##TITLE=NES1099_Nhol10910_9887186_AK32tKpe6a
##JCAMPDX= 6.0         $$ Bruker NMR JCAMP-DX V2.0
##DATA TYPE= NMR SPECTRUM
##DATA CLASS= NTUPLES
##ORIGIN= BRUKER
##OWNER= Administrator
$$ 1.72 TOPSPIN		Version 2.1
$$ 2016-08-28 15:31:03.789 -0500  Administrator@X
$$ Compression mode = diff/dup
##.OBSERVE FREQUENCY= 400.02188249412
##.OBSERVE NUCLEUS= ^1H
##.ACQUISITION MODE= SIMULTANEOUS (DQD)
##.ACQUISITION SCHEME= undefined
##.AVERAGES= 8
##.DIGITISER RES= 22
##SPECTROMETER/DATA SYSTEM= spect
##.PULSE SEQUENCE= zg30
##.SOLVENT NAME= COFFEE_meoh
##.SHIFT REFERENCE= INTERNAL, COFFEE_meoh, 1, 14.98509
##AUDIT TRAIL= $$ (NUMBER, WHEN, WHO, WHERE, PROCESS, VERSION, WHAT)
$$ ##TITLE= Audit trail, TOPSPIN		Version 2.1
$$ ##JCAMPDX= 5.01
$$ ##ORIGIN= Bruker BioSpin GmbH
$$ ##OWNER= Administrator
$$ $$ E:\/data/COFFEE/nmr/NES1099_Nhol10910_9887186_AK32tKpe6a/20/pdata/1/auditp.txt
$$ ##AUDIT TRAIL=  $$ (NUMBER, WHEN, WHO, WHERE, PROCESS, VERSION, WHAT)
(   1,<2016-08-28 15:30:56.742 -0500>,<Administrator>,<X>,<go>,<TOPSPIN 2.1>,
      <created by zg
	started at 2016-08-28 15:29:50.445 -0500,
	POWCHK enabled, PULCHK disabled,
       configuration hash MD5:
       21 0F 79 D6 B3 7B B4 F6 88 20 88 DB 03 48 BD 9F
       data hash MD5: 64K
       AD D1 73 CC 37 B6 37 2D 5B 6C 33 F8 23 50 0D 0B>)
(   2,<2016-08-28 15:30:59.804 -0500>,<Administrator>,<X>,<proc1d>,<TOPSPIN 2.1>,
      <Start of raw data processing
       efp LB = 0 FT_mod = 6 PKNL = 1 PHC0 = 0 PHC1 = 0 SI = 32K 
       data hash MD5: 32K
       E5 F2 8D 32 A0 BD BA A7 05 7B DF 3B EA 19 61 A4>)
(   3,<2016-08-28 15:31:00.086 -0500>,<Administrator>,<X>,<proc1d>,<TOPSPIN 2.1>,
      <pk PHC0 = 92.75208 PHC1 = 0 
       data hash MD5: 32K
       7C B8 7B 02 DD 19 88 65 0A D9 5E B4 0F DD E9 16>)
(   4,<2016-08-28 15:31:00.179 -0500>,<Administrator>,<X>,<proc1d>,<TOPSPIN 2.1>,
      <abs ABSG = 1 
       data hash MD5: 32K
       5E E4 E3 7B EF 5C 13 6B 1F B7 53 2C 24 FE 89 DE>)
(   5,<2016-08-28 15:31:00.242 -0500>,<Administrator>,<X>,<proc1d>,<TOPSPIN 2.1>,
      <abs ABSG = 2 
       data hash MD5: 32K
       73 8B 2F 09 6D 3A 4A 66 E6 CF 2C A5 9A BA B5 FC>)
(   6,<2016-08-28 15:31:00.304 -0500>,<Administrator>,<X>,<proc1d>,<TOPSPIN 2.1>,
      <abs ABSG = 3 
       data hash MD5: 32K
       01 86 0D C8 F4 2E 31 B2 CE E0 17 9C 24 20 84 5B>)
(   7,<2016-08-28 15:31:00.367 -0500>,<Administrator>,<X>,<proc1d>,<TOPSPIN 2.1>,
      <abs ABSG = 4 
       data hash MD5: 32K
       32 0A 51 9A 23 2D 5B 4F FB 9C 58 B9 51 4F 0A B0>)
(   8,<2016-08-28 15:31:00.429 -0500>,<Administrator>,<X>,<proc1d>,<TOPSPIN 2.1>,
      <abs ABSG = 5 
       data hash MD5: 32K
       8F 34 42 54 8D 51 69 1A 4D 14 61 7D 00 0E B2 CC>)
$$ ##END=
$$ 
$$ $$ hash MD5
$$ $$ E4 44 B2 AC 3B 4B B4 96 ED F4 DA 57 19 2E A5 DC
##$RELAX= 
##$RELAX= 
##$RELAX= 
##$RELAX= 
##$RELAX= 
##$RELAX= 
##$RELAX= 
$$ Bruker specific parameters
$$ --------------------------
##$DU= <E:\>
##$EXPNO= 20
##$NAME= <NES1099_Nhol10910_9887186_AK32tKpe6a>
$$ [...]
150 150 150 150 150 150 150 150
##$TP07= 0
##$TPNAME0= <>
##$TPNAME1= <>
##$TPNAME2= <>
##$TPNAME3= <>
##$TPNAME4= <>
##$TPNAME5= <>
##$TPNAME6= <>
##$TPNAME7= <>
##$TPOAL= (0..7)
0.5 0.5 0.5 0.5 0.5 0.5 0.5 0.5
##$TPOFFS= (0..7)
0 0 0 0 0 0 0 0
##$TUNHIN= 0
##$TUNHOUT= 0
##$TUNXOUT= 0
##$USERA1= <user>
##$USERA2= <user>
##$USERA3= <user>
##$USERA4= <user>
##$USERA5= <user>
##$V9= 5
##$VALIST= <valist>
##$VCLIST= <CCCCCCCCCCCCCCC>
##$VD= 0
##$VDLIST= <DDDDDDDDDDDDDDD>
##$VPLIST= <PPPPPPPPPPPPPPP>
##$VTLIST= <TTTTTTTTTTTTTTT>
##$WBST= 2048
##$WBSW= 25
##$XGAIN= (0..3)
0 0 0 0
##$XL= 0
##$YL= 0
##$YMAX_a= 599137
##$YMIN_a= -504041
##$ZGOPTNS= <>
##$ZL1= 120
##$ZL2= 120
##$ZL3= 120
##$ZL4= 120
##$ABSF1= 14.98509
##$ABSF2= -5.573092
##$ABSG= 5
##$ABSL= 3
##$ALPHA= 0
##$AQORDER= 0
##$ASSFAC= 0
##$ASSFACI= 0
##$ASSFACX= 0
##$ASSWID= 0
##$AUNMP= <proc_prof1d_extract_pilot.lims>
##$AXLEFT= 0
##$AXNAME= <>
##$AXNUC= <1H>
##$AXRIGHT= 0
##$AXTYPE= 0
##$AXUNIT= <>
##$AZFE= 0.1
##$AZFW= 0.1
##$BCFW= 0
##$BC_mod= 0
##$BYTORDP= 0
##$COROFFS= 0
##$CY= 15
##$DATMOD= 1
##$DC= 0
##$DFILT= <>
##$DTYPP= 0
##$F1P= 0
##$F2P= 0
##$FCOR= 0.5
##$FTSIZE= 32768
##$FT_mod= 6
##$GAMMA= 0
##$GB= 0
##$INTBC= 1
##$INTSCL= 1
##$ISEN= 128
##$LB= 0
##$LEV0= 0
##$LPBIN= 0
##$MAXI= 10000
##$MC2= 0
##$MEAN= 0
##$ME_mod= 0
##$MI= 0
##$NCOEF= 0
##$NC_proc= -8
##$NLEV= 6
##$NOISF1= 0
##$NOISF2= 0
##$NSP= 0
##$NTH_PI= 0
##$NZP= 0
##$OFFSET= 14.98509
##$PC= 1
##$PHC0= 92.75208
##$PHC1= 0
##$PH_mod= 1
##$PKNL= yes
##$PPARMOD= 0
##$PPDIAG= 0
##$PPIPTYP= 0
##$PPMPNUM= 2147483647
##$PPRESOL= 1
##$PSCAL= 4
##$PSIGN= 0
##$PYNMP= <proc.py>
##$REVERSE= no
##$SF= 400.02
##$SI= 32768
##$SIGF1= 0
##$SIGF2= 0
##$SINO= 400
##$SIOLD= 32768
##$SPECTYP= <>
##$SREGLST= <1H.CDCl3>
##$SSB= 0
##$STSI= 32768
##$STSR= 0
##$SW_p= 8223.68421052631
##$SYMM= 0
##$S_DEV= 0
##$TDeff= 65536
##$TDoff= 0
##$TI= <>
##$TILT= no
##$TM1= 0
##$TM2= 0
##$TOPLEV= 0
##$USERP1= <user>
##$USERP2= <user>
##$USERP3= <user>
##$USERP4= <user>
##$USERP5= <user>
##$WDW= 1
##$XDIM= 32768
##$YMAX_p= 440305550
##$YMIN_p= -692162
##$CURPLOT= <Network HP LaserJet P1505>
##$CURPRIN= <$Network HP LaserJet P1505>
##$DFORMAT= <normdp>
##$LAYOUT= <+/1D_H.xwp>
##$LFORMAT= <normlp>
##$PFORMAT= <normpl>
##$SURQMSG= 1
$$ End of Bruker specific parameters
$$ ---------------------------------
##NTUPLES= NMR SPECTRUM
##VAR_NAME=  FREQUENCY,     SPECTRUM/REAL,   SPECTRUM/IMAG
##SYMBOL=    X,             R,               I
##VAR_TYPE=  INDEPENDENT,   DEPENDENT,       DEPENDENT
##VAR_FORM=  AFFN,          ASDF,            ASDF
##VAR_DIM=   32768,         32768,           32768
##UNITS=     HZ,            ARBITRARY UNITS, ARBITRARY UNITS
##FACTOR=    0.250966925370066, 1,           1
##FIRST=     8223.43324360094, 87168,        245337
##LAST=      0,             177921,          -192067
##MIN=       0,             -692162,         0
##MAX=       8223.43324360094, 440305550,    0
$$ Real data points
##PAGE= N=1
##DATA TABLE= (X++(R..R)), XYDATA
$$ [...]
$$ plain form
19520 64611 67935 36088 -272086 -180836 -36746 121014 -191049 22183 55192 -92726 8172
19508 101481 -46494 -185367 -106856 -55581 -20994 -330294 -152861 -103044 -31700 -259390 -147602
19497 -147602 133669 -120803 -200041 -301685 147105 134787 -193862 231430 -44450 30382
19486 209440 -251639 97187 -169525 26813 187332 -138644 79907 -79798 -40217 -108249 -37085
19474 47694 -98124 -130464 -142146 26752 -50917 -12566 -165865 -217545 -310307 202147 -101119
19462 -67786 -60058 -179911 -173739 -176861 -191166 112499 336709 10290 153083 -271672 174023
19450 -99565 112916 -314171 69038 -183708 51358 -107965 -145437 89842 -24577 106216 -33159
19438 -45284 236626 -38316 -173877 29651 -233690 202850 -108161 85562 -199986 -2776 -288497
$$ packed form
19520F4611L324l1847b72086R1250c6746A21014a91049B2183L3009i2726H172
19508A01481d6494j38873P8511N1275b0994l09300a52861M9817c1700k27690J11788
19497a47602A33669a20803p9238j01644A47105j2318a93862B31430d4450C0382
19486B09440b51639I7187a69525B6813J60519a38644G9907g9798L9581o8032c7085
19474D7694i8124l2340j1682B6752e0917a2566j53299n1680r2762B02147a01119
19462f7786P728j19853O172l122j4305A12499K24210A0290J42793b71672A74023
19450i9565A12916c14171F9038a83708E1358a07965l7472H9842b4577A06216c3159
19438d5284B36626c8316j35561B9651b33690B02850a08161H5562a99986b776k85721
$$ plain form
19427 -288497 -146727 -191423 157847 -141150 -34028 -283615 -3272 50069 -47151 -335589 -194748
19416 -194748 -129480 -14790 -31000 -258549 -94556 -384649 39429 -93489 -260434 10463 -120277
19404 -310060 -272426 -32697 105173 186916 -183997 -268480 -262047 19548 -115382 4642 -19470
19392 45258 -383271 69142 -275001 -82811 -188982 -251428 -44875 -265512 -22897 -119601 -36219
19380 -216274 59763 134872 -192019 -153972 -223525 -166575 -63990 -166678 -201828 -179276 -63246
19368 -52767 14841 -319387 137665 -141677 227233 -198484 179424 -293605 -141244 -60912
19357 60846 287867 -157686 172997 55347 15787 206056 90345 -166958 -103403 222471
19346 25197 -193676 -130104 -100163 141378 51369 -93502 122082 89928 5787 -49003 -356775
$$ packed form
19427b88497J41770m4696A57847a41150c4028k49587c272E0069d7151k88438J40841
19416a94748O5268a4790j6210k27549i4556k90093C9429i3489j66945A0463a20277
19404c10060L7634c2697A05173Q1743a83997q4483O433A9548a15382D642a9470
19392D5258c83271F9142b75001h2811j06171o2446d4875k20637b2897r6704c6219
19380b16274E9763P5109a92019L8047o9553N6950f3990j02688l5150K2552f3246
19368e2767A4841c19387A37665a41677B27233a98484A79424b93605a41244f0912
19357F0846K27021a57686A72997E5347A5787J90269I0345a66958O3555B22471
19346B5197a93676O3572K9941A41378E1369i3502A22082l2154E787d9003l07772
$$ plain form
19335 -356775 120588 -114290 823 55748 -17877 -185904 70600 -40742 12203 -255860 220263
19323 -76323 -226743 -181151 -149761 -35758 159119 226329 -212612 23747 -215256 220457 129622
19312 129622 -81355 -49900 -201343 -204583 -203455 -120008 -44846 -58040 -19871 -152909 248269
19300 -183739 43049 -240995 -235899 -343846 -144845 -41303 197993 -14227 -249564 107000
19289 -258452 -262483 85271 41031 -328074 -231579 196180 -94713 -44299 -182949 -104433 -164940
19278 -164940 -240470 -155089 159087 -87049 -112618 29411 132052 161009 1519 41341 72301
19267 72301 -169211 -247494 -212510 -423135 177882 -62492 -77267 -229957 -97053 -220466 -16331
19255 -6900 -174865 -141017 -164379 -181694 161517 -283831 17700 81256 -69777 -37123 -124580
$$ packed form
19335c56775A20588a14290H23N4925a7877j68027G0600d0742A2203b55860B20263
19323g6323j50420M5592L1390c5758A59119O7210b12612B3747b15256B20457r0835
19312A29622h1355L1455j51443l240J128Q3447d4846j3194a9871j33038B48269
19300a83739D3049b40995N096j07947a44845d1303A97993a4227k35337A07000
19289b58452m031H5271D1031c28074R6495A96180i4713d4299j38650P8516o0507
19278a64940p5530Q5381A59087h7049k5569B9411J02641K8957A519L9822L0960
19267G2301a69211p8283L4984k10625A77882f2492j4775j52690i7053j23413a6331
19255f900j67965L3848k3362j7315A61517b83831A7700O3556f9777L2654q7457
$$ plain form
19244 -124580 243818 -302815 -90965 -13643 43380 58631 -225110 -77255 29161 -40466 47069
19232 -243600 149542 -41363 -89126 -237849 -441844 -80978 53517 45134 -65750 -300152 174906
19220 25543 -3331 82907 -199732 -15366 -180485 147579 -80697 -112714 -220295 118581 -231917
19208 -107832 -174892 -33616 -568 53380 -286316 211186 -215625 -138883 -84637 -146320 -65494
19196 164488 -73110 -42011 -346240 -81075 187450 -187415 -141540 -215947 -88467 -54552 -175432
19185 -175432 -71795 -74399 -4900 -222993 -76620 51558 40353 -9288 -64929 69934 46354 9271
19172 47994 -125139 -233565 -126692 -68054 47954 -80442 -145447 -93036 -114910 87850 127532
19161 127532 -321592 -104061 34451 4890 67455 -108303 272354 -48188 234425 17861 -223689
$$ packed form
19244a24580B43818c02815i0965a3643D3380J5251b25110g7255B9161d0466D7069
19232b43600A49542d1363m7763j48723k03995h0978E3517q383f5750k34402A74906
19220B5543c331H2907a99732a5366j65119A47579h0697l2017j07581A18581b31917
19208a07832o7060c3616e68E3380b86316B11186b15625P6742N4246o1683f5494
19196A64488g3110L1099l04229h1075A87450a87415M5875p4407h8467L3915j20880
19185a75432g1795k604d900k18093g6620E1558j1205i288n5641F9934k3580I271
19172D7994a25139j08426J06873N8638D7954h0442o5005N2411k1874H7850L9682
19161A27532c21592a04061C4451D890O2565a08303B72354d8188B34425A7861b23689
$$ plain form
19149 -207235 -180172 98061 -54993 117512 -203576 73390 -227925 -213980 -33035 42095 6349
19137 -144864 -37828 17722 28244 140813 -321808 -36593 182389 36158 -34984 -212093 -164268
19126 -164268 -236244 64732 -51695 -317546 100680 6322 24222 87235 -125106 -256517 66747
19114 -107244 -31596 145837 345653 -307970 -115181 -101156 48503 -208356 39108 247540
19104 247540 144437 315396 54221 -331545 -213658 -381869 -93982 59397 -181148 -178114
19094 -178114 -29932 53166 -133344 -108908 -258217 157963 -181880 -358655 -1194 -313020
19084 -313020 3355 -13162 119181 -51036 -7017 -156061 23971 37167 -541154 -80978 -98232
19073 -98232 -33929 64870 28558 212730 -80369 -39755 -47094 93449 -164697 404329 306899
$$ packed form
19149b07235K7063I8061e4993A17512b03576G3390b27925J3945c3035D2095F349
19137a44864c7828A7722J0522J12569c21808c6593A82389C6158c4984j77109M7825
19126a64268p1976F4732e1695k65851A00680F322J7900O3013a25106j31411F6747
19114a07244c1596A45837J99816c07970a15181J4025D8503b08356C9108K08432
19104B47540j03103J70959E4221c31545J17887j68211i3982E9397a81148L034
19094a78114b9932E3166a33344K4436j49309A57963a81880j76775a194l11826
19084c13020C355a3162A19181e1036g017j49044B3971J3196e41154h0978j7254
19073i8232c3929F4870B8558J84172h0369c9755p339I3449a64697D04329r7430
$$ plain form
19062 306899 -146997 -49611 -78108 3127 -164497 -196230 201866 -138263 259651 -168391
19051 -110089 -51135 97834 -151089 60382 -323157 -8422 -104389 -264882 217327 46573 265686
19040 265686 123211 -215690 -128814 229511 -169879 -33149 21429 -406549 241906 20163
19029 209862 257434 -33991 -13214 7323 30244 291198 -12956 6369 -18979 -14476 -159417 100088
19016 -73195 -70417 -156011 -44913 -65483 50403 19323 29654 -38318 -144252 -130878 -272289
19005 -272289 55179 49413 -230688 227531 -93713 -17622 -74650 -229 131638 -68741 -43446
18994 -43446 -1195 49115 70610 -108014 159062 -134223 -260598 -431018 -109529 185021
18983 -49548 -212142 84347 -40811 -181947 -213523 118857 -181137 58818 -186470 73729 -164166
$$ packed form
19062C06899a46997d9611k8497C127a64497l1733B01866a38263B59651a68391
19051a10089e1135I7834a51089F0382c23157h422r5967j60493B17327D6573K19113
19040B65686A23211b15690Q6876B29511a69879c3149B1429d06549B41906B0163
19029B09862M7572c3991a3214G323K2921K60954a2956F369a8979M503j44941A00088
19016g3195K778q5594d4913k0570E0403A9323J0331c8318j05934J3374j41411
19005b72289E5179n766b30688B27531i3713a7622n7028b29A31638f8741K5295
18994d3446a195D9115K1495a08014A59062a34223j26375j70420a09529A85021
18983d9548j62594H4347d0811j41136l1576A18857a81137E8818a86470G3729a64166
$$ plain form
18971 206991 195073 -96034 -146148 262815 -23889 -140879 207819 311149 -80429 65395 -159658
18959 6099 -146813 359196 -104800 344313 -160414 71176 207889 8877 -149953 155581
18948 -77339 -9577 -112191 -238940 -523748 -173243 257834 178254 215359 -124606 127257
18937 -271742 -53754 79274 312405 7432 4483 286361 -110375 -142046 -90006 106638 139542
18926 139542 197043 -247342 -146377 174536 -38293 -176621 77297 -83355 200450 -135692
18915 -228184 -38188 -239838 2622 -79846 -88274 -16136 -201033 96802 -212055 36417 -234247
18903 -99026 -193099 51708 346730 -44489 -109378 359918 -146914 -290147 -302086 146681 -444435
18891 -132325 111746 156023 102171 -81703 -50697 -104621 93236 63641 35050 -34750 -374913
$$ packed form
18971B06991j1918i6034n0114B62815b3889j16990B07819J03330h0429F5395a59658
18959F099a46813C59196a04800C44313a60414G1176J36713H877a49953A55581
18948g7339i577j02614j26749k84808a73243B57834p9580L7105a24606A27257
18937b71742e3754G9274K33131G432k949K81878a10375l1671N2040A06638L2904
18926A39542N7501b47342J00965A74536c8293j38328G7297h3355B00450a35692
18915b28184c8188k01650B622g9846q428a6136j84897I6802b12055C6417b34247
18903i9026r4073E1708K95022d4489o4889C59918a46914j43233j1939A46681d44435
18891a32325A11746M4277n3852h1703L1006n3924I3236k9595k8591c4750l40163
$$ plain form
18880 -374913 -140838 -81827 9081 127653 -9586 101967 -151308 230340 -96716 -1364 -40955
18869 -40955 -96396 -98464 -15797 251341 126650 208664 23714 194518 115308 -61372 178897
18857 -102296 12494 -478275 -46375 94526 53580 -157851 -80850 -93512 -63212 -109708 261959
18845 -76316 -11682 -71474 -80674 -135351 7237 -51559 -121953 -279976 36346 -54041 -44101 -66252
18833 -66252 26662 -103398 24127 159641 -13732 182924 -130614 -213511 4112 76481 83885
18822 83885 83593 349751 62171 -130304 26932 59924 -57328 -118785 80644 219604 -278566
18810 79252 -220895 266200 137875 174449 -239173 101870 -57929 70189 101957 51010 136274
18799 136274 -198674 -163417 -200442 -46948 -144500 -70909 -391942 -235659 45092 190322 -65820
$$ packed form
18880c74913a40838N9011I081J18572i586A01967a51308B30340i6716a364l9591
18869d0955n5441k068a5797B51341j24691Q2014B3714J70804p9210f1372A78897
18857a02296A2494d78275d6375I4526m0946a57851P7001j2662L0300m6496B61959
18845g6316a1682n9792r200n4677G237e1559p0394j58023C6346e4041R940k2151
18833f6252B6662a03398B4127J35514a3732A82924a30614q2897D112P2369P404
18822H3885k92K66158F2171a30304B6932L2992e7328o1457H0644J38960b78566
18810G9252b20895B66200j28325L6574b39173A01870e7929G0189L1768n0947Q5264
18799A36274a98674L5257l7025d6948r7552g0909l21033J56283D5092J45230f5820
$$ plain form
18787 -81536 -99742 -44289 -53605 76343 -125079 36008 14000 -145919 152375 -161069 -60106
18775 -127460 -80515 -126693 -418616 -211736 -245433 5175 139393 103864 230276 -283108 -254787
18764 -254787 188342 -62238 -142899 -279900 -137469 -49108 33884 -119896 -115911 -417150 -15968
18752 173634 113566 -1762 -100466 -70374 -402936 92120 -161457 -25242 -151801 35161 -223626
18740 -154791 69102 251355 -94990 -207515 -297323 28275 -269814 -384349 103250 -129402
18729 -224248 -28324 -273113 14928 -138597 36501 -160687 -279306 -202187 211960 249786
18719 249786 -57250 78461 -114622 -530868 -264448 -57901 96766 88112 -115002 -120395 220890
18707 -436788 -175397 -345617 -62881 -13711 -255183 -113603 -77169 -108987 281275 -297301
$$ packed form
18787h1536j8206d4289r316G6343a25079C6008A4000a45919A52375a61069f0106
18775a27460M6945m6178k91923K06880l3697E175J34218l5529J26412b83108K8321
18764b54787A88342f2238q0661j37001a37469d9108C3884a19896L985l01239a5968
18752A73634o0068a762r8704L0092l32562I2120a61457b5242j26559C5161b23626
18740a54791F9102J82253i4990j12525q9808B8275b69814j14535A03250a29402
18729b24248b8324k44789A4928a38597C6501a60687j18619P7119B11960L7826
18719B49786e7250G8461a14622m16246b64448e7901I6766q654a15002n393B20890
18707d36788a75397j70220f2881a3711k41472a13603L6434l1818B81275b97301
$$ plain form
18696 -149285 -254430 -192513 -152682 -108074 -81166 -69257 -67450 -52645 63878 33936 -231736
18684 261485 -66928 361377 -152837 342206 -85187 -110801 86310 -54285 -384827 80684 -95626
18672 101186 -325519 -223683 -251157 -45716 141964 -245803 -171531 -144832 -271976 71340
18661 3294 -90084 -110582 11583 -445486 188061 -185194 -231894 85205 -206158 210224 -63905
18649 -140490 -199834 -81430 81815 105117 -172727 298270 -412953 47139 -87080 7669 -144950
18637 -167177 -138086 223796 125134 -78844 -78037 -239361 -146166 46181 40922 197366 195582 -41166
18624 -118724 -151308 -25735 -92378 -257017 148544 113690 46212 -60353 21538 -206263 178421
18612 -157864 -10703 -244284 -220347 74317 14328 38561 -35283 -34066 -308938 153238 -120168
$$ packed form
18696a49285j05145O1917L9831M4608K6908J1909J807J4805F3878k9942b31736
18684B61485f6928C61377a52837C42206h5187k5614H6310e4285l30542H0684i5626
18672A01186c25519J01836k7474d5716A41964b45803P4272K6699j27144G1340
18661C294i0084k0498A1583d45486A88061a85194m6700H5205b06158B10224f3905
18649a40490n9344h1430H1815K3302a72727B98270d12953D7139h7080G669a44950
18637a67177K9091B23796r8662g8844Q07j61324R3195D6181n259J56444j784d1166
18624a18724l2584b5735o6643j64639A48544l4854D6212f0353B1538b06263A78421
18612a57864a0703k33581K3937G4317A4328K4233c5283J217k74872A53238a20168
$$ plain form
18600 196093 -33860 -2322 -144776 180891 -181262 -75133 -73622 43886 -43502 52865 -64034
18588 -279495 152710 50473 9592 -323803 54053 285696 -14222 -59335 274642 175740 -245062
18576 -84973 58215 104824 -32182 -77133 49239 -55076 31781 -46198 308360 26963 61426
18565 61426 29880 13291 -16847 -155884 213236 -92117 -2446 13058 105012 -234902 -122601
18554 -122601 -206735 -236207 166862 -273397 -499801 216951 167616 -57456 -133562 -46976 214516
18542 149247 51002 -167305 -91051 -225911 -275685 -249232 -236855 -80061 -31120 96261 -135130
18530 -201956 -204391 -23640 -152127 91827 128660 126700 -4440 5971 -290715 140186 67005 127224
18518 127224 245738 -27440 -8872 -19736 122033 -125641 -150237 -118132 -239491 -123948 139852
$$ packed form
18600A96093c3860b322j42454A80891a81262g5133J511D3886d3502E2865f4034
18588b79495A52710E0473I592c23803E4053K31643a4222m5113B74642r8902b45062
18576h4973E8215M6609c2182m4951D9239e5076C1781d6198C08360B6963L4463
18565F1426B9880A3291a6847j39037B13236i2117b446A3058R1954b34902J12301
18554a22601q4134k9472A66862b73397k26404B16951m9335e7456p6106d6976B14516
18542A49247E1002a67305P6254j34860m9774K6453J2377h0061c1120I6261a35130
18530b01956k435b3640j28487I1827L6833j960d440E971b90715A40186F7005O0219
18518A27224J18514b7440h872j0864A22033a25641k4596L2105j21359J15543A39852
$$ plain form
18506 58322 147747 -84885 -296888 -98841 5150 -68451 -82497 186975 24569 75935 -49889
18494 11328 -252553 147618 -244914 -81932 -196261 -184830 98631 -247892 -108543 -212471
18484 -212471 -148996 -346244 61020 119969 174088 -66940 -386031 -447486 -109061 161400 -16099
18472 162610 -69272 207441 -267892 121027 -274703 79423 -106286 243475 -140033 -489853
18462 -489853 71728 185754 120804 123558 15905 66093 -56253 239942 304547 -251721 19140
18450 -162714 -32107 -501981 -89445 217204 -58318 -30190 -106279 -21318 -195185 -23531 71053
18438 -333782 153233 125035 92360 -14015 198308 -165706 235272 -421862 92193 186402
18428 186402 210671 -172027 144899 -175876 97039 171924 -108780 23079 58194 -294796
$$ packed form
18506E8322Q9425h4885k12003i8841E150f8451j4046A86975B4569N1366d9889
18494A1328b52553A47618b44914h1932j14329J1431I8631b47892a08543j03928
18484b12471O3475j97248F1020N8949N4119f6940l19091o1455a09061A61400a6099
18472A62610f9272B07441b67892A21027b74703G9423a06286B43475a40033l49820
18462d89853G1728J14026o4950K754A5905N0188e6253B39942O4605b51721A9140
18450a62714c2107m69874h9445B17204e8318K8128p6089b1318j73867b3531G1053
18438c33782A53233k8198l2675a4015A98308a65706B35272d21862I2193R4209
18428A86402K4269a72027A44899a75876I7039P4885a08780B3079L5115b94796
$$ plain form
18417 121760 -132226 151168 -202987 -60787 -107371 -246134 166293 54571 -177690 145691
18406 -116433 108921 -251477 -23310 228722 5706 20888 94226 147494 -48818 -336143 49639
18394 -166922 -317852 -347760 -163044 -115867 -164119 228450 -163227 -16619 132768 -211604
18383 -13889 -11417 299711 124241 289959 -93673 -198439 83587 163194 -87414 184057 -24770
18371 -219537 56512 -43038 -191750 -41832 -146966 -179444 364842 139483 95685 162270 124879
18360 124879 -182659 -889 267718 -82528 -162203 -135668 -28116 -300657 42543 -297025 250965
18348 -266355 -402668 -226186 282994 212667 79529 43981 40121 -36754 395046 -2963 -219807
18337 -219807 53403 259227 -141701 -97619 -102670 43246 -169641 -86338 -184693 29870 -150461
$$ packed form
18417A21760a32226A51168b02987f0787m6584j38763A66293E4571a77690A45691
18406a16433A08921b51477b3310B28722E706J5182P3338N3268d8818k87325D9639
18394a66922j50930k9908a63044M7177m8252B28450a63227a6619A32768b11604
18383a3889K472B99711A24241J65718i3673j04766H3587P9607h7414A84057b4770
18371b19537E6512d3038j48712d1832j05134l2478C64842A39483m3798O6585l7391
18360A24879a82659h89B67718h2528p9675K6535b8116k72541D2543b97025B50965
18348b66355j36313J76482B82994p0327G9529l5548l860c6754C95046b963k16844
18337b19807E3403K05824a41701M4082n051D3246a69641Q3303r8355B9870a50461
$$ plain form
18325 -73540 -118613 32960 -51731 110753 -49138 142511 297297 22616 -217266 -177995 -275592
18314 -275592 -107097 -218646 48525 -31114 -98406 -6303 -192298 -193671 200575 47305 63298
18303 63298 127488 -218030 -45420 -106858 30669 -145098 4490 166786 -26529 17214 -11088
18291 321315 -88987 -111668 -19719 351270 -238326 -21813 78989 -69772 -106185 33354 55530
18280 55530 22894 -204735 -298511 241317 -196792 -57959 12231 248393 -86733 20982 -382869
18268 -44141 -3479 26385 -54465 -50576 14292 83393 -117014 -397334 -102713 -228766 126481
18256 -260177 51201 -265979 183719 -109548 -294311 -382568 -64999 -58787 -22329 -53546 117176
18244 -149319 -160892 28198 -177167 7046 -384646 15146 18053 -4749 287353 198230 16032
$$ packed form
18325g3540m5073C2960e1731A10753d9138A42511J54786B2616b17266L9271r7597
18314b75592a07097j11549D8525c1114o7292f303j85995j373B00575D7305J5993
18303F3298O4190b18030d5420o1438C0669a45098D490J62296b6529A7214a1088
18291C21315h8987k2681a9719C51270b38326b1813G8989f9772l6413C3354K2176
18280E5530B2894b04735r3776B41317a96792e7959A2231K36162h6733B0982c82869
18268d4141c479B6385e4465L889A4292O9101a17014k80320a02713j26053A26481
18256b60177E1201b65979A83719a09548j84763q8257f4999O212b2329l1217A17176
18244a49319j1573B8198a77167G046c84646A5146K907d749B87353q9123A6032
$$ plain form
18232 26047 49326 -184616 187918 -167367 179038 -125563 -51527 -18912 -145999 -6105 3162
18220 80900 -357016 -236223 -36890 -269703 -195878 -209420 -270413 64159 226135 -210178 102680
18208 72006 -282119 67687 119875 24498 18768 265811 91546 -85595 90023 -180049 -6350
18196 -107721 -123336 -196408 -94197 18911 96424 -100088 -44992 280048 -44341 166138 112111
18185 112111 -15024 -5098 25331 -58804 -60410 44791 -257698 -116805 43072 -126671 94119
18173 232217 -52910 51140 280204 146159 105983 -142536 -229952 -68973 -105175 19849 -51542
18161 246524 72152 -273925 -2097 148474 186838 -81436 31488 -203876 145878 -106079 -136970
18150 -136970 76609 -125163 -14554 175398 116709 139023 -231261 -52096 -124598 -199366 -130698
$$ packed form
18232B6047K3279a84616A87918a67367A79038a25563e1527a8912j27087f105C162
18220H0900c57016J20793c6890k32813P3825j3542o0993F4159J61976b10178A02680
18208G2006b82119F7687N2188B4498n730K47043I1546h5595I0023a80049f350
18196a07721j5615p3072i4197A8911P7513a00088d4992B80048d4341A66138n4027
18185A12111a5024e098B5331e8804j606D4791b57698a16805D3072a26671I4119
18173B32217e2910E1140K29064j34045m0176a42536q7416f8973l6202A9849e1542
18161B46524G2152b73925b097A48474L8364h1436C1488b03876A45878a06079l0891
18150a36970G6609a25163a4554A75398n8689K2314b31261e2096p2502p4768O8668
$$ plain form
18139 -130698 -319994 179502 306555 100459 -79829 145607 -364766 -72904 -135597 3451
18128 -158450 -401689 73945 82708 77655 141438 -247546 47778 -297157 -191474 171759 160966
18117 160966 -371396 -193361 82452 -29576 -161140 849 74010 -281307 213640 -234728 -68944
18105 -20418 1576 114213 264864 -95327 -104715 -85123 206952 -238211 -117440 -184216 111450
18093 -956 -33359 214823 -116022 193881 192950 -1022 119598 -149818 280739 6505 -4737 -270677
18081 -270677 -109494 -40190 38319 103832 -40360 -85249 -2655 175861 -318116 -77033 -219692
18070 -219692 -38304 -157480 -87607 27825 159884 291875 93622 -19367 14752 21276 193490
18059 193490 53714 -121712 86051 86735 -175307 -144708 -339629 -94072 -244535 223564 -80654
$$ packed form
18139a30698j89296A79502J27053A00459g9829A45607c64766g2904o2693C451
18128a58450k43239G3945Q763n053O3783b47546D7778b97157J05683A71759j0793
18117A60966c71396J78035H2452b9576j31564H49P3161b81307B13640b34728f8944
18105b0418A576J12637J50651i5327r388J9592B06952b38211a17440o6776A11450
18093i56l2403B14823a16022A93881r31a022A19598a49818B80739F505d737k65940
18081b70677a09494d0190C8319O5513d0360m4889b655A75861c18116g7033j42659
18070b19692c8304j19176O9873B7825J32059J31991I3622a9367A4752O524J72214
18059A93490E3714a21712H6051O84a75307L0599j94921i4072j50463B23564h0654
$$ plain form
18047 -157899 13434 -82156 297984 -19805 -11958 30325 -40947 -23175 -199250 6606 242896
18036 242896 -294544 120950 37975 -107057 118166 -77052 75088 28827 38879 -34074 -187458
18025 -187458 -244578 -67091 -108585 1713 84679 -131377 -39412 -391180 104011 295145 -201637
18013 -7022 -137592 36225 145049 87859 -197476 46007 -104962 -94489 -42053 138444 -84056
18001 224428 181990 -260269 135849 -13372 404806 -82130 -137339 140214 143678 105554 -61753
17989 40668 -90230 296560 -126695 -261988 -23462 100578 -73822 -190650 114772 331 -162968
17977 -107985 -121356 312550 49214 237595 -12556 -165526 -114791 59647 18707 -137797 -145489
17966 -145489 -108922 -19611 211234 -37154 -38436 -98265 -11414 137001 -63105 277658 -158737
$$ packed form
18047a57899A3434h2156B97984a9805P847C0325d0947J7772j76075F606K36290
18036B42896b94544A20950C7975a07057A18166g7052G5088B8827J0052c4074j53384
18025a87458n7120f7091m1494A713Q2966a31377c9412l51768A04011J91134b01637
18013g022j30570C6225J08824n7190a97476D6007a04962J0473d2053A38444h4056
18001B24428m2438b60269A35849a3372D04806h2130n5209A40214L464l8124f1753
17989D0668i0230B96560a26695j35293b3462A00578g3822j16828A14772C31a62968
17977a07985j3371C12550D9214J88381a2556j52970N0735E9647A8707a37797p692
17966a45489L6567a9611B11234c7154j282n9829a1414A37001f3105B77658a58737
$$ plain form
17954 -41888 -341574 103832 -77082 163198 -67662 -172365 -13110 220220 -18878 -27165 -44416
17943 -44416 166586 -130117 60005 -18546 -68335 -133480 123128 -308634 29569 143633 -78384
17931 -186491 118798 182353 -154846 86242 154504 275013 -130088 190442 92046 -57881
17920 156611 -97573 322844 -98093 10256 -56115 -110961 -69831 -316341 -92296 -3491 -163834
17909 -163834 -231897 62657 -32401 -126257 28307 -47668 -82149 84620 -38456 -213333 -148026
17898 -148026 175470 58380 -139650 -48084 161812 -29591 -11488 -69894 -276151 -18728 4213
17886 106923 27804 -211613 101615 -11346 197077 -354297 24684 110988 -156908 337846
17875 138008 315364 -26967 -162579 309675 309902 -95157 -297333 -237820 110772 194865 239376
$$ packed form
17954d1888k99686A03832g7082A63198f7662j04703a3110B20220a8878q287j7251
17943d4416A66586a30117F0005a8546m9789o5145A23128c08634B9569J14064g8384
17931a86491A18798O3555a54846H6242O8262J20509a30088A90442I2046e7881
17920A56611i7573C22844i8093A0256e6115n4846M1130k46510i2296c491j60343
17909a63834o8063F2657c2401r3856B8307d7668l4481H4620c8456j74877O5307
17898a48026A75470E8380a39650d8084A61812b9591a1488n8406k06257a8728D213
17886A06923B7804b11613A01615a1346A97077c54297B4684Q6304a56908C37846
17875A38008J77356b6967j35612C09675K27i5157k02176N9513A10772Q4093M4511
$$ plain form
17864 239376 -115405 -71972 -7210 154041 -72912 -51135 -91554 -281223 249018 169153 43257
17852 121214 17797 -178617 20011 -34174 -61077 36153 -151330 35031 -381647 64945 4733
17840 152309 -134708 488344 277191 42226 98603 -23503 -119897 -13041 189233 413556
17830 413556 -131447 -105045 -2564 86518 252497 -5922 -88587 -16071 119761 72641 364822
17819 364822 -260827 -8663 -388240 170029 -53135 145148 -116993 -140619 96521 172924 136157
17808 136157 -151981 -63510 -89098 263322 -173219 95178 76113 218096 135522 85032 46571
17797 46571 114063 -58716 149222 -229307 444211 105981 30057 -29714 20064 -172691 51551
17785 129362 -36276 -79521 167293 -51770 31590 -38724 22784 106262 271741 -21811 267220
$$ packed form
17864B39376a15405M3433g210A54041g2912K1777m0419j89669B49018p9865D3257
17852A21214A7797a78617B0011c4174k6903C6153a51330C5031c81647F4945D733
17840A52309a34708D88344k11153D2226N6377b3503r6394a3041A89233K24323
17830D13556a31447K6402b564H6518J65979e922q2665a6071A19761m7120K92181
17819C64822b60827h663l79577A70029e3135A45148a16993k3626I6521P6403l6767
17808A36157a51981f3510k5588B63322a73219I5178j9065J41983q2574n0490l8461
17797D6571O7492e8716A49222b29307D44211A05981C0057b9714B0064a72691E1551
17785A29362c6276m3245A67293e1770C1590c8724B2784Q3478J65479b1811B67220
$$ plain form
17773 -9505 112254 146695 -294294 -34910 28572 33487 43637 180265 86714 -180185 86411
17761 -71499 -161692 24475 -206990 99333 135988 -14062 134033 23753 -111837 212232 227168
17750 227168 -52609 -87278 -169848 153334 64526 -261099 21471 -118736 92713 13858 -98042
17738 192493 219087 -109778 -22222 143164 286255 133524 145786 -31137 -10298 238263
17727 -51463 -241817 179756 -146184 53770 -216490 231405 29006 146201 305171 29989
17716 -52574 16148 -182661 -16554 120715 162595 -69613 200355 53644 -2653 33432 -155492
17704 -65461 37000 124971 -89726 274237 -122804 -67390 296064 437063 157127 186406 23259
17692 180078 109281 -112951 55240 107721 -38183 106720 -40717 80868 219994 188029 391775
$$ packed form
17773i505A12254L4441b94294c4910B8572M915J0150J36628H6714a80185H6411
17761g1499r0193B4475b06990I9333L6655a4062A34033B3753a11837B12232J4936
17750B27168e2609l4669q2570A53334F4526b61099B1471a18736I2713A3858i8042
17738A92493K6594a09778b2222A43164J43091A33524J2262c1137a0298B38263
17727e1463j90354A79756a46184E3770b16490B31405B9006J17195J58970B9989
17716e2574A6148a82661a6554A20715M1880f9613B00355E3644b653C3432a55492
17704f5461C7000Q7971h9726B74237a22804N5414B96064J40999A57127K9279B3259
17692A80078p0797a12951E5240N2481c8183A06720d0717H0868J39126l1965K03746
$$ plain form
17681 391775 -35490 -40469 83163 242847 -169346 410761 -151473 -444609 165802 -32960
17670 134098 355174 74775 -290311 52988 133424 -1002 275564 5087 -7320 53082 108283
17659 108283 -33755 228874 276170 97575 178792 160377 -115421 -180733 -167360 24444 14180
17648 14180 37600 -81454 -228066 2820 289323 165399 176006 269090 56957 -201529 98165
17636 -198492 294339 83023 -114196 287357 263893 -180251 235149 195091 87921 -152652
17625 -78900 215279 7680 -28685 108202 404095 126128 157154 37346 -364108 278722 111186
17613 447096 53350 408107 -221284 84667 214998 63111 -33892 133227 178772 -52546 111509
17601 -283872 176241 3859 213072 196457 177009 -183708 55666 185659 212743 425380 53226
$$ packed form
17681C91775c5490m979H3163J59684a69346D10761a51473k93136A65802c2960
17670A34098K21076G4775b90311E2988Q0436a002B75564E087g320E3082N5201
17659A08283c3755B28874M7296I7575Q1217j8415a15421o5312J3373B4444j0264
17648A4180K3420h1454j46612B820K86503j23924J0607R3084E6957b01529I8165
17636a98492B94339H3023a14196B87357k3464a80251B35149m0058H7921a52652
17625g8900B15279G680b8685A08202K95893A26128L1026C7346c64108B78722A11186
17613D47096E3350L54757b21284H4667J30331F3111c3892A33227M5545e2546A11509
17601b83872A76241C859K09213j6615j9448a83708E5666J29993K7084K12637E3226
$$ plain form
17589 60421 -109912 92394 143735 -151106 3303 136766 294426 -49500 100676 -178569 25536
17577 -9077 53532 166560 345191 -297273 -308037 -121487 -228017 7967 293784 71119 -41314
17565 98560 -29700 409147 93857 -77649 -90915 71588 -289704 99614 208061 -148134 -45900
17553 -47620 229250 110150 205439 -57178 249032 47439 104361 159078 424406 11608 -19218
17541 -14052 22485 200712 -258035 166687 -655 262891 369553 229797 187150 62731 8783
17529 85112 223503 161024 155803 -19673 233075 -97799 351864 709790 358151 433874 399717
17518 399717 333290 169025 322758 117996 292738 -93354 194888 85945 -21618 413094
17507 293343 408861 349309 347424 375875 659628 457880 383582 350140 2666 491129 196273
$$ packed form
17589F0421a09912I2394N1341a51106C303J33463J57660d9500A00676a78569B5536
17577i077E3532J13028J78631b97273j0764a21487j06530G967K85817G1119d1314
17565I8560b9700D09147I3857g7649j3266G1588b89704I9614J08447a48134d5900
17553d7620B29250A10150R5289e7178B49032D7439N6922N4717K65328A1608a9218
17541a4052B2485J78227b58035A66687f55B62891J06662j39756m2647F2731H783
17529H5112J38391o2479n221a9673B33075i7799C51864L57926l51639P5723l4157
17518C99717o6427j64265J53733A17996J74742i3354A94888H5945b1618D13094
17507B93343J15518n9552j885K8451K83753k01748p4298l3442B666M88463A96273
$$ plain form
17495 372886 43693 117969 322667 102727 102596 60808 -30689 59048 347505 14765 362631
17484 362631 358266 412874 39253 181586 156353 359520 133558 285079 227286 -100708 16809
17472 104137 378673 1121 184579 205233 227123 441973 161957 350519 251015 209971 218850
17461 218850 229008 87480 191155 87947 93175 269730 239400 615199 37048 277922 250642
17450 250642 564089 328294 439561 414980 431563 504695 615976 457428 1017 279974
17440 279974 -24509 153027 220013 585333 377907 311580 579555 184159 269440 46155
17429 356798 435156 68178 149405 602683 154797 563240 403933 188068 330142 214966
17419 214966 85156 227097 196488 454861 478964 326514 311664 116908 327072 198657
$$ packed form
17495C72886D3693P4276K04698A02727j31m1788c0689E9048K88457A4765L47866
17484C62631m365N4608C9253J42333k5233K03167A33558J51521n7793a00708A6809
17472A04137K74536A121J83458K0654K1890K14850A61957J88562r9504m1044Q879
17461B18850J0158H7480J03675H7947N228J76555l0330L75799C7048K40874k7280
17450B50642L13447k35795J11267k4581J6583P3132J11281j58548A017K78957
17440B79974b4509A53027O6986L65320k07426o6327K67975A84159Q5281D6155
17429C56798P8358F8178Q1227M53278A54797M08443j59307A88068J42074j15176
17419B14966H5156J41941l0609K58373K4103j52450j4850A16908K10164j28415
$$ plain form
17409 198657 117869 332996 498985 542209 165821 171959 -86425 189672 319942 434201
17399 434201 -59432 -285861 50428 145230 345020 411607 244972 162784 364272 417074 419993
17388 419993 99515 202379 323021 163937 164168 306014 63001 -35645 69280 30170 17941
17377 17941 -79899 -117372 62495 63627 501443 91322 281823 369108 201329 189325 72522
17365 275279 146293 225660 -29881 344974 365871 88870 221646 466014 109054 227562
17355 227562 285901 104566 309300 -105748 -48486 105190 216077 342149 246839 348670
17345 348670 393315 214461 225096 -113228 76512 37872 -205575 271161 114462 173695
17335 173695 59583 265925 285519 -39544 31726 95293 261774 239876 209076 103348 122475
$$ packed form
17409A98657q0788K15127J65989M3224A65821O138h6425A89672J30270J14259
17399D34201e9432k26429E0428R4802J99790O6587j66635q2188K01488N2802K919
17388D19993I9515J02864J20642j59084K31J41846F3001c5645F9280C0170j2229
17377A7941g9899l7473F2495J132M37816I1322J90501Q7285j67779j2004G2522
17365B75279j28986P9367b9881C44974K0897H8870J32776K44368A09054J18508
17355B27562N8339A04566K04734a05748d8486A05190J10887J26072r5310J01831
17345C48670M4645j78854J0635a13228G6512C7872b05575B71161A14462N9233
17335A73695E9583K06342J9594c9544C1726O3567J66481k1898l0800A03348J9127
$$ plain form
17324 122475 349179 -54773 390648 29505 102313 -20573 -92209 273468 113400 368669
17314 368669 168178 166657 181897 380168 234460 64568 272052 398995 68898 275691
17304 275691 162145 91711 629169 83218 136151 -136139 232331 -7694 139266 143995 12444
17292 294336 170601 366548 170801 -178248 45058 249884 171060 -56454 49055 280599
17282 280599 73743 387659 541215 32032 555103 329454 212686 146466 369065 351432
17272 351432 23140 59151 495981 295961 -19418 404339 332888 111085 267776 405099
17262 405099 416586 420867 326435 -280 -4959 311473 1415 415330 237670 327277 -38777 293248
17249 241261 44332 353405 52551 460561 392678 238744 -80612 71688 527710 416302
$$ packed form
17324A22475K26704e4773C90648B9505P2808b0573p1636B73468A13400K55269
17314C68669A68178j521J5240J98271j45708F4568K07484J26943F8898K06793
17304B75691j13546p0434N37458H3218N2933a36139B32331g694A39266M729A2444
17292B94336j23735J95947A70801a78248D5058K04826p8824e6454D9055K31544
17282B80599G3743L13916J53556C2032N23071k25649j16768o6220K22599j7633
17272C51432B3140L6011M36830k00020a9418D04339p1451A11085J56691J37323
17262D05099J1487M281r4432b80m679C11473A415M13915j77660Q9607c8777B93248
17249B41261D4332L09073E2551M08010o7883j53934h0612G1688M56022j11408
$$ plain form
17239 416302 147903 235684 404905 12126 286713 112511 98895 7395 149187 143115 279800
17228 279800 333334 319334 463104 647183 276272 346103 439140 287213 229937 -55161 199096
17216 321705 190293 65178 340798 301504 192534 145853 587708 -282254 183694 513141
17206 513141 209765 193618 279890 59874 266414 304370 174878 148191 267939 346742 361862
17195 361862 149438 446952 118381 239091 453762 620985 -2801 243398 237272 338639
17185 338639 444466 160541 79494 464825 617387 284117 184741 140081 416895 647264
17175 647264 540256 290955 216132 48424 158899 293677 250795 528685 93075 451542
17165 451542 305205 109039 235436 102547 595683 58723 468379 358437 114049 159030
$$ packed form
17239D16302A47903Q7781J69221A2126K74587A12511j3616G395J41792o072J36685
17228B79800N3534j4000J43770J84079B76272O9831R3037j51927n7276e5161A99096
17216C21705j31412F5178K75620l9294j08970m6681M41855b82254A83694L29447
17206E13141B09765j6147Q6272E9874K06540L7956j29492k6687J19748P8803J5120
17195C61862A49438K97514A18381J20710K14671J67223b801B43398o126J01367
17185C38639J05827A60541G9494L85331J52562B84117r9376m4660K76814K30369
17175F47264j07008k49301p4823D8424J10475J34778m2882K77890I3075L58467
17165D51542j46337A09039J26397A02547M93136E8723M09656j09942A14049M4981
$$ plain form
17155 159030 184736 124224 551281 580120 176941 488537 201762 232989 467047 410514
17145 410514 316372 514569 421794 454184 276225 461144 250335 176776 483569 338133
17135 338133 592040 493901 236287 325129 295486 891782 512753 464405 179347 366712
17125 366712 379488 507682 304430 357240 510230 495632 642824 611695 548202 539149 649202
17114 649202 548256 460127 299283 417621 521898 520604 474792 563746 728495 249929
17103 567234 404514 587358 526529 643773 731662 436809 388125 283545 179948 482768
17093 482768 481775 308894 401080 345194 366310 570465 494041 533426 532206 691973 451044
17082 451044 475577 697162 432773 765625 445596 630267 534208 419733 647955 781422
$$ packed form
17155A59030K5706o0512M27057K8839A76941L11596B01762L1227K34058n6533
17145D10514r4142J98197r2775L2390j77959J84919k10809p3559L06793j45436
17135C38133K53907r8139B36287Q8842k9643N96296l79029m8348A79347J87365
17125C66712J2776J28194k03252N2810J52990j4598J47192l1129o3493r053J10053
17114F49202j00946q8129j60844J18338J04277j294m5812Q8954J64749B49929
17103E67234j62720J82844o0829J17244Q7889k94853m8684j04580j03597L02820
17093D82768r93j72881R2186n5886K1116K04155p6424L9385j220J59767k40929
17082D51044K4533K21585k64389L32852l20029J84671r6059j14475K28222J33467
$$ plain form
17072 781422 574216 286476 796689 707335 780185 520716 421151 353496 503376 784772
17062 784772 345924 590239 546113 593821 342190 535909 922070 596750 786502 780193
17052 780193 681646 669377 420828 825847 824943 862228 1003556 574655 627545 527179 610085
17041 610085 728445 504382 701522 589254 957480 721349 758847 816404 804363 632652
17031 632652 810017 598790 437236 889330 1321698 524284 486778 1261408 742897 418206
17021 418206 712596 818204 778359 654570 857311 812045 907819 538857 889602 907743
17011 907743 1068217 662586 757075 992705 641327 731933 888240 777316 953600 1015404
17001 1015404 1304315 824276 926252 902433 1066541 826197 495081 962947 1042776 997172
$$ packed form
17072G81422k07206B86476N10213q9354P2850k59469r9565o7655J49880K81396
17062G84772C45924K44315m4126M7708k51631J93719L86161l25320J89752o309
17052G80193r8547j2269k48549M05019r04L7285J41328m28901N2890j00366Q2906
17041F10085J18360k24063J97140j12268L68226k36131L7498N7557j2041j71711
17031F32652J77365k11227j61554M52094M32368E24284l7506P74630n18511l24691
17021D18206K94390J05608l9845j23789K02741m5266R5774l68962L50745J8141
17011I07743J60474m05631R4489K35630l51378R0606J56307j10924J76284O1804
17001A015404K88911m80039J01976k3819J64108k40344l31116M67866P9829m5604
$$ plain form
16991 997172 1157641 1089083 839228 645520 919431 802180 1093410 939147 1007964 1024527
16981 1024527 916009 923247 1153348 1051144 1321916 1293224 1226875 1241974 1050384 1185269
16971 1185269 1135060 993080 1312712 1025005 1255286 1154736 1163259 1048331 1102397 1062742
16961 1062742 1415910 890157 1513156 1320203 1459381 1395489 1425913 1345564 1278810 1383680
16951 1383680 1494368 1529472 1303318 1771358 1391088 1412397 1681919 1360668 1294091 1449508
16941 1449508 1281218 1594079 1763266 1302700 1608417 1596451 1484223 1687813 1540704 1661535
16931 1661535 2012447 1809687 1509264 1321296 1797660 1715300 1693243 1930690 1965125 1606405
16921 1606405 1815435 2003260 1826390 1836864 1941222 1912457 1817827 1847175 2008033 1996491
$$ packed form
16991I97172J60469o8558k49855j93708K73911j17251K91230j54263O8817J6563
16981A024527j08518P238K30101j02204K70772k8692o6349J5099j91590J34885
16971A185269n0209j41980L19632k87707K30281j00550Q523j14928N4066l9655
16961A062742L53168n25753O22999j92953J39178o3892L0424q0349o6754J04870
16951A383680J10688L5104k26154M68040l80270K1309K69522l21251o6577J55417
16941A449508j68290L12861J69187m60566L05717j1966j12228K03590j47109J20831
16931A661535L50912k02760l00423j87968M76364q2360k2057K37447L4435l58720
16921A606405K09030J87825j76870J0474J04358k8765r4630K9348J60858j1542
$$ plain form
16911 1996491 2151729 1829639 2152805 2140567 2131200 2297161 2232789 2089268 2301223 2050282
16901 2050282 2450239 2145734 2477244 2271609 2357035 2319367 2516408 2569347 2548544 2384068
16891 2384068 2599605 2374662 2407457 2325564 2722718 2589133 2835447 2634345 2545127 2949094
16881 2949094 2884081 2843082 3020565 3073378 3248482 2935577 3297023 3117783 3107602 3277967
16871 3277967 3491033 3542521 3503972 3569825 3370960 3683562 3831547 3728627 3885775 3809447
16861 3809447 3788079 3741626 3815439 3985786 4049008 3889014 4271917 4201924 4134579 4339566
16851 4339566 4416746 4500675 4787464 4403381 5061253 4807269 4878464 4751112 5082309 5162840
16841 5162840 4989955 5447996 5447293 5177373 5140441 5749201 5713565 5934784 6138198 5827765
$$ packed form
16911A996491J55238l22090L23166j2238r367J65961o4372j43521K11955k50941
16901B050282L99957l04505L31510k05635Q5426l7668J97041N2939k0803j64476
16891B384068K15537k24943L2795q1893L97154j33585K46314k01102q9218M03967
16881B949094o5013m0999J77483N2813J75104l12905L61446j79240j0181J70365
16871C277967K13066N1488l8549O5853j98865L12602J47985j02920J57148p6328
16861C809447k1368m6453P3813J70347O3222j59994L82903o9993o7345K04987
16851D339566P7180Q3929K86789l84083O57872k53984P1195j27352L31197Q0531
16841E162840j72885M58041p03k69920l6932O08760l5636K21219K03414l10433
$$ plain form
16831 5827765 6225874 6227156 6364896 6731053 6638030 6752888 7333872 7091559 7435865 7082467
16821 7082467 7476985 7760377 7501376 7620933 8215813 8115619 8332445 8555047 8682209
16812 8682209 8963587 9233182 9458592 9600811 9894987 9840482 10366936 10276973 11006236 11205985
16802 11205985 11141385 11389115 11597560 12101814 12339512 12384902 12996410 13355071 13646214 13834721
16792 13834721 14343410 14638058 14976929 15433654 15878143 16317956 16995401 17017040 17855626
16783 17855626 18170113 19061658 19357424 19967223 20650742 21095768 21855925 22540151 23537884
16774 23537884 24443529 24806515 25323351 26306257 27333513 28072150 29295177 30326050 31672458
16765 31672458 32317161 33679637 34539653 36010373 37528751 38810666 39863233 41771248
$$ packed form
16831E827765L98109J282J37740L66157r3023J14858N80984k42313L44306l53398
16821G082467L94518K83392k59001J19557N94880j00194K16826K22602J27162
16812H682209K81378K69595K25410J42219K94176n4505N26454q9963P29263J99749
16802A1205985o4600K47730K08445N04254K37698M5390O11508L58661K91143J88507
16792A3834721N08689K94648L38871M56725M44489M39813O77445K1639Q38586
16783A7855626L14487Q91545K95766O09799O83519M45026P60157O84226R97733
16774B3537884R05645L62986N16836R82906J027256P38637J223027J030873J346408
16765C1672458O44703J362476Q60016J470720J518378J281915J052567J908015
$$ plain form
16757 41771248 43349467 44953842 46732870 48363618 50595586 52409187 54454959 56865063
16749 56865063 58929260 61283425 63839184 66260852 68997888 71766672 74729385 77596972
16741 77596972 80153973 83182569 86479728 89437655 92546577 95922338 98971251 102063542
16733 102063542 104473908 107543973 109976882 112698855 114989002 116584942 118933980 120218995
16725 120218995 121454603 122004455 122229802 122706402 122153790 121485083 119985468 118766122 117354571
16716 117354571 115073414 113077910 110222741 108112518 104861855 101927295 98872696 96156489
16708 96156489 92921350 89996092 86632568 83661897 80145321 77468731 74740635 71510795
16700 71510795 69136520 66539992 63759770 61461210 59291519 56813810 54512013 52778859
$$ packed form
16757D1771248J578219J604375J779028J630748K231968J813601K045772K410104
16749E6865063K064197K354165K555759K421668K737036K768784K962713K867587
16741G7596972K557001L028596L297159K957927L108922L375761L048913L092291
16733A02063542K410366L070065K432909K721973K290147J595940K349038J285015
16725A20218995J235608N49852K25347M76600n52612o68707j499615j219346j411551
16716A17354571k281157j995504k855169k110223l250663k934560l054599k716207
16708I6156489l235139k925258l363524k970671l516576k676590k728096l229840
16700G1510795k374275k596528k780222k298560k169691k477709k301797j733154
$$ plain form
16692 52778859 50463437 48855895 46986634 45018325 43200328 41937268 40282530 38885935
16684 38885935 37193135 36415398 34850112 33776420 32398003 31644567 30688955 29419345
16676 29419345 28447596 27555995 26675138 25928654 25100501 24135442 23404162 22626606 22407077
16667 22407077 21582489 20814879 20115657 19586970 19512914 18719689 18050739 17634683 17185130
16658 17185130 16844750 16177762 15675171 15147874 14937709 14613213 14422950 13959762 13644062
16649 13644062 13393987 12775370 12840623 12482794 12068864 11737995 11485564 11429918 10940986 10918760
16639 10918760 10551428 10515552 10153594 9737684 9567361 9510333 9121930 9031327 8879083 8802942
16629 8802942 8721449 8466298 8365296 8020433 7895210 7891809 7506254 7293426 7388210 7188191
$$ packed form
16692E2778859k315422j607542j869261j968309j817997j263060j654738j396595
16684C8885935j692800p77737j565286j073692j378417p53436r55612j269610
16676B9419345r71749q91601q80857p46484q28153r65059p31280p77556k19529
16667B2407077q24588p67610o99222n28687p4056p93225o68950m16056m49553
16658A7185130l40380o66988n02591n27297k10165l24496j90263m63188l15700
16649A3644062k50075o18617O5253l57829m13930l30869k52431n5646m88932k2226
16639A0918760l67332l5876l61958m15910j70323n7028l88403r0603j52244p6141
16629H802942q1493k55151j01002l44863j25223l401l85555k12828R4784k00019
$$ plain form
16619 7188191 7363360 7171708 6774400 6681733 6952872 6410432 6212466 6374244 6121977 6087701
16609 6087701 5985452 5791995 5710938 5820156 5703279 5405000 5225248 4997197 5800480 4777626
16599 4777626 4841138 4957137 5144243 5013853 4915248 4705236 4696085 4629428 4445858 4512536
16589 4512536 4386010 4469203 4209155 4477164 4225433 3906372 4230277 3949458 3976898 3939531
16579 3939531 3813333 3791865 3636306 3843859 3742802 3793765 3579210 3785045 3376675 3471754
16569 3471754 3213173 3182210 3328657 3060129 3489332 3465124 3195437 3162308 2855794 3242337
16559 3242337 2964336 2695014 2909336 2786145 2877187 2945668 2955351 2894855 2825206 2807137 2566788
16548 2566788 2770911 2585088 2854390 3031228 2658694 2785095 2345043 2633080 2532180
$$ packed form
16619G188191J75169j91652l97308r2667K71139n42440j97966J61778k52267l4276
16609F087701j02249j93457q1057J09218j16877k98279j79752k28051Q03283j022854
16599D777626O3512J15999J87106j30390r8605k10012r151o6657j83570O6678
16589D512536j26526Q3193k60048K68009k51731l19061L23905k80819K7440l7367
16579C939531j26198k1468j55559K07553j01057N0963k14555K05835m08370R5079
16569C471754k58581l0963J46447k68528M29203k4208k69687l3129l06514L86543
16559C242337k78001k69322K14322j23191R1042O8481R683o0496o9649j8069k40349
16548B566788K04123j85823K69302J76838l72534J26401m40052K88037j00900
$$ plain form
16539 2532180 2412126 2547309 2257705 2080211 2281425 2431768 2228704 2190687 2386603 2460804
16529 2460804 2358250 2323420 2125066 2380320 2148577 2047507 2010457 1862369 1922345 2061997
16519 2061997 1791233 1678659 1936100 1681641 1654676 2023818 1569965 1533074 1858185 1899804
16509 1899804 1791656 1713110 1799280 1763736 1802795 1806515 1723145 1619284 1759202 1730929 1835295
16498 1835295 1870709 1703515 1792890 1942383 1807126 1426078 1694238 1531872 1642608 1766512
16488 1766512 1691767 1552341 1480682 1709553 1316058 1466286 1397153 1459322 1603534 1406476
16478 1406476 952970 1173984 1498019 1545814 1301701 1176748 1263992 1054975 1248392 1495927
16468 1495927 1513749 1317124 1208211 1022715 1318007 1138165 1228927 1121923 1406488 1295107
$$ packed form
16539B532180j20054J35183k89604j77494K01214J50343k03064l8017J95916P4201
16529B460804j02554l4830j98354K55254k31743j01070l7050j48088N9976J39652
16519B061997k70764j12574K57441k54459k6965L69142m53853l6891L25111M1619
16509A899804j08148p8546Q6170l5544L9059L720q3370j03861J39918k8273J04366
16498A835295L5414j67194Q9375J49493j35257l81048K68160j62366J10736J23904
16488A766512p4745j39426p1659K28871l93495J50228o9133O2169J44212j97058
16478A406476m53506K21014L24035M7795k44113j24953Q7244k09017J93417K47535
16468A495927J7822j96625j08913j85496K95292j79842R0762j07004K84565j11381
$$ plain form
16458 1295107 1406668 1183559 1164434 998273 1320917 1292352 1353236 1268745 1067063 1024323
16448 1024323 1437133 1084209 1000295 1089986 1395414 1212367 835633 905625 1282335 1035614
16438 1035614 1046693 894040 1115392 1277000 1166789 1245526 982520 870005 1039031 977905
16428 977905 1161787 1122579 1169597 1275529 966606 1079482 1396801 913893 1003021 971733
16418 971733 962497 934015 903837 1108090 1069260 799441 766106 1073073 950038 651935 810723
16407 810723 1149819 1021292 965156 761706 1222917 927709 971255 732093 878494 830776
16397 830776 1091099 817951 1147188 687937 961561 885191 896097 1062301 474754 1033751
16387 1033751 821664 627584 603464 712701 801402 597303 565041 902393 779779 879917
$$ packed form
16458A295107J11561k23109j9125j66161L22644k8565O0884q4491k01682m2740
16448A024323M12810l52924q3914Q9691L05428j83047l76734O9992L76710k46721
16438A035614J1079j52653K21352J61608j10211P8737k63006j12515J69026o1126
16428I77905J83882l9208M7018J05932l08923J12876L17319m82908Q9128l1288
16418I71733r236k8482l0178K04253l8830k69819l3335L06967j23035k98103J58788
16407H10723L39096j28527n6136k03450M61211k95208M3546k39162J46401m7718
16397H30776K60323k73148L29237m59251K73624p6370J0906J66204D74754N58997
16387A033751k12087j94080k4120J09237Q8701k04099l2262L37352j22614J00138
$$ plain form
16377 879917 598689 769076 740701 662985 727747 816383 615668 915948 650110 752299
16367 752299 786287 828651 575164 900159 1081431 440418 691082 550329 333462 920501
16357 920501 521213 512359 801692 825440 552146 793277 615404 544590 799129 777610
16347 777610 883521 608591 824282 615116 798881 1036979 660810 497206 352368 611273
16337 611273 373374 537276 616611 886014 548568 539151 582812 693318 354434 436888
16327 436888 757519 538983 464182 556076 382473 797551 681940 466343 684857 564321
16317 564321 499774 978335 492485 472151 637468 526745 820042 300559 523050 545477
16307 545477 387336 442927 202632 707891 292622 615040 345175 527746 559882 579754
$$ packed form
16377H79917k81228J70387k8375p7716O4762Q8636k00715L00280k65838J02189
16367G52299L3988M2364k53487L24995J81272D40418K50664j40753k16867N87039
16357I20501l99288q854K89333K3748k73294K41131j77873p0814K54539k1519
16347G77610J05911k74930K15691k09166J83765K38098l76169j63604j44838K58905
16337F11273k37899J63902P9335K69403l37446r417M3661J10506l38884Q2454
16327D36888L20631k18536p4801R1894j73603M15078j15611k15597K18514j20536
16317E64321o4547M78561m85850k0334J65317j10723K93297C00559K22491K2427
16307E45477j58141N5591B02632N05259B92622L22418k69865J82571L2136J9872
$$ plain form
16297 579754 477833 572498 510748 298450 454435 650761 514807 400837 702577 317980
16286 214000 267084 882506 548030 459556 580241 396830 777184 339950 562649 304159
16276 304159 741611 265973 335308 430946 600738 799843 164814 485185 477846 409286
16266 409286 85745 353201 513356 203427 356942 267043 408366 312768 355171 327839
16256 327839 451146 591838 144758 437692 553251 209570 391173 407658 268627 351495
16246 351495 256118 399915 360723 378665 155248 316733 344259 506634 329029 269153
16236 269153 360236 421222 159701 335153 307545 691701 506096 491020 466837 380814 332284
16225 332284 434153 389253 237714 381963 341009 58966 211984 524360 328084 344417
$$ packed form
16297E79754j01921R4665o1750k12298J55985J96326j35954j13970L01740C17980
16286B14000N3084O15422l34476q8474J20685j83411L80354C39950K22699k58490
16276C04159M37452B65973O9335R5638J69792J99105A64814L20371p339o8560
16266D09286H5745K67456J60155B03427J53515q9899J41323r5598M2403k7332
16256C27839J23307J40692A44758K92934J15559B09570J81603J6485j39031Q2868
16246C51495r5377J43797l9192J7942A55248J61485K7526J62375j77605n9876
16236B69153R1083O0986A59701J75452k7608L84156j85605j5076k4183q6023m8530
16225C32284J01869m4900j51539J44249m0954E8966J53018L12376j96276J6333
$$ plain form
16215 344417 535801 606659 304279 529497 282188 263178 228831 -37563 68923 191724
16205 191724 182512 220576 10476 335796 250042 224521 516445 141235 171853 202781 448592
16194 448592 266879 155008 264196 138712 23114 538958 -68880 347461 70176 286203
16184 286203 288135 84658 226314 332363 223140 246081 336703 453115 176628 -79139 61292
16172 281367 284607 266828 45968 301237 287572 112115 225026 441609 194205 135859 182515
16161 182515 133945 94744 159305 124084 406136 621850 323188 267649 18215 322308 234545
16150 234545 347447 -10181 185917 305849 377184 289882 172773 -3291 74993 60849 118598
16139 118598 140122 306413 163909 161920 151804 174 466335 -11415 126164 34051 482280
$$ packed form
16215C44417J91384P0858l02380K25218k47309j9010l4347c7563F8923J22801
16205A91724r212L8064A0476L25320q5754k5521K91924A41235L0618L0928K45811
16194D48592j81713j11871J09188j25484B3114N15844f8880C47461G0176K16027
16184B86203J932H4658J41656J06049j09223K2941R0622J16412A76628g9139F1292
16172B81367L240j7779D5968K55269j3665A12115J12911K16583A94205n8346M6656
16161A82515m8570l9201O4561l5221K82052K15714k98662n5539A8215L04093q7763
16150B34545J12902a0181A85917J19932P1335q7302j17109c291G4993j4144N7749
16139A18598K1524J66291j42504j989j0116A74M66161a1415A26164C4051M48229
$$ plain form
16128 482280 307849 313805 -92018 109680 106148 245038 352721 117496 176211 41771 69602
16117 69602 271434 25142 56520 335427 385688 16713 89021 393282 185083 448991 -47380
16105 138537 339410 10979 116983 -137303 -49725 337374 254405 281887 155401 37419
16094 138055 480078 -82571 278997 345048 -32343 -69563 -102133 -64384 201049 -97023 41238
16082 272790 374757 54785 -229524 224428 31849 -117541 122580 -84055 -83797 268045 84088
16070 -32101 -87777 208606 -2140 128916 30766 65516 -85130 78815 270726 168968 266453
16059 266453 -463872 104663 170303 97954 66802 251370 590219 1237 202208 91213 73691
16048 73691 -26586 217821 123477 -46072 -95079 145657 30088 304059 253150 430917 54135
$$ packed form
16128D82280j74431N956i2018A09680l532J38890J07683A17496N8715D1771K7831
16117F9602K01832B5142L1378K78907N0261A6713P2308L04261A85083K63908d7380
16105A38537K00873A0979J06004a37303d9725C37374q2969K7482j26486C7419
16094A38055L42023h2571B78997O6051c2343l7220l2570L7749B01049i7023D1238
16082B72790J01967E4785b29524B24428C1849a17541A22580h4055K58B68045H4088
16070c2101n5676B08606b140A28916C0766L4750h5130G8815J91911j01758R7485
16059B66453d63872A04663O5640p2349l1152J84568L38849A237K00971I1213j7522
16048G3691b6586B17821r4344d6072m9007A45657C0088K73971n0909J77767E4135
$$ plain form
16036 299582 -171498 24623 -82765 -253699 417870 -81013 -201480 38783 175060 -173576
16025 26188 -188968 -133964 115645 303170 424160 97561 -63639 77884 232833 15956 199479
16014 199479 12377 -25218 391772 109306 -68955 131849 -8107 132330 58810 161839 175914
16003 175914 51977 -396045 114376 25291 255355 9960 6168 -139573 46879 38610 -77124
15991 -172263 128779 347318 -19463 9130 445780 311748 224034 578978 896995 348280
15980 373582 65437 368262 207278 -305698 254721 32818 -287124 250717 114959 245386
15970 245386 138192 -30054 -24380 155575 313159 284553 -232942 47074 -157843 -90260 225230
15958 -109744 10538 267836 -117785 4562 45293 4432 -229221 82834 12945 30383 -43915
$$ packed form
16036B99582a71498B4623h2765j70934D17870h1013j20467C8783J36277a73576
16025B6188a88968N5004A15645J87525J20990I7561f3639G7884J54949A5956J83523
16014A99479A2377b5218C91772A09306f8955A31849h107A32330E8810J03029J4075
16003A75914E1977c96045A14376B5291K30064I960l792a39573D6879q269g7124
15991a72263A28779K18539a9463I130M36650j34032q7714L54944L18017C48280
15980C73582F5437L02825j60984c05698B54721C2818b87124B50717A14959J30427
15970B45386j07194c0054N674A55575J57584k8606b32942D7074a57843O7583B25230
15958a09744A0538K57298a17785D562M0731D432b29221H2834A2945J7438d3915
$$ plain form
15946 -86193 112150 16811 299484 -31193 217859 -335040 -341410 173296 -247474 287759
15935 -68883 -72822 202141 24426 -169254 -129552 193854 201433 341689 322041 196035 32289
15923 191720 -309445 -175986 80159 -170435 -104333 -13094 -233827 -29103 55592 -267392
15912 149119 6001 -37862 95308 -63036 342325 104219 20250 209837 250869 166282 107196
15901 107196 -357229 -11994 48356 -70062 -273812 -107067 -97090 -52851 27040 51404 211342
15890 211342 249910 -166709 -177706 -152141 132119 -17035 109466 -81579 -86289 90923 74227
15879 74227 -313873 -269147 186896 -228129 -57634 -97014 98287 -231122 123666 -181341
15868 -254953 110556 -146789 -522421 94811 21521 -28644 -180046 49341 44254 -281059 -27714
$$ packed form
15946h6193A12150A6811K82673c1193B17859c35040o370A73296b47474B87759
15935f8883l939B02141B4426a69254L9702A93854P579J40256j9648j26006C2289
15923A91720c09445J33459H0159a70435O6102a3094k20733b9103E5592b67392
15912A49119F001c7862I5308f3036C42325A04219B0250J89587M1032q4587n9086
15901A07196c57229a1994D8356g0062k03750a07067R977M4239B7040K4364J59938
15890B11342L8568a66709j0997K5565A32119a7035A09466h1579m710I0923j6696
15879G4227c13873M4726A86896b28129e7634l9380I8287b31122A23666a81341
15868b54953A10556a46789l75632I4811B1521b8644j51402D9341n087b81059b7714
$$ plain form
15856 -5442 -70525 127086 14860 220457 161302 194967 -113527 -70585 38336 97804 -152764
15844 96878 4127 172378 168776 126567 316213 207663 46195 185025 52741 18960 99513
15833 99513 70397 33285 -194788 63826 207119 35050 -275613 -62745 134638 -258997 100361
15821 182395 -13351 101945 97940 -218651 -24026 -21923 86305 -148528 162053 -169106 -809
15809 -22150 30655 48216 -176897 203732 -9487 -130595 -121108 289875 -41949 13725 70725
15798 70725 120669 141714 -221264 101681 229174 30939 -271076 -386054 -383865 101991 341271
15787 341271 71390 -200599 -207769 29170 173812 -242026 106704 -94730 -137165 -112447 153378
15775 90361 77182 -9599 237171 231498 -171001 -233504 99841 -233788 -207365 81908 -95045
$$ packed form
15856e442o5083A27086A4860K05597n9155L3665a13527M2942C8336N9468a52764
15844I6878D127J68251l602m2209J89646j08550D6195J38830E2741A8960Q0553
15833I9513k9116C3285a94788F3826J43293C5050b75613f2745A34638b58997A00361
15821A82395a3351A01945m005b18651b4026K103H6305a48528A62053a69106h09
15809b2150C0655J7561a76897B03732i487j21108R487B89875d1949A3725N7000
15798G0725M9944K1045b21264A01681J27493C0939b71076j14978K189A01991K39280
15787C41271G1390b00599p170B9170J44642b42026A06704i4730m2435K4718A53378
15775I0361j3179i599B37171n673a71001o2503I9841b33788K6423H1908i5045
$$ plain form
15763 -191339 21712 -26600 242734 -44272 -41774 175702 62761 -28858 154960 -47360 -24880
15752 -24880 -91455 -125466 29045 -120113 -31756 180351 -137356 -226499 -67689 236168 -54396
15740 225145 32883 -253729 -280768 -102878 -130341 91365 -3410 -485034 -236510 28677 -31212
15728 -260008 -92251 129797 -112101 140142 39153 -67911 383 -126936 -168729 110264 59088
15717 59088 78881 -205497 -119100 -320520 13643 -248436 -345791 -219678 -65864 332306 120579
15705 -237158 24752 9127 -93685 -30302 34239 -175576 -109884 194897 130194 -168432 156051
15693 -237318 52313 81452 -76295 -98403 337702 42480 106290 398064 103875 59424 33041
15682 33041 -63602 85062 -28717 -58902 -140741 95552 -129525 12874 -61901 88593 -342966
$$ packed form
15763a91339B1712b6600B42734d4272K498A75702F2761b8858A54960d7360K2480
15752b4880o6575l4011B9045a20113c1756A80351a37356q9143f7689B36168e4396
15740B25145C2883b53729k7039a02878k7463I1365c410m81624b36510B8677c1212
15728b60008i2251A29797a12101A40142C9153f7911C83a26936m1793A10264n1176
15717E9088J9793b05497Q6397k01420A3643b48436r7355J26113f5864C32306A20579
15705b37158B4752I127i3685c0302C4239a75576O5692A94897o4703a68432A56051
15693b37318E2313K9139g6295k2108C37702D2480O3810K91774A03875m4451k6383
15682C3041f3602H5062b8717l0185q1839I5552a29525A2874f1901H8593c42966
$$ plain form
15670 -201165 79814 41097 -5892 -56894 -157789 -64084 -133500 -65822 29365 45142 79977
15659 79977 53692 38951 35639 143562 -150793 85402 -83690 133839 -209070 96968 217197
15648 217197 105748 -165603 -391426 -207656 59973 -194593 270994 -152461 18254 -134905
15637 -109286 -401152 -100580 58115 55340 -234221 -12292 -150981 10493 188707 73368 -74730
15625 -12952 52574 15772 -56305 218554 -195005 -41695 -78654 -90604 40944 222187 -83323
15613 -228530 -211599 -4334 86488 -40258 264843 48015 260217 16035 322075 157707 188991
15602 188991 106624 173525 -67493 -342889 -115924 58241 -57910 -9958 97119 -160641 321685
15590 -111692 -149762 -278594 177058 85812 -326525 -36111 98338 46734 -45189 -155354 -185545
$$ packed form
15670b01165G9814l8717e892n1002j00895f4084o9416f5822B9365J5777L4835
15659G9977k6285j4741l312J07923a50793H5402h3690A33839b09070I6968J20229
15648B17197A05748a65603k25823J83770E9973a94593B70994a52461A8254a34905
15637a09286k91866a00580E8115k775b34221a2292j38689A0493J78214G3368g4730
15625a2952E2574A5772e6305B18554a95005d1695l6959j1950D0944J81243h3323
15613b28530J6931d334H6488d0258B64843D8015K12202A6035L06040A57707L1284
15602A88991q2367O6901f7493k75396a15924E8241e7910i958I7119a60641C21685
15590a11692l8070j28832A77058H5812c26525c6111I8338D6734d5189j10165l0191
$$ plain form
15579 -185545 194328 228041 -26829 45728 -413984 -57142 -198429 -76346 186798 -251715
15568 -238465 -38869 473595 -28925 -59599 -157330 -444550 92711 30812 -113128 97687 -36379
15556 34777 99114 241327 260278 -363179 468199 220140 105681 -91671 -45020 31718 175415
15545 175415 229130 219277 -237118 235487 276382 179274 48221 -286808 213076 -2693 108244
15533 229885 167633 -216360 -194033 -8799 76745 -77230 226492 30866 34579 278877 18318
15521 199689 -55591 185470 72756 4092 4079 25288 -103182 -19135 477960 -111018 10492
15509 55457 -125655 62508 -255805 -12165 -283923 -202001 -2294 110653 69915 29730 25102
15498 25102 -323526 152907 30560 73093 402677 8265 7925 -62624 85441 -176333 40351
$$ packed form
15579a85545A94328L3713b6829D5728d13984e7142j41287g6346A86798b51715
15568b38465c8869D73595b8925l0674r7731k87220I2711C0812a13128I7687c6379
15556C4777O4337J42213J8951c63179D68199B20140A05681i1671d5020C1718J43697
15545A75415N3715r853b37118B35487M0895r7108D8221b86808B13076b693A08244
15533B29885o2252b16360K2327h799G6745g7230B26492C0866L713K44298A8318
15521A99689e5591A85470G2756D092j3K1209a03182a9135D77960a11018A0492
15509E5457a25655F2508b55805a2165k71758Q1922b294A10653m0738B9730m628
15498B5102c23526A52907C0560M2533L29584H265l40f2624H5441a76333D0351
$$ plain form
15486 183297 -234329 192773 -139445 125884 9759 69772 64385 50121 202828 -89073 180437
15474 39185 418943 266304 -30114 172734 104406 113842 133543 -410197 -249315 399457 137237
15462 -249293 278249 136885 152506 187962 81323 390890 99030 213049 -3221 275043 42587
15450 62286 77709 146734 206215 -368994 -62773 -204158 90003 344191 552690 267178 289189
15439 289189 303094 356087 145491 -3776 56632 23919 321082 10228 -70364 94808 205022
15428 205022 -88 118376 57239 -192357 52170 -16685 75104 161176 30663 134140 59775
15416 -242948 -76348 100371 -290876 81283 91520 -77467 172247 -36386 69047 185816 -184315
15404 -8731 -291301 189709 127147 -161649 20121 33971 -174485 -234699 41934 288097 179343
$$ packed form
15486A83297b34329A92773a39445A25884I759O0013n387j4264J52707h9073A80437
15474C9185L79758j52639c0114A72734o8328R436J9701d10197J60882C99457A37237
15462b49293B78249A36885J5621L5456H1323L09567I9030J14019c221B75043D2587
15450F2286J5423O9025N9481c68994f2773j41385I0003K54188K08499B67178K2011
15439B89189J3905N2993A45491c776E6632B3919K97163A0228g0364I4808J10214
15428B05022h8A18376E7239a92357E2170a6685G5104Q6072C0663J03477E9775
15416b42948g6348A00371b90876H1283J0237g7467A72247c6386F9047J16769a84315
15404h731k82570A89709o2562a61649B0121J3850a74485o0214D1934K46163j08754
$$ plain form
15393 179343 161495 192433 -140763 -44465 145617 -274122 184770 -84987 35830 59945 287339
15382 287339 -139506 -40295 -160428 -263335 383192 -81382 331450 -101 -169863 -153309 -23172
15370 406367 191698 -120910 140296 166121 -98492 25799 311947 -218089 92443 32417
15359 85486 154967 -64752 -73164 173704 -54583 -156132 -123755 -130040 -224551 81569 43579 69560
15347 69560 365358 48742 37139 -205902 45788 259723 17333 109806 390978 46319 186905
15336 186905 158812 282816 38486 -109004 -257239 184545 96196 18131 325332 310273
15326 310273 -64344 -134335 175101 416049 96831 -89150 -196629 24826 123183 -183964 80763
15314 -143876 212717 124804 87719 157505 110150 84237 -207933 -131273 -24978 263940 345397
$$ packed form
15393A79343j7848L0938a40763d4465A45617b74122A84770h4987C5830K4115K27394
15382B87339a39506d0295j20133j02907C83192h1382C31450a01j69762J6554b3172
15370D06367A91698a20910A40296K5825i8492B5799K86148b18089I2443C2417
15359H5486O9481f4752q412A73704e4583j01549L2377o285r4511H1569l7990K5981
15347F9560K95798D8742j1603b05902D5788K13935A7333R2473K81172D6319J40586
15336A86905k8093J24004C8486a09004j48235A84545q8349A8131L07201j5059
15326C10273f4344o9991A75101K40948I6831h9150j07479B4826R8357a83964H0763
15314a43876B12717q7913l7085O9786m7355k5913b07933P6660b4978B63940Q1457
$$ plain form
15303 345397 43261 -328180 -131375 375919 -55295 299488 -106841 -175130 32172 -312821
15292 171931 -99067 -94572 28796 219848 225447 -239031 137437 168744 -47766 -156411 -39881
15280 -83615 -87996 -247807 -35797 71093 334393 113820 -3972 73738 94867 227556 -1103
15268 233175 87789 -15576 -344635 -10814 248229 60098 -324864 -16632 115733 -21109 -286436
15257 -286436 12821 56361 20923 -55652 362164 44521 400731 470313 366058 138606 992920
15246 992920 1955932 1049312 1616308 963440 237506 339578 -264242 209021 -112204 -17506
15235 -139728 96075 14468 -71910 11062 250137 -111978 -142111 1718 87385 -182321 88266
15223 131551 -166761 413251 -277747 166597 -17490 -134273 181310 174372 -48214 74798
$$ packed form
15303C45397D3261c28180a31375C75919e5295B99488a06841o8289C2172c12821
15292A71931i9067M495B8796J91052N599b39031A37437L1307d7766j08645c9881
15280h3615m381j59811c5797G1093K63300A13820c972G3738K1129J32689a103
15268B33175H7789a5576l29059a0814B48229F0098c24864a6632A15733b1109k65327
15257b86436A2821M3540B0923e5652C62164D4521L56210O9582j04255A38606Q54314
15246I92920R63012r06620N66996o52868B37506J02072b64242B09021a12204a7506
15235a39728I6075A4468g1910A1062K39075a11978l0133A718Q5667a82321H8266
15223A31551a66761D13251b77747A66597a7490j16783A81310o938d8214G4798
$$ plain form
15212 50055 -112943 98759 -37021 118940 219778 -74157 -4466 -160399 31475 384200 35155
15200 241374 364409 99092 167018 37725 -63167 177038 262038 -56508 -177733 -79832 182465
15188 168971 118855 282863 -196929 147764 226217 -379311 57856 -18307 25403 104174 242368
15177 242368 47704 121998 316555 -91530 -89829 38148 112721 66460 -56217 -32136 27098
15165 -13751 -219901 36478 -257176 -178542 256327 265135 271805 150643 60216 -263602 108966
15153 -187451 -27207 132713 59001 156880 246278 178985 123490 78618 123214 -128307 315429
15141 85577 260253 -32839 -36105 -219748 -144341 393944 220901 -141960 -50691 316474 -22458
15129 299114 104494 506080 34654 224264 140257 167402 112559 66931 30876 89431 413330
$$ packed form
15212E0055a12943I8759c7021A18940J00838g4157d466j55933C1475L52725C5155
15200B41374J23035I9092O7926C7725f3167A77038Q5000e6508j21225g9832A82465
15188A68971n0116J64008a96929A47764P8453c79311E7856a8307B5403P8771J38194
15177B42368D7704P4294J94557i1530J701C8148P4573m6261e6217K4081B7098
15165a3751k06150C6478b57176P8634B56327Q808O670j21162F0216b63602A08966
15153a87451b7207A32713E9001R7879Q9398o7293n5495m4872M4596a28307C15429
15141H5577J74676c2839l266j83643P5407C93944j73043a41960e0691C16474b2458
15129B99114A04494M01586C4654J89610q4007K7145n4843m5628C0876N8555L23899
$$ plain form
15118 413330 21867 60947 -215373 -90106 -88000 59394 95475 356639 -28436 14640 -211319
15106 149632 -144895 234424 -14959 287952 180025 285966 99001 138440 231753 17240
15095 199207 119048 192877 -48927 158203 271350 174518 417508 185958 153342 -65953 42729
15083 -121868 138183 328638 -74385 136188 52752 38174 273917 18157 16813 49049 -24228
15071 74553 359358 289770 82611 113925 40939 44324 2923 177266 286578 14290 339992
15060 339992 81546 76088 -59204 173736 98531 229274 132776 56471 49351 85003 186068
15049 186068 259302 181158 380893 429759 146505 24016 145627 241070 335865 506472 295520
15038 295520 -49166 265261 260993 258562 562224 220966 351878 114805 371827 125194
$$ packed form
15118D13330B1867L9080b15373i0106K106E9394L6081K61164b8436A4640b11319
15106A49632a44895B34424a4959B87952j07927J05941I9001L9439R3313A7240
15095A99207q0159P3829d8927A58203J13147r6832K42990A85958l2616f5953D2729
15083a21868A38183J90455g4385A36188E2752j4578K35743A8157j344L2236b4228
15071G4553K84805o9588H2611L1314D0939L385B923J74343J09312A4290L25702
15060C39992H1546n458e9204A73736p5205J30743r6498E6471p120L5652J01065
15049A86068P3234p8144J99735M8866A46505B4016J21611R5443R4795J70607k10952
15038B95520d9166B65261m268k431L03662B20966J30912A14805K57022A25194
$$ plain form
15027 366443 181017 271701 635335 359039 611136 249296 342176 33096 432608 263072
15017 263072 591136 388515 370132 244429 296171 48060 248507 14784 428295 190806
15006 485621 471030 352827 399653 313172 31548 482547 581686 283532 366977 43736 150829
14995 150829 237421 714543 317395 190360 305055 318321 332844 235460 295219 344674 245498
14984 245498 325945 89468 73727 418757 321620 512725 405499 318403 210086 221892 123196
14973 123196 445483 27799 127516 481306 180228 448515 236179 118232 578707 245519
14962 656986 98957 541394 291838 198488 145736 370237 380444 262219 90518 662387
14952 662387 113332 483699 481915 219723 418194 97178 416239 156404 61439 -189688
$$ packed form
15027C66443A81017R0684L63634k76296K52097B49296R2880C3096L99512j69536
15017B63072L28064k02621j8383j25703N1742D8060K00447A4784M13511A90806
15006D85621j4591j18203M6826q6481C1548M50999R9139B83532Q3445D3736J07093
14995A50829Q6592M77122C17395j27035J14695J3266J4523r7384N9759M9455r9176
14984B45498Q0447H9468j5741L45030r7137J91105j07226q7096j08317J1806r8696
14973A23196L22287B7799R9717L53790A80228K68287k12336j17947M60475B45519
14962F56986I8957M42437k49556r3350n2752K24501J0207j18225I0518N71869
14952F62387A13332L70367j784B19723J98471I7178L19061A56404F1439a89688
$$ plain form
14941 390793 806442 556898 290300 749231 188615 238825 418440 338022 334023 220559
14931 220559 292761 466676 473422 574402 791068 651874 745852 855894 911917 1056008
14921 1056008 607890 951203 1035961 572095 659482 566164 1233497 888214 1032468 660497
14911 660497 662088 717449 618800 519627 310928 351650 397884 266843 421672 113673 232968
14900 232968 330497 714894 205029 357566 150013 256599 213578 437735 481703 385108
14890 385108 405350 229100 303766 309923 391634 720981 766646 889244 413150 64894 425726
14879 425726 727587 353607 341699 335643 501820 807435 594015 372804 632142 470022
14869 470022 297450 320852 619814 609682 576524 654583 646510 284430 470641 342144 588478
$$ packed form
14941C90793M15649k49544k66598M58931A88615N0210J79615q0418l999j13464
14931B20559P2202J73915O746J00980K16666j39194R3978J10042N6023J44091
14921A056008m48118L43313Q4758m63866Q7387r3318O67333l45283J44254l71971
14911F60497J591N5361r8649r9173k08699M0722M6234j31041J54829A13673J19295
14900B32968R7529L84397B05029J52537A50013J06586m3021K24157M3968r6595
14890C85108K0242j76250P4666O157Q1711L29347M5665J22598D13150F4894L60832
14879D25726L01861C53607j1908o056J66177L05615k13420k21211K59338j62120
14869D70022j72572K3402K98962j0132l3158P8059q073B84430J86211j28497K46334
$$ plain form
14858 588478 295097 339805 283466 521921 382256 519831 379370 417973 369516 790240
14848 790240 406167 378298 303846 482207 527902 581089 321831 708743 155921 508440
14838 508440 681787 907816 646491 581125 831120 545651 339778 461443 318596 210578
14828 210578 699904 840133 376267 461301 345119 565320 515821 597149 406496 519212
14818 519212 530105 559050 795441 497537 371473 145779 409465 482448 534782 494717
14808 494717 619205 526819 772052 902846 355244 555121 349240 573296 441728 726022
14798 726022 925213 815123 309365 404648 540779 496896 671834 614768 270771 725108
14788 725108 455487 594839 642774 686519 797747 492628 376376 357368 425658 513470
$$ packed form
14858E88478k93381M4708n6339K38455j39665J37575j40461L8603m8457M20724
14848G90240l84073k7869p4452J78361M5695N3187k59258L86912A55921L52519
14838E08440J73347K26029k61325o5366K49995k85469k05873J21665j42847j08018
14828B10578M89326J40229C76267Q5034j16182K20201m9499Q1328j90653J12716
14818E19212J0893K8945K36391k97904j26064A45779K63686P2983N2334m0065
14808D94717J24488r2386K45233J30794C55244J99877k05881K24056j31568K84294
14798G26022J99191j10090C09365R5283J36131m3883J74938n7066B70771M54337
14788G25108k69621J39352M7935M3745J11228l05119j16252j9008O8290Q7812
$$ plain form
14778 513470 388614 897039 609010 545246 496410 454007 641276 597843 384145 610787
14768 610787 587677 488858 894453 850878 607649 691056 368784 326367 474787 554030 428088
14757 428088 688802 524928 868677 801924 485954 466204 663406 444620 490642 882367
14747 882367 898500 411174 809274 916086 849684 695502 569291 838719 899526 574215
14737 574215 799295 897877 620858 513532 814793 581613 698288 642885 733595 892673
14727 892673 793638 531381 1056835 983659 667170 732639 746589 983077 1012536 1251503
14717 1251503 827088 715871 652103 919457 815921 997723 676531 649154 704073 798162
14707 798162 752773 1073963 511371 287850 617732 857508 779896 1022970 963527 774283
$$ packed form
14778E13470j24856N08425k88029o3764m8836m2403J87269m3433k13698K26642
14768F10787k3110r8819M05595m3575k43229Q3407l22272m2417J48420P9243j25942
14757D28088K60714j63874L43749o6753l15970j9750J97202k18786M6022L91725
14747H82367J6133D11174L98100J06812o6402j54182j26211K69428O0807l25311
14737E74215K25080R8582k77019j07326L01261k33180J16675n5403R0710J59078
14727H92673r9035k62257N25454p3176l16489O5469J3950K36488K9459K38967
14717A251503m24415j11217o3768K67354j03536J81802l21192k7377N4919R4089
14707G98162m5389L21190E11371k23521L29882K39776p7612K43074n9443j89244
$$ plain form
14697 774283 807762 1117834 1269617 1008762 961440 774072 1055835 911221 977525 1072110
14687 1072110 743849 849801 709453 787058 662659 676424 809464 745250 823227 852100
14677 852100 616707 1087063 947401 800475 637177 1116223 1308429 920275 1040316 942489
14667 942489 914539 1097446 897954 777174 717748 749438 1182413 1120580 1013639 1066777
14657 1066777 704432 750486 1232235 779709 780073 935784 1019196 872658 1092174 1049631
14647 1049631 1124199 1296114 1173576 1133445 1033036 1096637 1103278 1301518 863867 757158
14637 757158 765030 1203288 1004952 988498 1077799 1201221 1130067 1111945 1112580 1079018 1339437
14626 1339437 1063311 1198570 1495855 1340417 1504821 1380684 1080286 967939 1219120
$$ packed form
14697G74283L3479L10072J51783k60855m7322j87368K81763j44614O6304R4585
14687A072110l28261J05952j40348P7605j24399J3765J33040o4214P7977K8873
14677H52100k35393M70356j39662j46926j63298M79046J92206l88154J20041r7827
14667I42489k7950J82907j99492j20780n9426L1690M32975o1833j06941N3138
14657A066777l62345M6054M81749m52526L64J55711Q3412j46538K19516m2543
14647A049631P4568J71915j22538m0131j00409O3601O641J98240m37651j06709
14637G57158P872M38258j98336j6454Q9301J23422p1154j8122O35l3562K60419
14626A339437k76126J35259K97285j55438J64404j24137l00398j12347K51181
$$ plain form
14617 1219120 1519584 1294848 1270038 1357063 1012676 1169601 1421798 1240590 1309990 1135900
14607 1135900 1316886 1151036 1502283 1455489 1508352 1405101 1235987 1484243 1446986 1359943
14597 1359943 1561830 1215968 1358679 1510710 1394024 1438303 1848104 1410310 1521094 1399847
14587 1399847 1830784 1505117 1606571 1722569 1779127 1883098 1608566 1493969 1672294 1641482
14577 1641482 1897286 2161295 1728412 1836535 1528970 1933817 1882146 1947094 2355107 2135780
14567 2135780 2362097 1982773 2347536 2437797 2014672 2256283 2443584 2362746 2563000 2289047
14557 2289047 2570758 2778931 3016549 3074256 3508912 3918739 4824065 5773089 7791340
14548 7791340 12336274 21061242 37478299 34957795 15779842 8804840 6241507 3346328
$$ packed form
14617A219120L00464k24736k4810Q7025l44387J56925K52197j81208O9400j74090
14607A135900J80986j65850L51247m6794N2863j03251j69114K48256l7257q7043
14597A359943K01887l45862J42711J52031j16686M4279M09801m37794J10784j21247
14587A399847M30937l25667J01454J15998N6558J03971k74532j14597J78325l0812
14577A641482K55804K64009m32883J08123l07565M04847n1671O4948M08013k19327
14567B135780K26317l79324L64763R0261m23125K41611J87301q0838K00254k73953
14557B289047K81711K08173K37618N7707M34656M09827R05326R49024K018251
14548G791340M544934Q724968J6417057k520504A5779842o975002k563333k895179
$$ plain form
14540 3346328 2423546 1922286 1690725 1620488 1729570 1743434 1731283 1584678 1869546 1978601
14530 1978601 1741857 1945251 2083261 1840359 2231246 1859612 2298933 1924949 2398551
14521 2398551 2312614 2384279 2167198 2175041 2003251 2103765 2245358 2109810 2123301 2596113
14511 2596113 2426099 2419540 2572411 2750837 2564316 2779365 2663380 2673088 2714603 2847384
14501 2847384 2716608 2588426 2886609 2897715 2804881 2794200 3188676 3006580 2934602 2934509 3301128
14490 3301128 3183975 3124316 3475726 3421390 3091791 3484510 3578944 3633970 3244721 3684413
14480 3684413 3651452 3641548 3411074 3793138 3612751 3918095 3492273 3840270 3893291 3823589
14470 3823589 3720067 3988411 4014456 4229239 3994848 4017168 4153153 4445380 4301920 4485211
$$ packed form
14540C346328r22782n01260k31561p0237J09082J3864j2151j46605K84868J09055
14530A978601k36744K03394J38010k42902L90887l71634M39321l73984M73602
14521B398551q5937P1665k17081P843j71790J00514J41593j35548J3491M72812
14511B596113j70014o559J52871J78426j86521K15049j15985R708M1515J32781
14501B847384j30776j28182K98183J1106r2834j0681L94476j82096p1978r3L66619
14490C301128j17153n9659L51410n4336l29599L92719R4434N5026l89249M39692
14480C684413l2961r904k30474L82064j80387L05344m25822L47997N3021o9702
14470C823589j03522K68344K6045K14783k34391K2320J35985K92227j43460J83291
$$ plain form
14460 4485211 4575160 4688684 4595238 5046711 4264435 4413575 5081808 5192831 4752755 4555101
14450 4555101 4813023 4905880 4868256 4871676 5349947 5126065 5348041 5041406 5291660 5359580
14440 5359580 5584386 5379013 5442513 5651731 5580146 5790374 5870051 5896660 5872191 6319334
14430 6319334 6102220 6602261 6351357 6715803 6681476 6463270 6812608 7243264 7032290 7062483
14420 7062483 7360129 7567299 7447030 7681479 7814657 7973303 8075530 7954813 8080870
14411 8080870 8369488 8329205 8553932 8374258 8674824 8865113 9041634 9048958 9254488 9380816
14401 9380816 9343586 9773812 10140235 9989060 10237065 10487779 10449800 10240667 10670785 10975866
14391 10975866 11298082 11437540 11424638 11545531 11991700 12551858 12649835 12439860 13089699 13280787
$$ packed form
14460D485211Q9949J13524r3446M51473p82276J49140O68233J11023m40076j97654
14450D555101K57922R2857l7624L420M78271k23882K21976l06635K50254O7920
14440E359580K24806k05373O3500K09218p1585K10228P9677K6609k4469M47143
14430F319334k17114N00041k50904L64446l4327k18206L49338M30656k10974L0193
14420G062483K97646K07170j20269K34449J33178J58646J02227j20717J26057
14411H080870K88618m0283K24727j79674L00566J90289J76521P324K05530J26328
14401I380816l7230M30226L66423j51175K48005K50714l7979k09133M30118L05081
14391A0975866L22216J39458j2902J20893M46169N60158R7977k09975O49839J91088
$$ plain form
14381 13280787 13496879 13861638 13950887 14620446 14873307 14880823 15110533 15332540 15352678 15765103
14371 15765103 15945244 16429044 17006173 17288209 17773839 17866592 18208789 18528184 19302150
14362 19302150 19629665 20222844 20315297 20856483 21137556 22066247 22360871 23076224 23439872
14353 23439872 23795750 24053789 24797485 25714626 26060783 27279774 27803216 28450899 29190232
14344 29190232 29736507 30830455 31404723 32416054 33273178 34147869 34865393 36590874 37226083
14335 37226083 38209327 39347189 40774246 41758287 43580379 44421891 45953834 47470825
14327 47470825 49051231 50832120 52401197 53896236 55710933 58272749 60115947 62098485
14319 62098485 64713416 67023042 69057823 71573120 74684805 77442743 80729288 84122334
$$ packed form
14381A3280787K16092L64759Q9249O69559K52861P516K29710K22007K0138M12425
14371A5765103J80141M83800N77129K82036M85630R2753L42197L19395P73966
14362A9302150L27515N93179R2453N41186K81073R28691K94624P15353L63648
14353B3439872L55878K58039P43696R17141L46157J218991N23442O47683P39333
14344B9190232N46275J093948N74268J011331Q57124Q74691P17524J725481O35209
14335C7226083R83244J137862J427057R84041J822092Q41512J531943J516991
14327D7470825J580406J780889J569077J495039J814697K561816J843198J982538
14319F2098485K614931K309626K034781K515297L111685K757938L286545L393046
$$ plain form
14311 84122334 87315668 90897371 94694292 98716789 103350628 107634283 112623148 117541356
14303 117541356 122964431 128918032 135039366 141622871 148555016 155980497 163512799 171813424
14295 171813424 180222241 189730607 199294793 209654978 220316805 231907024 243812362
14288 243812362 256388752 269217003 283002783 296912773 311192043 325702948 340555460
14281 340555460 355078062 369071816 383258077 396536790 408702353 419848840 429221309
14274 429221309 436354439 440017232 440305550 439964278 439822376 437937333 432934476 426983925
14266 426983925 418538875 408361817 396249091 382860450 368234324 353235452 337823766
14259 337823766 322289703 307096868 292262192 277746412 263647913 250185924 238361001
$$ packed form
14311H4122334L193334L581703L796921M022497M633839M283655M988865M918208
14303A17541356N423075N953601O121334O583505O932145P425481P532302Q300625
14295A71813424Q408817R508366R564186J0360185J0661827J1590219J1905338
14288B43812362J2576390J2828251J3785780J3909990J4279270J4510905J4852512
14281C40555460J4522602J3993754J4186261J3278713J2165563J1146487R372469
14274D29221309P133130L662793K88318l41272j41902j885043n002857n950551
14266D26983925q445050j0177058j2112726j3388641j4626126j4998872j5411686
14259C37823766j5534063j5192835j4834676j4515780j4098499j3461989j1824923
$$ plain form
14252 238361001 226746499 214537054 203869382 193575709 183521370 174299968 165878511
14245 165878511 157804875 150258341 143238635 136518169 129943215 123659832 118320863 113204212
14237 113204212 108479792 103522552 98897270 94555212 90812702 87260528 83908568 80556264
14229 80556264 77329395 74334067 71506744 68822893 66040692 63910059 61635897 59482985
14221 59482985 57131401 55618793 53583033 51860476 50118662 48256461 46851661 45874464
14213 45874464 44131101 42855615 41565314 40130392 39089589 38145543 36948284 36019993
14205 36019993 34946821 34133630 33017107 32185437 31006049 30817230 29817779 29031021 27769296
14196 27769296 27532049 26948876 26011813 25803736 24708326 24580754 23766021 23148711 22613351
$$ packed form
14252B38361001j1614502j2209445j0667672j0293673j0054339r221402q421457
14245A65878511q073636p546534p019706o720466o574954o283383n338969n116651
14237A13204212m724420m957240m625282m342058l742510l552174l351960l352304
14229H0556264l226869k995328k827323k683851k782201k130633k274162k152912
14221E9482985k351584j512608k035760j722557j741814j862201j404800r77197
14213D5874464j743363j275486j290301j434922j040803r44046j197259r28291
14205C6019993j073172q13191j116523q31670j179388j88819r99451p86758j261725
14196B7769296k37247n83173r37063k08077j095410j27572q14733o17310n35360
$$ plain form
14187 22613351 21848701 21428040 21070462 20566391 20401866 19661435 19422871 18701615 18417051
14178 18417051 18216556 18001234 17451852 16968958 16639331 16041319 15998737 15692226 15434755
14169 15434755 14898127 15038756 14623183 14648347 14226085 14168101 13389437 13403820 13268953 13011140
14159 13011140 12497487 12467697 12206140 11903281 11891224 11695270 11411488 11310881 11210824 11144615
14149 11144615 10228251 10635042 10452892 10329283 10050956 9988176 9813805 9608180 9467711
14140 9467711 9258291 8983147 9006015 8802672 8789667 8727069 8301397 8250075 8174289 8067161
14130 8067161 7874241 7818040 8005643 7614230 7885520 7338364 7214366 7322390 7340496 7238677
14120 7238677 7047628 6974173 6770663 6784209 6607105 6514033 6497957 6256141 6404851 6245268
$$ packed form
14187B2613351p64650m20661l57578n04071j64525p40431k38564p21256k84564
14178A8417051k00495k15322n49382m82894l29627n98012m2582l06511k57471
14169A5434755n36628J40629m15573K5164m22262n7984p78664J4383j34867k57813
14159A3011140n13653k9790k61557l02859j2057j95954k83782j00607j00057o6209
14149A1144615r16364M06791j82150j23609k78327o2780j74371k05625j40469
14140I467711k09420k75144K2868k03343j3005o2598m25672n1322p5786j07128
14130H067161j92920n6201J87603l91413K71290n47156j23998J08024J8106j01819
14120G238677j91049p3455k03510J3546j77104r3072j6076k41816J48710j59583
$$ plain form
14110 6245268 6195805 6113377 6240692 6011191 5956587 5763285 5590954 5609273 5581478 5355348
14100 5355348 5822434 5379022 5493301 5280482 5041655 5159584 4956406 5211779 4930245
14091 4930245 4765156 5097638 4645590 4781126 4580592 4749347 4848807 4383067 4359362 4514610
14081 4514610 3789698 4294591 4473114 4611105 3959988 4242959 3950815 4288330 4154975
14072 4154975 3967613 3970173 3774345 3830740 3680390 3923362 3852875 3838109 3379266 3370556 3304141
14061 3304141 3401306 3713544 3512957 3370339 3350493 3354619 3261810 3069811 3144035 3165593 3067866
14050 3067866 3268275 3247041 3351679 2996418 3245343 3245620 3053652 3113654 2780528 3064136
14040 3064136 2968479 3066174 3064176 2985531 2812990 3095159 2864837 3192881 2911474 3260460
$$ packed form
14110F245268m9463q2428J27315k29501n4604j93302j72331J8319k7795k26130
14100E355348M67086m43412J14279k12819k38827J17929k03178K55373k81534
14091D930245j65089L32482m52048J35536k00534J68755R9460m65740k3705J55248
14081D514610p24912N04893J78523J37991o51117K82971k92144L37515j33355
14072D154975j87362K560j95828N6395j50350K42972p0487j4766m58843q710o6415
14061C304141R7165L12238k00587j42618j9846M126r2809j91999P4224K1558r7727
14050C067866K00409k1234J04638l55261K48925K77j91968O0002l33126K83608
14040C064136r5657R7695j998p8645j72541K82169k30322L28044k81407L48986
$$ plain form
14030 3260460 3132753 2827552 2701914 2765315 2899808 2555280 2611087 2532235 2763864 2648541
14020 2648541 2561581 2544395 2373814 2639521 2247330 2553632 2414338 2482583 2386799 2461024
14010 2461024 2296200 2235459 2089780 2563445 2166959 2261701 2168442 2210736 2295421 2015551
14000 2015551 1963111 2041801 2083601 2036280 2150184 1997146 2176751 2034531 2345252 2376787
13990 2376787 3037578 4602927 7512676 14242560 30933032 38812277 21623118 11417845
13982 11417845 7508447 5378081 4536862 3678581 3190737 3033756 2773423 2801787 2688199
13973 2688199 2314018 2624787 2422796 2248533 2316153 2245746 2139189 1851161 2076444 2070556
13963 2070556 1905222 1707652 1957490 2020079 2093611 1752122 1676653 1740053 1587252 1883131
$$ packed form
14030C260460j27707l05201j25638O3401J34493l44528N5807p8852K31629j15323
14020B648541q6960j7186j70581K65707l92191L06302j39294O8245r5784P4225
14010B461024j64824o0741j45679M73665l96486R4742r3259M2294Q4685k79870
14000B015551n2440P8690M1800m7321J13904j53038J79605j42220L10721L1535
13990B376787O60791J565349K909749O729884J6690472P879245j7189159j0205273
13982A1417845l909398k130366q41219q58281m87844j56981k60333K8364j13588
13973B688199l74181L10769k01991j74263O7620p0407j06557k88028K25283n888
13963B070556j65334j97570K49838O2589P3532l41489p5469O3400j52801K95879
$$ plain form
13953 1883131 1885443 2001510 1803209 1948542 1632605 1791364 1748560 1548303 1558790 1499970
13943 1499970 1484968 1748148 1629240 1610249 1675036 1868273 1455211 1725747 1482234 1786837
13933 1786837 1806549 1437389 1624605 1772988 1475102 1496471 1659069 1654274 1363721 1665226
13923 1665226 1371721 1322967 1488041 1409381 1348237 1583217 1480771 1353843 1374365 1213050
13913 1213050 1106375 1466246 1470643 1276873 1081011 1133402 1127063 1374980 1151682 1514878
13903 1514878 1144719 1519098 1165579 1119463 1161312 1236017 948581 1099189 1283295 1641071
13893 1641071 879944 911700 1600326 1228306 1234023 1104706 1281173 1276547 971143 909947
13883 909947 1297226 1056943 936814 1097609 1012919 1294491 890323 717648 1240532 1084425
$$ packed form
13953A883131K312J16067j98301J45333l15937J58759m2804k00257J0487n8820
13943A499970j5002K63180j18908j8991O4787J93237m13062K70536k43513L04603
13933A786837J9712l69160J87216J48383k97886K1369J62598m795k90553L01505
13923A665226k93505m8754J65074p8660o1144K34980j02446j26928K0522j61315
13913A213050j06675L59871M397j93770j95862N2391o339K47917k23298L63196
13903A514878l70159L74379l53519m6116M1849P4705k87436J50608J84106L57776
13893A641071p61127L1756O88626l72020N717j29317J76467m626l05404o1196
13883I09947L87279k40283j20129J60795q4690K81572m04168j72675N22884j56107
$$ plain form
13873 1084425 1054052 1057990 1134300 1407966 1205554 939686 988663 1215091 996383 1107206
13863 1107206 1051640 900828 1066390 928551 977045 883195 1106265 1005711 565083 782128
13853 782128 1107028 1175651 778649 949328 961885 1030919 909997 1093306 887976 523694
13843 523694 992971 1105869 884177 835627 542039 783931 788958 836395 897369 1116465
13833 1116465 891879 726921 579510 795526 1181261 566804 527602 884475 886627 716524
13823 716524 981076 956041 866278 949673 847329 786227 693835 736264 562196 1009447 782652
13812 782652 570794 405621 567673 674541 648756 905915 1174453 575710 623762 356671
13802 356671 827560 664921 779399 539286 908407 758066 525941 630122 673484 704429
$$ packed form
13873A084425l0373L938P6310K73666k02412k65868M8977K26428k18708J10823
13863A107206n5566j50812J65562j37839M8494r3850K23070j00554m40628K17045
13853G82128L24900O8623l97002J70679J2557O9034j20922J83309k05330l64282
13843E23694M69277J12898k21692m8550k93588K41892N027M7437O0974K19096
13833A116465k24586j64958j47411K16016L85735E66804l9202L56873K152j70103
13823G16524K64552k5035q9763Q3395j02344o1102r2392M2429j74068M47251k26795
13812G82652k11858j65173J62052J06868k5785K57159K68538E75710M8052k67091
13802C56671M70889j62639J14478k40113L69121j50341k32125J04181M3362L0945
$$ plain form
13792 704429 891466 804316 881714 454934 722096 701537 927398 701232 815489 585367
13782 585367 783089 709331 341311 682704 511736 844648 656720 409715 370855 947768
13772 947768 565096 624240 429005 481119 400148 565579 606272 856750 185206 494711
13762 494711 686365 536188 552635 722731 669670 465041 514509 658927 522524 631811
13752 631811 739991 437379 418065 544505 626125 591136 526340 638379 423918 800268
13742 800268 477557 442568 561939 136245 558965 744039 651408 618790 478900 656246
13732 656246 794215 764891 640213 615042 352471 632686 313318 525927 758840 624748
13722 624748 653634 523231 692751 211446 717532 371311 618723 605809 435663 349582
$$ packed form
13792G04429J87037q7150P7398m26780K67162k0559K25861k26166J14257k30122
13782E85367J97722p3758C41311L41393j70968L32912j87928k47005l8860N76913
13772I47768l82672N9144j95235N2114q0971J65431M0693K50478A85206L09505
13762D94711J91654j50177J6447J70096n3061k04629M9468J44418j36403J09287
13752F31811J08180l02612j9314J26440Q1620l4989o4796J12039k14461L76350
13742H00268l22711l4989J19371A36245M22720J85074r2631l2618j39890J77346
13732F56246J37969k9324j24678k5171k62571K80215C13318K12609K32913j34092
13722F24748K8886j30403J69520B11446N06086l46221K47412j2914j70146q6081
$$ plain form
13712 349582 796493 411744 464342 328176 480199 509985 441711 536272 365779 558192
13702 558192 458712 323944 512903 235103 620514 586005 528060 229431 585666 489601
13692 489601 128604 349172 491933 279556 476471 440619 385424 498481 537598 611465
13682 611465 177505 625874 555117 131502 361980 262292 826130 258221 253064 566734
13672 566734 512213 711234 305840 449710 265098 97617 432279 651851 673067 624517
13662 624517 263375 -157314 389401 528938 308621 479418 733280 604952 210063 387408
13652 387408 321470 117025 154460 105999 426286 133766 668829 344757 598342 529216
13642 529216 258411 608916 168074 334742 344429 286670 236058 478541 513201 383997
$$ packed form
13712C49582M46911l84749N2598j36166J52023K9786o8274R4561j70493J92413
13702E58192r9480j34768J88959B35103L85411l4509n7945B29431L56235r6065
13692D89601A28604K20568J42761k12377J96915l5852n5195J13057L9117P3867
13682F11465A77505M48369p0757A31502K30478r9688N63838B58221n157L13670
13672E66734n4521J99021C05840J43870j84612I7617L34662K19572K1216m8550
13662F24517B63375a57314C89401J39537k20317J70797K53862j28328B10063J77345
13652C87408o5938A17025L7435m8461L20287A33766N35063l24072K53585o9126
13642E29216B58411L50505A68074J66668R687n7759n0612K42483L4660j29204
$$ plain form
13632 383997 505384 625520 635387 301060 365799 690816 225563 40779 329988 500002
13622 500002 334659 368197 438834 496664 367085 231125 119624 347986 665489 578183
13612 578183 200543 466633 530431 357534 554080 215769 249518 395775 355902 465132
13602 465132 425476 249144 277601 362656 316969 75819 -21420 138014 284260 433354 404224
13591 404224 293174 38040 115007 82152 684326 131408 65670 278302 146198 363467
13581 363467 297915 445638 169045 -24009 -3112 188223 755064 274473 319481 384953 221070
13570 221070 216687 59925 293523 591394 402723 393846 199295 224038 260473 213401 584266
13559 584266 270795 343220 216030 193055 361030 361271 628606 270571 403604 498123 318568
$$ packed form
13632C83997J21387J20136R867C01060O4739L25017B25563D0779K89209J70014
13622E00002j65343L3538P0637N7830j29579j35960j11501K28362L17503q7306
13612E78183B00543K66090O3798j72897J96546B15769L3749J46257l9873J09230
13602D65132l9656j76332K8457Q5055m5687G5819b1420A38014J46246J49094k9130
13591D04224j11050C8040P6967l2855O02174A31408F5670K12632j32104K17269
13581C63467o5552J47723A69045b4009c112A88223N66841B74473M5008O5472j63883
13570B21070m383E9925K33598K97871j88671q877j94551K4743L6435m7072L70865
13559E84266B70795P2425j27190k2975J67975K41K67335B70571J33033R4519j79555
$$ plain form
13548 318568 211090 291418 414293 430765 137131 208882 373414 268135 192845 215794
13538 215794 154534 124977 319196 586937 175005 398205 416604 289863 106068 234868
13528 234868 396900 112497 338462 60443 561466 944 196197 -44680 -129160 265843 215837
13517 215837 110875 176812 232874 455561 123317 -5756 394746 -40712 189314 -121473
13506 204492 187110 172913 324234 158814 94659 396349 709422 264372 102938 157511
13496 157511 400657 186296 -178683 228623 391569 166095 51420 196867 76975 -13569
13485 293935 93330 325689 205770 427569 -11698 208932 547694 -8258 490701 6591 357371
13474 357371 -148605 -42607 376015 394435 88732 580785 296304 153125 597762 144487
$$ packed form
13548C18568j07478Q0328J22875J6472A37131P1751J64532j05279p5290K2949
13538B15794o1260k9557J94219K67741A75005K23200J8399j26741A06068J28800
13528B34868J62032A12497K25965F0443N01023I44J95253d4680q4480B65843n0006
13517B15837j04962O5937N6062K22687A23317e756C94746d0712A89314a21473
13506B04492j7382j4197J51321A58814o4155L01690L13073B64372A02938N4573
13496A57511K43146A86296a78683B28623J62946A66095E1420J45447G6975a3569
13485B93935I3330K32359j19919K21799a1698B08932L38762h258D90701F591L50780
13474C57371a48605d2607C76015J8420H8732M92053k84481j43179M44637A44487
$$ plain form
13463 306626 167054 194298 101327 336145 247522 305358 219377 242550 82468 113894 313277
13452 313277 -40276 256825 -103631 61734 63065 239735 123967 251202 227973 99782 56050
13441 56050 412097 374399 611548 -66312 90918 414435 -46147 120287 146503 -106955 239671
13429 83602 -26917 35048 88021 -30082 248965 -72481 -78566 308513 517668 157343 231488
13418 231488 190290 629672 162688 421289 -59139 154500 203174 258890 314816 -40634 137247
13406 199572 280939 181117 271313 231480 -13909 182211 -418504 124153 -20775 111672 -105187
13394 31651 31375 -47702 -162846 140271 239955 211000 -140013 383176 -82636 181328 290813
13383 290813 -116178 397946 341024 163759 37973 375564 -92711 174771 3675 53235 -60087
$$ packed form
13463C06626j39572K7244r2971K34818q8623N7836q5981K3173H2468L1426J99383
13452C13277d0276B56825a03631F1734J331J76670j15768J27235k3229I9782m3732
13441E6050L56047l7698K37149f6312I0918L23517d6147A20287K6216a06955B39671
13429H3602b6917C5048N2973c0082B48965g2481o085C08513K09155A57343P4145
13418B31488m1198M39382A62688K58601e9139A54500M8674N5716N5926d0634A37247
13406A99572Q1367r9822R0196l9833a3909A82211d18504A24153b0775A11672a05187
13394C1651k76d7702j15144A40271R9684k8955a40013C83176h2636A81328J09485
13383B90813a16178C97946n6922A63759C7973L37591i2711A74771C675M9560f0087
$$ plain form
13371 85016 555635 32155 160192 167624 215394 456469 179919 290012 184137 303918
13361 303918 298868 157251 175736 19654 62658 102326 215168 321692 171621 132795 -19266
13349 401870 352459 278360 427336 103683 253458 382610 386167 350347 10507 168343 227738
13338 227738 192094 300866 244686 59801 89398 1617 134775 -124310 265572 193582 276856
13327 276856 64819 83930 177655 80930 450745 14066 125050 383930 49641 330817 641898
13316 641898 88733 22922 76638 275080 355655 181553 156678 134666 439280 242446 139155
13305 139155 24926 146544 141881 159951 53821 95291 120925 223833 17444 410075 -90295
13293 78223 75894 -219148 58304 83328 -57924 -187029 326291 420354 -23703 86356 574938
$$ packed form
13371H5016M70619C2155J28037P432M7770K41075A79919J10093j05875J19781
13361C03918n050j41617J8485A9654M3004L9668J12842J06524j50071l8826a9266
13349D01870m9411p4099J48976A03683J49775J29152L557l5820A0507J57836N9395
13338B27738l5644J08772n6180E9801K9597A617J33158a24310B65572p1990Q3274
13327B76856F4819J9111R3725H0930L69815A4066J10984K58880D9641K81176L11081
13316F41898H8733B2922N3716J98442Q0575j74102k4875k2012L04614j96834j03291
13305A39155B4926J21618m663J8070E3821M1470K5634J02908A7444L92631i0295
13293G8223k329b19148E8304K5024e7924j29105C26291R4063b3703H6356M88582
$$ plain form
13282 574938 21256 147902 207472 218207 -106224 229238 -135485 81832 89970 -163017 -13272
13270 167045 -161749 26102 -2140 374947 242433 -99523 497653 -53357 276682 -88066 215221
13258 89310 264472 138073 163857 -47415 191945 -1923 31219 -92871 211851 -104450 221514
13246 233007 169783 -16209 -51052 224270 73910 73980 -194979 188454 190667 -96743 136918
13234 -96687 202111 37338 449991 251282 227603 226181 44706 73390 171973 83628 262530
13223 262530 126092 -16603 -17924 -13519 -25580 147417 129690 1770 -25295 -171002 -249636
13212 -249636 -10618 124157 -26833 -162068 117657 380326 -194931 285325 38196 169529
13202 169529 205959 87644 268393 317787 29722 -257009 164294 -124056 -84764 19806 184765
$$ packed form
13282E74938B1256J26646N9570J0735a06224B29238a35485H1832Q138a63017a3272
13270A67045a61749B6102b140C74947j32514i9523D97653e3357B76682h8066B15221
13258H9310J75162j26399K5784d7415A91945a923C1219i2871B11851a04450B21514
13246B33007o3224a6209l4843B24270G3910P0a94979A88454K213i6743A36918
13234i6687B02111C7338M12653j98709k3679j422D4706K8684R8583H3628J78902
13223B62530A26092a6603j321M405j2061A47417j7727A770b5295j45707p8634
13212b49636a0618A24157b6833j35235A17657K62669a94931B85325C8196J31333
13202A69529L6430H7644J80749M9394B9722b57009A64294a24056L9292A9806J64959
$$ plain form
13191 184765 316179 268163 233745 -319888 -2002 15211 278201 -28048 118674 -196210 144675
13179 97371 326629 159718 -41698 -91146 -34420 -18958 70501 167612 -57369 -31033 41984
13167 65909 2202 182461 -163862 -103026 184499 285723 -368679 349448 45453 -81711 295529
13155 1672 156485 246175 207792 192082 55069 -141364 243281 111610 55286 -79731 240188
13143 141038 105453 -121266 210416 -30124 59534 -36788 -237157 113995 -103897 283369
13132 180803 -241125 299048 64527 151561 144087 -115282 99530 97819 239455 -67838 128112
13120 99924 45513 99767 284728 -26392 -237467 274261 16587 -109825 -85309 142259 54078
13108 302294 164506 471485 19668 -8375 -220391 263552 -13933 121351 332008 -128265
$$ packed form
13191A84765J31414m8016l4418c19888b002A5211K62990b8048A18674a96210A44675
13179I7371K29258A59718d1698m9448c4420J5462G0501R7111e7369K6336D1984
13167F5909B202J80259a63862O0836A84499J01224c68679C49448D5453h1711B95529
13155A672J54813Q9690l8383j5710E5069a41364B43281A11610E5286g9731B40188
13143A41038l5585a21266B10416c0124E9534c6788k00369A13995a03897B83369
13132A80803b41125B99048F4527Q7034p474a15282I9530j711J41636f7838A28112
13120I9924D5513N4254J84961b6392k11075B74261A6587a09825K4516A42259E4078
13108C02294j37788L06979A9668h375k12016B63552a3933A21351K10657a28265
$$ plain form
13097 -42291 -255102 64237 -170827 127335 -13729 75910 -174181 161311 -179608 -168427
13087 -168427 116744 337218 321532 -144471 388872 183008 201287 -166863 76033 76100 125067
13076 125067 91470 -224682 7027 112862 -70047 -81587 90955 3048 204407 201235 -22659
13064 12785 -23884 135030 -206891 -213718 56351 567060 63226 451934 77647 222796 -212433
13052 57888 115279 -387052 -63488 -156788 247724 15150 56000 50813 143153 244071 94500
13040 -47798 323866 331159 -17479 -703 -51198 279350 80188 -189788 88139 100731 -94433 127144
13027 42435 271971 -136598 202182 -190296 131031 109261 61906 5089 41376 75499 -181354
13015 74125 32641 122562 -167012 257111 226586 205113 141768 318189 52192 8098 7071
$$ packed form
13097d2291k12811F4237a70827A27335a3729G5910a74181A61311a79608J1181
13087a68427A16744K20474j5686a44471C88872A83008J8279a66863G6033O7M8967
13076A25067l3597b24682G027J05835g0047j1540I0955C048K01359l172b2659
13064A2785b3884A35030b06891o827E6351N10709F3226L88708G7647J45149b12433
13052E7888N7391c87052f3488r3300B47724A5150M0850n187R2340J00918I4500
13040d7798C23866P293a7479g03n0495B79350H0188a89788H8139J2592i4433A27144
13027D2435K29536a36598B02182a90296A31031k1770m7355E089L6287L4123a81354
13015G4125C2641Q9921a67012B57111l0525k1473o3345J76421E2192H098j027
$$ plain form
13004 7071 -152209 108390 -56376 -128267 -89476 -75893 -25605 -85297 148833 -162235 -258831
12993 -258831 -95347 256234 -130150 275754 355528 -3333 180379 -64209 471645 -259480
12982 -28641 115872 113620 27259 -45059 -175794 -62571 -8659 16196 -383874 147124 35451
12970 -100093 -71231 355551 -414389 -34503 290282 84583 89019 280368 48449 -312872 -105276
12958 51158 -41714 97400 -123636 1580 -13168 26720 427012 455175 -155967 -43809 -53975
12947 -53975 231054 -99457 -37222 -115500 300761 -35559 93068 8975 -252286 255761 -67979
12935 319687 -7628 188748 38723 325901 244405 5904 -52781 251660 21731 24654 74500
12924 74500 196058 185420 -259900 -111110 -378952 -57758 493793 144891 -4376 262211
$$ packed form
13004G071a52209A08390e6376p1891L8791J3583b5605n9692A48833a62235r6596
12993b58831i5347B56234a30150B75754P9774c333A80379f4209D71645b59480
12982b8641A15872k252B7259d5059j30735f2571h659A6196c83874A47124C5451
12970a00093K8862C55551d14389c4503B90282H4583M436J91349D8449c12872a05276
12958E1158d1714I7400a23636A580a3168B6720M00292K8163a55967d3809j0166
12947e3975B31054i9457c7222p8278C00761c5559I3068H975b52286B55761f7979
12935C19687g628A88748C8723K87178q1496E904e2781B51660B1731K923M9846
12924G4500J21558j0638b59900a11110k67842e7758D93793A44891d376B62211
$$ plain form
12913 360737 4589 -407285 62202 -237819 -53729 -132214 -76416 -226890 -252431 350501 30213
12901 64694 169186 -80754 -140587 96799 -102372 6357 87242 -83666 92142 282356 -47223
12889 21961 -257560 -49733 290165 -11894 -136870 61744 26131 -117425 -120144 -21034 128403
12877 6950 150059 150332 -40864 180203 85563 -134300 149501 -45007 192998 -14285 143016
12865 -245774 -171858 3607 189398 -76256 28798 146118 -67938 281986 -61847 62671 68853
12854 68853 -214986 52699 201092 -7816 -118890 -21723 -26696 259772 -70495 -126249 143129
12842 -78147 -24789 -33695 12485 98840 267817 -259197 -71396 -116407 111632 330 128703
12831 128703 161033 32417 -170742 126957 -65843 49375 -372983 -194337 137082 -204811
$$ packed form
12913C60737D589d07285F2202b37819e3729p8485N5798j50474k5541C50501C0213
12901F4694J04492h0754n9833I6799a02372F357Q0885h3666I2142J90214d7223
12889B1961b57560d9733B90165a1894j24976F1744B6131a17425k719b1034A28403
12877F950J43109K73d0864A80203H5563a34300A49501d5007A92998a4285A43016
12865b45774P3916C607J85791g6256B8798J17320f7938B81986f1847F2671O182
12854F8853b14986E2699J48393g816j11074b1723m973B59772g0495n5754A43129
12842g8147b4789q906A2485Q6355J68977b59197g1396m5011A11632C30J28373
12831A28703L2330C2417a70742A26957f5843D9375c72983J78646A37082b04811
$$ plain form
12820 71028 158733 -215921 32183 -12880 -85246 110512 46805 -241236 -27795 51194 98150
12809 98150 221537 107249 -35262 -46965 43717 303122 -90377 244827 68053 -43672 4629
12797 199351 225677 -188734 -88078 -74180 -223489 -30521 -474 13375 -258643 108305 -21838
12785 -328657 -18896 14887 124833 -166984 91863 -388620 -171438 -184463 -165103 68648 53935
12774 53935 76961 83924 -119886 84545 -32966 -27432 -82518 -109839 -141686 263290 -162583
12762 144829 -104369 82835 -159830 -170213 216015 -175146 -215196 389298 191189 111625
12752 111625 -146967 162305 -69193 -4629 -5065 303194 -202142 141060 120763 54368 75600
12741 75600 -90589 127178 77312 48366 76438 -262531 348161 -28101 110152 480826 40227
$$ packed form
12820G1028Q7705b15921C2183a2880p2366A10512D6805b41236b7795E1194M6956
12809I8150J23387A07249c5262j1703D3717K59405i0377B44827F8053d3672D629
12797A99351K6326a88734h8078J3898j49309c0521d74A3375b58643A08305b1838
12785c28657a8896A4887J09946a66984I1863c88620a71438j3025J9360F8648j4713
12774E3935K3026O963a19886H4545c2966N534n5086k7321l1847B63290a62583
12762A44829a04369H2835a59830j0383B16015a75146m0050C89298A91189p9564
12752A11625a46967A62305f9193d629m36C03194b02142A41060k0297E4368K1232
12741G5600i0589A27178m9866k8946K8072b62531C48161b8101A10152L70674D0227
$$ plain form
12729 -82082 212662 111005 198071 -15377 -455983 94592 206448 -413902 46749 314936
12719 314936 168074 104161 -57942 122096 38527 77162 103709 -50530 -192 37572 103949
12708 103949 419186 417477 261268 20194 125873 291925 161122 -30940 28685 335167
12698 335167 217205 -64165 -1656 42454 -35205 99825 -133558 -248552 -146637 -218719 -270581
12687 -270581 -53913 -53117 37593 318982 -48026 79534 77110 -133815 -163956 -238171 73651 -33951
12674 113267 26030 -482206 -99207 244274 221477 93935 -67737 193998 324710 38832 407956
12663 407956 124162 541131 251950 -146666 370562 178365 -1028 -198580 226734 -91760
12652 -255149 271337 77482 27967 -249867 341980 -286379 103078 -241323 -72987 248948
$$ packed form
12729h2082B12662j01657Q7066a5377m40606I4592J11856d13902D6749K68187
12719C14936j46862o3913e7942A22096C8527L8635K6547e0530a92C7572O6377
12708A03949L15237j709j56209B0194J05679J66052j30803c0940B8685L06482
12698C35167j17962f4165a656D2454c5205I9825a33558j14994J01915p2082n1862
12687b70581e3913P96C7593K81389d8026G9534k424a33815l0141p4215G3651c3951
12674A13267B6030d82206i9207B44274k2797I3935f7737A93998J30712C8832L69124
12663D07956A24162M16969B51950a46666C70562A78365a028j97552B26734i1760
12652b55149B71337G7482B7967b49867C41980b86379A03078b41323g2987B48948
$$ plain form
12641 -109717 189017 470872 205308 78943 48300 -35269 248919 -73678 149576 -28767
12630 138038 -79744 188714 384361 -58209 86706 157264 37338 -30609 340940 -70187 -141825
12619 -141825 -210746 -22802 -6474 168003 -103951 -112308 -153768 121980 232751 -40949 -26667
12608 -26667 -127213 -47722 -23341 -22756 123710 -48171 -39141 -368550 -47028 124527 -15111
12596 73846 -137405 -169407 66732 27640 -9564 -80390 17935 88747 46480 -94767 40604 46885
12584 46885 2269 -14060 15202 98823 101784 71176 -62906 -23974 -20876 93489 -67008 383321
12571 103992 -85628 -300339 45453 162728 -12791 -430201 61967 -133682 284415 -43752
12560 133903 -24543 29049 19183 98316 174399 -118139 107185 -12377 -59640 81530 218060
$$ packed form
12641a09717A89017K81855B05308G8943l0643c5269B48919g3678A49576b8767
12630A38038g9744A88714J95647e8209H6706P0558C7338c0609C40940g0187p1638
12619a41825o8921b2802f474A68003a03951q357m1460A21980J10771d0949J4282
12608b6667j00546d7722b3341N85A23710d8171R030l29409d7028A24527a5111
12596G3846a37405l2002F6732B7640i564p0826A7935P0812m2267i4767D0604O281
12584D6885B269a4060A5202Q3621K961l0608f2906b3974L098I3489f7008C83321
12571A03992h5628k14711D5453J17275a2791m17410F1967a33682B84415d3752
12560A33903b4543B9049r866P9133P6083a18139A07185a2377m7263H1530J36530
$$ plain form
12549 218060 139247 110483 19298 327419 5093 158288 -47272 -14824 171714 132825 13922
12537 131738 294708 -345951 -42514 146279 -196857 -79825 -197733 -203783 9834 153633 -264169
12525 -107384 28667 97824 1540 94948 261933 -52034 168767 414963 404152 256881 328870
12514 328870 -153449 172522 48106 105495 -121706 -59513 -99717 23657 -35136 -166710 23433
12502 -173541 882 -232385 -201410 75202 -61571 72133 -407844 149975 97236 201054 60014
12490 123692 172052 459032 -77839 129522 -187255 3376 4127 -208246 400211 -5674 -16005
12479 -16005 124842 -128960 297877 74641 10832 -215724 -134014 133445 41037 -101169
12468 -102777 -35486 716 127724 -209407 39744 -124646 109631 149615 112740 83143 9376
$$ packed form
12549B18060p8813k8764A9298L08121E093J53195d7272a4824A71714l8889A3922
12537A31738J62970c45951d2514A46279a96857g9825j17908o050I834J43799b64169
12525a07384B8667O9157A540R3408J66985e2034A68767K46196j0811j47271P1989
12514C28870a53449A72522D8106N7389a21706e9513m0204B3657c5136j31574B3433
12502a73541H82b32385L0975G5202f1571G2133d07844A49975n2739J03818F0014
12490A23692M8360K86980g7839A29522a87255C376P51b08246D00211e674j0331
12479a6005A24842a28960B97877G4641A0832b15724Q1710A33445D1037a01169
12468a02777c5486G16J27008b09407C9744a24646A09631L9984l6875k9597I376
$$ plain form
12456 -310756 -8828 335403 -53189 235668 -10313 189483 -67239 8147 145871 -186041 -3760
12444 125045 -142513 -426158 129491 -304872 -152200 -217217 -228287 -237336 -5008 136536 232499
12433 232499 -186689 -187157 72766 258279 194709 113126 -168588 336334 394114 153887 179641
12422 179641 -180314 158289 36981 9622 -86862 301709 -99752 229703 49211 -67264 99090
12410 -169376 330057 -123686 -4016 49903 31619 127752 -204396 -132497 210511 213773 -154484
12398 113361 248435 -268593 245234 -184790 157446 -11064 236254 69111 226862 -18266
12387 -95599 -30115 -216694 370474 219704 -91259 190407 -65650 -46022 22009 -136824 -33821
12375 -134646 -183626 199786 8636 168173 -186106 -141257 223175 -198256 277039 -4120 159694
$$ packed form
12456c10756h828C35403e3189B35668a0313A89483f7239H147J37724a86041c760
12444A25045a42513k83645A29491c04872a52200o5017j1070r049e008A36536R5963
12433B32499a86689m68G2766J85513o3570q1583a68588C36334N7780A53887K5754
12422A79641a80314A58289C6981I622h6862C01709i9752B29703D9211f7264I9090
12410a69376C30057a23686d016D9903j8284R6133b04396P1899B10511L262a54484
12398A13361J35074b68593B45234a84790A57446a1064B36254F9111J57751a8266
12387i5599c0115j86579C70474j50770i1259A90407f5650J9628B2009a36824c3821
12375a34646m8980A99786H636J59537a86106M4849B23175a98256B77039d120A59694
$$ plain form
12363 -54789 121120 -43994 -140068 17561 91686 -226072 163164 -5547 241352 -107197 87091
12351 -19474 61925 148805 -227 183393 49580 -132194 86226 -4030 -195672 191746 -57921
12339 213525 262962 -80749 39200 200229 131320 -18061 -100603 82312 -46165 87207 -60484
12327 -71509 237948 -105596 -16468 -103054 291817 71021 141031 40365 46639 23891 -103466
12315 -111491 -81311 131531 -240468 260613 -155352 209025 368265 -161800 275865 -508694
12304 -43755 -108704 -225332 65268 111832 37418 217531 39155 274639 125119 33239 176091
12293 176091 -173886 296916 219235 -128437 -169867 -156618 33100 195064 -6639 -56866 148562
12281 -134421 26999 -116778 303102 87837 34033 -148054 72957 52398 -216060 -101196
$$ packed form
12363e4789A21120d3994r6074A7561P4125b26072A63164e547B41352a07197H7091
12351a9474F1925Q6880b27A83393D9580a32194H6226d030j91642A91746e7921
12339B13525M9437h0749C9200J61029o8909a8061q2542H2312d6165H7207f0484
12327g1509B37948a05596a6468q6586B91817G1021P0010D0365O274k2748a03466
12315a11491L0180A31531b40468B60613a55352B09025J59240a61800B75865e08694
12304d3755o4949j16628F5268M6564C7418J80113C9155K35484A25119C3239J42852
12293A76091a73886B96916p7681a28437m1430J3249C3100J61964f639n0227A48562
12281a34421B6999a16778C03102H7837C4033a48054G2957k0559b16060a01196
$$ plain form
12270 -150793 126198 -50337 194992 97621 46933 -33945 87797 -51037 234783 -209136 191458
12258 -172010 -67384 151985 22257 77242 -85741 -80097 9758 178424 177036 -534 -204401 -10834
12245 54354 200020 293039 169314 291491 238172 -5183 -61889 63352 198919 95836 18099
12233 -69801 211208 69453 7723 -120369 55827 34020 218611 28767 34324 -169105 160850
12221 286713 235019 265763 262119 529913 167664 157728 101126 417284 89246 165392 198279
12210 198279 339500 31268 58237 190160 404292 179892 129945 -367543 207574 -36570
12199 87072 324176 65408 229633 203709 190037 361801 545699 154666 214501 211492 208189
12188 208189 216798 346198 252686 150943 -244180 118850 -314 -4356 145229 -71147 142014
$$ packed form
12270a50793A26198e0337A94992r7371D6933c3945H7797e1037B34783b09136A91458
12258a72010f7384A51985B2257N4985h5741N644I758J68666j388e34k03867a0834
12245E4354J45666R3019j23725J22177n3319e183n6706F3352J35567I5836A8099
12233f9801B11208F9453G723a20369E5827k1807J84591B8767N557a69105A60850
12221B86713n1694L0744l644K67794A67664r936n6602L16158H9246P6146L2887
12210A98279J41221C1268K6969J31923K14132A79892m9947c67543B07574c6570
12199H7072K37104F5408J64225k5924j3672J71764J83898A54666N9835l009l303
12188B08189Q609J29400r3512j01743b44180A18850c14m042A45229g1147A42014
$$ plain form
12176 188934 420865 -106307 232186 142542 124732 166929 414001 33440 281558 41288
12165 391921 44698 69571 141716 127303 -246134 -12282 -88538 7699 193127 726 275901
12154 275901 -50275 -89494 48871 231584 237207 218176 33217 286545 230297 -150859 139651
12142 135135 251229 70197 270578 63524 -52617 98293 243690 182272 195526 326352 126754
12130 323933 283565 385570 121083 -49967 138699 -126614 247803 199788 353821 398243
12120 398243 -134733 -148228 208601 116156 -177898 -153662 184025 284193 -135368 47545
12109 38240 300068 -122947 -146863 -223455 -12561 7650 115536 407829 209457 -116507 -32532
12097 -35087 241049 -23209 -112255 -222287 8212 40079 -42856 99917 176549 20870 -116772
$$ packed form
12176A88934K31931a06307B32186q9644j7810M2197K47072C3440K48118D1288
12165C91921D4698K4873P2145j4413b46134a2282p6256G699J85428G26K75175
12154B75901e0275l9219D8871J82713N623j9031C3217K53328n6248a50859A39651
12142A35135J16094G0197K00381F3524e2617I8293J45397o1418J3254J30826A26754
12130C23933m0368J02005A21083d9967A38699a26614B47803m8015J54033M4422
12120C98243a34733j3495B08601r2445a77898K4236A84025J00168a35368D7545
12109C8240K61828a22947k3916p6592a2561G650J07886K92293j98372a16507c2532
12097c5087B41049b3209q9046j10032H212L1867d2856I9917P6632B0870a16772
$$ plain form
12085 -186454 -63142 82403 21948 144408 -333815 136640 -275276 168130 157596 -38920
12074 90596 -165053 -156900 231948 -41287 223625 116124 54092 -1561 -72165 96161 79637
12063 79637 -121285 -341340 -195674 359804 -262785 -320252 -11304 -66327 -170387 -23385
12052 -254266 -46674 -82019 -154086 388 19749 60229 -178103 125264 202765 -30988 86848
12040 290713 -99570 -74279 460066 -121462 138114 204491 -316012 126939 72450 66524 199834
12029 199834 15269 56617 -158715 -168754 -45784 12485 -81925 -4003 -190730 -348 -69360 -1874
12016 -127973 121357 -93457 50712 272126 76306 -301278 -131565 -140994 98083 -113435 13131
12004 -40411 391757 -303137 127807 -110024 -90226 -146015 -22653 -46685 24032 -118801 24243
$$ packed form
12085a86454f3142H2403B1948J22460c33815A36640b75276A68130j0534c8920
12074I0596a65053Q153B31948d1287B23625j07501E4092a561p0604I6161j6524
12063G9637a21285k20055J45666C59804b62785n7467a1304n5023j04060b3385
12052b54266d6674l5345p2067C88J9361M0480a78103A25264P7501c0988H6848
12040B90713i9570K5291D60066a21462A38114O6377c16012A26939n4489n926J33310
12029A99834A5269M1348a58715j0039d5784A2485h1925d003j86727c48o9012a874
12016a27973A21357i3457E0712K21414G6306c01278a31565r429I8083a13435A3131
12004d0411C91757c03137A27807a10024J9798n5789b2653k4032B4032a18801B4243
$$ plain form
11992 -173561 -226893 -441143 -12040 -149813 -71696 -100380 -421822 -37064 -175034 39 -160607
11980 -20294 30954 50775 -205202 201030 -76314 -142313 -139726 105248 -84165 -149400 -134819
11969 -134819 -90656 -354883 -38662 43437 492063 -61158 -214631 184827 -102684 -59296
11959 -59296 -115503 -87929 199391 -46322 -20032 -171609 -217121 -117874 45775 235168 124426
11948 124426 76426 238478 7289 233107 -55013 -263986 18034 15889 335255 255817 -119853
11936 23603 -12647 -81335 210845 -19881 32319 165680 -230229 199943 15619 -28062 55067
11924 -106213 34259 -315312 -150315 102081 180185 -234397 100733 86789 170153 126358
11914 126358 -298714 -139301 -124007 71683 -85440 383900 -48388 -250883 -69239 238158
$$ packed form
11992a73561n3332k14250a2040j37773g1696k8684l21442c7064j37970C9a60607
11980b0294C0954J9821b05202B01030g6314o5999K587A05248h4165o5235J4581
11969a34819M4163k64227c8662D3437M48626f1158j53473A84827a02684M3388
11959e9296n6207K7574A99391d6322b0032j51577m5512R9247D5775J89393j10742
11948A24426m8000J62052G289K25818e5013k08973A8034k145L19366p9438a19853
11936B3603a2647o8688B10845a9881C2319J33361b30229A99943A5619b8062E5067
11924a06213C4259c15312a50315A02081P8104b34397A00733j3944Q3364m3795
11914A26358b98714a39301J5294G1683h5440C83900d8388k02495f9239B38158
$$ plain form
11903 265057 -61003 -91857 -203144 -213926 -62464 -85341 96451 18711 -309333 -240012 -26154
11891 218596 59447 101788 -226449 -290957 24459 214452 133406 231335 -75426 -32228 51549
11879 -8711 -148453 -234213 -60031 308112 127933 193942 35853 -268467 -21131 -19768 -256649
11868 -256649 80920 24113 -215943 -179009 -30235 84050 -137772 -160746 130843 -136051 -36485
11856 -113864 296259 -119935 -16621 28283 -81843 -317013 -41729 -32300 26828 19527 -397389
11844 -47618 -339710 -102755 64881 -144915 -144827 -129323 -105488 54722 -140611 -20468 -26160 -289066
11832 -289066 -286033 27609 69719 77169 -7433 89021 177358 97411 -39392 83477 94325 85313
11820 85313 -249640 -276822 164618 -17986 108394 12357 -39663 -215699 39873 258450 -3220
$$ packed form
11903B65057f1003l0854j11287j0782f2464k2877I6451A8711c09333O9321b6154
11891B18596E9447M2341b26449o4508B4459J89993q1046R7929g5426c2228E1549
11879h711j39742q5760f0031C08112A27933O6009C5853b68467b1131J363k36881
11868b56649H0920B4113b15943L6934c0235H4050a37772k2974A30843a36051c6485
11856a13864B96259a19935a6621B8283h1843k35170d1729R429B6828p301c97389
11844d7618k92092a02755F4881a44915Q8J5504K3835E4722a40611b0468n692k62906
11832b89066L033B7609M2110P450g433H9021Q8337p9947c9392H3477J0848r012
11820H5313b49640k7182A64618a7986A08394A2357c9663j76036C9873K18577c220
$$ plain form
11808 -164248 85385 35572 -432256 -52453 -20940 10151 39598 68798 155390 -161291 11804
11796 -143453 33778 101492 255907 27574 -20279 204781 -7505 172696 -199899 205908 -44466
11784 -295513 80786 -17858 65 227778 -131497 -310233 -79932 176909 12558 138446 -120685
11772 243618 107377 -237270 -14495 -28237 -49112 -142673 -55240 -8205 55409 -205103 -133006
11761 -133006 171329 -162970 135418 -51264 -148367 -118338 -58155 252393 -41821 74681 96574
11750 96574 180142 94720 -190688 117966 249610 55515 203563 326183 -43514 -162377
11740 -162377 69334 -126510 -97603 -6823 -22785 181139 70380 234458 -303386 -96651 37786
11728 226223 -16502 95411 -134342 129780 32581 -139751 -124442 -69150 113613 54592 2071
$$ packed form
11808a64248H5385C5572d32256e2453b0940A0151K9447K9200Q6592a61291A1804
11796a43453C3778O7714J54415B7574b0279B04781g505A72696a99899B05908d4466
11784b95513H0786a7858F5K27713a31497j78736g9932A76909A2558J25888a20685
11772B43618A07377b37270a4495j3742k0875r3561e5240h205E5409b05103P2097
11761a33006A71329a62970A35418e1264r7103L0029e8155B52393d1821G4681K1893
11750I6574Q3568q5422a90688A17966J31644E5515J48048J22620d3514j18863
11740a62377F9334a26510K8907f823j5962A81139G0380J64078c03386i6651C7786
11728B26223a6502I5411a34342A29780C2581a39751J5309N5292A13613E4592B071
$$ plain form
11716 151693 41462 34392 -104633 -52373 63223 131543 127138 -62656 26058 -168006 -39369
11704 112268 310051 -37137 -175409 326596 -155887 -36259 100059 -117179 -389982 -118398
11693 -289262 -237658 -102711 -286218 311968 -83264 -299355 -14172 104009 -46049 -31148
11683 -31148 184429 -280606 -133040 205776 -179640 37271 218111 -86226 85770 286632
11673 286632 -218782 -171991 72737 -230450 -58468 119604 -76658 -76909 -190878 114174 203095
11662 203095 155022 -19144 166454 145939 12836 4277 -272476 -267886 -63434 -67993 -84979 65832
11649 -405694 -65056 -179268 -356106 57685 -193253 -305752 54664 375853 -90093 273399
11638 152911 -41371 -127606 178284 -52452 -36657 82400 -146392 214526 -40682 -63429 11742
$$ packed form
11716A51693D1462p070a04633N2260F3223O8320m405f2656B6058a68006c9369
11704A12268J97783c7137j38272C26596a55887c6259A00059a17179k72803a18398
11693b89262N1604a02711j83507C11968h3264k16091a4172A04009d6049J4901
11683c1148A84429b80606a33040B05776a79640C7271J80840h6226H5770K00862
11673B86632b18782M6791G2737b30450e8468A19604g6658k51j13969A14174Q8921
11662B03095m8073a9144A66454k0515A2836D277b72476M590f3434m559j6986F5832
11649d05694f5056j14212j76838E7685a93253j12499E4664L21189i0093B73399
11638A52911d1371q6235A78284e2452J5795H2400a46392B14526d0682k2747A1742
$$ plain form
11626 -28036 -129334 386011 -128112 -235103 -74713 -192288 273538 31163 -89066 -101323
11616 -101323 68326 23454 257093 150337 146175 -136454 -221164 -168388 -160377 78452 -43578
11604 30373 -127846 -163640 -17946 128803 -8988 165597 -263335 162039 172022 -76804 1093
11592 181776 165884 -66510 -224312 17066 -127845 169264 77445 185634 -62758 218188
11581 245867 216092 -238443 -7338 95200 -49025 333488 49511 109987 141975 -96728 16689
11569 12399 -104600 481371 -12292 -116801 -124535 611 119957 24686 -98971 156368 355717
11558 355717 40059 -203794 47417 -15314 -184223 267821 -206265 182419 -8236 -62104 74973
11546 -96209 190597 42029 175117 -1007 -9868 76634 69081 129340 195060 -77478 -107582 186118
$$ packed form
11626b8036j01298C86011a28112j06991g4713j17575B73538C1163h9066j2257
11616a01323F8326B3454K33639j06756m162a36454q4710N2776Q011G8452d3578
11604C0373a27846l5794a7946A28803h988A65597b63335A62039R983g6804A093
11592A81776j5892f6510j57802A7066a27845A69264G7445J08189f2758B18188
11581B45867k9775b38443g338I5200d9025C33488D9511O0476L1988i6728A6689
11569A2399a04600D81371a2292j04509p734F11J19346B4686i8971A56368J99349
11558C55717D0059b03794D7417a5314j68909B67821b06265A82419h236n3868G4973
11546i6209A90597D2029J33088a007q861G6634p553O0259O5720g7478l0104A86118
$$ plain form
11533 24840 212886 -160776 262738 -66171 35314 -35891 255451 189754 237404 112377 138502
11522 138502 224011 153828 265516 19263 116809 232209 117730 18445 -22271 -197973 299980
11510 43718 108511 701443 226669 10566 295048 291205 -142384 283478 -105778 73289 -36629
11498 363622 -55778 -51838 43447 89126 314216 236336 194110 117529 420375 459821 484903
11487 484903 52892 131892 206431 -67629 66353 283345 186418 110457 107132 356906 289988
11476 289988 308473 2805 -101883 -69659 398978 307269 85139 -27819 35746 125256 191044
11465 191044 239272 58275 480372 5272 236224 546292 167051 -414212 112509 134408
11455 134408 198031 156321 128713 26175 -158205 288670 -103170 54776 182069 296212
$$ packed form
11533B4840J88046a60776B62738f6171C5314c5891B55451o5697M7650A12377K6125
11522A38502Q5509p0183J11688A9263R7546J15400j14479A8445b2271j75702B99980
11510D3718O4793N92932B26669A0566K84482l843a42384B83478a05778G3289c6629
11498C63622e5778L940D3447M5679K25090p7880m2226p6581L02846L9446K5082
11487D84903E2892P9000P4539f7629F6353K16992r6927p5961l325K49774o6918
11476B89988J8485B805a01883L2224C98978r1709H5139b7819C5746Q9510O5788
11465A91044M8228E8275M22097E272K30952L10068A67051d14212A12509K1899
11455A34408O3623m1710k7608B6175a58205B88670a03170E4776J27293J14143
$$ plain form
11445 296212 471113 232887 7154 -19552 180869 309979 349944 -41277 250529 66748 170295
11434 170295 136835 77737 173489 135540 -295685 139562 66661 16408 -248062 276352 271604
11423 271604 170002 -80551 98772 102344 246130 -138591 -108808 -120137 34907 -111576 50158
11411 25166 191247 25357 42990 -93510 125 -75605 174400 72397 -8778 79401 80742 335820
11399 335820 -68668 -156272 355370 -59575 -152805 -144283 32330 42282 10681 -15023 -92725 -56666
11387 -56666 -178287 -209030 -188216 57926 -147327 138406 -320326 -181272 -261740 71697 223207
11376 223207 123697 -234693 -12499 -112348 -84192 104345 -308877 43433 -238311 93697 130369
11365 130369 -93194 183035 -160258 -7462 -145345 222122 -92090 -198684 -152220 273651
$$ packed form
11445B96212J74901B32887G154a9552A80869J29110L9965d1277B50529F6748J03547
11434A70295l3460n9098R5752l7949b95685A39562F6661A6408b48062B76352m748
11423B71604j01602h0551I8772L572J43786a38591K9783j1329C4907a11576E0158
11411B5166J66081B5357J7633i3510A25g5605A74400G2397h778G9401J341K55078
11399C35820f8668q7604C55370e9575r3230Q522C2330R952A0681a5023p7702L6059
11387e6666j21621l0743K0814E7926a47327A38406c20326J39054q0468G1697J51510
11376B23207r9510b34693a2499r9849K8156A04345c08877D3433b38311I3697L6672
11365A30369i3194A83035a60258g462j37883B22122i2090j06594M6464B73651
$$ plain form
11354 -32578 -123736 -64196 183351 -326686 -132939 -78607 -222279 78435 -4470 -22498 -16123
11343 -16123 167583 -47669 156520 5474 69577 -14389 13970 -109543 -285538 54041 -72705
11331 178045 58104 21959 42409 -170735 234778 -172188 -41919 148708 53742 192443
11321 192443 -131561 -82109 9197 -310715 -70915 -160662 -156322 60061 -120894 13751 136246
11310 136246 428601 -19844 -128755 -10291 124859 21195 -293464 21439 111960 -155220
11299 -50560 127140 -170593 -150196 -44908 54236 27154 112746 268918 -21997 -260456 -124206
11287 -195978 -191510 120278 -240754 142923 79093 15753 -39987 -172388 -75073 -174335 -271493
11276 -271493 70158 -243437 -126526 188816 59998 1536 22971 102336 66513 -269367 -37670
$$ packed form
11354c2578r1158N9540A83351c26686a32939N4332j43672G8435d470j8028O375
11343a6123A67583d7669A56520E474O4103a4389A3970a09543j75995E4041g2705
11331A78045E8104B1959K0450a70735B34778a72188d1919A48708E3742J38701
11321A92443a31561M9452I197c10715g0915q9747M340F0061a20894A3751J22495
11310A36246K92355a9844j08911a0291A24859B1195b93464B1439R0521a55220
11299e0560A27140a70593K0397d4908E4236k7082Q5592J56172b1997k38459a24206
11287a95978M468A20278b40754A42923o3830A5753c9987j32401g5073r9262r7158
11276b71493G0158b43437J16911A88816E9998A536K1435P9365l5823b69367c7670
$$ plain form
11264 24336 -262929 31104 -147361 -125898 -368406 101748 -390626 -255615 167552 158872
11254 158872 88367 133583 -190695 -11645 -54291 89419 -300350 -40008 -104003 127078 -62885
11242 14341 10172 85516 95790 83676 156712 -17244 1127 -2530 -167347 295559 -32965 -249588
11230 -249588 -343271 302102 -21877 -235285 -86443 -55770 82875 -257204 -64018 30049 -49814
11218 -26780 30930 11896 92942 -5392 -97626 193132 -35980 -196174 -151219 4626 67838 109268
11206 109268 -161859 -73427 -327858 -164183 92940 -43964 -160710 16653 -190273 -196539 -140542
11195 -140542 -16178 -210655 14426 -101992 -18873 -140206 -241434 -195680 -211307 -250560 50914
11183 38003 32999 -167178 -260831 -345388 173673 -71212 -254122 -299984 -323713 -36990 -131581
$$ packed form
11264B4336b62929C1104a47361K1463k42508A01748c90626J35011A67552q680
11254A58872p0505M5216a90695a1645m2646H9419c00350d0008o3995A27078f2885
11242A4341m169P5344J0274j2114P3036a7244A127b530j64817B95559c2965k16623
11230b49588r3683C02102b1877k13408h6443L0673H2875b57204f4018C0049d9814
11218b6780C0930A1896Q1046e392r2234A93132c5980j60194M4955D626O3212M1430
11206A09268a61859g3427k54431J63675I2940d3964j16746A6653a90273o266N5997
11195a40542a6178j94477A4426a01992a8873j21333j01228M5754j5627l9253E0914
11183C8003n004a67178r3653q4557A73673g1212j82910m5862k3729c6990r4591
$$ plain form
11172 -131581 338672 8891 -260147 48887 138008 15833 36862 -35187 228004 -411200 -32813
11160 -81255 99436 -438887 -54740 -47000 89987 6627 124950 39446 97684 146433 82919 -10911
11147 331732 -29759 414616 -14598 32831 -84175 -3432 195247 288298 149916 -585989 -201502
11135 302974 -12736 -58465 284451 150719 -96591 -41344 213485 -157756 86125 -23404 -24049
11124 -24049 177085 36698 301059 320465 70256 57052 -115464 -48640 171266 53679 18246
11112 351118 -143846 377574 -10465 264646 -55592 235827 288740 358214 -23156 230348
11101 262363 180090 25618 169495 374743 117970 222436 449631 121690 397660 481266
11091 481266 104765 210801 402647 -115495 149927 285790 222079 363202 451373 309189
$$ packed form
11172a31581C38672H891b60147D8887Q9121A5833K1029c5187B28004d11200c2813
11160h1255I9436d38887e4740P740H9987F627J18323C9446N8238M8749o3514a0911
11147C31732b9759D14616a4598C2831h4175c432A95247R3051j38382e85989b01502
11135C02974a2736m5729B84451j33732i6591d1344B13485a57756H6125b3404o45
11124b4049A77085C6698K64361J9406G0256j3204a15464d8640A71266E3679A8246
11112C51118a43846C77574a0465B64646e5592B35827N2913O9474b3156B30348
11101B62363q2273B5618J43877K05248A17970J04466K27195A21690K75970Q3606
11091D81266A04765J06036J91846a15495A49927J35863o3711J41123Q8171j42184
$$ plain form
11081 309189 333070 403322 229430 -2368 472620 9237 215272 178780 455931 366106 321300
11070 321300 519545 558974 339793 528433 364638 232004 310106 578553 349393 497559
11060 497559 288681 353703 633899 447455 628782 845986 800478 948874 693427 564302
11050 564302 655986 1078910 952437 863351 739291 821281 903386 902219 1047915 1143484 782819
11039 782819 868661 1015811 861381 1029559 1021132 980347 959073 1138321 947630 921131 1048187
11028 1048187 707643 982700 827577 1199087 769514 717949 1063706 584248 880612 939497
11018 939497 816043 553397 959482 617113 952765 723654 700768 601350 649542 998520
11008 998520 834627 876340 815223 515336 1000377 545226 703183 685449 704121 663025
$$ packed form
11081C09189K3881P0252j73892b368D72620I237K06035l6492K77151q9825m4806
11070C21300J98245L9429k19181J88640j63795j32634P8102K68447k29160J48166
11060D97559k08878O5022K80196j86444J81327K17204m5508J48396k55447j29125
11050E64302R1684M22924j26473q9086j24060Q1990Q2105j167J45696R5569l60665
11039G82819Q5842J47150j54430J68178q427m0785k1274J79248j90691k6499J27056
11028A048187l40544K75057j55123L71510m29573n1565L45757m79458K96364N8885
11018I39497j23454k62646M06085l42369L35652k29111k2886r9418M8192L48978
11008I98520j63893M1713o1117k99887M85041m55151J57957j7734J8672m1096
$$ plain form
10998 663025 542652 798028 1238812 696265 819480 824478 813027 853063 872097 893142 1050968
10987 1050968 1040224 1157557 1178568 1040548 991674 1167208 1196081 1426058 1421879 1461457 1763206
10976 1763206 1767600 2073247 1985661 2695293 3259126 3118355 3889419 4004914 4342410 4409230
10966 4409230 4470489 4104364 3701660 2688927 2215186 1935792 1470911 1527006 1757069 1773502
10956 1773502 1448558 1400334 1639203 1304101 1474942 1260352 1010496 972250 784123 953285
10946 953285 505449 431611 427960 260678 563247 433694 445108 136771 138588 258947 131127
10935 131127 21518 309413 393874 18153 75353 -154498 -33184 138989 222276 126310 -19787
10923 -127239 167737 -31748 426212 -40290 129488 213289 239493 216173 -93692 -31187 2287
$$ packed form
10998F63025j20373K55376M40784n42547J23215M998j1451M0036J9034K1045J57826
10987A050968j0744J17333K1011j38020m8874J75534K8873K29977m179L9578L01749
10976A763206M394L05647q7586P09632N63833j40771P71064J15495L37496O6820
10966D409230O1259l66125m02704j012733m73741k79394m64881N6095K30063J6433
10956A773502l24944m8224K38869l35102J70841k14590k49856l8246j88127J69162
10946I53285m47836p3838l651j67282L02569j29553J1414A36771J817J20359j27820
10935A31127B1518K87895Q4461A8153N7200a54498c3184A38989Q3287r5966a9787
10923a27239A67737c1748D26212d0290A29488Q3801K6204k3320i3692c1187B287
$$ plain form
10911 76140 30313 -266314 52166 343829 -204113 57487 -174886 -154167 -65395 -126453 114160
10899 56945 -187878 68298 -61966 -346034 -316583 99987 -85361 254597 230791 239851 -298076
10887 382718 39353 265739 -75165 39422 -17775 227814 78935 -137910 7061 1405 -179013
10875 -198122 -34645 -378909 -260263 64298 -103290 -417883 285377 274321 -363075 -89073
10864 117918 -326973 377276 369719 -251469 -137412 63651 77556 36980 169216 -127552
10853 287249 -110162 -217003 13792 38280 -41237 -79610 87904 -130102 -482222 -106449
10842 86674 62687 116003 51366 -319673 -234505 -99653 -383059 150601 -147543 224467 141646
10831 141646 -153501 -110664 -116008 -394751 -3587 -231333 -161233 64922 -100121 -176029 2004
$$ packed form
10911G6140C0313b66314E2166K91663b04113E7487a74886K0719f5395o1058A14160
10899E6945a87878F8298f1966k84068K9451I9987h5361B54597k3806R060b98076
10887C82718C9353K26386g5165C9422a7775B27814G8935a37910G061A405a79013
10875a98122c4645l44264J18646F4298a03290l14593B85377j1056c63075h9073
10864A17918c26973C77276p557b51469J14057F3651J3905C6980J32236a27552
10853B87249a10162j06841A3792K4488d1237l8373H7904a30102l52120a06449
10842H6674k3987N3316E1366c19673Q5168i9653k83406A50601a47543B24467q2821
10831A41646a53501M2837n344k78743c587k27746P0100F4922a00121p5908B004
$$ plain form
10819 100324 -223921 -11055 52021 -67879 17090 -250616 113262 3639 129387 -82947 85213
10807 -125105 -190647 -4229 -13081 117011 282334 -174091 -48344 -1734 -256652 67514 -121368
10795 -104263 -235271 32539 24204 97263 -138349 19252 43581 7831 -233798 83235 32359
10783 69588 66112 -182995 26304 -173156 40858 59216 -235909 181236 90915 -6124 -149376
10772 -149376 -239085 -116128 -103043 114465 227875 1229 -75104 -37491 -56576 -162922 -328781
10761 -328781 217369 -62250 87424 -206555 -63325 48911 -55899 -103060 51562 72343 -139810
10749 -23497 390847 -39322 -27451 53506 -206473 92273 -110626 57518 64339 204504 92600
10737 -116483 77446 131027 145499 -65683 -97545 102786 39128 169354 -12884 -172225 -34239
$$ packed form
10819A00324b23921a1055E2021f7879A7090b50616A13262C639J25748h2947H5213
10807a25105o5542d229q852A17011J65323a74091d8344a734k54918F7514a21368
10795a04263j31008C2539q335P3059a38349A9252K4329G831b33798H3235C2359
10783F9588l476a82995B6304a73156D0858J8358b35909A81236r0321f124j43252
10772a49376q9709a16128J3085A14465J13410A229g5104c7491j9085j06346j65859
10761c28781B17369f2250H7424b06555f3325D8911e5899m7161E1562K0781a39810
10749b3497C90847c9322J1871E3506b06473I2273a10626E7518O821J40165I2600
10737a16483G7446N3581J4472f5683l1862A02786C9128J30226a2884j59341c4239
$$ plain form
10725 -265624 133796 -76922 -188714 88686 119146 127224 113342 -29348 -218152 60772 72682
10714 72682 -7373 131019 -96632 -164307 -114152 -132360 -124168 11825 -232821 20749 -259149
10702 -27705 -20348 -113441 -179334 -235158 -251388 -199021 -277364 -70325 85984 6113 -62737 -124992
10690 -124992 -146386 144202 -106272 -349322 171164 83077 -126972 169585 -208783 -194226
10680 -194226 -323347 30401 -303777 -375096 -77410 -157518 174575 -124583 75073 96083 -175659
10668 408596 138879 -5276 -165126 -65365 -241129 -204878 -330271 2659 107586 225125 123456
10657 123456 -72045 30783 32882 -163540 -208222 -205924 -49112 -52217 -185834 186961 69534
10645 69093 -148169 2252 -115866 -122783 -235711 66841 -286601 -410822 -30358 58616 -349451
$$ packed form
10725b65624A33796g6922j11792H8686L0460Q078j3882b9348j88804F0772J1910
10714G2682g373A31019i6632o7675N0155j8208Q192A1825b32821B0749b59149
10702b7705P357r3093o5893n5824j6230N2367p8343g0325H5984F113f2737o2255
10690a24992k1394A44202a06272k43050A71164H3077a26972A69585b08783J4557
10680a94226j29121C0401c03777p1319g7410q0108A74575a24583G5073K1010a75659
10668D08596A38879e276j59850f5365j75764L6251j25393B659J04927J17539j01669
10657A23456g2045C0783K099a63540m4682K298d9112l105j33617A86961F9534
10645F9093a48169B252a15866o917j12928F6841b86601j24221c0358E8616c49451
$$ plain form
10633 -128715 -303175 88109 205605 -206557 345738 23761 -182497 152215 -246822 61851
10622 104550 -28076 22944 2253 73012 -223339 35602 -152383 -59509 252621 -140377 62938
10610 -224388 -153870 47557 -352727 113965 -52900 201193 36012 -123514 -39839 2703 -137493
10598 19135 19545 -207812 42268 -290737 -96773 -203116 53176 -172931 159583 -195226 -43919
10586 -243346 -207463 191660 -25248 90532 -148664 -29871 -95381 -96416 -37831 13123 -177805
10574 -339518 -7297 -52049 158558 181861 108853 69088 15748 -42493 -228460 -60541 -8678
10562 231528 -340115 309779 -12551 -455075 29144 63854 87152 153939 -88668 37714 -236734
10550 -299312 -254238 -167432 -59102 -54403 -157045 19115 95922 33691 -110843 -145471 -134353
$$ packed form
10633a28715j74460H8109J17496b06557C45738B3761a82497A52215b46822F1851
10622A04550b8076B2944B253P0759b23339C5602a52383e9509B52621a40377F2938
10610b24388P0518D7557c52727A13965e2900B01193C6012a23514c9839B703a37493
10598A9135M10b07812D2268b90737i6773j06343E3176a72931A59583a95226d3919
10586b43346L5883A91660b5248I0532a48664b9871o5510j035c7831A3123a77805
10574c39518g297m4752A58558K3303p3008l9765A5748d2493j85967f0541h678
10562B31528c40115C09779a2551m42524B9144L4710K3298O6787h8668C7714b36734
10550b99312M5074Q6806e9102M699j02642A9115P6807C3691a10843l4628J1118
$$ plain form
10539 -134353 8073 -175957 137075 -39438 287946 -268307 -143540 -53408 159919 -55389
10528 -112151 -49478 -109668 -1007 77131 -196249 -10232 -251166 -82003 -18611 64338 -22448
10516 -210593 -52539 -294820 -93295 146209 15284 -103928 146190 -344225 -89844 118575
10505 -73673 74976 -55985 -348791 122063 -123684 -20904 19066 -145693 47956 -230556 87605
10493 -112298 -251844 6737 -162595 27492 -91824 64270 -159549 -96023 -24090 64148 55032
10482 55032 136504 206039 384772 -23216 513177 348992 240822 108848 51372 41388 -111830
10470 -36843 91789 99463 -339249 -4979 119863 -144414 48846 -11667 116397 12926 28527
10459 28527 425 -3340 76040 -275102 -73320 -295816 12406 107723 -137010 77983 -62775 -33960
$$ packed form
10539a34353H073a75957A37075c9438B87946b68307J24767e3408A59919e5389
10528a12151d9478o0190a007G7131a96249a0232k40934h2003a8611F4338b2448
10516b10593e2539k42281i3295A46209A5284a03928A46190c44225h9844A18575
10505g3673G4976e5985k92806A22063a23684b0904A9066a45693D7956b30556H7605
10493a12298j39546F737a62595B7492i1824F4270a59549O3526b4090F4148r116
10482E5032Q1472O9535J78733b3216E13177j64185j08170A08848E1372r984a11830
10470c6843I1789P674c39249d979A19863a44414D8846a1667A16397A2926J5601
10459B8527D25c340G6040b75102g3320k22496A2406R5317a37010G7983f2775K8815
$$ plain form
10447 -33960 -43202 370833 -51669 115283 214674 -81158 5365 12223 67193 -72344 -149762 -24891
10434 6034 -182599 104715 -228056 -178001 -42814 -162444 54736 241998 -198023 -265194 45119
10422 -94909 -230836 -61742 20490 -75962 -20527 -102519 -31487 -9172 139595 261076 -379082
10410 41481 -196444 -154934 -149312 65326 202136 73404 65518 -84025 -188525 -61971 -37101
10399 -37101 240204 68839 -16350 -70136 -43540 -66930 142102 -163758 44057 71603 399132
10388 399132 284374 155911 172790 129538 66920 -24119 52252 93268 3806 178459 158825
10377 158825 212558 245804 413981 432398 253154 340179 225020 311576 235477 365809 452012
10366 452012 561485 476463 341349 487255 498150 512879 413245 363868 258718 263215 178937
$$ packed form
10447c3960r242C70833e1669A15283R9391h1158E365O858N4970g2344p7418b4891
10434F034a82599A04715b28056N0055d2814j19630E4736J87262a98023o7171D5119
10422i4909j35927f1742B0490g5962b0527q1992c1487i172A39595J21481c79082
10410D1481a96444M1510N622F5326J36810G3404p886h4025j04500f1971K4870
10399c7101B40204F8839a6350n3786K6596k3390A42102a63758D4057K7546L27529
10388C99132j14758j28463J6879m3252o2618b4119E2252M1016C806J74653j9634
10377A58825N3733L3246J68177J8417j79244Q7025j15159Q6556p6099J30332Q6203
10366D52012J09473q5022j35114J45906J0895J4729r9634m9377j05150M497q4278
$$ plain form
10355 178937 156971 240911 43555 538647 629190 563685 829306 1016773 317997 392868 540010
10344 540010 220585 99176 126489 351022 326233 402392 351388 247155 175857 540426 416010
10333 416010 436866 278279 206671 161175 244909 20064 32307 102070 77227 328091 297584
10322 297584 389639 280611 184206 214363 377722 137816 312128 381459 305994 170376
10312 170376 19885 406040 -215690 141008 226020 -8574 -68943 -59706 -47280 -55066 -211300
10301 -211300 -351924 41256 -2393 -46258 -43985 204774 -130280 -85282 -180654 -23429 -21244
10290 -21244 138281 -85304 -479997 -113891 -79367 -135629 -109551 -368884 73445 -144172 -288197
10279 -288197 -18860 189160 -12484 -44683 -253122 73149 200872 32032 32223 50190 -52139
$$ packed form
10355A78937k1966Q3940D3555M95092R0543o5505K65621J87467C17997P4871J47142
10344E40010B20585I9176K7313K24533k4789P6159n1004j04233p1298L64569j24416
10333D16010K0856j58587p1608m5496Q3734B0064J2243O9763k4843K50864l0507
10322B97584R2055j09028r6405L0157J63359A37816J74312O9331p5465j35618
10312A70376A9885L86155b15690A41008Q5012h574o0369R237J2426p786j56234
10301b11300j40624D1256b393m3865K273B04774a30280M4998r5372b3429K185
10290b1244A38281h5304l94693a13891L4524n6262K6078k59333G3445a44172j44025
10279b88197a8860A89160a2484l2199k08439G3149J27723C2032J91J7967e2139
$$ plain form
10267 -32576 58621 228352 178088 34297 -30855 -105647 156782 122842 -138834 39827 -137514
10255 149484 -22139 -323445 261477 161512 140240 456365 -205167 -194433 236889 3318 -187187
10243 17275 -46477 -218880 62406 -282258 -83244 7054 -255957 10712 87179 -312124 -348870
10232 -348870 -114897 -331300 70280 -75774 46405 37499 -160139 -4527 -24743 27306 -216070
10220 77881 -62668 -255787 -119028 -96426 131004 70553 214687 -132785 -247172 -324567
10210 -324567 -211362 -198161 232579 -123783 107306 -295799 76376 55052 -27134 -13004
10199 62666 -272951 -65747 14719 -141751 128938 -121349 -314458 -419306 -180825 273887
10188 109131 193647 -102919 115500 76492 -275769 574 -128728 -140784 -204364 166275 -186803
$$ packed form
10267c2576E8621J69731n0264C4297c0855p4792A56782l3940a38834C9827a37514
10255A49484b2139l01306B61477r9965k1272L16125b05167J0734B36889C318a87187
10243A7275d6477j72403F2406b82258h3244G054b55957A0712P6467c12124l6746
10232c48870a14897k16403G0280g5774D6405q906a60139d527k0216B7306b16070
10220G7881f2668j93119a19028K2602A31004o0451J44134a32785j14387p7395
10210c24567J13205J3201B32579a23783A07306b95799G6376k1324b7134a3004
10199F2666b72951f5747A4719a41751A28938a21349j93109j04848a80825B73887
10188A09131Q4516a02919A15500l9008b75769E74a28728j2056o3580A66275a86803
$$ plain form
10176 2916 -139410 -159866 -236256 -125424 -251434 -116558 -199688 86419 -99873 -162559 -21911
10164 -69864 -14228 -51942 -252751 -176607 261542 209893 -10981 64460 -147723 -11396 -250842
10153 -250842 -99468 -247881 -123230 1503 -139733 93043 -222164 -90004 -77066 -26882 -198619
10142 -198619 -220127 -85242 -25011 -370356 -59894 -211390 -368572 -50100 -330821 94450 -39705
10130 -200271 29532 -11755 52499 -12703 -7549 -3266 -341541 51694 -197144 69709 -321543
10118 -75291 281812 -140631 79350 -36592 303048 -228311 13019 -188951 86487 -164772
10107 -325039 -233280 -61286 138686 -78454 -121598 -128963 -286161 -41469 -36876 -272130 69512
10095 24468 492276 -60904 77490 22391 10080 35669 100937 -102104 32280 -30656 71188
$$ packed form
10176B916a39410k0456p6390J10832j26010a16558q3130H6419i9873o2686b1911
10164f9864a4228l7714k00809P6144B61542n1649a0981F4460a47723a1396k39446
10153b50842i9468j48413a23230A503a39733I3043b22164i0004J2938b6882j71737
10142a98619k1508h5242b5011l45345e9894j51496j57182e0100k80721I4450c9705
10130b00271B9532a1755E2499a2703N154c266l38275E1694a97144F9709c21543
10118g5291B81812a40631G9350c6592C03048b28311A3019a88951H6487a64772
10107c25039R1759f1286A38686g8454m3144p365j57198d1469M593k35254F9512
10095B4468M67808f0904G7490B2391A0080K5589O5268a02104C2280c0656G1188
$$ plain form
10083 -30320 -102890 -171400 -60725 -162150 95098 -25850 -180828 -229419 37066 -193428 -92635
10071 -191187 -282432 -65545 -130821 218174 -37715 264738 4598 153445 -35983 37353 -152743
10059 -105757 20458 144920 -303516 -145459 154767 -276504 34769 213809 -226118 141674
10048 -213262 -308722 19199 -147776 150849 -8096 -141164 -64417 -48014 -320928 -324945 111914
10036 -23408 -341660 102568 -90894 -243789 -7525 92687 -367708 -305740 -22116 -258366 -34588
10024 41722 158728 -35056 94266 -160467 -180296 76825 35653 -19309 30498 -135933 -237742
10013 -237742 31390 82940 4357 -314920 8021 -96915 -19235 -210279 200639 -340140 180308
10001 -172634 -23589 -99065 122741 116577 -216956 -899 146314 -74821 57242 -22558 37779
$$ packed form
10083c0320p2570o8510f0725j01425I5098b5850j54978m8591C7066a93428i2635
10071a91187r1245f5545o5276B18174c7715B64738D598J48847c5983C7353a52743
10059a05757B0458J24462c03516a45459A54767b76504C4769J79040b26118A41674
10048b13262r5460A9199a47776A50849h096j33068f4417J6403k72914m017A11914
10036b3408l18252A02568i0894j52895g525I2687c67708O1968b2116k36250c4588
10024D1722J17006c5056I4266a60467j9829G6825C5653a9309C0498a35933j01809
10013b37742C1390N1550D357c14920H021i6915a9235j91044B00639c40140A80308
10001a72634b3589p5476A22741o164b16956h99A46314g4821E7242b2558C7779
$$ plain form
9989 -187083 -84728 -211561 -43023 13416 -224014 -77425 120100 195520 -60436 -219219 114950
9977 -199387 -97627 -302193 -197331 -214 -117667 -64881 12571 379 -298389 -26686 -151881
9966 -151881 -162797 -210288 -53784 -113180 -31082 -35319 -365822 -322965 13025 -20857 -100671 168381
9953 168784 158302 121126 -211168 147425 -113865 -197453 -271517 -155522 119716 -274102
9942 241523 -58685 32629 -26961 317525 96481 101524 -266623 7786 61796 166337 -219352
9930 -196064 -79294 -71189 -205195 -45400 -143967 740 -279650 -236978 -52462 118946 -126510
9918 -27383 -101176 -51782 10517 -385198 36895 -52174 -70589 104720 -63111 -342194 -37164
9906 -246104 -246137 -225272 -10240 -271011 -405222 190913 -180993 -182217 -9202 -45900 -6053 8280
$$ packed form
9989a87083h4728j26833d3023A3416b24014g7425A20100P5420f0436j58783A14950
9977a99387i7627k04566J04862b14j17453N2786A2571C79b98389b6686j25195
9966a51881j0916m7491e3784n9396c1082m237l30503M2857A3025b0857p9814A68381
9953A68784j0482l7176b11168A47425a13865q3588p4064J15995A19716b74102
9942B41523e8685C2629b6961C17525I6481N043b66623G786N4010J04541b19352
9930a96064g9294Q105j34006d5400r8567G40b79650M2672e2462A18946a26510
9918b7383p3793M9394A0517c85198C6895e2174j8415A04720f3111k79083c7164
9906b46104l3K0865a0240k60771j34211A90913a80993j224i202l6698f053H280
$$ plain form
9893 148603 1439 -262365 219500 -34881 95156 -73966 -10295 94513 -5699 180056 88303
9881 -230830 -435892 109954 -93950 -116639 11073 -37254 -30108 -156095 -269624 96016 -229113
9869 261816 -108391 -55558 175874 314571 -87045 -338488 -13076 15368 -327395 35292 -291797
9857 -135378 -50934 -130900 197738 -15043 -591820 -153006 -295661 50171 -207244 23057 32440
9846 32440 -198777 -49390 -56096 -123911 97487 -52546 -79743 22768 311717 -67813 -158062 40388
9833 -202746 197575 103197 -117439 39029 143371 -199804 46734 -31433 -67833 10190 1854
9821 -39612 -100878 -181710 167992 -95058 -140378 -81960 -503574 -103122 -57681 12677 86244
9810 86244 -115747 120412 -253745 -305657 -46288 -316213 176097 -252493 -1575 196489 -121693
$$ packed form
9893A48603A439b62365B19500c4881I5156g3966a0295I4513e699A80056H8303
9881b30830k05062A09954i3950k2689A1073c7254P146j25987j13529I6016b29113
9869B61816a08391N2833A75874J38697h7045k51443a3076A5368c27395C5292b91797
9857a35378e0934p9966A97738a5043n76777a53006j42655E0171b07244B3057R383
9846C2440a98777d9390o706o7815I7487e2546k7197B2768K88949f7813r0249D0388
9833b02746A97575r4378a17439C9029J04342a99804D6734c1433l6400A0190A854
9821c9612o1266q0832A67992i5058m5320N8418m21614a03122M5441A2677P3567
9810H6244a15747A20412b53745n1912d6288k69925A76097b52493a575A96489a21693
$$ plain form
9798 71506 -30408 -211953 -138685 -95349 35302 -19420 -221433 145970 -81513 -188058 -156751
9787 -156751 -37656 -11040 -97560 50538 -66775 -185965 -123784 -56326 257914 -210825 190847
9775 208386 -73855 104946 -17495 22748 41465 -90564 -148200 -203926 24356 -44816 -68856
9764 -68856 -236900 23208 74967 104423 124596 -97683 -279988 121362 -244704 -179000 -261295
9753 -261295 518317 -38447 -124565 9621 -250345 -320413 126917 -162090 -98015 -110103 -327540
9742 -327540 -220852 -252155 -75869 120582 -71306 -131620 147106 -143197 49381 188480 -43050
9730 -272401 -196243 74363 -161084 -133420 -199501 134897 355753 -284361 24057 -107990 25380
9718 10474 122643 -44100 342061 5688 -218695 -269879 171821 -51780 32095 -96591 113554
$$ packed form
9798G1506c0408j81545P3268M3336C5302a9420k02013A45970h1513j06545L1307
9787a56751c7656a1040q6520E0538f6775j19190O2181e6326B57914b10825A90847
9775B08386g3855A04946a7495B2748J8717i0564n7636n5726B4356d4816k4040
9764f8856j68044B3208N1759K9456K0173i7683j82305A21362b44704O5704q2295
9753b61295E18317c8447q6118I621b50345p0068A26917a62090O4075j2088k17437
9742c27540J06688l1303g5869A20582g1306o0314A47106a43197D9381J39099d3050
9730b72401P6158G4363a61084K7664o6081A34897K20856b84361B4057a07990B5380
9718A0474J12169d4100C42061E688b18695n1184A71821e1780C2095i6591A13554
$$ plain form
9706 128316 203124 -149583 -242793 90074 -116079 -72809 61146 43811 -327231 -278234 26067
9694 159550 -205093 -307579 -181287 90 2003 53326 147959 -155055 -60544 -235082 55235
9682 -334264 -15107 -114214 -175965 -192500 -169303 -153736 -244851 -169455 -108032 119303 -202237
9670 160023 -229859 -63706 11085 102305 -112693 205782 168010 -2379 -159219 -352794 -276167
9659 -276167 -2588 -150586 -411873 -102546 -87645 -3529 -189961 -412091 -191182 -431404 -30661
9647 39590 -106883 -271665 -2373 49151 -117873 17399 136668 -131205 -1396 -316487 8095
9635 -123211 45261 -52652 -310843 46218 -91369 -132561 -177596 -276559 -34657 -117003 -346434
9624 -346434 203414 -110567 -662297 -84196 -72143 5146 -155821 25268 -419789 -187206 -241147
$$ packed form
9706A28316P4808a49583r3210I0074a16079M3270F1146j7335c27231M8997B6067
9694A59550b05093j02486J26292I0J913N1323R4633a55055f0544j74538E5235
9682c34264a5107r9107o1751j6535K3197J5567r1115P5396O1423A19303b02237
9670A60023b29859f3706A1085R1220a12693B05782l7772b379j56840j93575P6627
9659b76167b588j47998k61287a02546J4901c529j86432k22130a91182k40222c0661
9647C9590a06883j64782b373D9151a17873A7399J19269a31205a396l15091H095
9635a23211D5261e2652k58191D6218i1369m1192m5035r8963c4657q2346k29431
9624c46434B03414a10567n51730h4196J2053E146a55821B5268d19789a87206n3941
$$ plain form
9613 -241147 25300 20125 243024 14960 26673 140682 205982 227225 138287 -150500 115238
9601 85864 -305739 -146563 -225574 19097 239771 -46268 81840 203247 -76512 -101057 -144284
9590 -144284 57881 -37654 -6181 -93758 -246176 -193120 -83893 -161170 -149661 14194 165747
9579 165747 -62983 99897 -365904 30388 -81281 -269889 138597 -38632 -59762 -107458 62930
9567 -111520 183852 -78760 56515 -284753 -87355 -52279 -32528 -134285 -182878 288723 212128
9556 212128 -102052 -182047 57052 -260392 -357406 -97000 157315 -321717 -212634 -40945 72990
9544 -191820 -120231 33015 -266365 -194502 50444 -233365 -192663 80992 35527 188294 -238591
9532 -326285 -443484 101938 -36201 -315662 58558 -168788 -192144 120922 -182766 -35817
$$ packed form
9613b41147B5300n175K22899A4960J1713J14009O5300K1243q8938a50500A15238
9601H5864c05739a46563p9011A9097K20674d6268H1840J21407g6512k4545m3227
9590a44284E7881c7654f181q7577j52418N3056h3893p7277J1509A4194J51553
9579A65747f2983I9897c65904C0388h1281j88608A38597c8632k1130m7696F2930
9567a11520A83852g8760E6515b84753h7355L5076J9751j01757m8593B88723p6595
9556B12128a02052p9995E7052b60392r7014i7000A57315c21717J09083d0945G2990
9544a91820P1589C3015b66365P1863E0444b33365M0702H0992C5527J52767b38591
9532c26285j17199A01938c6201k79461E8558a68788k3356A20922a82766c5817
$$ plain form
9521 23667 -268402 -299394 134751 -21006 221133 -280652 -48405 -105782 158181 496518 26092
9509 -300474 -289993 -50042 -31963 89106 248054 -156483 -106653 88039 -257545 37824 -123157
9497 72220 2831 -105846 271628 -428039 70405 -17354 42293 138 -178714 110887 -122537
9485 -234330 -261116 -193468 22889 -232265 147567 251343 26953 -156119 -384298 -225174
9475 -225174 147212 -221779 125135 -86526 -244856 -326217 234080 141679 31672 68142 80555
9464 80555 -63142 -241936 -14126 -27326 6267 -93372 31203 -294978 -89837 -279900 -211400
9453 -211400 135138 90793 153881 52622 144894 -61138 167864 106814 -31469 -2016 126251
9441 -111406 -46194 -321469 -47123 182001 -19967 21228 -23766 -19027 209070 -26085 -92363
$$ packed form
9521B3667b68402l0992A34751b1006B21133b80652d8405n7377A58181L38337B6092
9509c00474J0481e0042J8079H9106J58948a56483M9830H8039b57545C7824a23157
9497G2220B831a05846B71628d28039G0405a7354D2293A38a78714A10887a22537
9485b34330k6786O7648B2889b32265A47567J03776B6953a56119k28179J59124
9475b25174A47212b21779A25135h6526j58330q1361B34080r2401C1672L6470J2413
9464H0555f3142j78794a4126j3200F267i3372C1203b94978h9837j90063O8500
9453b11400A35138m4345O3088E2622R2272f1138A67864o1050c1469b016A26251
9441a11406d6194k75275d7123A82001a9967B1228b3766M739B09070b6085o6278
$$ plain form
9430 -92363 -217377 -75816 157695 -467501 158909 43606 -233129 31315 -214700 -16232 -190803
9419 -190803 62348 -328269 -22800 -196943 -245883 -54463 -259350 179604 -24913 80379 149023
9408 149023 35455 337655 135459 9050 -344567 -250682 -213156 -84341 301199 20092 158829
9397 158829 -160705 53349 -50865 -91972 36772 -85491 -15711 -183201 -60963 46236 -99482
9385 -85189 7147 -29326 -83530 -130281 -301501 -330616 -202307 76681 -3196 -71044 -88104 78847
9372 107349 -120969 -158836 -206529 -44055 -113309 59657 -75637 29404 13830 -88680 -130482
9361 -130482 3355 80414 -60419 -38174 124238 -13718 85984 45668 -96623 -34500 -93003 -30766
9348 389344 -89015 298493 -178264 -22739 25891 81875 -468802 25232 -3126 33887 -54029
$$ packed form
9430i2363j25014g5816A57695d67501A58909D3606b33129C1315b14700a6232j74571
9419a90803F2348c28269b2800j74143m8940e4463k04887A79604b4913H0379O8644
9408A49023C5455L02200A35459I050c44567R3885L7526h4341C01199B0092J38737
9397A58829a60705E3349e0865m1107C6772h5491a5711j67490f0963D6236i9482
9385h5189G147b9326n4204m6751j71220k9115J28309G6681c196o7848j7060G8847
9372A07349a20969l7867m7693d4055o9254E9657g5637B9404A3830h8680m1802
9361a30482C355P7059f0419K2245A24238a3718H5984m0316i6623c4500n8503c0766
9348C89344h9015B98493a78264b2739B5891N5984d68802B5232c126C3887e4029
$$ plain form
9336 -197783 -65237 34025 47534 -127658 304146 -243317 -19706 -165607 73880 -202345 21454
9324 -359855 -103660 -335886 160870 -488221 36040 57372 19265 -52847 60986 72528 26125
9312 -46952 128858 73198 -29404 -211899 -288278 -35006 134524 -204437 -415065 -22262 -74392
9301 -74392 -77082 -150137 -48794 -100806 132829 -209855 46007 -31979 247833 226951 -346860
9289 -70382 -207843 -33849 139120 -222335 -175398 -339973 -396847 -20542 -23700 95471 -121281
9277 -207957 -252111 -321507 -242352 -205689 -69248 37799 71901 -175745 101795 -86478 -128730
9266 -128730 -138150 36100 -150993 -71831 -286057 -141058 90495 -211584 -135513 -102765 48489
9254 -329230 135848 -429879 363935 -95604 -106678 157261 -6309 -80750 -266061 -176294 -126690
$$ packed form
9336a97783f5237C4025J3509a27658C04146b43317a9706j45901G3880b02345B1454
9324c59855a03660k32226A60870d88221C6040K1332A9265e2847F0986J1542B6125
9312d6952A28858n5660b9404j82495p6379c5006A34524b04437k10628b2262n2130
9301g4392k690p3055d8794n2012A32829b09855D6007c1979B47833k0882c46860
9289g0382j37461c3849A39120b22335M6937j64575n6874b0542l158I5471a21281
9277b07957m4154o9396P9155L6663f9248C7799L4102a75745A01795h6478m2252
9266a28730r420C6100a50993g1831k14226a41058I0495b11584P6071L2748D8489
9254c29230A35848d29879C63935i5604j1074A57261f309p4441j85311Q9767M9604
$$ plain form
9243 -126690 -165677 -32415 -36721 -29406 -235507 129196 131440 132035 -398562 262561 -68444 62207
9230 3199 87675 -24599 -111950 22012 -99106 -311261 65692 95383 -113665 -127431 90699 64123
9218 64123 -78571 -162564 133025 -11059 -154334 -84844 -107817 37483 -404362 -221870 130818
9206 -30808 -17960 -76764 217723 -240903 -273639 37123 -86018 -55313 53020 -57071 -39885
9195 -39885 -104230 -153357 316177 -369742 -346874 -43456 93624 -8279 171901 -90890 -7449 -409927
9183 -409927 -43160 102708 -43085 11025 145521 -79551 -343157 228288 80913 -101453 -60356
9172 -60356 23041 1397 -93935 -140143 55148 -23907 -95843 42833 86969 -8265 -195825 -132033
9160 -132033 -138094 -197821 56309 -166147 -189912 4510 77428 102033 -180087 -375237 -137833
$$ packed form
9243a26690l8987c2415m306P315k06101A29196K244N95c98562B62561f8444F2207
9230C199Q4476b4599q7351B2012i9106k12155F5692K9691a13665j3766I0699k6576
9218F4123g8571q3993A33025a1059j43275O9490k2973C7483d04362J82492A30818
9206c0808J2848n8804B17723b40903l2736C7123h6018L0705E3020e7071J7186
9195c9885o4345m9127C16177c69742K2868d3456I3624h279A71901i0890g449m02478
9183d09927d3160A02708d3085A1025J34496g9551k63606B28288H0913a01453M1097
9172f0356B3041A397i3935m6208E5148b3907p1936D2833M4136h265j87560O3792
9160a32033o061n9727E6309a66147k3765D510P2918K4605a80087j95150a37833
$$ plain form
9148 -246228 64016 18641 46672 183519 3645 -154736 -58833 -55784 -20242 -11696 39313 -75321
9135 44070 -31786 39340 97701 158477 10761 -235743 -69838 -113583 215817 264803 -157558
9123 63087 -55304 -18666 -307074 60181 58021 -9234 43724 -71137 -75807 124367 -34511 -136486
9111 -136486 -149701 -122046 35009 -34884 -126747 232423 -136713 50930 -16740 165862 -128136
9099 237869 -126264 90258 82388 57074 14053 158289 12250 -28688 -47745 -84230 -9267 -304835
9087 -304835 93847 79396 -182810 -127522 124593 -174015 134167 -175355 -197084 -249831 -126420
9076 -126420 -206637 -124575 -244861 -105299 -99082 44613 -42449 -218902 119791 -54471 -19111
9064 -326848 -152281 342571 53268 1575 -112204 125126 -332583 203447 -4238 233888 -8761
$$ packed form
9148b46228F4016A8641K8031J36847C645a54736e8833L049b0242Q546C9313g5321
9135D4070c1786C9340N8361O0776A0761b35743f9838m3745B15817M8986a57558
9123F3087e5304a8666k88408F0181k160i234D3724g1137m670A24367c4511j01975
9111a36486j3215K7655C5009c4884r1863B32423a36713E0930a6740A65862a28136
9099B37869a26264I0258p870k5314A4053J44236A2250b8688j9057l6485i267k95568
9087c04835I3847j4451a82810N5288A24593a74015A34167a75355k1729n2747J23411
9076a26420q0217Q2062j20286a05299O217D4613d2449j76453A19791e4471a9111
9064c26848a52281C42571E3268A575a12204A25126c32583B03447d238B33888h761
$$ plain form
9052 -157884 -5999 101037 -96605 -50128 -289029 -163101 -195517 -455585 -32347 -330023 -204919
9041 -204919 -214792 117886 102775 184075 -99115 73780 -56517 -210201 -176155 92354 -57772
9029 8587 122682 225819 -85432 4050 180249 -224158 165009 -202266 -86862 -1988 -8138
9018 -8138 -5853 -68640 -193461 67111 -44582 376434 -208668 58163 -105340 201069 -108127
9006 -213831 -201710 -122700 -379190 -79970 -254494 -127730 -80902 49323 -200328 45942 -310602
8994 -121664 -179971 -261401 100667 -189736 -149609 -11379 -104061 8269 -323803 65656 -3203
8982 -3355 -186622 -111429 -59855 -78445 -252545 -271803 -80123 32722 -85456 -49522 -94399 208726
8969 -68481 75633 162423 -69276 -50702 63908 -57999 -191838 84816 86048 -76857 299568 -231896
$$ packed form
9052a57884e999A01037i6605M6477k38901J25928l2416k60068c2347k97676J25104
9041b04919r873A17886j5111Q1300i9115G3780e6517j53684L4046I2354e7772
9029H587J14095J03137h5432D050J76199b24158A65009b02266h6862a988o150
9018h138K285o2787j24821F7111d4582C76434b08668E8163a05340B01069a08127
9006b13831J2121P9010k56490g9970j74524J26764M6828D9323b00328D5942c10602
8994a21664n8307q1430A00667a89736M0127a1379r2682H269c23803F5656c203
8982c355j83267P5193N1574j8590j74100j9258h0123C2722h5456L5934m4877B08726
8969f8481G5633Q6790f9276J8574F3908e7999j33839H4816J232g6857B99568b31896
$$ plain form
8956 200773 52750 154790 -187654 265612 88557 -85523 -92466 189902 54918 -168100 315098
8944 60578 19654 118577 109822 -86153 -91297 -74789 -121782 -17440 -178363 -15790 -91921 -211117
8932 -211117 203706 219042 -71441 -183938 -4648 -179900 -222188 -99433 175674 -173447 -23435
8920 269300 1236986 90686 542715 17932 -226727 27804 89160 -149198 -107135 -356743 162940
8908 -37775 71025 266564 -103656 200520 -47593 222123 -241187 -104286 165777 82295
8897 -4592 -85490 -27970 -167396 106870 -98839 -13476 -174505 -39090 -92620 78651 -78268
8885 173982 -81104 -133740 238928 -38745 150595 84801 58256 -9798 136409 -75601 242784
8873 42591 -28004 -44796 -15523 -191239 -229943 -207751 -110668 -160789 9662 249400 -86855 -63482
$$ packed form
8956B00773E2750J02040a87654B65612H8557h5523o943A89902E4918a68100C15098
8944F0578A9654R8923q755h6153n144J6508m6993a7440j60923a5790p6131j19196
8932b11117B03706J5336g1441j12497d648j75252m2288i9433A75674a73447b3435
8920B69300R67686I0686M52029A7932b26727B7804O1356a49198M2063k49608A62940
8908c7775G1025J95539a03656B00520d7593B22123b41187a04286A65777H2295
8897d592q0898b7970j39426A06870i8839a3476j61029c9090n3530G8651g8268
8885A73982h1104n2636B38928c8745A50595o5794k6545i798A36409g5601B42784
8873D2591b8004j6792a5523j75716l8704K2192R7083n0121I662K39738h6855K3373
$$ plain form
8861 -63482 40138 -281607 -514017 -200506 31366 -7680 -89905 -334611 62106 -117173 -74465
8850 -74465 125746 4174 159824 -122139 -145030 -163737 162150 -238683 -111631 155491 -237598
8838 -95458 -167026 -96316 74160 -269188 -34319 333172 -289681 -111445 -46998 -103333 219106
8826 141470 -285820 -203845 -46740 -152763 -398774 -247719 -2507 -252003 150515 125758 -293239
$$ packed form
8861f3482D0138b81607k32410b00506C1366g680q2225k44706F2106a17173M2708
8850g4465A25746D174J55650a22139k2891j8707A62150b38683a11631A55491b37598
8838i5458p1568P0710G4160b69188c4319C33172b89681a11445d6998n6335B19106
8826A41470b85820Q1975d6740j06023k46011J51055b507k49496A50515k4757b93239
$$ [...]
##END NTUPLES=NMR SPECTRUM
##END=
