##TITLE=NES1099_Nhol10910_9887186_AK32tKpe6a
##JCAMPDX= 6.0         $$ Bruker NMR JCAMP-DX V2.0
##DATA TYPE= NMR SPECTRUM
##DATA CLASS= NTUPLES
##ORIGIN= BRUKER
##OWNER= Administrator
$$ 1.72 TOPSPIN		Version 2.1
$$ 2016-08-28 18:46:35.664 -0500  Administrator@X
$$ Compression mode = diff/dup
##.OBSERVE FREQUENCY= 400.02188249412
##.OBSERVE NUCLEUS= ^1H
##.ACQUISITION MODE= SIMULTANEOUS (DQD)
##.ACQUISITION SCHEME= undefined
##.AVERAGES= 8
##.DIGITISER RES= 22
##SPECTROMETER/DATA SYSTEM= spect
##.PULSE SEQUENCE= zg30
##.SOLVENT NAME= COFFEE_meoh
##.SHIFT REFERENCE= INTERNAL, COFFEE_meoh, 1, 14.98509
##AUDIT TRAIL= $$ (NUMBER, WHEN, WHO, WHERE, PROCESS, VERSION, WHAT)
$$ ##TITLE= Audit trail, TOPSPIN		Version 2.1
$$ ##JCAMPDX= 5.01
$$ ##ORIGIN= Bruker BioSpin GmbH
$$ ##OWNER= Administrator
$$ $$ E:\/data/COFFEE/nmr/NES1099_Nhol10910_9887186_AK32tKpe6a/10/pdata/1/auditp.txt
$$ ##AUDIT TRAIL=  $$ (NUMBER, WHEN, WHO, WHERE, PROCESS, VERSION, WHAT)
(   1,<2016-08-28 18:46:28.601 -0500>,<Administrator>,<X>,<go>,<TOPSPIN 2.1>,
      <created by zg
	started at 2016-08-28 18:45:21.976 -0500,
	POWCHK enabled, PULCHK disabled,
       configuration hash MD5:
       21 0F 79 D6 B3 7B B4 F6 88 20 88 DB 03 48 BD 9F
       data hash MD5: 64K
       4C A9 B4 FE 8D 25 C6 09 76 7E 2E 78 3A 6D 8B 45>)
(   2,<2016-08-28 18:46:31.679 -0500>,<Administrator>,<X>,<proc1d>,<TOPSPIN 2.1>,
      <Start of raw data processing
       efp LB = 0 FT_mod = 6 PKNL = 1 PHC0 = 0 PHC1 = 0 SI = 32K 
       data hash MD5: 32K
       EE 16 20 ED E2 FF 2D C6 6A 06 25 6B A7 62 2A E1>)
(   3,<2016-08-28 18:46:31.945 -0500>,<Administrator>,<X>,<proc1d>,<TOPSPIN 2.1>,
      <pk PHC0 = 93.3728 PHC1 = 0 
       data hash MD5: 32K
       FB 9F CD D2 9B AD 92 4B 9F 5F 86 54 5D A7 FC D5>)
(   4,<2016-08-28 18:46:32.054 -0500>,<Administrator>,<X>,<proc1d>,<TOPSPIN 2.1>,
      <abs ABSG = 1 
       data hash MD5: 32K
       BB 57 5D 70 FD 76 DD 0F 33 13 A5 D8 33 3C D1 D4>)
(   5,<2016-08-28 18:46:32.117 -0500>,<Administrator>,<X>,<proc1d>,<TOPSPIN 2.1>,
      <abs ABSG = 2 
       data hash MD5: 32K
       D8 4C 0B 28 69 ED 4E 03 5A 29 F9 68 F2 D6 D8 1A>)
(   6,<2016-08-28 18:46:32.164 -0500>,<Administrator>,<X>,<proc1d>,<TOPSPIN 2.1>,
      <abs ABSG = 3 
       data hash MD5: 32K
       25 71 B6 F5 21 2B C4 74 A7 F3 24 E0 95 8D 41 FC>)
(   7,<2016-08-28 18:46:32.226 -0500>,<Administrator>,<X>,<proc1d>,<TOPSPIN 2.1>,
      <abs ABSG = 4 
       data hash MD5: 32K
       80 15 56 A7 95 9F 1A 92 D0 5D 1A 39 BA 33 34 15>)
(   8,<2016-08-28 18:46:32.289 -0500>,<Administrator>,<X>,<proc1d>,<TOPSPIN 2.1>,
      <abs ABSG = 5 
       data hash MD5: 32K
       90 84 A5 00 6B 12 3D 11 24 6E 7A FB 63 33 46 75>)
$$ ##END=
$$ 
$$ $$ hash MD5
$$ $$ 16 B9 8E 44 2B E1 DF 90 82 76 30 D0 AE 7D 64 91
##$RELAX= 
##$RELAX= 
##$RELAX= 
##$RELAX= 
##$RELAX= 
##$RELAX= 
##$RELAX= 
$$ Bruker specific parameters
$$ --------------------------
##$DU= <E:\>
##$EXPNO= 10
##$NAME= <NES1099_Nhol10910_9887186_AK32tKpe6a>
$$ [...]
150 150 150 150 150 150 150 150
##$TP07= 0
##$TPNAME0= <>
##$TPNAME1= <>
##$TPNAME2= <>
##$TPNAME3= <>
##$TPNAME4= <>
##$TPNAME5= <>
##$TPNAME6= <>
##$TPNAME7= <>
##$TPOAL= (0..7)
0.5 0.5 0.5 0.5 0.5 0.5 0.5 0.5
##$TPOFFS= (0..7)
0 0 0 0 0 0 0 0
##$TUNHIN= 0
##$TUNHOUT= 0
##$TUNXOUT= 0
##$USERA1= <user>
##$USERA2= <user>
##$USERA3= <user>
##$USERA4= <user>
##$USERA5= <user>
##$V9= 5
##$VALIST= <valist>
##$VCLIST= <CCCCCCCCCCCCCCC>
##$VD= 0
##$VDLIST= <DDDDDDDDDDDDDDD>
##$VPLIST= <PPPPPPPPPPPPPPP>
##$VTLIST= <TTTTTTTTTTTTTTT>
##$WBST= 2048
##$WBSW= 25
##$XGAIN= (0..3)
0 0 0 0
##$XL= 0
##$YL= 0
##$YMAX_a= 515986
##$YMIN_a= -435142
##$ZGOPTNS= <>
##$ZL1= 120
##$ZL2= 120
##$ZL3= 120
##$ZL4= 120
##$ABSF1= 14.98509
##$ABSF2= -5.573092
##$ABSG= 5
##$ABSL= 3
##$ALPHA= 0
##$AQORDER= 0
##$ASSFAC= 0
##$ASSFACI= 0
##$ASSFACX= 0
##$ASSWID= 0
##$AUNMP= <proc_prof1d_extract_pilot.lims>
##$AXLEFT= 0
##$AXNAME= <>
##$AXNUC= <1H>
##$AXRIGHT= 0
##$AXTYPE= 0
##$AXUNIT= <>
##$AZFE= 0.1
##$AZFW= 0.1
##$BCFW= 0
##$BC_mod= 0
##$BYTORDP= 0
##$COROFFS= 0
##$CY= 15
##$DATMOD= 1
##$DC= 0
##$DFILT= <>
##$DTYPP= 0
##$F1P= 0
##$F2P= 0
##$FCOR= 0.5
##$FTSIZE= 32768
##$FT_mod= 6
##$GAMMA= 0
##$GB= 0
##$INTBC= 1
##$INTSCL= 1
##$ISEN= 128
##$LB= 0
##$LEV0= 0
##$LPBIN= 0
##$MAXI= 10000
##$MC2= 0
##$MEAN= 0
##$ME_mod= 0
##$MI= 0
##$NCOEF= 0
##$NC_proc= -8
##$NLEV= 6
##$NOISF1= 0
##$NOISF2= 0
##$NSP= 0
##$NTH_PI= 0
##$NZP= 0
##$OFFSET= 14.98509
##$PC= 1
##$PHC0= 93.3728
##$PHC1= 0
##$PH_mod= 1
##$PKNL= yes
##$PPARMOD= 0
##$PPDIAG= 0
##$PPIPTYP= 0
##$PPMPNUM= 2147483647
##$PPRESOL= 1
##$PSCAL= 4
##$PSIGN= 0
##$PYNMP= <proc.py>
##$REVERSE= no
##$SF= 400.02
##$SI= 32768
##$SIGF1= 0
##$SIGF2= 0
##$SINO= 400
##$SIOLD= 32768
##$SPECTYP= <>
##$SREGLST= <1H.CDCl3>
##$SSB= 0
##$STSI= 32768
##$STSR= 0
##$SW_p= 8223.68421052631
##$SYMM= 0
##$S_DEV= 0
##$TDeff= 65536
##$TDoff= 0
##$TI= <>
##$TILT= no
##$TM1= 0
##$TM2= 0
##$TOPLEV= 0
##$USERP1= <user>
##$USERP2= <user>
##$USERP3= <user>
##$USERP4= <user>
##$USERP5= <user>
##$WDW= 1
##$XDIM= 32768
##$YMAX_p= 406551412
##$YMIN_p= -799747
##$CURPLOT= <Network HP LaserJet P1505>
##$CURPRIN= <$Network HP LaserJet P1505>
##$DFORMAT= <normdp>
##$LAYOUT= <+/1D_H.xwp>
##$LFORMAT= <normlp>
##$PFORMAT= <normpl>
##$SURQMSG= 1
$$ End of Bruker specific parameters
$$ ---------------------------------
##NTUPLES= NMR SPECTRUM
##VAR_NAME=  FREQUENCY,     SPECTRUM/REAL,   SPECTRUM/IMAG
##SYMBOL=    X,             R,               I
##VAR_TYPE=  INDEPENDENT,   DEPENDENT,       DEPENDENT
##VAR_FORM=  AFFN,          ASDF,            ASDF
##VAR_DIM=   32768,         32768,           32768
##UNITS=     HZ,            ARBITRARY UNITS, ARBITRARY UNITS
##FACTOR=    0.250966925370066, 1,           1
##FIRST=     8223.43324360094, -42003,       -160478
##LAST=      0,             126188,          -306211
##MIN=       0,             -799747,         0
##MAX=       8223.43324360094, 406551412,    0
$$ Real data points
##PAGE= N=1
##DATA TABLE= (X++(R..R)), XYDATA
$$ [...]
19534D9179a27621B14555c88207G3265c5888H9579d27847A60607n5840L35078
$$ 49179 -127621 214555 -388207 73265 -35888 89579 -427847 160607 104767 439845
19524D39845b02189g4179A75499e3173p3911j18215E4577a68347k45163D11468
$$ 439845 -202189 -74179 175499 -53173 -127084 -245299 54577 -168347 -413510 411468
19513A06124A1363a82069p5917B4391O0042a33821q6801C9330R0261d7909k4258
$$ 106124 11363 -182069 -257986 24391 84433 -133821 -220622 39330 129591 -47909 -72167
19502g2167A48832d76133i8674K8605J0062a2812q2896q3205N950f8186A849b16859
$$ -72167 148832 -476133 -98674 -70069 -60007 -12812 -95708 -178913 -172963 -68186 1849 -216859
19489a41091e1793q8214p228L3114r8793j66926Q6430J30048A46928b36398j22622
$$ -141091 -51793 -140007 -147235 -114121 -212914 -379840 -293410 -163362 146928 -236398 -359020
19478c59020B63439a56959O8484A41222a68686K5122b095m05049A48697l6608
$$ -359020 263439 -156959 -88475 141222 -168686 -143564 -2095 -407144 148697 112089
19468A12089J59796j3929j5995b06732f2457m2318c1976j83141C15077a03859
$$ 112089 271885 257956 241961 -206732 -62457 -104775 -31976 -215117 315077 -103859
19457D6369b28040p3181P5699j5914k5473i4558C7962a02792B7718a89309A01024
$$ 46369 -228040 -301221 -225522 -241436 -266909 -94558 37962 -102792 27718 -189309 101024
19445B382b25333K7298j4560N4879A20017g2308A07841A4969a53552c2293M605
$$ 2382 -225333 -198035 -212595 -157716 120017 -72308 107841 14969 -153552 -32293 -27688
19434b7688J2097A51821J5090a65521B63114c6537n1515J1705L5432j92745Q3364
$$ -27688 -15591 151821 166911 -165521 263114 -36537 -88052 -76347 -40915 -233660 -150296
19423a50296A3904e0735A13943c44898A6892c80280h7681C08069f2016j63037
$$ -150296 13904 -50735 113943 -344898 16892 -380280 -87681 308069 -62016 -225053
19413b25053a3105A27428h2426B11496e7625j37456l4868M4399M4634A17200a6886
$$ -225053 -13105 127428 -82426 211496 -57625 -195081 -229949 -185550 -140916 117200 -16886
19401A750M2529h631A29488c87924a37210b2907A69378a60282d3465a0212r7252
$$ 1750 44279 -8631 129488 -387924 -137210 -22907 169378 -160282 -43465 -10212 -107464
19390a07464j19199L2785b7101k54227A0954c16748F5796f2763b3787n7425m3416
$$ -107464 -226663 -193878 -27101 -281328 10954 -316748 65796 -62763 -23787 -81212 -124628
19379a24628H9670K778j0202b16687N7608n6857K465a01615M9436j88928F1417
$$ -124628 89670 92448 82246 -216687 -159079 -215936 -213471 -101615 -52179 -241107 61417
19367h2831k7503o1567A54289a93191k46107g2583A1680g2431k04991b1466I8951
$$ -82831 -110334 -171901 154289 -193191 -439298 -72583 11680 -72431 -277422 -21466 98951
19355b6612k14254A39756c49108i6033E8984O2257c49826i0621j08515R8603j12674
$$ -26612 -240866 139756 -349108 -96033 58984 121241 -349826 -90621 -199136 -100533 -213207
19344b13207J9296b1117p7746B5595a41174F5343n757c01177a00121M0287g735
$$ -213207 -193911 -21117 -98863 25595 -141174 65343 59586 -301177 -100121 -59834 -7735
19332c73225d0850r0530A39567e2633j66633f6300j89993e1849j7795k03662A48251
$$ -373225 -40850 -131380 139567 -52633 -219266 -66300 -256293 -51849 -69644 -273306 148251
19320C3650j435N0910M7776a13010b8115k9252B02904J161a50970p3670R6318
$$ 33650 32215 83125 130901 -113010 -28115 -57367 202904 204065 -150970 -224640 -128322
19309a28322C1108c54888C6992K6589c39628a02109F262J77996E56c8036K953
$$ -128322 31108 -354888 36992 63581 -339628 -102109 6262 184258 556 -38036 -35083
19298c5083o9530M142B5661J07852a87912A75864a15881c6378j93096D3204j9722
$$ -35083 -104613 -100471 25661 133513 -187912 175864 -115881 -36378 -229474 43204 23482
19287B3482K28766C8233d16308I8879b9398C22452j15216a53081H6190b67821
$$ 23482 252248 38233 -416308 98879 -29398 322452 207236 -153081 86190 -267821
19276b62792J31345r3323f222l47409E9242A7440b6352C06947j49396C3461e8884
$$ -262792 -131447 -224770 -6222 -353631 59242 17440 -26352 306947 157551 33461 -58884
19264i0785p7480k2643A26319b3312j62013N5708c2450A16796a58571j33859J33348
$$ -90785 -168265 -190908 126319 -23312 -185325 -129617 -32450 116796 -158571 -292430 -159082
19253a59082J629G3373c13982N2649l4457I1995c8698I6383a69302l17280a73306
$$ -159082 -157453 73373 -313982 -261333 -295790 91995 -38698 96383 -169302 -486582 -173306
19241A2380a82756G743P5964a81952A5428b80338c0227k3595l26700C22928B4469
$$ 12380 -182756 7743 83707 -181952 15428 -280338 -30227 -53822 -380522 322928 24469
19229c2020r8436c2493F9425b02894B6077a27190E1301c1644m68020B0857a84633
$$ -32020 -130456 -32493 69425 -202894 26077 -127190 51301 -31644 -499664 20857 -184633
19217G8433e3172D7582a87172b5328A0238d0439o1273K1924p7563n0691n5336
$$ 78433 -53172 47582 -187172 -25328 10238 -40439 -101712 -79788 -157351 -208042 -263378
19206b63378B2007K9390b23771A0145P3482b24976D9534a84927A80379d9528A76515
$$ -263378 22007 51397 -223771 10145 83627 -224976 49534 -184927 180379 -49528 176515
19194d219E6398J2879a4578j29636F2808b09572o7185A3947b56331g5996k53988
$$ -4219 56398 69277 -14578 -144214 62808 -209572 -276757 13947 -256331 -75996 -329984
19183c29984A26987l6687k165J48103a84408m8686D5810c03639e3020I9156a00331
$$ -329984 126987 90300 88135 236238 -184408 -233094 45810 -303639 -53020 99156 -100331
19171c16973E6031k1223O1149c24444b20j09240j81416J11187I2651D3913P8558
$$ -316973 56031 34808 95957 -324444 -220 -109460 -290876 -179689 92651 43913 122471
19160A22471j2349l8962c4967p3147D4897A9385b09921j12203c1806n01458d1241
$$ 122471 110122 71160 -34967 -108114 44897 19385 -209921 -322124 -31806 -533264 -41241
19148a7164E7860a73099M3159B4195a54974j22096A77553n3235g9046F2253a61566
$$ -17164 57860 -173099 -129940 24195 -154974 -277070 177553 124318 -79046 62253 -161566
19136G0822J95034a03711q0586A03734l416O8101F7267b0548j49414O8177A98823
$$ 70822 265856 -103711 -184297 103734 100318 168419 67267 -20548 -169962 -101785 198823
19124d07032J72727A11917f7449A43853b86802I8163B3250a3905j55344A46559
$$ -407032 -234305 111917 -67449 143853 -286802 98163 23250 -13905 -169249 146559
19113A44249b44008J18346C6641d38787a21984I3104a38869c1673n1324p5985
$$ 144249 -244008 -125662 36641 -438787 -121984 93104 -138869 -31673 -82997 -158982
19103a58982L5077A11346a07092C00517a10738a7116j32784A03520K7746F3097
$$ -158982 -123905 111346 -107092 300517 -110738 -17116 -149900 103520 131266 63097
19092B7751b28485p1107f6110l3362J303H0271a48575b6097g255j59407F5352
$$ 27751 -228485 -299592 -66110 -99472 -98169 80271 -148575 -26097 -7255 -166662 65352
19080c63A02026a35657H9077K3044E4800J27558e1322k66728a05454k20118i5627
$$ -363 102026 -135657 89077 112121 54800 182358 -51322 -318050 -105454 -325572 -95627
19068d4317p2436j5419R535l1219E4344c27495a0214k19549A3761c05701i0083
$$ -44317 -116753 -132172 -122637 -153856 54344 -327495 -10214 -229763 13761 -305701 -90083
19056b38073A21560b81641a3268k51603l75252a45844B68911a76455A96375J45229
$$ -238073 121560 -281641 -13268 -264871 -640123 -145844 268911 -176455 196375 341604
19046C41604a33766L5450h914j33706o6793d5987E8607k6238b51561d6701A01526
$$ 341604 -133766 -98316 -8914 -142620 -209413 -45987 58607 32369 -251561 -46701 101526
19034b84683D1980Q4156L0754a11297J0345B9634g9582q7659N9070n5189G9087
$$ -284683 41980 126136 156890 -111297 -100952 29634 -79582 -167241 -108171 -163360 79087
19022b59182D6550A4333K97938r9865f323B12977c57981C2511h306q2916q0595
$$ -259182 46550 14333 312271 212406 -6323 212977 -357981 32511 -8306 -91222 -171817
19011a71817A09544K0712a69103j30064B32105m7139D2374N1820C6313b4922l65782
$$ -171817 109544 130256 -169103 -299167 232105 184966 42374 94194 36313 -24922 -390704
19000c90704E7745i2345k94874a83018e835k63922a24081A90253c2295B04733
$$ -390704 57745 -92345 -387219 -183018 -5835 -269757 -124081 190253 -32295 204733
18989D73K46559g641I5721a20828d4890B4901b36186A31230R8021I5937a49644
$$ 473 247032 -7641 95721 -120828 -44890 24901 -236186 131230 229251 95937 -149644
18977B2582a99341c597A24062c54103a17418j0310B96572L4518h747p496A04484
$$ 22582 -199341 -3597 124062 -354103 -117418 -127728 296572 331090 -8747 -16243 104484
18965B39573G9073J16248M116n8928c3319D18012g3938H3705c33628G4557a3501
$$ 239573 79073 195321 199437 140509 -33319 418012 -73938 83705 -333628 74557 -13501
18953a79614J1973B23802c38060a08544l20238B0588b51521b6867l1423j7253
$$ -179614 -167641 223802 -338060 -108544 -428782 20588 -251521 -26867 -58290 -75543
18943g5543B67038i5659c646B5422R0852d773k21786E723h3255q3525L0066A6914
$$ -75543 267038 -95659 -3646 25422 116274 -4773 -226559 5723 -83255 -166780 -136714 16914
18930a14076C8764e0007B01217a82464A08415a75944l471A0128e4500j38444A68530
$$ -114076 38764 -50007 201217 -182464 108415 -175944 -179415 10128 -54500 -192944 168530
18918a70587a3141A25789a38131E998J31276b70730M7567a6376C9075P4467c3708
$$ -170587 -13141 125789 -138131 5998 137274 -270730 -223163 -16376 39075 113542 -33708
18906e363p5510B17677B4570b20352A45675D8109a2995B03134i1459G6191J7027
$$ -5363 -80873 217677 24570 -220352 145675 48109 -12995 203134 -91459 76191 93218
18895I3218H93i2660k44708O1618K054a06212d6928l51793a01052B58327E4093
$$ 93218 893 -92660 -337368 -275750 -273696 -106212 -46928 -398721 -101052 258327 54093
18883F9089b80626E7527M2032b20604J5088h8263M1159k31027i1422F755c78299
$$ 69089 -280626 57527 99559 -220604 -205516 -88263 -47104 -278131 -91422 6755 -378299
18871A14149a34882C7201c49874e8384A37959f3169k29149A9679b58926i9773
$$ 114149 -134882 37201 -349874 -58384 137959 -63169 -292318 19679 -258926 -99773
18860a8363j28201G4991i3126K7255E2603O8070a71865b8148l82797b1584j64859
$$ -18363 -146564 74991 -93126 -65871 52603 120673 -171865 -28148 -410945 -21584 -186443
18849a86443n4476B2428K31757d2166j11589G9570c40150a10349A50714a26187
$$ -186443 -240919 22428 254185 -42166 -153755 79570 -340150 -110349 150714 -126187
18838f4248j03549k8343O6818D69114b70638E1820J03608i1895J7320b7737l23132
$$ -64248 -167797 -196140 -129322 469114 -270638 51820 155428 -91895 -74575 -27737 -350869
18827c50869A11710c01525d0538j04469K7380B3203a31952c656r9204j02831d7108
$$ -350869 111710 -301525 -40538 -145007 -117627 23203 -131952 -3656 -102860 -205691 -47108
18815a49147M3531b1307A42093M7241o6630C9601A4746A22a25117c1091a3827
$$ -149147 -105616 -21307 142093 189334 122704 39601 14746 122 -125117 -31091 -13827
18803b26888B10434i4013L6483a639l49728g2759j444l36341J65825A81302d1363
$$ -226888 210434 -94013 -57530 -1639 -351367 -72759 -74203 -410544 -244719 181302 -41363
18791G4087O7961c22014C5285a18441B38093A00725a96966M5073R823F4197P3385
$$ 74087 142048 -322014 35285 -118441 238093 100725 -196966 -151893 -142070 64197 137582
18780A37582b69296N1492a6840E5804b69173d1642I2619h529E8992A7764a90084
$$ 137582 -269296 -217804 -16840 55804 -269173 -41642 92619 -8529 58992 17764 -190084
18768C13815h9186j14276E857f08554b35444A58463e6353k7423a216E4922j911
$$ 313815 -89186 -203462 5857 -608554 -235444 158463 -56353 -83776 -1216 54922 53011
18757E3011J59419b77159O1174c9055n0013m6395C61734j32755K2912n3926d1976
$$ 53011 212430 -277159 -215985 -39055 -89068 -135463 361734 228979 251891 197965 -41976
18745b22889R722A4538a87546G3564i5572a909o962E2180d01634d5471j34210
$$ -222889 -213167 14538 -187546 73564 -95572 -1909 -8871 52180 -401634 -45471 -179681
18734a79681M8851m8240B73199a74311j4744L7063p2198A09463C8470h6328D788
$$ -179681 -130830 -179070 273199 -174311 -189055 -151992 -224190 109463 38470 -86328 4788
18722A30330a679J39n4534q7687H4958b07093C51639a28321l43269A4441d5894
$$ 130330 -1679 -1540 -56074 -143761 84958 -207093 351639 -128321 -471590 14441 -45894
18710b33209B81697a45329n1622B91685b4800j53359A23749l6760J04564g3884
$$ -233209 281697 -145329 -196951 291685 -24800 -178159 123749 86989 191553 -73884
18699C45866g3611B83770I2804c6204A22142B9960M6629a33545E5669a20512A10325
$$ 345866 -73611 283770 92804 -36204 122142 29960 76589 -133545 55669 -120512 110325
18687c72210b6045B77512a23480F6002b0730A9317p898J91018b72416G4728N6700
$$ -372210 -26045 277512 -123480 66002 -20730 19317 11419 202437 -272416 74728 131428
18676A31428L7613J16615g7636m0033G8390f9212A08426j814J95480k3200c9119
$$ 131428 169041 285656 -77636 -117669 78390 -69212 108426 106612 302092 278892 -39119
18664c32278a1210j07705j39088O1045e8978A50897a03818A06846K6255M0027
$$ -332278 -11210 -118915 -258003 -196958 -58978 150897 -103818 106846 133101 173128
18654A73128e2417h49m3521j6603k08557G1433b38621r3498J01233r7140L8731
$$ 173128 -52417 -849 -44370 -60973 -269530 71433 -238621 -332119 -230886 -328026 -289295
18643b89295b2938B4193c18620f967j26480L7214j06509j79635B4757h7477B48669
$$ -289295 -22938 24193 -318620 -6967 -133447 -96233 -202742 -382377 24757 -87477 248669
18631i2180j85394a3053A02064b00701C09912h9359p4650m1722h1465B08250J12855
$$ -92180 -277574 -13053 102064 -200701 309912 -89359 -164009 -205731 -81465 208250 321105
18620C21105c33180j47235i9311l7691M3564M1338C6875a72828k13108A63a08965
$$ 321105 -333180 -480415 -99311 -137002 -93438 -52100 36875 -172828 -385936 163 -108965
18608A29088m3204K13579c8007A22878L7891b47337e446r3524b6547n0181o9021
$$ 129088 85884 299463 -38007 122878 160769 -247337 -5446 -98970 -26547 -76728 -145749
18597a45749A23974l0588r542J4754d4829B07497G0163N1354J26142d7936k68934
$$ -145749 123974 93386 83844 98598 -44829 207497 70163 121517 247659 -47936 -316870
18586c16870A90714a56715b2481A225b7769q21A01783h0404B04317d81125a92555
$$ -316870 190714 -156715 -22481 1225 -27769 -28590 101783 -80404 204317 -481125 -192555
18574A13881E2358b54135B31304b34880I734b96741J41780n7559A38359a09693
$$ 113881 52358 -254135 231304 -234880 9734 -296741 -154961 -212520 138359 -109693
18563A02222a856k60233j47771e9925n6065j780h787l3700D0112a82425L9284
$$ 102222 -1856 -262089 -409860 -59925 -115990 -117770 -8787 -42487 40112 -182425 -143141
18552a43141l7334A38202a83141g385A85125D3632a18533o397c6112j08099m5751
$$ -143141 -180475 138202 -183141 -7385 185125 43632 -118533 -124930 -36112 -144211 -189962
18541a89962B6952J13288c71183O0338A10598e1041p1706e812G9047k3513A6873
$$ -189962 26952 140240 -371183 -310845 110598 -51041 -122747 -5812 79047 55534 16873
18529i9700G5665k4162a6965M352l36060B5841O5632c65360d4913j81950j52590
$$ -99700 75665 51503 -16965 -12613 -348673 25841 91473 -365360 -44913 -226863 -379453
18518c79453A48797P2147F8524a02788k57058a36195A97233h0877f310k72687
$$ -379453 148797 220944 68524 -102788 -359846 -136195 197233 -80877 -6310 -278997
18508b78997O6003A43056F4140j705a0724A7544K6248N4139a14241L798G9993
$$ -278997 -212994 143056 64140 62435 -10724 17544 43792 97931 -114241 -110443 79993
18496a63306P3047m4930m5599o1546A7649a9975A3583J20406Q3728O1601D787
$$ -163306 -90259 -135189 -180788 -242334 17649 -19975 13583 133989 217717 279318 4787
18484a32207c8030o399A15061D0455a58338M2449j33142B10682q0472a08556j40773
$$ -132207 -38030 -44429 115061 40455 -158338 -115889 -249031 210682 130210 -108556 -249329
18473b49329O8806P3886k40890Q1022A82313b97559C9152a34729n6334C4131K5937
$$ -249329 -180523 -106637 -347527 -266505 182313 -297559 39152 -134729 -191063 34131 60068
18462F0068K96486I6532a15567K9684k38969a10928A8968b60455E2181a85578
$$ 60068 356554 96532 -115567 -85883 -324852 -110928 18968 -260455 52181 -185578
18451g0954J0267j91016n0215K1317J17726D5474c59161A80072a34914B26324
$$ -70954 -60687 -251703 -301918 -280601 -162875 45474 -359161 180072 -134914 226324
18440b21562i744k0806o565G0218J02515b16411G839a1746A16676b71725q2744
$$ -221562 -9744 -30550 -37115 70218 172733 -216411 7839 -11746 116676 -271725 -354469
18429c54469A57617h1270K2996h607A24181a09101d7696j32808N3416A74088j2932
$$ -354469 157617 -81270 -58274 -8607 124181 -109101 -47696 -180504 -127088 174088 161156
18418A61156p409b5209G8117a22441J8442M0422j33334k2068e7363l00527a20900
$$ 161156 153747 -25209 78117 -122441 -103999 -63577 -196911 -218979 -57363 -357890 -120900
18406A50656F7602N0495g3770A17555K1975a82243a9569q38j69195c08o1424A02487
$$ 150656 67602 118097 -73770 117555 139530 -182243 -19569 -20407 -189602 -308 -61732 102487
18393F1469b0798N982q2205m33578B28514A13878k2340b28915h4931J7413j73337
$$ 61469 -20798 -14816 -97021 -530599 228514 113878 91538 -228915 -84931 -67518 -240855
18382b40855i0038C61983b33815g0992d038j27465l56653H4653a56113f3227K0168
$$ -240855 -90038 361983 -233815 -70992 -4038 -131503 -488156 84653 -156113 -63227 -43059
18371d3059A07176a04072K7110E7222J10005R9977B8451a60325I614K43586d604
$$ -43059 107176 -104072 -76962 57222 167227 267204 28451 -160325 9614 253200 -4604
18359a35008I9657f9344j53059F69J7365K22684h9893K9943K7719I2275b12236
$$ -135008 99657 -69344 -222403 669 18034 240718 -89893 -59950 -32231 92275 -212236
18347I9934f6504o6691E7011J42359a74989F0517b1146B7110g0114I9363m9383
$$ 99934 -66504 -133195 57011 199370 -174989 60517 -21146 27110 -70114 99363 49980
18336D9980a0374B344a39651j3393c392D303J51537a08964A98640a26872j19990
$$ 49980 -10374 2344 -139651 -153044 -3392 4303 155840 -108964 198640 -126872 -246862
18325b46862a05657j80183G2569J05909b88783p880A8997O3214c09748C90904
$$ -246862 -105657 -285840 72569 178478 -288783 -296663 18997 82211 -309748 390904
18314a89567c4130A52971a26743k98162J58673D3026d8746a1947C0288A2034D768
$$ -189567 -34130 152971 -126743 -424905 -266232 43026 -48746 -11947 30288 12034 4768
18302a67472O5809K6531A81614a65773B74122b66815a05434B02198F5920c4409
$$ -167472 -101663 -75132 181614 -165773 274122 -266815 -105434 202198 65920 -34409
18291d50154A46389B5621c39082F8666b5978q3945B59061a68242f2380A53472
$$ -450154 146389 25621 -339082 68666 -25978 -109923 259061 -168242 -62380 153472
18280a62700B2535b17666I0103a84397B60365E5899d83937B33103F1380a10028
$$ -162700 22535 -217666 90103 -184397 260365 55899 -483937 233103 61380 -110028
18269A00151m6524j5639k290J07559h3554A82489b33860B43494a01983B08162
$$ 100151 53627 37988 35698 143257 -83554 182489 -233860 243494 -101983 208162
18258c3756n9445j03843A69395b32388C2338b36218R0318G9340a77834P6130A28675
$$ -33756 -93201 -197044 169395 -232388 32338 -236218 -145900 79340 -177834 -101704 128675
18246d0583H1505e4590B38314l0839b19096N8188j48279A49110a5933o7596F4528
$$ -40583 81505 -54590 238314 207475 -219096 -160908 -309187 149110 -15933 -83529 64528
18234h5577j84531m9225G4674a04054B59099b20590m4552B03208c22789b397j91958
$$ -85577 -270108 -319333 74674 -104054 259099 -220590 -265142 203208 -322789 -2397 -194355
18223a94355j4188C399b57380A643a15234N0119C77860A72309a12077B16321G5141
$$ -194355 -208543 3399 -257380 1643 -115234 -65115 377860 172309 -112077 216321 75141
18211d3274m2668G8245G526c56673e0076A46056R0693a29176A04748b21771E5596
$$ -43274 -85942 78245 7526 -356673 -50076 146056 236749 -129176 104748 -221771 55596
18199c8390k926o639r712o0886n9821k05457C09317j25661i3500A1398J31463
$$ -38390 -41316 -47955 -57667 -118553 -178374 -383831 309317 183656 -93500 11398 142861
18188A42861D6607a6454j6618j11357G270h5090L3230k8445R835o5669H893a38394
$$ 142861 46607 -16454 -33072 -144429 7270 -85090 -51860 -80305 -70470 -136139 8893 -138394
18175i5037o2458D7652M2305a6763C0347N8148C2445b03619Q4276n3065b6767
$$ -95037 -157495 47652 89957 -16763 30347 88495 32445 -203619 -119343 -172408 -26767
18163a4490j68667N3061G4971b35560C5741a04557L9504B46934b7758B2040A283
$$ -14490 -183157 -130096 74971 -235560 35741 -104557 -65053 246934 -27758 22040 1283
18151C28340j48515m6285c08161B1260R6726b65820j0253a4803C03412o550a72393
$$ 328340 179825 133540 -308161 21260 117986 -265820 -276073 -14803 303412 296862 -172393
18139A15429a44031C23699E2792A2595M4334e4899J0888j50815k4423e8181b3353
$$ 115429 -144031 323699 52792 12595 56929 -54899 -44011 -194826 -219249 -58181 -23353
18127a74712j89901F6925a26769A75663a56392o4613B27321a02538B3988P8932
$$ -174712 -364613 66925 -126769 175663 -156392 -221005 227321 -102538 23988 102920
18117A02920c62362g0519B56292H9798a0645k51243O7823g6704b9139p4566G0273
$$ 102920 -362362 -70519 256292 89798 -10645 -261888 -194065 -76704 -29139 -103705 70273
18105a04724H8646h8478A68213c7275l57428R9567J05371A25659J3304O6596b56832
$$ -104724 88646 -88478 168213 -37275 -394703 -295136 -189765 125659 138963 205559 -256832
18093A20544a32903b40A65911m1355a05444A45479b6260j12633C7436e5640C46858
$$ 120544 -132903 -240 165911 124556 -105444 145479 -26260 -138893 37436 -55640 346858
18081H1030K047c21998a9695C11157a63899e1245o1619c2597C615a09564r1983
$$ 81030 83077 -321998 -19695 311157 -163899 -51245 -112864 -32597 3615 -109564 -201547
18070b01547o2306F7024l0874c0562E9572a18491M8528k48532B9998K41677I7723
$$ -201547 -263853 67024 36150 -30562 59572 -118491 -69963 -318495 29998 271675 97723
18058e5432q2327D0814c76740E8279a62619B02821K5537E8819K25739C0393g2928
$$ -55432 -137759 40814 -376740 58279 -162619 202821 228358 58819 284558 30393 -72928
18046H5520K3863K49582j73320H6914J93946a60348n4643R6934A81842m5749e6537
$$ 85520 109383 358965 185645 86914 280860 -160348 -214991 -118057 181842 136093 -56537
18034i0046B57202a54756i03r3730M210m0565B91497c25793J06116i1212D6670
$$ -90046 257202 -154756 -903 -94633 -90423 -130988 291497 -325793 -219677 -91212 46670
18022a47273j07531H557J70885c12524J02858A07242b9165k6570l1579B59609
$$ -147273 -254804 8557 179442 -312524 -209666 107242 -29165 -55735 -87314 259609
18011a03126j8896k11166J09096A35361F3387f0160B33237p4748d5007l7636c5465
$$ -103126 -122022 -333188 -224092 135361 63387 -60160 233237 158489 -45007 -82643 -35465
17999b38336A49877b4411k73582A29035K6063m6657Q7708a11712k5704C39024
$$ -238336 149877 -24411 -297993 129035 155098 108441 196149 -111712 -137416 339024
17988b6912j13214A00285d3913J5342C39919A60729F1541b9733C2533a2136A55693
$$ -26912 -140126 100285 -43913 -28571 339919 160729 61541 -29733 32533 -12136 155693
17976b70667A03797G095f09A21259i2396J8137H2331b54410J09715f8780j03524
$$ -270667 103797 7095 -609 121259 -92396 -74259 82331 -254410 -144695 -68780 -172304
17965a72304A57907a77294D5095b49811B81424a26182A78111c2226A55594G4064
$$ -172304 157907 -177294 45095 -249811 281424 -126182 178111 -32226 155594 74064
17954e23974G3508a70294p0846q4567A23715c440C58118p2870c51031A27830C5443
$$ -523974 73508 -170294 -241140 -325707 123715 -3440 358118 285248 -351031 127830 35443
17942A15839P7028a5199B2907h3300A2646K04637b8600B62688h3740P874C4983
$$ 115839 192867 -15199 22907 -83300 12646 217283 -28600 262688 -83740 -75866 34983
17930e2455q1213A71142a12399a6897r5354A34004j3938a85501N4096j74151d2042
$$ -52455 -133668 171142 -112399 -16897 -112251 134004 120066 -185501 -131405 -305556 -42042
17918a40487r1901d6322B30768b62279e0096A92994N2087i3365l5783B8417O9781
$$ -140487 -232388 -46322 230768 -262279 -50096 192994 245081 -93365 -129148 28417 98198
17907I8198h2024F6914i6148C8276b09968j95188C74491d130I723h1803I0681
$$ 98198 -82024 66914 -96148 38276 -209968 -405156 374491 -4130 9723 -81803 90681
17895a70915B99823Q5495A92472J44332f4133B80957a55010C29698F352f9280
$$ -170915 299823 385318 192472 336804 -64133 280957 -155010 329698 6352 -69280
17884A9456b58733A35631b4151p867D2045J86077A06056b16226B19111b4399o0887
$$ 19456 -258733 135631 -24151 -32018 42045 228122 106056 -216226 219111 -24399 -85286
17873h5286A19740l0558a64161c9345O90F4963b39311l4561K6424g4618l167E07554
$$ -85286 119740 89182 -164161 -39345 -38655 64963 -239311 -273872 -247448 -74618 -77785 507554
17860a65381c5540B00897c89372C0663a08425A11274J79103e59582C32891A13000
$$ -165381 -35540 200897 -389372 30663 -108425 111274 290377 -559582 332891 113000
17849b06864M3852A5996i1568I4009a29058R24c9432m4307j080A47270b32915
$$ -206864 -163012 15996 -91568 94009 -129058 -128134 -39432 -83739 -84819 147270 -232915
17837f5105j52764m7109B73842a07333r9331K2051B1623M4558O701K74626f23
$$ -65105 -217869 -264978 273842 -107333 -206664 -184613 21623 66181 72882 347508 -623
17825D3949R147a10892J0651j29689f6424C45K02235N3624n1321m7182J82490
$$ 43949 53096 -110892 -100241 -229930 -66424 345 202580 256204 204883 157701 340191
17814C40191E7340R639a62071A70038A6317J32457d3396k24495b508p9361B68199
$$ 340191 57340 66979 -162071 170038 16317 148774 -43396 -267891 -2508 -81869 268199
17802a11460b1572c662j15241j57157c7977k3846B5326g1597A40645O0035i7804
$$ -111460 -21572 -3662 -118903 -276060 -37977 -61823 25326 -71597 140645 200680 -97804
17790i3983M5957a1671m9736J4096E76892b6438I0570a45943B61069o7466a41411
$$ -93983 -48026 -11671 -61407 -47311 576892 -26438 90570 -145943 261069 193603 -141411
17778i7757B15301b97797a11825n337A06972a767H83J55111d1620C39746A3806
$$ -97757 215301 -297797 -111825 -117162 106972 -1767 883 155994 -41620 339746 13806
17766G4154J4547N3748K2807l565n116q8b37953J07192H7378b62440Q8685A26946
$$ 74154 88701 142449 165256 161691 156575 156487 -237953 -130761 87378 -262440 -173755 126946
17753d0662E3950R1653g12A64405F1108k2025M6427h620B46088j19620n5124b6714
$$ -40662 53950 145603 -712 164405 61108 39083 85510 -8620 246088 126468 71344 -26714
17740a83690C30161a32790F0461J93265a24656b560B78672i4872m3152A19120
$$ -183690 330161 -132790 60461 253726 -124656 -2560 278672 -94872 -138024 119120
17729b24417B37132n5633a43718I3440b69962h3957E0672L5448M0565J50935r3827
$$ -224417 237132 181499 -143718 93440 -269962 -83957 50672 86120 126685 277620 183793
17718A83793J08453F8464A2790L35939A41873a0997j45622B73270j26722k1699
$$ 183793 292246 68464 12790 348729 141873 -10997 -156619 273270 146548 124849
17708A24849P8992a60530N5630m7446A71550J53090E130K53169a905j33096A17482
$$ 124849 203841 -160530 -104900 -152346 171550 324640 5130 258299 -1905 -135001 117482
17696f2540q0531J6034B89402c3403k56099F6522K1403M524l0033P8851M3933
$$ -62540 -143071 -127037 289402 -33403 -289502 66522 87925 92449 62416 141267 185200
17685A85200a0238G9108p33L8499L3884f4627a5668A24200b4623m1087A08185
$$ 185200 -10238 79108 78375 116874 150758 -64627 -15668 124200 -24623 -65710 108185
17673a8456B2012k686M5926J26900a09257g610q5782B58115a1207A23270d0060
$$ -18456 22012 19326 65252 192152 -109257 -7610 -93392 258115 -11207 123270 -40060
17661i496l4032g246j66063O1230A80933a32537K8759A68668h6183F6067j7062
$$ -9496 -43528 -7246 -173309 -112079 180933 -132537 -103778 168668 -86183 66067 49005
17650D9005J82630E3415M1014g6355H9919J3951J0879e7074j9074B06033K73202
$$ 49005 231635 53415 94429 -76355 89919 103870 114749 -57074 -76148 206033 479235
17639D79235H5785R5185p0391E4496e8178A77823C8706Q6946a3279A33770O3858
$$ 479235 85785 180970 110579 54496 -58178 177823 38706 125652 -13279 133770 197628
17628A97628e5602q9916H229P8273d1050G1708M01010A16741e4859o2894a1843
$$ 197628 -55602 -145518 8229 86502 -41050 71708 472718 116741 -54859 -117753 -11843
17616A09066I039a16705B96797b20076E6893J02041a10607A34893a15922c6176
$$ 109066 9039 -116705 296797 -220076 56893 158934 -110607 134893 -115922 -36176
17605f9394B2982O8504d11190J06451A58610B0944h0768C27922f5567A28745a15432
$$ -69394 22982 91486 -411190 -304739 158610 20944 -80768 327922 -65567 128745 -115432
17593a55398l5031A67447o9253a77239b6978A68023p2461C1888J47222c57325
$$ -155398 -190429 167447 98194 -177239 -26978 168023 95562 31888 179110 -357325
17582E35846a39626C35206n9040A08722a21589a8163j31356A8674j225M6207J98513
$$ 535846 -139626 335206 276166 108722 -121589 -18163 -149519 18674 17449 63656 262169
17571B62169m2230l3508H6078L9655J08679j02839h9030A64822J41099c6399A36850
$$ 262169 219939 186431 86078 125733 234412 131573 -89030 164822 305921 -36399 136850
17559F05J53085D6210e254A24161a0754j21998m1736A89420D6157L7497J95392
$$ 605 153690 46210 -5254 124161 -10754 -132752 -174488 189420 46157 83654 279046
17548B79046b1711C47065a06521A5351R0477j6408J92668j30546J43272a27074
$$ 279046 -21711 347065 -106521 15351 105828 89420 282088 151542 294814 -127074
17537a52548I9672R1780j4433E2471b5943E5510R1150K32193j69247J56166a346
$$ -152548 99672 191452 177019 52471 -25943 55510 146660 378853 209606 365772 -1346
17525a02605B25896Q0167Q4529j93793L50016j70059j8541L0964j44558h3I3853
$$ -102605 225896 306063 390592 196799 546815 376756 358215 389179 244621 -83 93853
17513C16729G9073J93465q9440k5681l3474J17642M2072P3405j888Q4258j21465
$$ 316729 79073 272538 183098 157417 123943 241585 283657 357062 355174 439432 317967
17502C17967L6152A75255K76942H6135K12072B8283J22636k7041K30263K2428
$$ 317967 354119 175255 452197 86135 298207 28283 150919 123878 354141 376569
17492C76569f4363B9325P5529R6420n7113J3134N37d2227B14117O85k7680q9740
$$ 376569 -64363 29325 104854 201274 144161 157295 157832 -42227 214117 214802 187122 97382
17480I7382O0084K91253a56723D5810M32629a49048C93776p7516n6621q275K64400
$$ 97382 157466 448719 -156723 45810 478439 -149048 393776 316260 259639 251364 515764
17469E15764R8085A88836a01897E9474P6799E0473O1490j7044J35684C1069f069
$$ 515764 613849 188836 -101897 59474 136273 50473 111963 94919 230603 31069 -6069
17457A3515N96905a01976A83746M08891B14628R2676g3700C49442J6705B2026
$$ 13515 610420 -101976 183746 592637 214628 307304 -73700 349442 366147 22026
17446C40190k4172K05866l3948a39163D9343K54042J33026N8416A08775K73353
$$ 340190 316018 521884 487936 -139163 49343 303385 436411 494827 108775 382128
17436C82128h6034F914K23101H6680K79259A0054K53907j13159N2884J76869j48559
$$ 382128 -86034 6914 230015 86680 365939 10054 263961 150802 203686 380555 231996
17425B31996k169a74456g0137B91537j18984k6256J80291A58436L27415j00993
$$ 231996 229827 -174456 -70137 291537 172553 146297 326588 158436 485851 384858
17415C84858B9289Q246L33165A75252D6172J74816e3918B68175k1796J54602n4042
$$ 384858 29289 37535 370700 175252 46172 220988 -53918 268175 246379 400981 346939
17404C46939p1521K6019R5369B6814J24319g1059B6215J98408n1141B4768K42729
$$ 346939 275418 301437 396806 26814 151133 -71059 26215 224623 173482 24768 267497
17393B67497C1526J38461K61555j07948p862H2183B4443J28341b23596A29174
$$ 267497 31526 169987 431542 323594 315732 82183 24443 152784 -223596 129174
17382B97495j05225C2748J90604L19000E4518K02546F5708R7527N0722P4644c398
$$ 297495 192270 32748 223352 542352 54518 257064 65708 163235 213957 288601 -3398
17370E46102A79884n5007J36733L0399A03145K03730B6989h2595B57506A19277
$$ 546102 179884 124877 261610 292009 103145 306875 26989 -82595 257506 119277
17359I223J22919a0820C43147d2136H0599J41708r6002K27759Q8503I5693L84608
$$ 9223 132142 -10820 343147 -42136 80599 222307 126305 354064 442567 95693 480301
17348D80301E2313J55009a1651k0083I6098k680N4565n4789a96345c3279A80058
$$ 480301 52313 207322 -11651 -31734 96098 93418 147983 93194 -196345 -33279 180058
17336e5468B23425J14852G0381b40659A27335b7446F5320J99071a35838B20433
$$ -55468 223425 338277 70381 -240659 127335 -27446 65320 264391 -135838 220433
17325A30393K39667A73472P0463p8716c047D57050a95353I3576B3425b64447B36966
$$ 130393 370060 173472 243935 165219 -3047 457050 -195353 93576 23425 -264447 236966
17313C76479g3319I4332M0666J04882p7929N0240I0849k8915K0611A7668J53008
$$ 376479 -73319 94332 134998 239880 161951 212191 90849 61934 82545 17668 170676
17302A70676K95531j02003r5291J16383j30477Q3381b35941B51112H0272K51676
$$ 170676 466207 364204 268913 385296 254819 338200 -235941 251112 80272 331948
17292C31948a55446B40232o0926J27846J0161e9970k28639B24156E6322a6713
$$ 331948 -155446 240232 179306 307152 317313 -59970 -288609 224156 56322 -16713
17281B5207a36072A95833L02533G3352J18557J0428F9093J03464K70245B10753
$$ 25207 -136072 195833 498366 73352 191909 202337 69093 172557 442802 210753
17270B68469n6361b08215A06420h2609B87106j14786D8932J72399M5070a0104
$$ 268469 212108 -208215 106420 -82609 287106 172320 48932 221331 266401 -10104
17259B8305L20793M6112q4179J9226A23141f1523A56202a58562B47885r0961J16591
$$ 28305 349098 395210 311031 330257 123141 -61523 156202 -158562 247885 156924 273515
17248B73515J29031A16842J0512d6146A68762J30024D8542M6451h4116A74528
$$ 273515 402546 116842 127354 -46146 168762 298786 48542 94993 -84116 174528
17237B98324p7753K23646c608C98438A54389K68281b7268D4001M7447K8045J75178
$$ 298324 220571 444217 -3608 398438 154389 422670 -27268 44001 91448 119493 294671
17226B94671Q5172A72358J48375E290J17682d3744B24804K09809j61592J15773
$$ 294671 379843 172358 320733 5290 122972 -43744 224804 434613 273021 388794
17216C88794j80030L48092A38313K98678b6538D39209A18245E7636Q4531B5380
$$ 388794 208764 556856 138313 436991 -26538 439209 118245 57636 142167 25380
17205d013D2072M6447J47274j11289E2920K01945L41216k66235J15450k06264
$$ -4013 42072 88519 235793 124504 52920 254865 596081 329846 445296 239032
17195B39032N8140m5587A1670f7603E7771R3286J67388k4317J97119A49856k7723
$$ 239032 297172 251585 11670 -67603 57771 151057 318445 294128 491247 149856 122133
17184A22133K28763p4334K45155k7505r4461E504K58957A07671L96286O3689k04196
$$ 122133 350896 276562 521717 494212 399751 5504 264461 107671 503957 567646 363450
17173C63450A81578J49786J72899k44861A14686K11994P7265j14030I5790J11541
$$ 363450 181578 331364 504263 259402 114686 326680 403945 289915 95790 207331
17163B07331J76812J1915j34198O3742J2262J76096k43034O4783j27729J7913
$$ 207331 384143 396058 261860 325602 337864 513960 270926 335709 207980 225893
17153B25893r9986J15491E4261N29500k17876j70193J27441O8882l3818m468Q9225
$$ 225893 125907 241398 54261 583761 365885 195692 323133 392015 358197 353729 442954
17142D42954o2708N9677l3443O8138j74813J71233k29142n2759O5783K17955K3077
$$ 442954 380246 439923 406480 474618 299805 471038 241896 189137 254920 472875 495952
17131D95952j9921B08150c2404C45763J3045F7499P0547J31130K05419A00261
$$ 495952 476031 208150 -32404 345763 358808 67499 138046 269176 474595 100261
17120C86832A57602J71920K05387A38890K11790P2937j4496M9186A37122L12445
$$ 386832 157602 329522 534909 138890 350680 423617 409121 458307 137122 449567
17110D49567k9927k5563O2926R9661j87539A04823M07945L7965k60159K56159
$$ 449567 419640 394077 457003 556664 369125 104823 512768 550733 290574 546733
17100E46733j14134k14255a880D61524K1873a18401F07919B53614e3889D94260
$$ 546733 432599 218344 -1880 461524 483397 -118401 607919 253614 -53889 494260
17089A13947K70398K80508k29601A70982L28027B15293J47976O6901J23696j30458
$$ 113947 384345 664853 435252 170982 499009 215293 363269 430170 553866 423408
17079D23408J64425k18348K00079n0078j08956P2589N3237j83836M07925j20860
$$ 423408 587833 369485 569564 519486 410530 483119 536356 352520 760445 639585
17069F39585L2580k01982n584J36474M6408q6863q3537R5356J05914p0732j03251
$$ 639585 672165 470183 464599 601073 647481 560618 477081 572437 678351 607619 504368
17058E04368J26128P4329j47395N6673j42198J84790D1502O55107q9827j95464
$$ 504368 630496 704825 557430 614103 471905 656695 41502 696609 606782 411318
17048D11318K52970J12025l71275K45023j01899Q3005l116K04615k59112J87059
$$ 411318 664288 776313 405038 650061 548162 631167 628051 832666 573554 760613
17038G60613J0951j21102K7532l0338j83423N54379m46460P478J0468J8849J77781
$$ 760613 771564 650462 677994 647656 464233 1018612 572152 579630 590098 608947 786728
17027G86728o5266j3735n1383j76637J20274K56290m02816J56301K34311k20603
$$ 786728 721462 707727 656344 479707 599981 856271 453455 609756 844067 623464
17017F23464A38744N71553m9787j53001M8793q5813J08932k01686J60473M42139
$$ 623464 138744 710297 660510 507509 556302 470489 579421 377735 538208 980347
17007I80347j05077j28956K27861l18917J88480L5457k44028j54433J55649n3776
$$ 980347 875270 746314 974175 655258 843738 879195 635167 480734 636383 582607
16997E82607L8313L01935k63314m3262L11849l59716J17815K06422r5047J78978
$$ 582607 620920 922855 659541 616279 928128 568412 686227 892649 797602 976580
16987I76580j66886M4092K58056k31658j32755J17646j4476o2454J03582J95522
$$ 976580 809694 853786 1111842 880184 747429 865075 850599 788145 891727 1087249
16977A087249l98079K95858r1669J09369j40763M90570o21942J63407j05705N04771
$$ 1087249 689170 985028 893359 1002728 861965 1352535 730593 894000 788295 1293066
16967A293066l34669J446J44560j32165J26594o2364j47001L49976r4087k2725
$$ 1293066 958397 959843 1104403 972238 1098832 1036468 889467 1239443 1145356 1122631
16957A122631k13914o481J96411J30345j58404Q4041j3441m3501l90223L88642
$$ 1122631 908717 902236 1098647 1228992 1070588 1154629 1141188 1097687 707464 1096106
16947A096106J14686o1592R7249k91165m3201J36989M04438j44622j34198J23981
$$ 1096106 1210792 1149200 1246449 955284 912083 1049072 1453510 1308888 1174690 1298671
16937A298671J30793l99886O07824l62889j98064K03736J56094j11456m18112
$$ 1298671 1429464 1029578 1637402 1274513 1076449 1280185 1436279 1324823 906711
16928I06711N94132p7162J51403o9540K3137J1756q1238J43104j17701j43600
$$ 906711 1500843 1423681 1575084 1505544 1528681 1540437 1459199 1602303 1484602 1341002
16918A341002M1899J76858j98479L016L37775m5539Q6274m2084l4978j84594L04063
$$ 1341002 1382901 1559759 1361280 1364296 1702071 1656532 1742806 1700722 1665744 1481150 1785213
16907A785213p1537P5573J89578J78954l38019q4249L63959j0814l350j31786
$$ 1785213 1713676 1789249 1978827 2157781 1819762 1735513 2099472 2088658 2085308 1953522
16897A953522j63293N09270k85755K00047j30321J02790k04780M03614l29246
$$ 1953522 1790229 2299499 2013744 2213791 2083470 2186260 1981480 2385094 2055848
16888B055848L08329k81535L77966k23868J20591Q2204J044K96946m62460O7269
$$ 2055848 2364177 2082642 2460608 2236740 2357331 2439535 2440579 2737525 2275065 2342334
16878B342334K96164m2407j32526K44525q8882K27109q4803j17951J91753j85004
$$ 2342334 2638498 2596091 2463565 2708090 2619208 2846317 2761514 2643563 2835316 2650312
16868B650312O54817l41076J97019k21477l4750L27704j66241J68178o9973L56877
$$ 2650312 3305129 2964053 3161072 2939595 2904845 3232549 3066308 3234486 3164513 3521390
16858C521390j99070R4577K65794n6090K4927l7557j3787o580O4673J20192N9546
$$ 3521390 3322320 3416897 3682691 3626601 3651528 3613971 3600184 3593604 3658277 3778469 3838015
16847C838015N8061N1114J03533K95435l58966M72535j85814L07218N6998p8597
$$ 3838015 3896076 3947190 4050723 4346158 3987192 4459727 4273913 4581131 4638129 4559532
16837D559532J09160L28814o8668m4487K835L78736j12956K81169k43587M31506
$$ 4559532 4668692 4997506 4928838 4884351 4887186 5265922 5152966 5434135 5190548 5622054
16827E622054l51762O65321J72576j43037J08952k70757M87728L3853K21406K40154
$$ 5622054 5270292 5935613 6108189 5965152 6074104 5803347 6291075 6324928 6546334 6786488
16817F786488q8737K26287j52751R0494N64615Q9102K38322L70800j17571K12824
$$ 6786488 6697751 6924038 6771287 6861781 7426396 7515498 7753820 8124620 8007049 8219873
16807H219873K34376J89832j19095K95307Q39619j13737L72039K06092m97714
$$ 8219873 8454249 8644081 8524986 8820293 9659912 9546175 9918214 10124306 9626592
16798I626592P92192K75864J96199J67050J87770N88239L60112L09597L27768
$$ 9626592 10418784 10694648 10890847 11057897 11245667 11833906 12194018 12503615 12831383
16789A2831383J93354M16356J10135P07811K22219N20027K78146N93915O21133
$$ 12831383 13024737 13441093 13551228 14259039 14481258 15001285 15279431 15873346 16494479
16780A6494479L81180P63607J49644P29220K08614Q50680N19774Q77149P92526
$$ 16494479 16875659 17639266 17788910 18518130 18726744 19577424 20097198 20974347 21766873
16771B1766873N22247Q33308Q90102P95846P25194P73259J023810R10970J195774
$$ 21766873 22289120 23122428 24012530 24808376 25533570 26306829 27330639 28241609 29437383
16762B9437383J031952J215598R75751J453682J370655J556818J142219J298793
$$ 29437383 30469335 31684933 32660684 34114366 35485021 37041839 38184058 39482851
16754C9482851J571199J764734J829990J697219J783576K106581K066176J898460
$$ 39482851 41054050 42818784 44648774 46345993 48129569 50236150 52302326 54200786
16746E4200786K563278K090144K450606K207232K491925K636966K569545K704985
$$ 54200786 56764064 58854208 61304814 63512046 66003971 68640937 71210482 73915467
16738G3915467K925222K628825L107436K649650K647732K417629K553238K383234
$$ 73915467 76840689 79469514 82576950 85226600 87874332 90291961 92845199 95228433
16730I5228433K354477K120331J551612J683164J113294J297236P18743K96572
$$ 95228433 97582910 99703241 101254853 102938017 104051311 105348547 106067290 106363862
16722A06363862K10992l25424n36052j072186j229612j326390j408900k317401
$$ 106363862 106574854 106249430 105713378 104641192 103411580 102085190 100676290 98358889
16714I8358889k091042k093173k702155k590758k675599k693472k723455k568757
$$ 98358889 96267847 94174674 91472519 88881761 86206162 83512690 80789235 78220478
16706G8220478k755616k658164k803820k610188k656727k339096k175504k339520
$$ 78220478 75464862 72806698 70002878 67392690 64735963 62396867 60221363 57881843
16698E7881843k215439k020360k242509j976255j968404k076828j797167j391529
$$ 57881843 55666404 53646044 51403535 49427280 47458876 45382048 43584881 42193352
16690D2193352j935762j385757j420281j221842j291007j168345j580785r58993
$$ 42193352 40257590 38871833 37451552 36229710 34938703 33770358 32189573 31230580
16682C1230580j234536o72781j239615q80298r00209j106354n63893q72650p19818
$$ 31230580 29996044 29323263 28083648 27203350 26303141 25196787 24632894 23760244 23040426
16673B3040426o31060j059448k75092p96600n61840o88677l92238n88060n46141
$$ 23040426 22409366 21349918 21074826 20278226 19716386 19027709 18635471 18047411 17501270
16664A7501270o06421k13542n98369m55730l80945j4389r09031m79551l52140
$$ 17501270 16894849 16681307 16082938 15627208 15246263 15231874 14322843 13843292 13491152
16655A3491152j57261k66395o63317J63103o37087m88580M8426m52317J30381
$$ 13491152 13333891 13067496 12404179 12567282 11930195 11441615 11490041 11037724 11168105
16646A1168105p92001n7181K27954o86632k46273l71211j75497l16418L36629
$$ 11168105 10376104 10318923 10546877 9860245 9613972 9242761 9067264 8750846 9087475
16637I087475l31361k85635m787n37480K72628j61362l57747M102r1474l59910
$$ 9087475 8756114 8470479 8465692 7928212 8200840 8039478 7681731 7685833 7594359 7234449
16627G234449J2886r7741j18865q3168j49934m09564O3792l23042Q2733r2422
$$ 7234449 7247335 7149594 7030729 6947561 6797627 6388063 6451855 6128813 6211546 6119124
16617F119124j54131n1083m24906J00287N5162m6993o97363L09649N0468m91403
$$ 6119124 5964993 5913910 5489004 5589291 5644453 5597460 4900097 5209746 5260214 4768811
16607D768811K19603R9460k4788k92979k81033j06250L11753j2968k56784k14358
$$ 4768811 4988414 5087874 5063086 4770107 4489074 4382824 4694577 4681609 4424825 4210467
16597D210467o4813k94095M07853k16360J58759k16070L0190r4182l44044M98070
$$ 4210467 4145654 3851559 4259412 4043052 4201811 3985741 4015931 3921749 3577705 4075775
16587D075775o58567O14468m27475j70167P6928L5621l04093L81373o35645K95019
$$ 4075775 3417208 4031676 3604201 3434034 3510962 3546583 3242490 3623863 2988218 3283237
16577C283237p3833l0813j26524J34173j42410J50356k88021n3300j00912j3591
$$ 3283237 3209404 3178591 3052067 3186240 3043830 3194186 2906165 2852865 2751953 2738362
16567B738362K02237j6783m25169q3569O65397j84642m81858N30677m54711J00110
$$ 2738362 2940599 2923816 2498647 2415078 3080475 2895833 2413975 2944652 2489941 2590051
16557B590051k8K03j51300P9108L5574j06855l06153J230M16265k48489j23353
$$ 2590051 2590023 2590226 2438926 2518034 2553608 2446753 2140600 2141830 2558095 2309606 2186253
16546B186253j18541L80531l76628O0847K42111m18966M27546m94841L07525l46337
$$ 2186253 2067712 2448243 2071615 2132462 2374573 1955607 2383153 1888312 2195837 1849500
16536A849500K64219k63572J21197o4895J04607o1478o9727l0696p4116K15119
$$ 1849500 2113719 1850147 1971344 1906449 2011056 1949578 1879851 1849155 1775039 1990158
16526A990158l2499j9862J27969m84311K32244k13964q8653N07681j85752k34534
$$ 1990158 1957659 1937797 2065766 1581455 1813699 1599735 1511082 2018763 1833011 1598477
16516A598477j71575K9052M7982K49218p4303K6200L8616l04912J23101l0045
$$ 1598477 1426902 1455954 1503936 1753154 1678851 1705051 1743667 1438755 1561856 1531811
16506A531811k05630j06622O51860m46485L30922k58559J69486k55122L02231
$$ 1531811 1326181 1219559 1871419 1424934 1755856 1497297 1666783 1411661 1713892
16497A713892l57688O079k63829p7811j61392L16576L9011L30234j84559j34585
$$ 1713892 1356204 1362283 1098454 1020643 859251 1175827 1214838 1545072 1360513 1225928
16487A225928J6936K4M66358m36149P4959M5545j02826l748N1736J15296j81308
$$ 1225928 1242864 1242888 1709246 1273097 1348056 1393601 1290775 1287027 1338763 1454059 1272751
16476A272751j21664m5311M310k5782L17674l08918K64703Q0635m78251L74892
$$ 1272751 1151087 1105776 1110086 1084304 1401978 1093060 1357763 1438398 960147 1335039
16466A335039l55376J69863M72170n25696k2438O0522k1456J044l39346L46904
$$ 1335039 979663 1149526 1621696 1096000 1073562 1134084 1112628 1113672 774326 1121230
16456A121230k95764M15184r3066l37413J62239j30907K78807K4597j6416J1232
$$ 1121230 825466 1240650 1147584 810171 972410 841503 1120310 1144907 1128491 1139723
16446A139723l11893L0743j7476J38432J03972k16078M1574L78709k67994j70437
$$ 1139723 827830 858573 841097 979529 1083501 867423 908997 1287706 1019712 849275
16436H49275J77969q8814P5526l40973K72253j51207L91310l62716O5753L87511
$$ 849275 1027244 938430 1013956 672983 945236 794029 1185339 822623 888376 1275887
16426A275887l28968P8836r4139o5430P34j03026j91863J36658K18559p4636J24213
$$ 1275887 946919 1025755 931616 866186 866920 763894 572031 708689 927248 852612 976825
16415I76825r0047m6998j05975J60994j50119J93175j19389L1174j61665j04931
$$ 976825 886778 839780 733805 894799 744680 937855 818466 849640 687975 583044
16405E83044K17954o809j57462J10150J11292N000D14364L83298B72609M95761
$$ 583044 800998 794189 636727 746877 858169 863169 414364 797662 272609 768370
16395G68370J40100l79585J88311J5932j07485P2006j72103K08261J28503j11964
$$ 768370 908470 528885 717196 733128 625643 697649 525546 733807 862310 750346
16385G50346R1395l65024J49441j7211o9138N2203k33283J87999K22903k19525
$$ 750346 841741 476717 626158 608947 539809 592012 358729 546728 769631 550106
16375E50106P1601o8008J72387J74127k36779m1902B65293L20344L78397j78576
$$ 550106 621707 553699 726086 900213 663434 621532 265293 585637 964034 785458
16365G85458l19612J4027K29490k29892R4881n9590Q7994k27642K6353j35745
$$ 785458 465846 479873 709363 479471 574352 514762 602756 375114 401467 265722
16355B65722L57348k15426J43534J3628J99319k31737L7994O0733j97785J46511
$$ 265722 623070 407644 551178 564806 764125 532388 570382 631115 433330 579841
16345E79841K8250j19694R1928n8747J38109J40359C91268J44974r6272K32317
$$ 579841 608091 488397 580325 521578 659687 800046 391268 536242 439970 672287
16335F72287j53583l3215n2678M78785j58872C63630K55034M0641B26861L03063
$$ 672287 518704 485489 432811 911596 752724 363630 618664 659305 226861 529924
16325E29924K17111l62391k5097L41805j29999j69763M5169A26318N36342P3950
$$ 529924 747035 384644 359547 701352 571353 401590 446759 126318 662660 736610
16315G36610l12077R9796J54588k68437J6531K1478J55744k41995K84348j64409
$$ 736610 424533 524329 678917 410480 427011 448489 604233 362238 646586 482177
16305D82177j07304p2680P8704m7543K51312j24802o7949J26458j55688p6649
$$ 482177 374873 302193 380897 333354 584666 459864 391915 518373 362685 286036
16295B86036Q5489J5608A61457P04844k70493A34562J00797R9691I8698O25548
$$ 286036 371525 387133 161457 866301 595808 134562 235359 335050 98698 724246
16285G24246G7351k8927M62626j1285J42202B58533K9601Q9853o4354p6985J23293
$$ 724246 77351 48424 511050 499765 641967 258533 288134 377987 313633 236648 359941
16274C59941K18310A98518K47441j67361J66164j01793K9598A24931J14010p9306
$$ 359941 578251 198518 445959 278598 444762 342969 372567 124931 238941 159635
16264A59635N0594Q2211n3243Q5074j52737k2395J01832J23783K28193B96777
$$ 159635 210229 292440 239197 324271 171534 149139 250971 374754 602947 296777
16253a7029F24378H9231J73806K36314P884A47984K63122k02986L1794K21697
$$ -17029 624378 89231 263037 499351 507235 147984 411106 208120 239914 461611
16243D61611J19151k0133B53897R256J32322H5796M05893J52263j89633R4130
$$ 461611 580762 560629 253897 263153 395475 85796 491689 643952 454319 548449
16233E48449k29838K6472M7999j90835r426J78910J16611B3306J13257m9076k442
$$ 548449 318611 345083 393082 202247 192821 371731 488342 23306 136563 87487 85045
16222H5045e324B79107J69189j38145j16617O200p1409q951l2725K04623N9932
$$ 85045 -5324 279107 448296 310151 193534 199734 128325 119374 86649 291272 351204
16211C51204Q2866j53243A21367n1191J92039O5427J2458K0732A14750M4442L59129
$$ 351204 434070 280827 121367 70176 262215 327642 340100 360832 114750 159192 518321
16200E18321F2288k8061K07433o5774a24605B64764J7067a40728B03120J83698
$$ 518321 62288 34227 241660 175886 -124605 264764 281831 -140728 203120 386818
16190C86818A81184p8252K20471l0105J31587H0167J91388D0529J52854M17699
$$ 386818 181184 102932 323403 293298 424885 80167 271555 40529 193383 611082
16180F11082b29720A42409o5477J1716J89455O4496r6052e8873A46611J96867
$$ 611082 -229720 142409 76932 88648 278103 342599 246547 -58873 146611 343478
16170C43478b16963D57488A86518L707q0218B1724c7313B28033J01697K52630
$$ 343478 -216963 457488 186518 190225 110007 21724 -37313 228033 329730 582360
16160E82360B55231J04029j63537J39208n1341A25806F0268J15092M3579a39867
$$ 582360 255231 359260 195723 334931 283590 125806 60268 175360 218939 -139867
16149B24898B4021K09015a15963D4161J31134G3714L30203j73037E3321J03561
$$ 224898 24021 233036 -115963 44161 175295 73714 403917 230880 53321 156882
16139A56882D1486R0434J10674K26533A20487J7571m9750J86054n3558L7405K33241
$$ 156882 41486 131920 242594 469127 120487 138058 88308 274362 220804 258209 491450
16128D91450j57555q3065m9205a93241E289J73125f2628K4832j92141B01243A9007
$$ 491450 333895 250830 201625 -193241 5289 178414 -62628 -37796 -229937 201243 19007
16116a55145P4458A02276i7486L9529A49031R9720p8744J4124n5114J92314q8938
$$ -155145 -80687 102276 -97486 -57957 149031 248751 170007 184131 129017 321331 232393
16105B32393D5685A4580O3626a10573H3175K43241A46177b9354B08683r2032L8615
$$ 232393 45685 14580 78206 -110573 83175 326416 146177 -29354 208683 116651 155266
16094A55266a00933k1863O1252F6340R6914c64C55654j01772e0719A3420J23196
$$ 155266 -100933 -122796 -61544 66340 163254 -364 355654 253882 -50719 13420 136616
16083A36616J21375D4424L8908K25638A37019J02101H678K10235G8132J7422a72677
$$ 136616 257991 44424 83332 308970 137019 239120 8678 218913 78132 95554 -172677
16071b21600a0156C72344K2458H165J8022a57197j37623i0829D5750M5522J87809
$$ -221600 -10156 372344 394802 8165 26187 -157197 -294820 -90829 45750 91272 279081
16060B79081P316j03137B4791K3172B390b21542B46563a58558C3293J66894C5483
$$ 279081 286397 183260 24791 47963 2390 -221542 246563 -158558 33293 200187 35483
16048E7916K37238j26623G9040L750J10082a6493A66364p8518J97695d6129n091
$$ 57916 295154 168531 79040 82790 192872 -16493 166364 87846 285541 -46129 -51220
16037e1220D7384a74381A34155J67074b34115c1134H0987a44959B53120p951p7868
$$ -51220 47384 -174381 134155 301229 -234115 -31134 80987 -144959 253120 245169 167301
16026A67301a26015G8573H178i0664E6847K27980F5130K40997H7526K3316b47826
$$ 167301 -126015 78573 8178 -90664 56847 284827 65130 306127 87526 110842 -247826
16014a91933I0303J41744b19046J00669j2376j8561K8064j47865A37283d9099
$$ -191933 90303 232047 -219046 -118377 -130753 -149314 -121250 -269115 137283 -49099
16003a14871a2167A27736C6578e5988D4202a2797D3876A2338J81368R6960A05572
$$ -114871 -12167 127736 36578 -55988 44202 -12797 43876 12338 193706 290666 105572
15991a07534I2699C2099J13793m3764M74837p4175m1879J05349R654A81856M45232
$$ -107534 92699 32099 145892 102128 576965 502790 460911 566260 575914 181856 627088
15980F27088h9544l8970A86498L4613r5037O231R2058e6296B2838N4011G496a86938
$$ 627088 -89544 -128514 186498 221111 126074 132305 224363 -56296 22838 76849 7496 -186938
15967H4405d14405b2142k07625c337k4164j25016B61218a29289G9981d8017A21750
$$ 84405 -414405 -22142 -229767 -3337 -27501 -152517 261218 -129289 79981 -48017 121750
15955b0642F3293b61533g4737D09475A04726b3388E553a69659B27953b14907k5957
$$ -20642 63293 -261533 -74737 409475 104726 -23388 5553 -169659 227953 -214907 -240864
15944b40864A20923m0343d8173A92054L0219j88H9427f9398D15214b5293A63014
$$ -240864 120923 80580 -48173 192054 222273 222085 89427 -69398 415214 -25293 163014
15932C74433a80253l9009j8948K9379E578c1266A98600a99418A19847d0758G4655
$$ 374433 -180253 -219262 -238210 -208831 5578 -31266 198600 -199418 119847 -40758 74655
15920B11997n0257J21620a40207k1904A55876e6592k5905b7918C6639K5385K18521
$$ 211997 161740 283360 -140207 -162111 155876 -56592 -82497 -27918 36639 62024 280545
15909B80545f0791J5804B12104B6686J22798a8404k40304E0732J02028L0280c01719
$$ 280545 -60791 -44987 212104 26686 149484 -18404 -258708 50732 152760 183040 -301719
15897A17915B2690a46122A70022F034f584A56946P0006p8033b71414M8132A97248
$$ 117915 22690 -146122 170022 6034 -6584 156946 226952 148919 -271414 -223282 197248
15885f45035A4655a48312m1612h0632D00948c85699J69614B4791J17875c9199
$$ -645035 14655 -148312 -189924 -80632 400948 -385699 -216085 24791 142666 -39199
15874a45769A01169C6206a04505A01802P7104a34482A65179a73631B3965M0640
$$ -145769 101169 36206 -104505 101802 178906 -134482 165179 -173631 23965 64605
15864F4605J8491g8230F0422j1078b56411Q8535j29349A29209e08844A02966e4508
$$ 64605 83096 -78230 60422 49344 -256411 -167876 -297225 129209 -508844 102966 -54508
15852d2463l53089e1842q8220A13436A8386a08777G895K3214b71831n5520A97698
$$ -42463 -395552 -51842 -140062 113436 18386 -108777 7895 31109 -271831 -327351 197698
15840A98764D1999b258H7805a069m0271N34B72275G9651F778a0147q7956p6590
$$ 198764 41999 -2258 87805 -1069 -41340 -40806 272275 79651 6778 -10147 -98103 -174693
15828a74693I3584a89596h19E6920a4678l48944J05722c4929k32882a22229a2214
$$ -174693 93584 -189596 -819 56920 -14678 -363622 -257900 -34929 -267811 -122229 -12214
15816a17817A24676f9386B9944O3127L24250j75853F2058b33984C0463J04331
$$ -117817 124676 -69386 29944 93071 417321 241468 62058 -233984 30463 134794
15806A34794h0684o9638A12302N8214h3854B55856D6028J56402a02978A10596
$$ 134794 -80684 -150322 112302 170516 -83854 255856 46028 202430 -102978 110596
15795e2437A04183B8768Q2104a30199f0508A67006a43688A29063k8739J55862
$$ -52437 104183 28768 110872 -130199 -60508 167006 -143688 129063 100324 256186
15785B56186A6241J25985d4480j754j14088A93483k9833g8407b2128D5937j8105
$$ 256186 16241 142226 -44480 -46234 -160322 193483 163650 -78407 -22128 45937 27832
15774B7832e7678I1717a44648D0488b68389k1660B1906K46649A2021b39700A50987
$$ 27832 -57678 91717 -144648 40488 -268389 -290049 21906 268555 12021 -239700 150987
15762A9701J76011b39205A87442g7042c3409B68040J5946e2756E9570L3166b27301
$$ 19701 195712 -239205 187442 -77042 -33409 268040 283986 -52756 59570 92736 -227301
15750H5577K17683A2801K10199b48612a06506L8847F9950h2650l2317H0145J59459
$$ 85577 303260 12801 223000 -248612 -106506 -67659 69950 -82650 -114967 80145 239604
15739B39604F4338J59515o7523d59655D6818i537k12089A8147K15389B1408J09244
$$ 239604 64338 223853 156330 -459655 46818 -9537 -221626 18147 233536 21408 130652
15728A30652a42153O2938k68708j9010A37595d6968q554A94067l5927h5254A14682
$$ 130652 -142153 -79215 -347923 -366933 137595 -46968 -55522 194067 158140 -85254 114682
15716c91813E4931a36221A89463c69333C13431A47122b01675K069H9872N5802
$$ -391813 54931 -136221 189463 -369333 313431 147122 -201675 -199606 89872 145674
15706A45674p1262a14112k11660i0944H3254f0881k20907D2269a01558A93349
$$ 145674 74412 -114112 -325772 -90944 83254 -60881 -281788 42269 -101558 193349
15695A10498i7707p8114A04833E0608R7254J87155b37181B38384a96839c4950
$$ 110498 -97707 -175821 104833 50608 147862 335017 -237181 238384 -196839 -34950
15684g4305k11707h3756l5017d6339n1610H0331B2904N1175d1894C01663A05398
$$ -74305 -286012 -83756 -118773 -46339 -97949 80331 22904 74079 -41894 301663 105398
15672A42874f2055k52443C7371a01742G3753R1334a59080A67202a38516q0426
$$ 142874 -62055 -314498 37371 -101742 73753 165087 -159080 167202 -138516 -218942
15662b18942J4556h7077j11764A36380Q9424H2206b59345L7138P9751j68343J33957
$$ -218942 -204386 -87077 -198841 136380 225804 82206 -259345 -222207 -142456 -310799 -176842
15651a76842E2485a0154j67537C01877b39419f1178A43173i8119D0845h9895A96534
$$ -176842 52485 -10154 -177691 301877 -239419 -61178 143173 -98119 40845 -89895 196534
15639d4520D0545i4403b2568A10910a93839m5977j89940c7087j85818J3862G5240
$$ -44520 40545 -94403 -22568 110910 -193839 -239816 -429756 -37087 -222905 -209043 75240
15627A49910i4824j44893F8170a02108B76573D5996R4393P0635b64364P7768g7714
$$ 149910 -94824 -239717 68170 -102108 276573 45996 140389 211024 -264364 -186596 -77714
15615g98j18508A03995A5817J83344f6518l83917E1784E124J22602i4858G8336
$$ -798 -119306 103995 15817 199161 -66518 -450435 51784 5124 127726 -94858 78336
15603B31927i1381A20069d234j35742A1908f1751k6851J4113l0604l18627A90553
$$ 231927 -91381 120069 -4234 -139976 11908 -61751 -88602 -74489 -105093 -423720 190553
15591b29376A25023a22867N0989E5077a93463M7855C25621j45014a20474A10189
$$ -229376 125023 -122867 -71878 55077 -193463 -145608 325621 180607 -120474 110189
15580c07846H3804a31616B04105b56153I530a24530m7022r0156D5797g3254n2944
$$ -307846 83804 -131616 204105 -256153 9530 -124530 -171552 -261708 45797 -73254 -126198
15569a26198b4183j39202A24872b7939M635i504A79688K19887c11756d2189C50796
$$ -126198 -24183 -163385 124872 -27939 -23304 -9504 179688 399575 -311756 -42189 350796
15557d98229A42421a96156b8019A12996P0342a13227C45927g4460A04444R0863
$$ -498229 142421 -196156 -28019 112996 183338 -113227 345927 -74460 104444 195307
15547A95307a31770j9283e1417D7720A9068a99180j10709F6709J88861F9637c43540
$$ 195307 -131770 -151053 -51417 47720 19068 -199180 -309889 66709 255570 69637 -343540
15535I7689P0763Q7903b05035C0234L37391j23180B839P1668a61879A57349J24408
$$ 97689 168452 256355 -205035 30234 367625 244445 2839 74507 -161879 157349 281757
15524B81757C9763b50745b3476m9070B25391e2206j518I9875J45711f9430c0228
$$ 281757 39763 -250745 -23476 -72546 225391 -52206 -53724 99875 245586 -69430 -30228
15512B68033o4002e0126A4357a36950N6163B17099n5500b43740K1527H5728a39614
$$ 268033 204031 -50126 14357 -136950 -80787 217099 161599 -243740 -222213 85728 -139614
15500a49724j10750a08351c5233l71760D8285b83744e4191A9187b05330G2413
$$ -149724 -260474 -108351 -35233 -406993 48285 -283744 -54191 19187 -205330 72413
15489A51570d15940B2279j042M4666Q5034b8870A26977j7920b46115B46258b4763
$$ 151570 -415940 22279 21237 65903 150937 -28870 126977 109057 -246115 246258 -24763
15477C43608L6539a16841e6188A86664K6509O0068p2538J17412g0625o3574q4445
$$ 343608 380147 -116841 -56188 186664 213173 273241 200703 318115 -70625 -134199 -218644
15466b18644A04513J85816A10166J2516b06075A56270K0639o3107i5996A91094
$$ -218644 104513 290329 110166 122682 -206075 156270 176909 113802 -95996 191094
15455B23424E5778B3639b90559D21538B05076b60376a24959c899E1764F34K13843
$$ 223424 55778 23639 -290559 421538 205076 -260376 -124959 -3899 51764 634 214477
15444B14477K4772G2872J92785E2943K70257L3208b2875A4034a08113H1212I650
$$ 214477 239249 72872 265657 52943 323200 356408 -22875 14034 -108113 81212 9650
15432I1215e7532j23545a5135j9718C3012D153M8768a26600i384B6247c51719
$$ 91215 -57532 -181077 -15135 -34853 33012 4153 52921 -126600 -9384 26247 -351719
15420d42033g7779A5565e8460j9595I6435b805E818J56450C8244J72811c074q1323
$$ -442033 -77779 15565 -58460 -78055 96435 -2805 5818 162268 38244 211055 -3074 -84397
15408h4397C99718A32837b75090j51282C4266a40701q6442j9293B63042r1960
$$ -84397 399718 132837 -275090 -426372 34266 -140701 -227143 -246436 263042 171082
15398A71082k8755e6710b3755k11495h9162E8840b1982G8553b03904H4288O4367
$$ 171082 142327 -56710 -23755 -235250 -89162 58840 -21982 78553 -203904 84288 148655
15387A48655b6609A91110B9140K17400R425K9514g9151A48390g7294B2076c23368
$$ 148655 -26609 191110 29140 246540 255965 285479 -79151 148390 -77294 22076 -323368
15375a74008p0176I1038J00492l5231i8237A33808g822D88374A56076p6088A4819
$$ -174008 -244184 91038 191530 156299 -98237 133808 -7822 488374 156076 79988 14819
15363b67413B75170c26037B8606O193b2679B80897M3894a1878B33132a77909c0404
$$ -267413 275170 -326037 28606 34799 -22679 280897 324791 -11878 233132 -177909 -30404
15351b38556C24924a60722A58302K37855h8014A16045i3046B01612o6196m8778
$$ -238556 324924 -160722 158302 396157 -88014 116045 -93046 201612 135416 86638
15341H6638O4536D3040c93014G392b8670l07224a20514J9014A84717H3763C8314
$$ 86638 151174 43040 -393014 7392 -28670 -335894 -120514 -101500 184717 83763 38314
15329C7327g6478B95463q9897m6238h9121E43615m0973b2186F9487K2265B1615
$$ 37327 -76478 295463 205566 159328 -89121 543615 502642 -22186 69487 91752 21615
15317a23001D50811j82269j11593o3139g1450j58682B61429G258L8318a7558k40624
$$ -123001 450811 268542 156949 93810 -71450 -230132 261429 7258 45576 -17558 -258182
15306b58182b4291o1651A77603H0602m807J67050f1390j29672P4429j5665B24604
$$ -258182 -24291 -85942 177603 80602 75795 242845 -61390 -191062 -116633 -132298 224604
15294a9940k77344B80988e2078A00970g1553G7000i7338c3198C6150b11808D04648
$$ -19940 -297284 280988 -52078 100970 -71553 77000 -97338 -33198 36150 -211808 404648
15282A16160N7959m3660J75489F3082L24692C6487I483J00206a12217j8657C20859
$$ 116160 174119 130459 305948 63082 387774 36487 9483 109689 -112217 -130874 320859
15270A47079a32113B55854a88191g2280j71841A74884a46974D08940a97521M0434
$$ 147079 -132113 255854 -188191 -72280 -244121 174884 -146974 408940 -197521 -157087
15260a57087J7548k46390I7765c0674A42906f1444B0155N01811A26308B7849i7583
$$ -157087 -139539 -385929 97765 -30674 142906 -61444 20155 521966 126308 27849 -97583
15248B16836J30177Q25490L63370n94482M55766k35094C27669h8512k7646e6789
$$ 216836 347013 1172503 1535873 941391 1397157 1162063 327669 -88512 -116158 -56789
15237a21527j02213Q8097A78670a36085B50799a1043G6960L35692f1808E0203
$$ -121527 -223740 -135643 178670 -136085 250799 -11043 76960 412652 -61808 50203
15226I3579d22404D07683a61617f9654Q527j06534q4204B2123J45614c3128m9464
$$ 93579 -422404 407683 -161617 -69654 -61127 -167661 -251865 22123 167737 -33128 -82592
15215h2592k9770A24368j6730h1349J1152D6819L1707J74884F8489e5658E8564
$$ -82592 -112362 124368 107638 -81349 -70197 46819 78526 253410 68489 -55658 58564
15203B42512B7027f9137D48718H2805k6336c51075A54622k4168e0190C2656M73305
$$ 242512 27027 -69137 448718 82805 56469 -351075 154622 130454 -50190 32656 505961
15192E05961k20442i1583A69797O7166c37449C69912A83635N5313E2261a98624
$$ 505961 285519 -91583 169797 236963 -337449 369912 183635 238948 52261 -198624
15181b34564A60070a9827B05460F7981P5658E8943L7320N2821d9629E3751c591
$$ -234564 160070 -19827 205460 67981 143639 58943 96263 149084 -49629 53751 -3591
15169E6044A040c7957m21508a3036k59621A54686a54537H7989J03377n4346a07441
$$ 56044 1040 -37957 -459465 -13036 -272657 154686 -154537 87989 191366 137020 -107441
15157A43271a90977C52041c0691n0301B9108f2378k20487k9544G1740a09308f751
$$ 143271 -190977 352041 -30691 -80992 29108 -62378 -282865 -312409 71740 -109308 -6751
15145A18875d0811G6662h8092A23325C8668h2917B2694B984P8443g1597H7218
$$ 118875 -40811 76662 -88092 123325 38668 -82917 22694 2984 81427 -71597 87218
15133A73721g6720q508D5338d112r4710A81118n5037a41337A56146O485c5772
$$ 173721 -76720 -85228 45338 -4112 -98822 181118 126081 -141337 156146 162631 -35772
15121B38672R9086o3963A06427J36063h0499A30693k1473M72809B15357F6901
$$ 238672 337758 273795 106427 242490 -80499 130693 109220 582029 215357 66901
15110a45373B22011h6901b1245C9841Q9782J01133C0305a53119C36694p2829p7918
$$ -145373 222011 -86901 -21245 39841 129623 230756 30305 -153119 336694 263865 185947
15099A85947k3789B8252J01836h8929b3782C40193B9495J55290g0048E0466N4885
$$ 185947 162158 28252 130088 -88929 -23782 340193 29495 184785 -70048 50466 105351
15088A05351a72032B77139A12416p96E1675J6857O2109r515a12977A57411R9495
$$ 105351 -172032 277139 112416 111620 51675 68532 130641 121126 -112977 157411 256906
15077B56906j00727A8264J88404A01423J41832B3347K94090l676n9869B2713o217
$$ 256906 156179 18264 206668 101423 243255 23347 317437 313761 253892 22713 16496
15066A6496J13504O731K21787B4706c14971B84671d6239q343j04707g7900H9502
$$ 16496 130000 136731 358518 24706 -314971 284671 -46239 -54582 -159289 -77900 89502
15054E73869A81537n9469K10562e4374b4342C1975g1077C05558D7594O3883K20944
$$ 573869 181537 122068 332630 -54374 -24342 31975 -71077 305558 47594 111477 332421
15043C32421j56294a00273E6901K14343R0818H7130M05649I2967d0558B01640
$$ 332421 176127 -100273 56901 271244 362062 87130 492779 92967 -40558 201640
15032E08593A31761L01739A78480L2973J510L09801j36140M0430k07424K7522
$$ 508593 131761 433500 178480 211453 212963 522764 386624 427054 219630 247152
15022B47152r7423o5730R7277P3344G6361g0929B28477L3476K5817J02795r822
$$ 247152 149729 83999 181276 254620 76361 -70929 228477 261953 287770 390565 380743
15011C80743A35130J55723J17188O852e1230B05254J09741l9983i4674H1822M44164
$$ 380743 135130 290853 408041 414893 -51230 205254 314995 275012 -94674 81822 525986
15000E25986j71370C8332J41928K18456i7957C48757N5993p1313j8750Q4244A43016
$$ 525986 354616 38332 180260 398716 -97957 348757 404750 333437 314687 398931 143016
14988D34136n3953j29957q2221P9243L5798c0019A15740P7510K40154o5312n4163
$$ 434136 380183 250226 168005 247248 283046 -30019 115740 193250 433404 368092 313929
14977C13929k4481M7203l731P131f0485o8401A61907J59648A55716K35957p5684
$$ 313929 289448 336651 332920 340051 -60485 -128886 161907 321555 155716 391673 315989
14966C15989l4023J3443K07189m6653A29881N1284J46543b30625B20864K74330
$$ 315989 281966 295409 502598 455945 129881 181165 327708 -230625 220864 495194
14956D95194k02183K20028A88446L51537j69544L418J29250o8773A7463J11905
$$ 495194 293011 513039 188446 539983 370439 373857 503107 434334 17463 129368
14946A29368J6002F9333J04142K28233j98399K77740B39368J82349j41966q5648
$$ 129368 145370 69333 173475 401708 203309 481049 239368 421717 279751 194103
14936A94103L32294j87602j33633J73753q5548P9377K828M14952C81300K91909
$$ 194103 526397 338795 205162 378915 293367 372744 375572 790524 381300 673209
14926F73209C34015J77550J03230k74141K91970P149l02674K26145J55435L49599
$$ 673209 334015 511565 614795 340654 632624 639773 337099 563244 718679 1068278
14916A068278k74383K08376j93459k3557k9849l73903K87261k19354J59844f3866
$$ 1068278 793895 1002271 808812 785255 755406 381503 668764 449410 609254 -63866
14905B42358K63537r3689n0361A30151D9151L69101G9316A2333M42131j50940
$$ 242358 505895 412206 361845 130151 49151 418252 79316 12333 454464 303524
14895C03524Q6801M6256j86588l8095K70917j56564m6814m5556j15033O253K40249
$$ 303524 390325 436581 249993 211898 482815 326251 279437 233881 118848 125101 365350
14884C65350q9378p7902J11946J08906Q4874j22486j84896P5762K5702K41221
$$ 365350 275972 198070 310016 418922 503796 381310 196414 272176 297878 539099
14874E39099R5602C06624K18278k11461P3540A07805J23971M0600K38508n8104
$$ 539099 634701 306624 524902 313441 386981 107805 231776 272376 510884 452780
14864D52780j05188J90571B55730K51064j18637K57149l03258j00982M70946A92004
$$ 452780 347592 538163 255730 506794 388157 645306 342048 241066 712012 192004
14853C34512Q7783G4792K01704M0898J39846l6042A37389K06140M5268J6376l6954
$$ 334512 422295 74792 276496 317394 457240 421198 137389 343529 388797 405173 368219
14842C68219N2636J60626B85768K03097R6378K92301j33710j36056n0248q2650
$$ 368219 420855 581481 285768 488865 585243 877544 743834 607778 557530 474880
14832D74880J66362k17130B04011N0420L8134m5558J55003L36874k95697J26938
$$ 474880 641242 424112 204011 254431 292565 247007 402010 738884 443187 570125
14822E70125B46534J41783J06250j40612J81195k65779K19436j75543R0664d8816
$$ 570125 246534 388317 494567 353955 535150 269371 488807 313264 403928 -48816
14811B13034K45342A39407M89945k56837R9238A63781G6403L06029q857L07953
$$ 213034 458376 139407 629352 372515 471753 163781 76403 382432 373575 681528
14801F81528R533l19906J11470J05391k05741K51542B39858M6434K71015k65571
$$ 681528 691061 371155 482625 588016 382275 633817 239858 286292 557307 291736
14791B91736L4664J27222Q6945p1974k04464K6693J61495K2816k24966K06743
$$ 291736 326400 453622 540567 468593 264129 290822 452317 475133 250167 456910
14781D56910M04515k79097b1980G06281j38434p1552R7858l1521k54864L26776
$$ 456910 861425 582328 -21980 706281 567847 496295 594153 562632 307768 634544
14771F34544k77912J67500j83375L78462l59476J41126j62525r4790K56787J70909
$$ 634544 356632 524132 340757 719219 359743 500869 338344 243554 500341 671250
14761F71250k21068j9012M2907K15878k19014L8799O1108o6526o0123J59987j20331
$$ 671250 450182 431170 474077 689955 470941 509740 570848 504322 444199 604186 483855
14750D83855Q1081k30082J07324j62200P0657Q2697J44338j61277O022j1035J21013
$$ 483855 564936 334854 442178 279978 350635 433332 577670 416393 422415 411380 532393
14739E32393K77428k56205j44382J02296j65328l273L35986j42066J212L92180
$$ 532393 809821 553616 409234 511530 346202 342929 678915 536849 538061 930241
14729I30241D10719L48057k00661R2350j07449N9867J49899R7191M2409J75741
$$ 930241 410719 758776 558115 650465 543016 602883 752782 849973 892382 1068123
14719A068123j26731K09106l45171J6867m8570k78507K17657O7806B70436L79456
$$ 1068123 941392 1150498 805327 822194 773624 495117 712774 780580 270436 649892
14709F49892L13494C88994J58470L2977P8582P0888j62284j8090J74654J94401
$$ 649892 963386 388994 547464 580441 659023 729911 567627 549537 724191 918592
14699I18592j61169L7016L4664K0239K44672p4627j63748k71538L95584j50710
$$ 918592 757423 794439 829103 849342 1094014 1019387 855639 584101 979685 828975
14689H28975r0113p5450J98745k78407J49206J79860L1165D70551M91477k36278
$$ 828975 738862 663412 862157 583750 732956 912816 943981 470551 962028 725750
14679G25750J05563j19233j6622j77395q4928J88767J59847j21421N1884n8118
$$ 725750 831313 712080 695458 518063 433135 621902 781749 660328 712212 654094
14669F54094J08683J25466j55433n2310j69462L47932q7073k1393n9831J4967
$$ 654094 762777 888243 732810 680500 511038 858970 771897 750504 690673 705640
14659G05640J93315j06379J43627j30634J94242r0047k7925j96953R0541J49123
$$ 705640 898955 792576 936203 805569 999811 909764 881839 684886 775427 924550
14649I24550j51671M4109O13627m87528D41109M59234R2750m6918J92918L25980
$$ 924550 772879 816988 1430615 943087 441109 900343 993093 946175 1139093 1465073
14639A465073l96800k85104L03599k62857M1398j59959K69586j64068J36715J36247
$$ 1465073 1068273 783169 1086768 823911 865309 705350 974936 810868 947583 1083830
14629A083830L5711j11606r7404K06057j06611j46415Q3050j16509K71862j63886
$$ 1083830 1119541 1007935 910531 1116588 1009977 863562 946612 830103 1101965 938079
14619I38079K01586J49165n74455L39797q123k05495M01750j54426J59928j78566
$$ 938079 1139665 1288830 714375 1054172 1046049 840554 1242304 1087878 1247806 1069240
14609A069240j49903K59193j87254j641j440K0369P9815J0708k38619K56780J1878
$$ 1069240 919337 1178530 991276 989635 988195 1008564 1088379 1099087 860468 1117248 1129126
14598A129126P2429o0538M25105l71580K34157k27943K24857l78980K46568l94756
$$ 1129126 1201555 1141017 1566122 1194542 1428699 1200756 1425613 1046633 1293201 898445
14588H98445O05051l71217r9741Q0205K64375k65276J04682n630K35442n7631
$$ 898445 1503496 1132279 1032538 1112743 1377118 1111842 1216524 1210894 1446336 1388705
14578A388705R3010j15004K17184j39473n8773K97928j59513J48518K35347k52122
$$ 1388705 1481715 1366711 1583895 1444422 1385649 1683577 1524064 1672582 1907929 1655807
14568A655807j51641J26966j80893K29637n0815j39404N97217m80751L34009J54968
$$ 1655807 1504166 1631132 1450239 1679876 1629061 1489657 2086874 1606123 1940132 2095100
14558B095100K9453K69304m2041K74391K21997n263N15070L68060J342224K779407
$$ 2095100 2124553 2393857 2351816 2626207 2848204 2842941 3358011 3726071 5068295 7847702
14548G847702M263590P980894J2251190o253651A2657932m510716k490567k801800
$$ 7847702 12111292 20092186 32343376 26089725 12657932 8147216 5656649 2854849
14540B854849j135168J77666l31781l0541l618J22232J4993k93433J13421K06160
$$ 2854849 1719681 1897347 1565566 1535025 1531407 1653639 1668632 1375199 1488620 1694780
14530A694780j38459M3308J17184J91194j47223k29637K88093J85137m85144K62610
$$ 1694780 1556321 1599629 1716813 1908007 1760784 1531147 1819240 2004377 1519233 1781843
14520A781843J14674M97549o44086j37783M91764j01723m0763p7735K10400j24148
$$ 1781843 1896517 2394066 1749980 1612197 2103961 2002238 1961475 1883740 2094140 1969992
14510A969992O7446J06419j39207l22198M45644R6478k58922K29489p9365J51427
$$ 1969992 2037438 2143857 2004650 1682452 2128096 2224574 1965652 2195141 2115776 2267203
14500B267203n7114j06375L77688m19010M01996q7852j15889P1869q922L11119
$$ 2267203 2210089 2103714 2481402 2062392 2464388 2376536 2260647 2332516 2323594 2634713
14490B634713j05004l73665K06069L37391k82457K53923k12158L22329l69339
$$ 2634713 2529709 2156044 2362113 2699504 2417047 2670970 2458812 2781141 2411802
14481B411802M5360J98347m8377R5501L6853J20221j47787K94871P4652r8721
$$ 2411802 2457162 2655509 2607132 2702633 2739486 2859707 2711920 3006791 3081443 2982722
14471B982722R5702j83482J61831K52369r7116J94513k41971L45308k50338j2519
$$ 2982722 3078424 2894942 3056773 3309142 3212026 3406539 3164568 3509876 3259538 3247019
14461C247019K04415J98162k5987r5417m08249M53620j48630J49639M32845j03691
$$ 3247019 3451434 3649596 3623609 3528192 3119943 3573563 3424933 3574572 4007417 3903726
14451C903726J2154j49570j9959K11720k43401N98807l68652M11131j03494j09499
$$ 3903726 3915880 3766310 3746351 3958071 3714670 4313477 3944825 4355956 4252462 4142963
14441D142963J46232L32748j63671J20229m5183l35864L74320J63967o3106J09368
$$ 4142963 4289195 4621943 4458272 4578501 4533318 4197454 4571774 4735741 4672635 4782003
14431D782003K2711J30781Q9341J47823K18860j03405Q9263j78758o58Q85889
$$ 4782003 4804714 4935495 5024836 5172659 5391519 5288114 5377377 5198619 5197961 6083850
14421F083850k6939j72153k39183O59209l37512j20675O16338j17095j57348N9512
$$ 6083850 6056911 5884758 5645575 6304784 5967272 5846597 6462935 6345840 6188492 6248004
14411F248004L03827K62467k13763J40339J10822L25019R0086o1678J64278L9892
$$ 6248004 6551831 6814298 6600535 6740874 6851696 7176715 7266801 7205123 7369401 7409293
14401G409293L27466k315L25735J17205P1576j27340M13715R795K29286J29912
$$ 7409293 7736759 7734444 8060179 8177384 8248960 8121620 8535335 8545130 8774416 8904328
14391H904328k7254M3913M17962j1986K29680J98447J64802J46219L06628J11986
$$ 8904328 8877074 8920987 9338949 9326963 9556643 9755090 9919892 10066111 10372739 10484725
14381A0484725j739M88198N3475L83369K69740J98113l27820N42993L57231j05949
$$ 10484725 10482986 10971184 11024659 11408028 11677768 11875881 11548061 12091054 12448285 12342336
14371A2342336L04115M91074K47845K86835Q4233N37121R5074L79517L44518J93320
$$ 12342336 12646451 13137525 13385370 13672205 13756438 14293559 14388633 14768150 15112668 15305988
14361A5305988J11110M93853N01622M05859N81022O33672j10133L88199N07152
$$ 15305988 15417098 15910951 16412573 16818432 17399454 18033126 17922993 18311192 18818344
14352A8818344L86310K28121M96634N24283P28411M13013O85012P32722O36346
$$ 18818344 19204654 19432775 19929409 20453692 21182103 21595116 22280128 23012850 23649196
14343B3649196M07380L22295J149772M68686P31234P58569J322985N68014P80807
$$ 23649196 24056576 24378871 25528643 25997329 26728563 27487132 28810117 29378131 30158938
14334C0158938J091271O03790J113611R09631R78842J136407J344552J085777
$$ 30158938 31250209 31853999 32967610 33877241 34856083 35992490 37337042 38422819
14326C8422819J074144J812968J255097J428351J862419J553747J723595J493514
$$ 38422819 39496963 41309931 42565028 43993379 45855798 47409545 49133140 50626654
14318E0626654K170046J869426K135314K320483K460148K210675K911553K898097
$$ 50626654 52796700 54666126 56801440 59121923 61582071 63792746 66704299 69602396
14310F9602396K733387L543641L044737L464733L824770M083333M208236M460468
$$ 69602396 72335783 75879424 78924161 82388894 86213664 90296997 94505233 98965701
14302I8965701N109997N356244N130013N919649O870863O584460O872277Q053803
$$ 98965701 104075698 109431942 114561955 120481604 127352467 133936927 140809204 148863007
14294A48863007P930105Q745224R494274J0098337J0469982J1081608J1918477
$$ 148863007 156793112 165538336 175032610 185130947 195600929 206682537 218601014
14287B18601014J2600848J2821321J3690593J4191708J4542882J4935722J5253312
$$ 218601014 231201862 244023183 257713776 271905484 286448366 301384088 316637400
14280C16637400J4796452J4848160J3934194J3358206J2042428J0084580P334066
$$ 316637400 331433852 346282012 360216206 373574412 385616840 395701420 403035486
14273D03035486J828043K62152O33876P91855j677408n588768n693336p537404
$$ 403035486 404863529 405125681 405759557 406551412 404874004 399285236 393591900 386054496
14265C86054496r482419j1416597j2776378j4307642j5423116j5477337j5440464
$$ 386054496 376572077 365155480 352379102 338071460 322648344 307171007 291730543
14258B91730543j4908884j4822604j3991397j4016624j2606833j1400670j1617774
$$ 291730543 276821659 261999055 248007658 233991034 221384201 209983531 198365757
14251A98365757j0737073j0539767r514928r028729q587849p742371p660494o596390
$$ 198365757 187628684 177088917 167573989 158545260 149957411 142215040 134554546 127958156
14243A27958156o290866o030079n876146n315096m676794m517180m574757m361571
$$ 127958156 121667290 115637211 109761065 104445969 99769175 95251995 90677238 86315667
14235H6315667l599317l952307l005189l174217k972118l055126k693739k519451
$$ 86315667 82716350 78764043 75758854 72584637 69612519 66557393 63863654 61344203
14227F1344203k611685j991435k054888k207333j927207j829608j769768j370878
$$ 61344203 58732518 56741083 54686195 52478862 50551655 48722047 46952279 45581401
14219D5581401j708303j548599j449251j299833j240414j182047j089402j276901
$$ 45581401 43873098 42324499 40875248 39575415 38335001 37152954 36063552 34786651
14211C4786651q52243j435832p91998m02069p91514q62458j123873r99844r33448
$$ 34786651 33934408 32498576 31706578 31304509 30512995 29650537 28526664 27526820 26593372
14202B6593372k80179m67208q21148p30392o91128r35926m33740n72415m78770
$$ 26593372 26313193 25845985 25024837 24294445 23603317 22667391 22233651 21661236 21182466
14193B1182466n63461m75380o05606o00482j88361m91205o20050j97393j3248
$$ 21182466 20619005 20143625 19538019 18937537 18749176 18257971 17637921 17440528 17427280
14184A7427280p09352l10991q56144K3089k55033m17025m79453j65236m68357
$$ 17427280 16717928 16406937 15550793 15573882 15318849 14901824 14422371 14257135 13788778
14175A3788778Q1841o36532K23467m31927p14433J79103o45427j62709L29097
$$ 13788778 13870619 13234087 13457554 13025627 12311194 12490297 11844870 11682161 12011258
14166A2011258o77082q5517k87944j28572n28266K46470j12919l88570k97238
$$ 12011258 11334176 11248659 10960715 10832143 10303877 10550347 10437428 10048858 9751620
14157I751620l4872J11070m97039l40479L10725n82891l30415K68062P7935m31486
$$ 9751620 9716748 9827818 9330779 8990300 9301025 8718134 8387719 8655781 8733716 8302230
14147H302230K755l91375j9973j87507J9875j25620K9006l31287L7700l26115
$$ 8302230 8304985 7913610 7893637 7706130 7726005 7600385 7629391 7298104 7335804 7009689
14137G009689r9016j33658o5687L366L5065k60125J00074j96906J58587l27727
$$ 7009689 6910673 6777015 6711328 6714694 6749759 6489634 6589708 6392802 6551389 6223662
14127F223662k89199K97957k73976l3672K77344l12408N0573o18882K46174j75682
$$ 6223662 5934463 6232420 5958444 5924772 6202116 5889708 5940281 5321399 5567573 5391891
14117E391891k24257m8925O9566k2472p9931j99473J97571k62804r1179K45492
$$ 5391891 5167634 5118709 5188275 5165803 5085872 4886399 5083970 4821166 4729987 4975479
14107D975479o7303m41841j04694J35281M03826l83783J606j34875l61684N5303
$$ 4975479 4908176 4466335 4361641 4496922 4900748 4516965 4518571 4383696 4022012 4077315
14097D077315K91503j85404k33971K88969j8049k14589K6485j65945m8857J47223
$$ 4077315 4368818 4183414 3949443 4238412 4220363 4005774 4032259 3866314 3817457 3964680
14087C964680l5699j41203P3267k98666L82182l37761q1613m763J68395l02499
$$ 3964680 3928981 3787778 3861045 3562379 3944561 3606800 3525187 3520424 3688819 3386320
14077C386320j97560J96691m3360j50148J18759n6568N6530q0908j20198j31690
$$ 3386320 3188760 3385451 3342091 3191943 3310702 3254134 3310664 3229756 3109558 2977868
14067B977868K04004l72914P874j04459J69632j75608K26063k57322K59042l85577
$$ 2977868 3181872 2808958 2816832 2712373 2882005 2706397 2932460 2675138 2934180 2548603
14057B548603K03815j37267l0093j81067M6888J14803R2369j46482k03930K94224
$$ 2548603 2752418 2615151 2585058 2403991 2450879 2565682 2658051 2511569 2307639 2601863
14047B601863P7798l16764m42777M12175j08815N020L48702l01187K7961M5930
$$ 2601863 2679661 2362897 1920120 2332295 2223480 2228500 2577202 2276015 2303976 2349906
14037B349906j37322k51630K45407J64224k8605j30026j52894M06530j69384k80199
$$ 2349906 2212584 1960954 2206361 2370585 2341980 2211954 2059060 2465590 2296206 2016007
14027B016007j34955J57044j44075j3747Q6271j14074j81104K02307Q650K10392
$$ 2016007 1881052 2038096 1894021 1880274 1966545 1852471 1671367 1873674 1882324 2092716
14017B092716m07789K02492l1885k10217r8836J7464N8053O0935k80885K20439
$$ 2092716 1684927 1887419 1855534 1645317 1546481 1563945 1621998 1682933 1402048 1622487
14007A622487J2050k95107N11149k52599K7152P889j29975q4880j61491J50720
$$ 1622487 1634537 1339430 1850579 1597980 1625132 1633021 1503046 1418166 1256675 1407395
13997A407395K99312o4535q7401k40359L44535J1007L97526O54433J701765L269008
$$ 1407395 1706707 1642172 1554771 1314412 1658947 1669954 2067480 2721913 4423678 7692686
13987G692686P048217J3891868J366216j3548381p371648k935473j858058j098638
$$ 7692686 14740903 28632771 29998987 16450606 9078958 6143485 4285427 3186789
13979C186789j76776k05831n52525K59590j24177l62922j86213J66356j72809
$$ 3186789 3010013 2804182 2251657 2511247 2387070 2024148 1837935 2004291 1831482
13970A831482L37403n63521L60125l11198K13215l04585R4759m23411P0010J73005
$$ 1831482 2168885 1605364 1965489 1654291 1867506 1562921 1657680 1234269 1304279 1477284
13960A477284J97698k1415j52779j80571O3511o8602K63645k48508j12J78147
$$ 1477284 1674982 1653567 1500788 1320217 1383728 1315126 1578771 1330263 1330151 1508298
13950A508298l83731R5608L9847o7057J48141N5182k73323j97712L73868J66128
$$ 1508298 1124567 1220175 1260022 1192965 1341106 1396288 1122965 925253 1299121 1465249
13940A465249k02209K27594l55800K76824j42040J47760m86320K88575M4960j47810
$$ 1465249 1263040 1490634 1134834 1411658 1269618 1417378 931058 1219633 1264593 1116783
13930A116783J83551j12975J85695j08904l57930P2936j61643L70337k87334J21557
$$ 1116783 1300334 1187359 1373054 1264150 906220 979156 817513 1187850 900516 1022073
13920A022073P3891j49523k6972j31377L40859j32610l08017M56885j54631n1360
$$ 1022073 1095964 946441 919469 788092 1128951 996341 688324 1145209 990578 939218
13910I39218J56610k4837k32888j55489K65825p4585L6711M522j9171j94217P8419
$$ 939218 1095828 1070991 838103 682614 948439 873854 910565 915087 895916 701699 780118
13899G80118q3572P5972K11452O9008L2755k80510O3647J83923j86725J77118
$$ 780118 696546 772518 983970 1052978 1085733 805223 868870 1052793 866068 1043186
13889A043186j98224J81623l64075J68555K13803k21521P394p7883J64525k93348
$$ 1043186 844962 1026585 662510 831065 1044868 823347 830741 752858 917383 624035
13879F24035r4221L11625k75641J71630K75756l04089j74902M6202L67147k28544
$$ 624035 529814 841439 565798 737428 1013184 709095 534193 580395 947542 718998
13869G18998j62319J19832L45246k2307j85090j61400J25787q0525J11020K13187
$$ 718998 556679 676511 1021757 999450 814360 652960 778747 698222 809242 1022429
13859A022429j03964j67950j6071o9512p8558k73482K59890J55053J66787M2788
$$ 1022429 918465 750515 734444 664932 586374 312892 572782 727835 894622 937410
13849I37410m09083M89679k41730p2816J98960j3140D34871N41089o0489q5043
$$ 937410 528327 1018006 776276 703460 902420 889280 434871 975960 915471 830428
13839H30428B96672N77389o9266n959j08927r7471K8065q198l2568L00389k6422
$$ 830428 296672 874061 804795 798836 689909 592438 620503 612305 579737 880126 853704
13828H53704j01752k66576n1541L3535P7154J89521k3135j27506J58298L3713
$$ 853704 751952 485376 433835 467370 544524 734045 710910 583404 741702 775415
13818G75415j89623j66403M95047j39565k17675K45026k38320j78155K381L08015
$$ 775415 585792 419389 914436 774871 557196 802222 563902 385747 388128 696143
13808F96143J19013k22338L8319j75026J88451j60901J23569m2111Q3611k61994
$$ 696143 815156 592818 631137 456111 644562 483661 607230 565119 648730 386736
13798C86736J76296O5088j71690K42101J83178l54932p2096L62270p8357B72875
$$ 386736 563032 628120 456430 698531 881709 526777 454681 816951 738594 272875
13787D45974P566Q6531Q3243j94219j41550K66346B16939M1412r3078J87905L27627
$$ 445974 453540 540071 623314 429095 287545 553891 216939 258351 165273 353178 680805
13776F80805A36363J56184P31116m64630R358L67581B09675M5107K30546k15235
$$ 680805 136363 292547 1023663 559033 568391 935972 209675 254782 485328 270093
13766B70093L56807B77778j9405R3801j63696L950M920K14482J07206k9812J05033
$$ 270093 626900 277778 258373 352174 188478 192428 197348 411830 519036 489224 594257
13755E94257B74432J97863B8701M03351H3675J99753O9669P4150k1395N1159J977
$$ 594257 274432 472295 28701 432052 83675 283428 353097 427247 405852 457011 458988
13744D58988O0332j82146K06841l1430J27459q7644j95273Q7784k18717j512K56576
$$ 458988 519320 337174 544015 512585 640044 552400 357127 444911 226194 224682 481258
13733D81258A14679L87287j84331R2476I8897L40482k18248J91491j73183J79499
$$ 481258 114679 501966 317635 410111 98897 439379 221131 412622 239439 418938
13723D18938q6010O1556L3811j22332M37409C28246k2527M06812C46531J15249
$$ 418938 332928 394484 428295 305963 743372 328246 305719 712531 346531 461780
13713D61780A28149J17834J73577n8946k8580K58812p548B84760J4974J30658
$$ 461780 128149 245983 419560 360614 332034 590846 583298 284760 299734 430392
13703D30392A14715L84316n6938J08615B70608L8242P6547K5274B4010K64880
$$ 430392 114715 499031 442093 550708 270608 308850 385397 410671 24010 288890
13693B88890J67050I9333J72557J01808I2536K41753A52573J78884F4663L34327
$$ 288890 455940 99333 271890 373698 92536 334289 152573 331457 64663 398990
13683C98990A86146G0296K38015j13443K02174k8146K30177j07211j01857A61345
$$ 398990 186146 70296 308311 194868 397042 368896 599073 491862 390005 161345
13672C39675J82383B01352j877J71793J43893G5845N71873B86113J29703q3877
$$ 339675 522058 201352 199475 371268 515161 75845 647718 286113 415816 331939
13662C31939o4727n6650L98030m1390k71622J65266k09714J54340j18033J28914
$$ 331939 267212 210562 608592 567202 295580 460846 251132 405472 287439 416353
13652D16353j4215J26569H3428R8240K96305j67180l4901j07492J33757J67191
$$ 416353 402138 528707 83428 181668 477973 310793 275892 168400 302157 469348
13642D69348A7661R8379J50412m4836J1206K05852l0063A82676a76732A85859
$$ 469348 17661 116040 266452 221616 232822 438674 408611 182676 -176732 185859
13631a83797C30246Q4743q9748C2152K96132q6892A05940q575J41459f9642A09422
$$ -183797 330246 414989 325241 32152 328284 241392 105940 97365 238824 -69642 109422
13619E17910A68977k9441O2394D8133K00930J97269k12483K55326k42816j5886
$$ 517910 168977 139536 201930 48133 249063 446332 233849 489175 246359 230473
13609B30473O4613a6782A91136p5132J48756J5308J33366d7138C35623A37594
$$ 230473 295086 -16782 191136 116004 264760 280068 413434 -47138 335623 137594
13598A08491J40464n0963N1369O968o2290K12917j33435J27057o0995K23781k78664
$$ 108491 248955 197992 249361 256329 194039 406956 273521 400578 339583 563364 284700
13587B84700J78078B6901J73615l3902K9207L58422B07840J14417J4832L348J76859
$$ 284700 462778 26901 200516 166614 195821 554243 207840 322257 337089 340437 517296
13576E17296k42441j3070q8570L3071q056J16227G7410R4055o231K3454a15252
$$ 517296 274855 261785 173215 206286 198230 314457 77410 171465 165234 188688 -115252
13564H876J28461J68632n7893d8499B3604O7978k7854J65673J69496d6863A71833
$$ 8876 137337 305969 248076 -48499 23604 91582 63728 229401 398897 -46863 171833
13552A47995m2004K86851A75673K28925k1143R562B7636M08189A34810g3705A24546
$$ 147995 105991 392842 175673 404598 383455 393017 27636 435825 134810 -73705 124546
13540C19148A43076f7767A71420J34061A45534b4125B7799D259M19140A75018
$$ 319148 143076 -67767 171420 305481 145534 -24125 27799 4259 423399 175018
13529B05920P4885p4008K63985q0897d6434A40483L34831B09310L20535B54419
$$ 205920 280805 206797 470782 389885 -46434 140483 475314 209310 529845 254419
13518A60825m5777J21464E2362J29895o7429l1146n618B7535M22812g1927B46793
$$ 160825 115048 236512 52362 182257 114828 83682 78064 27535 450347 -71927 246793
13506I2466j6199L98512A54750a3047B41307n5573B6034K00074n6657J30765A16092
$$ 92466 76267 474779 154750 -13047 241307 185734 26034 226108 169451 300216 116092
13494B93504A30415K8696A7199L10953H2114f2839a6657m084D7227J92967A06340
$$ 293504 130415 159111 17199 328152 82114 -62839 -16657 -20741 47227 240194 106340
13482A29019R1382M5034p7308e2630A81592N2325p7047h8489K3762N056B70717
$$ 129019 220401 265435 188127 -52630 181592 233917 156870 -88489 -64727 -59671 270717
13470A83237a20722L7059A05307b51482a6706D18646a78877A20392B5908J75757
$$ 183237 -120722 -83663 105307 -251482 -16706 418646 -178877 120392 25908 201665
13460B01665L0492j11239O1130A9524O771J96522L0294H7163g5229B19079B6847
$$ 201665 232157 120918 182048 19524 26295 222817 253111 87163 -75229 219079 26847
13448h350D23476A73852J69724A15180M6510k8577k9909h9979D20259j35130p8565
$$ -8350 423476 173852 343576 115180 161690 133113 103204 -89979 420259 285129 206564
13437B06564K6812m5383a35841j9199A07405D1019K18007E8662j2868K1988J93913
$$ 206564 233376 187993 -135841 -155040 107405 41019 259026 58662 45794 67782 261695
13426B61695M8110c8868a8223I7609a36180d7428A72661q2590L96131j23846C5584
$$ 261695 309805 -38868 -18223 97609 -136180 -47428 172661 90071 486202 362356 35584
13414c8512I3349M35059B37054O617O5264D4049J80368C8317h0069E7862J49341
$$ -38512 93349 528408 237054 243671 308935 44049 224417 38317 -80069 57862 207203
13403B07203J3576K48283F2456R4623A3444J9491j5895J18010B4270L920M7902
$$ 207203 220779 469062 62456 157079 13444 32935 17040 135050 24270 28190 76092
13392G6092I783J1686e6703E5559P8048b7701C01321d55658A76508C4911L96760
$$ 76092 9783 21469 -56703 55559 133607 -27701 301321 -455658 176508 34911 431671
13381D31671A66140n4185C1478Q6097m8496Q2196n2097b5445B35715p9529a8548
$$ 431671 166140 111955 31478 117575 69079 151275 99178 -25445 235715 156186 -18548
13369B61442d4252k7731A6053J52447K58497D0474J42627H3581f2985j09099e4480
$$ 261442 -44252 -71983 16053 168500 426997 40474 183101 83581 -62985 -172084 -54480
13357B52366A12706A3925a15251B35153J3607j9920L005L707N281p4878B4280
$$ 252366 112706 13925 -115251 235153 248760 228840 231845 235552 240833 165955 24280
13345C22072A8350K81133A06768L81007j24196n2965J08173a092C75639j25814
$$ 322072 18350 299483 106768 487775 363579 310614 418787 -1092 375639 249825
13335B49825B7160K33113G3074J95062a61167a8119n2080A53745h4973A61904
$$ 249825 27160 260273 73074 268136 -161167 -18119 -70199 153745 -84973 161904
13324c8099C56321H7701K09190D5923M07507A46331J9988c2420A6685J46449J87694
$$ -38099 356321 87701 296891 45923 453430 146331 166319 -32420 16685 163134 350828
13313C50828B4283J1300M38738r1856a29950d2926C65824B4248K47749J5295O5578
$$ 350828 24283 35583 474321 382465 -129950 -42926 365824 24248 271997 287292 352870
13302C52870b18376A84389g0752D8564a66831B26328D708J83373a06334J4356
$$ 352870 -218376 184389 -70752 48564 -166831 226328 4708 188081 -106334 -91978
13292i1978B64952A03807J13021a8055D20530j92112g8035a3424j04538F3935
$$ -91978 264952 103807 216828 -18055 420530 228418 -78035 -13424 -117962 63935
13281A2560J98589o1461J6228p3505a43929O4186p6773D44454e9938B82164G7098
$$ 12560 211149 149688 165916 92411 -143929 -79743 -156516 444454 -59938 282164 77098
13269b4752G2813B6205J23358J3720n8279O5268C3652L18509A66931d8137A49399
$$ -24752 72813 26205 149563 163283 105004 170272 33652 352161 166931 -48137 149399
13257C1399a66910B57347i1777k47468C20897H7480a21709E097e33413a17669
$$ 31399 -166910 257347 -91777 -339245 320897 87480 -121709 5097 -533413 -117669
13246A70426h2066l3370A07815h9566A25858a24250G6381P8685N1430a22978N5567
$$ 170426 -82066 -115436 107815 -89566 125858 -124250 76381 155066 206496 -122978 -67411
13235f7411A7750M6438a09806A26886j6294a13654G7925a66993A61030K3982H7654
$$ -67411 17750 64188 -109806 126886 110592 -113654 77925 -166993 161030 185012 87654
13223C79700A42284h6828J2113B6632K36162q0348i2532C8181L74116A04390D7678
$$ 379700 142284 -86828 -74715 26632 262794 182446 -92532 38181 412297 104390 47678
13211a21860G3481J0216B4897K13845a27054D0580O5354a3252B42863C9438d48358
$$ -121860 73481 83697 24897 238742 -127054 40580 105934 -13252 242863 39438 -448358
13199b6510j93918A22620d0969A07618R806D3869R4311n4310a08733m7377A72816
$$ -26510 -220428 122620 -40969 107618 117424 43869 138180 83870 -108733 -156110 172816
13187A43973j1117l9416C7085a1275m8240B57066P9811A7143b3668A43137d2383
$$ 143973 132856 93440 37085 -11275 -59515 257066 336877 17143 -23668 143137 -42383
13175C9838L8721N6975j5359e4209a6863m3260A52493Q6604H8877f3865B68693
$$ 39838 78559 135534 120175 -54209 -16863 -60123 152493 239097 88877 -63865 268693
13163b04218E3091J52141c9841j52044H8734k0729r592J66871n3860B6247c4478
$$ -204218 53091 205232 -39841 -191885 88734 68005 58413 225284 171424 26247 -34478
13151f450n4730O710J0082b1944E8876K6180b95374j82330d8121j61281B82597
$$ -6450 -61180 -54470 -44388 -21944 58876 85056 -295374 -477704 -48121 -209402 282597
13139B89426q4521J43601D0891L2765a65530A41541E641J05305J43935i0713B312
$$ 289426 204905 348506 40891 73656 -165530 141541 5641 110946 254881 -90713 2312
13127d9177A21660i139D73565a08435L6115A06069J36790b03686f9513j8746A92083
$$ -49177 121660 -9139 473565 -108435 -72320 106069 242859 -203686 -69513 -88259 192083
13115A457d0358M029r3009A25692I921b3664A09113M9395b055r743D6258g903
$$ 1457 -40358 -36329 -129338 125692 9921 -23664 109113 158508 -2055 -11798 46258 -7903
13102d1521C19783a2015A02579q206K5471Q715M6018d0574r1552A33543a9412
$$ -41521 319783 -12015 102579 94373 119844 128559 174577 -40574 -132126 133543 -19412
13090f5701J5520p4741f153j13841A21433M1419h3549k82298A44021C3934e6979
$$ -65701 -50181 -124922 -6153 -119994 121433 162852 -83549 -365847 144021 33934 -56979
13078F2772Q8077L5426H3205d61563E8459P0187h2868j07771I4902J87822b41021
$$ 62772 150849 186275 83205 -461563 58459 128646 -82868 -190639 94902 282724 -241021
13066B12658r54c4620B0320i2186j10760h2032C0529P5427M4645b14263P1350
$$ 212658 211704 -34620 20320 -92186 -202946 -82032 30529 105956 150601 -214263 -142913
13055a42913A19639Q2701A8355K97807G7749d1771A6215N1209a06627I1437J45634
$$ -142913 119639 202340 18355 316162 77749 -41771 16215 67424 -106627 91437 237071
13044B37071A01375a40485I6147g9509m01878A27708k8536K81614j85796J6668
$$ 237071 101375 -140485 96147 -79509 -481387 127708 99172 380786 194990 211658
13034B11658o3798J17293b62843B0332K44349k6519c8051B14525l0039c58477
$$ 211658 147860 265153 -262843 20332 264681 238162 -38051 214525 184486 -358477
13023I4945j6432c18823a04509G0403b09312M8659A02215a16968L4636L2178A9493
$$ 94945 78513 -318823 -104509 70403 -209312 -160653 102215 -116968 -82332 -50154 19493
13011a59135B13010h9766D9777J24195B4945a08307F9021a36608B30773J66970
$$ -159135 213010 -89766 49777 173972 24945 -108307 69021 -136608 230773 397743
13001C97743E4492d5892k27246A26339E5427d0726C730b5412q5197d4587j88118
$$ 397743 54492 -45892 -273138 126339 55427 -40726 3730 -25412 -110609 -44587 -232705
12990b32705A86068F3880J8938A4159K13465a90495Q4071j49710A0880O1914K37337
$$ -232705 186068 63880 82818 14159 227624 -190495 -106424 -256134 10880 72794 310131
12979C10131p7157a50021O5447D8153a96644I136i4584j11385n2283D722K03153
$$ 310131 232974 -150021 -84574 48153 -196644 9136 -94584 -205969 -258252 4722 207875
12968B07875n1587L33862r8534a3297B57420F7820R5206K5334b02672k47491F2172
$$ 207875 156288 490150 391616 -13297 257420 67820 163026 188360 -202672 -450163 62172
12956g5086J8384k069G7243J29985e2295j4895A0801a38329b2879j30797q8364
$$ -75086 -56702 -58771 77243 207228 -52295 -67190 10801 -138329 -22879 -153676 -242040
12945b42040l4548B33715B1332K05797h3971M0070m4268H7794a3365I7397h5282
$$ -242040 -276588 233715 21332 227129 -83971 -43901 -88169 87794 -13365 97397 -85282
12933C4574b844B71055a8265H6275f7237E6330O3917a28382H290J18110a01316
$$ 34574 -2844 271055 -18265 86275 -67237 56330 120247 -128382 8290 126400 -101316
12921B94378j46799g8060f870j66362j3759B43644e3981k42848a6904A7516c19731
$$ 294378 147579 -78060 -6870 -173232 -186991 243644 -53981 -296829 -16904 17516 -319731
12909B70148a60557i612G6781C7672f786E877h240k94092I1129e9533C90310c7088
$$ 270148 -160557 -9612 76781 37672 -6786 5877 -8240 -302332 91129 -59533 390310 -37088
12896H2689B2249g9870B79011b57948J23779c6152A52679C9980e8713C84458e6609
$$ 82689 22249 -79870 279011 -257948 -134169 -36152 152679 39980 -58713 384458 -56609
12884h8535A36987J92231j54467a81518B34687a00193n9649O1008F4502c1701
$$ -88535 136987 329218 174751 -181518 234687 -100193 -159842 -98834 64502 -31701
12873b10468h6941B45799b01817G4001a19913F52e10185C3904k765g3066D9442
$$ -210468 -86941 245799 -201817 74001 -119913 652 -510185 33904 31139 -73066 49442
12861B15336F1837P4045c9982j23291B86703i3634K0774I0085d171D2971a37718
$$ 215336 61837 135882 -39982 -163273 286703 -93634 -72860 90085 -4171 42971 -137718
12849F3411a82417n6216I9310J66158D9496J12700p4192p283b26502J0162a050
$$ 63411 -182417 -238633 99310 265468 49496 162196 88004 80721 -226502 -216340 -1050
12837F6211i7731l0059K6798c8174C4708a48308j8730I9926c699A92000B2288
$$ 66211 -97731 -127790 -100992 -38174 34708 -148308 -167038 99926 -3699 192000 22288
12825b16308d4872A2589a52303E407J3137h540m33372b2165j07605F1857j952
$$ -216308 -44872 12589 -152303 5407 18544 -8540 -441912 -22165 -129770 61857 59905
12814E9905h6860j72034F0801a34573e1369ij93761A55861a4130C31496C5351
$$ 59905 -86860 -258894 60801 -134573 -51369 -9 -193770 155861 -14130 331496 35351
12802i6030a0508k40754c1879B2235L0232f84k4144p9101A13146d1811k72000
$$ -96030 -10508 -251262 -31879 22235 52467 -684 -24828 -103929 113146 -41811 -313811
12791c13811a50900b8081l44284B34967d6156m7931D47196c7404J5044D3343a597
$$ -313811 -150900 -28081 -372365 234967 -46156 -94087 447196 -37404 -22360 43343 -1597
12779A02322a99470H8796A1953L01906D7869j4338J48740d867k24422o0306A37895
$$ 102322 -199470 88796 11953 313859 47869 33531 182271 -4867 -229289 -289595 137895
12767A55647N0849B2087J12975i364p711D483a87438C3097g593B9548N1366k8128
$$ 155647 206496 22087 135062 -9364 -17075 4483 -187438 33097 -7593 29548 80914 52786
12755E2786L61741b6655C8854H745J92887m5019A9968a96650A81265G7220b00604
$$ 52786 414527 -26655 38854 8745 201632 156613 19968 -196650 181265 77220 -200604
12743c82889E7083b91147P3081N1309E03a47566A6270N8097l4260a0076B32280
$$ -382889 57083 -291147 -218066 -166757 503 -147566 16270 74367 40107 -10076 232280
12731I8176R553b75153f1604A89334c31812A55739a60828B3298h4695R013q2887
$$ 98176 107729 -275153 -61604 189334 -331812 155739 -160828 23298 -84695 -75682 -158569
12720a58569B46460o034c43677B25181q504i6554k11489B39565b00528f2001A17970
$$ -158569 246460 240426 -343677 225181 216677 -96554 -308043 239565 -200528 -62001 117970
12708E694J62238d100r6668A14796J16508L17959B18160q7012b17010a5517M182
$$ 5694 167932 -4100 -100768 114796 231304 549263 218160 131148 -217010 -15517 -11335
12697a1335j92642B47791K4901q5354a25974C02645A17433n5021P6082k5644J45936
$$ -11335 -203977 247791 272692 187338 -125974 302645 117433 62412 138494 112850 258786
12686B58786D4891i3848c003l22183E5454b12115B91817d3728B08725h6755L8214
$$ 258786 44891 -93848 -3003 -325186 55454 -212115 291817 -43728 208725 -86755 -48541
12675d8541l3043A34699c8794H651M1a53994N9349A04457d9992C24033A9098M7733
$$ -48541 -81584 134699 -38794 8651 8692 -153994 -94645 104457 -49992 324033 19098 66831
12663F6831J43629j9131O2342br8786I9295a17435K5991B81860a9825j01550e9461
$$ 66831 210460 191329 253671 -2 -98788 99295 -117435 -91444 281860 -19825 -121375 -59461
12650A36261a93477M0732b2565j01413I0666K2365e0196b3188I0471a07332C5787
$$ 136261 -193477 -152745 -22565 -123978 90666 113031 -50196 -23188 90471 -107332 35787
12638B10409F1941c5760A95518b56476M6916P6042K2774B07295l8098Q0828J20351
$$ 210409 61941 -35760 195518 -256476 -209560 -133518 -110744 207295 169197 250025 370376
12627C70376r5391b48771R0910A42375d5868A77865i6149A2155J09041b85231
$$ 370376 274985 -248771 -157861 142375 -45868 177865 -96149 12155 121196 -285231
12616B28604I7455i3272l11158A80676a32432m7651A58864A8303a09790q7481
$$ 228604 97455 -93272 -404430 180676 -132432 -180083 158864 18303 -109790 -197271
12606a97271G9053e3809A78894L6550G2712C202J61227p7685b31900K5076L622
$$ -197271 79053 -53809 178894 215444 72712 3202 164429 86744 -231900 -206824 -203202
12595b03202F3956b33606A26522a0030G9183a5400j55405O5270A23070e4130J1595
$$ -203202 63956 -233606 126522 -10030 79183 -15400 -170805 -105535 123070 -54130 -42535
12584d2535l33769H6421A8323J08295J92742r1347F3758d3180H2176a20964C515
$$ -42535 -376304 86421 18323 126618 319360 228013 63758 -43180 82176 -120964 3515
12572F9663b79572J34589F7934b39941B05010N5675j403F0133c13345A45702a49940
$$ 69663 -279572 -144983 67934 -239941 205010 260685 259282 60133 -313345 145702 -149940
12560a51452k06024C3330L63244j81598b8850A86963J1743c1264a0248G5196J45961
$$ -151452 -357476 33330 396574 214976 -28850 186963 198706 -31264 -10248 75196 221157
12549B21157D3775a0703A50486K70111A12748K05851h3708A85679A9067f8268
$$ 221157 43775 -10703 150486 420597 112748 318599 -83708 185679 19067 -68268
12538h7671B27985d9315r3479j02043A0537a61488j6672D7769a39950j44560a0842
$$ -87671 227985 -49315 -142794 -244837 10537 -161488 -178160 47769 -139950 -284510 -10842
12526B27570g5926A34804b50286D6620J5427C502L25885o6403b692I7049L66848
$$ 227570 -75926 134804 -250286 46620 62047 3502 329387 262984 -2692 97049 463897
12515D63897A5393K77798A16863a6621H7793h017k63121A53510a54969B5308P3441
$$ 463897 15393 293191 116863 -16621 87793 -8017 -271138 153510 -154969 25308 98749
12504I8749K07922a14927k0730L5001d4526A7781a27797k12225g8995A33741R123
$$ 98749 306671 -114927 -135657 -100656 -44526 17781 -127797 -340022 -78995 133741 142864
12493A42864a99613b4210B0070L33261l480C1154E056f6447I5074J77018a66093
$$ 142864 -199613 -24210 20070 353331 349851 31154 5056 -66447 95074 272092 -166093
12481B32052E534J52214b83555B88814d17849d775l1619j15679M6818B1698a07894
$$ 232052 5534 157748 -283555 288814 -417849 -4775 -36394 -152073 -105255 21698 -107894
12469a3300j44163c6652A96276d75181a11498K2335n9198a3491k508A18868a08836
$$ -13300 -157463 -36652 196276 -475181 -111498 -89163 -148361 -13491 -15999 118868 -108836
12457B5158b79352G1294K06969A5853J10670c05993a5028j95824c7283j85863
$$ 25158 -279352 71294 278263 15853 126523 -305993 -15028 -210852 -37283 -223146
12447b23146j02991L7853a36849B53333b56949A86361a86570A60486E9173B4753
$$ -223146 -326137 -288284 -136849 253333 -256949 186361 -186570 160486 59173 24753
12436b96452a04441R556A96833I1302a49285b850m8519C61103A00233d0293k48244
$$ -296452 -104441 -94885 196833 91302 -149285 -2850 -51369 361103 100233 -40293 -288537
12425b88537I8291L7402f3814R612A21813L5320M4439g2342j75684J25r1590P1434
$$ -288537 98291 135693 -63814 -54202 121813 157133 201572 -72342 -248026 -247901 -339491 -268057
12413b68057j33384A39801o4586n377R098k7863b14420J02981o7776a5252A85936
$$ -268057 -401441 139801 75215 69838 78936 51073 -214420 -111439 -179215 -15252 185936
12401e1280q72a4886G6623J32309d3744r0366k598C4149J51835n1645b7871a1107
$$ -51280 -52152 -14886 76623 208932 -43744 -134110 -136708 34149 185984 134339 -27871 -11107
12388e7920K5449B04608g067B16600F7490a61082b8947A97938A8666e9198D3837
$$ -57920 -32471 204608 -7067 216600 67490 -161082 -28947 197938 18666 -59198 43837
12376C14103m266b41917B12961l2204C3152e7950A88046b91499F5931b176D20637
$$ 314103 309837 -241917 212961 180757 33152 -57950 188046 -291499 65931 -2176 420637
12364C12452j50605A099a06600F9570D327d85166C52705A17850h885r4626D13603
$$ 312452 161847 1099 -106600 69570 4327 -485166 352705 117850 -8885 -103511 413603
12352A1846e2022B17745b40749e0358q1956c762j93684G7848B4085B567a89539
$$ 11846 -52022 217745 -240749 -50358 -132314 -3762 -197446 77848 24085 2567 -189539
12340B99443A5617a67701C10148I0726k9907M9113a78005H787b67053C56152b57815
$$ 299443 15617 -167701 310148 90726 60819 109932 -178005 8787 -267053 356152 -257815
12328A06845a51587M5988r6741G9261a54402F9812A1282Q4290c80386h1103j00187
$$ 106845 -151587 -105599 -202340 79261 -154402 69812 11282 95572 -380386 -81103 -181290
12317a81290C8956J0633K1421O94B1633b6143r8422L2166D9319h0090j00175c7952
$$ -181290 38956 49589 71010 71704 21633 -26143 -124565 -92399 49319 -80090 -180265 -37952
12304e051m3421B36415b71367E0052J3204N5094P4373a59635e8842J8371m7806
$$ -5051 -48472 236415 -271367 50052 63256 118350 192723 -159635 -58842 -40471 -88277
12293h8277B23097b11838M2924C78291A62559b16959e2212A46782f1954B4271
$$ -88277 223097 -211838 -168914 378291 162559 -216959 -52212 146782 -61954 24271
12282D6625J02854o7326a43552H0529f9666j61383G6413b40094G3773N10972a0092
$$ 46625 149479 82153 -143552 80529 -69666 -231049 76413 -240094 73773 584745 -10092
12270a55602A10355b4439B80067E5333J87161j7055b60261C2589K45507g8316
$$ -155602 110355 -24439 280067 55333 242494 225439 -260261 32589 278096 -78316
12259e5836A27998c7898A26459i7388M422D1945J07842J0816k7287b3788B15111
$$ -55836 127998 -37898 126459 -97388 -92966 41945 149787 160603 133316 -23788 215111
12247A33125K9787K40016E7418J46148A2369J16991c00517C57448j72794a37772
$$ 133125 162912 402928 57418 203566 12369 129360 -300517 357448 184654 -137772
12236d4435D6621L1242a58478e7996k22056J4175A87427F4767B9493Q2774L28492
$$ -44435 46621 77863 -158478 -57996 -280052 -265877 187427 64767 29493 112267 440759
12225D40759I1953L9710Q9844O9918p4167q7692N1030K74893A37908e7291G6687
$$ 440759 91953 131663 221507 291425 217258 129566 180596 455489 137908 -57291 76687
12213i9394M8890B95349m8627G7503k5455P4369h0452A02091J17970J21370L4039
$$ -99394 -50504 295349 246722 77503 52048 126417 -80452 102091 220061 341431 375470
12202C75470A4855J37362J28677G8181J73785o9538P1352L0134m9039O142I7686
$$ 375470 14855 152217 280894 78181 251966 182428 253780 283914 234875 241017 97686
12190h1633C64516K3619i2520B61160e6800C71812G8818J26538E1561a4458H5523
$$ -81633 364516 388135 -92520 261160 -56800 371812 78818 205356 51561 -14458 85523
12178B50602a81122G4046P1700O4578M6189j2439l9772F8463K10762j35844A1714
$$ 250602 -181122 74046 145746 210324 256513 244074 204302 68463 279225 143381 11714
12166a92265E951J50793N9263q569L7797k7931r1561l622a28237B39510K48690
$$ -192265 5951 156744 216007 207438 245235 217304 125743 122121 -128237 239510 488200
12155D88200b50537b6212D7891K40232B7968q951J10551b49233A7210J36730a59373
$$ 488200 -250537 -26212 47891 288123 27968 19017 129568 -249233 17210 153940 -159373
12143i8469B19963r5290Q2516a5091G1536a49917A16812K599E3949J7075b35144
$$ -98469 219963 124673 207189 -15091 71536 -149917 116812 119411 53949 71024 -235144
12131F3892n264J90469P7862G266J57162L9085Q4012H2520J72032A16856J78724
$$ 63892 58628 249097 326959 7266 164428 203513 287525 82520 254552 116856 295580
12120B95580D6248N3236a26762G5169b01406B62570a16431e5254j30951i2036
$$ 295580 46248 99484 -126762 75169 -201406 262570 -116431 -55254 -186205 -92036
12109b29080a2929E5833J89788J36050A47924o8172A3702b52782M9677B0211J08541
$$ -229080 -12929 55833 245621 381671 147924 79752 13702 -252782 -203105 20211 128752
12098A28752a20039C22294A35104n5541J40655b77662H6529e6784m57930a81579
$$ 128752 -120039 322294 135104 79563 220218 -277662 86529 -56784 -514714 -181579
12087G3605O6728c6520A02312K96287d82n3009j5755k35670p8325B7922b37591
$$ 73605 140333 -36520 102312 398599 -482 -53491 -69246 -304916 -383241 27922 -237591
12075A12734j895b82787a28535A09096R500d4516p0144A12069i0244k8536D0993
$$ 112734 110839 -282787 -128535 109096 118596 -44516 -114660 112069 -90244 -118780 40993
12063A33730M6621e7291j54307J6219F1200G774a40103c3996l7301A33232N6571
$$ 133730 180351 -57291 -211598 -195379 61200 7774 -140103 -33996 -71297 133232 189803
12052A89803a58606k3495b3404A54495a46553B76571c05114J31131B4308c3599
$$ 189803 -158606 -182101 -23404 154495 -146553 276571 -305114 -173983 24308 -33599
12041c71928a06229k15575N1302C8106J07387m5506K34735b11444K9836B23743
$$ -371928 -106229 -321804 -270502 38106 145493 99987 334722 -211444 -181608 223743
12030d6962k08528C4438g6006j22413L0181g9708G9407b3121A94178o0621b6854
$$ -46962 -255490 34438 -76006 -198419 -168238 -79708 79407 -23121 194178 133557 -26854
12018H7213J35729a26281A71023a4725A79333b39740e5829A3265a26889M2520
$$ 87213 222942 -126281 171023 -14725 179333 -239740 -55829 13265 -126889 -84369
12008h4369A08955J4209h7138A60844a05653C918b26191j03070B94579I4905c25932
$$ -84369 108955 123164 -87138 160844 -105653 3918 -226191 -329261 294579 94905 -325932
11996a75067C2261i696k78699A209b09427B43259b6694k41789D430J85162D8251
$$ -175067 32261 -9696 -288395 1209 -209427 243259 -26694 -268483 4430 189592 48251
11984A71065d0255n6987p3338P0896Q087b9834K936j58225i603m51399a24003
$$ 171065 -40255 -97242 -170580 -99684 -91597 -29834 -26898 -185123 -9603 -461002 -124003
11972a18079J2590K8491B7800b54253O6696g2178o2905l8106d4012B03831a05426
$$ -118079 -105489 -76998 27800 -254253 -187557 -72178 -135083 -173189 -44012 203831 -105426
11960b76645G7677K7306b27140B49683a15248G2700j4976a79763G1930g2093A10292
$$ -276645 77677 104983 -227140 249683 -115248 72700 57724 -179763 71930 -72093 110292
11948c0350A87721j6220K6120l8831d32934A15160A4907J62924p4988q704J7293
$$ -30350 187721 171501 197621 158790 -432934 115160 14907 177831 102843 94139 111432
11937A11432D9387c11846J35370A63717k6108N4325M5452h916A3632a1256n2218
$$ 111432 49387 -311846 -176476 163717 137609 191934 237386 -8916 13632 -11256 -63474
11926f3474l4580A62353a45526A3100c84741a1544m7943D0277J23753G8813K1324
$$ -63474 -98054 162353 -145526 13100 -384741 -11544 -59487 40277 164030 78813 100137
11915A00137c469q1160F1135g0042K6043R336j83393H0301c25259a24729b3621
$$ 100137 -3469 -84629 61135 -70042 -43999 -34663 -218056 80301 -325259 -124729 -23621
11903a40296J3663m6567A6903d3589B08920a95113A98798H1640k5644a60167M9351
$$ -140296 -126633 -173200 16903 -43589 208920 -195113 198798 81640 55996 -160167 -110816
11892a10816d9976A60241b42837N1744h4994k8615k3451j03054N7554a513j23455
$$ -110816 -49976 160241 -242837 -191093 -84994 -113609 -137060 -240114 -182560 -1513 -124968
11881a24968d4039j18765A53750f6458E930L8777c6010C9187Q2775b30175k24133
$$ -124968 -44039 -162804 153750 -66458 5930 44707 -36010 39187 121962 -230175 -454308
11870d54308A80859n7672d80334a66824j6485A63701a69363O8691D2479b05113
$$ -454308 180859 123187 -480334 -166824 -183309 163701 -169363 -100672 42479 -205113
11859A57572C6360a61064A70624i8509L6695e98p5127B41931E6884g2052j19277
$$ 157572 36360 -161064 170624 -98509 -61814 -598 -75725 241931 56884 -72052 -191329
11848a91329D7837b33873H5033j0475K69905a46677I9501J24658a4968j44839
$$ -191329 47837 -233873 85033 74558 344463 -146677 99501 224159 -14968 -159807
11838a59807L6646d4075j47563A48858l216a68802e1646A32070b73319a20586
$$ -159807 -123161 -44075 -191638 148858 145642 -168802 -51646 132070 -273319 -120586
11827E552f5731C2436C538J04462c82743J51118B9735J20480f4628k9936a3581
$$ 5552 -65731 32436 3538 108000 -382743 -231625 29735 150215 -64628 -94564 -13581
11815I1438a72787m4861e3933A78725o2520b93301A06811e5162j06972j26554
$$ 91438 -172787 -217648 -53933 178725 116205 -293301 106811 -55162 -162134 -288688
11805b88688a40585J5578m4193I777J71174f2660A09909J2863c29690A37590a7828
$$ -288688 -140585 -125007 -169200 9777 180951 -62660 109909 122772 -329690 137590 -17828
11793h7316C1296b02424A4423E430J82431a30142I5623A6101a16715A3427b24146
$$ -87316 31296 -202424 14423 5430 187861 -130142 95623 16101 -116715 13427 -224146
11781c62011C25655a00435m4887j82813C3438a24381j12869D4907i9124O562j91081
$$ -362011 325655 -100435 -145322 -328135 33438 -124381 -237250 44907 -99124 -92562 -283643
11770b83643G6788K93443A43328e8006j42229R6301B58727F3793b30322a2518
$$ -283643 76788 370231 143328 -58006 -200235 -103934 258727 63793 -230322 -12518
11759A12977J247g686E0002b94623A04882c11705A9031J68809H2955p269J3245
$$ 112977 114224 -7686 50002 -294623 104882 -311705 19031 187840 82955 75686 88931
11748H8931b29429j57147b5660B21084A0496b2411k16834J00826B8696d5012o085
$$ 88931 -229429 -386576 -25660 221084 10496 -22411 -239245 -138419 28696 -45012 -51097
11737e1097r9341I4738O829b2805j68407B37190c1644o3114k44691A86411A7562
$$ -51097 -150438 94738 101567 -22805 -191212 237190 -31644 -94758 -339449 186411 17562
11725a4671H9111b75B19710E6088K02541f57m5232k2408c212j02987H4215R3652
$$ -14671 89111 -275 219710 56088 258629 -657 -45889 -68297 -3212 -106199 84215 177867
11713A77867J84886j68883d60472a42256L9515o6874A15630a18802a0926A23279
$$ 177867 362753 193870 -460472 -142256 -102741 -169615 115630 -118802 -10926 123279
11702a51673A04041a50466F6974N1070C1993J70031J19955j58428J84294P0522
$$ -151673 104041 -150466 66974 118044 31993 202024 321979 163551 347845 418367
11692D18367j39184p9631H7583a36894d9461F4543f3383l95n1558A17539c1136
$$ 418367 279183 199552 87583 -136894 -49461 64543 -63383 -63778 -115336 117539 -31136
11680f8704A3460d2027j16939C58193H6088J6270b29209C00L4561K76196b29811
$$ -68704 13460 -42027 -158966 358193 86088 102358 -229209 300 34861 311057 -229811
11668a62286k8606A33434a20266k0669b1110k06809g6409A72348b9396E8214a24698
$$ -162286 -190892 133434 -120266 -140935 -21110 -227919 -76409 172348 -29396 58214 -124698
11656a99121A47743b1887A92554J30641a26601O1347j20846A7882b2485p1989
$$ -199121 147743 -21887 192554 323195 -126601 -65254 -186100 17882 -22485 -94474
11646i4474i523D356a59338l6067E6360j7745a60924d0728b251A77154A8275O0086
$$ -94474 -9523 4356 -159338 -195405 56360 38615 -160924 -40728 -2251 177154 18275 78361
11634G8361b78034r3890G1785N0508A5574K59181a7766D6803O0628a03438G5200
$$ 78361 -278034 -371924 71785 122293 15574 274755 -17766 46803 107431 -103438 75200
11622a9674H6175L3551j9069O9272E4779K8450a11255c5829M99Q000A66450a37351
$$ -19674 86175 119726 100657 169929 54779 83229 -111255 -35829 -35330 -27330 166450 -137351
11609b2193A05505d2534B03676n0666L1769A8331K5610e7533A45713g5813l38493
$$ -22193 105505 -42534 203676 153010 184779 18331 43941 -57533 145713 -75813 -414306
11598d14306G7655d0908n884A66353a70375G4392J93417J21647A32531g5506B69661
$$ -414306 77655 -40908 -46792 166353 -170375 74392 267809 389456 132531 -75506 269661
11586a66077i022F9105d8425j31897b4238B579g3301r8558C32128a44849B38960
$$ -166077 -9022 69105 -48425 -180322 -24238 2579 -73301 -171859 332128 -144849 238960
11574h9473F5650J4654J53755b4302k4572D5383a10798n9793A48106B066R775
$$ -89473 65650 80304 234059 -24302 -48874 45383 -110798 -170591 148106 2066 11841
11563A1841J4357o461a15538A87110M9244j01511A5584f1992B90879G2609F580
$$ 11841 26198 19737 -115538 187110 236354 134843 15584 -61992 290879 72609 6580
11551b21020d8022l7461n022j49500A96580b29761i4125B16515a96422B40845
$$ -221020 -48022 -85483 -90505 -240005 196580 -229761 -94125 216515 -196422 240845
11540a90354A0404J07755a63294C22047a15520l142H6529c2282C17677A57308
$$ -190354 10404 118159 -163294 322047 -115520 -118662 86529 -32282 317677 157308
11529A86810E6069K05960q3645m6997J46489i1487B9657J20082A1897J06844a92160
$$ 186810 56069 262029 178384 131387 277876 -91487 29657 149739 11897 118741 -192160
11517A87087a81374B00465G8540J30629d8092j68143A13270e2278D42990B08220
$$ 187087 -181374 200465 78540 209169 -48092 -216235 113270 -52278 442990 208220
11506F2254g6807E1664J98794p4824b7172C16711H7637Q459M4948J78674c553
$$ 62254 -76807 51664 250458 175634 -27172 316711 87637 96096 141044 319718 -3553
11494D92456k25474A07012K09342G0022L50382c6959B23159G3258L09236j75857
$$ 492456 266982 107012 316354 70022 420404 -36959 223159 73258 382494 206637
11484B06637L4351A13301J38200J20660a16070k84389J85558A47792b2276D6586
$$ 206637 240988 113301 251501 372161 -116070 -400459 -214901 147792 -22276 46586
11473g2961B97026G5884H469L25652M3620A19816J0127e5599C29979O1264C9662
$$ -72961 297026 75884 8469 334121 377741 119816 129943 -55599 329979 391243 39662
11461A96519j1882b95896A42734G0493M993J69130F9023g3168F5359K9617m5512
$$ 196519 184637 -295896 142734 70493 75486 244616 69023 -73168 65359 94976 49464
11450D9464c97189A09771K9110j3317M968b1010B80567A7054K89638I8926m2264
$$ 49464 -397189 109771 138881 125564 130532 -21010 280567 17054 306692 98926 56662
11439E6662M893J14867p1930b28621E6790J13823j1488A6933K36100n1108a66929
$$ 56662 61555 176422 104492 -228621 56790 170613 159125 16933 253033 201925 -166929
11427g0646A78683a25089j29930A50037e8424C95700A10698a74440L8483B6288
$$ -70646 178683 -125089 -255019 150037 -58424 395700 110698 -174440 -135957 26288
11416b01920j13778A20504A0217K487Q6036c66538E3780a34912j01238A24051
$$ -201920 -315698 120504 10217 12704 98740 -366538 53780 -134912 -236150 124051
11405B30759c4009g146j8736A43629a02626D8479K20915f8798C09226A49724k7066
$$ 230759 -34009 -7146 -25882 143629 -102626 48479 269394 -68798 309226 149724 122658
11394A22658J1963K4524J29085A1086c0351D4802N8494g3351A83196a07004E5459
$$ 122658 134621 159145 288230 11086 -30351 44802 103296 -73351 183196 -107004 55459
11382h6297A04043b32539C13418H3311O2341h8541j75640D9409O8100K59537A18207
$$ -86297 104043 -232539 313418 83311 145652 -88541 -264181 49409 117509 377046 118207
11370c40584a3362A72683c04677g5499b1652A17522N7438h1879j25444B52381
$$ -340584 -13362 172683 -304677 -75499 -21652 117522 174960 -81879 -207323 252381
11359A11595c56622H4976J56637a1997j17032A37816g6431A50555b57335A16069
$$ 111595 -356622 84976 241613 -11997 -129029 137816 -76431 150555 -257335 116069
11348a58319B2049a59741A01728c66030A32596d6812j79218Q6697N1577B70328
$$ -158319 22049 -159741 101728 -366030 132596 -46812 -226030 -139333 -87756 270328
11337c2784q00G3738k8510a0368B5942a54462J5692D9548b49318A57279e63173
$$ -32784 -33584 73738 45228 -10368 25942 -154462 -138770 49548 -249318 157279 -563173
11325B42756f947k04263i819j74269j49165A50610l6768d04254M8056e064C57929
$$ 242756 -6947 -211210 -9819 -184088 -333253 150610 113842 -404254 -356198 -5064 357929
11313E898g9589c1254B05955e4112A49837c40669H945d1193J1697l33531A05685
$$ 5898 -79589 -31254 205955 -54112 149837 -340669 8945 -41193 -29496 -363027 105685
11301f2436A76635J19047r583a7939D8284K24953c44611B877a80664B75606A15798
$$ -62436 176635 295682 286099 -17939 48284 273237 -344611 2877 -180664 275606 115798
11289a07787I9797a32875c4720J3984m2209A26035K30649a88943C5944J5979b36430
$$ -107787 99797 -132875 -34720 -20736 -62945 126035 356684 -188943 35944 51923 -236430
11277i8975k73921a11706d1208k56547L6116C73627b77940C1584b22064e1076
$$ -98975 -372896 -111706 -41208 -297755 -261639 373627 -277940 31584 -222064 -51076
11266A56665a51396g585o4215b556p1192A91644a25136f183m3362B96718a96336
$$ 156665 -151396 -7585 -71800 -2556 -73748 191644 -125136 -6183 -49545 296718 -196336
11254a87329I7327D2655b67546I892a98628m3600O8023k03636I0073O7869o5602
$$ -187329 97327 42655 -267546 9892 -198628 -242228 -174205 -377841 90073 157942 92340
11243I2340i9430a0661E1968A5908b9498A15363a32038k33165A30811o2675a72715
$$ 92340 -99430 -10661 51968 15908 -29498 115363 -132038 -365203 130811 68136 -172715
11231H7810b67016B0245e9623C22227a74651J7034L0931m3927N5137B12701a931
$$ 87810 -267016 20245 -59623 322227 -174651 -157617 -126686 -170613 -115476 212701 -1931
11219g3652F6711b35223a12826j38943H0998f6238J2266k0999I8222N5173b90758
$$ -73652 66711 -235223 -112826 -251769 80998 -66238 -53972 -74971 98222 153395 -290758
11207A642J15766a08142a7649p4717B46520k2820b89678p0557H6695b08606A61299
$$ 1642 117408 -108142 -17649 -92366 246520 223700 -289678 -360235 86695 -208606 161299
11195A90295a80634L6206b9059j53176h9222m8523E0074b82403A5402a96009H1684
$$ 190295 -180634 -144428 -29059 -182235 -89222 -137745 50074 -282403 15402 -196009 81684
11183A00602d0735j7852A21152B5160N9040i295l7855A8703h2521F2349a39752
$$ 100602 -40735 -58587 121152 25160 84200 -9295 -47150 18703 -82521 62349 -139752
11171d0968j99086k27870h3630D63868b33479A30419D8009f5933j53721d5735
$$ -40968 -240054 -467924 -83630 463868 -233479 130419 48009 -65933 -219654 -45735
11160C88152c00154d2594C3184N3934J2878d4405b1794B56207c24062I8426Q6340
$$ 388152 -300154 -42594 33184 87118 99996 -44405 -21794 256207 -324062 98426 184766
11149A84766f8611A16499a53914B15014e5361D7619N8905J51706j10790c06864
$$ 184766 -68611 116499 -153914 215014 -55361 47619 106524 258230 147440 -306864
11138B7996h0747A11602L0315L5017D3637f4199A74573K39449a2595A03640Q2515
$$ 27996 -80747 111602 141917 176934 43637 -64199 174573 414022 -12595 103640 186155
11127A86155H610K88211A28315a28301e0893h263l5856h816n1504n8201A31285
$$ 186155 8610 296821 128315 -128301 -50893 -8263 -44119 -8816 -60320 -118521 131285
11115E1658N8394a6678r2A01517D4952j6226K81053j40142q790m1680D0682c25405
$$ 51658 110052 -16678 -16770 101517 44952 28726 309779 169637 160847 119167 40682 -325405
11102A73684E0638K28434j29090F7857L104i960p0831F1995k6010a48221H035
$$ 173684 50638 279072 149982 67857 70961 -9960 -80791 61995 35985 -148221 8035
11090A80353H0659J30142G9699L04613H6195L8868l415a23720D53551o3525A25309
$$ 180353 80659 210801 79699 384312 86195 125063 121648 -123720 453551 390026 125309
11078E24856k32961q8965J50715j41898O5253p7229J53356Q5207J27304l9701
$$ 524856 291895 202930 353645 211747 277000 199771 353127 438334 565638 525937
11068E25937A42022L74791k49906O1450O2139j48625K17536k3062m2398M13968
$$ 525937 142022 516813 266907 328357 390496 241871 459407 436345 393947 807915
11058H07915l11032l4548J04884L7232k24108K49883K73568j78447P2137j15035
$$ 807915 496883 462335 567219 604451 380343 630226 903794 725347 797484 682449
11048F82449K1664j42663O23077k30959j20712j46265J36621K344p2859m2566
$$ 682449 704113 561450 1184527 953568 832856 686591 823212 825556 752697 710131
11038G10131O4282k2575K1604P3625k01233K46000k33497J78671o9806j91949
$$ 710131 774413 751838 773442 847067 645834 891834 658337 837008 767202 575253
11028E75253M48279k34772k43125J45781N8986j40471N90855k46407J89258k47535
$$ 575253 1023532 788760 545635 691416 750402 609931 1200786 954379 1143637 896102
11018H96102j55614j53249j02404M55325k32176k69452K57270l2416J63721C59228
$$ 896102 740488 587239 484835 940160 707984 438532 695802 663386 827107 359228
11007H22145P3048J0139K00202m29141O227K09379l89042K93141o1794k19575
$$ 822145 895193 905332 1105534 676393 682620 891999 502957 796098 734304 514729
10997E14729J77128L9645j59933L06210k58864j8090L20202j68435L40942n2106
$$ 514729 691857 731502 571569 877779 618915 600825 921027 752592 1093534 1041428
10987A041428k78527R3777k12296N43502R5908l12537L45074R4754o2686p1016
$$ 1041428 762901 856678 644382 1187884 1283792 971255 1316329 1411083 1348397 1277381
10977A277381L26556J34731R778L40966J4248O60193N55323J65705L21866j27516
$$ 1277381 1603937 1738668 1748446 2089412 2103660 2763853 3319176 3484881 3806747 3679231
10967C679231M44354m31920k01909m95168o22362m37722l96798k08738p1485r7179
$$ 3679231 4123585 3691665 3489756 2994588 2372226 1934504 1537706 1328968 1257483 1160304
10957A160304K2278m2296m9818L81051l88483O589L2026k6662D81859q7246M36738
$$ 1160304 1182582 1140286 1090468 1471519 1083036 1089625 1121651 1094989 481859 394613 831351
10946H31351A18927L79021I4536K39293K17085A46673d0853D00093I3656K68163
$$ 831351 118927 497948 94536 333829 550914 146673 -40853 400093 93656 361819
10936C61819j67665J4304j00547b5766A47388C5605b61568B40196q6798c8083
$$ 361819 194154 208458 107911 -25766 147388 35605 -261568 240196 153398 -38083
10925B00197Q4276E3635J30571b19895a03848B47764j839r5300b81218H3491C6136
$$ 200197 284473 53635 184206 -219895 -103848 247764 245925 150625 -281218 83491 36136
10913B91235a10512I9362c30377P2556P0989D1556N7845a60317C51489a49076
$$ 291235 -110512 99362 -330377 -257821 -186832 41556 99401 -160317 351489 -149076
10902f5007K8744a6833r5956M7649J7404j95612F4531a97086J0104J4486f3386
$$ -65007 -36263 -16833 -112789 -65140 -47736 -243348 64531 -197086 -186982 -172496 -63386
10890I7735h3271A17898c11027A91151d3583k37256e0376q0823A17618B3197b3652
$$ 97735 -83271 117898 -311027 191151 -43583 -280839 -50376 -131199 117618 23197 -23652
10878i1264j4118e677G1784d01388a48804J260j68742C0178J1322J11415D8374
$$ -91264 -105382 -5677 71784 -401388 -148804 -147544 -316286 30178 41500 152915 48374
10866b7353A85711p3346g1777j50660e2335q9167q209N7990N736L5312B5025b08182
$$ -27353 185711 112365 -71777 -222437 -52335 -141502 -149711 -91721 -85985 -50673 25025 -208182
10853A68486n6250a5838j5463A95292H1449b58473A85419a21939q0197R227n184
$$ 168486 112236 -15838 -31301 195292 81449 -258473 185419 -121939 -202136 -192909 -198093
10842a98093B87176c3354j03907r9213E0101h4022A43557J27491r2484D1902b45419
$$ -198093 287176 -33354 -137261 -236474 50101 -84022 143557 271048 178564 41902 -245419
10830a84940P0696B3881a14289A136a05067E2307b402m7726B04847I149P1175
$$ -184940 -114244 23881 -114289 1136 -105067 52307 -2402 -50128 204847 9149 80324
10819H0324b8319m3109D7800c37042A23352a83580I7016j5052J08706b457k4245
$$ 80324 -28319 -71428 47800 -337042 123352 -183580 97016 81964 190670 -2457 -26702
10808b6702l01108A9680M947a02691J064M2676b2101I3302b48887a06747p6610
$$ -26702 -327810 19680 24627 -102691 -101627 -58951 -22101 93302 -248887 -106747 -183357
10797a83357c9373j53903B4103b69029A95704c00577o3077C69613j78053b68502
$$ -183357 -39373 -193276 24103 -269029 195704 -300577 -363654 369613 191560 -268502
10786a13780A5437m475e0660C1885M0076a16177G8549a37173J8095A88017a81848
$$ -113780 15437 10962 -50660 31885 71961 -116177 78549 -137173 -119078 188017 -181848
10774h3740K0537B08571a5864j31203M6894K0226j0926l4427A1831f2432j34613
$$ -83740 -63203 208571 -15864 -147067 -100173 -79947 -90873 -125300 11831 -62432 -197045
10763a97045h7108A55354C5991a95821a7002k36444B5413I296K08957b89033L3523
$$ -197045 -87108 155354 35991 -195821 -17002 -253446 25413 9296 218253 -289033 -255510
10752b55510D3109L6a34155G6679b7604B6015b51911g4378c5973B67458a07034
$$ -255510 43109 43145 -134155 76679 -27604 26015 -251911 -74378 -35973 267458 -107034
10740f1954o194B55548b20487B1785L3117i3704g578j58088g6976A00509i6390
$$ -61954 -68148 255548 -220487 21785 54902 -93704 -7578 -165666 -76976 100509 -96390
10728A8685b00984K0669d5103p2685b5594j65631A30678a53638H2599J04773C1319
$$ 18685 -200984 -180315 -45103 -117788 -25594 -191225 130678 -153638 82599 187372 31319
10716c5257j36045K7626g0852H458R4471a86693N3102E806R3135a32995A12825
$$ -35257 -171302 -143676 -70852 8458 102929 -186693 -133591 5806 98941 -132995 112825
10704b6154I0810a61025h189B31012G7186J975A211c2579j19305N5152c8711J5064
$$ -26154 90810 -161025 -8189 231012 77186 79161 1211 -32579 -151884 -96732 -38711 -23647
10692b3647A23412g4237k35848e37A03040b07048C0736a99892j03485a02573A52623
$$ -23647 123412 -74237 -310085 -537 103040 -207048 30736 -199892 -303377 -102573 152623
10680b85459P1962A1554J53955a19197n6426e1927b958F7672L7198c41374B88167
$$ -285459 -213497 11554 165509 -119197 -175623 -51927 -2958 67672 104870 -341374 288167
10668b4994I2742L9126g271o7746k2968o1527L5098p2035j58005a29313A21642
$$ -24994 92742 131868 -7271 -75017 -97985 -159512 -124414 -196449 -354454 -129313 121642
10656c40934C749J73475c3709B70876i442B01538a32919b1763o5742N458E7821
$$ -340934 3749 177224 -33709 270876 -9442 201538 -132919 -21763 -87505 -82047 57821
10644g2570B21756g4410l5373A89826e9093C1569i0278D1642d4880D125a47209
$$ -72570 221756 -74410 -109783 189826 -59093 31569 -90278 41642 -44880 4125 -147209
10632f9379K130l64993E5872K58478i2623G1618a87015a2491j90557n0123p8107
$$ -69379 -67249 -432242 55872 314350 -92623 71618 -187015 -12491 -203048 -253171 -331278
10621c31278d0345p7066H7533a08473A89269f9576A2750g2174l01105a8774j69698
$$ -331278 -40345 -117411 87533 -108473 189269 -69576 12750 -72174 -373279 -18774 -188472
10610a88472A00461c06637d4591j93085d6417J2734j68816M2996A31818a37306
$$ -188472 100461 -306637 -44591 -237676 -46417 -33683 -202499 -159503 131818 -137306
10599A06884M5750c17405a52134n4273A05505A4341b6895m6150k45756b3528j70368
$$ 106884 152634 -317405 -152134 -206407 105505 14341 -26895 -73045 -318801 -23528 -193896
10588a93896a4360A68354a83621K9017B5346c41378a11676p4262B0658N8731g3569
$$ -193896 -14360 168354 -183621 -154604 25346 -341378 -111676 -185938 20658 79389 -73569
10576g2069H442R6781a14381D3904a9120k15787A53861J8418L672a93974A15639
$$ -72069 8442 105223 -114381 43904 -19120 -234907 153861 172279 175951 -193974 115639
10564b06749J01445I4630f2263C1912K7736a99856f6454b8612A3327Q8857C304
$$ -206749 -105304 94630 -62263 31912 59648 -199856 -66454 -28612 13327 102184 3304
10552b5027F9616c17610A41682a22979L3741E4086a83661B2419R9939a38577D01920
$$ -25027 69616 -317610 141682 -122979 -89238 54086 -183661 22419 122358 -138577 401920
10540b73088B12466A01586B889K25023a50315B61940b71401D7523a46307j65936
$$ -273088 212466 101586 2889 227912 -150315 261940 -271401 47523 -146307 -312243
10530c12243D00375d6163k87066N5654E04605f3003A23097a3023n3408p5690A01798
$$ -312243 400375 -46163 -333229 -277575 504605 -63003 123097 -13023 -66431 -142121 101798
10518a76397A8719b83805a21835j37696L3056G4204b11828m6205e6883J5368j69655
$$ -176397 18719 -283805 -121835 -259531 -226475 74204 -211828 -258033 -56883 -41515 -211170
10507b11170j74291A6334a35168b0140m1449r1227B54576Q1805i8827K4726K9269
$$ -211170 -385461 16334 -135168 -20140 -61589 -152816 254576 336381 -98827 -74101 -44832
10496d4832M22G7632b91228r712a21261D9484f7386c1533j20002I921K49379m5695
$$ -44832 -44410 77632 -291228 -300940 -121261 49484 -67386 -31533 -151535 9921 259300 213605
10484B13605k1351E2738a85071I5601K08021p2443J45243M12891A53065b8236
$$ 213605 192254 52738 -185071 95601 303622 231179 376422 789313 153065 -28236
10473G0694J28665J03819e1427j687F1148c6068l9329j04325f3354C36362a83470
$$ 70694 199359 303178 -51427 -53114 61148 -36068 -75397 -179722 -63354 336362 -183470
10461h021A22741a26677E0407g2257p4615c0050F0713j9272M8009e024I3476K246
$$ -8021 122741 -126677 50407 -72257 -146872 -30050 60713 41441 89450 -5024 93476 95722
10449I5722a99234R4662G95R5049J24812g3225j76350a6515r7904A00719O1275
$$ 95722 -199234 -104572 795 95844 220656 -73225 -249575 -16515 -114419 100719 161994
10438A61994h522r1124K3216J3250E73030a96371o1776D056a48502A6174a50481
$$ 161994 -8522 -99646 -76430 -63180 573030 -196371 -258147 4056 -148502 16174 -150481
10426H5927J5427h7553D1205a16538L6922F697J9760a11698j12555d7761J3346
$$ 85927 101354 -87553 41205 -116538 -79616 6697 26457 -111698 -224253 -47761 -34415
10415c4415k10533P9353B20610a75617m5850A54195a08464D939a9718H8119c19966
$$ -34415 -244948 -165595 220610 -175617 -221467 154195 -108464 4939 -19718 88119 -319966
10403A16194j5422C9514e6345H7257a38154B9039J86910A06130b1973k11825G0405
$$ 116194 100772 39514 -56345 87257 -138154 29039 215949 106130 -21973 -233798 70405
10391C1591M12144f7410K8794A3965L1997J87785E3127E896a34896c4108A81907
$$ 31591 443735 -67410 -38616 13965 45962 233747 53127 5896 -134896 -34108 181907
10379A51812N24M03300G1252j6867J28089J58443d2212B24300K13402b11993D5898
$$ 151812 152336 555636 71252 54385 182474 340917 -42212 224300 437702 -211993 45898
10367B69657g7976A85902J72548K85965k19823J66063j35925j95590r8795p910
$$ 269657 -77976 185902 358450 644415 424592 590655 454730 259140 160345 152435
10357A52435J0556L5127a04844D9997P4899M22919j6505J25497J35836k05427
$$ 152435 162991 198118 -104844 49997 124896 547815 531310 656807 792643 587216
10347E87216j19565A93733L28757A09902K53527q9950l0451j17747a20726A65445
$$ 587216 467651 193733 522490 109902 363429 273479 243028 125281 -120726 165445
10336A55243L05250j10840A44044a53867g6836j3277D57312D2600P2606d6857
$$ 155243 460493 349653 144044 -153867 -76836 -90113 457312 42600 115206 -46857
10325B98918j26897p24n5791K89734m3760h1247B74571q3656K06371j23636c02149
$$ 298918 172021 171297 115506 405240 361480 -81247 274571 190915 397286 273650 -302149
10313A44344k1139b65660C07R4461J78587A31259a50062L7238a0880I0122i8169
$$ 144344 123205 -265660 307 94768 273355 131259 -150062 -112824 -10880 90122 -98169
10301F398b44950A54217M7247I024O2094d7565r2637k04565C0415K27262c3398
$$ 6398 -244950 154217 201464 9024 71118 -47565 -140202 -344767 30415 257677 -33398
10289a8501A29150J36441C8092L6915J50182a6946n7872j6007l8589c2664C47389
$$ -18501 129150 265591 38092 75007 225189 -16946 -74818 -90825 -129414 -32664 347389
10277B02292q1800c516j47447A71400l9624N6443E7035j0506P2139a3486I8632
$$ 202292 120492 -3516 -150963 171400 131776 188219 57035 46529 118668 -13486 98632
10265c5441j09941i978n4876m3602C96853b45686Q8101a0290l9786j02533A99723
$$ -35441 -145382 -9978 -64854 -108456 396853 -245686 -157585 -10290 -50076 -152609 199723
10253F2574L18919J1522d3351A68990f2174A50815c3387q2618K3539B3975b5021
$$ 62574 381493 393015 -43351 168990 -62174 150815 -33387 -116005 -92466 23975 -25021
10241A25403B9600J11305d3018C9702a62518g7708m6537j03000d4579l6443m84316
$$ 125403 29600 140905 -43018 39702 -162518 -77708 -124245 -227245 -44579 -81022 -565338
10230e65338f9232E5314a49275F0470J20784F0408a94479k9823B36864a95382
$$ -565338 -69232 55314 -149275 60470 181254 60408 -194479 -224302 236864 -195382
10219c77881A57682A945c7072c166I9187a44478e5656h890j89266k0899d4293
$$ -377881 157682 1945 -37072 -3166 99187 -144478 -55656 -8890 -198156 -219055 -44293
10207b82470A35958c3246j542H8120a68048j06236j79101a65311C22956A00401
$$ -282470 135958 -33246 -34788 88120 -168048 -274284 -453385 -165311 322956 100401
10196I864a57776b9550I4585i4400j19466B06928d7854k51095a8571B41822a59530
$$ 9864 -157776 -29550 94585 -94400 -213866 206928 -47854 -298949 -18571 241822 -159530
10184A26370g3803k57976a30550m07502E0515c3403k00931c4398A4316a83336
$$ 126370 -73803 -331779 -130550 -538052 50515 -33403 -234334 -34398 14316 -183336
10173A99926J72522A75772A9688L0316c3118j1932H3836e7372l4038m9519c2760
$$ 199926 372448 175772 19688 50004 -33118 -45050 83836 -57372 -91410 -140929 -32760
10161a40359B08446a36606p3650B63096e0957k05430A50155a68580k53144a55273
$$ -140359 208446 -136606 -210256 263096 -50957 -256387 150155 -168580 -421724 -155273
10150b31085B49689c73955A72294D9146b08793a01389A38949J30026f414D1942
$$ -231085 249689 -373955 172294 49146 -208793 -101389 138949 268975 -6414 41942
10139A69856g4158k17209a21540D8166r195J19121j3070b00485E4547p423a14928
$$ 169856 -74158 -291367 -121540 48166 38971 158092 145022 -200485 54547 47124 -114928
10127b2570j2976C10158B7594a38569b2358j44690m9320J05746L7820j80593e4736
$$ -22570 -35546 310158 27594 -138569 -22358 -167048 -216368 -110622 -72802 -253395 -54736
10115b15527H1698K6697D5694h8042A81975b05606O5530B03823E4043a14695M3127
$$ -215527 81698 108395 45694 -88042 181975 -205606 -140076 203823 54043 -114695 -71568
10104g1568j99135b7459r1535L0570H6816K1000b42123B1631J45935g347C51497
$$ -71568 -270703 -27459 -118994 -88424 86816 107816 -242123 21631 167566 -7347 351497
10092c2884G2201c57543g2988k33j33887c4406k50215a27862O0703m9865L3137
$$ -32884 72201 -357543 -72988 -73221 -207108 -34406 -284621 -127862 -67159 -117024 -83887
10081h3887j14013b7317A85362a68169A54706P763a0974k51005B49125A04825
$$ -83887 -197900 -27317 185362 -168169 154706 162469 -10974 -261979 249125 104825
10070G7995b6251p8867j90918J11753H0835e9404C4788b63851a7059j0225k12134
$$ 77995 -26251 -105118 -296036 -184283 80835 -59404 34788 -263851 -17059 -27284 -239418
10059b39418b5712k6725k29755J28217g5722k1100A51719P6950E7556D66J87275
$$ -239418 -25712 -52437 -282192 -153975 -75722 -96822 151719 228669 57556 466 187741
10048A87741b08635i1952o5981n4014L7560f467l9080C9637J9914j5134O5199
$$ 187741 -208635 -91952 -157933 -211947 -174387 -6467 -45547 39637 59551 44417 109616
10037A09616a89157k99727g5211l09706i7839q3538k45695b4518k23325E0185
$$ 109616 -189157 -488884 -75211 -384917 -97839 -181377 -427072 -24518 -247843 50185
10026d24822F1676f5876k51801d6953g77m0397j57232P6885G2742k2916a03185
$$ -424822 61676 -65876 -317677 -46953 -777 -41174 -198406 -121521 72742 49826 -103185
10014a08096p3120d7665I9210c07485A62013D0187J02427E4866J85090a29620
$$ -108096 -181216 -47665 99210 -307485 162013 40187 142614 54866 239956 -129620
10003C53532A33665n493f8972j83383B01785k2603c58313J72418A70059d2225
$$ 353532 133665 128172 -68972 -252355 201785 179182 -358313 -185895 170059 -42225
9992A03149N6265a36733A23461b40100A21952B1782j05c72655A51162a56119D5940
$$ 103149 159414 -136733 123461 -240100 121952 21782 21677 -372655 151162 -156119 45940
9980b07549f8137A00088a08297j01281I9463a15530j64573C72672i3643J7314
$$ -207549 -68137 100088 -108297 -209578 99463 -115530 -280103 372672 -93643 -76329
9970g6329F8004J52999a92517N5710f2720j66122A86895a66732O5768k13795G8311
$$ -76329 68004 221003 -192517 -136807 -62720 -228842 186895 -166732 -100964 -314759 78311
9958i6523q5746k8250j514J3741d3268j2736k929a8931A24460c41049G4300b88948
$$ -96523 -182269 -210519 -212033 -198292 -43268 -56004 -58933 -18931 124460 -341049 74300 -288948
9945g3257A36440a66871A92107l6263D6162a12934B1259M14898A07937a16415
$$ -73257 136440 -166871 192107 155844 46162 -112934 21259 436157 107937 -116415
9934B68435g8985C0952J14958l3121a28938j23630L1059J4204B67914a17403B5096
$$ 268435 -78985 30952 145910 112789 -128938 -252568 -221509 -207305 267914 -117403 25096
9922a43108G5485a02299H3965b54518c2238B98442P781a29209L3985j45188D2526
$$ -143108 75485 -102299 83965 -254518 -32238 298442 306223 -129209 -95224 -240412 42526
9910c46685g4230j12751j50488G4329A8095c8072j95977B3588b05804d8004j69945
$$ -346685 -74230 -186981 -337469 74329 18095 -38072 -234049 23588 -205804 -48004 -217949
9899b17949r2175I3J14882G608a67683G9359B7841K13107f3643j40046B12459
$$ -217949 -310124 93 114975 7608 -167683 79359 27841 240948 -63643 -203689 212459
9887G71b57934c7536j7374j45292Q435B17453o3039O2385a05458m7838B1211N7324
$$ 771 -257934 -37536 -54910 -200202 -191767 217453 154414 216799 -105458 -153296 21211 78535
9875G8535b06647A3740L6100Q5633a12308A871b16740I0447J2884a52803m46141
$$ 78535 -206647 13740 49840 135473 -112308 1871 -216740 90447 103331 -152803 -598944
9864e98944G556b10954I9822L493A0786a52304K0672q7237Q0093D2210a66215
$$ -598944 7556 -210954 99822 103315 10786 -152304 -131632 -218869 -138776 42210 -166215
9852b00963A52056q298n5740J8268l6041J04588b869J288j1732A58790B588b19435
$$ -200963 152056 143758 88018 106286 70245 174833 -2869 -1581 -13313 158790 2588 -219435
9839E9246i8753j81227g1866G7526e3016J4698k10960A92915a31628H61J32697
$$ 59246 -98753 -279980 -71866 77526 -53016 -38318 -249278 192915 -131628 861 133558
9828A33558a04290k94917B2438a42637d1707j77726A35423K51a06111A7668b16990
$$ 133558 -104290 -399207 22438 -142637 -41707 -219433 135423 135674 -106111 17668 -216990
9816c12767j44034E3920h53A07095b8222A14146d56076e5233q1893K189D0297
$$ -312767 -456801 53920 -853 107095 -28222 114146 -456076 -55233 -137126 -134937 40297
9804a403o9375j28344i5512p2863j4544C09859d54001e1799r9730D4710J45075
$$ -1403 -70778 -199122 -95512 -168375 -182919 309859 -454001 -51799 -151529 44710 189785
9793A89785F761f8126D2685O4980c65231h6354r3753A6750b22963d6230j04310
$$ 189785 6761 -68126 42685 107665 -365231 -86354 -180107 16750 -222963 -46230 -150540
9782a50540e0029k69883B0219a36239j22859L2571a8515j48526A9370I511d97
$$ -150540 -50029 -319912 20219 -136239 -259098 -226527 -18515 -167041 19370 9511 -497
9770b8348j94736B7134b63056F0328f9995j34474i0343n27516F1783a00226l08016
$$ -28348 -223084 27134 -263056 60328 -69995 -204469 -90343 -617859 61783 -100226 -408242
9759d08242e448D5608J69797c47076L4628d6866k71634P4489A62792E4683L0937
$$ -408242 -5448 45608 215405 -347076 -312448 -46866 -318500 -244011 162792 54683 85620
9748H5620K5354K6284b77769A11592m9365J88459J11323a30838B29876r7107a93271
$$ 85620 110974 137258 -277769 111592 62227 250686 362009 -130838 229876 132769 -193271
9736g7810I6159f1826B65864b36137A65188d7315j53101A63817a32232a6493E694
$$ -77810 96159 -61826 265864 -236137 165188 -47315 -200416 163817 -132232 -16493 5694
9724A31103E1651J10292N0147C3152e8968j75211f2799C03893a79587q6266I0370
$$ 131103 51651 161943 212090 33152 -58968 -234179 -62799 303893 -179587 -265853 90370
9712B3541M0163A6898b92535B47482I2434H957c9320j61815B95952d6411o6403
$$ 23541 63704 16898 -292535 247482 92434 8957 -39320 -201135 295952 -46411 -112814
9701a12814a1545k25193b5079j75680k9262P5748L0590l64027A32070b23675P1007
$$ -112814 -11545 -236738 -25079 -200759 -230021 -154273 -123683 -487710 132070 -223675 -152668
9690a52668q1948H9675f5302C2894a01296b3599k8218o5527l30949i7048H5410
$$ -152668 -234616 89675 -65302 32894 -101296 -23599 -51817 -117344 -448293 -97048 85410
9678c4822l65795R0771l8769f1674A70063b9118l83635a11426r126j13625F2499
$$ -34822 -400617 -309846 -348615 -61674 170063 -29118 -412753 -111426 -120552 -234177 62499
9666D2223N9043P8019D6513d03656c1291j09872b8098A00113J64644g4869L6422
$$ 42223 101266 179285 46513 -403656 -31291 -141163 -28098 100113 264757 -74869 -38447
9655c8447j82641a07439p7737d9568C09857K52720E3193a10540M5896k51188b9554
$$ -38447 -221088 -107439 -185176 -49568 309857 562577 53193 -110540 -64644 -315832 -29554
9643b17964G6362J58536b06074A85637a49204D81262b592j3907j06627L0292r7324
$$ -217964 76362 234898 -206074 185637 -149204 481262 -2592 -16499 -123126 -92834 -190158
9632a90158A36571C9318a52831c7603p851n7045j06275E5263c52352D319N8532
$$ -190158 136571 39318 -152831 -37603 -45454 -102499 -208774 55263 -352352 4319 62851
9621F2851J756a42964C42145b21743r5965A13011d2637A832d23726A28269a50428
$$ 62851 64607 -142964 342145 -221743 -317708 113011 -42637 1832 -423726 128269 -150428
9609I9961J00301C8918a69125A34569b13358A09225c09645C13810A35221m2112
$$ 99961 200262 38918 -169125 134569 -213358 109225 -309645 313810 135221 93109
9599I3109p288a8358M501q2811r2481f7028A25723K1799a19544D4738d1169B90606
$$ 93109 85821 -18358 -13857 -96668 -189149 -67028 125723 147522 -119544 44738 -41169 290606
9586d9005A40831q330c87716a77899a1450j36351j26026A422J3052J5818q208
$$ -49005 140831 132501 -387716 -177899 -11450 -147801 -273827 1422 14474 30292 22084
9575B2084a94160I8189J5300n5901j1737h3506c0175b348k32977R7811b7992A20738
$$ 22084 -194160 98189 113489 57588 45851 -83506 -30175 -2348 -235325 -137514 -27992 120738
9562c25602A02272c58702d5262c240G9386a60188B2124a58227j7004f9346m1014
$$ -325602 102272 -358702 -45262 -3240 79386 -160188 22124 -158227 -175231 -69346 -110360
9551a10360e422q7137F6827a48252b2021o2503L261I0652b87512h2838J8604j16552
$$ -110360 -5422 -92559 66827 -148252 -22021 -84524 -81263 90652 -287512 -82838 -64234 -180786
9539a80786d657k47952A21758h1132C8518a20747m8131f9668H909c7482l63139
$$ -180786 -4657 -252609 121758 -81132 38518 -120747 -168878 -69668 8909 -37482 -400621
9528d00621a44382b8902k20938P1504E6248a01597c0876A30477J40529b83967
$$ -400621 -144382 -28902 -249840 -178336 56248 -101597 -30876 130477 271006 -283967
9517b51092C64303E9334f5474k88032I6482k5029a65391Q1491j21876d0874j77332
$$ -251092 364303 59334 -65474 -353506 96482 71453 -165391 -83900 -205776 -40874 -218206
9506b18206N1028A74436d6361A94416f6046P492F1533b70877l7523h7343b7162
$$ -218206 -167178 174436 -46361 194416 -66046 -58554 61533 -270877 -308400 -87343 -27162
9494c17461a31842e8353j11016B50343a1845r9659J824q9181A20827j6265m0913
$$ -317461 -131842 -58353 -169369 250343 -11845 -111504 -109680 -198861 120827 104562 63649
9483F3649J15824f2774j31831k54642H9858f4002A3742L07060a70509b0907j72686
$$ 63649 179473 -62774 -194605 -449247 89858 -64002 13742 320802 -170509 -20907 -193593
9472a93593Q7562j82936a03356k66715f2072l951C0873b8523J1285j12293r0001
$$ -193593 -106031 -288967 -103356 -370071 -62072 -66023 30873 -28523 -17238 -129531 -219532
9461b19532B1864a957r7966p931j24790N4893F2564O9408a25225A341Q6417a409
$$ -219532 21864 -1957 -99923 -107854 -232644 -177751 62564 131972 -125225 1341 87758 -1409
9448B37188I899g9154L5691A63345a1383m9268j52572c1014A24278D4080d21849
$$ 237188 9899 -79154 -43463 163345 -11383 -60651 -213223 -31014 124278 44080 -421849
9436B35892a05847k3009A76967H3244d8536j55490A64650c4262j36270r2501d9390
$$ 235892 -105847 -128856 176967 83244 -48536 -204026 164650 -34262 -170532 -263033 -49390
9424b04589J4212j84312g0842j10395A05056b46539A11822a56892G5422a92287
$$ -204589 -190377 -374689 -70842 -181237 105056 -246539 111822 -156892 75422 -192287
9413g1724j66457d2623r6614D96384f5857l10089J78667c0773A19912f1208J1041
$$ -71724 -238181 -42623 -139237 496384 -65857 -375946 -197279 -30773 119912 -61208 -50167
9402e0167A65739b32074j051E9853P8495a72122o7962D0141b57140P1460A28204
$$ -50167 165739 -232074 -233125 59853 138348 -172122 -240084 40141 -257140 -185680 128204
9390a67906O9993E4690b76781C87798a71812Q474F9183J06597M941a60222A98651
$$ -167906 -97913 54690 -276781 387798 -171812 -163338 69183 175780 180721 -160222 198651
9378a61283j15366M773L4693b3552D582i1335I1481Q0224F932a57201H9695j0114
$$ -161283 -276649 -271876 -237183 -23552 4582 -91335 91481 171705 6932 -157201 89695 79581
9366G9581k131a9918l8043k84770J65012g7371k5846j01885n3826B66484E6176
$$ 79581 77450 -19918 -57961 -342731 -177719 -77371 -103217 -205102 -258928 266484 56176
9354a54528A10067K4708h1061A01967B7547K13342a95301A04510k519d18276f8264
$$ -154528 110067 134775 -81061 101967 27547 240889 -195301 104510 101991 -418276 -68264
9342A87817a59282A68832a4938B9264b92787f8232F086a74534n140H1221K04064
$$ 187817 -159282 168832 -14938 29264 -292787 -68232 6086 -174534 -179674 81221 285285
9331B85285d22182J95792A78981i4545B07604a02543p4468G761b01352r8991j81866
$$ 285285 -422182 -226390 178981 -94545 207604 -102543 -177011 7761 -201352 -300343 -482209
9320d82209b33759J03171A57859E0473c68296B55377A02008J13247n8857E8204
$$ -482209 -233759 -130588 157859 50473 -368296 255377 102008 215255 156398 58204
9309e0663F1370A4481K24280A11810D115d4201m2576k84414a65314e6708F8849
$$ -50663 61370 14481 238761 111810 4115 -44201 -86777 -371191 -165314 -56708 68849
9297D6369b287D438a49528e4506D720d9201j30788D18053B4139a35772A02909
$$ 46369 -2287 4438 -149528 -54506 4720 -49201 -179989 418053 24139 -135772 102909
9285a47933K874a2142j22086M7608H7076A4396a17376C18951G6160b7179B32190
$$ -147933 -145059 -12142 -134228 -86620 87076 14396 -117376 318951 76160 -27179 232190
9273b86606J08751H2604b81081A7047M629M7598a64998F8301N8758a68308Q2438
$$ -286606 -177855 82604 -281081 17047 21676 69274 -164998 68301 127059 -168308 -85870
9262h5870r3528Q0972A99764B4838a00574j28908B70875e3780B31123b48394A08364
$$ -85870 -179398 -98426 199764 24838 -100574 -229482 270875 -53780 231123 -248394 108364
9250b11491a6421I8107B8396K4713f2872F4929a00284o6374O4261B36409p3127
$$ -211491 -16421 98107 28396 53109 -62872 64929 -100284 -166658 -102397 236409 163282
9239A63282a13925j12618B09983a2528k58713N7559o664A19367f360j2712k15077
$$ 163282 -113925 -226543 209983 -12528 -271241 -213682 -220346 119367 -6360 -19072 -234149
9228b34149a13487l3908r3364J17670d548o85A40377R5736g9526k69717A47409
$$ -234149 -113487 -147395 -240759 -123089 -4548 -5233 140377 236113 -79526 -349243 147409
9216d7958k16412B8729c4244A49498J4070e3657B1319d08053g2680j97582C5836
$$ -47958 -264370 28729 -34244 149498 163568 -53657 21319 -408053 -72680 -270262 35836
9204a28058q4087j26222D9047a1825o944k50239A05097K25504b69576D7140b17698
$$ -128058 -212145 -338367 49047 -11825 -18769 -269008 105097 330601 -269576 47140 -217698
9192G3386i0535k17188a17579m0436j88544B77648c9842k09739a18073e4107B638
$$ 73386 -90535 -307723 -117579 -158015 -346559 277648 -39842 -249581 -118073 -54107 2638
9180a51985e772n4531C47945B7999a79358B62353c1271k1908R29j30941C1974
$$ -151985 -5772 -60303 347945 27999 -179358 262353 -31271 -53179 -52250 -183191 31974
9168b07850A27143d59o8960m136k9086m07751C9967J3401b19829F7043d03291
$$ -207850 127143 -459 -69419 -73555 -102641 -510392 39967 53368 -219829 67043 -403291
9156a23167a4264B23231f8003j26144h9544I8658a14944j26008A66314a81473
$$ -123167 -14264 223231 -68003 -194147 -89544 98658 -114944 -240952 166314 -181473
9145A78510e55031a55768c1897r2920F7768J6413c4108M83A9191h5502r2715A51798
$$ 178510 -555031 -155768 -31897 -124817 67768 84181 -34108 -33625 19191 -85502 -178217 151798
9132a2117j75872M9871j22950B6265N8027g989k4274A71619a77567b7587p4483
$$ -12117 -187989 -138118 -261068 26265 84292 -7989 -32263 171619 -177567 -27587 -102070
9121a02070K9116D5637a1627E947b22313b7214j25759g5664j18266q9081P0577
$$ -102070 -72954 45637 -11627 5947 -222313 -27214 -152973 -75664 -193930 -283011 -212434
9110b12434R1815A78084O2512a83933m3248C2522h7940I5113m5287Q8896L20860
$$ -212434 -120619 178084 240596 -183933 -227181 32522 -87940 95113 49826 138722 459582
9099D59582d52544F4092a34376n4913A4640b3469G7569J6429B3015K5911J47254
$$ 459582 -452544 64092 -134376 -189289 14640 -23469 77569 93998 23015 48926 196180
9088A96180a62297A52956m9869e6974d354k01125i0974o4226e6295r2063k04026
$$ 196180 -162297 152956 103087 -56974 -4354 -205479 -90974 -155200 -56295 -148358 -352384
9077c52384B75927B953a81503l2755C66a78487J2834H7898P6674B0202b1224A62510
$$ -352384 275927 2953 -181503 -214258 366 -178487 -165653 87898 164572 20202 -21224 162510
9064i5224H0565d11071M2126J23211O5015F287a06642A40587a88031A43551a71526
$$ -95224 80565 -411071 -368945 -245734 -180719 6287 -106642 140587 -188031 143551 -171526
9052B16637b61532c7839A98017H4674a44458j53920J5650a28503i143G4404J38133
$$ 216637 -261532 -37839 198017 84674 -144458 -298378 -282728 -128503 -9143 74404 212537
9041B12537b18706N8245b8817B4140b8200q2968m2824P3235M173B8278R692a96338
$$ 212537 -218706 -160461 -28817 24140 -28200 -111168 -153992 -80757 -76584 28278 37970 -196338
9028A05740a67912g6690o8913N6353j8456k22145a36200L9848L2846B96149A00342
$$ 105740 -167912 -76690 -145603 -89250 -107706 -329851 -136200 -96352 -63506 296149 100342
9016a58224A42884b58983p4975A75716h8943r7211P3770a0879k3228A85868c15324
$$ -158224 142884 -258983 -333958 175716 -88943 -186154 -112384 -10879 -34107 185868 -315324
9004b20245A44010a42865F3221J65119a11580B08530d83994E0304i7358L7212
$$ -220245 144010 -142865 63221 228340 -111580 208530 -483994 50304 -97358 -60146
8994f0146p1282B6542a07990A27297O4666b42942b2191k10517A20856Q3981J25826
$$ -60146 -131428 26542 -107990 127297 191963 -242942 -22191 -232708 120856 204837 330663
8983C30663A41722J3481l4693K3480A8005e6513B04050c75036I4208J03632k0673
$$ 330663 141722 155203 120510 143990 18005 -56513 204050 -375036 94208 197840 177167
8972A77167E1085a86844r4111L1711D4149b1409C6716J61780a59572K7239N2009
$$ 177167 51085 -186844 -280955 -249244 44149 -21409 36716 198496 -159572 -132333 -80324
8961h0324J9630m7632A2351b79452a18182j9554C11676d7213r8206r9336a09581
$$ -80324 -60694 -108326 12351 -279452 -118182 -137736 311676 -47213 -145419 -244755 -109581
8949b58976a04159k92437a50539d652F9615C2747b860k17902A06624a67505P833
$$ -258976 -104159 -396596 -150539 -4652 69615 32747 -2860 -220762 106624 -167505 -159672
8938a59672A44832a5731j8625e129q6804J2832E0141J53355d20993C032h7371
$$ -159672 144832 -15731 -34356 -5129 -91933 -79101 50141 203496 -420993 3032 -87371
8926a85616C8036O0086K9081M7861K50947P8226M24899G4133J63134n9952G5783
$$ -185616 38036 98122 127203 175064 426011 504237 929136 74133 237267 177315 75783
8914i7650E9514Q4901D8927K8832a61493g8481H0882b23662b6618L330m7807j90812
$$ -97650 59514 144415 48927 77759 -161493 -78481 80882 -223662 -26618 -23288 -71095 -261907
8902b61907O8811B87033o8278a11210F7990a81167O5181k24565b9227A45256c20170
$$ -261907 -193096 287033 218755 -111210 67990 -181167 -115986 -340551 -29227 145256 -320170
8890A4946h8762G0708h6841I1142J50422b18551H5050h3466q7574J6223f81r0707
$$ 14946 -88762 70708 -86841 91142 241564 -218551 85050 -83466 -171040 -154817 -681 -91388
8878i1388j84785g6164L0601A01706f1511k22883a8869l0611C3017h6455j442
$$ -91388 -276173 -76164 -45563 101706 -61511 -284394 -18869 -49480 33017 -86455 -87897
8867h7897G6703a84430B4327d0612A7431O094b48675H4620c6230G9581K20515
$$ -87897 76703 -184430 24327 -40612 17431 23525 -248675 84620 -36230 79581 300096
8856C00096b40686a15512C65010b75451A55233i880j67436B70298a78857B72472
$$ 300096 -240686 -115512 365010 -275451 155233 -9880 -177316 270298 -178857 272472
8845H911L3623G275i2149M5428l266j55568j32543F8295N2041J45655c43799G3319
$$ 8911 42534 7275 -92149 -46721 -49987 -205555 -338098 68295 120336 265991 -343799 73319
8832d9739H2550d6991A24513J17557b30732C5292M0636b18921R2956I0306g615
$$ -49739 82550 -46991 124513 242070 -230732 35292 75928 -218921 -125965 90306 -7615
8820F1873b00135A05521e8577r6524B51226A11056a46605j87407a21140N7445
$$ 61873 -200135 105521 -58577 -155101 251226 111056 -146605 -334012 -121140 -63695
8810f3695A87913a58271c2690k4846J5513j600A329J40350b2857j68065P2080
$$ -63695 187913 -158271 -32690 -57536 -42023 -43623 1329 141679 -22857 -190922 -118842
8799a18842a877j99116i7848j91112F5079O9791f9321I9348a27894j21229a5637
$$ -118842 -1877 -200993 -97848 -288960 65079 134870 -69321 99348 -127894 -249123 -15637
$$ [...]
##END NTUPLES=NMR SPECTRUM
##END=
