##TITLE=NES1099_Nhol10910_9887186_AK32tKpe6a
##JCAMPDX= 6.0         $$ Bruker NMR JCAMP-DX V2.0
##DATA TYPE= NMR SPECTRUM
##DATA CLASS= NTUPLES
##ORIGIN= BRUKER
##OWNER= Administrator
$$ 1.72 TOPSPIN		Version 2.1
$$ 2016-08-28 18:59:39.304 -0500  Administrator@X
$$ Compression mode = diff/dup
##.OBSERVE FREQUENCY= 400.02188249412
##.OBSERVE NUCLEUS= ^1H
##.ACQUISITION MODE= SIMULTANEOUS (DQD)
##.ACQUISITION SCHEME= undefined
##.AVERAGES= 64
##.DIGITISER RES= 22
##SPECTROMETER/DATA SYSTEM= spect
##.PULSE SEQUENCE= noesygpps1d.comp
##.SOLVENT NAME= COFFEE_meoh
##.SHIFT REFERENCE= INTERNAL, COFFEE_meoh, 1, 14.96159
##AUDIT TRAIL= $$ (NUMBER, WHEN, WHO, WHERE, PROCESS, VERSION, WHAT)
$$ ##TITLE= Audit trail, TOPSPIN		Version 2.1
$$ ##JCAMPDX= 5.01
$$ ##ORIGIN= Bruker BioSpin GmbH
$$ ##OWNER= Administrator
$$ $$ E:\/data/COFFEE/nmr/NES1099_Nhol10910_9887186_AK32tKpe6a/12/pdata/1/auditp.txt
$$ ##AUDIT TRAIL=  $$ (NUMBER, WHEN, WHO, WHERE, PROCESS, VERSION, WHAT)
(   1,<2016-08-28 18:59:34.179 -0500>,<Administrator>,<X>,<go>,<TOPSPIN 2.1>,
      <created by zg
	started at 2016-08-28 18:48:03.445 -0500,
	POWCHK enabled, PULCHK disabled,
       configuration hash MD5:
       21 0F 79 D6 B3 7B B4 F6 88 20 88 DB 03 48 BD 9F
       data hash MD5: 64K
       06 6D 47 CC BD 19 44 43 CD B6 E3 A7 B7 42 C9 56>)
(   2,<2016-08-28 18:59:37.258 -0500>,<Administrator>,<X>,<proc1d>,<TOPSPIN 2.1>,
      <Start of raw data processing
       efp LB = 0.3 FT_mod = 6 PKNL = 1 PHC0 = 0 PHC1 = 0 SI = 128K 
       data hash MD5: 128K
       C9 B4 A8 68 8C 33 F8 59 34 45 FB 40 62 DE 53 9E>)
(   3,<2016-08-28 18:59:38.133 -0500>,<Administrator>,<X>,<proc1d>,<TOPSPIN 2.1>,
      <pk PHC0 = -83.54004 PHC1 = 0 
       data hash MD5: 128K
       8A 97 5A D1 D3 34 34 10 8C 36 4D 73 E4 D5 5D 1E>)
(   4,<2016-08-28 18:59:38.492 -0500>,<Administrator>,<X>,<proc1d>,<TOPSPIN 2.1>,
      <abs ABSG = 1 
       data hash MD5: 128K
       FB 1F 00 C3 14 82 49 95 93 4E BB DB BF 83 E5 75>)
(   5,<2016-08-28 18:59:38.586 -0500>,<Administrator>,<X>,<proc1d>,<TOPSPIN 2.1>,
      <abs ABSG = 2 
       data hash MD5: 128K
       D6 3E 78 52 49 66 54 D6 1F 9D EF D6 A9 F9 B1 B3>)
(   6,<2016-08-28 18:59:38.664 -0500>,<Administrator>,<X>,<proc1d>,<TOPSPIN 2.1>,
      <abs ABSG = 3 
       data hash MD5: 128K
       3A A0 9E 45 84 3B FF 1B 92 15 F8 8D 18 9C 6B D8>)
(   7,<2016-08-28 18:59:38.758 -0500>,<Administrator>,<X>,<proc1d>,<TOPSPIN 2.1>,
      <abs ABSG = 4 
       data hash MD5: 128K
       9A 16 0C 63 96 8D 13 3E 4E 62 E2 F1 BA ED B6 28>)
(   8,<2016-08-28 18:59:38.851 -0500>,<Administrator>,<X>,<proc1d>,<TOPSPIN 2.1>,
      <abs ABSG = 5 
       data hash MD5: 128K
       E0 10 EC FD 4A 8D FF 03 68 A2 CF 08 62 94 A7 88>)
$$ ##END=
$$ 
$$ $$ hash MD5
$$ $$ D8 EA 36 A4 09 D0 07 85 B2 59 0E A6 D3 78 3C F0
##$RELAX= 
##$RELAX= 
##$RELAX= 
##$RELAX= 
##$RELAX= 
##$RELAX= 
##$RELAX= 
##$RELAX= 
$$ Bruker specific parameters
$$ --------------------------
##$DU= <E:\>
##$EXPNO= 12
$$ [...]
##$TP07= 0
##$TPNAME0= <>
##$TPNAME1= <>
##$TPNAME2= <>
##$TPNAME3= <>
##$TPNAME4= <>
##$TPNAME5= <>
##$TPNAME6= <>
##$TPNAME7= <>
##$TPOAL= (0..7)
0.5 0.5 0.5 0.5 0.5 0.5 0.5 0.5
##$TPOFFS= (0..7)
0 0 0 0 0 0 0 0
##$TUNHIN= 0
##$TUNHOUT= 0
##$TUNXOUT= 0
##$USERA1= <user>
##$USERA2= <user>
##$USERA3= <user>
##$USERA4= <user>
##$USERA5= <user>
##$V9= 5
##$VALIST= <valist>
##$VCLIST= <CCCCCCCCCCCCCCC>
##$VD= 0
##$VDLIST= <DDDDDDDDDDDDDDD>
##$VPLIST= <PPPPPPPPPPPPPPP>
##$VTLIST= <TTTTTTTTTTTTTTT>
##$WBST= 2048
##$WBSW= 25
##$XGAIN= (0..3)
0 0 0 0
##$XL= 0
##$YL= 0
##$YMAX_a= 7169512
##$YMIN_a= -13346488
##$ZGOPTNS= <>
##$ZL1= 120
##$ZL2= 120
##$ZL3= 120
##$ZL4= 120
##$ABSF1= 14.96159
##$ABSF2= -5.596592
##$ABSG= 5
##$ABSL= 3
##$ALPHA= 0
##$AQORDER= 0
##$ASSFAC= 0
##$ASSFACI= 0
##$ASSFACX= 0
##$ASSWID= 0
##$AUNMP= <proc_prof1d_extract.lims>
##$AXLEFT= 0
##$AXNAME= <>
##$AXNUC= <1H>
##$AXRIGHT= 0
##$AXTYPE= 0
##$AXUNIT= <>
##$AZFE= 0.1
##$AZFW= 0.1
##$BCFW= 0
##$BC_mod= 0
##$BYTORDP= 0
##$COROFFS= 0
##$CY= 15
##$DATMOD= 1
##$DC= 0
##$DFILT= <>
##$DTYPP= 0
##$F1P= 0
##$F2P= 0
##$FCOR= 0.5
##$FTSIZE= 131072
##$FT_mod= 6
##$GAMMA= 0
##$GB= 0
##$INTBC= 1
##$INTSCL= 1
##$ISEN= 128
##$LB= 0.3
##$LEV0= 0
##$LPBIN= 0
##$MAXI= 10000
##$MC2= 0
##$MEAN= 0
##$ME_mod= 0
##$MI= 0
##$NCOEF= 0
##$NC_proc= -2
##$NLEV= 6
##$NOISF1= 0
##$NOISF2= 0
##$NSP= 0
##$NTH_PI= 0
##$NZP= 0
##$OFFSET= 14.96159
##$PC= 1
##$PHC0= -83.54004
##$PHC1= 0
##$PH_mod= 1
##$PKNL= yes
##$PPARMOD= 0
##$PPDIAG= 0
##$PPIPTYP= 0
##$PPMPNUM= 2147483647
##$PPRESOL= 1
##$PSCAL= 4
##$PSIGN= 0
##$PYNMP= <proc.py>
##$REVERSE= no
##$SF= 400.020009399002
##$SI= 131072
##$SIGF1= 0
##$SIGF2= 0
##$SINO= 400
##$SIOLD= 131072
##$SPECTYP= <>
##$SREGLST= <1H.CDCl3>
##$SSB= 0
##$STSI= 131072
##$STSR= 0
##$SW_p= 8223.68421052631
##$SYMM= 0
##$S_DEV= 0
##$TDeff= 65536
##$TDoff= 0
##$TI= <>
##$TILT= no
##$TM1= 0
##$TM2= 0
##$TOPLEV= 0
##$USERP1= <user>
##$USERP2= <user>
##$USERP3= <user>
##$USERP4= <user>
##$USERP5= <user>
##$WDW= 1
##$XDIM= 131072
##$YMAX_p= 340077431
##$YMIN_p= -11920
##$CURPLOT= <Network HP LaserJet P1505>
##$CURPRIN= <$Network HP LaserJet P1505>
##$DFORMAT= <normdp>
##$LAYOUT= <+/1D_H.xwp>
##$LFORMAT= <normlp>
##$PFORMAT= <normpl>
##$SURQMSG= 1
$$ End of Bruker specific parameters
$$ ---------------------------------
##NTUPLES= NMR SPECTRUM
##VAR_NAME=  FREQUENCY,     SPECTRUM/REAL,   SPECTRUM/IMAG
##SYMBOL=    X,             R,               I
##VAR_TYPE=  INDEPENDENT,   DEPENDENT,       DEPENDENT
##VAR_FORM=  AFFN,          ASDF,            ASDF
##VAR_DIM=   131072,        131072,          131072
##UNITS=     HZ,            ARBITRARY UNITS, ARBITRARY UNITS
##FACTOR=    0.0627417313425164, 1,          1
##FIRST=     8223.62146879497, 3317,         -58040
##LAST=      0,             5176,            -57826
##MIN=       0,             -11920,          0
##MAX=       8223.62146879497, 340077431,    0
$$ Real data points
##PAGE= N=1
##DATA TABLE= (X++(R..R)), XYDATA
$$ [...]
61215A125645l3079l3077l1811k9122k5496k1622j7756j3626q919l749J415O118
61203I14921J0090J3165J5222J6251J6264J5089J2500Q754M823J876N22N94J479
61190A031550K432K771K147P45r00k377l691n117o812q534r671r815r276q899
61176I74553r228j0044j0900j1675j2378j2764j2650j2408j2526j2787j2505j1532
61164H33156j0398r341p891n732l420j718p43j71l9q36k984o577j1344j6460k0669
61149G34833k3145k4172k4542k4433k3434k1554j9573j8164j7173j6022j4468
61138E08153j2731j1175j0030r327q858q407p994p650p006n513l337j538r54j165
61124D12468r99P5J512K608L340M111N064N985O748P509Q364R031R054Q230O733
$$ y = [1125645, 1092566, 1059489, 1027678, 998556, 973060, 951438, 933682, 920056, 911137, 907388, 908803, 914921, 925011, 938176, 953398, 969649, 985913, 1001002, 1013502, 1022256, 1027079, 1028955, 1029477, 1030071, 1031550, 1033982, 1036753, 1038900, 1039645, 1038745, 1036368, 1032677, 1027560, 1020748, 1012214, 1002543, 992728, 983452, 974553, 965325, 955281, 944381, 932706, 920328, 907564, 894914, 882506, 869980, 857193, 844688, 833156, 822758, 813417, 805526, 799794, 796374, 794656, 793913, 793742, 793703, 792867, 789883, 783306, 771962, 755502, 734833, 711688, 687516, 662974, 638541, 615107, 593553, 573980, 555816, 538643, 522621, 508153, 495422, 484247, 474217, 464890, 456032, 447625, 439631, 431981, 424975, 419462, 416125, 414587, 413633, 412468, 411469, 411544, 413056, 415664, 419004, 423115, 428179, 434164, 440912, 448421, 456785, 465816, 474870, 483100, 489833]
61109D89833M813K540m3k611m588n598n816n795n943o122n857m966l856l022k306
61094D40663j094O19J840J600K29r54j180q86q34j074j165r89q96j165j664j954
61078D31096j625o11O19J310J076K63m38o10k12O67J773K520K313J234J33j62
61062D39346L19Q66R81R44J320K179L058L706M439N501O494O822O608O581P093
61047D96257P701P851P528P083O868P256Q492J0214J1509J1855J1695J1762J2186
61034F18257J2778J3776J5618J8079K0308K1827K3113K4971K7672L0833L3954
61023H61186L6975M0289M4147M7990N0768N2150N3132N5151N8859O4075P0586
61012A435308P8391Q7348R7123J07556J18848J31713J47728J69243J98388K36292
$$ y = [489833, 494646, 497186, 497143, 494532, 489944, 484346, 478530, 472735, 466792, 460670, 454813, 449847, 445991, 442969, 440663, 439569, 440188, 442028, 443628, 443857, 442903, 441723, 440837, 440003, 438929, 437764, 436775, 435879, 434714, 433050, 431096, 429471, 428860, 429479, 430789, 431865, 432128, 431690, 431080, 430868, 431535, 433308, 435828, 438141, 439375, 439508, 439346, 439665, 440531, 441512, 442456, 443776, 445955, 449013, 452719, 457158, 462659, 469153, 475975, 482583, 489164, 496257, 503958, 511809, 519337, 526420, 533288, 540544, 549036, 559250, 570759, 582614, 594309, 606071, 618257, 631035, 644811, 660429, 678508, 698816, 720643, 743756, 768727, 796399, 827232, 861186, 898161, 938450, 982597, 1030587, 1081355, 1133505, 1186637, 1241788, 1300647, 1364722, 1435308, 1513699, 1601047, 1698170, 1805726, 1924574, 2056287, 2204015, 2373258, 2571646, 2807938]
61002B807938K83385L39772M04791M77322N58045O51193P63534R03042J079820
60993H268842J303918J572330J850823K070001K147035K021128J680629J172612
60985B2087318N97825Q9379k30583l04393j68796O3358K55843K98481J32220k41543
60975B2579109p57186j297286j734194j984719k039225j945101j765329j548690
60967I507379j325440j114756r28370p70138o38023n28510m38777l66039l07253
60958C090073k60139k23370j95311j73440j55363j39922j26889j15844j05707
60949A594088r5407q4825p4850o6323n9158n2904m7854m4871m3906m3592m2598
60938I37800m0717l8147l4693l0435k6477k3861k2108j9842j6724j3733j1579
$$ y = [2807938, 3091323, 3431095, 3835886, 4313208, 4871253, 5522446, 6285980, 7189022, 8268842, 9572760, 11145090, 12995913, 15065914, 17212949, 19234077, 20914706, 22087318, 22685143, 22774522, 22543939, 22239546, 22070750, 22134108, 22389951, 22688432, 22820652, 22579109, 21821923, 20524637, 18790443, 16805724, 14766499, 12821398, 11056069, 9507379, 8181939, 7067183, 6138813, 5368675, 4730652, 4202142, 3763365, 3397326, 3090073, 2829934, 2606564, 2411253, 2237813, 2082450, 1942528, 1815639, 1699795, 1594088, 1498681, 1413856, 1339006, 1272683, 1213525, 1160621, 1112767, 1067896, 1023990, 980398, 937800, 897083, 858936, 824243, 793808, 767331, 743470, 721362, 701520, 684796, 671063, 659484]
60927F59484r938q391p174o570o248n662m714l759l281l676m915o240o687o111
60913E76118n395n492o540p932q890q971q423p999q038p919p018n929n862o790
60899D74920p263o349m849m059m166m524m736m708m163l054k045j810k044j945
60885D19205j486j386j891k363k254j804j511j426j294j051q64q75j016j074q57
60870C98053m77l38o94j243j405r47j79M32O34M97M04Q41J859K844L121K738K315
60853D08455K177K078J810J638J884K399K718K598K220J907J748J414M15j286
60839D32175k949l605l116k400k459l306m021l761k594j397r94j396j822j603
60825C96752q74l00j53o4L23P72Q39N52L35L45K35l09j045j371j052n23l84p19
$$ y = [659484, 649546, 641155, 633981, 627411, 621163, 615501, 610787, 607028, 603747, 600071, 595156, 588916, 582229, 576118, 570723, 565231, 558691, 550759, 541869, 532898, 524475, 516476, 508438, 500519, 493501, 487572, 481710, 474920, 467657, 461308, 456459, 452400, 448234, 443710, 438974, 434266, 430103, 427049, 425004, 423194, 421150, 419205, 417719, 416333, 414442, 412079, 409825, 408021, 406510, 405084, 403790, 402739, 401875, 401000, 399984, 398910, 398053, 397576, 397238, 396544, 395301, 393896, 392949, 392770, 393202, 393836, 394333, 394737, 395578, 397437, 400281, 403402, 406140, 408455, 410632, 412710, 414520, 416158, 418042, 420441, 423159, 425757, 427977, 429884, 431632, 433046, 433461, 432175, 429226, 425621, 422505, 420105, 417646, 414340, 410319, 406558, 403964, 402567, 401573, 400177, 398355, 396752, 395878, 395578, 395425, 395361, 395684, 396456, 397295, 397847, 398182, 398527, 398762, 398453, 397408, 396037, 394985, 394462, 394078, 393359]
60807C93359j106j271j384j594j628j239q61j246k390l350l368k730k219k064
60793C66909j918j615j417j515j709j689j426j146j122j429j810j816j288n76
60779C46433p4K95P66J087P29j81p76n24O9K09k24q02j269j565j458q19j06j4
60761C41776n39r66q23m01j01J15M47P98J000J194J670K431L126L295K667J401
60745C57090J30o19j047j793k875l451k965j965j369j337j487j772k429l213l511
60730C27387l217k840k683k506k137j751j363p38k4J11n94j426j492p19L07J082
60714C07397J338R01j02j074j488j469j404j253p57j61q8o88j406j662j353o06
60698B96125M68J572K208K043J215J66n64m92M66J646K073J461N87L99J069K072
$$ y = [393359, 392253, 390982, 389598, 388004, 386376, 385137, 384276, 383030, 380640, 377290, 373922, 371192, 368973, 366909, 364991, 363376, 361959, 360444, 358735, 357046, 355620, 354474, 353352, 351923, 350113, 348297, 347009, 346433, 346359, 346654, 347420, 348507, 349236, 349055, 348279, 347755, 347824, 348033, 347809, 347007, 345738, 344173, 342715, 341896, 341790, 341776, 341237, 340271, 339448, 339047, 338946, 339061, 339508, 340306, 341306, 342500, 344170, 346601, 349727, 353022, 355689, 357090, 357220, 356601, 355554, 353761, 350886, 347435, 344470, 342505, 341136, 339799, 338312, 336540, 334111, 330898, 327387, 324170, 321330, 318647, 316141, 314004, 312253, 310890, 310152, 310128, 310239, 309645, 308219, 306727, 306008, 306315, 307397, 308735, 309636, 309534, 308460, 306972, 305503, 304099, 302846, 302089, 301928, 301840, 301152, 299746, 298084, 296731, 296125, 296593, 298165, 300373, 302416, 303631, 303797, 303233, 302741, 303207, 304853, 306926, 308387, 308974, 309373, 310442, 312514]
60682C12514K840L035K485J348K54j16K33O08M33j20m84m03j48j03l37o46q32
60665C20561q07n52j11L14M46K73J20K48M90N18M03N59J070J461J316Q70O34O38
60647C28451M61m9m67l94j3J68m2m28p59r44q27j51R55J761J538M19o59r62o24
60628C27434k27M4L90Q02R32O76M59O87J156J320R82M11o7l40l52q5K60L99L61
60609C35242N93J435K663L687M098L905L369K750K107J300K55p19j143j025j048
60594C57469j767k788l219k820k278k222k363j931p31N29R27K27q70j398j052
60579C35713m58l79q05j157j207j276j479j440j032p74j016j245q92l86n38j106
60563C20523r39L56J807K371K119J712J408J159J135J544K143K543K753K974L131
$$ y = [312514, 315354, 318389, 320874, 322222, 322476, 322360, 322593, 323201, 323634, 323514, 323030, 322627, 322479, 322376, 322039, 321393, 320561, 319754, 319202, 319091, 319405, 319851, 320124, 320244, 320492, 320982, 321500, 321903, 322462, 323532, 324993, 326309, 327179, 327813, 328451, 328912, 328863, 328396, 328002, 327989, 328157, 328115, 327687, 326928, 325984, 325157, 325006, 325961, 327722, 329260, 329679, 329020, 328058, 327434, 327207, 327251, 327641, 328443, 329375, 330051, 330510, 331197, 332353, 333673, 334655, 335066, 334999, 334659, 334307, 334222, 334482, 334881, 335242, 335835, 337270, 339933, 343620, 347718, 351623, 354992, 357742, 359849, 361149, 361404, 360685, 359542, 358517, 357469, 355702, 352914, 349695, 346875, 344597, 342375, 340012, 338081, 337350, 337879, 338806, 339033, 338163, 336765, 335713, 335255, 334876, 334071, 332914, 331707, 330431, 328952, 327512, 326480, 325706, 324690, 323445, 322553, 322167, 321629, 320523, 319584, 319940, 321747, 324118, 326237, 327949, 329357, 330516, 331651, 333195, 335338, 337881, 340634, 343608, 346739]
60548C46739L139L415M438N910O974P335P582Q271R263J0249J1350J2848J4646
60535D52159J6494J8547K1222K4534K7916L0860L3414L5863L8031L9173L8482
60524G76695L5568L0346K2832J3344K887p134j5704k2575k7767l1051l2174l1323
60512G13944k9033k5767k1870j7750j3762r954o252k813K22L165O560J0447J4327
60499F21464J7939K1549K5294K8657L0916L1729L1080K8984K5561K1146J5961
60488I00280J0059L905j384m973p257r227j1003j1650j0623q615o592m479j369
60475H37072L274R090J5524K2460K9995L7998M6292N5075O4757P5379Q6564R8134
60463A381614J10251J22437J32593J37725J35885J26954J11380Q8820N8830K2713
$$ y = [346739, 349878, 353293, 357731, 363641, 370615, 377950, 385532, 393803, 403066, 413315, 424665, 437513, 452159, 468653, 487200, 508422, 532956, 560872, 591732, 625146, 661009, 699040, 738213, 776695, 812263, 842609, 865441, 878785, 881672, 874538, 858834, 836259, 808492, 777441, 745267, 713944, 684911, 659144, 637274, 619524, 605762, 595808, 589556, 586743, 586965, 590130, 596690, 607137, 621464, 639403, 660952, 686246, 714903, 745819, 777548, 808628, 837612, 863173, 884319, 900280, 910339, 914244, 912860, 907887, 900630, 891403, 880400, 868750, 858127, 849512, 842920, 838441, 837072, 840346, 849436, 864960, 887420, 917415, 955413, 1001705, 1056780, 1121537, 1196916, 1283480, 1381614, 1491865, 1614302, 1746895, 1884620, 2020505, 2147459, 2258839, 2347659, 2406489, 2429202]
60453B429202j6069n3495q6561j13336j32405j43066j45884j42515j34806j24260
60443A336805j12191r9916q8409p7912o8093n8724n0122m2914l7356l3114k9679
60432F38375k6827k4436k2137j9552j6839j4554j2822j1104q947o605m601l105
60420D66846k132j947k689l727m115l664l078k890k839k469j804j120m26L49R40
60405D35235J024P22N60Q84J604K444L184L631L649L309K923K869L320M053M529
60390D73940M414M044M101M673N006M457L352K499K151J984J915K227K829L077
60376E20669K569J704J098P99M28j78q10j224j356j304j275j380j358p33M93J570
60360E19712J782J406J443K373L587M171L985L662L778M306M946N605O350P015
$$ y = [2429202, 2413133, 2359638, 2273077, 2159741, 2027336, 1884270, 1738386, 1595871, 1461065, 1336805, 1224614, 1124698, 1036289, 958377, 890284, 831560, 781438, 738524, 701168, 668054, 638375, 611548, 587112, 564975, 545423, 528584, 514030, 501208, 490104, 481157, 474552, 469951, 466846, 464714, 462767, 460078, 456351, 452236, 448572, 445494, 442604, 439765, 437296, 435492, 434372, 433946, 434295, 435235, 436259, 436981, 437541, 438425, 440029, 442473, 445657, 449288, 452937, 456246, 459169, 462038, 465358, 469411, 473940, 478354, 482398, 486499, 491172, 496178, 500635, 503987, 506486, 508637, 510621, 512536, 514763, 517592, 520669, 523238, 524942, 526040, 526839, 527267, 527089, 526279, 525055, 523699, 522395, 521120, 519740, 518382, 517649, 518142, 519712, 521494, 522900, 524343, 526716, 530303, 534474, 538459, 542121, 545899, 550205, 555151, 560756, 567106, 574121]
60346E74121P264P101O939O929O470M878K359j31j979l352m464n051m840m122
60332E92122l388k815k435k437k796k924k386j664j636k337l023l388l941m889
60318E52063n477m987l846l133l214l481l334k869k553k582k700k442j539k40
60304E09666P61J005Q29J026J867K749K935K293J160k34j789l112l615l224k604
60289E09713k473k855l317l685m114m547m543l785k455r67L40J177J374J185J239
60274D82287J816K504K834K982L360L830L879L444K986K697K327J843J718K200
60260E20707K861L207L350L610L796L487K903K916M019N687O944P426P607Q146
60246E86666R195J0465J1741J3076J4516J5951J7440J9426K2206K5330K7949K9806
$$ y = [574121, 581385, 588486, 595425, 602354, 608824, 613702, 616061, 615930, 613951, 610599, 606135, 601084, 596244, 592122, 588734, 585919, 583484, 581047, 578251, 575327, 572941, 571277, 569641, 567304, 564281, 560893, 556952, 552063, 546586, 541599, 537753, 534620, 531406, 527925, 524591, 521722, 519169, 516587, 513887, 511445, 509906, 509666, 510427, 511432, 512261, 513287, 515154, 517903, 520838, 523131, 524291, 524057, 522268, 519156, 515541, 512317, 509713, 507240, 504385, 501068, 497383, 493269, 488722, 484179, 480394, 477939, 476972, 477312, 478489, 479863, 481048, 482287, 484103, 486607, 489441, 492423, 495783, 499613, 503492, 506936, 509922, 512619, 514946, 516789, 518507, 520707, 523568, 526775, 530125, 533735, 537531, 541018, 543921, 546837, 550856, 556543, 563487, 570913, 578520, 586666, 595861, 606326, 618067, 631143, 645659, 661610, 679050, 698476, 720682, 746012, 773961, 803767]
60234H03767L1489L3627L6233L9026M1956M5118M8361N1306N3586N4933N5221
60223A294623N4602N3409N1753M9385M6041M1618L5983K9080K1474J4230P826
60212A700024J717m566j0385j4737j7581j9553k0635k0208j8403j6268j4254j1494
60200A533657p210j986L055P846J3218J9535K6254L2763L8928M4742N0067N4831
60188A815700N9028O2281O3848O3270O0829N7126N2430M6564L9274L0521K0635
60177B371506J0332N14q273j6231k3938l1490l8123m2841m5393m6384m6377m5142
60165B038160m2122l7448l2063k6798k1659j6202j0197l706L198J0343J7286K3531
60153A902323K8864L3123L5829L6431L4916L1734K7194K1396J4810Q305K269l784
$$ y = [803767, 835256, 868883, 905116, 944142, 986098, 1031216, 1079577, 1130883, 1184469, 1239402, 1294623, 1349225, 1402634, 1454387, 1503772, 1549813, 1591431, 1627414, 1656494, 1677968, 1692198, 1700024, 1701741, 1697175, 1686790, 1672053, 1654472, 1634919, 1614284, 1594076, 1575673, 1559405, 1545151, 1533657, 1526447, 1524461, 1527516, 1535362, 1548580, 1568115, 1594369, 1627132, 1666060, 1710802, 1760869, 1815700, 1874728, 1937009, 2000857, 2064127, 2124956, 2182082, 2234512, 2281076, 2320350, 2350871, 2371506, 2381838, 2382352, 2374079, 2357848, 2333910, 2302420, 2264297, 2221456, 2176063, 2129679, 2083302, 2038160, 1996038, 1958590, 1926527, 1899729, 1878070, 1861868, 1851671, 1847965, 1851163, 1861506, 1878792, 1902323, 1931187, 1964310, 2000139, 2036570, 2071486, 2103220, 2130414, 2151810, 2166620, 2174925, 2177194, 2173410]
60141B173410j0298j6656k1551k4202k4821k3980k1960j8710j4047p869l78P792
60129A996730J5989K4126L2609M1653N0975O0300O9851Q0091R1192J02946J14982
60118B681444J26776J37644J47103J55161J61868J66554J67969J65428J59417
60109D069364J50836J39816J25782J08483Q8442O6344M2582J7746o995l0588n2976
60098D718836p4614r5128j13154j27614j38468j45893j49440j48612j43893j36420
60088C445600j26917j15685j03335r0679p7787o4066m9524l5145k1633q613M267
60077B756483J6194K6006L3726M0258M5720M9005M9161M6377M1366L4472K5815
60066C164583J5859N354n129j5327k5164l4662m3797n2223n9406o5174o9911p4047
$$ y = [2173410, 2163112, 2146456, 2124905, 2100703, 2075882, 2051902, 2029942, 2011232, 1997185, 1989316, 1988938, 1996730, 2012719, 2036845, 2069454, 2111107, 2162082, 2222382, 2292233, 2372324, 2463516, 2566462, 2681444, 2808220, 2945864, 3092967, 3248128, 3409996, 3576550, 3744519, 3909947, 4069364, 4220200, 4360016, 4485798, 4594281, 4682723, 4749067, 4791649, 4809395, 4802400, 4771812, 4718836, 4644222, 4549094, 4435940, 4308326, 4169858, 4023965, 3874525, 3725913, 3582020, 3445600, 3318683, 3202998, 3099663, 3008984, 2931197, 2867131, 2817607, 2782462, 2760829, 2752216, 2756483, 2772677, 2798683, 2832409, 2872667, 2918387, 2967392, 3016553, 3062930, 3104296, 3138768, 3164583, 3180442, 3185796, 3180667, 3165340, 3140176, 3105514, 3061717, 3009494, 2950088, 2884914, 2815003, 2740956]
60054B740956p7517p9843q0578p9502p6648p2331o7037o1063n4411m7090l9288
60043B005648l1117k2450j3261l866N386J4511K3670L2728M1356M9441N7006O3665
60031B222717O8551P0953P0875O8774O4887N8966N0755M0548K9150J7195M827
60020B768198p839k0204l1552m1871n1673o0834o8068p2005p2454p0303o6473
60009B204922o1383n5238m8282m0765l2921k4963j6821q120J207J0529J9191K7432
59997A974788L5988M4951N3710O2018P0299P8566Q5790R0839R3485R3895R1676
59986B776005Q6231P7827O7470N5701M2264K7170J1368m006j8599l2550m5618
59975C043263n7168o6787p4360p9410q1047p8973p4163o8107o1442n3721m4504
$$ y = [2740956, 2663439, 2583596, 2503018, 2423516, 2346868, 2274537, 2207500, 2146437, 2092026, 2044936, 2005648, 1974531, 1952081, 1938820, 1934954, 1940340, 1954851, 1978521, 2011249, 2052605, 2102046, 2159052, 2222717, 2291268, 2362221, 2433096, 2501870, 2566757, 2625723, 2676478, 2717026, 2746176, 2763371, 2768198, 2760359, 2740155, 2708603, 2666732, 2615059, 2554225, 2486157, 2414152, 2341698, 2271395, 2204922, 2143539, 2088301, 2040019, 1999254, 1966333, 1941370, 1924549, 1916429, 1917636, 1928165, 1947356, 1974788, 2010776, 2055727, 2109437, 2171455, 2241754, 2320320, 2406110, 2496949, 2590434, 2684329, 2776005, 2862236, 2940063, 3007533, 3063234, 3105498, 3132668, 3144036, 3140030, 3121431, 3088881, 3043263, 2986095, 2919308, 2844948, 2765538, 2684491, 2605518, 2531355, 2463248, 2401806, 2348085, 2303581]
59964B303581l4302k4256j5166p030N95Q059J5431K2665K9781L6807M3530M9402
59952B429097N3929N7014N8725N8813N6851N2973M8006M2644L6816L0207K3050
59941B948125J6031R631M021n77l920n999o747n520j478N464J4551K5195L7507
59928C036284N1550O6624Q1769R6688J11691J26785J41177J53726J63638J70658
59918D200590J74635J74952J70378J59655J42224J18384Q9029N5456J9339j7523
59908E287119n3426q6569j14950j37109j53021j63620j69325j69681j64673j55644
59898C919101j44368j31726j17839j02978q7628p2015n6277m0994k6847j3751
59888C124678r42J1999K4662L6385M6849N6056O4094P0980P6338P9255P8754P4495
$$ y = [2303581, 2269279, 2245023, 2229857, 2222827, 2223422, 2231481, 2246912, 2269577, 2299358, 2336165, 2379695, 2429097, 2483026, 2540040, 2598765, 2657578, 2714429, 2767402, 2815408, 2858052, 2894868, 2925075, 2948125, 2964156, 2973787, 2977808, 2977231, 2973311, 2967312, 2960565, 2955045, 2953567, 2959031, 2973582, 2998777, 3036284, 3087834, 3154458, 3236227, 3332915, 3444606, 3571391, 3712568, 3866294, 4029932, 4200590, 4375225, 4550177, 4720555, 4880210, 5022434, 5140818, 5229847, 5285303, 5304642, 5287119, 5233693, 5147124, 5032174, 4895065, 4742044, 4578424, 4409099, 4239418, 4074745, 3919101, 3774733, 3643007, 3525168, 3422190, 3334562, 3262547, 3206270, 3165276, 3138429, 3124678, 3123736, 3135735, 3160397, 3196782, 3243631, 3299687, 3363781, 3434761, 3511099, 3590354, 3669108, 3743603]
59876C743603O6735N5786M1925K5737Q058j0432k9142m7167o3577p8200r1391
59865C621935j02808j11061j15049j15252j13183j09837j05107r8539r0231q0973
59855B579895p1752o3196n5329m7947m1228l5827l2212l0084k8469k6353k3198
59844B124300j9143j4753j0478o393k612K71J673J841J637J444J016N66J201L578
59830B084148O685Q616Q266N659J097n055j1821j7791k2246k5518k7976k9214
59818A974850k8642k6523k3918k1735k0154j8817j7283j5310j2944j0400p794
59807A771330m946j620K081N730R028J2085J5014J7354J8239J7291J5133J2732
59795A889451J0461Q086N497K935N64j556k920k589j47L768Q287J3380J9610K7139
$$ y = [3743603, 3810338, 3866124, 3908049, 3933786, 3941844, 3931412, 3902270, 3855103, 3791526, 3713326, 3621935, 3519127, 3408066, 3293017, 3177765, 3064582, 2954745, 2849638, 2751099, 2660868, 2579895, 2508143, 2444947, 2389618, 2341671, 2300443, 2264616, 2232404, 2202320, 2173851, 2147498, 2124300, 2105157, 2090404, 2079926, 2073533, 2070921, 2071192, 2072865, 2074706, 2076343, 2077787, 2078803, 2079369, 2080570, 2084148, 2090833, 2099449, 2107715, 2113374, 2114471, 2109416, 2097595, 2079804, 2057558, 2032040, 2004064, 1974850, 1946208, 1919685, 1895767, 1874032, 1853878, 1835061, 1817778, 1802468, 1789524, 1779124, 1771330, 1766384, 1764764, 1766845, 1772575, 1781603, 1793688, 1808702, 1826056, 1844295, 1861586, 1876719, 1889451, 1899912, 1907998, 1913495, 1916430, 1916994, 1915438, 1912518, 1909929, 1909782, 1913550, 1921837, 1935217, 1954827, 1981966]
59781A981966L5506M4330N3714O3933P5131Q7256J00076J13291J26888J41118
59771B823209J55712J69093J78746J82090J76661J59965J30417Q9025L9759j1894
59761D092783o0588j01783j32228j50747j58372j57221j49416j37104j22620j07755
59751B814949r3051p8455o4517n2256m1930l2669k3534j4474n937J901R210J6085
59739B435322K2564K8942L5625M2642M9611N6375O3359P1082P9577Q8627R8510
59728C072236J09929J23124J37493J52344J67724J84080K01494K19631K38249
59719D606304K57141K75611K92481L06647L17206L23105L23290L17429L06071
59710G325285K90150K70821K49845K29414K11198J95945J84088J75954J71026
$$ y = [1981966, 2017472, 2061802, 2115516, 2179449, 2254580, 2341836, 2441912, 2555203, 2682091, 2823209, 2978921, 3148014, 3326760, 3508850, 3685511, 3845476, 3975893, 4064918, 4104677, 4092783, 4032195, 3930412, 3798184, 3647437, 3489065, 3331844, 3182428, 3045324, 2922704, 2814949, 2721898, 2643443, 2578926, 2526670, 2484740, 2452071, 2428537, 2414063, 2408126, 2410027, 2419237, 2435322, 2457886, 2486828, 2522453, 2565095, 2614706, 2671081, 2734440, 2805522, 2885099, 2973726, 3072236, 3182165, 3305289, 3442782, 3595126, 3762850, 3946930, 4148424, 4368055, 4606304, 4863445, 5139056, 5431537, 5738184, 6055390, 6378495, 6701785, 7019214, 7325285, 7615435, 7886256, 8136101, 8365515, 8576713, 8772658, 8956746, 9132700, 9303726]
59701I303726J67729J64586J61026J56455J49267J37821J22106J03562Q3306O1473
59691A0611057L8292J4833p524k7662m4446n6619o3413o4827o1001n1766l7163
59680A0249761j7967M803L0537N8926Q9515J21767J55319J89678K23785K56245
59670A1362369K85907L11883L32981L47499L53574L49477L33549L04256K60673
59661A4242168K03054J32961N3007l3429j22173k08324k86701l52862m03961m38942
59651A2784798m58112m62737m54781m36579m10574l79558l47263l18353k97380
59642I219461k87474k89690l02972l24236l48704l70950l86403l92395l88274
59633F128363l75000l54706l30182l04064k77994k52461k27523k03664j81836
$$ y = [9303726, 9471455, 9636041, 9797067, 9953522, 10102789, 10240610, 10362716, 10466278, 10549584, 10611057, 10649349, 10664182, 10656658, 10628996, 10584550, 10527931, 10464518, 10399691, 10338690, 10286924, 10249761, 10231794, 10236597, 10267134, 10326060, 10415575, 10537342, 10692661, 10882339, 11106124, 11362369, 11648276, 11960159, 12293140, 12640639, 12994213, 13343690, 13677239, 13981495, 14242168, 14445222, 14578183, 14631190, 14597761, 14475588, 14267264, 13980563, 13627701, 13223740, 12784798, 12326686, 11863949, 11409168, 10972589, 10562015, 10182457, 9835194, 9516841, 9219461, 8931987, 8642297, 8339325, 8015089, 7666385, 7295435, 6909032, 6516637, 6128363, 5753363, 5398657, 5068475, 4764411, 4486417, 4233956, 4006433, 3802769, 3620933]
59624C620933j62703j46086j31240j17477j04422r1964q0306p0024o1614n4965
59614B600132m9387m4269l9424l4839l0425k6264k2827k0679j9935k0139k0711
59603B271233k1370k2188k3285k4578k5833k6964k8053k8962k9163k8293k6734
59592A985810k5255k4032k2526k0464j8404j6944j5781j4167j2134j0604j0160
59581A795339j0286j0036r092p793o405m891l267j791o09N16J971L969O512R451
59567A763588J2462J5143J7410J9633K2203K5085K8053L1249L5140L9895M5166
59556B055027N0436N5354N9751O3794O8140P3454P9591Q5729R1506R7478J04024
59545B884284J10395J15419J18755J20654J20743J17817J10962J00261Q6430P0462
$$ y = [3620933, 3458230, 3312144, 3180904, 3063427, 2959005, 2867041, 2786735, 2716711, 2655097, 2600132, 2550745, 2506476, 2467052, 2432213, 2401788, 2375524, 2352697, 2332018, 2312083, 2291944, 2271233, 2249863, 2227675, 2204390, 2179812, 2153979, 2127015, 2098962, 2070000, 2040837, 2012544, 1985810, 1960555, 1936523, 1913997, 1893533, 1875129, 1858185, 1842404, 1828237, 1816103, 1805499, 1795339, 1785053, 1775017, 1765925, 1758132, 1751727, 1746836, 1743569, 1741778, 1741169, 1741685, 1743656, 1747625, 1754137, 1763588, 1776050, 1791193, 1808603, 1828236, 1850439, 1875524, 1903577, 1934826, 1969966, 2009861, 2055027, 2105463, 2160817, 2220568, 2284362, 2352502, 2425956, 2505547, 2591276, 2682782, 2780260, 2884284, 2994679, 3110098, 3228853, 3349507, 3470250, 3588067, 3699029, 3799290, 3885720, 3956182]
59535C956182N3853L8386K5063J3516K709p958j8445k8577l8261m7233n4913o0671
59523C833651o4353o6441o7581o7769o6175o1971n5151m6248l5527k2922q685
59512C270828O536K2342L8887N6296P4181R1829J08533J23574J36068J44885J48592
59501D222551J45774J35864J19555R7963P1560M0573O280k8929o2874r4170j21483
59490D532664j43334j59048j69094j73863j72945j66271j55215j41754j26988
59481C124152j11249r5168p9678o5068n0833l6470k1983p729N758J8033K9229
59470B708994M0014N0636O0336O8277P4518P9381Q2261Q1995P8239P1602O2500
59459C458753N0748L6392K0027K177j6848l6230n4568p0831q4877r6667j05691
$$ y = [3956182, 4010035, 4048421, 4073484, 4087000, 4089709, 4081751, 4063306, 4034729, 3996468, 3949235, 3894322, 3833651, 3769298, 3702857, 3635276, 3567507, 3501332, 3439361, 3384210, 3337962, 3302435, 3279513, 3270828, 3277364, 3299706, 3338593, 3394889, 3469070, 3560899, 3669432, 3793006, 3929074, 4073959, 4222551, 4368325, 4504189, 4623744, 4721707, 4793267, 4833840, 4840120, 4811191, 4748317, 4654147, 4532664, 4389330, 4230282, 4061188, 3887325, 3714380, 3548109, 3392894, 3251140, 3124152, 3012903, 2917735, 2838057, 2772989, 2722156, 2685686, 2663703, 2655974, 2661732, 2679765, 2708994, 2749008, 2799644, 2859980, 2928257, 3002775, 3082156, 3164417, 3246412, 3324651, 3396253, 3458753, 3509501, 3545893, 3565920, 3568097, 3551249, 3515019, 3460451, 3389620, 3304743, 3208076, 3102385]
59448C102385j11573j14711j15788j15017j12327j08071j03020r7701r2070q5855
59438B046252p9063p2144o5709n9983n4604m9050m3353l8140l3874l0230k6391
59427A493711k1907j7137j2856r400o373l223M0L071O000R470J3583J7334J9427
59414A491740J9365J7401J3968R653N462K481J290K019M573Q402J2436J5807J8369
59401A622966J9990J9952J7858J4808J2661J2238J3143J5079J8240K2393K6758
59390A816086L1079L5809M0848M5172M8245N0891N4156N7993O1730O5181O8687
59379B375877P2500P6716Q1423Q6403R1090R5292R9635J04970J11789J20452J31323
59368C447470J44162J58113J72917J89494K08516K28852K48336K65641K80427
$$ y = [3102385, 2990812, 2876101, 2760313, 2645296, 2532969, 2424898, 2321878, 2224177, 2132107, 2046252, 1967189, 1895045, 1829336, 1769353, 1714749, 1665699, 1622346, 1584206, 1550332, 1520102, 1493711, 1471804, 1454667, 1441811, 1432411, 1426038, 1422815, 1422855, 1425926, 1431926, 1441396, 1454979, 1472313, 1491740, 1511105, 1528506, 1542474, 1552127, 1557589, 1560070, 1561360, 1563379, 1567952, 1576354, 1588790, 1604597, 1622966, 1642956, 1662908, 1680766, 1695574, 1708235, 1720473, 1733616, 1748695, 1766935, 1789328, 1816086, 1847165, 1882974, 1923822, 1968994, 2017239, 2068130, 2122286, 2180279, 2242009, 2307190, 2375877, 2448377, 2525093, 2606516, 2692919, 2784009, 2879301, 2978936, 3083906, 3195695, 3316147, 3447470, 3591632, 3749745, 3922662, 4112156, 4320672, 4549524, 4797860, 5063501, 5343928]
59359E343928K91946K98718K99764K95292K85826K71610K53283K32429K10747
59350G783543J88943J66909J44649J22276R9255P4291M6307J5126j9047n6374
59340H565878r6983j39912j83019k24045k61244k92922l17142l32571l39300l38297
59330F040443l30415l16613k98637k78555k57635k36463k15991j97474j81253
59321C727407j66578j52990j40895j30454j20882j11488j02618r4902q8162q1831
59311B536607p5876p0601o5893o1343n6767n2084m7089m1924l7335l3770l0567
59300A963358k6727k2193j7708j3647r795o017k386J293N276R130J1717J2146
59288A904447J0386P175L752J587J672L904P537J2164J7888K4593L1538L7719
$$ y = [5343928, 5635874, 5934592, 6234356, 6529648, 6815474, 7087084, 7340367, 7572796, 7783543, 7972486, 8139395, 8284044, 8406320, 8505575, 8579866, 8626173, 8641299, 8622252, 8565878, 8468895, 8328983, 8145964, 7921919, 7660675, 7367753, 7050611, 6718040, 6378740, 6040443, 5710028, 5393415, 5094778, 4816223, 4558588, 4322125, 4106134, 3908660, 3727407, 3560829, 3407839, 3266944, 3136490, 3015608, 2904120, 2801502, 2706600, 2618438, 2536607, 2460731, 2390130, 2324237, 2262894, 2206127, 2154043, 2106954, 2065030, 2027695, 1993925, 1963358, 1936631, 1914438, 1896730, 1883083, 1873288, 1867271, 1864885, 1866178, 1871454, 1880584, 1892301, 1904447, 1914833, 1922008, 1925760, 1927347, 1929019, 1932923, 1940460, 1952624, 1970512, 1995105, 2026643, 2064362]
59276B064362M2382M5286M6772M7504M7801M7252M5190M1299L5511K7799J8471
59265B509629Q330j976j2444k3019l2822m0771m6685n1066n4035n5346n5208n4206
59253B090381n2348m9151m4791m0305l6367l2637k8627k4481k0453j6299j1729
59242A733193p093l131j07K417N068Q002J0728J2663J3982J5693J8454K1617K4011
59229A855497K5536K7259K9931L3243L6658M0112M3526M6489M9061N2319N7355
59218B296986O3991P1119P8197Q5827R4838J05225J16283J27551J39361J52290
59208C331668J66025J79018J89288J95496J97013J93331J83812J67941J45511
59199D949103J16701Q2382M4169L756l7613p8505j16475j48772j73938j92054
$$ y = [2064362, 2106744, 2152030, 2198802, 2246306, 2294107, 2341359, 2386549, 2427848, 2463359, 2491158, 2509629, 2517959, 2515983, 2503539, 2480520, 2447698, 2406927, 2360242, 2309176, 2255141, 2199795, 2144587, 2090381, 2038033, 1988882, 1944091, 1903786, 1867419, 1834782, 1806155, 1781674, 1761221, 1744922, 1733193, 1726100, 1722969, 1722862, 1725279, 1730347, 1738349, 1749077, 1761740, 1775722, 1791415, 1809869, 1831486, 1855497, 1881033, 1908292, 1938223, 1971466, 2008124, 2048236, 2091762, 2138251, 2187312, 2239631, 2296986, 2360977, 2432096, 2510293, 2596120, 2690958, 2796183, 2912466, 3040017, 3179378, 3331668, 3497693, 3676711, 3865999, 4061495, 4258508, 4451839, 4635651, 4803592, 4949103, 5065804, 5148186, 5192355, 5196111, 5158498, 5079993, 4963518, 4814746, 4640808, 4448754]
59189D448754k03402k07848k05783j98758j88588j76368j62742j48466j34128
59180B822671j19844j05783r2581q0692o9827n9620n0506m3226l7724l3211k9167
59169B100490k5701k3011k1051j9780j9273j9610k1014k3898k8272l3144l7130
59158A828606l9756m1624m3309m4615m5164m5017m4342m2915m0586l7966l5920
59147A367392l4393l2421k9537k6509k4243k2431k0066j7028j4259j2272j0358
59136A123875p762m930k858j698p83K76J347K473L929N506O612P327Q559J0820
59122A152693J3448J5485J6795J7844J8923K0068K1412K3021K4648K6081K7470
59111A377888K8832K9542K8937K7312K5702K4588K3411K1527J9207J7399J6771
$$ y = [4448754, 4245352, 4037504, 3831721, 3632963, 3444375, 3268007, 3105265, 2956799, 2822671, 2702827, 2597044, 2504463, 2423771, 2353944, 2294324, 2243818, 2200592, 2162868, 2129657, 2100490, 2074789, 2051778, 2030727, 2010947, 1991674, 1972064, 1951050, 1927152, 1898880, 1865736, 1828606, 1788850, 1747226, 1703917, 1659302, 1614138, 1569121, 1524779, 1481864, 1441278, 1403312, 1367392, 1332999, 1300578, 1271041, 1244532, 1220289, 1197858, 1177792, 1160764, 1146505, 1134233, 1123875, 1116113, 1111183, 1108325, 1106627, 1105844, 1106120, 1107467, 1109940, 1113869, 1119375, 1125987, 1133314, 1141873, 1152693, 1166141, 1181626, 1198421, 1216265, 1235188, 1255256, 1276668, 1299689, 1324337, 1350418, 1377888, 1406720, 1436262, 1465199, 1492511, 1518213, 1542801, 1566212, 1587739, 1606946, 1624345, 1641116]
59100A641116J7231J8311J9754K1719K4525K8212L2317L6061L8800M0421M1394
59089A959861M2405M3726M4974M5533M5227M4351M3088M1093L7792L2919K6599
59078B407568J9077J0505R93r203j9580k9563l8845m7492n5516o2398o7337p0043
59066B038166p1089p1289p0888o9480o6729o2939n8875n5018n1202m7059m2654
59055A370944l8364l4273l0154k6157k2923k0738j9029j7204j5452j4162j2997
59044A119491j1329r293p546o070m151j601R16L006N145P716J0163J1641J2042
59031A130130J1848J1378J0639R628Q374O873N305M021L098K166R24l71j160j173
59017A201680o09nJ04k76l47O67K407L595L564K979K742K823K603J890R91J49
$$ y = [1641116, 1658347, 1676658, 1696412, 1718131, 1742656, 1770868, 1803185, 1839246, 1878046, 1918467, 1959861, 2002266, 2045992, 2090966, 2136499, 2181726, 2226077, 2269165, 2310258, 2348050, 2380969, 2407568, 2426645, 2437150, 2438143, 2428940, 2409360, 2379797, 2340952, 2293460, 2237944, 2175546, 2108209, 2038166, 1967077, 1895788, 1824900, 1755420, 1688691, 1625752, 1566877, 1511859, 1460657, 1413598, 1370944, 1332580, 1298307, 1268153, 1241996, 1219073, 1198335, 1179306, 1162102, 1146650, 1132488, 1119491, 1108162, 1098869, 1091323, 1085253, 1081102, 1079501, 1080417, 1083423, 1088568, 1096284, 1106447, 1118088, 1130130, 1141978, 1153356, 1163995, 1173623, 1181997, 1188870, 1194175, 1198196, 1201294, 1203460, 1204384, 1204013, 1202853, 1201680, 1201071, 1201066, 1201170, 1200894, 1200547, 1201214, 1203621, 1207216, 1210780, 1213759, 1216501, 1219324, 1221927, 1223817, 1224808, 1224957]
59001A224957n57j113j708k714m004m667l942k273q18l6O85J956L480M396M251
58986A217893L334K085M29k093n466q750j0899j1857j2390j2867j2815j1823j0283
58973A124498q881p778o648n262l685k207j170p07m39J63J062J711J875J888J974
58958A096394J938J786J995K780L743M562N510O791P996Q697R109R647J0326J1026
58944A182300J1808J2505J2676J2438J2685J3696J4400J3917J3175J3799J5828
58933A329227J7808J9026K0276K2355K4921K7304K9512L1950L4799L8097M1886
58922A637161M5893M9443N2077N3905N5127N5662N5577N5589N6687N9309O3123
58911B239553O7648P2859P9146Q6659R4982J03575J12416J21843J31802J41687
$$ y = [1224957, 1224400, 1223287, 1221579, 1218865, 1214861, 1210194, 1206252, 1203979, 1203161, 1203125, 1203810, 1205766, 1209246, 1213642, 1217893, 1221227, 1223312, 1223741, 1221648, 1216182, 1207432, 1196533, 1184676, 1172286, 1159419, 1146604, 1134781, 1124498, 1115617, 1107839, 1101191, 1095929, 1092244, 1090037, 1088867, 1088160, 1087721, 1087884, 1088946, 1090657, 1092532, 1094420, 1096394, 1098332, 1100118, 1102113, 1104893, 1108636, 1113198, 1118708, 1125499, 1133495, 1142192, 1151301, 1160948, 1171274, 1182300, 1194108, 1206613, 1219289, 1231727, 1244412, 1258108, 1272508, 1286425, 1299600, 1313399, 1329227, 1347035, 1366061, 1386337, 1408692, 1433613, 1460917, 1490429, 1522379, 1557178, 1595275, 1637161, 1683054, 1732497, 1784574, 1838479, 1893606, 1949268, 2004845, 2060434, 2117121, 2176430, 2239553, 2307201, 2380060, 2459206, 2545865, 2640847, 2744422, 2856838, 2978681, 3110483, 3252170]
58901C252170J51069J60175J69393J78646J87574J96079K04362K12559K20407
58892D932434K27094K31427K32532K30318K24794K15116K00097J79721J55150
58883F828683J27139R5533O0863K5154r741m3662p7079j09293j38748j64469j86090
58872F408290k03116k15305k23361k28130k29466k27040k21837k15558k08739
58863D435738k00658j91019j80568j70079j59819j50140j41389j33199j24779
58854B984088j16138j08084j00983r4397q8003q1984p6440p1244o6434o1844n6514
58843B062023m9630m2061l5767l1481k8117k4626k1170j8114j5098j1777q493
58832A775689n582k816m1K470M717P242J0187J2901J5072J7457K0910K5217K9456
$$ y = [3252170, 3403239, 3563414, 3732807, 3911453, 4099027, 4295106, 4499468, 4712027, 4932434, 5159528, 5390955, 5623487, 5853805, 6078599, 6293715, 6493812, 6673533, 6828683, 6955822, 7051355, 7112218, 7137372, 7127631, 7083969, 7006890, 6897597, 6758849, 6594380, 6408290, 6205174, 5989869, 5766508, 5538378, 5308912, 5081872, 4860035, 4644477, 4435738, 4235080, 4044061, 3863493, 3693414, 3533595, 3383455, 3242066, 3108867, 2984088, 2867950, 2759866, 2658883, 2564486, 2476483, 2394499, 2318059, 2246815, 2180381, 2118537, 2062023, 2012393, 1970332, 1934565, 1903084, 1874967, 1850341, 1829171, 1811057, 1795959, 1784182, 1775689, 1770107, 1767291, 1767250, 1769720, 1774437, 1781679, 1791866, 1804767, 1819839, 1837296, 1858206, 1883423, 1912879]
58819A912879L3054L6069L9042M2759M7645N3019N7614O1125O4598O8994P4083
58808B490881P9187Q4307R0020R6793J04756J13667J22892J31946J41252J51747
58798C607448J63573J75876J87932J99553K10284K19276K26338K31917K35563
58789E457760K35533K30541K20861K06972J88290J64102J34798J01249O3899K3659
58779G027664j7117n5967r2203j26362j58125j85908k08384k25406k37418k44741
58769E476033k47536k45928k40291k31705k21739k11294k00156j88125j75974
58760C513285j64602j53926j43449j33401j24368j16237j08476j01076r4282q7701
58750B285767q0753p3716o7270o1193n4722m8123m2616l8579l4929l0681k6074
$$ y = [1912879, 1945933, 1982002, 2021044, 2063803, 2111448, 2164467, 2222081, 2283206, 2347804, 2416798, 2490881, 2570068, 2654375, 2744395, 2841188, 2945944, 3059611, 3182503, 3314449, 3455701, 3607448, 3771021, 3946897, 4134829, 4334382, 4544666, 4763942, 4990280, 5222197, 5457760, 5693293, 5923834, 6144695, 6351667, 6539957, 6704059, 6838857, 6940106, 7004005, 7027664, 7010547, 6954580, 6862377, 6736015, 6577890, 6391982, 6183598, 5958192, 5720774, 5476033, 5228497, 4982569, 4742278, 4510573, 4288834, 4077540, 3877384, 3689259, 3513285, 3348683, 3194757, 3051308, 2917907, 2793539, 2677302, 2568826, 2467750, 2373468, 2285767, 2205014, 2131298, 2064028, 2002835, 1948113, 1899990, 1857374, 1818795, 1783866, 1753185, 1727111]
58739A727111k1732j7718j4080j1490j0486j0547j0707j0797j1356j2409j3095
58728A582694j2606j0992q814o476m346l237m097p054j1228j5731k0466k5618
58716A452029l0785l5283l9009m2231m4690m5731m5428m4593m3456m1290l7794
58705A001739l3962l0841k8140k4929k1138j7513j4440j1703r246p321n832m278
58693G92396k492r71l72r38k507m732p222r641j1633j2747j2642j1536j0080q678
58679F96205p195n453l547j587L79K041K973L384M102N471O898P831Q504R221
58665G29227R562Q870P026M265Q17k781n707p787r786j2070j3772j4035j3356
58652F80473j2785j2412j1714j0828j0236r599q169o187m602l554k234m29J008
$$ y = [1727111, 1705379, 1687661, 1673581, 1662091, 1651605, 1641058, 1630351, 1619554, 1608198, 1595789, 1582694, 1570088, 1559096, 1550282, 1543806, 1539460, 1536223, 1532126, 1525072, 1513844, 1498113, 1477647, 1452029, 1421244, 1385961, 1346952, 1304721, 1260031, 1214300, 1168872, 1124279, 1080823, 1039533, 1001739, 967777, 936936, 908796, 883867, 862729, 845216, 830776, 819073, 809827, 802506, 796674, 792396, 789904, 788933, 788561, 787623, 785116, 780384, 773162, 763521, 751888, 739141, 726499, 714963, 704883, 696205, 689010, 683557, 680010, 678423, 678802, 680843, 683816, 687200, 691302, 696773, 703671, 711502, 720006, 729227, 738789, 747659, 754685, 758950, 759767, 756986, 751279, 743492, 733706, 721636, 707864, 693829, 680473, 667688, 655276, 643562, 632734, 622498, 612899, 604730, 598543, 593941, 590387, 588153, 587724, 588732]
58639E88732J479J501J900K843L945M626M366L248K374K932M695O150O283N593
58625F40667N061M967N104N541O511P854R060R843J0432J1323J2769J4534J6189
58612G59855J7733J9586K1922K4348K6537K8717L1149L3622L5990L8690M2151
58601A080300M6084M9988N3965N8228O2216O5177O7334O9414P1143P1278O9179
58590A764306O5294N9939N2627M3089L2026K0387Q552l303j4561k4451l2662l9294
58578A931949m4397m7831m9412m9059m7092m4295m1432l8632l5600l2323k9162
58567A472714k6260k3394k0504j7927j5876j4053j2037r954q667r220j1899j5812
58555A287111j9710k3286k7145l1275l4434l5706l5917l6466l7211l6691l4374
$$ y = [588732, 590211, 591712, 593612, 596455, 600400, 605026, 609392, 612640, 615014, 617946, 622641, 628791, 635074, 640667, 645728, 650695, 655799, 661340, 667851, 675705, 684765, 694608, 705040, 716363, 729132, 743666, 759855, 777588, 797174, 819096, 843444, 869981, 898698, 929847, 963469, 999459, 1038149, 1080300, 1126384, 1176372, 1230337, 1288565, 1350781, 1415958, 1483292, 1552706, 1623849, 1695127, 1764306, 1829600, 1889539, 1942166, 1985255, 2017281, 2037668, 2046220, 2042917, 2028356, 2003905, 1971243, 1931949, 1887552, 1839721, 1790309, 1741250, 1694158, 1649863, 1608431, 1569799, 1534199, 1501876, 1472714, 1446454, 1423060, 1402556, 1384629, 1368753, 1354700, 1342663, 1332709, 1324042, 1314822, 1302923, 1287111, 1267401, 1244115, 1216970, 1185695, 1151261, 1115555, 1079638, 1043172, 1005961, 969270, 934896]
58544I34896l1423k9011k6972k4606k2043j9982j8605j7384j5898j4339j3153
58533G01480j2380j1649j0777j0121r993r932r154p749o712o538o561o059n297
58520E88558m849m607m174l707l601l737l705l398k810j771m68L95O82J293K787
58505E56888M287M769M702N280O607P839Q534Q750Q340P514P337Q294Q988P938
58491F56067O189O192Q307J0421J1036J0730J0266R318P722O218N047L322O65
58478G51500j902l522m851o929r642j2118j3869j4832j5013j4631j3997j2981
58466F27213j1312r516q599q627q596p932p027o134m958l724l303l769m027l362
58452E36327k290j403n38L81R00J005J444K464L386L893M579N652O393O542O902
$$ y = [934896, 903473, 874462, 847490, 822884, 800841, 780859, 762254, 744870, 728972, 714633, 701480, 689100, 677451, 666674, 656553, 646560, 636628, 627474, 619725, 613013, 606475, 599914, 593855, 588558, 583709, 579102, 574928, 571221, 567620, 563883, 560178, 556780, 553970, 552199, 551731, 552126, 552808, 554101, 556888, 561175, 565944, 570646, 575926, 582533, 590372, 598906, 607656, 615996, 623510, 630847, 639141, 648129, 656067, 662256, 668448, 676755, 687176, 698212, 708942, 719208, 728526, 736248, 742466, 747513, 750835, 751500, 749598, 746076, 741225, 734296, 724654, 712536, 698667, 683835, 668822, 654191, 640194, 627213, 615901, 606385, 597786, 589159, 580563, 572631, 565604, 559470, 554512, 550788, 547485, 543716, 539689, 536327, 534037, 532634, 532096, 532477, 533377, 534382, 535826, 538290, 541676, 545569, 550148, 555800, 562193, 568735, 575637]
58437E75637P774Q214P769P604Q711J0213J0670J0071R285Q403O976N224L764
58424F80315K598J386L78J47P30J724K766L409L174K238J340N36r16k864l677
58409F93284k337K4J808L100M834O743P723P672P476P338O509M598K064n05k726
58394G47605m125m445m246m411n055n488n156m135k874j863j375j141n58N38J642
58379G04913K302K457K008Q66k17K4J699L298L613L248L414M125M520M346M140
58364G44756M323M920N799O573O739O392O342P054Q134R207J0431J1638J1954
58351H44262J1100J0227J0537J1813J2968J3436J3253J2458J1234J0051Q975P463
58339I77777N417L701L017L013L103L349L881M320M508M996O044P001P364P660
$$ y = [575637, 583411, 591625, 599394, 606998, 615709, 625922, 636592, 646663, 655948, 664351, 671327, 676551, 680315, 682913, 684299, 684677, 684824, 685554, 687278, 690044, 693453, 696627, 698865, 700205, 700741, 699825, 696961, 693284, 690947, 690971, 692779, 695879, 700713, 707456, 715179, 722851, 730327, 737665, 744174, 748772, 750836, 750331, 747605, 743480, 739035, 734789, 730378, 725323, 719835, 714679, 710544, 707670, 705807, 704432, 703291, 702733, 703271, 704913, 707215, 709672, 711680, 712546, 712329, 712353, 714052, 717350, 720963, 724211, 727625, 731750, 736270, 740616, 744756, 749079, 753999, 759798, 766371, 773110, 779502, 785844, 792898, 801032, 810239, 820670, 832308, 844262, 855362, 865589, 876126, 887939, 900907, 914343, 927596, 940054, 951288, 961339, 970314, 977777, 983194, 986895, 989912, 992925, 996028, 999377, 1003258, 1007578, 1012086, 1017082, 1023126, 1030127, 1037491, 1045151]
58325A045151Q567R964J1484J3198J5045J6471J7303J8124J9245K0153K0542K0852
58313A236099K1334K1579K1420K1089K0246J8211J5572J3850J3124J1850R639
58302A424013Q100Q047Q119P530P818J0236J3378J5284J6173J7159J8016J8221
58290A572094J8695K0402K2499K3805K4852K6578K8312K9054K9541L1075L3351
58279A860258L5347L7212L9450M1475M2820M4552M7711N1502N4773N7789O0756
58268B373645O2210O0997N8319N5730N2734M8561M4599M2581M1898M1153M0893
58257B923320M2274M4646M7125N0958N7391O4661P0090P3917P8241Q3406Q8382
58246C624411R3396R9286J05283J10316J15350J21847J29242J36560J44776J54771
$$ y = [1045151, 1053718, 1063682, 1075166, 1088364, 1103409, 1119880, 1137183, 1155307, 1174552, 1194705, 1215247, 1236099, 1257433, 1279012, 1300432, 1321521, 1341767, 1359978, 1375550, 1389400, 1402524, 1414374, 1424013, 1432113, 1440160, 1448279, 1455809, 1463627, 1473863, 1487241, 1502525, 1518698, 1535857, 1553873, 1572094, 1590789, 1611191, 1633690, 1657495, 1682347, 1708925, 1737237, 1766291, 1795832, 1826907, 1860258, 1895605, 1932817, 1972267, 2013742, 2056562, 2101114, 2148825, 2200327, 2255100, 2312889, 2373645, 2435855, 2496852, 2555171, 2610901, 2663635, 2712196, 2756795, 2799376, 2841274, 2882427, 2923320, 2965594, 3010240, 3057365, 3108323, 3165714, 3230375, 3300465, 3374382, 3452623, 3536029, 3624411, 3717807, 3817093, 3922376, 4032692, 4148042, 4269889, 4399131, 4535691, 4680467, 4835238]
58236D835238J64934J73804J83135J95026K08199K20636K33665K49605K67602
58227F731844K85885L05888L29775L56131L82682M11145M44590M82264N22062
58218A0252266N65915O17398O76233P40764Q13715Q99762R99629J112715J243380
58209A7921777J398753J583178J801648K066040K391240K788457L269497L852710
58201C7073300M554580N378079O318264P376094Q559466R880734J1370746J3093433
58193A03604696J5131569J7552316K0369370K3470640K6490833K8723259K9221532
58186B64564215K7109339K1940999J3944035M072514o168214j5149014k1661360
58179B88652514k5264136k6220895k5164527k2807666j9833778j6856358j4339956
$$ y = [4835238, 5000172, 5173976, 5357111, 5552137, 5760336, 5980972, 6214637, 6464242, 6731844, 7017729, 7323617, 7653392, 8009523, 8392205, 8803350, 9247940, 9730204, 10252266, 10818181, 11435579, 12111812, 12852576, 13666291, 14566053, 15565682, 16678397, 17921777, 19320530, 20903708, 22705356, 24771396, 27162636, 29951093, 33220590, 37073300, 41627880, 47005959, 53324223, 60700317, 69259783, 79140517, 90511263, 103604696, 118736265, 136288581, 156657951, 180128591, 206619424, 235342683, 264564215, 291673554, 313614553, 327558588, 331631102, 325462888, 310313874, 288652514, 263388378, 237167483, 212002956, 189195290, 169361512, 152505154, 138165198]
58172A38165198j2525011j1421729j0854806j0531755j0153853r548106q720398
58165F4409540p780710o830147n921705n087511m354314l729495l199765k751042
58157B4754851k376124k063833j797314j566214j369166j203093j060522r38008
58149A2380577q37094p55479o85866o24398n72357n28708m88467m49513m14130
58140G024565l82803l52606l22647k95337k71288k48208k25680k06207j90818
58131D528971j77972j67412j60685j57319j54342j50148j45380j39953j32738
58122C143022j24250j16270j08872j00912r3104q7244q2854p7945p2645o8712
58112B210214o5959o2632n8882n6330n4590n1779m8203m5955m5049m3483m1003
$$ y = [138165198, 125640187, 114218458, 103363652, 92831897, 82678044, 73129938, 64409540, 56628830, 49798683, 43876978, 38789467, 34435153, 30705658, 27505893, 24754851, 22378727, 20314894, 18517580, 16951366, 15582200, 14379107, 13318585, 12380577, 11543483, 10788004, 10102138, 9477740, 8905383, 8376675, 7888208, 7438695, 7024565, 6641762, 6289156, 5966509, 5671172, 5399884, 5151676, 4925996, 4719789, 4528971, 4350999, 4183587, 4022902, 3865583, 3711241, 3561093, 3415713, 3275760, 3143022, 3018772, 2902502, 2793630, 2692718, 2599614, 2512370, 2429516, 2351571, 2278926, 2210214, 2144255, 2081623, 2022741, 1966411, 1911821, 1860042, 1811839, 1765884, 1720835, 1677352, 1636349]
58101A636349l9243l8090l5658l2055k9635k8985k7999k5539k2911k1098j9532
58090A315604j8228j8218j9309k0092k0774k3134k7140l0411l1736l2318l2829
58079A041415l2073k9630k7184k5964k5122k3716k2171k0748j8684j5947j3882
58068G86294j3082j2400j1111j0240j0651j1415j1238j0212r200q614q555r060
58056F60516r690r892r982j0646j1408j1117r898r028q744q041o798o173o470
58043E42629o551n963n704o179o242n141l746k938k398j848j901k719l283l051
58029D84965k998l948n102n314m787m409m374m390m433m473m169l475k795k137
58015D28161j032K27N02l52q66P8J623K288K019J873K426L465M779O300P745Q828
$$ y = [1636349, 1597106, 1559016, 1523358, 1491303, 1461668, 1432683, 1404684, 1379145, 1356234, 1335136, 1315604, 1297376, 1279158, 1259849, 1239757, 1218983, 1195849, 1168709, 1138298, 1106562, 1074244, 1041415, 1009342, 979712, 952528, 926564, 901442, 877726, 855555, 834807, 816123, 800176, 786294, 773212, 760812, 749701, 739461, 728810, 717395, 706157, 695945, 686745, 678131, 669576, 660516, 650826, 640934, 630952, 620306, 608898, 597781, 587883, 578855, 570111, 562070, 555272, 549099, 542629, 536078, 530115, 524411, 518232, 511990, 506849, 503103, 500165, 497767, 495919, 494018, 491299, 488016, 484965, 481967, 478019, 472917, 467603, 462816, 458407, 454033, 449643, 445210, 440737, 436568, 433093, 430298, 428161, 427129, 427356, 427858, 427506, 426640, 426718, 428341, 430629, 432648, 434521, 436947, 440412, 445191, 451491, 459236, 468064]
57999D68064R651J0404J1006J1271J1135J0504R355Q125P378P013O413N506N048
57986E80873N590O834Q129R040R346R142Q952R071Q885P670N920M927N032N303
57972F84714M938L945K346j35l381o822j0227j3632j6536j8217j8935j9574k0084
57959E68400j9556j7927j6138j4397j1834q389n448l832k572n44J942M071N878
57946D79654P721R332J0388J1142J1695J1442J0089Q396P185O290N162L719J979
57933E84194l46l088n309o452p058p651p805p082n997n137m112k428p27j32p32
57918E20138j690k586l793n715q208j0651j2256j2701j2663j3103j3874j3785
57906D09113j2350j0454q848p165n053l158k024j068K30J089O58l09m23K63N28
$$ y = [468064, 477715, 488119, 499125, 510396, 521531, 532035, 541390, 549515, 556893, 563906, 570319, 575825, 580873, 586463, 593297, 601426, 610466, 619812, 628954, 637906, 646977, 655862, 663532, 669452, 674379, 679411, 684714, 689652, 693597, 695943, 695808, 692427, 685605, 675378, 661746, 645210, 626993, 608058, 588484, 568400, 548844, 530917, 514779, 500382, 488548, 480159, 474711, 470879, 468307, 467763, 469705, 473776, 479654, 487375, 496707, 507095, 518237, 529932, 541374, 551463, 559859, 567044, 573334, 578496, 582215, 584194, 583848, 580760, 575451, 568999, 561941, 554290, 546485, 539403, 533406, 528269, 524157, 521729, 521002, 520870, 520138, 518448, 515862, 512069, 506354, 498146, 487495, 475239, 462538, 449875, 436772, 422898, 409113, 396763, 386309, 377461, 370296, 365243, 362085, 360061, 358993, 359223, 360312, 360970, 360661, 360238, 360501, 361029]
57891C61029l1o87j182k118l610m781n023m819m869n076m922m342l699l108k231
57876C10531q21O75J466J484J813L485O044Q102R169R977J0876J1127J0343R431
57862C93702R213R097Q148O611N275L966J966n27k611m162n822p609q688q698
57848C99861q299q107p952p455o714o060n591n144m395l013j074P33J776K264
57834C40830K878L774M433M472M024L296K277R77m15j756l037m222n180n758n782
57819C40811n192m283l569l167k636j705o94J21J027K276L347L535L000K581K733
57804C38185L258L953M907O095P210Q069Q852R905J1432J3229J4562J4634J3364
57791D57655J1450R457P324N044L111J734K23k054m573o347p400q599j0251j1771
$$ y = [361029, 360998, 360311, 359129, 357011, 353401, 348620, 343597, 338778, 333909, 328833, 323911, 319569, 315870, 312762, 310531, 309710, 310385, 311851, 313335, 315148, 318633, 324677, 332779, 341948, 351925, 362801, 373928, 384271, 393702, 402915, 412012, 420160, 426771, 432046, 436012, 437978, 437451, 434840, 430678, 424856, 417247, 408559, 399861, 391562, 383455, 375503, 368048, 361334, 355274, 349683, 344539, 340144, 337131, 336057, 336790, 338566, 340830, 343708, 347482, 351915, 356387, 360411, 363707, 365984, 366961, 366546, 364790, 361753, 357531, 352351, 346593, 340811, 335619, 331336, 327767, 324600, 321964, 320259, 319565, 319686, 320713, 322989, 326336, 329871, 332871, 335452, 338185, 341443, 345396, 350303, 356398, 363608, 371677, 380529, 390434, 401866, 415095, 429657, 444291, 457655, 469105, 478562, 485886, 490930, 494041, 495775, 495998, 493944, 489371, 483024, 475624, 467025, 456774, 445003]
57777D45003j2770j3544j4363j5075j5587j6064j6391j6025j4750j3104j1784
57766B85546j0933j0212r248p928o420n105m263l852l670l576l418k992k357j896
57752B09676j730j368m25O14R29N27K26N81J388K258L015L471L362K793K385K683
57736B30385L594M453M611L950L027K545K531K296J453N80L82N99L24o63j564
57721B58503j584p98J48P34Q83Q53R25J076J002O19K75K36K89J79J36N66J416
57704B65458K350L209L922M257M252M493N368O289O415N994O162P468R317J0870
57690C45824J1846J2377J2743J3401J4749J6770J9312K2521K6437L0413L3744
57679E60137L6770M0613M5760N1781N8450O6119P4901Q4393R4585J05876J17576
$$ y = [445003, 432233, 418689, 404326, 389251, 373664, 357600, 341209, 325184, 310434, 297330, 285546, 274613, 264401, 255153, 247225, 240805, 235700, 231437, 227585, 223915, 220339, 216921, 213929, 211572, 209676, 207946, 206578, 206153, 206767, 207696, 208223, 208449, 209030, 210418, 212676, 215691, 219162, 222524, 225317, 227702, 230385, 233979, 238432, 243043, 246993, 250020, 252565, 255096, 257392, 258845, 259425, 259807, 260406, 260730, 260067, 258503, 256919, 256121, 256269, 257003, 257886, 258739, 259664, 260740, 261742, 262361, 262636, 262872, 263161, 263340, 263476, 264042, 265458, 267808, 271017, 274939, 279196, 283448, 287941, 293309, 299598, 306013, 312007, 318169, 325637, 334954, 345824, 357670, 370047, 382790, 396191, 410940, 427710, 447022, 469543, 495980, 526393, 560137, 596907, 637520, 683280, 735061, 793511, 859630, 934531, 1018924, 1113509, 1219385, 1336961]
57668A336961J27037J30965J27073J14383R3189O5825L6767J0442j1267k8895
57658B002480m3140n3750o0661o5105o8810p2462p5396p6693p6155p4279p1612
57647A264417o8446o4838o0744n6062n0837m5543m0844l6939l3353k9622k5906
57636G51283k2637j9826j7156j4549j2172r911p428m758k395o12Q96K552M437
57623F47724O399Q289J0011J1625J3512J6124J9461K3043K6486K9856L3365L7001
57611H82896M0516M3674M6462M9157N1999N4693N6420N6535N4996N1849M6754
57600A435951L9473L0379J9936Q126m817j7516k8331l7094m4862n1962n7361o0302
57588A231620o1374o1499o0760n8971n6521n3883n0812m6888m2473l8474l5307
$$ y = [1336961, 1463998, 1594963, 1722036, 1836419, 1929608, 1995433, 2032200, 2042642, 2031375, 2002480, 1959340, 1905590, 1844929, 1779824, 1711014, 1638552, 1563156, 1486463, 1410308, 1336029, 1264417, 1195971, 1131133, 1070389, 1014327, 963490, 917947, 877103, 840164, 806811, 777189, 751283, 728646, 708820, 691664, 677115, 664943, 655032, 647604, 642846, 640451, 639839, 640735, 643287, 647724, 654123, 662412, 672423, 684048, 697560, 713684, 733145, 756188, 782674, 812530, 845895, 882896, 923412, 967086, 1013548, 1062705, 1114704, 1169397, 1225817, 1282352, 1337348, 1389197, 1435951, 1475424, 1505803, 1525739, 1533865, 1529048, 1511532, 1483201, 1446107, 1401245, 1349283, 1291922, 1231620, 1170246, 1108747, 1047987, 989016, 932495, 878612, 827800, 780912, 738439, 699965, 664658]
57577F64658l2740l0420k8081k5451k2530j9846j7945j6775j5917j5200j4610
57566D25143j3822j2351j0243q158o696n869n297m667l979l453l158k799k023
57553C42628r85k88k08k84M1O83J115J132J089J367J968K656L303L976M692N240
57537C68125N385N266N383O002O812P426P977Q828R946J1043J2178J3609J5210
57524D83190J6689J8300K0602K3365K5703K7455K9582L2708L6108L8756M0673
57513G93131M2509M4319M5601M6079M5674M3901M0088L4216K6996J9155J1061
57502A192730K826n658j4605k3645l1520l7064m0446m2837m4867m6025m5678m4042
57490H19169m1843l9430l6631l3313k9785k6575k3888k1406j8786j6239j4338
$$ y = [664658, 631918, 601498, 573417, 547966, 525436, 505590, 487645, 470870, 454953, 439753, 425143, 411321, 398970, 388727, 380569, 373873, 368004, 362707, 358040, 354061, 350608, 347450, 344651, 342628, 341643, 341355, 341147, 340863, 340904, 341587, 342702, 343834, 344923, 346290, 348258, 350914, 354217, 358193, 362885, 368125, 373510, 378776, 384159, 390161, 396973, 404399, 412376, 421204, 431150, 442193, 454371, 467980, 483190, 499879, 518179, 538781, 562146, 587849, 615304, 644886, 677594, 713702, 752458, 793131, 835640, 879959, 925560, 971639, 1017313, 1061214, 1101302, 1135518, 1162514, 1181669, 1192730, 1195556, 1189898, 1175293, 1151648, 1120128, 1083064, 1042618, 999781, 954914, 908889, 863211, 819169, 777326, 737896, 701265, 667952, 638167, 611592, 587704, 566298, 547512, 531273, 516935]
57479E16935j3139j1921j0030p629n291l255j495j52P27J625L080M815O025O612
57465D86907P502R477J2220J4822J6899J8835K1129K3867K6734K9333L1473L3326
57453G32524L5233L7269L8984L9753L9434L8501L7289L5238L1214K4790J6774
57442A107003Q167r59j0890k0843k9090l4734l8618m1973m4833m6381m6395m5540
57430G54914m4414m2961m0888l8166l5093l2152k9767k7916k6071k3846k1541
57419C92099j9698j8328j6944j5274j3475j1724j0114q928q501q606q398p317
57407B44792n815m861m833n171n166m811m636m778m696m017l208k978l171l046
57393A83605k452k021k052k066j745j511j631j565q73n1L14N69J226J738J186
$$ y = [516935, 503796, 491875, 481845, 474216, 468925, 465670, 464175, 464023, 464750, 466375, 469455, 474270, 480295, 486907, 494409, 503886, 516106, 530928, 547827, 566662, 587791, 611658, 638392, 667725, 699198, 732524, 767757, 805026, 844010, 883763, 923197, 961698, 998987, 1034225, 1065439, 1090229, 1107003, 1115170, 1114211, 1103321, 1082478, 1053388, 1018654, 980036, 938063, 893230, 846849, 800454, 754914, 710500, 667539, 626651, 588485, 553392, 521240, 491473, 463557, 437486, 413640, 392099, 372401, 354073, 337129, 321855, 308380, 296656, 286542, 277614, 269113, 260507, 252109, 244792, 238977, 234116, 229283, 224112, 218946, 214135, 209499, 204721, 200025, 196008, 192800, 189822, 186651, 183605, 181153, 179132, 177080, 175014, 173269, 171758, 170127, 168562, 167689, 167638, 167952, 168521, 169747, 171485, 172671]
57378A72671j10q72o96m33o40p82l63J73K06j34l97n57q13j023q74l64K33N89
57360A65814L87m74j499j893j442p37l44j92n6l8k47m07k67rJ24L25Q69J571J973
57341A63458J876J368O38O7J60R35J654J646J171R32J013R03N05L67Q07J400J598
57324A80498J407J113P80L71J61N69J558K499K705K069J168P48J085J785K280
57309B00796K489K783L352L860M008M080M575N365N726N279M538M217M431M841
57295B60340N370O207P315Q382R321J0292J1160J1404J0836R966R360Q962Q377
57282C77292P560O750N900M591K566O8k374m377n988p632r571j1422j2451j2527
57268C38385j2324j2370j2367j1898j1254j0960j0788j0059q733p429o347n069
$$ y = [172671, 172561, 171689, 170993, 170560, 169920, 169138, 168775, 168948, 169154, 169020, 168623, 168066, 167253, 166230, 165356, 164992, 165225, 165814, 166201, 165727, 164228, 162335, 160893, 160156, 159812, 159620, 159564, 159526, 159279, 158872, 158605, 158596, 158720, 159045, 159914, 161485, 163458, 165334, 166702, 167340, 167407, 167567, 168502, 170156, 171802, 172973, 173905, 174918, 175821, 176326, 176693, 177500, 178900, 180498, 181905, 183018, 183798, 184169, 184330, 184899, 186457, 188956, 191661, 193730, 194898, 195646, 196731, 198516, 200796, 203285, 206068, 209420, 213280, 217288, 221368, 225943, 231308, 237034, 242313, 246851, 251068, 255499, 260340, 265710, 271917, 279232, 287614, 296935, 307227, 318387, 329791, 340627, 350593, 359953, 368915, 377292, 384852, 391602, 397502, 402093, 404659, 404727, 402353, 397976, 391988, 384356, 374785, 363363, 350912, 338385, 326061, 313691, 301324, 289426, 278172, 267212, 256424, 246365, 237632, 230203, 223856, 218787]
57256B18787l507k266j793j825j994k294k585k385j648j155j440j805j194K74
57242A93170J411J582J412J698K345K711K562K193J867J622J542J854K546L171
57228B21686L269K905K550K484K540K506K534K858L392L818M009M074M068L971
57214B66664L886M001M320M707N151N704O232O528O743P268Q060Q538Q300P635
57200C53737P105O942P057P314P529P458P091O808O960P454P963Q390Q829R235
57186D59872R442R436R401R519R866J0400J0834J0712R941R179R365J0732J2430
57173E91129J3311J3051J2451J2644J3942J5534J6360J6225J5852J5952J6524
57162G52975J7178J7760J8390J9118J9840K0486K0959K1023K0529J9739J9205
$$ y = [218787, 215280, 213014, 211221, 209396, 207402, 205108, 202523, 200138, 198490, 197335, 195895, 194090, 192896, 193170, 194581, 196163, 197575, 199273, 201618, 204329, 206891, 209084, 210951, 212573, 214115, 215969, 218515, 221686, 224955, 227860, 230410, 232894, 235434, 237940, 240474, 243332, 246724, 250542, 254551, 258625, 262693, 266664, 270550, 274551, 278871, 283578, 288729, 294433, 300665, 307193, 313936, 321204, 329264, 337802, 346102, 353737, 360842, 367784, 374841, 382155, 389684, 397142, 404233, 411041, 418001, 425455, 433418, 441808, 450637, 459872, 469314, 478750, 488151, 497670, 507536, 517936, 528770, 539482, 549423, 558602, 567967, 578699, 591129, 604440, 617491, 629942, 642586, 656528, 672062, 688422, 704647, 720499, 736451, 752975, 770153, 787913, 806303, 825421, 845261, 865747, 886706, 907729, 928258, 947997, 967202]
57151I67202J9260J9773K0414K0967K1376K1709K2128K2787K3687K4698K5682
57140A209683K6494K6916K6826K6471K6425K7090K8333K9708L0978L2270L3694
57129A524888L5070L6151L7090L8472M0780M3987M7672N1451N5219N9126O3626
57118B033532O9517P7703Q8734J02550J18656J36392J54997J73500J90746K05819
57108C352146K18802K31364K46541K67769K97958L39335L93791M63055N48599
57099F359360O51675P73378R14268J073727J249805J439955J641767J852794K069721
57090A8026450K287746K499927K695215K855586K956305K972725K890223K707829
57082C9892006K431073K062314J601471J058144M61375j45306p19742j233627
$$ y = [967202, 986462, 1006235, 1026649, 1047616, 1068992, 1090701, 1112829, 1135616, 1159303, 1184001, 1209683, 1236177, 1263093, 1289919, 1316390, 1342815, 1369905, 1398238, 1427946, 1458924, 1491194, 1524888, 1559958, 1596109, 1633199, 1671671, 1712451, 1756438, 1804110, 1855561, 1910780, 1969906, 2033532, 2103049, 2180752, 2269486, 2372036, 2490692, 2627084, 2782081, 2955581, 3146327, 3352146, 3570948, 3802312, 4048853, 4316622, 4614580, 4953915, 5347706, 5810761, 6359360, 7011035, 7784413, 8698681, 9772408, 11022213, 12462168, 14103935, 15956729, 18026450, 20314196, 22814123, 25509338, 28364924, 31321229, 34293954, 37184177, 39892006, 42323079, 44385393, 45986864, 47045008, 47506383, 47361077, 46641335, 45407708]
57074D5407708j673669k035724k319417k525703k656149k713369k702327k631347
57066B6150003k511627k355800k176411j984673j789830j599374j419375j253909
57058A1059004j104375r70283q51038p46501o56063n78266n11758m55655m08509
57049D776556l67819l31337k98329k68916k42715k18805j96678j76425j58189
57040B517343j41906j27457j14647j03216r3111q4454p6986o9976o2951n6131
57030A586508m9732m3381l6558k9159k1210j2533l062P095J8460L2314M9161O7237
57018A565140Q2792R1072Q6843O5878K8507j7994o2234r5024j13276j18889j15620
57007A397195j07223r6717q5839p5181o5114n6242m8815m2387l6480l1213k6931
$$ y = [45407708, 43734039, 41698315, 39378898, 36853195, 34197046, 31483677, 28781350, 26150003, 23638376, 21282576, 19106165, 17121492, 15331662, 13732288, 12312913, 11059004, 9954629, 8984346, 8133308, 7386807, 6730744, 6152478, 5640720, 5185065, 4776556, 4408737, 4077400, 3779071, 3510155, 3267440, 3048635, 2851957, 2675532, 2517343, 2375437, 2247980, 2133333, 2030117, 1937006, 1852552, 1775566, 1705590, 1642639, 1586508, 1536776, 1493395, 1456837, 1427678, 1406468, 1393935, 1390873, 1397968, 1416428, 1448742, 1497903, 1565140, 1647932, 1739004, 1825847, 1891725, 1920232, 1902238, 1840004, 1744980, 1631704, 1512815, 1397195, 1289972, 1193255, 1107416, 1032235, 967121, 910879, 862064, 819677, 783197, 751984, 725053]
56996G25053k3624k1036j8992j7304j5695j4031j2452j1053r654p957n830l405
56984E64020j230k17j069l588o846j0024j2819j5074j6470j6707j5725j3769j1436
56971D39046r500q220o909m693j666J252L523N441P318Q960J0274J1750J3787
56958D70363J5867J6854J5927J2995Q411K719l359q924j3087j5371j6007j5689
56946D70699j4915j3692j2005j0133q185n753k645M41K716M537O983J0282J3597
56933D41927J6293J8415J9637J8817J5134R043J698n881j2730j7896k1107k2945
56921D60405k3865k3555k1796j9260j6869j4839j2960j1326j0115r091q010p081
56909B81638o444n664m420l295k961k976k292q42L74P22N37L26K54N97J808L786
$$ y = [725053, 701429, 680393, 661401, 644097, 628402, 614371, 601919, 590866, 581212, 573255, 567425, 564020, 562790, 562573, 561504, 557916, 551070, 541046, 528227, 513153, 496683, 479976, 464251, 450482, 439046, 429546, 421326, 414417, 409724, 408058, 409310, 412833, 418274, 425592, 434552, 444826, 456576, 470363, 486230, 503084, 519011, 532006, 540417, 543136, 539777, 530853, 517766, 502395, 486388, 470699, 455784, 442092, 430087, 419954, 411769, 406016, 403371, 403812, 406528, 411065, 418048, 428330, 441927, 458220, 476635, 496272, 515089, 530223, 539266, 540964, 535083, 522353, 504457, 483350, 460405, 436540, 412985, 391189, 371929, 355060, 340221, 327261, 315935, 305820, 296729, 288719, 281638, 275194, 269530, 265110, 261815, 258854, 255878, 253586, 252744, 253118, 253840, 254377, 254703, 254957, 255554, 257362, 261148]
56893B61148N778P361Q920J0769J2433J3260J3282J2925J2198J0684Q150M777
56881C81685Q76l144o623q851r607r265q322o947n040k609J08K875N714Q796J2066
56866C51712J5146J7753K0116K2831K6254L0052L3100L3778L0726K3774J4265
56855F19507M176n134j3175j9563k3565k4676k3330k0589j7135j2940p929k640
56843D53007K165O451J1076J6793K3363K9988L6377M2825M9050N3505N4152M9696
56831H28448L9899K5309P395j1233k7620l9845m7381n0320m8981m4443l8603l2879
56819E59746k7192k0843j4037p799k450K867Q917J5413K1745K7970L4172L9240
56807F37749M1140L8445L1071J9701N417r883k3614l3766l9787m2141m1523l8909
$$ y = [261148, 266926, 274287, 283207, 293976, 306409, 319669, 332951, 345876, 358074, 368758, 376908, 381685, 382561, 379417, 372794, 363943, 354336, 345071, 336749, 329802, 324762, 322153, 322261, 325136, 330850, 339646, 351712, 366858, 384611, 404727, 427558, 453812, 483864, 516964, 550742, 581468, 605242, 619507, 623683, 618549, 605374, 585811, 562246, 537570, 514240, 493651, 476516, 463576, 455647, 453007, 455172, 461623, 472699, 489492, 512855, 542843, 579220, 622045, 671095, 724600, 778752, 828448, 868347, 893656, 901051, 889818, 862198, 822353, 774972, 724652, 675671, 631228, 592625, 559746, 532554, 511711, 497674, 489875, 487425, 490292, 499209, 514622, 536367, 564337, 598509, 637749, 678889, 717334, 748405, 768106, 773523, 763640, 740026, 706260, 666473, 624332, 582809, 543900]
56795E43900l5469l1750k7308k1821j6123j1302p233l032J293M867P681J0957
56783D14660J5230J9092K0619J9284J5749J0438L335m997j3135j9625k3716k5359
56771D31575k5074k3761k2157k0403j8313j6036j4049j2572j1310r827q013o206
56759B43854n015m806n221n334m585l383k574k489k779k993k968k662k051j223
56745A95771m72j06k29o05p89n81k79k46k39L03J295J843J397N08R8M05J081J805
56727B00960K307K186J367M83J32J13p8l12j65J45j8o01r29q22p50p92m36K99
56709B03089N26k21j170j422j148j047j157j021o95o35q00o35n9K67j15q00j133
56692A91824j030q09n41m1N44O99K17m14n64j81L04O29Q60R82Q13M43K88M93O63
$$ y = [543900, 508431, 476681, 449373, 427552, 411429, 400127, 392894, 389862, 391155, 396022, 403703, 414660, 429890, 448982, 469601, 488885, 504634, 515072, 518407, 513410, 500275, 480650, 456934, 431575, 406501, 382740, 360583, 340180, 321867, 305831, 291782, 279210, 267900, 258073, 250060, 243854, 238839, 234033, 228812, 223478, 218893, 215510, 212936, 210447, 207668, 204675, 201707, 199045, 196994, 195771, 195299, 195193, 194964, 194359, 193570, 192989, 192710, 192464, 192225, 192528, 193823, 195666, 197063, 197571, 197669, 198074, 199155, 200960, 203267, 205453, 206820, 207303, 207435, 207548, 207470, 207158, 206993, 207138, 207120, 206519, 205590, 204768, 204018, 203226, 202790, 203089, 203615, 203394, 202224, 200802, 199654, 198607, 197450, 196429, 195734, 195099, 194299, 193664, 193605, 193872, 193757, 192957, 191824, 190794, 189985, 189444, 189403, 189947, 190646, 190863, 190449, 189885, 189704, 190008, 190637, 191497, 192479, 193292, 193735, 194023, 194516, 195179]
56673A95179N61N69J019J403J010J19j59O25J652J949J518J011P60N68K30j80
56657B07834l72k2R29J931K087J112k19r47j018j100j463j644j314q63q27j147
56641B02957j409j532j662j552p55M44R51J74j084j661j521j488j770j677r57
56626A87458l91o01j058r28l09Q5P7N7J08n6l52l09J67N37L52k79r65j377j259
56607A80957n81J90M51J46j96k41j72j94j65N4K63J75k01n59n25Q0R91J575J444
56588A83492R97R54J421J790J600J038N97N74R89J603J988J966J986K602L632
56573B07229M253M062L512L188L181L270L329L348L459M036N289O750P624P687
56559B70217P339O812N989N149N024N779O622O808O366N509M068K110L85n47j187
$$ y = [195179, 195740, 196309, 197328, 198731, 199741, 199860, 199701, 200326, 201978, 203927, 205445, 206456, 207216, 207784, 208014, 207834, 207462, 207440, 208369, 210300, 212387, 213499, 213280, 212333, 211315, 210215, 208752, 207108, 205794, 204931, 204104, 202957, 201548, 200016, 198354, 196802, 196047, 196491, 197442, 197616, 196532, 194871, 193350, 191862, 190092, 188415, 187458, 187067, 186466, 185408, 184480, 184171, 184256, 184333, 184390, 184498, 184442, 184090, 183781, 183948, 184485, 184837, 184558, 183593, 182216, 180957, 180376, 180566, 181017, 181163, 180967, 180726, 180554, 180360, 180195, 180249, 180512, 180687, 180486, 179927, 179402, 179482, 180473, 182048, 183492, 184489, 185443, 186864, 188654, 190254, 191292, 191889, 192463, 193452, 195055, 197043, 199009, 200995, 203597, 207229, 211482, 215544, 219056, 222244, 225425, 228695, 232024, 235372, 238831, 242867, 248156, 254906, 262530, 270217, 277556, 284368, 290357, 295506, 300530, 306309, 312931, 319739, 326105, 331614, 335682, 337792, 338177, 337630, 336443]
56544C36443k382m099n572o387o729o806o652o498o712p362q122q620q570p833
56530B44099o598n393m643m335m281m299m072l227j985j173j191j416j157p20
56516A99609q71j578k018j647p04J99N25pj082j789j452m28L42L55j70p69r88
56499A87527n57K09M89nn15l34Q0j14o65o30J12P88J059J251J277N96n24q72L3
56480A89205J160J370P63R8k78k99K48J294K174K430K414K538K499J916J226J103
56464B09861J368J285P13J74n2j74k59j27N7k28j050j788j849j274m50L14Q58
56447B07379J106J163J201J215J105R79J031J084P38L1m84n17m65p64j213j345
56431B12244j192j146j272j244r90q86j166j488j388r03n12n01o48n27pN76P13
$$ y = [336443, 334061, 329962, 324390, 318003, 311274, 304468, 297816, 291318, 284606, 277244, 269122, 260502, 251932, 244099, 237501, 232108, 227465, 223130, 218849, 214550, 210478, 207251, 205266, 204093, 202902, 201486, 200329, 199609, 198738, 197160, 195142, 193495, 192791, 192990, 193515, 193508, 192426, 190637, 189185, 188757, 189099, 189454, 189284, 188515, 187527, 186970, 187179, 187668, 187663, 187148, 186814, 186894, 186780, 186115, 185485, 185597, 186385, 187444, 188695, 189972, 190568, 190044, 189172, 189205, 190365, 191735, 192498, 192596, 192318, 192019, 192267, 193561, 195735, 198165, 200579, 203117, 205616, 207532, 208758, 209861, 211229, 212514, 213227, 213401, 213349, 213175, 212916, 212789, 212846, 212618, 211568, 209780, 207931, 206657, 206207, 206521, 207379, 208485, 209648, 210849, 212064, 213169, 214148, 215179, 216263, 217001, 217032, 216548, 216031, 215566, 214802, 213589, 212244, 211052, 209906, 208634, 207390, 206400, 205514, 204348, 202860, 201472, 200569, 200057, 199556, 198908, 198381, 198374, 198950, 199663]
56414A99663K57l22l70K54J021J355J203Q59N36L54M96R87J437J442J174J131
56398B11477J329J292R59R36J562K209K032J102K39n9N2K78N34O35L00l83q90
56381B23604q86o33n10m57k27J4j85q21j251r41j62L73M77O72J368K185K386J788
56363B26794Q87K52Q8L28P73J078R79O64O04R49J335J429J302J177J155J285J549
56346B42628J639J152K95j01M11J275J747J850K026K199J903J176O22N45N93L74
56330B60334Lj07L02J171K054K274J535M34l8L93J043J316J430J834K231J835
56314B78044O02l47N1J376K056J255p2m14L48R38M91m07p22k78L33O75P07N23
56296B85159K98K98N27P03P67J092J733K020J420M00j63p4K70O66J087J215Q52
$$ y = [199663, 199920, 199598, 199228, 199482, 200503, 201858, 203061, 203920, 204456, 204810, 205306, 206293, 207730, 209172, 210346, 211477, 212806, 214098, 215057, 215993, 217555, 219764, 221796, 222898, 223137, 223078, 223130, 223408, 223942, 224577, 224877, 224494, 223604, 222718, 222085, 221575, 221118, 220891, 220905, 220720, 219899, 218648, 217707, 217545, 217918, 218395, 219067, 220435, 222620, 225006, 226794, 227681, 227933, 228021, 228349, 229122, 230200, 231179, 231843, 232447, 233396, 234731, 236160, 237462, 238639, 239794, 241079, 242628, 244267, 245419, 245714, 245613, 246024, 247299, 249046, 250896, 252922, 255121, 257024, 258200, 258822, 259367, 259960, 260334, 260337, 260230, 260532, 261703, 263757, 266031, 267566, 268000, 267962, 268355, 269398, 270714, 272144, 273978, 276209, 278044, 278646, 278299, 278350, 279726, 281782, 283037, 282965, 282551, 282899, 283837, 284328, 283921, 283199, 282921, 283254, 283929, 284636, 285159, 285457, 285755, 286282, 286985, 287752, 288844, 290577, 292597, 294017, 294417, 294254, 294180, 294450, 295116, 296203, 297418, 298270]
56279B98270N52J027J937K236J649J008J003J433J881K342K803K895K422J764
56265C23222J425J509J894K486L077L290K962K358J867J692J905K477L197L804
56251C57165M217M433M338L940L570L515L557L352L067L108L404L568L603L794
56237D08631L996L717K895J990J317R27R95J557J986J622Q48O50J037J038L51
56222D33557j62j2J04l63p89m86P3R1j24L82J694K915L333K989K246J497J242
56205D48187J750K571K873K304J339O92P09J273K087K888L434L434K832K221K481
56190D81075L626M440L909K700K383L314M309M405L981L877M306M989N687O210
56176E39211O556P125Q197R106Q850P719P263Q327J0081J1518J2794J4420J6055
$$ y = [298270, 298822, 299849, 301786, 304022, 305671, 306679, 307682, 309115, 310996, 313338, 316141, 319036, 321458, 323222, 324647, 326156, 328050, 330536, 333613, 336903, 339865, 342223, 344090, 345782, 347687, 350164, 353361, 357165, 361382, 365815, 370153, 374093, 377663, 381178, 384735, 388087, 391154, 394262, 397666, 401234, 404837, 408631, 412627, 416344, 419239, 421229, 422546, 423473, 424468, 426025, 428011, 429633, 430481, 431131, 432168, 433206, 433557, 433395, 433383, 433487, 433124, 432335, 431849, 431922, 432013, 431889, 432271, 433965, 436880, 440213, 443202, 445448, 446945, 448187, 449937, 452508, 455381, 457685, 459024, 459716, 460425, 461698, 463785, 466673, 470107, 473541, 476373, 478594, 481075, 484701, 489141, 493050, 495750, 498133, 501447, 505756, 510161, 514142, 518019, 522325, 527314, 533001, 539211, 545767, 552892, 561089, 570195, 579045, 586764, 594027, 602354, 612435, 623953, 636747, 651167, 667222]
56163F67222J7051J7560J8274J9489K1109K3165K5719K8658L2084L6504M2211
56152I49046M8910N6293O4450P3557Q3834R6171J11879J31347J53444J76525J99038
56141B144494K18764K32561K37724K33097K18717J95747J67629J39922J17448
56132C906103J01597R0692Q1858P1761N7154L6826J2978j0393l0321m5727n6811
56121D215717o5254p4574q8613j09192j35445j64659j92724k14674k26667k27979
56111B715936k20460k06368j87542j66018j44015j23088j04029q7434p3515o1639
56101A341828n0948m1438l3627k7503k2531j8472j5357j2778j0106p279m722k671
56089A094396j094pP29J625K992M551N972P252Q100P801O362N007M671M803M474
$$ y = [667222, 684273, 701833, 720107, 739596, 760705, 783870, 809589, 838247, 870331, 906835, 949046, 997956, 1054249, 1118699, 1192256, 1276090, 1372261, 1484140, 1615487, 1768931, 1945456, 2144494, 2363258, 2595819, 2833543, 3066640, 3285357, 3481104, 3648733, 3788655, 3906103, 4007700, 4098392, 4180250, 4252011, 4309165, 4345991, 4358969, 4348576, 4318255, 4272528, 4215717, 4150463, 4075889, 3987276, 3878084, 3742639, 3577980, 3385256, 3170582, 2943915, 2715936, 2495476, 2289108, 2101566, 1935548, 1791533, 1668445, 1564416, 1476982, 1403467, 1341828, 1290880, 1249442, 1215815, 1188312, 1165781, 1147309, 1131952, 1119174, 1109068, 1101789, 1097067, 1094396, 1093302, 1093295, 1094024, 1095649, 1098641, 1103192, 1109164, 1116416, 1124516, 1132317, 1138679, 1143686, 1148357, 1153160, 1157634]
56074A157634L886L772M145M606N250O204P025P556Q575J0590J2800J4272J5211
56061A261526J5980J6068J5331J5135J6559J8504J9215J8852J8772J9183J9368
56050A454493J9496K0248K1263K1769K2167K3132K3942K3677K3303K4364K6234
56039A704088K7027K6732K6993K8113K8854K9106L0183L2363L4503L6252L8338
56028B042552M0607M2097M3207M5459M8826N1604N3281N5175N7944O0683O2980
56017B604415O5553O8370P0431P1909P4381P8318Q2444Q6010Q9713R3902R7907
56006C483353J01611J05736J10281J14590J19074J24867J31741J38523J45440
55997D575216J53681J62859J71545J80170J90634K03058K15844K28881K43725
$$ y = [1157634, 1161520, 1165292, 1169437, 1174043, 1179293, 1185497, 1192522, 1200078, 1208653, 1219243, 1232043, 1246315, 1261526, 1277506, 1293574, 1308905, 1324040, 1340599, 1359103, 1378318, 1397170, 1415942, 1435125, 1454493, 1473989, 1494237, 1515500, 1537269, 1559436, 1582568, 1606510, 1630187, 1653490, 1677854, 1704088, 1731115, 1757847, 1784840, 1812953, 1841807, 1870913, 1901096, 1933459, 1967962, 2004214, 2042552, 2083159, 2125256, 2168463, 2213922, 2262748, 2314352, 2367633, 2422808, 2480752, 2541435, 2604415, 2669968, 2738338, 2808769, 2880678, 2955059, 3033377, 3115821, 3201831, 3291544, 3385446, 3483353, 3584964, 3690700, 3800981, 3915571, 4034645, 4159512, 4291253, 4429776, 4575216, 4728897, 4891756, 5063301, 5243471, 5434105, 5637163, 5853007, 6081888, 6325613]
55988F325613K60623K78448K97492L19256L43575L69323L97528M30193M66601
55979I488652N04969N47147N97009O54672P17517P86813Q67602R61979J068808
55970A6195168J190765J335340J508098J711975J954803K250914K614246L057100
55962C1818409L596180M250198N028314N928913O951768Q103424R392615J0837577
55954H5907398J2485689J4414780J6706914J9416074K2518030K5797056K8703248
55947B25949189L0334116K9658503K5906023J8917896R311704j588996j2080323
55940C26408112k0607670k6270190k8997757k9320092k7968295k5605266k2753516
55933A44885326j9800409j6996600j4467870j2258520j0371706q783921p454426
$$ y = [6325613, 6586236, 6864684, 7162176, 7481432, 7825007, 8194330, 8591858, 9022051, 9488652, 9993621, 10540768, 11137777, 11792449, 12509966, 13296779, 14164381, 15126360, 16195168, 17385933, 18721273, 20229371, 21941346, 23896149, 26147063, 28761309, 31818409, 35414589, 39664787, 44693101, 50622014, 57573782, 65677206, 75069821, 85907398, 98393087, 112807867, 129514781, 148930855, 171448885, 197245941, 225949189, 256283305, 285941808, 311847831, 330765727, 340077431, 338488435, 326408112, 305800442, 279530252, 250532495, 221212403, 193244108, 167638842, 144885326, 125084917, 108088317, 93620447, 81361927, 70990221, 62206300, 54751874]
55926E4751874o342995n418486m651524m011036l472600l021501k643898k322784
55918B2867050k045311j806288j601078j421698j262653j123814j004259q98950
55910A1702999q04383p21904o52269n91832n37131m88747m47613m11532l78246
55901F669342l48435l22986l00375k79107k59808k42894k26974k11374j97454
55892D279935j85665j74112j61729j50190j40943j32916j24854j17345j10825
55883B981356j04033r6172q8451q1789p5124o7580o0261n4421m9877m6694m6365
55872B210589m9613n4707n9392o2914o4912o4382o1292n7575n4891n2769n0241
55861A577901m7758m6057m4582m2521m0278l8596l7349l6266l5654l5344l4216
$$ y = [54751874, 48408879, 42990393, 38338869, 34327833, 30855233, 27833732, 25189834, 22867050, 20821739, 19015451, 17414373, 15992675, 14730022, 13606208, 12601949, 11702999, 10898616, 10176712, 9524443, 8932611, 8395480, 7906733, 7459120, 7047588, 6669342, 6320907, 5997921, 5697546, 5418439, 5158631, 4915737, 4688763, 4477389, 4279935, 4094270, 3920158, 3758429, 3608239, 3467296, 3334380, 3209526, 3092181, 2981356, 2877323, 2781151, 2692700, 2610911, 2535787, 2468207, 2407946, 2353525, 2303648, 2256954, 2210589, 2160976, 2106269, 2046877, 1983963, 1919051, 1854669, 1793377, 1735802, 1680911, 1628142, 1577901, 1530143, 1484086, 1439504, 1396983, 1356705, 1318109, 1280760, 1244494, 1208840, 1173496, 1139280]
55850A139280l1828k9344k7810k6774k5574k4618k4327k4039k3131k1990k0879
55839H58966j9094j6404j4012j2884j2240j0957r297q001o781n077l396k426j622
55826G36775k3K071L532L934L541K404N93j186k396l711o149r448j2280j3957
55812G03700j5060j6437j8152j9502j9664j8493j6753j5296j4086j2602j0961
55801E26694r711q596o760m398k899k859l225l006k498k111j203Q93L729O485
55787D90535Q867J0396R863O616J641l566q324j2184j4162j3768j2016j0148q003
55774D45747m792q39K601M676M981K892j672p141j1239j3119j3657j3843j3761
55761C80834j3121j1874j0280q864q206q286q438q376q644r493j0046r503q528
$$ y = [1139280, 1107452, 1078108, 1050298, 1023524, 997950, 973332, 949005, 924966, 901835, 879845, 858966, 839872, 823468, 809456, 796572, 784332, 773375, 764078, 756077, 749296, 744219, 740823, 738397, 736775, 736752, 738823, 742355, 746289, 749830, 752234, 752827, 751641, 749245, 745534, 739385, 729937, 717657, 703700, 688640, 672203, 654051, 634549, 614885, 596392, 579639, 564343, 550257, 537655, 526694, 516983, 508387, 501627, 497229, 494330, 491471, 488246, 485240, 482742, 480631, 479428, 480321, 484050, 490535, 499402, 509798, 519661, 526277, 527918, 524352, 516028, 503844, 489682, 475914, 463898, 453750, 445747, 440955, 440116, 442717, 447393, 452374, 455266, 453594, 446453, 435214, 422095, 408438, 394595, 380834, 367713, 355839, 345559, 336695, 328489, 320203, 311765, 303389, 294745, 285252, 275206, 265703, 257175]
55748B57175q304q662q351o973n509m862m858m799m312l502k763k499k589k307
55734A86885j248J9O76O96N28J73o21j572k094k184k323k589k617k396k355k620
55718A66358k782k503j902j241o22k6N67J109J380J224R62J112J496J207j57j755
55702A64427k555k566k497k649k800k820k741k476j994j486r91k58O35J150J187
55687A41566J436K247K923K896K859L695M980N617N446N126M834M305L820L959
55673A95709M432M315L417K346J342J22j175k030k634l761n366o367o127n246
55659A78977m481l812l011k291j922j718j352p47Q2J093K021K556K756K829K564
55644A73544J717Q09P32J450J959J709J186Q46M01m24j260j775k317l223m095
$$ y = [257175, 248871, 240209, 231858, 224885, 219376, 214514, 209656, 204857, 200545, 197043, 194280, 191781, 189192, 186885, 185637, 185656, 186332, 187028, 187556, 187729, 187108, 185536, 183442, 181258, 178935, 176346, 173729, 171333, 168978, 166358, 163576, 161073, 159171, 157930, 157308, 157282, 157849, 158958, 160338, 161562, 162524, 163636, 165132, 166339, 166182, 164427, 161872, 159306, 156809, 154160, 151360, 148540, 145799, 143323, 141329, 139843, 138852, 138594, 139229, 140379, 141566, 143002, 145249, 148172, 151068, 153927, 157622, 162602, 168219, 173665, 178791, 183625, 187930, 191750, 195709, 200141, 204456, 207873, 210219, 211561, 211683, 210508, 208478, 205844, 202083, 196717, 190350, 184223, 178977, 174496, 170684, 167673, 165382, 163460, 161742, 160390, 159643, 159725, 160818, 162839, 165395, 168151, 170980, 173544, 175261, 176070, 176802, 178252, 180211, 181920, 183106, 183952, 184353, 183929, 182669, 180894, 178577, 175354, 171259]
55629A71259m351m096l858l795l654l282k694j860q60j36k14j119k282k997l000
55614A33061k673k698l270l773l559k922k806l505m224m151l432k821k691k839
55600H7697k962k957k804k436j845j171o96o60j026j514j897k138k094j483m25
55585F1589K85p9j275k286k429j886j258r60r57q41k82M53O88L24J42O26J091
55568E2945O50l17o40m7O21P49N74L81J1n43r04r29r10r26o47j8N13O79P01P50
55548E2693O88N50O27Q88R39O60K39m02j447k331k124j044n19j207j993j641n68
55531D4008o0m78j132j442j258m35J031K584L494L611L203K426J426O30L34L02
55515E8244K89O19J545K474K643K289K340K941L202K518J449R80J335J861J836
$$ y = [171259, 166908, 162812, 158954, 155159, 151505, 148223, 145529, 143669, 142809, 142673, 142459, 141340, 139058, 136061, 133061, 130388, 127690, 124420, 120647, 117088, 114166, 111360, 107855, 103631, 99480, 96048, 93227, 90536, 87697, 84735, 81778, 78974, 76538, 74693, 73522, 72826, 72166, 71140, 69626, 67729, 65591, 63497, 62014, 61589, 61874, 61795, 60520, 58234, 55805, 53919, 52661, 51701, 50744, 49903, 49621, 50074, 50762, 51086, 51228, 51854, 52945, 53595, 53278, 52638, 52591, 53212, 53961, 54535, 54916, 54927, 54384, 53480, 52551, 51641, 50715, 50068, 50050, 50563, 51242, 51943, 52693, 53381, 53931, 54558, 55446, 56385, 57045, 57284, 56882, 55435, 53104, 50980, 49936, 49417, 48210, 46217, 44576, 44008, 43948, 43470, 42338, 40896, 39638, 39203, 40234, 42818, 46312, 49923, 53126, 55552, 56978, 57608, 57942, 58244, 58533, 59152, 60697, 63171, 65814, 68103, 70443, 73384, 76586, 79104, 80553, 81533, 82868, 84729, 86565]
55500H6565J227O91Q02J257J138J38r07j149r31j294k522l855m556m582m191l543
55484F4288k869k527k571k584k209j629j349j651k337k926l039k637j947j152
55470C2861l81J10M5l96o04l37j00l69p97p26k28n5n48j175j276p64j2O46J084
55451B6978J259J119O37j6l87j32L87L41m35j005n23M88P51n2r49j039m51K07
55433B7178O32P53M66j84q16j066r44o73l62KN14J248K009K268J726R30P14J000
55415C5395Q37j60j092j030l03J41J33K54O62Q16M41q2m29q01j308j522j067l01
55397C0584J19J20J66M62P04O89O48Q06R48P12J18m74q26r57q92n77q6L34N01
55378C3099M61K69j70r02j670k075j954j474q73k33L84P07M00n16j406j495p11
$$ y = [86565, 87792, 88483, 89285, 90542, 91680, 91818, 90911, 89762, 88831, 87537, 85015, 81160, 76604, 72022, 67831, 64288, 61419, 58892, 56321, 53737, 51528, 49899, 48550, 46899, 44562, 41636, 38597, 35960, 34013, 32861, 32480, 32590, 32635, 32239, 31635, 31298, 31198, 30829, 30032, 29306, 29078, 29023, 28475, 27300, 26024, 25260, 25248, 25894, 26978, 28237, 29356, 29993, 29977, 29590, 29458, 29845, 30186, 29751, 28746, 28223, 28711, 29462, 29410, 28461, 27422, 26971, 27178, 27810, 28563, 29029, 28845, 28029, 26963, 26019, 25346, 24984, 24986, 25500, 26748, 28757, 31025, 32751, 33681, 34395, 35395, 36232, 36072, 34980, 33950, 33647, 33788, 33921, 34175, 34837, 35653, 36094, 36012, 35583, 34782, 33474, 31952, 30885, 30584, 30703, 30823, 30989, 31451, 32155, 32844, 33492, 34298, 35246, 35958, 36076, 35602, 34776, 33819, 32927, 32350, 32264, 32598, 33099, 33560, 33829, 33659, 32757, 31087, 29012, 27058, 25584, 24711, 24478, 24862, 25569, 25969, 25453, 24047, 22552, 21841]
55361B1841J45L20L1M6M31K96q80k243k457j341O5R60J536K129K364J711M39n66
55343B4827q49o84m12o2K98L46n1m95n13k09j34n60j087j066l02P07J220R79N20
55324B2473O41J511K473K770K269J415O64K30J56L38N51P03Q57Q68K49j101k363
55307C4704k583j914j372j348j143k52P16R00L58j91l83l69l36m06p17j092j010
55290B3562l77Q3j84o03l36L57M89j13o66q16j007j421j515j003l77k3L52R58
55272A7360J345J111N64J60j14l26k06K87N80K91j19j63j96p30j376j362p76l83
55254A5947l76k27K40N24L11m2j11M4J77K54L34M06M60N04M80M02M44O20N21j35
55234B0777q82j017n60j03J58N24Q90O30k99r55o49P1K54j16l51k44k61n82p38
$$ y = [21841, 21986, 22306, 22337, 22383, 22814, 23110, 22230, 19987, 17530, 16189, 16254, 17214, 18750, 20879, 23243, 24954, 25393, 24827, 23978, 23294, 22882, 22820, 23118, 23464, 23413, 22918, 22405, 22196, 22062, 21502, 20415, 19349, 19047, 19754, 20974, 21953, 22473, 23114, 24625, 27098, 29868, 32137, 33552, 34216, 34446, 34602, 34940, 35491, 36194, 37051, 37919, 38168, 37067, 34704, 32121, 30207, 28835, 27487, 26344, 26092, 26808, 27708, 28066, 27875, 27492, 27123, 26787, 26381, 25664, 24572, 23562, 23185, 23268, 23084, 22481, 22145, 22502, 22991, 22878, 22212, 21396, 20389, 18968, 17453, 16450, 16073, 16050, 16402, 17360, 18705, 19816, 20380, 20540, 20426, 20100, 19894, 20181, 20761, 21052, 20933, 20770, 20574, 19844, 18468, 17106, 16330, 15947, 15571, 15344, 15584, 16108, 16419, 16377, 16266, 16310, 16487, 16741, 17075, 17481, 17941, 18445, 18925, 19327, 19771, 20391, 20912, 20777, 19895, 18878, 18318, 18215, 18373, 18897, 19787, 20417, 20118, 19163, 18514, 18585, 18839, 18723, 18372, 18128, 17867, 17285, 16547]
55215A6547l86J52M02L79M06O00Q67J230J708J984J594N42n43j033q16j39P24
55198B4218J433J569J087N19L27K15m08j391j894j549q65l82n7K23K13j44l41
55181B2773m2L05J47k99m99n14o42n56K66J375J626P61k02m06j50o2k7M07J058
55162B5319J284R20M75L74M75M31J89j0j4P1J37L07P16J113R99L05m01o62o98
55143C1330q92j057q00l62l90r14j284j124p35l97N4P08J252J459J476J363R28
55126C0615L31K24P69J148O56j71l14K27M99J24j51L79J302J591Q57l09j018r22
55108C5837l67J9n2l77o04n71l07O0K45r4r46j727j876j477j064q46n31L2M46
55089B5800J91o70j436j392n05N37R88P66L75J21k44r06j410j201n08o6LL18J049
$$ y = [16547, 16161, 16313, 16715, 17094, 17500, 18100, 18967, 20197, 21905, 23889, 25483, 26025, 25482, 24449, 23633, 23494, 24218, 25651, 27220, 28307, 28826, 29153, 29368, 28960, 27569, 25675, 24126, 23261, 22879, 22822, 23045, 23258, 23114, 22773, 22731, 23036, 23183, 22884, 22385, 21871, 21229, 20673, 20939, 22314, 23940, 24701, 24499, 24093, 23943, 23881, 23854, 24261, 25319, 26603, 27523, 27998, 28372, 28847, 29278, 29467, 29457, 29443, 29514, 29651, 29958, 30674, 31787, 32786, 33091, 32690, 32028, 31330, 30438, 29381, 28581, 28219, 27829, 26915, 25631, 24507, 23772, 23375, 23429, 24137, 25389, 26848, 28324, 29687, 30615, 30946, 31170, 31939, 33087, 33743, 33572, 33258, 33485, 33984, 34108, 33957, 34336, 35638, 37229, 38086, 37777, 36759, 35837, 35470, 35489, 35437, 35060, 34456, 33885, 33578, 33638, 33883, 33789, 32843, 31116, 29240, 27763, 26699, 25853, 25322, 25354, 25800, 25991, 25321, 23885, 22493, 21988, 22525, 23513, 24279, 24654, 24775, 24531, 23625, 22215, 21014, 20506, 20440, 20443, 20761, 21810]
55070B1810J373O24n37q40q0O93O64J47j56j54j64j63J45P08J059R10L73l52j156
55051B4904j763j699p85M61J220J131N69K02L71Q72J278J389J274R21J87p97j397
55034B8338j092k01M95P70J113J719J957J204k18j305j409n93O15J503J477N94
55018C4967k91m30o2k7o01j248j464j330j106p67j78N79J236J536J349Q11K97
55001C3271K6k36p31j120q46LO86Q59R48J316J603J322O83L05L90O57Q87J094
54983D1117J205J039O52M32O93J344J915J887J131J38l47p4M57O89O96Q74J117
54966E4965Q36r3r09p96P8Q24R83R83J292J600J258K84n63p19l25K42Q49J377
54948F2166J544J392J539K404L494M048M104M308M795N003M713M475M770N242
$$ y = [21810, 23183, 23807, 23270, 22430, 22350, 23043, 23707, 23854, 23698, 23544, 23380, 23217, 23362, 24070, 25129, 26039, 26412, 26060, 24904, 23141, 21442, 20657, 21118, 22338, 23469, 24038, 24240, 24611, 25483, 26761, 28150, 29424, 30345, 30532, 29735, 28338, 27246, 27045, 27540, 28310, 29423, 31142, 33099, 34303, 34085, 32780, 31371, 30778, 31393, 32896, 34373, 34967, 34676, 34246, 34184, 34157, 33556, 32308, 30844, 29514, 28408, 27641, 27463, 28042, 29278, 30814, 32163, 32974, 33271, 33297, 33061, 32330, 31210, 30364, 30367, 31053, 31912, 32860, 34176, 35779, 37101, 37784, 38089, 38479, 39136, 40023, 41117, 42322, 43361, 44013, 44445, 45138, 46482, 48397, 50284, 51415, 51553, 51206, 51132, 51589, 52278, 52974, 53848, 54965, 55801, 55708, 54799, 54003, 54081, 54905, 55888, 56871, 58163, 59763, 61021, 61305, 60742, 60023, 59698, 59940, 60789, 62166, 63710, 65102, 66641, 69045, 72539, 76587, 80691, 84999, 89794, 94797, 99510, 103985, 108755, 113997]
54934A13997N106L990K092q9k058l643n100o608p657p526o409n394n079m854m014
54919F6754k829k032j757j636j594j842k253k374j957j077Q4J233J934K092K189
54904E4935K656L214L388L358L603M002M019L822M291N728P239P785P229N989
54890A21258M230J962l92k205l348m270n290o167o473o195n756n499n354n071
54876G1430m630m206l766l052k137j653k072k918l149k327j018k0L78L26L6k13
54860D1009o0N05R11N86k55q16p19m31n23q34p49k02R0m70j514k105j808j050
54842C1565m59k19j23L4K67M60M27J00k82l36lL65M53L20J29r9k72o9N84J142
54822C3984R95L12j18P0M06L51P0R0M72P10M64N0L5N30J092J295J183J064J070
$$ y = [113997, 119103, 123093, 125185, 125096, 123038, 119395, 114295, 107687, 100030, 92504, 86095, 80701, 75622, 70768, 66754, 63925, 61893, 60136, 58500, 56906, 55064, 52811, 50437, 48480, 47403, 47487, 48720, 50654, 52746, 54935, 57591, 60805, 64193, 67551, 71154, 75156, 79175, 82997, 87288, 93016, 100255, 108040, 115269, 121258, 125488, 127450, 127058, 124853, 121505, 117235, 111945, 105778, 99305, 93110, 87354, 81855, 76501, 71430, 66800, 62594, 58828, 55776, 53639, 51986, 49914, 46996, 43847, 41520, 40502, 40482, 40860, 41186, 41222, 41009, 40949, 41454, 42365, 42951, 42696, 41880, 41161, 40730, 40207, 39373, 38624, 38422, 38512, 38042, 36528, 34423, 32615, 31565, 31106, 30887, 30764, 30798, 31065, 31525, 31952, 32052, 31770, 31434, 31431, 31796, 32249, 32569, 32698, 32599, 32327, 32258, 32842, 33984, 34979, 35291, 35173, 35243, 35649, 36000, 36070, 36160, 36632, 37342, 37806, 37856, 37891, 38421, 39513, 40808, 41991, 43055, 44125]
54803D4125J102J104J137J215J319J525J853K047J876J647J976K862L567L654
54789G1009L709M521N917O985P304P319P540P880P957P550O589M990K832N65j247
54774A51420k387l107l752m260m168l221j894r61n84j53P58J697J953J523J076
54759A33940J046J179J000L10p54j862k676l073l189l159k967k669k474k356j890
54744A10406q17M94J597K591L643M229L671K365J552J646J599K98j995m136n487
54729A21656o269o803p021o747o030n122m289l651l128k613k201k059k066j803
54715F1854j083k16L70O01O02M20P8j90k08j30k16l75j86N00J289J617J327P62
54697F6816M08M68O96N96j54j283j980j522nJ604K316K022J455J320J667K079
$$ y = [44125, 45227, 46331, 47468, 48683, 50002, 51527, 53380, 55427, 57303, 58950, 60926, 63788, 67355, 71009, 74718, 79239, 85156, 92141, 99445, 106764, 114304, 122184, 130141, 137691, 144280, 149270, 152102, 152667, 151420, 149033, 145926, 142174, 137914, 133746, 130525, 128631, 127670, 127086, 126933, 127691, 129388, 131341, 132864, 133940, 134986, 136165, 137165, 137475, 136721, 134859, 132183, 129110, 125921, 122762, 119795, 117126, 114652, 112296, 110406, 109589, 110083, 111680, 114271, 117914, 122143, 125814, 128179, 129731, 131377, 132976, 133274, 131279, 127143, 121656, 115387, 108584, 101563, 94816, 88786, 83664, 79375, 75724, 72596, 69983, 67782, 65723, 63657, 61854, 60771, 60555, 60925, 61526, 62128, 62548, 62626, 62436, 62228, 62098, 61882, 61507, 61321, 61821, 63110, 64727, 66054, 66816, 67224, 67692, 68388, 68984, 68830, 67547, 65567, 64045, 64040, 65644, 67960, 69982, 71437, 72757, 74424, 76503]
54681G6503K181J838J159M82J90L48O64R00J133J410J519J301R87R10J154J672
54665I4351K458L240L413K774K130K550M114N936P313Q242Q871R146R129R123
54651A72790R212R194Q982Q554P435M930J268k180m317n487o683q068q919q909
54637A77802q570q416q229p575o602n807n175m132k549j320j427k559l274k653
54623A09514j260k41J1j36l50n18m71j77k1l29p71q44p27r44j370j331p00q0J71
54604I9426K55K46r6n93o31r8L84M88N91Q98J009P79P40J145J434J240J113J509
54586A09839J878J609J176J377K047K468K572K704K588J688M36j7O24J408J493
54571A33890J070P72Q69J208J432J140K96n23o90l84l24p58j217j264r10l45K80
$$ y = [76503, 78684, 80522, 81681, 82163, 82353, 82701, 83365, 84265, 85398, 86808, 88327, 89628, 90615, 91525, 92679, 94351, 96809, 100049, 103462, 106236, 108366, 110916, 115030, 120966, 128279, 136521, 145392, 154538, 163667, 172790, 182002, 191196, 200178, 208732, 216167, 221097, 222365, 220185, 215868, 210381, 203698, 195630, 186711, 177802, 169232, 160816, 152587, 145012, 138410, 132603, 127428, 123296, 120747, 119427, 118000, 115441, 112167, 109514, 108254, 108013, 108024, 107888, 107538, 107020, 106549, 106372, 106351, 106022, 105251, 104407, 103680, 102736, 101366, 100035, 99335, 99255, 99426, 99681, 99927, 99831, 99238, 98607, 98509, 98893, 99381, 99972, 100870, 101879, 102658, 103398, 104543, 105977, 107217, 108330, 109839, 111717, 113326, 114502, 115879, 117926, 120394, 122966, 125670, 128258, 129946, 130382, 130365, 130989, 132397, 133890, 134960, 135732, 136601, 137809, 139241, 140381, 140677, 140154, 139464, 139080, 138756, 137998, 136781, 135517, 134607, 134262, 134542]
54554A34542Q35J392K244L320L828L248K373K528L798M928N027M489M079L985
54540A80616M030M054L751K826J688J183J434J532P65n79j913l108m088m440m114
54525A83637l772l852l819l067k012j458j348r78k33K95L23J95J27r6n06o00O8
54508A62904J347K641L363L223K380J447J035J252J773K276K559K371J658R35
54494A91164R27J635K251K094J284L04n64j096q65K41J448J655O85m84r20p41
54478A99018n88n10K1J097J976J991J352P36L52n9n44p45m74k7J64k3m05o50m50
54459B02232J63N85R9j263k644l219k906k154j430j051j142j467j605j484j447
54444A81267j581j426o75K46P65R26J051R51J59j155k169k385k134j975k090k322
$$ y = [134542, 135377, 136769, 139013, 142333, 146161, 149409, 151782, 154310, 158108, 163036, 168063, 172552, 176631, 180616, 184646, 188700, 192451, 195277, 196965, 198148, 199582, 201114, 201879, 201300, 199387, 196279, 192191, 187751, 183637, 179865, 176013, 172194, 169127, 167115, 165657, 164309, 163331, 163098, 163393, 163716, 163911, 164038, 163942, 163436, 162836, 162904, 164251, 166892, 170255, 173478, 175858, 177305, 178340, 179592, 181365, 183641, 186200, 188571, 190229, 191164, 192091, 193726, 195977, 198071, 199355, 199659, 199095, 197999, 197134, 197375, 198823, 200478, 201163, 200679, 199759, 199018, 198430, 197920, 197941, 199038, 201014, 203005, 204357, 205093, 205445, 205386, 204842, 204097, 203623, 203596, 203760, 203737, 203332, 202682, 202232, 202395, 202980, 203079, 201816, 199172, 195953, 193047, 190893, 189463, 188412, 187270, 185803, 184198, 182714, 181267, 179686, 178260, 177585, 177831, 178596, 179522, 180573, 181524, 181683, 180528, 178359, 175974, 173840, 171865, 169775, 167453]
54428A67453k395k049j300o45n51p58n94j5L22J87K29R35J796K058J781J419R08
54411A68781K7o67l13Q45J488R90K15J33L69p5j233k106k031j372q48p62j003
54394A62438j320j433j297j293j800k454k342j180J40N33qn92o44m40m73p24q11
54377A46300n41j31O9j01n27r70j273j421j474j457j361j144p68l65l19q92j723
54360A31902k010j415n12m6J9K52P76J088Q53L63J8j55k88l22k24k17m75p72q62
54341A27973r71j451k096k306j976j710j889k069j673r45o24q23r07n81m23r36
54325A06593j597j510p31j90l17n09j91K23Mp51j287j278j145j298j605j716j516
54308I1179j115o91m48n17p73j011j297j857k614l150l197k880k371j691r98o78
$$ y = [167453, 165058, 163009, 161709, 161064, 160513, 159755, 159161, 159146, 159468, 159655, 159884, 160819, 162615, 164673, 166454, 167873, 168781, 168808, 168141, 167828, 168673, 170161, 171151, 171366, 171499, 171868, 171793, 170560, 168454, 166423, 165051, 164203, 163441, 162438, 161118, 159685, 158388, 157095, 155295, 152841, 150499, 149319, 149459, 149992, 149984, 149392, 148748, 148308, 147835, 147111, 146300, 145759, 145628, 145697, 145596, 145069, 144099, 142826, 141405, 139931, 138474, 137113, 135969, 135201, 134836, 134517, 133625, 131902, 129892, 128477, 127965, 127919, 127938, 128190, 128966, 130054, 130907, 131270, 131288, 131133, 130845, 130523, 130299, 130082, 129607, 128835, 127973, 127002, 125551, 123455, 121149, 119173, 117463, 115574, 113505, 111832, 110887, 110263, 109440, 108533, 107952, 107529, 106593, 104996, 103486, 102755, 102565, 102248, 101739, 101548, 101771, 101775, 101024, 99737, 98459, 97314, 96016, 94411, 92695, 91179, 90064, 89373, 88925, 88408, 87635, 86624, 85327, 83470, 80856, 77706, 74509, 71629, 69258, 67567, 66569, 65891]
54292F5891q12q90m49J90K88k87q08n89K06Q95J181J323J518J505J033L95J35
54275G0725K95M24L59M45Q40J106R66R07J394J845J249k25j208q50J48O09K79
54258G9308k59m91k16O16J748K528K521J999J441R24M41L34P39R60L21o13n83
54241I1718M32R63O7j286j618j040r21j744k376j757m76J1p56j812k144j805j410
54224G4046j127o88j41P8j48m18m36l93m75m63j11M12Q69J289J645J561Q67J35
54206G6502J4L12L05j59o07q54j144j380j082l33P5j68l89n2K80j63j152j906
54188F8099k261k506k435j547j95M55j61j310j982j935j511r67l95K6J72J41J04
54171E1792J44L53P70J062O92l13j124r84n1R21J417J343O96l19j038q39O6Q24
$$ y = [65891, 65079, 64189, 63740, 63930, 64218, 63931, 63123, 62534, 62740, 63635, 64816, 66139, 67657, 69162, 70195, 70590, 70725, 71020, 71444, 71803, 72248, 73088, 74194, 75160, 76067, 77461, 79306, 80555, 80330, 79122, 78272, 78420, 79029, 79308, 79049, 78558, 78342, 78958, 80706, 83234, 85755, 87754, 89195, 90119, 90560, 90894, 91633, 92593, 92914, 92301, 91718, 92150, 93113, 93180, 91894, 90276, 89236, 88315, 86571, 84195, 82438, 81962, 81973, 81217, 79405, 77261, 75456, 74046, 72919, 72231, 72090, 72168, 72020, 71602, 71166, 70773, 70298, 69835, 69724, 70136, 71005, 72294, 73939, 75500, 76367, 76502, 76516, 76828, 77133, 76974, 76367, 75513, 74369, 72989, 71907, 71574, 71649, 71481, 71092, 71040, 71320, 71157, 70005, 68099, 65838, 63332, 60897, 59350, 59155, 59610, 59449, 58139, 56157, 54222, 52711, 51744, 51349, 51375, 51547, 51688, 51792, 51936, 52289, 53059, 54121, 54813, 54500, 53376, 52392, 52341, 53262, 54679, 56022, 56718, 56399, 55361, 54522, 54588, 55412]
54153E5412R48O78L56K6k20n8N10R56R16P51R28J165P68l34j390j691j247n78
54135E7896k39n59j377j945j538m05K97j73j233j694j167l34N1m7j86o7K38M64
54117D7982L45j40o71p85l58K38N47N04L65L04K56P5k55o48r13p86j76O34J134
54098D7652J093P71N75N62M13j54j049j787j839j108j16M35L85K40M45P98Q61
54081D8177P07P78J115J272J035P68Q12J012J080J008Q44M50j04l01J81Q63J016
54064F0713O53M17O05R15J116J332J564J534J209R39R04Q77Q08J072J792K394
54048G8844K309J767J397J355J350J359J661K227K600K575K490K743L221L484
54034A09382L301K878K645K817L207L420L262K850K278J496O15R9K50P17Q59N15
$$ y = [55412, 56360, 57038, 57394, 57420, 57200, 57142, 57652, 58608, 59524, 60275, 61203, 62368, 63136, 62802, 61412, 59721, 58474, 57896, 57657, 57098, 55721, 53776, 52238, 51833, 52130, 51957, 50724, 49030, 47863, 47529, 47580, 47533, 47347, 47280, 47518, 47982, 48327, 48187, 47516, 46731, 46373, 46611, 47158, 47662, 48027, 48331, 48587, 48662, 48407, 47759, 46846, 46060, 45884, 46518, 47652, 48745, 49516, 50091, 50653, 51066, 50912, 49863, 48076, 46237, 45129, 45013, 45448, 45833, 46073, 46518, 47316, 48177, 48884, 49662, 50777, 52049, 53084, 53852, 54664, 55676, 56756, 57764, 58608, 59058, 58954, 58653, 58834, 59697, 60713, 61366, 61783, 62388, 63303, 64419, 65751, 67315, 68849, 70058, 70997, 71901, 72778, 73586, 74658, 76450, 78844, 81153, 82920, 84317, 85672, 87022, 88381, 90042, 92269, 94869, 97444, 99934, 102677, 105898, 109382, 112683, 115561, 118206, 121023, 124230, 127650, 130912, 133762, 136040, 137536, 138151, 138250, 138500, 139217, 140076, 140591]
54018A40591N6k76o19j085j519j821k087k307k270j980j814j914j825j142l24
54003A19664k38r49j503j181m87n11j526k690l122k803k299j899j448r09o43r39
53987I6517j551j934j886j689j631j608j383j024q52r42r33n17N5K02k13o87p03
53970G9221l31M7L69Q59J428J610J212P14O76J001J095P07K67K86P20J076J074
53953I2031R88J239J821K308K476K598K976L500L909M278M804N264N230M821M662
53938A42905M889M802L846K475J509J062O38K8m71p02q44r46p57j87M46Q15R48
53921A60456J087J351J657J805J660J417J605K576L963N010N362N253M857L932
53907B01991K364O13o12j075j094j080j220j510j868k260k722l299l879m188m073
$$ y = [140591, 140647, 140371, 139752, 138667, 137148, 135327, 133240, 130933, 128663, 126683, 124869, 122955, 121130, 119988, 119664, 119426, 118477, 116974, 115793, 115306, 114795, 113269, 110579, 107457, 104654, 102355, 100456, 99008, 98099, 97456, 96517, 94966, 93032, 91146, 89457, 87826, 86218, 84835, 83811, 82959, 82017, 81084, 80567, 80622, 80824, 80611, 79924, 79221, 78890, 78937, 79306, 80165, 81593, 83203, 84415, 85129, 85805, 86806, 87901, 88608, 88875, 89161, 89881, 90957, 92031, 93019, 94258, 96079, 98387, 100863, 103461, 106437, 109937, 113846, 118124, 122928, 128192, 133422, 138243, 142905, 147794, 152596, 156442, 158917, 160426, 161488, 162126, 162154, 161683, 160981, 160137, 159191, 158434, 158247, 158693, 159508, 160456, 161543, 162894, 164551, 166356, 168016, 169433, 171038, 173614, 177577, 182587, 187949, 193202, 198059, 201991, 204355, 204968, 204356, 203281, 202187, 201107, 199887, 198377, 196509, 194249, 191527, 188228, 184349, 180161, 176088]
53892A76088l701l402l356l477l590l647l772m067m437m654m621m440m183l809
53878A20932l337k886k388j511k07Q94R99mj470k699l362l410k945k221j426n18
53862I4441M35R19N05l87q59o76m55n85o90m36k23n53j168j429j157o58j82J47
53844H6989J36l05q58j129j067q44n16j55j3j21m8N23J166J237P82L14pl70n74
53825H5140j57P64J488J692J698J623J111K08k53K31J012J211R97J189J922K484
53809A02360K436K211K443L229M200M921N114M767M171L611L019K179J293R34
53795A46888J334K042K489K603K607K432J735M62q48j511j314o56j30m7l46q02
53779A56938j226j546j809k158k619k953k868k490k273k350k265j670r79q11r99
$$ y = [176088, 172387, 168985, 165629, 162152, 158562, 154915, 151143, 147076, 142639, 137985, 133364, 128924, 124741, 120932, 117595, 114709, 112321, 110810, 110603, 111497, 112496, 112492, 111022, 108323, 104961, 101551, 98606, 96385, 94959, 94441, 94876, 95795, 96300, 95913, 95054, 94378, 93923, 93338, 92648, 92212, 91989, 91436, 90268, 88839, 87682, 87024, 86842, 86989, 87125, 86820, 85962, 84833, 83766, 82922, 82406, 82251, 82238, 82117, 82069, 82592, 83758, 84995, 85777, 86091, 86084, 85714, 85140, 84983, 85747, 87235, 88927, 90625, 92248, 93359, 93567, 93314, 93545, 94557, 95768, 96765, 97954, 99876, 102360, 104796, 107007, 109450, 112679, 116879, 121800, 126914, 131681, 135852, 139463, 142482, 144661, 145954, 146888, 148222, 150264, 152753, 155356, 157963, 160395, 162130, 162592, 161744, 160233, 158919, 158263, 158133, 158086, 157740, 156938, 155712, 154166, 152357, 150199, 147580, 144627, 141759, 139269, 136996, 134646, 132381, 130711, 129732, 128921, 127922]
53764A27922p81NO01M08k37p40j111j626k048j870j185o32n27n49m11l21n54r40
53746A15404j070p78k93Jj70p35j283j446j279j100j066j088j125j163j024o06
53730A01179k32l11o03m48J26K05o68j570j235L29J913K634K707K745K843K631
53714A12245J910R63L07J10n6p10j671k083j396K0J479K768L933M745M994M977
53698A32535N077M996M144K734J714J535J725J775J828K113K368K213J725J265
53684A67747J047J135J494J894K083K225K725L454L634K875J769J114R73R28Q36
53669A95933P97P46N58M34O21R38J025Q73P20O14M64L73M50N04L02Lj61m13j131
53650B03650k104k634k348j462m00L39K05q25j831j863j251j159j775j970j070
$$ y = [127922, 127141, 127146, 127747, 128155, 127918, 127178, 126067, 124441, 122393, 120523, 119338, 118706, 118179, 117630, 117219, 116898, 116344, 115404, 114334, 113556, 113263, 113264, 113094, 112359, 111076, 109630, 108351, 107251, 106185, 105097, 103972, 102809, 101785, 101179, 100947, 100636, 100033, 99585, 99711, 99916, 99248, 97678, 96443, 96772, 98685, 101319, 104026, 106771, 109614, 112245, 114155, 115118, 115425, 115535, 115479, 114769, 113098, 111015, 109619, 109639, 111118, 113886, 117819, 122564, 127558, 132535, 137612, 142608, 146752, 149486, 151200, 152735, 154460, 156235, 158063, 160176, 162544, 164757, 166482, 167747, 168794, 169929, 171423, 173317, 175400, 177625, 180350, 183804, 187438, 190313, 192082, 193196, 194169, 195097, 195933, 196730, 197476, 198034, 198468, 199089, 200027, 201052, 201925, 202645, 203259, 203723, 204096, 204546, 205050, 205352, 205355, 205194, 204781, 203650, 201546, 198912, 196564, 195102, 194702, 195041, 195246, 194421, 192590, 190727, 189476, 188317, 186542, 184572, 183502]
53635A83502N6L45Q7K49Q25R23K29n66p95n03m8L61N97O44P68J228J742J788J447
53616A92879J393J817K076J664J052J043J734K575L118L238K839J976J137Q98
53602B19439J245J647J823K011K429K943L341L626L772L600L075K537K364K528
53588B56380K678K556K172J704J336J106R08O14K40j51n44q19p06k46p7p05j586
53571B64860j616p26j33o81j701k038j541q32k08L25M22j96r47r85m57j93k34
53554B53119J46R50J213O36K61Q26J533J284L43j87J6L77N44P41J204J943K937
53537B67886L890M120L368K505K638L693M640M960M986M939M620M308M843O453
53523C27849Q190R136R545J0228J1327J2278J2745J2959J3292J3902J4765J5722
$$ y = [183502, 183558, 183903, 183990, 184239, 185064, 185987, 186216, 185650, 184855, 184352, 184304, 184665, 185262, 185906, 186674, 187902, 189644, 191432, 192879, 194272, 196089, 198165, 199829, 200881, 201924, 203658, 206233, 209351, 212589, 215428, 217404, 218541, 219439, 220684, 222331, 224154, 226165, 228594, 231537, 234878, 238504, 242276, 245876, 248951, 251488, 253852, 256380, 259058, 261614, 263786, 265490, 266826, 267932, 268840, 269454, 269694, 269543, 268999, 268180, 267474, 267228, 267151, 266446, 264860, 263244, 262518, 262385, 261704, 260003, 257965, 256424, 255592, 255384, 255709, 256131, 255935, 254988, 254003, 253546, 253353, 253119, 253265, 254215, 255428, 256064, 256325, 257151, 258684, 259968, 260311, 260124, 260140, 260517, 261061, 261802, 263006, 264949, 267886, 271776, 275896, 279264, 281769, 284407, 288100, 292740, 297700, 302686, 307625, 312245, 316553, 321396, 327849, 336039, 345175, 354720, 364948, 376275, 388553, 401298, 414257, 427549, 441451, 456216, 471938]
53511D71938J6535J7065J7382J7661J8155J9291K1361K3885K5748K6333K6209
53500G01563K6206K6249K5760K4969K4953K6163K7649K8248K8071K8299K9698
53489I97828L1820L3567L4142L3481L2185L1125L0728L0542K9703K7909K5671
53478A338701K3612K1834K0243J9005J8319J8079J8115J8601J9661K0758K1006
53467A557934K0091J8470J6655J4805J2944J1007Q561N077P86l319o571r207j1672
53454A635561j3974j6105j8379k0795k2656k3466k3820k4651k6035k7476k8913
53443A389291l0468l1490l1044k9457k8313k8542k9349k9505k8858k8065k7406
53432A066794k6510k4943k2533j9438j6170j3372j1237r383p448n461l459j191
$$ y = [471938, 488473, 505538, 522920, 540581, 558736, 578027, 599388, 623273, 649021, 675354, 701563, 727769, 754018, 779778, 804747, 829700, 855863, 883512, 911760, 939831, 968130, 997828, 1029648, 1063215, 1097357, 1130838, 1163023, 1194148, 1224876, 1255418, 1285121, 1313030, 1338701, 1362313, 1384147, 1404390, 1423395, 1441714, 1459793, 1477908, 1496509, 1516170, 1536928, 1557934, 1578025, 1596495, 1613150, 1627955, 1640899, 1651906, 1660467, 1665544, 1666330, 1663011, 1656440, 1647233, 1635561, 1621587, 1605482, 1587103, 1566308, 1543652, 1520186, 1496366, 1471715, 1445680, 1418204, 1389291, 1358823, 1327333, 1296289, 1266832, 1238519, 1209977, 1180628, 1151123, 1122265, 1094200, 1066794, 1040284, 1015341, 992808, 973370, 957200, 943828, 932591, 923208, 915760, 910299, 906840, 905649]
53420I05649J416L953O086Q102J0405J2871J5120J7161J9186K0991K2201K3002
53408A066143K4043K5560K7152K8513K9781L1081L2195L3075L4260L6294L8950
53397A407047M1471M3570M5747M8561N1954N5452N8701O1561O3805O5208O5959
53386B009036O6604O7463O8356O9041O9624P0252P0625P0214O8807O6531O3480
53375B760033N9762N5884N2561N0064M8100M6487M5356M4558M3357M1170L8275
53364C285607L5316L2344K8692K3638J6713P607l641j6249k8896m0568n0983o0144
53352C229436o7809p3593p7391p9459q0240q0265q0036p9792p9318p8261p6596
53341B376676p4742p3178p2132p1610p1515p1545p1160o9848o7481o4319o0757
$$ y = [905649, 907065, 911018, 917104, 925206, 935611, 948482, 963602, 980763, 999949, 1020940, 1043141, 1066143, 1090186, 1115746, 1142898, 1171411, 1201192, 1232273, 1264468, 1297543, 1331803, 1368097, 1407047, 1448518, 1492088, 1537835, 1586396, 1638350, 1693802, 1752503, 1814064, 1877869, 1943077, 2009036, 2075640, 2143103, 2211459, 2280500, 2350124, 2420376, 2491001, 2561215, 2630022, 2696553, 2760033, 2819795, 2875679, 2928240, 2978304, 3026404, 3072891, 3118247, 3162805, 3206162, 3247332, 3285607, 3320923, 3353267, 3381959, 3405597, 3422310, 3429917, 3426276, 3410027, 3381131, 3340563, 3289580, 3229436, 3161627, 3088034, 3010643, 2931184, 2850944, 2770679, 2690643, 2610851, 2531533, 2453272, 2376676, 2301934, 2228756, 2156624, 2085014, 2013499, 1941954, 1870794, 1800946, 1733465, 1669146, 1608389]
53330A608389n7176n3817n0550m6900m2613l8142l4157l0630k6922k2883j9304
53319A185295j6893j5258j3483j1364r601q805q829q984q603p503o142n177m595
53306A060058l629j889j56P03J123K322M473O394P221P517Q333R971J2023J4098
53292A128562J5976J7579J9164K1134K3369K5208K6445K7776K9793L2018L3470
53281A400494L3883L3791L3615L3176L2123L0485K8858K8049K8323K8908K8659
53270A740364K7324K5627K3994K1880J8769J5085J1492P859L643j123o014j1007
53258A877893j6358k1930k7299l2339l7008m0879m3605m5607m7433m8706m8701
53247A468028m7770m7015m6447m4794m1566l8060l5595l3830l1900l0453l1092
$$ y = [1608389, 1551213, 1497396, 1446846, 1399946, 1357333, 1319191, 1285034, 1254404, 1227482, 1204599, 1185295, 1168402, 1153144, 1139661, 1128297, 1118696, 1109891, 1101062, 1092078, 1083475, 1075972, 1069830, 1064653, 1060058, 1056429, 1054540, 1054384, 1055087, 1056210, 1058532, 1063005, 1069399, 1076620, 1084137, 1092470, 1102441, 1114464, 1128562, 1144538, 1162117, 1181281, 1202415, 1225784, 1250992, 1277437, 1305213, 1335006, 1367024, 1400494, 1434377, 1468168, 1501783, 1534959, 1567082, 1597567, 1626425, 1654474, 1682797, 1711705, 1740364, 1767688, 1793315, 1817309, 1839189, 1857958, 1873043, 1884535, 1892394, 1896037, 1894914, 1888900, 1877893, 1861535, 1839605, 1812306, 1779967, 1742959, 1702080, 1658475, 1612868, 1565435, 1516729, 1468028, 1420258, 1373243, 1326796, 1282002, 1240436, 1202376, 1166781, 1132951, 1101051, 1070598, 1039506]
53236A039506l3928l7002l8426l8213l7469l6625l5197l3015l0763k9071k7655
53225F62142k5707k2926j9767j6866j4544j2886j1758j0778r570q268p442p352
53213D94278p626p877q225q857r517r853j0024j0424j0979j1175j0727r851q943
53200C70200q327q124q097p790p139o736p022p636p979q107q363q477p898o897
53186B61608o364o474o483o054n844o283o658o064m661l374k713k506k457k420
53172A93253k248j923j719j815j964j794j353r65p42n72n34q76j599k251k353
53157A70545j852j144p06o81q36q82p20l32K98Q80P67l37j700k181j497l80N06
53140A59748J144J589J561R54J93l80q83j318j247n46P6n1n29m84J81P73Q55N06
$$ y = [1039506, 1005578, 968576, 930150, 891937, 854468, 817843, 782646, 749631, 718868, 689797, 662142, 636435, 613509, 593742, 576876, 562332, 549446, 537688, 526910, 517340, 509072, 501630, 494278, 486652, 478775, 470550, 461693, 452176, 442323, 432299, 421875, 410896, 399721, 388994, 379143, 370200, 361873, 353749, 345652, 337862, 330723, 323987, 316965, 309329, 301350, 293243, 284880, 276403, 268505, 261608, 255244, 248770, 242287, 236233, 230389, 224106, 217448, 211384, 206723, 203349, 200636, 198130, 195673, 193253, 191005, 189082, 187363, 185548, 183584, 181790, 180437, 179472, 178730, 178158, 177624, 176748, 175149, 172898, 170545, 168693, 167549, 166843, 166162, 165326, 164444, 163724, 163392, 163690, 164570, 165337, 165000, 163300, 161119, 159622, 159242, 159748, 160892, 162481, 164042, 164996, 165189, 164809, 163926, 162608, 161361, 160815, 160891, 160840, 160311, 159827, 160008, 160781, 161636, 162142]
53122A62142k29j345k305k271j180KL62n5n85p63n38r8J73j15r91k021k765l108
53104A44310l127k850k406k077k026k119k196k263k253j793o78N57R38J69r06
53089A21280j187n89l6k50q22q44r8P17R13N66K12J85M27O95P53N33K92M39R87
53070A24173J405J212M92l39j067j587j599r16j5K55l41j127j350r99o19n33n76
53053A16469m40p2K79L00m5m38m62k4N45Q33P37N13N07P99J087R94N43J80K34
53034A22539M51K90l96j203j678j699j353p76k59k16p30j288j265o98l08o05j214
53017A09592j307o21K56O25M10K0k94n61p64p29m36r7J41K76J84l09r38r61J2
52998A04499J442K409K575K213J645J069Q19J164J782J947J386O00J99K75N90
$$ y = [162142, 161913, 160568, 158263, 155992, 154812, 154814, 155176, 155121, 154536, 153773, 153235, 153137, 153310, 153195, 152204, 150183, 147418, 144310, 141183, 138333, 135927, 133850, 131824, 129705, 127509, 125246, 122993, 121200, 120522, 121079, 122017, 122186, 121280, 120093, 119504, 119468, 119218, 118396, 117552, 117454, 118171, 119084, 119650, 119862, 120047, 120474, 121169, 121922, 122455, 122747, 123186, 124173, 125578, 126790, 127282, 126943, 125876, 124289, 122690, 121774, 121759, 122014, 121673, 120546, 119196, 118197, 117578, 117045, 116469, 116029, 115957, 116236, 116536, 116491, 116053, 115591, 115567, 116112, 116945, 117682, 118195, 118702, 119501, 120588, 121582, 122125, 122305, 122539, 122990, 123280, 122884, 121681, 120003, 118304, 116951, 116175, 115916, 115700, 114970, 113682, 112417, 111719, 111411, 110806, 109592, 108285, 107664, 107920, 108545, 108955, 108975, 108681, 108120, 107356, 106627, 106191, 106094, 106235, 106511, 106695, 106386, 105448, 104487, 104499, 105941, 108350, 110925, 113138, 114783, 115852, 116671, 117835, 119617, 121564, 122950, 123550, 123749, 124024, 124614]
52983A24614R52J155Q76R6o33o85j01M31L50k38p83p95k16N93J164J306J192R92
52965A30270N93q6o34m45M50J221J208P50O60J063J285Q70J73l03o08r45j043
52948A34479n36J97L17k53n80M7J177J901K023J963J838J387P64O97J501K363
52932A49285K124O69q43j229n16K45K69j90l92j17K62N24Q43J262J394R98M24
52915A55012J46J08k0j84o7K89M68L59K87M19M91K99J09K22M82M86J68j42j46
52896A58786R9K33k9n99r96p95j04N54Q91J112J430J597J224M35j70k27j6ok37
52877A63182l90l47l76o88j038j028o81l97l40k65KJ70k0k43O3Q61J468J384Q09
52858A62126J36o29j670k772l360l157k521j948j492q76j35J70l71j359j916j687
$$ y = [124614, 125566, 126721, 127597, 127693, 127060, 126375, 126274, 126705, 127055, 126817, 126034, 125239, 125023, 125616, 126780, 128086, 129278, 130270, 130863, 130777, 130143, 129698, 130148, 131369, 132577, 133327, 133987, 135050, 136335, 137205, 137378, 137075, 136467, 135522, 134479, 133943, 134140, 134457, 134204, 133624, 133671, 134848, 136749, 138772, 140735, 142573, 143960, 144724, 145421, 146922, 149285, 151409, 152078, 151235, 150006, 149490, 149735, 150004, 149814, 149422, 149305, 149567, 150091, 150934, 152196, 153590, 154588, 155012, 155158, 155266, 155246, 155062, 154995, 155284, 155752, 156111, 156398, 156817, 157308, 157607, 157716, 157938, 158420, 158906, 159074, 158932, 158786, 158885, 159118, 159089, 158490, 157494, 156699, 156595, 157149, 158040, 159152, 160582, 162179, 163403, 163838, 163668, 163441, 163425, 163419, 163182, 162792, 162445, 162069, 161381, 160343, 159315, 158634, 158237, 157897, 157632, 157634, 157804, 157784, 157541, 157604, 158465, 159933, 161317, 162126, 162262, 161633, 159963, 157191, 153831, 150674, 148153, 146205, 144713, 143837, 143702, 143872, 143501, 142142, 140226, 138539]
52842A38539j193j034j158j103p11k39O9J45q1o22j206j448j247q13l16J54K83
52825A28019k75j344k160k143j501r04p63r67j157j070p37m30l47l24o3L86O17
52808A14837M13k1m06o36o22k13M47Q22N25k11q14r82q02m64j32O7J15R8k3l80
52788A11618q94j233j268j239j284j106m99J64L40l0o65j454k257k474j590j07
52772I6022Q22Q03N98Q67J238J046M08p2k37m27p58r23p44l31K02Q17J271J224
52754A01826P15K04rr8l15o33r50j261j406j044k42K26k84j255j464m88P61J273
52736I5556J173J314J961K508K402J871J488J473J558J432J030M98j1m85j052
52721A12716j749k290k284j713j019n50j51M56J077J162N67j18k53J03L32Q1l79
$$ y = [138539, 137346, 136312, 135154, 134051, 133340, 133101, 133170, 133315, 133234, 132612, 131406, 129958, 128711, 127898, 127582, 127736, 128019, 127744, 126400, 124240, 122097, 120596, 119692, 118929, 117962, 116805, 115735, 114998, 114568, 114221, 113897, 113834, 114220, 114837, 115250, 115229, 114823, 114187, 113565, 113352, 113799, 114621, 115146, 114935, 114121, 113139, 112337, 111873, 111741, 111808, 111923, 112021, 111998, 111618, 110724, 109491, 108223, 106984, 105700, 104594, 104095, 104259, 104599, 104569, 103904, 102450, 100193, 97719, 96129, 96022, 96844, 97647, 98245, 99112, 100350, 101396, 101804, 101732, 101495, 101068, 100310, 99387, 98643, 98312, 98514, 99331, 100602, 101826, 102541, 102745, 102736, 102638, 102323, 101690, 100740, 99479, 98073, 97029, 96787, 97013, 96729, 95474, 94010, 93522, 94283, 95556, 96729, 98043, 100004, 102512, 104914, 106785, 108273, 109746, 111304, 112736, 113766, 114264, 114253, 113768, 112716, 110967, 108677, 106393, 104680, 103661, 103111, 102960, 103416, 104493, 105655, 106222, 106104, 105851, 105954, 106286, 106367, 105988]
52704A05988o65q09j027j133o23N37J531J433K58j018j489j151o16l37k56r4K91
52687A00820Q26J318J580J577J433J270J093Q80P53Q66J186J460J444J083M62
52672A18051k63q92j241j258r98n09J02N02K66o13j538j838j473r14m89j68L4
52655A06761j19o10r46p18k39j42m67n96j07O96J200J156P37K27j35j92K2L43
52637A06871O80J058J338J244Q00N04P49J256J361P99q7p92j025p35m0P03J080
52620A15764Q85K20o38j331j489j018k44L46N39L94j7o17j124j196p91k09L24
52603A09798P94J170J271R66L59l02q10j042j011q98q53q07o03k69k6rj64l26
52585A07238k34K95J036J353R33L35L06P49R07N03N4j6J19K58N94J156J462J135
$$ y = [105988, 105323, 104514, 103487, 102354, 101731, 102268, 103799, 105232, 105490, 104472, 102983, 101832, 101216, 100879, 100623, 100529, 100820, 101646, 102964, 104544, 106121, 107554, 108824, 109917, 110797, 111550, 112416, 113602, 115062, 116506, 117589, 118051, 117788, 116896, 115655, 114397, 113399, 112890, 112992, 113494, 113760, 113147, 111609, 109771, 108298, 107384, 106895, 106727, 106761, 106642, 106032, 105086, 104368, 104129, 103987, 103520, 102924, 102817, 103513, 104713, 105869, 106606, 106833, 106698, 106506, 106528, 106871, 107551, 108609, 109947, 111191, 111991, 112495, 113244, 114500, 115861, 116660, 116573, 115781, 114756, 114021, 113981, 114684, 115764, 116649, 116869, 116231, 114900, 113411, 112393, 112149, 112495, 113034, 113428, 113411, 112794, 111670, 110474, 109683, 109474, 109798, 110592, 111762, 113033, 113999, 114358, 114056, 113246, 112204, 111193, 110295, 109442, 108635, 108032, 107763, 107737, 107728, 107564, 107238, 107004, 107299, 108335, 109688, 110621, 110956, 111262, 112011, 112918, 113421, 113475, 113459, 113578, 113836, 114430, 115586, 117048, 118183]
52567A18183N05J06j2j04j86j95k89n11m60J35P69O51k44j125j392j210j102j294
52549A12225j497j161p5J141J475P62M8K30P92O31j85n14R6P97Q21N22M79M47
52531A17034p7p67q10r8O09P31M95L81M44L93R1k23k51j6Q6k79r35j315j037k67
52511A14189N05R25R45P30N03L52K03Jj61k33l79o88q66o11j89j58m88n27j5M92
52491A14530N12L37L88M04n5o43n34M05J370J589J017J06o53r01o40l35l68m96
52473A16033l18j13n07j225j133Q2J198J042J31j34N34J087Q47L74M38R02J072
52456A20310O73O2k39M7P80J376J222L82l38k19O24J462J690J152P0j066j693
52439A26295j589j075o04l52k91m51p95j015q44m30j24K5K06L80L34J30J57N53
$$ y = [118183, 118688, 118794, 118782, 118678, 118492, 118297, 118008, 117497, 117037, 117172, 117941, 118592, 118348, 117223, 115831, 114621, 113519, 112225, 110728, 109567, 109492, 110633, 112108, 112870, 112918, 113148, 113940, 114571, 114386, 113872, 113968, 114765, 115586, 116108, 116587, 117034, 116957, 116190, 115380, 115282, 115891, 116622, 117117, 117498, 117942, 118335, 118426, 118203, 117952, 117936, 118022, 117743, 116808, 115493, 114456, 114189, 114694, 115619, 116564, 117294, 117797, 118149, 118352, 118353, 118192, 117959, 117580, 116892, 116026, 115415, 115226, 115068, 114580, 114053, 114038, 114530, 115042, 115379, 115767, 116171, 116116, 115473, 114939, 115344, 116714, 118303, 119320, 119426, 118773, 117872, 117232, 116897, 116529, 116033, 115715, 115602, 115095, 113870, 112737, 112819, 114017, 115059, 115190, 115056, 115590, 116677, 117524, 117898, 118336, 119238, 120310, 120983, 121045, 120806, 120853, 121633, 123009, 124231, 124613, 124275, 124056, 124680, 126142, 127832, 128984, 129054, 127988, 126295, 124706, 123631, 123027, 122675, 122384, 121933, 121138, 120123, 119279, 118849, 118725, 118750, 118956, 119336, 119670, 119800, 119957, 120510]
52421A20510R73J048Q33O34O15O83O40L15k38o91p38m80k79k54j93l0qk72o17
52402A22451q23r00q49n13J4J75m14j306j644j192n65m08p28j077j087o58R6Q22
52384A11394J067P55M19O22J125J075K36m15J19J321J641N85n49m68M17Q66P54
52367A20964R50J590J783J182O57Q92J270Q91n3o20l36N18J466K078K125J916
52351A37273K074K561K495J524O63R10J669J554M24n13m45K55J011J745K420K738
52335A58358K610K312J988J624J493J926K600K821K585K552K879L080L193M014
52321A94035N613O722O396N451N370O371P495Q211Q925R998J1083J1620J1473
52308B98763J0979J0703J1117J2206J3407J4214J4671J5145J5743J6231J6338
$$ y = [120510, 121483, 122531, 123364, 123998, 124613, 125296, 125936, 126251, 126013, 125322, 124584, 124104, 123825, 123571, 123378, 123348, 123340, 123068, 122451, 121628, 120728, 119879, 119366, 119380, 119555, 119141, 117835, 116191, 114999, 114434, 114026, 113298, 112221, 111134, 110476, 110572, 111394, 112461, 113216, 113635, 114257, 115382, 116457, 116693, 116278, 116397, 117718, 119359, 119944, 119395, 118927, 119344, 120210, 120964, 121914, 123504, 125287, 126469, 127126, 128018, 129288, 130179, 130126, 129506, 129170, 129688, 131154, 133232, 135357, 137273, 139347, 141908, 144403, 145927, 146590, 147500, 149169, 150723, 151147, 150634, 150189, 150444, 151455, 153200, 155620, 158358, 160968, 163280, 165268, 166892, 168385, 170311, 172911, 175732, 178317, 180869, 183748, 186828, 190021, 194035, 199648, 206370, 212766, 218217, 223587, 229958, 237453, 245664, 254589, 264587, 275670, 287290, 298763, 309742, 320445, 331562, 343768, 357175, 371389, 386060, 401205, 416948, 433179, 449517]
52297D49517J5972J5323J4849J4820J4802J3992J2284J0533R474Q917Q311P495
52285E96289O423M830K799J162N33L42l71j593k622l343m180m948m885m072l695
52270E82669m450n504n609m580l165j921r30k35J6m2J10R97K731M866O691P843
52254E79487Q600R417J0278J0830J1070J1384J1886J2228J2174J1867J1382J0579
52242G11182R616R042Q951Q576P178N004K870J164k75j565k744m042n570o809
52228G42578p131o808o888p919r396j0610j1512j2370j3081j3320j3097j2633
52216F17813j1958j1004j0089r737j0014j0343j0131r236p851o257m892m203m163
52203E07935m147l662k966k652k735k627j994j187p31p11q87j031r69n57J31P44
$$ y = [449517, 465489, 480812, 495661, 510481, 525283, 539275, 551559, 562092, 571566, 580483, 588794, 596289, 602712, 607542, 610341, 611503, 612036, 612378, 612007, 610414, 607792, 604449, 600269, 595321, 590436, 586364, 582669, 578219, 572715, 567106, 562526, 559361, 557440, 556510, 556275, 556291, 556249, 556359, 557356, 560087, 564953, 571644, 579487, 588087, 597504, 607782, 618612, 629682, 641066, 652952, 665180, 677354, 689221, 700603, 711182, 720798, 729840, 738791, 747367, 754545, 759549, 762419, 763583, 763308, 761743, 758999, 754957, 749387, 742578, 735447, 728639, 721751, 713832, 704436, 693826, 682314, 669944, 656863, 643543, 630446, 617813, 605855, 594851, 584762, 575025, 565011, 554668, 544537, 535301, 527450, 521193, 516301, 512098, 507935, 503788, 500126, 497160, 494508, 491773, 489146, 487152, 485965, 485234, 484523, 483636, 482605, 481636, 481079, 481210, 481954]
52187D81954R87Q79N77J96o5K5K95J51n58j074o23L79P48Q6p81j101j182j680
52169D79213k458k780k378j751j483j655k027k400k743l129l591l969l947l447
52155D41455k871k748l121l540l629l435l193k998k807k602k325j824j037k23
52141D05102K17J44j46k73j36N8P8j21m00n79n87m99l93j62M31J403K416L081
52123D09634L398L651M012M448N018N921P127Q358R532J0884J2367J3358J3447
52110E11155J3268J3839J5171J6197J6216J5820J6004J6922J7897J8306J7972
52099F88767J6961J5573J4378J3768J3397J2516J0930R202P803O527M950L090
52087H17862J286l25j807l078l911m311m620n208o201p488q757r620r912r897
$$ y = [481954, 482941, 483820, 484397, 484593, 484528, 484553, 484848, 484999, 484441, 483367, 482744, 483123, 483871, 483957, 483176, 482075, 480893, 479213, 476755, 473975, 471597, 469846, 468363, 466708, 464681, 462281, 459538, 456409, 452818, 448849, 444902, 441455, 438584, 435836, 432715, 429175, 425546, 422111, 418918, 415920, 413113, 410511, 408186, 406362, 405325, 405102, 405319, 405463, 405317, 405044, 404908, 404966, 405044, 404923, 404523, 403944, 403357, 402858, 402465, 402303, 402734, 404137, 406553, 409634, 413032, 416683, 420695, 425143, 430161, 436082, 443209, 451567, 461099, 471983, 484350, 497708, 511155, 524423, 538262, 553433, 569630, 585846, 601666, 617670, 634592, 652489, 670795, 688767, 705728, 721301, 735679, 749447, 762844, 775360, 786290, 795492, 803295, 809822, 814772, 817862, 819148, 818823, 817016, 813938, 810027, 805716, 801096, 795888, 789687, 782199, 773442, 763822, 753910, 744013]
52073G44013r944j0037r855r302q610p881o923n667m381l212j901k90J211K210
52059F69431L055M417O247P766Q544Q936R341R629R672R836J0401J0955J0922
52046G79152J0460J0242J0348J0107R093P769O827O269N500M193K612J120l94
52033H63298k252m322n956o777p257q193r725j1296j2527j3691j5065j6291j6852
52020G33094j6855j6916j7312j7666j7522j6915j6306j6150j6524j7010j6979
52009E46939j6156j4878j3672j2741j2031j1629j1720j2120j2236j1575j0229
51998D07952q808p970p828p804p256o389o137o886p746p647o813o401o776p007
51984C06484o254m877l808l328l054k767k681l030l720m403m749m606m100l501
$$ y = [744013, 734069, 724032, 714177, 704875, 696265, 688384, 681461, 675794, 671413, 668201, 666300, 666010, 667221, 669431, 672486, 676903, 683150, 690916, 699460, 708396, 717737, 727366, 737038, 746874, 757275, 768230, 779152, 789612, 799854, 810202, 820309, 829402, 837171, 843998, 850267, 855767, 859960, 862572, 863692, 863298, 861046, 856724, 850768, 843991, 836734, 828541, 818816, 807520, 794993, 781302, 766237, 749946, 733094, 716239, 699323, 682011, 664345, 646823, 629908, 613602, 597452, 580928, 563918, 546939, 530783, 515905, 502233, 489492, 477461, 465832, 454112, 441992, 429756, 418181, 407952, 399144, 391174, 383346, 375542, 368286, 361897, 355760, 348874, 341128, 333481, 326668, 320267, 313491, 306484, 300230, 295353, 291545, 288217, 285163, 282396, 279715, 276685, 272965, 268562, 263813, 259207, 255107, 251606]
51970B51606l056k925l241l882m326m025l142k533k891m039n198n661n261m441
51956A96985l929m045m322m120l602l478l793l687k697j593j335j777k054j922
51942A54631j858k005j873j205m42n8O9L08O00M92k69j370k147k122j429o98m43
51925A40181n80o79n97o03q72j139j016m97l0r1p08j392j553j066l63R2K66M48
51907A29801P12P68L58l07o27k16O20J087P29j8l37p1P5m88j388j728j167k31
51889A27572M10N71M65K60pk61l37j94k6r5l73n63m39o0M99J342K410L199L236
51870A37609K852K866L519M154M180L837L757M157M793N322N403M703L262J611
51856A92025K01j036k308l448m176m525m619m293l441k527k155k285k378k217
$$ y = [251606, 248550, 245625, 242384, 238502, 234176, 230151, 227009, 224476, 221585, 217546, 212348, 206687, 201426, 196985, 193056, 189011, 184689, 180569, 176967, 173489, 169696, 166009, 163312, 161719, 160384, 158607, 156553, 154631, 152773, 150768, 148895, 147690, 147248, 147190, 147259, 147567, 148167, 148659, 148390, 147020, 144873, 142751, 141322, 140624, 140181, 139601, 138922, 138325, 137722, 136850, 135711, 134695, 134198, 134168, 134077, 133369, 131977, 130424, 129358, 128995, 129087, 129353, 129801, 130513, 131281, 131639, 131332, 130705, 130489, 131109, 132196, 132925, 132907, 132570, 132499, 132574, 132086, 130698, 128970, 127803, 127572, 127982, 128553, 129018, 129278, 129271, 129010, 128673, 128479, 128453, 128358, 127985, 127422, 126983, 126923, 127422, 128764, 131174, 134373, 137609, 140461, 143327, 146846, 151000, 155180, 159017, 162774, 166931, 171724, 177046, 182449, 187152, 190414, 192025, 192226, 191190, 188882, 185434, 181258, 176733, 172114, 167821, 164380, 161853, 159698, 157413, 155035, 152818]
51842A52818k142k369k698k774k375j395j4J190J639J335O96j6o86j020p72k64
51826A41153j11l56m64k24p3l39o86o87m77n10r35j415j469q91rN07L39q7j58
51807A33108J08K84L53O26R36P10n0o24o50o00q44j010p07j90K09O41J130J059
51789A34489O6j060j242n94j32k11k15K23N69K42n50j194j412j305j016o73m30
51772A25555l55l55k75lM84J020J225Q95L57J40K86L78K13Q3J97K52j05o29o81
51753A28682j07M63L42l85j014j157j195j583j994j584k12J179J552Q98k2o65
51737A23198j056j327j397j210r27p52p46r09j200j448j386q73q3N74P67N33K69
51720A12027K76L86K68Q8L84J182J738J504R04O48O72M12j52m32k47j20m50r16
$$ y = [152818, 150676, 148307, 145609, 142835, 140460, 139065, 139051, 140241, 141880, 143215, 143911, 143895, 143209, 142189, 141417, 141153, 141042, 140686, 140222, 139998, 139925, 139586, 138900, 138213, 137736, 137226, 136291, 134876, 133407, 132516, 132507, 133014, 133353, 133266, 133108, 133216, 133500, 133853, 134479, 135415, 136125, 136075, 135451, 134801, 134201, 133357, 132347, 131640, 131450, 131659, 132300, 133430, 134489, 134555, 133495, 132253, 131659, 131527, 131316, 131101, 131324, 131893, 132135, 131585, 130391, 128979, 127674, 126658, 125985, 125555, 125200, 124845, 124570, 124567, 125051, 126071, 127296, 128191, 128548, 128688, 128974, 129352, 129565, 129648, 129845, 130097, 129992, 129363, 128682, 128575, 129038, 129380, 128995, 127981, 126824, 125629, 124046, 122052, 120468, 120256, 121435, 122987, 123885, 123863, 123198, 122142, 120815, 119418, 118208, 117281, 116529, 115783, 114874, 113674, 112226, 110840, 109967, 109884, 110458, 111225, 111758, 112027, 112303, 112689, 112957, 113045, 113429, 114611, 116349, 117853, 118757, 119405, 120077, 120489, 120337, 119905, 119658, 119538, 119088, 118172]
51702A18172r72m82K90R29R92L59m01m64K47R99J334J618K152K416J821P95K53
51685A30058K36j21j191k185k197j356n19k26l38m89m43m7O94J468J790J445O79
51668A27258j09o51q06n68j76K6P5M87J506K505K601J835J137J022R15J44r76
51651A36225j584j452j074q08n16q2L52P07J042J181P47k43j271j933k260k317
51635A26714j954j249o69m91l84K6N77Q92R81J059J032O45K8m02m77l49j35J05
51617A25949J72l7j37L31J105J341O72k69o57l79R1M16N82O37N93N15N11O46J039
51598A33121J772K541K628J588n4j253j589j560j699j802j414o56j14J8P2J81
51582A31780k2o93j251j097n28l66p72j035o00K23Q41J117J232J190R33O48N53
$$ y = [118172, 117200, 116718, 117008, 117937, 118929, 119288, 118887, 118423, 118670, 119669, 121003, 122621, 124773, 127189, 129010, 129805, 130058, 130294, 130173, 128982, 126797, 124600, 123244, 122725, 122499, 122161, 121672, 121229, 121182, 121876, 123344, 125134, 126579, 127258, 127149, 126498, 125692, 125124, 124948, 124974, 125049, 125536, 127042, 129547, 132148, 133983, 135120, 136142, 137057, 137201, 136225, 134641, 133189, 132115, 131307, 130791, 130709, 131061, 131768, 132810, 133991, 134738, 134495, 133224, 131291, 129031, 126714, 124760, 123511, 122842, 122351, 121967, 121993, 122570, 123462, 124443, 125502, 126534, 127179, 127207, 126805, 126328, 125979, 125844, 125949, 126121, 126084, 125947, 126278, 127383, 128724, 129396, 129127, 128470, 128091, 128182, 128598, 129180, 129817, 130410, 130925, 131436, 132082, 133121, 134893, 137434, 140062, 141650, 141596, 140343, 138754, 137194, 135495, 133693, 132279, 131623, 131509, 131527, 131599, 131780, 131758, 131065, 129814, 128717, 128189, 127823, 127051, 126016, 125416, 125639, 126480, 127597, 128829, 130019, 130952, 131600, 132153]
51565A32153N29L65K05L21N76N88L50K04K19J43KJ91P51J147J037P44O06L71k50
51546A40252p85n18L58Q27L34n52r01m27M87J305J646J425R04N00L13J10j69k36
51528A44873l2k5n84j380j863k068k324k387j677l83M34J53o49j150j312j448
51512A28178j325o08J85Q1r18j665j359n02l4j82n72r20j054o56L24J195J166
51495A21334L97j31J34P20R23P13N73P73J122J262J037O02L07L77O72Q73Q10M94
51477A32992j22j004j678j467l39Q37J213Q60M60L45K51m3l81n33m69k83q4q7
51459A30468m67j036j326j103o19j88J56M36M66J25l23n20m92n67p93q98q26r23
51441A21570j434k043k229j843j164n50k38l12n97o59k13N21J068J231J129Q21
$$ y = [132153, 132682, 133047, 133252, 133573, 134149, 134737, 135087, 135291, 135510, 135653, 135655, 135846, 136597, 137744, 138781, 139525, 140131, 140502, 140252, 139467, 138949, 139307, 140134, 140468, 139916, 139015, 138588, 139075, 140380, 142026, 143451, 144355, 144855, 145168, 145278, 145109, 144873, 144841, 144816, 144232, 142852, 140989, 138921, 136597, 134210, 132533, 132150, 132584, 132737, 132088, 130938, 129626, 128178, 126853, 126245, 126430, 126511, 125593, 123928, 122569, 122067, 122033, 121851, 121279, 120359, 119305, 118649, 118973, 120168, 121334, 121731, 121600, 121734, 122454, 123377, 124090, 124663, 125436, 126558, 127820, 128857, 129459, 129766, 130143, 130815, 131688, 132498, 132992, 132870, 131866, 130188, 128721, 128382, 129219, 130432, 131292, 131752, 132097, 132348, 132305, 131924, 131391, 130922, 130639, 130555, 130468, 130001, 128965, 127639, 126536, 125917, 125729, 125885, 126321, 126787, 126912, 126589, 126069, 125577, 125010, 124217, 123319, 122493, 121570, 120136, 118093, 115864, 114021, 112857, 112307, 112069, 111757, 111160, 110501, 110288, 110809, 111877, 113108, 114237, 115058]
51425A15058L14j74l55l57o04j034r78j77N63K93p99j635j610j073n14JM07L37
51407A07663l44j152j522j411j060n04K31P60P22L73K61L54J09n91j127j004n34
51390A01224l46n21o10k54M46J169J562J389O73k18q25r25n62N8O18P46K88m40
51372A03472q63o23J42R39J203P11j26n39k26K52J88k69l69J24N85M77P2j11j30
51353A04909l37o13m82J06O06N85J64l31p67j120j324j367j261q98j68P03J294
51336I9699J489J533J414P71l52j190j172p38o86r96r45k62N18Q91R58J001J014
51319A02947Q95O74L70oj25L89J243J511Q06j00k84J26L40R7k46o14j390k551
51301A04082l298k859j323N60J967K333J522J08q19n94L64R79O37l05j034j080
$$ y = [115058, 115372, 115198, 114843, 114486, 113882, 112848, 111870, 111693, 112256, 112549, 111750, 110115, 108505, 107432, 106918, 106919, 107326, 107663, 107319, 106167, 104645, 103234, 102174, 101670, 101901, 102661, 103383, 103756, 104017, 104371, 104480, 103889, 102762, 101758, 101224, 100878, 100357, 99747, 99493, 99939, 101108, 102670, 104059, 104732, 104514, 103689, 102764, 102202, 102260, 102878, 103624, 103912, 103472, 102609, 101986, 102128, 103067, 104270, 104981, 104855, 104316, 104090, 104342, 104530, 104261, 103892, 104016, 104601, 105078, 105150, 105039, 104909, 104572, 103959, 103477, 103583, 104189, 104774, 104938, 104607, 103840, 102720, 101396, 100029, 98768, 97870, 97702, 98405, 99699, 101188, 102721, 104135, 104906, 104554, 103364, 102192, 101454, 100768, 99772, 98827, 98565, 99083, 99974, 100932, 101933, 102947, 103842, 104516, 104886, 104880, 104755, 105144, 106387, 107898, 108704, 108604, 108320, 108446, 108786, 108883, 108637, 108023, 106633, 104082, 100784, 97925, 96602, 97162, 99129, 101462, 102984, 103092, 102273, 101679, 102043, 103022, 103659, 103354, 102320, 101240]
51285A01240o37j95K5K66Q60J719K324K211J388L39l17k34L76Q74Q33M74L11L87
51267A12244K45l00q19q80o33m38j88M69J422K031J903J327Q28N46K66q2k46L1
51249A17726O21J087J109P97N97Q77J662K670L518L869L545K650J560P35M85P70
51233A44278J188J203N85l20q79p57j63M89J017J483J931K226K136J637J104J015
51217A58173J362J570J312J062J405J930J608L13p64o75L6K07l19o63k35O44J329
51200A68295J382O05p97k034k298j658r86q39r60r26p40o05m96k73O0M13N70J50
51182A58863r98k225k552j908j316j552k162k291j898j498j195p32k39o6J6N28
51166A38775J179R25m83j811j745m92O68R78P19L23j75p01q41l68L13O18M61J17
$$ y = [101240, 100603, 100408, 100433, 100699, 101559, 103278, 105602, 107813, 109201, 109540, 109223, 108989, 109365, 110239, 111072, 111546, 111857, 112244, 112489, 112189, 111370, 110490, 109857, 109419, 109231, 109700, 111122, 113153, 115056, 116383, 117211, 117757, 118023, 117941, 117695, 117726, 118347, 119434, 120543, 121340, 121937, 122814, 124476, 127146, 130664, 134533, 138078, 140728, 142288, 143023, 143508, 144278, 145466, 146669, 147254, 146934, 146055, 145298, 145135, 145624, 146641, 148124, 150055, 152281, 154417, 156054, 157158, 158173, 159535, 161105, 162417, 163479, 164884, 166814, 168422, 168735, 167971, 167296, 167332, 167539, 167220, 166557, 166322, 166966, 168295, 169677, 170282, 169485, 167451, 165153, 163495, 162509, 161670, 160710, 159784, 159044, 158439, 157943, 157670, 157730, 158143, 158713, 158863, 157865, 155640, 153088, 151180, 149864, 148312, 146150, 143859, 141961, 140463, 139268, 138536, 138297, 138231, 138247, 138775, 139954, 140879, 140396, 138585, 136840, 136348, 137016, 137994, 138713, 139036, 138861, 138160, 137319, 136951, 137264, 137882, 138343, 138460]
51148A38460l12q68j275j063k26O22R56Q55O86O26P39J171J883K392K239J554
51132A48439Q19K18l39p63p75m11k1K12L80N11N81P76J209J400P48l91q99l24
51114A51370N86J107J462K028K475K366J978J688J231L25l71m3Q68J178P15M36
51098A69399P68R67N24J18O18J822K873L319L224K655J654N67p6L5Q15J814K371
51081A93467K132J502J199J225R37K18p2O91J887K399K004J347R02O18M20L53
51065B11229K36k87j228k138k617k668k512k364k342k384k200j579o56J89O76
51050A89355P40M70R9j05p8N9L43R49J621J597N66o88j079n40Q4K20M7j41l69
51031A93150n53k93N97J666K281K298K093K064K303K605K680K493K341K493K797
$$ y = [138460, 138148, 137280, 136005, 134942, 134716, 135338, 136294, 137149, 137835, 138461, 139200, 140371, 142254, 144646, 146885, 148439, 149258, 149476, 149137, 148374, 147599, 147188, 147167, 147379, 147759, 148270, 148851, 149627, 150836, 152236, 152984, 152593, 151694, 151370, 151956, 153063, 154525, 156553, 159028, 161394, 163372, 165060, 166291, 166616, 166245, 166202, 167070, 168248, 168963, 169399, 170167, 171134, 171658, 171776, 172394, 174216, 177089, 180408, 183632, 186287, 187941, 188508, 188432, 188467, 189282, 191096, 193467, 195599, 197101, 198300, 199525, 200462, 200680, 200608, 201299, 203186, 205585, 207589, 208936, 209838, 210456, 210876, 211229, 211465, 211178, 209950, 207812, 205195, 202527, 200015, 197651, 195309, 192925, 190725, 189146, 188490, 188679, 189355, 190095, 190565, 190664, 190559, 190481, 190540, 190883, 191832, 193453, 195050, 195616, 194928, 193849, 193309, 193393, 193613, 193660, 193519, 193150, 192597, 192304, 192901, 194567, 196848, 199146, 201239, 203303, 205606, 208211, 210891, 213384, 215725, 218218, 221015]
51016B21015K854K534K097J827J859K251K932L499L464K817K145K064K735L763
51002B57856M474M353L672L493M533O096O778O296N856O428P471P928P860Q207
50988C41301R327J0614J1546J2320J3328J4696J6450J8635K0942K2762K4026K5625
50976E41572K8428L2125L5579L8315M1070M4593M8416N1346N2964N3960N4896
50965A023264N5351N4712N3287N1769M9817M6092M0027L2711K5574J8714J1344
50954A462662L458l814r588j4218j8571k2838k6446k8871l0150l0668l0681l0157
50942A220118k8960k7245k5513k4174k3017k1526j9758j8634j8972k0452k1943
50931I69924k2866k3794k5489k7644k9008k8703k7150k5484k4299k3255k1876
$$ y = [221015, 223869, 226403, 228500, 230327, 232186, 234437, 237369, 240868, 244332, 247149, 249294, 251358, 254093, 257856, 262330, 266683, 270355, 273848, 278381, 284477, 291255, 297551, 303407, 309835, 317306, 325234, 333094, 341301, 350628, 361242, 372788, 385108, 398436, 413132, 429582, 448217, 469159, 491921, 515947, 541572, 570000, 602125, 637704, 676019, 717089, 761682, 810098, 861444, 914408, 968368, 1023264, 1078615, 1133327, 1186614, 1238383, 1288200, 1334292, 1374319, 1407030, 1432604, 1451318, 1462662, 1466120, 1462306, 1452718, 1438500, 1419929, 1397091, 1370645, 1341774, 1311624, 1280956, 1250275, 1220118, 1191158, 1163913, 1138400, 1114226, 1091209, 1069683, 1049925, 1031291, 1012319, 991867, 969924, 947058, 923264, 897775, 870131, 841123, 812420, 785270, 759786, 735487, 712232, 690356]
50920F90356k0396j9476j9169j8559j6725j3965j1629j0632j0460r882q483p025
50908E23955o258n934n244l928k521j586j145q52m10L16J278K195K725K869L058
50893E08518L737M899O064O675O478N746N107N045N479N918O083O160O524P377
50879E89810Q662J0091J1175J1607J1742J2405J3994J5977J7556J8595J9668K1342
50867G62624K3706K6460K9173L1572L3949L7152M1897M8003N4629O1264O8172
50856A218601P5710Q3589R1083R7921J04614J11730J18796J24285J26851J26567
50846B279747J24528J21217J15674J06514R3374P6980N8201L7749J6695l515k1846
50835C005318l8108n2310o4037p2713p8182q0640q0163p6741p0802o3492n6212
$$ y = [690356, 669960, 650484, 631315, 612756, 596031, 582066, 570437, 559805, 549345, 539463, 530980, 523955, 517697, 511763, 506519, 502591, 500070, 498484, 497339, 496487, 496077, 496393, 497671, 499866, 502591, 505460, 508518, 512255, 517154, 523218, 529893, 536371, 542117, 547224, 552269, 557748, 563666, 569749, 575909, 582433, 589810, 598472, 608563, 619738, 631345, 643087, 655492, 669486, 685463, 703019, 721614, 741282, 762624, 786330, 812790, 841963, 873535, 907484, 944636, 986533, 1034536, 1089165, 1150429, 1218601, 1294311, 1377900, 1468983, 1566904, 1671518, 1783248, 1902044, 2026329, 2153180, 2279747, 2404275, 2525492, 2641166, 2747680, 2841054, 2918034, 2976235, 3013984, 3030679, 3027164, 3005318, 2967210, 2914900, 2850863, 2778150, 2699968, 2619328, 2539165, 2462424, 2391622, 2328130, 2271918]
50824B271918m9900m4760m0647l7617l6044l6136l7534l9591m1945m4613m7586
50813A815545n0587n3164n4817n5160n4167n2313n0057m7211m3197l7960l2179
50802A284733k6364k0260j3493o455M6N871J1720J8134K4726L0626L5425L9384
50790A384093M2803M5454M6691M6063M3642L9818L4975K9469K3762J8290J3209
50779A768269Q418L830n53m903r582j4876k0676k6546l1959l6593m0558m4203
50767A550068m7475m9617m9956m8875m7521m6383m4762m1837l7784l3456k9405
50756A072997k5683k2205j8758j4951j0781p026m486k740l32L700Q840J3906J8353
50743A010834K2580K7199L2398L7925M3545M9296N5263O1156O6409P0729P4274
$$ y = [2271918, 2222018, 2177258, 2136611, 2098994, 2062950, 2026814, 1989280, 1949689, 1907744, 1863131, 1815545, 1764958, 1711794, 1656977, 1601817, 1547650, 1495337, 1445280, 1398069, 1354872, 1316912, 1284733, 1258369, 1238109, 1224616, 1218161, 1218207, 1224078, 1235798, 1253932, 1278658, 1309284, 1344709, 1384093, 1426896, 1472350, 1519041, 1565104, 1608746, 1648564, 1683539, 1713008, 1736770, 1755060, 1768269, 1776687, 1780517, 1779964, 1775061, 1765479, 1750603, 1729927, 1703381, 1671422, 1634829, 1594271, 1550068, 1502593, 1452976, 1403020, 1354145, 1306624, 1260241, 1215479, 1173642, 1135858, 1102402, 1072997, 1047314, 1025109, 1006351, 991400, 980619, 973593, 969107, 966367, 966035, 969735, 978575, 992481, 1010834, 1033414, 1060613, 1093011, 1130936, 1174481, 1223777, 1279040, 1340196, 1406605, 1477334, 1551608]
50732A551608P7013P8260P7346P4556P0810O6383O0465N2149M1444K9096J5818
50721B194948J961j2223k6224l9080m9510n6462n9694n9775n7575n3891m9347
50710A733128m4242l8580l2538k6932k2673j9843j7872j6682j6872j8501k0544
50699A457849k2104k3520k5444k7377k8065k7136k5381k3304k0414j6255j1333
50688A207516o417j463M209J0903J8258K5843L3555M1521M9911N8865O8259P7603
50676A588563Q6458R4852J02863J09739J13893J14244J11298J06480J00538R3066
50666B621994Q3668P3024O2483N2886M4169L5919K7734J9088R411j312j2374k3082
50654B993608l3469m3970n4422o3708p0422p3843p4284p2602o9390o4627n8122
$$ y = [1551608, 1628621, 1706881, 1784227, 1858783, 1929593, 1995976, 2056441, 2108590, 2150034, 2179130, 2194948, 2196909, 2184686, 2158462, 2119382, 2069872, 2013410, 1953716, 1893941, 1836366, 1782475, 1733128, 1688886, 1650306, 1617768, 1590836, 1568163, 1548320, 1530448, 1513766, 1496894, 1478393, 1457849, 1435745, 1412225, 1386781, 1359404, 1331339, 1304203, 1278822, 1255518, 1235104, 1218849, 1207516, 1201099, 1199636, 1203845, 1214748, 1233006, 1258849, 1292404, 1333925, 1383836, 1442701, 1510960, 1588563, 1675021, 1769873, 1872736, 1982475, 2096368, 2210612, 2321910, 2428390, 2528928, 2621994, 2705662, 2778686, 2841169, 2894055, 2938224, 2974143, 3001877, 3020965, 3030376, 3029064, 3016690, 2993608, 2960139, 2916169, 2861747, 2798039, 2727617, 2653774, 2579490, 2506888, 2437498, 2372871, 2314749]
50643B314749n0251m2008l4290k7369k1245j6206j2704j0842j0332j0863j2175
50632B066464j3898j5700j7734k0420k3637k6461k8026k8424k8339k8022k7000
50621A808803k4762k1322j7015j2149p034k111K268N991Q904J0644J1149J1121
50609A774487J1415J1829J1185Q733M854l1o494j5170k5126l4251m1321m6785
50597A653325n1369n4855n6709n7054n6304n4438n1461m8068m5052m2262l9004
50586A096749l5237l1645k8551k5607k2583j9692j6944j4002j0922q342o545m942
50574H71737k915n63J785M306P291J0429J3118J5369J7892K1308K5647L0490L5265
50561A051159L9607M3821M8867N5385O2768O9502P4503P7790P9937Q1234Q1398
$$ y = [2314749, 2264498, 2222490, 2188200, 2160831, 2139586, 2123380, 2110676, 2099834, 2089502, 2078639, 2066464, 2052566, 2036866, 2019132, 1998712, 1975075, 1948614, 1920588, 1892164, 1863825, 1835803, 1808803, 1784041, 1762719, 1745704, 1733555, 1726521, 1724410, 1726678, 1732669, 1741573, 1752217, 1763366, 1774487, 1785902, 1797731, 1808916, 1817649, 1822503, 1822472, 1815978, 1800808, 1775682, 1741431, 1700110, 1653325, 1601956, 1547101, 1490392, 1433338, 1377034, 1322596, 1271135, 1223067, 1178015, 1135753, 1096749, 1061512, 1029867, 1001316, 975709, 953126, 933434, 916490, 902488, 891566, 883224, 876679, 871737, 868822, 868259, 870044, 874350, 881641, 892070, 905188, 920557, 938449, 959757, 985404, 1015894, 1051159, 1090766, 1134587, 1183454, 1238839, 1301607, 1371109, 1445612, 1523402, 1603339, 1684573, 1765971]
50550A765971P9868P6349P1292O5797O0797N6492N2765M9948M8577M8333M7878
50539B424067M6023M2756L8845L4814L0736K6929K4317K3852K5679K9055L3096
50528B780169L7486M2351M7464N1911N4652N5290N3983N0762M5288L7312K7028
50517C283696J4915J505j2568k6586m0093n3088o5604p7162q6746r3391r6715
50506B748163r6967r4678r0203q3577p4805o4221n2505m0379k8371j6825n936
50495B099696M254J3701K2107K8877L3279L4555L2037K5545J5754L821r471k3913
50483B280242l9105n3885o6826p7049q4285q8459q9739q8875q6906q4304q0788
50472A440021p6102p0742o5563o0885n6285n1304m6104m1238l6939l2918k8940
$$ y = [1765971, 1845839, 1922188, 1993480, 2059277, 2120074, 2176566, 2229331, 2279279, 2327856, 2376189, 2424067, 2470090, 2512846, 2551691, 2586505, 2617241, 2644170, 2668487, 2692339, 2718018, 2747073, 2780169, 2817655, 2860006, 2907470, 2959381, 3014033, 3069323, 3123306, 3174068, 3219356, 3256668, 3283696, 3298611, 3300116, 3287548, 3260962, 3220869, 3167781, 3102177, 3025015, 2938269, 2844878, 2748163, 2651196, 2556518, 2466315, 2382738, 2307933, 2243712, 2191207, 2150828, 2122457, 2105632, 2099696, 2103950, 2117651, 2139758, 2168635, 2201914, 2236469, 2268506, 2294051, 2309805, 2313626, 2304155, 2280242, 2241137, 2187252, 2120426, 2043377, 1959092, 1870633, 1780894, 1692019, 1605113, 1520809, 1440021, 1363919, 1293177, 1227614, 1166729, 1110444, 1059140, 1013036, 971798, 934859, 901941, 873001]
50461H73001k5280k2367k0058j7821j5560j3773j2572j1168q838o119m326l968
50449G11151m250m148l369k112n55J053K321L194M155N616P397R172J1012J3063
50435G53700J5072J6873J9010K2206K6244L0126L3292L6027L8589M0697M2182
50424A074018M3396M4582M5441M5782M6132M7064M8342M9332M9952N0539N1025
50413A595605N0980N0386M9604M8481M6254M2604L8234L3956K9634K4459J8048
50402B028245J0788L280m296j2191k0681k9649l8554m6851n4250o0439o4802o6881
50390A643719o7069o6190o4311o0632n4857m7993m1274l4761k7691j9879j2105
50379A146957n225M74N148R114J2642J5498J6803J5847J3006R238M765r77q019
$$ y = [873001, 847721, 825354, 805296, 787475, 771915, 758142, 745570, 734402, 725564, 719445, 715119, 711151, 706901, 702753, 699384, 697272, 696717, 697770, 700091, 703285, 707440, 713056, 720453, 729625, 740637, 753700, 768772, 785645, 804655, 826861, 853105, 883231, 916523, 952550, 991139, 1031836, 1074018, 1117414, 1161996, 1207437, 1253219, 1299351, 1346415, 1394757, 1444089, 1494041, 1544580, 1595605, 1646585, 1696971, 1746575, 1795056, 1841310, 1883914, 1922148, 1956104, 1985738, 2010197, 2028245, 2039033, 2042313, 2038017, 2025826, 2005145, 1975496, 1936942, 1890091, 1835841, 1775402, 1710600, 1643719, 1576650, 1510460, 1446149, 1385517, 1330660, 1282667, 1241393, 1206632, 1178941, 1159062, 1146957, 1141732, 1142206, 1147354, 1156468, 1169110, 1184608, 1201411, 1217258, 1230264, 1239502, 1244267, 1243290, 1235271]
50366A235271j5290k1634k6751l0723l3323l4466l4830l5286l5838l5736l4586
50355H96808l2827l1125k9710k8406k6962k5255k3355k1462j9659j7858j6081
50344F24108j4606j3574j2659j1479j0153r055q110o805n084l706l485m297n157
50331E15938n161m248l021k062j414p86n2N80R43J161J476K002K800L977N528
50316E17661P192Q713J0067J1248J2085J2610J3296J4437J5555J5913J5547J5082
50304F69406J4602J3403J1172Q713P127O556O180N100K939q8l388o437r266j2202
50290G13817j5030j6886j7317j6952j6643j6394j5709j4598j3508j2463j1082
50279E47235r401p846o359m323j659O86J759J682J348J462K159L177M002M157
$$ y = [1235271, 1219981, 1198347, 1171596, 1140873, 1107550, 1073084, 1038254, 1002968, 967130, 931394, 896808, 863981, 832856, 803146, 774740, 747778, 722523, 699168, 677706, 658047, 640189, 624108, 609502, 595928, 583269, 571790, 561637, 552582, 544472, 537667, 532583, 528877, 525392, 521095, 515938, 510777, 506529, 503508, 501446, 500032, 499246, 499194, 499774, 500717, 501878, 503354, 505356, 508156, 512133, 517661, 524853, 533566, 543633, 554881, 566966, 579576, 592872, 607309, 622864, 638777, 654324, 669406, 684008, 697411, 708583, 717296, 724423, 730979, 737159, 742259, 745198, 745110, 741722, 735285, 726019, 713817, 698787, 681901, 664584, 647632, 630989, 614595, 598886, 584288, 570780, 558317, 547235, 537834, 529988, 523629, 519306, 517647, 518333, 520092, 521774, 523122, 524584, 526743, 529920, 533922, 538079]
50265E38079L691L229L234L549L884M382N211N972O078N582N082M817M431L677
50251F00898K934K678K846K904K475J705J085R93J364J803K080K368K933L701
50237F32767M339M651M689M676M974N944P419Q538Q643Q221Q418R605J1056J2108
50223G36048J3004J4287J5986J7871J9985K2415K4930K7409L0327L4250L9040
50212I95552M4160M9556N5627O2509P0029P8343Q7737R7762J07320J15874J23788
50201A888257J31013J36145J37420J34352J27750J18660J07931R6716Q6439P7950
50191C042633P0998O4526N7183M7559L4517J7485l639k8774n7213q6852j14404
50180C044019j36943j53184j63294j67881j67480j62681j54231j43015j30121
$$ y = [538079, 541770, 544999, 548233, 551782, 555666, 560048, 565259, 571231, 577309, 582891, 587973, 592790, 597221, 600898, 603832, 606510, 609356, 612260, 614735, 616440, 617525, 618518, 619882, 621685, 623765, 626133, 629066, 632767, 637106, 641757, 646446, 651122, 656096, 662040, 669459, 677997, 686640, 694861, 703279, 712884, 723940, 736048, 749052, 763339, 779325, 797196, 817181, 839596, 864526, 891935, 922262, 956512, 995552, 1039712, 1089268, 1144895, 1207404, 1277433, 1355776, 1443513, 1541275, 1648595, 1764469, 1888257, 2019270, 2155415, 2292835, 2427187, 2554937, 2673597, 2781528, 2878244, 2964683, 3042633, 3113631, 3178157, 3235340, 3282899, 3317416, 3334901, 3331262, 3302488, 3245275, 3158423, 3044019, 2907076, 2753892, 2590598, 2422717, 2255237, 2092556, 1938325, 1795310, 1665189]
50171A665189j16810j04072r2273q1376p1436o2608n4825m7872m1715l6497l2107
50160I23598k8131k4353k1009j8450j6779j5856j5356j4666j3210j1150r411q632
50148G26595q323p584o406n597n510n500m893l788k571j172N41K027K512K123
50134F82454J887K501L681M911O219P803R343J0283J0646J1021J1732J2507J3039
50121G88027J3513J4304J5442J6598J7451J7869J7922J7921J8336J9373K0642
50110I77398K1576K2196K3130K4769K6732K8507L0306L2842L6327M0248M4302
50099A308333M8978N4856O1708O8885P6439Q5203R5733J07651J20343J33829J48611
50088B310569J64870J82174J99711K16345K30457K40265K44646K43593K37891
$$ y = [1665189, 1548379, 1444307, 1352034, 1270658, 1199222, 1136614, 1081789, 1033917, 992202, 955705, 923598, 895467, 871114, 850105, 831655, 814876, 799020, 783664, 768998, 755788, 744638, 735227, 726595, 718272, 710688, 704282, 698685, 693175, 687675, 682782, 678994, 676423, 675251, 675792, 677819, 680331, 682454, 684341, 686842, 690523, 695434, 701653, 709456, 718799, 729082, 739728, 750749, 762481, 774988, 788027, 801540, 815844, 831286, 847884, 865335, 883204, 901126, 919047, 937383, 956756, 977398, 998974, 1021170, 1044300, 1069069, 1095801, 1124308, 1154614, 1187456, 1223783, 1264031, 1308333, 1357311, 1412167, 1473875, 1542760, 1619199, 1704402, 1800135, 1907786, 2028129, 2161958, 2310569, 2475439, 2657613, 2857324, 3073669, 3304126, 3544391, 3789037, 4032630, 4270521]
50079D270521K28554K16835K04417J93006J83318J74511J64733J52114J35015
50070E923024J11673Q0461M1119m392n2750j00839j46318j87029k20923k46890
50060E197136k65146k76358k80857k79008k71932k61149k47714k32149k15068
50051B867755j97303j79470j61858j44813j28794j14076j00769q9120p9324p1109
50041A601119o3912n7477n1833m6764m1856l7183l3278l0284k7748k5506k4053
50030A161225k3621k3475k2800k1748k0968k0434j9528j8135j6861j6124j5619
50019I41912j4861j3794j2697j1810j1183j0672j0004r046p989p083o323n596
50007H20854m981m563m125l406k548j881j420j022q54j119j467j288n86M1L83
$$ y = [4270521, 4499075, 4715910, 4920327, 5113333, 5296651, 5471162, 5635895, 5788009, 5923024, 6034697, 6115158, 6156277, 6151885, 6099135, 5998296, 5851978, 5664949, 5444026, 5197136, 4931990, 4655632, 4374775, 4095767, 3823835, 3562686, 3314972, 3082823, 2867755, 2670452, 2490982, 2329124, 2184311, 2055517, 1941441, 1840672, 1751552, 1672228, 1601119, 1537207, 1479730, 1427897, 1381133, 1339277, 1302094, 1268816, 1238532, 1210784, 1185278, 1161225, 1137604, 1114129, 1091329, 1069581, 1048613, 1028179, 1008651, 990516, 973655, 957531, 941912, 927051, 913257, 900560, 888750, 877567, 866895, 856891, 847845, 839856, 832773, 826450, 820854, 815873, 811310, 807185, 803779, 801231, 799350, 797930, 796908, 796054, 794935, 793468, 792180, 791594, 791635, 792018]
49992G92018Q16J473J974K245K856M172N858P618R740J2339J4779J6584J8414
49979H90886K1311K5371K9917L4703M0126M6422N3439O1193O9867P9291Q9072
49968A441598R9224J10002J21045J31455J40670J48482J53985J55432J51661J43231
49958B796785J31817J19059J06303R4764Q5226P7601P0889O3287N2307L5659J2596
49947C646293j5830m7956q2290j16735j47952j72637j89329j98354k00385j95894
49937B278931j85909j72303j57024j41414j26311j12237r9337q7524p6817o7250
49927A052805n8619n0817m4283l9398l5536l1492k7056k3282k0900j9241j7371
49916F84810j5470j4344j3937j3381j2288j1192j0617j0428j0311j0232j0159
$$ y = [792018, 792834, 794307, 796281, 798526, 801382, 805554, 811412, 819030, 828770, 841109, 855888, 872472, 890886, 912197, 937568, 967485, 1002188, 1042314, 1088736, 1142175, 1203368, 1273235, 1352526, 1441598, 1540822, 1650824, 1771869, 1903324, 2043994, 2192476, 2346461, 2501893, 2653554, 2796785, 2928602, 3047661, 3153964, 3248728, 3333954, 3411555, 3482444, 3545731, 3598038, 3633697, 3646293, 3630463, 3582507, 3500217, 3383482, 3235530, 3062893, 2873564, 2675210, 2474825, 2278931, 2093022, 1920719, 1763695, 1622281, 1495970, 1383733, 1284396, 1196872, 1120055, 1052805, 994186, 943369, 899086, 859688, 824152, 792660, 765604, 742322, 721422, 702181, 684810, 669340, 654996, 641059, 627678, 615390, 604198, 593581, 583153, 572842, 562610, 552451]
49905E52451r826r173q641q603q698q130o645m880l737l577m084m700n055m994
49891D61708m441l483k584k395l127m146m532m033l235k759k605k514k577l011
49877D16266l556l580k946k226j846j473o78K29N73L78L35O74P65J35o81q27k65
49860D01277L22N32N79P02Q17P89O39L93Q4p0J26M47N12M38O67J063Q09l79j562
49841D08185j665q50k34m62j207j878k208k127j613q69j98L98J193K122K637K330
49825D03554J391L33m54p50m04M23J170J336J009P56R87J571K016J896J222M20
49809D16476m9j35j53l46o36q93j159j483j711j664j435j262j234j256j251j244
49793D00565j237j228j322j587j844j751j227o17l67n36p23m86J79P63P36P9p21
$$ y = [552451, 542625, 533452, 524811, 516208, 507510, 499380, 492735, 487855, 484118, 480541, 476457, 471757, 466702, 461708, 457267, 453784, 451200, 448805, 445678, 441532, 437000, 432967, 429732, 426973, 424368, 421854, 419277, 416266, 412710, 409130, 406184, 403958, 402112, 400639, 399961, 400190, 400763, 401141, 401476, 402150, 402915, 403050, 402369, 401542, 401277, 401599, 402131, 402710, 403412, 404229, 405018, 405657, 406050, 406134, 406064, 406190, 406637, 407149, 407587, 408254, 409317, 410126, 409747, 408185, 406520, 405670, 405436, 404974, 403767, 401889, 399681, 397554, 395941, 395072, 394874, 395272, 396465, 398587, 401224, 403554, 404945, 405278, 404824, 404074, 403670, 404093, 405263, 406599, 407608, 408364, 409351, 410922, 412938, 414834, 416056, 416476, 416427, 416292, 416139, 415793, 415157, 414264, 413105, 411622, 409911, 408247, 406812, 405550, 404316, 403060, 401809, 400565, 399328, 398100, 396778, 395191, 393347, 391596, 390369, 389752, 389385, 388849, 388126, 387640, 387819, 388582, 389318, 389397, 388676]
49776C88676j181j190q81l94O1J40k32n59k47N82J159J059O88N69O06M55K84M66
49758C90061P94O58J25R0R59J820J524K61o10k31Q86J653J592J003N08O10J371
49741D03074K202K305J552O85M23O51Q10P06N80O38R12J456K177K636K500K106
49725D25413K001K042J579N83p9K27J142K010K717L369L680L375K844K673K790
49710D56366K698K472K691L356L686L228K463K019J810J534J406J814K498K798
49696D90839K558K274K288K406K420K499K835L246L400L199K787K351K097K215
49682E27414K608K879K794K596K620K763K671K376K328K747L263L310K696J724
49668E64789Q99O37R94J579J872J776J718K062K626K926K738K260J821J659J866
$$ y = [388676, 387495, 386305, 385424, 385030, 385091, 385231, 384999, 384440, 384193, 384775, 385934, 386993, 387681, 388250, 388856, 389311, 389595, 390061, 390855, 391513, 391638, 391728, 392687, 394507, 396031, 396292, 395682, 395451, 396337, 397990, 399582, 400585, 401093, 401703, 403074, 405276, 407581, 409133, 409818, 410241, 410892, 411702, 412408, 412988, 413626, 414538, 415994, 418171, 420807, 423307, 425413, 427414, 429456, 431035, 431618, 431539, 431766, 432908, 434918, 437635, 441004, 444684, 448059, 450903, 453576, 456366, 459064, 461536, 464227, 467583, 471269, 474497, 476960, 478979, 480789, 482323, 483729, 485543, 488041, 490839, 493397, 495671, 497959, 500365, 502785, 505284, 508119, 511365, 514765, 517964, 520751, 523102, 525199, 527414, 530022, 532901, 535695, 538291, 540911, 543674, 546345, 548721, 551049, 553796, 557059, 560369, 563065, 564789, 565688, 566325, 567319, 568898, 570770, 572546, 574264, 576326, 578952, 581878, 584616, 586876, 588697, 590356, 592222]
49653E92222K322K673K607K234K076K582L626M548M752M373M198M722N393N191
49639F43519M011K938K930L620L974L704L360L244L001K483K230K713L589M162
49625F89478M258M226M303M366M311M235M271M366M340M094L818L913M528N179
49611G49686N210M640M267M662N493O049O165O180O294O386O366O275O105N832
49597H29610N649N746N920N804N453N339N672O120O377O630P186P913Q274P956
$$ y = [592222, 594544, 597217, 599824, 602058, 604134, 606716, 610342, 614890, 619642, 624015, 628213, 632935, 638328, 643519, 647530, 650468, 653398, 657018, 660992, 664696, 668056, 671300, 674301, 676784, 679014, 681727, 685316, 689478, 693736, 697962, 702265, 706631, 710942, 715177, 719448, 723814, 728154, 732248, 736066, 739979, 744507, 749686, 754896, 759536, 763803, 768465, 773958, 780007, 786172, 792352, 798646, 805032, 811398, 817673, 823778, 829610, 835259, 841005, 846925, 852729, 858182, 863521, 869193, 875313, 881690, 888320, 895506, 903419, 911693, 919649]
$$ [...]
##END NTUPLES=NMR SPECTRUM
##END=
