##TITLE=NES1101_ptc160_9887098_N1h69xq1Zi
##JCAMPDX= 6.0         $$ Bruker NMR JCAMP-DX V2.0
##DATA TYPE= NMR SPECTRUM
##DATA CLASS= NTUPLES
##ORIGIN= BRUKER
##OWNER= Administrator
$$ 1.72 TOPSPIN		Version 2.1
$$ 2016-08-28 17:08:26.070 -0500  Administrator@X
$$ Compression mode = diff/dup
##.OBSERVE FREQUENCY= 400.02188249412
##.OBSERVE NUCLEUS= ^1H
##.ACQUISITION MODE= SIMULTANEOUS (DQD)
##.ACQUISITION SCHEME= undefined
##.AVERAGES= 8
##.DIGITISER RES= 22
##SPECTROMETER/DATA SYSTEM= spect
##.PULSE SEQUENCE= zg30
##.SOLVENT NAME= COFFEE_meoh
##.SHIFT REFERENCE= INTERNAL, COFFEE_meoh, 1, 14.98509
##AUDIT TRAIL= $$ (NUMBER, WHEN, WHO, WHERE, PROCESS, VERSION, WHAT)
$$ ##TITLE= Audit trail, TOPSPIN		Version 2.1
$$ ##JCAMPDX= 5.01
$$ ##ORIGIN= Bruker BioSpin GmbH
$$ ##OWNER= Administrator
$$ $$ E:\/data/COFFEE/nmr/NES1101_ptc160_9887098_N1h69xq1Zi/10/pdata/1/auditp.txt
$$ ##AUDIT TRAIL=  $$ (NUMBER, WHEN, WHO, WHERE, PROCESS, VERSION, WHAT)
(   1,<2016-08-28 17:08:18.929 -0500>,<Administrator>,<X>,<go>,<TOPSPIN 2.1>,
      <created by zg
	started at 2016-08-28 17:07:13.195 -0500,
	POWCHK enabled, PULCHK disabled,
       configuration hash MD5:
       21 0F 79 D6 B3 7B B4 F6 88 20 88 DB 03 48 BD 9F
       data hash MD5: 64K
       D0 20 4B 95 43 C8 8E CA 99 90 85 CF 03 B8 64 9C>)
(   2,<2016-08-28 17:08:22.054 -0500>,<Administrator>,<X>,<proc1d>,<TOPSPIN 2.1>,
      <Start of raw data processing
       efp LB = 0 FT_mod = 6 PKNL = 1 PHC0 = 0 PHC1 = 0 SI = 32K 
       data hash MD5: 32K
       73 6F 7C B8 55 AA 50 2A 75 9C 64 48 36 45 B3 C3>)
(   3,<2016-08-28 17:08:22.336 -0500>,<Administrator>,<X>,<proc1d>,<TOPSPIN 2.1>,
      <pk PHC0 = 92.66968 PHC1 = 0 
       data hash MD5: 32K
       80 40 F9 B1 DA 7C 17 3C 01 8F B5 80 0D 28 0A C1>)
(   4,<2016-08-28 17:08:22.445 -0500>,<Administrator>,<X>,<proc1d>,<TOPSPIN 2.1>,
      <abs ABSG = 1 
       data hash MD5: 32K
       0E CB F0 03 D9 B3 AB 12 1B 8A 5E 10 1C F2 EC 03>)
(   5,<2016-08-28 17:08:22.508 -0500>,<Administrator>,<X>,<proc1d>,<TOPSPIN 2.1>,
      <abs ABSG = 2 
       data hash MD5: 32K
       BD 28 49 10 38 11 3A 0E 64 8F A3 F5 AC 4E 0D 60>)
(   6,<2016-08-28 17:08:22.554 -0500>,<Administrator>,<X>,<proc1d>,<TOPSPIN 2.1>,
      <abs ABSG = 3 
       data hash MD5: 32K
       83 12 EC 2C 66 7B D4 51 E8 FC 08 53 65 AB CE 87>)
(   7,<2016-08-28 17:08:22.617 -0500>,<Administrator>,<X>,<proc1d>,<TOPSPIN 2.1>,
      <abs ABSG = 4 
       data hash MD5: 32K
       95 56 EB 96 31 4F E0 CC 6C FE 31 16 88 3A F6 62>)
(   8,<2016-08-28 17:08:22.664 -0500>,<Administrator>,<X>,<proc1d>,<TOPSPIN 2.1>,
      <abs ABSG = 5 
       data hash MD5: 32K
       3F 90 0D FC B9 11 49 24 99 75 7F 00 FA 82 FE 8C>)
$$ ##END=
$$ 
$$ $$ hash MD5
$$ $$ 68 3E 7A 50 53 DB B4 FB B1 DB E8 7C 43 44 E0 52
##$RELAX= 
##$RELAX= 
##$RELAX= 
##$RELAX= 
##$RELAX= 
##$RELAX= 
##$RELAX= 
$$ Bruker specific parameters
$$ --------------------------
##$DU= <E:\>
##$EXPNO= 10
##$NAME= <NES1101_ptc160_9887098_N1h69xq1Zi>
##$PROCNO= 1
$$ [...]
150 150 150 150 150 150 150 150
##$TP07= 0
##$TPNAME0= <>
##$TPNAME1= <>
##$TPNAME2= <>
##$TPNAME3= <>
##$TPNAME4= <>
##$TPNAME5= <>
##$TPNAME6= <>
##$TPNAME7= <>
##$TPOAL= (0..7)
0.5 0.5 0.5 0.5 0.5 0.5 0.5 0.5
##$TPOFFS= (0..7)
0 0 0 0 0 0 0 0
##$TUNHIN= 0
##$TUNHOUT= 0
##$TUNXOUT= 0
##$USERA1= <user>
##$USERA2= <user>
##$USERA3= <user>
##$USERA4= <user>
##$USERA5= <user>
##$V9= 5
##$VALIST= <valist>
##$VCLIST= <CCCCCCCCCCCCCCC>
##$VD= 0
##$VDLIST= <DDDDDDDDDDDDDDD>
##$VPLIST= <PPPPPPPPPPPPPPP>
##$VTLIST= <TTTTTTTTTTTTTTT>
##$WBST= 2048
##$WBSW= 25
##$XGAIN= (0..3)
0 0 0 0
##$XL= 0
##$YL= 0
##$YMAX_a= 605257
##$YMIN_a= -515595
##$ZGOPTNS= <>
##$ZL1= 120
##$ZL2= 120
##$ZL3= 120
##$ZL4= 120
##$ABSF1= 14.98509
##$ABSF2= -5.573092
##$ABSG= 5
##$ABSL= 3
##$ALPHA= 0
##$AQORDER= 0
##$ASSFAC= 0
##$ASSFACI= 0
##$ASSFACX= 0
##$ASSWID= 0
##$AUNMP= <proc_prof1d_extract_pilot.lims>
##$AXLEFT= 0
##$AXNAME= <>
##$AXNUC= <1H>
##$AXRIGHT= 0
##$AXTYPE= 0
##$AXUNIT= <>
##$AZFE= 0.1
##$AZFW= 0.1
##$BCFW= 0
##$BC_mod= 0
##$BYTORDP= 0
##$COROFFS= 0
##$CY= 15
##$DATMOD= 1
##$DC= 0
##$DFILT= <>
##$DTYPP= 0
##$F1P= 0
##$F2P= 0
##$FCOR= 0.5
##$FTSIZE= 32768
##$FT_mod= 6
##$GAMMA= 0
##$GB= 0
##$INTBC= 1
##$INTSCL= 1
##$ISEN= 128
##$LB= 0
##$LEV0= 0
##$LPBIN= 0
##$MAXI= 10000
##$MC2= 0
##$MEAN= 0
##$ME_mod= 0
##$MI= 0
##$NCOEF= 0
##$NC_proc= -8
##$NLEV= 6
##$NOISF1= 0
##$NOISF2= 0
##$NSP= 0
##$NTH_PI= 0
##$NZP= 0
##$OFFSET= 14.98509
##$PC= 1
##$PHC0= 92.66968
##$PHC1= 0
##$PH_mod= 1
##$PKNL= yes
##$PPARMOD= 0
##$PPDIAG= 0
##$PPIPTYP= 0
##$PPMPNUM= 2147483647
##$PPRESOL= 1
##$PSCAL= 4
##$PSIGN= 0
##$PYNMP= <proc.py>
##$REVERSE= no
##$SF= 400.02
##$SI= 32768
##$SIGF1= 0
##$SIGF2= 0
##$SINO= 400
##$SIOLD= 32768
##$SPECTYP= <>
##$SREGLST= <1H.CDCl3>
##$SSB= 0
##$STSI= 32768
##$STSR= 0
##$SW_p= 8223.68421052631
##$SYMM= 0
##$S_DEV= 0
##$TDeff= 65536
##$TDoff= 0
##$TI= <>
##$TILT= no
##$TM1= 0
##$TM2= 0
##$TOPLEV= 0
##$USERP1= <user>
##$USERP2= <user>
##$USERP3= <user>
##$USERP4= <user>
##$USERP5= <user>
##$WDW= 1
##$XDIM= 32768
##$YMAX_p= 435653532
##$YMIN_p= -657096
##$CURPLOT= <Network HP LaserJet P1505>
##$CURPRIN= <$Network HP LaserJet P1505>
##$DFORMAT= <normdp>
##$LAYOUT= <+/1D_H.xwp>
##$LFORMAT= <normlp>
##$PFORMAT= <normpl>
##$SURQMSG= 1
$$ End of Bruker specific parameters
$$ ---------------------------------
##NTUPLES= NMR SPECTRUM
##VAR_NAME=  FREQUENCY,     SPECTRUM/REAL,   SPECTRUM/IMAG
##SYMBOL=    X,             R,               I
##VAR_TYPE=  INDEPENDENT,   DEPENDENT,       DEPENDENT
##VAR_FORM=  AFFN,          ASDF,            ASDF
##VAR_DIM=   32768,         32768,           32768
##UNITS=     HZ,            ARBITRARY UNITS, ARBITRARY UNITS
##FACTOR=    0.250966925370066, 1,           1
##FIRST=     8223.43324360094, 10049,        40652
##LAST=      0,             -158523,         -177371
##MIN=       0,             -657096,         0
##MAX=       8223.43324360094, 435653532,    0
$$ Real data points
##PAGE= N=1
##DATA TABLE= (X++(R..R)), XYDATA
$$ [...]
$$ plain form
19600 225446 135758 62677 -34447 -99687 18772 -254852 480929 74379 -135663 72755 -69781
19588 216203 -58409 -1233 450937 -378247 -9024 -188017 198031 -129118 -23102 -207468 -152162
19577 -152162 -85187 -70398 -19490 -142383 3875 -6352 -92395 -50905 20833 -42751 -77167 -221598
19565 -221598 180957 -29925 -11967 131635 -18553 22850 -149959 15676 -233663 -48756 272791
19553 -223485 -19348 18423 86753 -147914 -209058 137828 294547 242845 51173 221052 68001
19541 94961 83869 59609 -151296 -172427 112433 108311 30922 -397340 -209429 44949 34758
19530 34758 79115 -1000 -308974 -34022 -446190 -247907 -117284 -486991 -399977 -179323 -75425
19518 -99435 201994 -149829 55152 68403 -207285 22309 -109658 -422016 -124948 -147804
$$ packed form
19600B25446q9688F2677c4447o5240A8772b54852D80929G4379a35663G2755f9781
19588B16203e8409a233D50937c78247i024j78993A98031a29118b3102j84366N5306
19577a52162O6975J4789a9490j22893C875f352q6043M1490B0833d2751l4416j44431
19565b21598A80957b9925a1967A31635a8553B2850a49959A5676b33663d8756B72791
19553b23485a9348A8423O8330a47914o1144A37828J56719n1702E1173J69879F8001
19541I4961j1092k4260a51296k1131A12433m122C0922c97340J87911D4949j0191
19530C4758M4357a000l07974c4022m12168J98283a17284l69707Q7014a79323g5425
19518i9435B01994a49829E5152J3251b07285B2309a09658l12358a24948k2856
$$ plain form
19508 -147804 -204882 -81936 -270740 -245485 27607 234156 -129392 -45370 131932 96490 -2014
19496 -47199 -114129 100537 24871 -65186 198756 -128848 -48966 28259 114589 7110 34539
19485 34539 28335 -19707 -70583 124855 22245 -245814 24026 -90365 64091 -431756 -72262
19473 -268209 -266824 70602 -108662 -286727 116097 -123497 -16813 56418 -184572 -83421 48133
19461 75681 26893 80421 129402 -36633 -61123 -172899 96573 -177854 89677 243597 87599
19449 -63158 -132431 -93250 28671 111837 4536 -372945 282322 -179279 394152 -4864 -164781
19438 -164781 232227 -180436 -54895 -28168 -195388 -248876 -108151 -3286 -35802 220666 272192
19427 272192 101972 -45778 -76250 -41165 -146172 -346894 143493 -206641 167995 -228456
$$ packed form
19508a47804n7078h1936j88804K5255B7607K06549a29392d5370A31932l5442b014
19496d7199o6930A00537B4871f5186A98756a28848d8966B8259Q6330G110K7429
19485C4539o204a9707n0876A24855B2245b45814B4026i0365F4091d31756g2262
19473b68209J385G0602a08662j78065A16097a23497a6813E6418a84572h3421D8133
19461G5681B6893N3528M8981c6633k4490j11776I6573a77854H9677J53920H7599
19449f3158o9273L9181B8671Q3166D536c72945B82322a79279C94152d864j59917
19438a64781B32227a80436e4895K6727j67220n3488a08151c286l2516B20666N1526
19427B72192A01972d5778l0472L5085j05007k00722A43493b06641A67995b28456
$$ plain form
19416 -209042 -89933 -174091 54333 36591 111388 23701 -222606 210790 -29513 150107 -76062
19404 350287 -197658 -122676 197038 -83760 -104499 -318960 208614 -140145 7700 187178
19394 187178 962 -164819 -303274 -10490 -73602 -364573 -42593 243987 117694 -6091 -97907
19383 -97907 -82919 -159044 -208755 -93494 -87954 -107470 75946 -228387 -15356 -64029 -22688 -85017
19371 -85017 -165269 -279773 219538 140746 -365227 117760 -179228 103583 72081 -42832
19360 -22471 163082 -266113 111546 -397769 97342 -142661 -187842 -167115 105018 91921
19350 91921 -147539 -67580 -139774 -11110 -96676 -132140 63835 85565 -14679 45099 -138500
19338 -223394 23389 -390886 -44774 -59328 -19757 -85945 -131841 -159299 23013 147258 -47074
$$ packed form
19416b09042h9933q4158E4333j7742P4797B3701b22606B10790b9513A50107g6062
19404C50287a97658P4982A97038h3760k0739k14461B08614a40145G700J79478
19394A87178I62a64819j38455a0490o3112k90971d2593B43987A17694f091r1816
19383i7907J4988p6125m9711i3494N540j9516G5946b28387a5356m8673b2688o2329
19371h5017q0252j14504B19538p8792c65227A17760a79228A03583l1502d2832
19360b2471A63082b66113A11546c97769I7342a42661m5181K0727A05018j3097
19350I1921a47539f7580p2194a1110q5566l5464F3835K1730a4679D5099a38500
19338b23394B3389c90886d4774j4554a9757o6188m5896k7458B3013J24245d7074
$$ plain form
19326 64430 -201576 -80012 -137158 -280101 54582 -31778 222131 -181596 -59309 -95632 -67305
19315 -67305 -117934 226394 -122055 335804 -291213 -239252 25039 -242018 -274955 42846 -185235
19303 89428 119702 -196012 -12932 -88885 -259935 -204615 -194922 -15006 198577 -223567 -1145
19291 206777 26289 -4445 36887 -144256 -193029 128187 2398 90673 131871 -95253 -167744
19280 -167744 -283734 -87050 251572 80210 75789 -91659 -185596 -114799 -118443 16349 -5254 -32460
19268 -32460 5566 198671 -183153 -117420 242756 -18391 -280339 37430 -395290 -120752 -188104
19257 -188104 76858 -169286 140565 73212 25710 -89285 -198284 377407 -3878 202068 -130378
19245 -443456 -132598 69660 -220324 -272085 -264063 205800 -192915 139681 -65540 -1368 -102653
$$ packed form
19326F4430b01576h0012n7146j42943E4582c1778B22131a81596e9309l6323K8327
19315f7305n0629B26394a22055C35804b91213N1961B5039b42018l2937D2846a85235
19303H9428L0274a96012a2932p5953j71050N5320R693a5006A98577b23567a145
19291B06777B6289d445C6887a44256m8773A28187B398Q8275M1198i5253p2491
19280a67744j15990h7050B51572H0210m421i1659r3937P0797l644A6349e254k7206
19268c2460E566J93105a83153O5733B42756a8391k61948C7430c95290a20752o7352
19257a88104G6858a69286A40565o7353B5710h9285j08999C77407c878B02068a30378
19245d43456a32598F9660b20324n1761Q022B05800a92915A39681f5540a368j01285
$$ plain form
19234 -102653 -42143 -278362 4848 -16007 -159721 -121590 -26829 -139371 -437703 124997 328804
19223 328804 75559 -297876 -116861 106848 140888 -172351 -15453 -66152 -335860 -152917
19212 90607 59414 -71437 -113713 -222803 -90397 -211991 118428 262223 -370362 54019 -250857
19200 -190853 -44751 24890 61845 -255453 10978 112157 116494 103344 -453844 -126569 -548072
19189 -548072 -126081 -68500 -109694 -195203 5958 110681 36867 -54493 -68278 -130152 255876
19177 22516 -89801 26433 2457 -92290 -52563 255795 -111106 -3133 -387606 6009 -25579 -324228
19165 -324228 174163 135709 -89945 140610 -70015 -74605 -12188 -48539 13237 33315 79944
19154 79944 -125453 -385497 -140485 -111636 -184558 -241726 -30580 -98980 -95386 196516 -110514
$$ packed form
19234a02653d2143k36219D848a6007j43714L8131b6829j12542k98332A24997K03807
19223C28804G5559b97876a16861A06848L4040a72351a5453n0699k69708a52917
19212I0607l1193g1437m2276j09090i0397j21594A18428J43795c70362E4019b50857
19200a90853d4751B4890L6955b55453A0978J01179M337j3150d53844a26569m21503
19189e48072a26081N7581m1194q5509E958J04723C6867e4493j3785o1874B55876
19177B2516h9801B6433B457i2290L9727B55795a11106c133l84473F009b5579k98649
19165c24228A74163l8454h9945A40610g0015m590a2188l6351A3237K0078M6629
19154G9944a25453k60044a40485K8849p2922n7168c0580o8400L594A96516a10514
$$ plain form
19142 -217326 67258 -40325 -189012 -259305 269279 19840 44263 -439414 209500 -208048
19131 1045 -328831 280420 -150185 137596 -282923 165983 192562 181592 299383 54562
19120 -76012 112659 -172559 -301920 127471 36289 162564 -94275 -108440 55054 12782 90611
19109 90611 -128466 37176 -160410 239402 -98080 213580 -17676 -286796 -190744 -145076 -87857
19098 -87857 65902 -319053 -232129 -302107 3832 -201045 224611 -99525 -85882 -43603 356934
19086 163463 129527 245325 122320 -358499 25464 -116579 -104337 -182435 -243324 -183095 -144350
19075 -144350 257900 -69329 -152058 -106377 91958 -304528 126823 -36273 -58356 166503 -118645
19063 -232150 -185654 208174 -409135 52173 196907 -244688 -118252 31310 -38036 -101969
$$ packed form
19142b17326F7258d0325j48687p0293B69279A9840K4423d39414B09500b08048
19131A045c28831B80420a50185A37596b82923A65983K6579j0970J17791E4562
19120g6012A12659a72559j29361A27471C6289J26275i4275j4165E5054A2782P7829
19109I0611a28466C7176a60410B39402i8080B13580a7676k69120R6052M5668N7219
19098h7857F5902c19053Q6924o9978C832b01045B24611i9525J3643M2279C56934
19086A63463l3936J15798A22320c58499B5464a16579J2242p8098o0889O0229L8745
19075a44350B57900f9329q2729M5681I1958c04528A26823c6273k2083A66503a18645
19063b32150M6496B08174d09135E2173J44734b44688a18252C1310c8036o3933
$$ plain form
19053 -101969 73458 64708 3851 44825 -2302 -100454 -150420 208741 101707 -112225 131274
19041 90442 -8096 -39818 -32204 285314 112829 -59460 -12158 -138044 -60983 -174081 93154
19029 231542 -84799 15376 8741 91821 25178 39848 247591 100436 -113094 -95823 233516
19017 -84754 -108368 -84244 52527 -145703 125009 3123 -321758 -111317 267502 20386 -296083
19005 -51464 81224 -347674 145218 -24095 -287213 -148037 375 -316041 33881 -8901 -107364
18994 -107364 -7220 -50271 -34603 -93302 8232 -180506 32595 -334365 9809 84072 -376186
18982 -352374 42730 50731 -124780 -13492 -248770 -203713 170169 18546 136921 -26604 135060
18970 -167063 -306974 -439204 18780 -40260 86329 111781 -212059 122040 71549 -128241
$$ packed form
19053a01969G3458q750C851M0974b302r8152m9966B08741A01707a12225A31274
19041I0442h096l1722P614B85314A12829e9460a2158j25886f0983j13098I3154
19029B31542h4799A5376o635Q3080B5178J4670K07743A00436a13094J7271B33516
19017h4754k3614K4124E2527a45703A25009C123c21758a11317B67502B0386b96083
19005e1464H1224c47674A45218b4095k63118J39176C75c16041C3881h901r8463
18994a07364g220m3051J5668n8699H232a80506C2595c34365I809P4263c76186
18982c52374D2730Q001a24780a3492k35278M5057A70169A8546J18375b6604A35060
18970a67063j39911j32230A8780d0260H6329K5452b12059A22040n0491a28241
$$ plain form
18959 -102593 -15781 -152034 -163680 -11069 -99831 -395893 -219437 -161132 234424 -110579
18948 -221928 47803 -226417 197802 145348 -225897 -114314 -182544 31100 -461017 -52876
18937 -26494 74373 36372 126103 271178 -156907 49980 -86046 -116729 55561 -242071 4232
18925 -54027 9019 114090 -124987 -72998 -224379 -248647 194855 126769 -154671 -139304 -30249
18913 -197675 -91354 50967 159902 46918 -356733 -135697 84085 28380 609 -137935 154567
18901 -119642 -253343 43292 -239816 91935 -49685 42314 22683 -312194 -268992 145142 -197100
18889 30702 -188432 -5982 -48698 -179574 -22920 -212226 -25918 24662 -340976 -234459 -123580
18878 -123580 -2170 -25530 -11225 -102666 -5145 -110890 -139726 -41663 -313686 -202830 -202190 -104414
$$ packed form
18959a02593a5781j36253j1646a1069q8762k96062J76456N8305B34424a10579
18948b21928D7803b26417A97802n2454b25897J11583o8230C1100d61017e2876
18937b6494G4373C6372Q9731J45075a56907D9980h6046l0683E5561b42071D232
18925e4027I019J05071a24987N1989j51381k4268A94855o8086a54671J5367c0249
18913a97675i1354E0967J08935D6918c56733a35697H4085B8380F09a37935A54567
18901a19642j33701D3292b39816I1935d9685D2314j9631c12194M3202A45142a97100
18889C0702a88432e982m2716j30876b2920j89306b5918B4662c40976J06517J10879
18878a23580b170k3360a1225r1441e145j05745k8836d1663k72023J10856O40R7776
$$ plain form
18866 -104414 69713 -258976 -51695 -130937 -44235 -79744 -154127 -205269 80287 219983 -152710
18854 238669 13760 -293723 -108712 -2502 224349 44312 -99412 213361 -11670 -272815 -360560
18843 -360560 20011 -81344 -132237 -221172 -238445 -38782 -75914 183391 194877 289710 -122589
18831 117805 -243389 -343141 -119952 -174358 82573 -200350 -321007 33748 -149461 -260260
18821 -260260 -79159 13610 -28100 164258 -90610 256758 -100007 51823 -57745 5432 132156
18810 132156 30989 27375 176194 243082 -135871 -337354 -239138 -160886 109551 -139484 -36992
18798 212716 -128158 164698 102967 -141183 -130942 5035 -25346 17919 192723 -49631 34974
18786 47918 -269472 88281 83745 92527 -124663 -194105 44081 -212991 -325572 109151 269904
$$ packed form
18866a04414F9713b58976e1695p9242d4235l5509p4383n1142H0287J39696a52710
18854B38669A3760b93723a08712b502B24349D4312i9412B13361a1670k61145q7745
18843c60560B0011h1344n0893q8935j7273c8782l7132A83391J1486R4833a22589
18831A17805b43389r9752a19952n4406H2573b00350j20657C3748a49461j10799
18821b60260g9159A3610b8100A64258i0610B56758a00007E1823e7745E432J26724
18810A32156C0989l614J48819O6888a35871k01483R8216P8252A09551a39484c6992
18798B12716a28158A64698o1731a41183J0241E035b5346A7919J74804d9631C4974
18786D7918b69472H8281m536Q782a24663o9442D4081b12991j12581A09151J60753
$$ plain form
18775 269904 69571 151910 -148417 -200853 -248349 166759 -38127 6109 -159969 -178385 -311671
18764 -311671 2100 -27659 -16504 -110591 -199051 -65424 159358 85803 -282524 231853 -303947
18752 60804 -262385 258372 23682 -293231 -116060 -304067 -252362 -203372 360955 -424616
18741 -281990 57840 245889 -10205 77612 -45878 -238190 -56537 17747 -80380 129741 72337
18730 72337 213130 134272 -149868 208300 161785 -14926 262050 -136686 -165616 -115003 -197254
18719 -197254 -98386 -142151 48738 -5617 -21048 255949 137872 110913 -23807 244692 -61396
18707 -257790 -17348 -15620 261699 -104077 177735 -80861 67059 75602 -560927 40881 74806
18696 74806 -77807 157079 1150 -49123 6881 -63909 -45856 -117943 17185 -346788 17216 -106589
$$ packed form
18775B69904F9571Q2339a48417n2436m7496A66759c8127F109a59969j8416j33286
18764c11671B100b7659J1155r4087q8460f5424A59358p3555b82524B31853c03947
18752F0804b62385B58372B3682b93231a16060j88007N1705M8990C60955d24616
18741b81990E7840J88049a0205G7612d5878j92312e6537A7747h0380A29741n7404
18730G2337J40793p8858a49868B08300m6515a4926B62050a36686k8930N0613q2251
18719a97254i8386m3765D8738e617j5431B55949j18077k6959b3807B44692f1396
18707b57790a7348J728B61699a04077A77735h0861F7059Q543e60927D0881L3925
18696G4806g7807A57079A150d9123F881f3909J8053p2087A7185c46788A7216a06589
$$ plain form
18683 -64458 231543 212998 -155748 -335388 -15173 -112142 -391098 -38281 -265740 -281180 39348
18671 20112 49195 265841 101604 191996 -4898 -113626 257552 -153636 -168982 -216298 -53979
18659 -155953 -19407 -140990 -167151 266165 -286613 -150623 -41172 139060 181582 -108051
18648 121788 18987 -33336 -29965 -3330 30004 -308890 308235 -82930 -390739 -195182 69734
18636 75254 -148835 87629 122597 191761 105056 -239759 -120937 2867 -205059 152819 -6964
18624 -133767 -353910 232768 -98745 -346889 -51193 69058 59474 -91125 -124222 -93283 -152611
18613 -152611 -36027 114851 -215218 -321361 116670 -326042 131127 216974 -59779 -193340
18603 -193340 -87308 -25763 -104150 177748 123594 396588 -128753 192458 -411259 140883
$$ packed form
18683f4458B31543j8545a55748j79640a5173r6969k78956c8281k27459j5440C9348
18671B0112K9083K16646A01604R0392d898j08728B57552a53636j5346m7316e3979
18659a55953a9407j21583k6161B66165b86613J35990d1172A39060M2522a08051
18648A21788A8987c3336L371c330C0004c08890C08235h2930l07809a95182F9734
18636G5254a48835H7629L4968O9164q6705b39759J18822B867b05059A52819f964
18624a33767k20143B32768i8745k48144e1193F9058r584i1125l3097L0939n9328
18613a52611c6027A14851b15218j06143A16670c26042A31127Q5847e9779j33561
18603a93340h7308b5763p8387A77748n4154K72994a28753A92458d11259A40883
$$ plain form
18592 -161726 -204454 -88952 -136546 146826 -94307 -85069 39511 -58726 -150175 -132408 123684
18580 -242921 8419 56005 141675 -298466 -83009 3160 151194 289659 -329923 -150110 -244050
18569 -244050 121230 119895 -209651 -222546 -248601 -160972 -462549 -3890 379350 -183008 -187482
18558 -187482 42234 -62650 -15672 199996 -198284 -145607 -424689 95411 -117857 -115589 30682
18546 -1049 -91396 149660 93038 -160442 -217871 -163766 37788 -187839 -154349 -273833 73123
18534 -423996 -55603 17355 30627 -112006 432628 133272 79421 14716 -1933 102552 97193
18523 97193 98750 -88425 181572 -347033 24835 -174582 119612 137486 -215916 -160100 -114586
18512 -114586 -274835 -156685 77818 -175245 176914 122595 -190210 19055 -213057 -128617
$$ packed form
18592a61726m2728h8952m7594A46826i4307R238C9511e8726r1449J7767A23684
18580b42921H419M7586Q5670b98466h3009C160J48034J38465c29923a50110r3940
18569b44050A21230j335b09651j2895k6055Q7629l01577c890C79350a83008m474
18558a87482D2234f2650a5672A99996a98284N2677k79082I5411a17857K268C0682
18546a049r0347A49660n6622a60442n7429N4105C7788a87839L3490j19484G3123
18534d23996e5603A7355J3272a12006D32628A33272n3851A4716a933A02552n359
18523I7193J557h8425A81572c47033B4835a74582A19612J7874b15916N5816M5514
18512a14586j60249J18150G7818a75245A76914n4319a90210A9055b13057Q4440
$$ plain form
18502 -128617 -196061 -163851 138705 -359634 -335723 -113626 -104474 126593 79910 -90631 758
18490 -286367 -174286 -59632 128683 -315223 -386198 13681 -87418 -6754 -45217 136524 -15010
18478 233022 -26823 253327 33939 -92499 153648 -125170 56575 -412265 4586 -102095 -158154
18467 -158154 -82097 -184296 -301065 -78317 -206593 106395 -182838 135273 145879 76292
18457 76292 -161956 -130837 -242469 59416 -40447 -191821 -286538 218698 133723 -42779 -92386
18446 -92386 -152964 -148710 -308758 -111350 -16688 -259216 -75114 362973 -91780 -260599 123882
18434 -29673 144907 -43470 -202517 188659 -263974 -183377 60506 -3531 -286785 -44897 -14555
18422 -103094 203400 134555 -88919 290303 -174940 -85625 -23785 -8386 85723 57979 -159897
$$ packed form
18502a28617o7444L2210A38705c59634K3911a13626R152A26593m6683i0631G58
18490b86367J12081e9632A28683c15223p0975A3681h7418f754l8463A36524a5010
18478B33022b6823B53327C3939i2499A53648a25170E6575d12265D586a02095n6059
18467a58154P6057j02199j16769g8317j28276A06395a82838A35273J0606o9587
18457G6292a61956L1119j11632E9416d0447j51374r4717B18698q4975d2779m9607
18446i2386o0578M254j60048a11350a6688k42528g5114C62973i1780j68819A23882
18434b9673A44907d3470j59047A88659b63974Q0597F0506c531k83254d4897a4555
18422a03094B03400o8845h8919B90303a74940h5625b3785h386H5723k7744a59897
$$ plain form
18410 105387 -20619 140493 5308 331020 109968 54970 -88939 -20487 243460 176255 -93180
18398 -284678 70571 31229 -33853 -45636 -20838 216905 -129952 -71879 -277433 -329785 -307144
18387 -307144 74892 -139135 -107076 -223830 282403 -143464 380566 160418 -185316 164052
18376 -89270 63059 -319429 -143160 -27608 -74376 -273297 160433 76498 12435 73500 -21190
18364 87593 -61941 113722 -141589 225117 -19150 -345363 162243 -128093 250495 -70440
18353 -226797 178472 295955 -148849 -191522 -102942 -2335 -4582 -120953 65920 -82632 -111117
18342 -111117 116118 2495 180427 -170637 -118005 -195072 203408 327698 -87679 -61881 -77177
18331 -77177 71497 -40266 -4772 -11818 79561 88910 -437356 112661 -76545 48946 156579 184601
$$ packed form
18410A05387b0619A40493E308L25712A09968E4970h8939b0487B43460o7205i3180
18398b84678G0571C1229c3853j1783b0838B16905a29952N8073k05554n2352K2641
18387c07144G4892a39135L2059j16754B82403a43464C80566A60418a85316A64052
18376h9270F3059c19429a43160b7608m6768j98921A60433G6498A2435O1065b1190
18364H7593f1941A13722a41589B25117a9150l26213A62243a28093B50495g0440
18353b26797A78472J17483a48849m2673Q8580b335k247j16371F5920h2632k8485
18342a11117A16118B495J77932a70637N2632p7067B03408J24290h7679K5798j5296
18331g7177G1497d0266d772p046G9561R349d37356A12661g6545D8946J07633K8022
$$ plain form
18319 184601 -92669 -38344 141135 -241393 124375 -213572 -64576 -262392 119597 -3226
18308 -283151 127406 -83820 88207 3503 -9153 -23246 19266 76506 -47837 72243 -139667
18296 -83151 22145 -25238 -87138 -101744 -116251 -216504 212794 -368717 -62544 55388 -193135
18284 73270 164182 127968 -186099 -125117 -23520 -90716 60941 -141048 -431908 -190274 -108262
18273 -108262 -120156 -290246 -216262 9386 -103416 -173245 -73862 101474 71450 -248880 -382901
18262 -382901 135853 -154714 -79667 31161 1956 -321078 -237164 -134065 116377 -180270
18251 78387 -116007 -65775 -15528 -195686 133379 183687 -250728 -84310 -277344 -27566 -256376
18240 -256376 -23163 -135949 32221 132647 157384 -277451 12368 76329 102782 72139 -116603
$$ packed form
18319A84601i2669c8344A41135b41393A24375b13572f4576j97816A19597c226
18308b83151A27406h3820H8207C503i153j4093A9266N7240d7837G2243a39667
18296h3151B2145b5238o1900j4606j4507j00253B12794c68717f2544E5388a93135
18284G3270R0912l6214a86099O0982b3520o7196F0941a41048k90860a90274Q2012
18273a08262j1894j70090P3984I386a03416o9829g3862A01474l0024b48880j34021
18262c82901A35853a54714P5047C1161A956c21078Q3914J03099A16377a80270
18251G8387a16007N0232a5528j80158A33379N0308b50728h4310j93034b7566k28810
18240b56376b3163j12786C2221J00426K4737b77451A2368O3961K6453l0643a16603
$$ plain form
18228 269937 72986 -58464 -86332 -206010 202719 104151 104033 -82189 299395 -284869 -135539
18216 39899 -256771 -25746 -6749 326932 107001 64569 -147779 -150759 -86982 130274 -21116
18204 -73779 -169817 11596 93791 154538 -7171 -104567 84582 68686 130348 42501 -39673 57931
18191 -133381 93148 -153809 -63280 225444 131061 -177278 169979 202213 -33393 -58640 -151038
18180 -151038 -61562 -147410 101896 77132 198459 47203 60469 -244307 -152527 -75149 -5981
18168 186655 -280560 -199569 -88246 -99396 -20938 -90193 267642 -81349 -97374 192304 29648
18156 169648 26986 157623 -318852 -31692 130116 193895 -196259 102103 -67341 21841
18145 105819 20224 -411502 56883 76245 -112930 -27183 7217 265645 74509 6587 -217799
$$ packed form
18228B69937G2986e8464k7868j19678B02719r8568j18h2189B99395b84869a35539
18216C9899b56771b5746f749C26932A07001m2432a47779k980O3777A30274b1116
18204g3779r6038A1596Q2195O0747g171r7396H4582j5896O1662D2501c9673E7931
18191a33381I3148a53809f3280B25444r4383a77278A69979L2234c3393k5247r2398
18180a51038f1562q5848A01896k4764J21327D7203J3266b44307R1780g5149e981
18168A86655b80560Q0991h8246j1150b0938o9255B67642h1349j6025A92304B9648
18156A69648B6986J30637c18852c1692A30116O3779a96259A02103f7341B1841
18145A05819B0224d11502E6883J9362a12930b7183G217K58428G4509F587b17799
$$ plain form
18133 -221117 76976 -78896 -242475 110558 -132332 -98658 -320805 -185513 -59237 38591
18122 -252564 -5503 75561 -212235 165772 -107043 -209552 -373883 -249069 209734 -195330
18111 -269866 155337 -177329 -78538 91757 2998 110892 208222 366590 -316248 173429
18100 -103521 91008 13855 182306 2115 211472 -227483 -214254 190606 -114884 2998 56806
18089 56806 390627 77831 -172391 -41175 -5253 151794 -285379 46519 -232090 -88730 85416
18077 -69510 -293270 266124 -260603 217818 -14902 -148739 48079 -225621 176015 -23270
18066 328409 43265 2323 74110 22540 46385 338740 -215491 -37143 -58349 234927 170761
18055 170761 -283457 95811 29491 -59350 -284158 20958 134074 57653 -153204 -3118 -78888
$$ packed form
18133b21117G6976g8896j63579A10558a32332L3674k22147J35292e9237C8591
18122b52564e503G5561b12235A65772a07043j02509j64331J24814B09734a95330
18111b69866A55337a77329g8538I1757B998J07894R7330J58368c16248A73429
18100a03521I1008A3855J68451B115K09357b27483J3229A90606a14884B998N3808
18089E6806L33821G7831a72391d1175e253A51794b85379D6519b32090h8730H5416
18077f9510k23760B66124b60603B17818a4902j33837D8079b25621A76015b3270
18066C28409D3265B323P1787B2540K3845K92355b15491c7143k1206B34927o4166
18055A70761b83457I5811B9491e9350k24808B0958J13116E7653a53204c118p5770
$$ plain form
18044 -78888 -451012 -88199 83301 3666 -281983 102194 319381 -208641 -193484 119833 -129653
18032 77065 -192324 -64747 18012 -37066 -200715 -75626 -347366 -78843 136041 251247 24972
18020 172971 -400509 -35627 -95249 -142362 -96110 108217 -269794 -178336 147171 -481248
18009 161480 140519 163274 79368 -77485 -77313 20422 -16430 -154577 254906 3543 407830
17998 407830 -1617 205485 -171852 297560 -27422 -130653 -85040 -214473 -23713 34848 -99465
17986 -16178 4339 569262 54580 -157446 255401 -87806 55165 -56513 -173095 69020 -30365
17974 59708 143050 -356696 291619 -171294 283725 19764 88242 -14657 -55790 395565 -406908
17962 9773 151207 -218416 32213 132989 -105114 -243994 -82913 148985 264651 267187 -57292
$$ packed form
18044g8888l72124h8199H3301C666b81983A02194K17187b08641J5157A19833a29653
18032G7065a92324f4747A8012c7066j63649g5626k71740g8843A36041J15206B4972
18020A72971d00509c5627n9622m7113M6252A08217b69794R1458A47171d81248
18009A61480k0961K2755G9368g7485J72B0422a6430j38147B54906C543M04287
17998D07830a617B05485a71852B97560b7422j03231M5613j29433b3713C4848i9465
17986a6178D339N64923E4580a57446B55401h7806E5165e6513j16582F9020c0365
17974E9708Q3342c56696B91619a71294B83725A9764O8478a4657m1133C95565d06908
17962I773J41434b18416C2213J00776a05114j38880h2913A48985J15666K536e7292
$$ plain form
17950 -267031 -135971 -179397 -306350 109971 -358427 -25581 -23660 161092 -337525 -5422 -6897
17939 -6897 -199282 8944 -5228 22472 -142910 -97853 -62193 -139431 57055 -265787 41326 -107261
17926 164528 -36886 -431598 -259655 -188548 202069 -158407 61439 -42054 170610 269836
17916 269836 -139286 -163840 -2648 304232 36338 122722 97743 -266606 15410 -130903 -133348
17905 -133348 -10604 -214611 83648 -95812 -19361 -358273 -162689 459535 78244 -135195
17894 -350198 -113184 102201 -83515 -97073 23933 170656 -131366 248908 77924 184625
17884 184625 -178811 30088 -308527 -133880 -159242 148732 -52927 310406 -31777 93392
17873 -131872 -150451 -9080 -260126 -27356 -248637 -74194 -88714 218472 93862 -108392 139734
$$ packed form
17950b67031J31060m3426j26953A09971c58427b5581J921A61092c37525e422j475
17939f897j92385H944e228B2472a42910M5057L5660p7238E7055b65787D1326a07261
17926A64528c6886l94712J71943P1107B02069a58407F1439d2054A70610R9226
17916B69836a39286k4554b648C04232C6338Q6384k4979b66606A5410a30903k445
17905a33348a0604k04007H3648i5812a9361l38912a62689D59535G8244a35195
17894c50198a13184A02201h3515j3558B3933J46723a31366B48908G7924J06701
17884A84625a78811C0088c08527a33880k5362A48732e2927C10406c1777I3392
17873a31872j8579i080k51046b7356k21281g4194j4520B18472I3862a08392A39734
$$ plain form
17861 -51776 -212789 -76386 -130511 -273034 -63576 76965 -163472 -250666 -53216 -62678 -110896
17850 -110896 -586317 -105863 -126653 -186277 386 -287950 4271 -89775 111499 -56477 32454
17838 143680 -25621 142891 62897 48648 -46323 -55841 62251 35176 100024 105529 -301944
17826 69554 -47010 161376 -165793 137034 -137356 134828 50191 -97150 36726 185336
17816 185336 72526 -254691 97061 -84138 7130 124463 8649 -270670 99321 -58639 1688
17804 137707 106283 29265 121860 -12474 -65418 -25587 -185443 -220344 228304 57697 27722
17792 -152355 -240369 -7185 45352 65157 277185 61258 100054 -96767 236956 -30938 -104086
17781 -104086 -34572 -164976 136189 -180002 -179634 -343671 94150 98704 174133 168175 127446
$$ packed form
17861e1776j61013g6386n4125j42523f3576G6965a63472q7194e3216r462m8218
17850a10896m75421a05863k0790n9624C86b87950D271h9775A11499e6477C2454
17838A43680b5621A42891F2897j4249d6323r518F2251k7075O4848N505c01944
17826F9554d7010A61376a65793A37034a37356A34828E0191i7150C6726J48610
17816A85336G2526b54691I7061h4138G130J17333H649b70670I9321e8639A688
17804A37707l1424B9265R2595a2474n2944b5587j59856l4901B28304E7697B7722
17792a52355q8014g185D5352J9805K12028F1258L8796i6767B36956c0938p3148
17781a04086c4572j30404A36189a80002L68j64037I4150M554P5429n958m0729
$$ plain form
17770 127446 181671 -51860 -212682 -35711 150754 19997 171778 185326 -29133 -73839 249263
17758 43875 -118911 -137355 -11700 16395 -30309 66627 -244513 -192020 111580 -177653 -23483
17746 -88939 137971 252519 388793 -6341 -78074 193006 127824 331592 126920 -12796 -231217
17735 -231217 -363118 298386 30413 11502 12585 221986 80269 56342 -170664 -203783 -64559
17723 -132272 -26542 -259712 204624 182652 -168518 -14415 -56209 -92545 -71708 -88230 94525
17711 256 -94168 -37163 107309 -283538 -39482 -107101 -123344 166711 22041 145684 -260586
17699 -307296 41785 79812 -31615 115324 96107 151636 -78585 90650 56193 153437 -28272
17687 -237720 -328604 1539 12087 -117827 303705 -174403 -110516 260758 29888 -86632 -23493
$$ packed form
17770A27446N4225e1860j60822c5711A50754A9997J51781J3548b9133m4706B49263
17758D3875a18911j8444a1700A6395c0309F6627b44513N2493A11580a77653b3483
17746h8939A37971J14548J36274f341p1733A93006o5182K03768A26920a2796k18421
17735b31217j31901B98386C0413A1502J083K09401H0269k3927a70664l3119f4559
17723a32272b6542k33170B04624k1972a68518a4415m1794l6336K0837j6522I4525
17711B56i4168c7163A07309b83538c9482o7619j6243A66711B2041J23643b60586
17699c07296D1785L8027c1615A15324j9217N5529g8585I0650l4457R7244b8272
17687b37720r0884A539J0548a17827C03705a74403O3887B60758B9888h6632b3493
$$ plain form
17675 88243 -79622 62012 -27929 -18840 -118821 101560 28692 -71316 25655 33078 -31630 103508
17662 -114099 -283288 -97693 -220677 -383203 73758 167178 195211 120391 -52168 148285 -96355
17650 118144 169923 -53805 137706 -39153 -90377 -112974 83334 -6463 48643 -106133 282518
17638 84447 -59920 -60482 -83374 75137 101053 79307 120576 -81515 203383 290859 64527 197642
17626 197642 42245 -80217 -82809 1948 -99381 -46748 147316 61319 -153199 58942 119136
17615 119136 -38652 -182898 -175942 -125446 70701 19636 -128925 286560 -113991 29670 -11227
17603 -114091 336991 -26215 117048 182431 -9942 132215 -149622 142440 169876 289365
17593 289365 165332 511089 -33893 -31994 -106046 -123169 -131304 -32049 114081 60585 -80730
$$ packed form
17675H8243g9622F2012b7929R089r9981A01560B8692g1316B5655P423c1630A03508
17662a14099j69189i7693j22984j62526G3758R3420K8033p4820e2168A48285i6355
17650A18144N1779e3805A37706c9153n1224k2597H3334f463D8643a06133B82518
17638H4447e9920n62k2892G5137K5916k1746M1269h1515B03383Q7476F4527J33115
17626A97642D2245h0217k592A948i9381d6748A47316F1319a53199E8942O0194
17615A19136c8652j44246O956N0496G0701A9636a28925B86560a13991B9670a1227
17603a14091C36991b6215A17048O5383i942A32215a49622A42440K7436J19489
17593B89365j24033L45757c3893J899p4052j7123q135c2049A14081n3496h0730
$$ plain form
17581 173451 -85087 133367 137467 139366 300047 122463 -126828 -83991 262260 137776 8739
17569 141282 9573 292328 4078 44508 98796 -55369 -55351 49579 90574 -126173 37223 -76595
17556 -434683 146650 9196 214713 -154911 -88444 -84268 -35264 -163002 45183 318869 -147754
17544 -38165 -189121 -67635 -112397 117647 123920 60209 336884 241812 -110805 51823 31414
17533 31414 192584 340137 187423 331731 68385 -9441 -44228 402274 107798 180833 -148006
17521 99645 300389 67450 -63308 252021 -26804 10490 173051 -116972 -45871 86030 162695
17510 162695 203165 26452 165644 270901 307515 -22375 -210852 -35240 168183 -6455 -30043
17499 -30043 -189755 76948 128083 -27234 236279 43151 25220 1987 166991 -6109 -15665 -132439
$$ packed form
17581A73451h5087A33367M100J899J60681A22463a26828M2837B62260j24484H739
17569A41282I573K82755D078M0430N4288e5369J8D9579M0995a26173C7223g6595
17556d34683A46650I196K05517a54911O6467M176c5264j27738D5183K73686a47754
17544c8165j50956f7635m4762A17647O273F0209K76675r5072a10805E1823k0409
17533C1414J61170J47553j52714J44308F8385i441l4787D02274A07798P3035a48006
17521I9645K00744F7450f3308B52021b6804A0490J62561a16972d5871H6030P6665
17510A62695M0470B6452J39192J05257L6614b2375j88477c5240A68183f455k3588
17499c0043j59712G6948N1135b7234B36279D3151j7931A987J65004f109r556j16774
$$ plain form
17487 -132439 -17023 31338 74956 11353 6416 318333 326395 149512 -95069 268663 -12925
17475 11062 171390 71278 -170430 -47633 -241797 303372 446975 -11619 166992 -75758
17464 -63409 202209 117226 -103178 185413 84808 33155 72822 75246 -13320 588741 -6133
17452 56430 162366 264419 265646 213140 144269 149470 229313 65678 197139 144239 -156244
17440 284817 207093 231606 258351 -140606 418486 173873 177038 -46962 258069 532652 102834
17428 6902 230689 284871 -156251 -76039 104321 245880 26768 130392 397134 110621
17417 131324 429023 -18576 409292 495021 50320 168107 186088 32998 33430 -133143 91611
17405 126119 138065 95674 219489 188236 170636 -171547 228657 72933 -140145 238181
$$ packed form
17487a32439a7023C1338M3618A1353m937L11917Q062A49512i5069B68663a2925
17475A1062J60328G1278a70430d7633j94164C03372J43603a1619A66992g5758
17464f3409B02209q4983a03178A85413H4808C3155L9667K424a3320E88741f133
17452E6430J05936J02053J227n2506o8871N201P9843F5678J31461n2900a56244
17440B84817p7724K4513K6745a40606D18486A73873L165d6962B58069K74583A02834
17428F902K23787N4182a56251g6039A04321J41559B6768J03624K66742A10621
17417A31324K97699a8576D09292Q5729E0320J17787J7981C2998M32a33143I1611
17405A26119J1946m2391J23815l1253j7600a71547B28657G2933a40145B38181
$$ plain form
17394 363460 -50189 -43575 83468 -27587 141533 212808 162719 141697 198339 -147270 492375
17382 -42189 241032 -52284 -73386 9369 -15090 65142 -26225 269346 -90195 33127 -35209
17370 81075 208783 187459 248286 99358 -16433 147508 86470 241984 235740 -95086 152690
17358 -70411 243660 130643 106527 88697 148423 -7892 287898 10716 -14728 242867 -91024
17346 -73495 -222115 291239 389522 156583 287918 179158 270041 187181 25761 409353
17336 409353 -162818 180831 298118 -214192 302751 135015 109296 353504 38733 107651
17326 107651 -124330 -84253 225036 567856 -103224 11242 -59010 56565 329388 168710
17316 168710 187829 142085 -10407 -108452 93041 7505 -3595 18077 1903 -176971 157201 -235423
$$ packed form
17394C63460e0189O614H3468b7587A41533P1275n0089k1022N6642a47270D92375
17382d2189B41032e2284k1102I369a5090F5142b6225B69346i0195C3127c5209
17370H1075J27708k1324O0827I9358a6433A47508o1038J55514o244i5086A52690
17358g0411B43660j13017k4116j7830N9726g892B87898A0716a4728B42867i1024
17346g3495j48620B91239R8283A56583J31335j08760R0883q2860B5761L83592
17336D09353a62818A80831J17287b14192C02751A35015k5719K44208C8733O8918
17326A07651a24330M0077B25036L42820a03224A1242e9010E6565K72823j60678
17316A68710J9119m5744a0407r8045I3041G505c595A8077A903a76971A57201b35423
$$ plain form
17303 375170 210234 215199 263429 455639 581488 -27480 265643 232331 182837 174416 78220
17291 298507 119602 277594 69334 -92284 -1807 210772 78509 426962 182330 60131 426556
17280 426556 436890 108536 14890 -212849 65928 -70744 113361 -62701 -212937 367492
17269 163945 245981 161939 234782 185835 -77996 207233 35893 -137136 197268 479038 114299
17257 238150 245060 77934 -170811 275249 64915 -238786 47716 89648 63077 -27857 257716
17245 429662 390267 -48187 27718 22265 112306 160885 57477 34638 129561 351665 101532
17233 297358 175609 300124 -112901 104217 258970 108605 211137 212408 124240 139872
17223 139872 -87887 204793 643898 19759 234255 222129 37877 151581 -30525 260332
$$ packed form
17303C75170j64936M965M8230J92210J25849b7480B65643l3312m9494q421G8220
17291B98507A19602J57992F9334i2284a807B10772G8509L48453A82330F0131L66425
17280D26556J0334A08536A4890b12849F5928g0744A13361f2701j50236C67492
17269A63945Q2036q4042P2843m8947g7996B07233C5893a37136A97268K81770A14299
17257B38150O910G7934a70811B75249F4915b38786D7716M1932k6571b7857B57716
17245D29662l9395d8187B7718n453R0041M8579E7477k2839R4923K22104A01532
17233B97358j21749J24515a12901A04217J54753A08605J02532J271q8168J5632
17223A39872h7887B04793M39105A9759K14496j2126C7877J13704c0525B60332
$$ plain form
17212 28838 313163 258384 123996 300401 143274 123251 83065 445420 322890 137762
17201 191981 165536 -276025 447826 252221 289819 251437 -130793 205208 460370 186431
17190 106375 189673 -30783 463338 147287 220306 276872 341378 262762 184207 108993 264929
17179 264929 183231 126391 -20055 40175 89667 85551 197043 300637 12967 372733 115161
17167 675357 164625 182675 257579 484447 281019 237917 -153862 154528 252057 -176345
17156 -58651 42820 337712 156745 439392 204331 65477 402061 493487 517935 139859
17145 528815 298676 51920 34054 522158 284603 382030 329551 273276 299788 69312 393323
17134 393323 327572 360672 23130 -39057 380420 262477 271355 240259 412231 268798 42237
$$ packed form
17212B8838K84325n4779A23996J76405A43274k0023m0186L62355j22530A37762
17201A91981k6445b76025D47826j95605L7598l8382a30793B05208K55162A86431
17190A06375Q3298c0783D63338A47287P3019N6566O4506p8616p8555p5214J55936
17179B64929q1698n6840b0055D0175M9492m116J11492J03594A2967L59766A15161
17167F75357A64625J8050P4904K26868k03428m3102a53862A54528R7529a76345
17156e8651D2820K94892A56745K82647B04331F5477L36584R1426K4448A39859
17145E28815k30139E1920j7866M88104k37555R7427n2479n6275K6512F9312L24011
17134C93323o5751L3100B3130c9057C80420j17943Q878l1096J71972j43433D2237
$$ plain form
17122 303828 116215 478430 620296 250679 264949 202424 490360 248672 170813 428089
17112 428089 382283 137443 324005 96882 140833 664618 140030 481165 268555 284991
17102 284991 397881 -117394 176446 244188 58915 361654 94548 504368 374553 103225
17091 32820 424433 134735 351571 202921 254525 222462 321995 151129 350260 321250
17081 321250 316727 213295 521380 430295 579520 337586 407490 520605 527730 368910 462682
17070 462682 221575 386553 430803 212907 558800 484201 422997 541236 272478 800331
17060 800331 300145 310396 272607 391930 260673 234753 354641 382061 541604 331709
17050 331709 516477 153913 683023 434109 623081 134672 263613 623750 436201 511184
$$ packed form
17122C03828A16215L62215J41866B50679J4270o2525K87936k41688p7859K57276
17112D28089m5806A37443J86562I6882M3951N23785A40030L41135k12610J6436
17102B84991J12890a17394A76446O7742E8915L02739I4548M09820j29815A03225
17091C2820L91613A34735K16836j48650N1604l2063R9533A51129J99131k9010
17081C21250m523j03432L08085r1085J49225k41934O9904J13115P125j58820R3772
17070D62682B21575J64978M4250B12907L45893p4599o1204J18239k68758N27853
17060H00331C00145J0251l7789J19323j31257k5920J19888K7420J59543k09895
17050C31709J84768A53913N29110k48914J88972A34672J28941L60137j87549P4983
$$ plain form
17040 511184 342925 367406 421772 568006 129425 342669 457661 632833 612609 387834
17030 387834 259797 377296 810754 597696 517071 357542 438484 316405 446840 448293
17020 448293 530563 232214 195149 692779 559990 673942 642169 648813 539244 655812
17010 655812 378477 823301 843898 614493 666231 648374 492078 559838 496739 657248
17000 657248 407886 898507 863186 573913 615011 752721 481625 563848 840335 750169
16990 750169 655391 410690 668122 796793 455944 465706 674132 731023 524406 666837
16980 666837 508542 1000758 810081 655654 671892 346517 863674 808661 751810 803907
16970 803907 731048 774987 803499 664956 752531 647184 1048772 863248 788626 705649 882480
$$ packed form
17040E11184j68259K4481N4366J46234A29425K13244J14992J75172k0224k24775
17030C87834j28037J17499M33458k13058q0625j59529Q0942j22079J30435J453
17020D48293Q2270B32214l7065M97630j32789J13952l1773O644j09569J16568
17010F55812k77335M44824K0597k29405N1738j7857j56296O7760o3099J60509
17000F57248k49362M90621l5321k89273M1098J37710k71096Q2223K76487r0166
16990G50169r4778k44701K57432J28671l40849R762K08426N6891k06617J42431
16980F66837j58295M92216j90677j54427J6238l25375N17157n5013n6851N2097
16970H03907p2859M3939K8512j38543Q7575j05347M01588j85524p4622q2977J76831
$$ plain form
16959 882480 816724 1077219 834442 1010149 979019 1000791 1014819 1061948 946011 925998 1000610
16948 1000610 884436 615966 937652 871899 1142003 1176052 1099484 1163592 1170811 625199
16938 625199 1023950 989818 881241 1043227 1256601 953525 596921 1180569 783382 1359587
16928 1359587 1226619 995012 1698217 603304 1289390 1169257 1085885 1296083 1109773 1400974
16918 1400974 1137806 1270524 1457646 1124593 1169591 1364863 1501629 1442943 1298675 1478776
16908 1478776 1233489 908270 1276079 1372332 1522289 1182528 1338086 1644293 1818039 1353184
16898 1353184 1622985 1372089 1381200 1509826 1453227 1420629 1629931 1404911 1784844 1836960
16888 1836960 1429645 1551515 1910663 1648042 1478996 1654963 1832398 2112681 2162279 1992526
$$ packed form
16959H82480o5756K60495k42777J75707l1130K1772J4028M7129j15937k0013P4612
16948A000610j16174k68470L21686o5753K70104L4049p6568O4108P219n45612
16938F25199L98751l4132j08577J61986K13374l03076l56604N83648l97187N76205
16928A359587j32968k31607P03205F03304O86086j20133q3372K10198j86310K91201
16918A400974k63168J32718J87122l33053M4998J95272J36766n8686j44268J80101
16908A478776k45287l25219L67809R6253J49957l39761J55558L06207J73746m64855
16898A353184K69801k50896R111J28626n6599l2598K09302k25020L79933N2116
16888A836960m07315J21870L59148k62621j69046J75967J77435K80283M9598j69753
$$ plain form
16878 1992526 2020286 2005916 2146812 2088732 1790955 1977865 2067162 2322380 2080197 2231972
16868 2231972 2491604 2205629 2133270 2431280 2299439 2563434 2470761 2486348 2574338 2604719
16858 2604719 2618972 2865223 2656375 2780674 2582915 2697107 2487346 2904269 2790011 2853172
16848 2853172 3118912 3073133 3176985 3166912 2957954 3382222 3068447 3220685 3332064 3655435
16838 3655435 3650326 3549324 3518043 3775516 3919175 3770911 3924045 3946417 4087430 4092889
16828 4092889 3998091 4189374 4137935 4379904 4685286 4481464 4477596 4569556 4757230 5007274
16818 5007274 4898457 5335231 5005707 5146649 5210210 5214911 5388640 5897912 5821805 6125563
16808 6125563 6312303 6225414 6655155 6423591 6709788 6813153 7133353 7171354 7437908 7737208
$$ packed form
16878A992526K7760j4370J40896n8080k97777J86910Q9297K55218k42183J51775
16868B231972K59632k85975p2359K98010j31841K63995r2673J5587Q7990L0381
16858B604719J4253K46251k08848J24299j97759J14192k09761M16923j14258O3161
16848B853172K65740m5779J03852j0073k08958M24268l13775J52238J11379L23371
16838C655435n109j01002l1281K57473J43659j48264J53134K2372J41013N459
16828D092889r4798J91283n1439K41969L05382k03822l868R1960J87674K50044
16818E007274j08817M36774l29524J40942O3561M701J73729N09272p6107L03758
16808F125563J86740q6889M29741k31564K86197J03365L20200L8001K66554K99300
$$ plain form
16798 7737208 7692108 7866362 7851555 8719921 8458828 8559709 9112095 9548597 9404262 9924076
16788 9924076 10097730 10364886 10622696 10923651 10913298 11523937 11973144 12307498 12765912 12941311
16778 12941311 13742900 14213776 14503647 14751753 15317034 15939038 16531718 17286538 17754229
16769 17754229 18470048 19145743 19724730 20661903 21239227 22137486 23278335 24228009 25148514
16760 25148514 26104273 27400244 28628567 29870092 31773200 32422929 34359213 35702291
16752 35702291 37719746 40153952 41695569 43780159 46574449 49044894 51414511 54955382
16744 54955382 57762962 61579654 65066505 68829220 73116778 78161377 82686974 88334568
16736 88334568 94012974 100139949 106755070 113319432 120579403 128135286 135844187 143915080
$$ packed form
16798G737208m5100J74254j4807Q68366k61093J00881N52386M36502j44335N19814
16788I924076J73654K67156K57810L00955j0353O10639M49207L34354M58414J75399
16778A2941311Q01589M70876K89871K48106N65281O22004N92680P54820M67691
16769A7754229P15819O75695N78987R37173N77324Q98259J140849R49674R20505
16760B5148514R55759J295971J228323J241525J903108O49729J936284J343078
16752C5702291K017455K434206J541617K084590K794290K470445K369617L540871
16744E4955382K807580L816692L486851L762715M287558N044599M525597N647594
16736H8334568N678406O126975O615121O564362P259971P555883P708901Q070893
$$ plain form
16728 143915080 151805779 159653094 167540699 174822685 180998088 186644831 190644805 193970160
16720 193970160 195565061 195794184 194519103 191470335 187224333 182145146 175280902 168594268
16712 168594268 160979700 152918713 144990054 136778458 128765142 121154969 113773044 106619145
16704 106619145 100333198 93732711 87718311 82459918 77554826 72898878 68383251 64191499
16696 64191499 60277100 56796753 53635266 50481250 48072490 45556450 43099409 40813750
16688 40813750 38781449 36839534 34846562 33298410 31872380 30066297 28712306 27436207
16680 27436207 26129446 24867937 24087044 23166142 21864642 21209793 20163214 19539682 18819101
16671 18819101 18139863 17510273 16766379 16166084 15820866 15230659 14361265 14013300 13805930
$$ packed form
16728A43915080P890699P847315P887605P281986O175403N646743L999974L325355
16720A93970160J594901K29123j275081l048768m246002n079187o864244o686634
16712A68594268p614568q060987p928659q211596q013316p610173p381925p153899
16704A06619145o285947o600487o014400n258393m905092m655948m515627m191752
16696F4191499l914399l480347l161487l154016k408760k516040k457041k285659
16688D0813750k032301j941915j992972j548152j426030j806083j353991j276099
16680B7436207j306761j261509p80893r20902j301500o54849j046579o23532p20581
16671A8819101o79238o29590p43894o00295l45218n90207q69394l47965k07370
$$ plain form
16662 13805930 13242757 12697753 12272866 11826566 11547103 10822265 10829984 10701337 10294656 9818367
16652 9818367 9445243 9343514 9108672 8776241 8362535 8465743 7996312 7801610 7832350 7506661
16642 7506661 7456406 7248428 6895494 6983358 6911408 6275679 6360212 6096183 6146758 5850665
16632 5850665 5579296 5665803 5077224 5303914 5158751 5371795 5196754 4793340 4464946 4539636
16622 4539636 4480855 4656627 4457092 4334484 4047089 3993090 4152572 3905131 3902557 3814380
16612 3814380 3850730 3878028 3586795 3471090 3109745 3162835 3572257 3270794 3203016 3269504
16602 3269504 3384132 3285048 2793502 2720556 3035736 2849822 2633460 2700523 2741817 2440695
16592 2440695 3177287 2278262 2502583 2503851 2624358 2537548 2115341 2616970 2416838 2493691
$$ packed form
16662A3805930n63173n45004m24887m46300k79463p24838P719j28647m06681m76289
16652I818367l73124j01729k34842l32431m13706J03208m69431j94702L0740l25689
16642G506661n0255k07978l52934Q7864p1950o35729Q4533k64029N0575k96093
16632E850665k71369Q6507n88579K26690j45163K13044j75041m03414l28394P4690
16622D539636n8781J75772j99535j22608k87395n3999J59482k47441k574q8177
16612C814380L6350K7298k91233j15705l61345N3090M09422l01463o7778O6488
16602C269504J14628r9084m91546p2946L15180j85914k16362O7063M1294l01122
16592B440695P36592q99025K24321J268J20507q6810m22207N01629k00132P6853
$$ plain form
16582 2493691 2353353 2105612 2198157 2105278 2082788 2119408 2043568 1787153 1819381 2073967
16572 2073967 2150874 2141752 2018814 1810267 1931571 2172055 1940540 1825889 1668421 2005425
16562 2005425 1835690 1519143 1918524 1828138 1827846 1783350 1665756 1475747 1587406 1767523
16552 1767523 1476346 1575027 1642292 1505287 1299530 1265514 1277630 1589175 1160556 1488741
16542 1488741 1441735 1245904 1420246 1205241 1390172 1164405 1519960 1221275 1478991 765810
16532 765810 955679 1109564 1065282 1172532 942783 1259626 1280794 1106822 840824 858346
16522 858346 1199012 1295939 627292 917897 1043477 1090182 1117419 1395853 1110258 933487
16512 933487 980041 747917 657757 664933 883962 847811 937593 876093 876165 748870 1010691
$$ packed form
16582B493691j40338k47741R2545r2879k2490L6620p5840k56415L2228K54586
16572B073967P6907r122j22938k08547J21304K40484k31515j14651j57468L37004
16562B005425j69735l16547L99381r0386k92m4496j17594j90009J11659J80117
16552A767523k91177R8681O7265j37005k05757l4016J2116L11545m28619L28185
16542A488741m7006j95831J74342k15005J84931k25767L55555k98685K57716p13181
16532G65810J89869J53885m4282J07250k29749L16843K1168j73972k65998J7522
16522H58346L40666R6927F27292K90605J25580M6705K7237K78434k85595j76771
16512I33487M6554k32124r0160P176K19029l6151Q9782o1500P2j27295K61821
$$ plain form
16501 1010691 937829 820372 622417 753513 1031936 662023 890258 801486 655001 649338
16491 649338 817095 337154 599889 643424 820019 898052 843203 467387 620282 918857
16481 918857 830295 557667 1087042 515536 298131 546689 519032 401927 503957 704340
16471 704340 512912 637338 663632 408753 213226 662146 446371 512274 731608 715846
16461 715846 797760 596446 635774 504506 470975 513108 375529 564960 476626 287451
16451 287451 889592 425691 456273 522130 608261 510239 630943 630475 331758 366737 432893
16440 432893 408041 417938 239770 580185 407285 727773 535452 573400 392911 639599
16430 639599 658681 741037 489032 342357 467193 238223 405492 642080 295364 396166
$$ packed form
16501A010691p2862j17457j97955J31096K78423l69913K28235q8772j46485n663
16491F49338J67757C37154K62735M3535J76595P8033n4849l75816J52895K98575
16481I18857q8562k72628N29375E15536k17405K48558k7657j17105J02030K00383
16471G04340j91428J24426K6294k54879j95527M48920k15775O5903K19334j5762
16461G15846Q1914k01314L9328j31268l3531M2133j37579J89431q8334j89175
16451B87451O02141D25691L0582O5857Q6131r8022J20704m68k98717L4979O6156
16440D32893k4852R897j78168L40415j72900L20488j92321L7948j80489K46688
16430F39599J9082Q2356k52005j46675J24836k28970J67269K36588B95364J00802
$$ plain form
16420 396166 272553 588290 176146 511851 505596 392418 201361 623556 171224 600275
16410 600275 89356 281653 339629 651927 213205 175482 327994 439120 416569 702910
16400 702910 176685 331417 641345 609743 145051 748904 48489 45911 226177 530437
16390 530437 241886 412470 224254 238806 -14266 608110 10771 256493 392993 273884
16380 273884 330957 340977 117313 181091 180521 411863 404022 244574 113013 356607 -82487
16368 120740 647760 219799 -14810 210671 198456 220399 118445 184206 346539 593850
16358 593850 276430 39860 237329 349078 189873 468417 203285 228888 319313 449823
16348 449823 396658 270149 126774 218297 204704 49541 128401 90752 213462 430845 439879
$$ packed form
16420C96166j23613L15737A76146L35705o255j13178j91057M22195A71224M29051
16410F00275H9356J92297N7976L12298B13205l7723J52512J11126k2551K86341
16400G02910A76685J54732L09928l1602A45051O03853D8489k578J80266L04260
16390E30437B41886J70584j88216J4552a4266F08110A0771K45722J36500j19109
16380B73884N7073J0020A17313O3778n70K31342p841j59448A13013K43594h2487
16368A20740N27020B19799a4810B10671j2215K1943j01954O5761J62333K47311
16358E93850B76430C9860J97469J11749j59205K78544B03285K5603R0425J30510
16348D49823n3165j26509A26774R1523j3593D9541P8860l7649J22710K17383R034
$$ plain form
16337 439879 448932 248008 -57314 -123893 473424 5776 17855 418970 133611 174376 313968
16326 313968 8336 -53480 388117 239457 82414 179561 358790 193944 183700 362936 179955
16314 322936 188406 284983 -41136 486723 115878 273367 344615 128306 415010 306195
16304 306195 451043 288607 82039 360036 55337 158261 430752 -87140 162785 433473
16294 433473 242889 245382 -3184 47150 -40858 166373 178392 282864 267661 345083 281937
16283 281937 25175 390048 92613 134406 233109 69629 216813 132529 377903 -209340 160872
16271 121191 -37381 40723 166814 184499 326559 -13461 445378 147247 32017 381935
16261 381935 285664 94869 288344 174596 290262 -8602 307947 175707 176004 -26181 205897
$$ packed form
16337D39879R053k00924e7314o6579D73424E776J2079M01115A33611M0765J39592
16326C13968H336e3480C88117j48660H2414R7147J79229j64846j0244J79236A79955
16314C22936j34530R6577d1136D86723A15878J57489P1248A28306K86704j08815
16304C06195J44848j62436H2039K77997E5337J02924K72491h7140A62785K70688
16294D33473j90584K493c184D7150d0858A66373J2019J04472j5203P7422o3146
16283B81937B5175L64873I2613M1793R8703F9629J47184q4284K45374b09340A60872
16271A21191c7381D0723J26091J7685J42060a3461D45378A47247C2017L49918
16261C81935r6271I4869J93475j13748J15666h602C07947j32240K97b6181B05897
$$ plain form
16249 237709 8489 33841 133228 98180 -127201 237104 263060 107163 381631 86200 -90898
16237 299927 195096 -24642 281724 113432 196488 104757 134507 141881 97407 84820 -207756
16225 71344 130508 85663 -21885 -54209 185565 24209 413817 -4812 180699 170654 -29631
16213 197569 82192 402747 -99958 -156846 56291 -275382 146650 100304 -3851 241167 272639
16202 272639 -39007 46961 374329 52361 140620 92294 274736 57146 7997 -24943 41773
16190 134139 32536 355145 -84497 -35512 22409 -86233 94243 34175 -17319 324446 -22251
16178 249074 -202376 53237 337709 -91817 -30668 148611 66372 -28504 224262 -33929 324739
16166 78559 45951 278886 78984 120823 -146488 178157 101422 -60935 -43705 188197 17608
$$ packed form
16249B37709H489K5352R9387l5048a27201B37104K5956A07163K74468H6200i0898
16237B99927j04831b4642B81724A13432Q3056r1731K9750P374m4474j2587b07756
16225G1344N9164m4845b1885l2324A85565B4209L89608d812A80699j0045b9631
16213A97569H2192L20555i9958n6888E6291b75382A46650m6346c851B41167L1472
16202B72639c9007D6961L27368E2361Q8259m8326J82442E7146G997b4943D1773
16190A34139C2536L22609h4497c5512B2409h6233I4243C4175a7319C24446b2251
16178B49074b02376E3237K84472i1817c0668A48611F6372b8504B24262c3929C24739
16166G8559l2608K32935G8984M1839a46488A78157p6735f0935J7230A88197A7608
$$ plain form
16154 -115122 120222 -59984 11365 -144095 -1476 269498 -78697 -284997 -135453 118212
16143 181412 -136001 -69006 -85310 152650 -8658 -62353 -21412 22497 132694 -249210 127460
16131 237149 119335 -43121 93065 -144426 284623 -153675 6780 117479 -26457 112162
16120 -18293 217388 121782 133332 96662 275422 37305 230218 -78249 -173094 -77575 88697
16108 27778 -65372 -163046 -130608 79659 140962 154123 -94983 177595 -122636 -68041 -302033
16097 -302033 10345 40915 88333 -46211 -182692 -124066 63602 71960 64254 7433 115250 123206
16085 123206 -106332 177333 -235856 -2933 -124071 -18826 361121 40258 139264 58343 115123
16074 115123 165063 201898 -252828 181520 -197248 76131 49669 -983 -207371 189462 -42077
$$ packed form
16154a15122A20222e9984A1365a44095a476B69498g8697k06300a35453A18212
16143A81412a36001O6995j6304A52650h658n3695b1412B2497J10197b49210A27460
16131B37149j17814d3121I3065a44426B84623a53675F780J10699b6457A12162
16120a8293B17388r5606J1550l6670J78760C7305J92913g8249r4845g7575H8697
16108B7778f5372r7674L2438G9659O1303J3161i4983A77595a22636N4595k33992
16097c02033A0345L0570M7418d6211j36481N8626F3602Q358p706G433J07817P956
16085A23206a06332A77333b35856b933j21138a8826C61121D0258R9006E8343N6780
16074A15123M9940L6835b52828A81520a97248G6131k6462i83k06388A89462d2077
$$ plain form
16062 -97465 -41701 -101289 -286808 128161 -183843 -80068 -141567 252133 -144553 358810
16051 -370053 59215 76766 -21376 -39905 12903 -31586 -88055 -74331 -44254 58938 -33165
16039 -82033 -127624 -141397 52474 -27711 -89350 36088 -274373 157494 -90694 3450 142464
16028 142464 -353568 -107160 -150706 -2979 -512 75850 -102310 -212019 140608 -120631 59803
16016 82750 -96454 -273050 42887 88067 -210830 109908 -67993 -115666 -155674 -60070 -43744
16005 -43744 5319 31335 96255 72332 144013 228538 116234 144767 119779 -156511 -194148
15994 -194148 -152466 19094 -164097 117 248999 47031 -59339 -117458 43272 29222 126848
15983 126848 30580 250252 276810 -18541 96449 -178199 -252432 -38109 187279 -120976 -136133
$$ packed form
16062i7465d1701n9588j85519A28161a83843h0068o1499B52133a44553C58810
16051c70053E9215J7551b1376j8529A2903c1586n6469J3724L0077E8938c3165
16039h2033m5591j3773E2474b7711o1639C6088b74373A57494i0694C450J39014
16028A42464c53568a07160m3546b979e12G5850a02310j09709A40608a20631E9803
16016H2750i6454j76596D2887M5180b10830A09908f7993m7673m0008f0070J6326
16005d3744E319K6016O4920k3923P1681Q4525j12304K8533k4988a56511l7637
15994a94148M1682A9094a64097A17K48882D7031e9339n8119D3272j4050R7626
15983A26848C0580K19672K6558a8541I6449a78199p4233c8109A87279a20976j5157
$$ plain form
15972 -136133 511678 -53403 167322 -107125 50215 48603 -206815 -105527 -167439 -100931 326648
15960 210452 231458 -36816 2196 -308750 87164 19504 -285824 50577 -104983 -310413 43054
15948 56052 -175002 135946 70686 54223 131051 125637 83292 -126380 -169491 -120811 -271092
15937 -271092 -132911 118891 -89903 -467406 -260105 77559 -148854 230507 -8349 -163957
15927 -163957 -12380 4954 142842 -342842 -28315 -11746 -315802 -31557 -135594 116662 -123497
15915 269645 112176 40590 79063 -246287 -9772 18810 133567 9274 -107617 -221793 144890
15903 14249 -59675 36176 -12958 -359806 405732 -169447 -100818 -2155 -140627 -152322 82338
15891 -207208 -13281 190266 -13846 -150041 -185371 -20488 181908 -40622 -119062 44961 -81517
$$ packed form
15972a36133E11678e3403A67322a07125E0215j612b06815J01288o1912O6508C26648
15960B10452K1006c6816B196c08750H7164A9504b85824E0577a04983k05430D3054
15948E6052a75002A35946o5260j6463P6828n414m2345a26380m3111M8680j50281
15937b71092a32911A18891h9903l77503K07301G7559a48854B30507h349j55608
15927a63957a2380D954J37888c42842b8315a1746l04056c1557j04037A16662a23497
15915B69645A12176D0590L8473b46287i772A8810J14757I274a07617j14176A44890
15903A4249e9675C6176a2958l46848D05732a69447O8629b155j38472j1695H2338
15891b07208a3281A90266a3846j36195l5330b0488A81908d0622p8440D4961h1517
$$ plain form
15879 -141044 -239279 19731 12171 193763 -229510 -348597 -1038 93121 -134684 -64821 -415311
15868 -415311 50944 -21092 -135634 -232074 -132714 -118761 77593 -194138 128782 148714 -229455
15856 -1313 -149100 6227 -97179 274671 16870 -180843 53032 -22165 -67693 -60806 87747 180837
15844 180837 -185943 -167010 -225924 -197794 -154161 37481 -128143 153382 61758 -171719 -29453
15832 50076 230777 1606 -78111 -218794 -108185 -214237 -73903 -31259 -207375 -83359 12538
15820 11169 -175910 -86908 100329 2321 36846 -349498 -8417 157948 -110100 144325 -97197
15808 -554996 -347526 106785 138028 7693 188255 -219384 -74632 122603 57366 -188233
15797 -156657 99444 -79157 -61737 -49850 30046 -98340 -155819 -180425 -164960 237172 -109971
$$ packed form
15879a41044r8235A9731p560J81592b29510j19087a038I3121a34684f4821l50490
15868d15311E0944b1092j14542r6440R9360J3953G7593a94138A28782J9932b29455
15856a313j47787F227i7179B74671A6870a80843E3032b2165m5528O887H7747R3090
15844A80837a85943J8933n8914K8130M3633C7481a28143A53382F1758a71719b9453
15832E0076J80701A606g8111j40683a08185j06052g3903c1259j76116h3359A2538
15820A1169a75910h6908A00329B321L4525c49498h417A57948a10100A44325i7197
15808e54996K07470A06785L1243G693J80562b19384g4632A22603E7366a88233
15797a56657I9444g9157J7420J1887C0046i8340n7479k4606J5465B37172a09971
$$ plain form
15785 -109023 -21146 9588 -138601 -50806 500860 -141657 126247 -79533 -369200 -71664 -258971
15774 -258971 -94153 -97346 -118184 -9812 -212905 24459 -266047 -196003 -381811 -241186 97696
15762 -2877 151504 183900 197810 -145828 -367299 -82249 269210 308279 -64552 -95444 -86759
15751 -86759 -35546 -52336 -235283 -258428 260521 212803 186871 43139 495087 35456 -246516
15739 200139 -186327 165837 -185254 -50903 131121 239614 -3409 -86522 -68339 91341 -198683
15727 12061 -190890 -149671 49446 -87119 -135578 -84116 47551 -14436 126339 143827 -250658
15715 -220944 147996 -169104 141755 148842 -229947 -169341 84003 -9757 -239846 58965 -187582
15703 88438 -2096 -67425 13382 -109313 63070 32361 -82300 -77411 -86225 234547 -354638 -291084
$$ packed form
15785a09023b1146I588a38601e0806E00860a41657A26247g9533k89667g1664j87307
15774b58971i4153l193k0838i812k03093B4459b66047P0044j85808J40625I7696
15762b877A51504L2396J3910a45828k21471h2249B69210L9069f4552l0892Q685
15751h6759c5546j6790j82947k3145B60521m7718k5932D3139M51948C5456b46516
15739B00139a86327A65837a85254e0903A31121J08493c409q3113J8183I1341a98683
15727A2061a90890M1219D9446h7119m8459N1462D7551a4436A26339J7488b50658
15715b20944A47996a69104A41755P087b29947O0606H4003i757k30089E8965a87582
15703H8438b096o5329A3382a09313F3070l0709h2300M889q814B34547c54638O3554
$$ plain form
15691 -291084 -309066 9531 383908 -12239 124076 -128869 46485 111547 -2475 -338901 -14204
15679 -37942 54970 -123554 -501356 -220805 -53428 -21124 -182440 -190466 186233 44599 -132036
15667 190242 105420 -139125 -95540 -12459 -112811 -206463 -26743 -355687 -146843 -14176 -63819
15656 -63819 164669 -239319 18727 -154390 271577 -230543 104760 89086 -77776 82400
15645 -49091 -118997 -135540 -233302 -147297 -143937 -51242 24463 17549 313939 18533 -167635 36160
15632 110695 -183349 -162472 -73550 -74931 -72459 -10949 218796 31522 68397 208928 31337
15620 -204134 -204923 -216813 -134618 118221 21546 -20566 163652 -16269 -65693 80068 -130074
15608 -68689 160935 84336 -4263 -269003 -93757 -164280 -259287 -88870 253280 134858 -90902
$$ packed form
15691b91084j7982I531L74377a2239A24076a28869D6485O5062b475l36426a4204
15679c7942E4970a23554l77802b20805e3428b1124j61316q026A86233D4599a32036
15667A90242q4822a39125M3585a2459j00352r3652b6743l28944a46843a4176m9643
15656f3819A64669b39319A8727a54390B71577b30543A04760j5674g7776H2400
15645d9091o9906j6543r7762Q6005L360e1242B4463o914K96390A8533a67635C6160
15632A10695a83349K0877g3550j381K472a0949B18796C1522L6875J40531C1337
15620b04134p89j1890Q2195A18221B1546b0566A63652a6269m9424H0068a30074
15608f8689A60935p6599d263k64740i3757p0523r5007h8870B53280j18422i0902
$$ plain form
15596 -254543 318704 48865 34536 -338550 174874 10487 -77348 316837 95553 176371 -189248
15584 157370 -285713 3012 94878 -315410 65569 -259345 -268671 -231383 -189095 -26583 17764
15572 82293 -199072 -13722 -92251 125946 -207505 -36173 139181 -223677 35266 -66248 -210299
15561 -210299 130721 55149 120154 58811 -125276 70181 86631 -289752 -119597 127175
15550 61495 -140371 119738 -194618 -21454 -7005 -226986 50135 -143228 -162067 78620 -96565
15538 -105644 -173457 -145935 -58891 -4500 346869 12736 -221343 10983 260129 -47948 -149380
15527 -149380 45318 -21436 75214 -164300 4396 -42623 -126632 -325010 116787 -91940 100935
15515 138158 -30862 39665 -35307 279525 -143926 9800 58021 -205559 22365 75635 162769
$$ packed form
15596b54543C18704D8865j4329c38550A74874A0487g7348C16837I5553Q0818a89248
15584A57370b85713C012R1866c15410F5569b59345r326L7288M2288b6583A7764
15572H2293a99072a3722p8529A25946b07505c6173A39181b23677C5266f6248j44051
15561b10299A30721E5149O5005E8811a25276G0181J6450b89752a19597A27175
15550F1495a40371A19738a94618b1454g005k19981E0135a43228j8839G8620i6565
15538a05644o7813K7522e8891d500C46869A2736b21343A0983K49146d7948j01432
15527a49380D5318b1436G5214a64300D396d2623q4009j98378A16787i1940A00935
15515A38158c0862C9665c5307B79525a43926I800M8221b05559B2365N3270Q7134
$$ plain form
15504 162769 -169284 -52520 148234 143574 108313 171084 -23064 193998 -312399 -57554 146293
15492 95600 -171609 9653 7990 54110 15583 -68184 74163 -375995 -373800 -107125 151107
15480 47564 -92253 147190 -40625 -24453 95366 100567 -154319 23661 98077 339880 81527
15468 162444 -21330 82819 -148652 -168652 190358 207667 173380 179832 108739 249688 35692
15456 123628 169462 126745 156785 96537 -410680 22146 -17845 -268925 71500 96647 -4360
15444 -62359 142363 -291754 -209230 -27209 218271 -248106 -271931 -175847 151584 233981 368798
15433 368798 -11802 269704 58839 120264 228192 76161 46736 -135050 -3075 -148117 118632
15421 -125455 73952 -47052 -122752 198501 -205883 134013 -197925 -42173 34530 -104385
$$ packed form
15504A62769a69284e2520A48234m660l5261O2771b3064A93998c12399e7554A46293
15492I5600a71609I653j663M6120A5583f8184G4163c75995K195a07125A51107
15480D7564i2253A47190d0625J6172I5366N201a54319B3661P4416K41803H1527
15468A62444b1330H2819a48652k0000A90358J7309l4287O452p1093J40949C5692
15456A23628M5834m2717L0040o0248d10680B2146a7845k51080G1500K5147d360
15444f2359A42363b91754Q2524b7209B18271b48106k3825R6084A51584Q2397J34817
15433C68798a1802B69704E8839O1425J07928G6161k9425a35050c075j45042A18632
15421a25455G3952d7052p5700A98501b05883A34013a97925d2173C4530a04385
$$ plain form
15410 -176807 95179 -94292 -62455 -16190 196177 -72759 13717 39801 -53644 -135088 113889
15398 -83073 76840 -189922 -334997 -11480 121776 -91525 107175 56525 219104 117966
15388 117966 -186744 -37265 -43365 -295783 -146129 -81618 -329765 -136262 -253214 384946
15377 -321898 381998 -135869 -88929 61391 -166381 -59196 -453563 -60390 92365 -281515
15366 279037 44576 -33996 63398 -182722 -99754 -121267 51926 -79422 28699 -362085 -70243
15354 119253 200919 87714 -310090 6697 104414 -249253 264343 -2560 -85339 115930 183671
15343 183671 -2211 155895 155237 200994 74722 -119132 -72989 209231 -207663 -326741 -229512
15332 -229512 54765 -173380 -19287 263436 -16872 140809 4046 75836 168728 -55518 -92134
$$ packed form
15410a76807I5179i4292L1837a6190A96177g2759A3717K6084e3644q1444A13889
15398h3073G6840a89922j45075a1480A21776i1525A07175n0650J62579j01138
15388A17966a86744c7265o100k52418a46129O4511k48147a36262j16952C84946
15377c21898C81998a35869M6940F1391a66381e9196l94367f0390I2365b81515
15366B79037D4576c3996F3398a82722Q2968k1513E1926g9422B8699c62085g0243
15354A19253Q1666H7714c10090F697R7717b49253B64343b560q2779A15930O7741
15343A83671b211A55895o58M5757G4722a19132M6143B09231b07663j19078R7229
15332b29512E4765a73380a9287B63436a6872A40809D046P1790R2892e5518l6616
$$ plain form
15321 -92134 33357 202039 -48757 -146885 174220 177181 121186 -168304 -138360 -20506 -20693 125690
15308 209108 248727 -306041 213211 384505 168043 -73460 98638 359666 101127 188962
15298 188962 58795 8226 -6234 160559 -218167 156708 178026 -79898 -492 157028 204855
15287 204855 -6998 -86966 55297 -163786 -143245 202334 130296 -22732 33521 289787 303663
15276 303663 309039 336443 81231 60741 87136 163870 555 -227774 40068 -16349 -68207 105165
15263 -301775 -287566 -255582 77076 133895 -50762 137399 -43081 99175 33437 199714 308880
15252 308880 386867 887598 741249 1332589 889087 1243125 782421 158908 154447 67689
15241 45269 -7258 119342 497204 334544 -75348 247572 -34098 -52487 -219048 -323021 63674
$$ packed form
15321i2134C3357J68682d8757r8128A74220K961n5995a68304K9944b0506j87A25690
15308B09108L9619c06041B13211J71294A68043g3460I8638K61028A01127Q7835
15298A88962E8795H226f234A60559b18167A56708K1318g9898d92A57028M7827
15287B04855f998p9968E5297a63786K0541B02334p2038b2732C3521K56266J3876
15276C03663N376K7404H1231k0490K6395P6734E55b27774D0068a6349n1858A05165
15263c01775J4209L1984G7076N6819e0762A37399d3081I9175C3437J66277J09166
15252C08880P7987N00731j46349N91340m43502L54038m60704A58908m461F7689
15241D5269g258A19342L77862j62660g5348B47572c4098j8389j66561j03973F3674
$$ plain form
15229 191467 -86524 109721 359634 -17211 261 53688 188362 121200 364677 56258 40236
15218 40236 47320 190829 -438320 -160638 207293 -54022 118143 178420 313899 45231 95026
15207 95026 225159 -5677 30686 -295214 42905 323323 215580 245001 -140976 -175732 -238734
15196 -238734 273022 -193622 61 -17613 95415 78735 217979 -125817 122540 135805 329083
15185 329083 -258046 31606 206883 192828 46838 -137026 179498 -35248 -40564 -277994 -34854
15173 4844 232221 147855 -98221 275791 -140921 84579 153181 48599 47886 -82458 -202144
15162 -202144 -70287 195965 136821 225772 38760 231454 573509 -200067 161327 -202910
15151 -24834 -32760 -130779 -258792 -49981 -187582 217422 -238370 79761 162968 179745 114785
$$ packed form
15229A91467h6524A09721K49913a7211B61N3427J34674o7162K43477E6258j6022
15218D0236P084J43509d38320a60638B07293e4022A18143O0277J35479D5231M9795
15207I5026J30133e677C0686b95214D2905K80418j07743K9421a40976l4756o3002
15196b38734B73022a93622F1a7613I5415j6680J39244a25817A22540J3265J93278
15185C29083b58046C1606J75277j4055D6838a37026A79498c5248n316k37430c4854
15173D844K27377q4366i8221B75791a40921H4579O8602D8599p13h2458j19686
15162b02144g0287A95965n9144Q8951C8760J92694L42055b00067A61327b02910
15151b4834p926r8019j28013d9981j37601B17422b38370G9761Q3207J6777o4960
$$ plain form
15140 114785 168467 204356 -126697 270401 152152 4379 128433 279423 144244 135641 367516
15129 367516 128848 187732 63994 43515 187707 17620 38242 235784 -118776 193437
15118 -201167 90999 226461 -121026 -79141 -130309 53289 57546 119029 202632 47566 308003
15107 308003 -145334 308739 430178 -127004 227670 -139156 156583 -192484 42313 517374
15097 517374 -44289 35640 68978 129845 245603 71183 94946 191415 372000 -86232 -285418
15086 -285418 -48697 246543 -75320 8338 370951 317897 2063 -215989 418737 111876 -82574
15074 265041 202345 62624 129290 192467 -295182 403750 -19294 331518 -37631 -132218 141808
15062 140721 -118036 -126216 655113 86733 349530 295896 136761 47124 161185 102748 -98582
$$ packed form
15140A14785N3682L5889a26697B70401j18249D379J24054J50990j35179q603K31875
15129C67516A28848N8884F3994k0479J44192A7620K0622J97542a18776A93437
15118b01167I0999J35462a21026M1885n1168E3289M257O1483Q3603D7566K60437
15107C08003a45334C08739J21439a27004B27670a39156A56583a92484D2313M75061
15097E17374d4289C5640L3338O0867J15758G1183K3763R6469J80585h6232j99186
15086b85418d8697B46543g5320H338L62613n3054B063b15989D18737A11876h2574
15074B65041o2696F2624O6666O3177b95182D03750a9294C31518c7631r4587A41808
15062A40721a18036q180F55113H6733K62797n3634A36761D7124J14061n8437i8582
$$ plain form
15050 -191913 -56754 167373 -72887 61806 71248 98829 -113162 65081 141881 122523 -4510
15038 114955 152637 213390 123675 405325 158347 191810 24401 276828 209780 -3574 164885
15026 292596 290430 418640 211489 149514 222361 -143669 177830 75394 206462 -79747 76277
15014 214222 70082 2141 -24944 274884 278710 140795 259464 253400 144057 150982 151912 -64923
15001 -63719 310360 43111 121269 60485 70795 388462 -90304 274927 148977 414325 -85829
14989 135483 47263 329985 -210578 -122023 198467 178457 257348 25683 307121 26108 70971
14978 70971 271931 79841 274927 349738 178065 430849 102455 156371 505960 242997
14967 174400 92101 212399 -3386 157130 493592 189318 258710 54628 151730 106604 396099
$$ packed form
15050a91913e6754A67373g2887F1806R442K7581a13162F5081P6800j9358d510
15038A14955L7682O0753q9715K81650A58347L3463B4401K52427o7048c574A64885
15026B92596k166J28210k07151o1975P2847a43669A77830G5394J31068g9747G6277
15014B14222G0082B141b4944B74884L826j37915J18669o064j09343O925R30f4923
15001f3719C10360D3111P8158F0485J0310L17667i0304B74927j25950K65348h5829
14989A35483D7263K82722b10578Q8555A98467k0010P8891B5683K81438B6108M4863
14978G0971K00960G9841J95086P4811j71673K52784A02455N3916L49589B42997
14967A74400q2299J20298c386A57130L36462A89318O9392E4628R7102m5126K89495
$$ plain form
14956 396099 289596 -181871 485660 250374 177031 125002 389489 373349 296460 34818
14945 9333 -183130 93304 84573 437760 231660 394774 345208 196557 322821 241138 273022
14934 273022 108771 465449 412372 78799 425910 414437 169215 196378 47905 218856
14924 218856 164696 92475 125950 122176 321401 332078 219491 299009 213217 365433 141670
14912 424819 323026 78161 295898 393052 310265 313661 401618 -21255 268050 153399 107103
14901 107103 310908 181143 328615 437976 393280 190412 160076 294345 120634 158306
14891 158306 413330 419723 158464 366243 435985 412573 290884 507763 -46676 363492
14880 464619 434321 226855 294265 331318 748434 540086 228527 363226 -16429 275648
$$ packed form
14956C96099j06503a81871D85660k35286p3343n2029K64487j6140p6889C4818
14945I333a83130I3304q731L53187k06100J63114m9566j48651J26264q1683L1884
14934B73022A08771L56678n3077G8799L47111j1473A69215K7163D7905J70951
14924B18856n4160p2221L3475l774J99225J0677j12587P9518q5792J52216A41670
14912D24819j01793G8161K17737R7154q2787L396Q7957b1255B68050j14651m6296
14901A07103K03805j29765J47472J09361m4696A90412l0336J34269A20634L7672
14891A58306K55024O393A58464K07779O9742k3412j21689K16879d6676C63492
14880D64619l0298k07466O7410L7053M17116k08348B28527J34699a6429B75648
$$ plain form
14869 401268 361428 258529 472494 434882 505693 445085 275295 707921 229385 269094
14859 269094 542797 423360 266996 556391 367370 476241 469056 438623 451204 351545
14849 351545 726044 302928 372490 466597 476147 469204 411883 402596 420192 564116 219076
14837 225444 176405 448198 554642 370338 230473 281092 262863 493062 386535 446211
14827 446211 462716 279072 318829 452283 410695 477222 605289 716014 408771 274212
14817 274212 468762 311101 298800 328823 593577 392798 574287 660582 415358 604317
14807 604317 290024 542987 544135 503471 369402 614110 493539 199827 480617 78869
14796 801148 578893 554351 742313 735332 773899 666855 460743 314966 606193 385998
$$ packed form
14869D01268l9840j02899K13965l7612P0811o0608j69790M32626B29385L9709
14859B69094K73703j19437j56364K89395j89021J08871p185l0433J2581r9659
14849C51545L74499C02928O9562R4107R550o943n7321r287J7596J43924B19076
14837B25444m9039K71793J06444j84304j39865N0619j8229K30199j06527N9676
14827D46211J6505j83644L9757J33454m1588O6527J28067J10725l07243j34559
14817B74212J94550j57661j2301L0023K64754k00779J81489Q6295k45224J88959
14807F04317B90024K52963J148m0664j34069K44708j20571A99827K80790G8869
14796H01148k22255k4542J87962o981L8567j07044k06112j45777K91227k20195
$$ plain form
14786 385998 506326 456796 326284 476548 353218 247984 619938 527854 536229 440410
14776 440410 346437 561959 730087 645628 424007 616801 452876 417912 564964 622344
14766 622344 232860 431968 566151 369459 625394 529280 465691 624183 508885 708169
14756 708169 529440 795451 637921 337641 267865 847777 692119 606999 352388 593268
14746 593268 870890 375290 746548 557512 815008 417131 982952 723661 521038 492344
14736 492344 480058 532827 530997 750679 769551 962430 775802 934272 653508 813712
14726 813712 915193 1001321 694673 632468 506616 635749 951822 911123 844718 639741
14716 639741 774612 528432 747458 880991 706933 531262 988540 1092513 771702 681448
$$ packed form
14786C85998J20328m9530j30512J50264j23330j05234L71954r2084Q375r5819
14776D40410r3973K15522J68128q4459k21621J92794j63925l4964J47052N7380
14766F22344B32860J99108J34183j96692K55935r6114o3589J58492j15298J99284
14756G08169j78729K66011j57530l00280o9776N79912j55658q5120k54611K40880
14746E93268K77622C75290L71258j89036K57496l97877N65821k59291k02623k8694
14736D92344j2286N2769j830K19682J8872J92879j86628J58470k80764J60204
14726H13712J01481Q6128l06648o2205j25852J29133L16073m0699o6405k04977
14716F39741J34871k46180K19026J33533j74058j75671M57278J03973l20811r0254
$$ plain form
14706 681448 921931 959211 534694 1050649 876792 676096 827341 841833 918703 685013
14696 685013 898140 904995 1010004 1036728 993690 849358 1027138 635525 973612 802357
14686 802357 1035052 1015539 570459 928847 688243 649062 717605 886394 1130578 1005510
14676 1005510 947600 921594 1061359 814537 985829 1069350 1331717 890282 963038 969066
14666 969066 1063005 1021666 895246 994143 1122364 945078 827404 974155 1072372 1104387
14656 1104387 915715 1068395 758877 774290 1307396 1385872 762989 1199181 987588 1175254
14646 1175254 1162690 1036554 1189394 1256553 1404152 889384 1307298 1175620 1185556 1059937
14636 1059937 1096117 1297168 1512035 1270744 1199322 990917 1070486 1145373 1129229 1305793
$$ packed form
14706F81448K40483L7280m24517N15955j73857k00696J51245J4492P6870k33690
14696F85013K13127O855J05009K6724m3038j44332J77780l91613L38087j71255
14686H02357K32695j9513m45080L58388k40604l9181O8543J68789K44184j25068
14676A005510n7910k6006J39765k46822J71292Q3521K62367m41435P2756O028
14666I69066R3939m1339j26420R8897J28221j77286j17674J46751R8217L2015
14656A104387j88672J52680l09518J5413N33106P8476o22883M36192k11593J87666
14646A175254j2564j26136J52840O7159J47599n14768M17914j31678R936j25619
14636A059937L6180K01051K14867k41291p1422k08405P9569P4887j6144J76564
$$ plain form
14626 1305793 1051478 1224935 1399299 1280793 1593503 1298924 1421564 1349812 1310569 1388509
14616 1388509 1466003 1825222 1147997 1656547 1364729 1413356 1421935 1328304 1644194 1710186
14606 1710186 1360775 1537546 1436698 1583367 1558593 1479628 1501807 1348023 1619837 1353084
14596 1353084 1340370 1415498 1947647 1493068 1528310 1519907 1808276 1843156 1828188 1664321 1455171
14585 1455171 2009075 1914367 1996370 1492322 1672189 2159625 1838781 2208939 1930886 1972593
14575 1972593 1838541 2036868 2075138 2010110 1890767 2362994 2309501 2122125 2481641 2481674 2214116
14564 2214116 2488586 2360785 2489475 2468981 2623024 2790998 2608227 2940371 2863767 2994780
14554 2994780 3124005 3754442 4863238 5335923 6713235 9336330 14848413 24044879 40316733
$$ packed form
14626A305793k54315J73457J74364j18506L12710k94579J22640p1752l9243P7940
14616A388509P7494L59219o77225N08550k91818M8627Q579r3631L15890O5992
14606A710186l49411J76771j00848J46669k4774p8965K2179j53784K71814k66753
14596A353084j2714P5128N32149m54579L5242q403K88369L4880j4968j63867k09150
14585A455171N53904r4708Q2003n04048J79867M87436l20844L70158k78053M1707
14575A972593j34052J98327L8270o5028j19343M72227n3493j87376L59516L3k67558
14564B214116K74470j27801J28690k0494J54043J67974j82771L32144p6604J31013
14554B994780J29225O30437J108796M72685J377312K623095N512083R196466J6271854
$$ plain form
14545 40316733 32037118 15020074 6827350 3892169 3047120 2147343 2112671 2133925 2077718
14536 2077718 2140187 1997913 2237661 1750576 1791620 2120676 2256887 2132756 2452334 2461736
14526 2461736 1981818 2079693 2256299 2157953 2347886 2269403 2443750 2256535 2449654 2649373
14516 2649373 2547271 2665130 2775197 2578162 2674612 2613495 2651738 2968700 2923634 2851087
14506 2851087 2689950 2881647 2930446 2769891 2954884 2886520 3074482 3154309 3178179 3045991
14496 3045991 3207174 3086523 3231642 3528449 3169279 3450044 3503561 3188602 3364884 3404154
14486 3404154 3568093 3213127 3520018 3516095 3761234 3940949 3743498 3580030 3625059 3717336
14476 3717336 3668362 3789078 3721265 4022042 4158537 4070368 4064371 4524148 4515728 4201584 4518680
$$ packed form
14545D0316733q279615A5020074F827350k935181q45049q99777l4672K1254n6207
14536B077718O2469j42274K39748m87085M1044L29056J36211j24131L19578R402
14526B461736m79918R7875J76606r8346J89933p8483J74347j87215J93119J99719
14516B649373j02102J17859J10067j97035R6450o1117L8243L16962m5066p2547
14506B851087j61137J91697M8799j60555J84993o8364J87962P9827K3870j32188
14496C045991J61183j20651J45119K96807l59170K80765N3517l14959J76282L9270
14486C404154J63939l54966L06891l923K45139J79715j97451j63468M5029R2277
14476C717336m8974J20716o7813L00777J36495q8169n997M59777q420l14144L17096
$$ plain form
14465 4518680 4183591 4640480 4278605 4139705 4656631 4355633 4522253 4907324 4713703
14456 4713703 4919701 4975089 4949996 4864008 5017572 5211473 5426230 5368845 5330904 5171279
14446 5171279 5383595 5500720 5697420 5817438 5835729 5465621 5738556 5910866 5707595 5900361
14436 5900361 6373430 5950500 6341455 6253190 6372330 6872999 6652031 6353116 6700596 6657304
14426 6657304 7026563 7197578 7241362 7417646 7294389 7507374 7600518 7620095 7654823 8216831
14416 8216831 8363892 8224205 8331260 8434166 8868081 8446008 8546698 8805038 9202509
14407 9202509 9074183 9444863 9559166 9637941 9532038 9737603 10107393 9877455 10520153 10625253
14397 10625253 10708509 10986435 11371831 11259357 11357724 11743865 11716157 12267097 12284045 12288558
$$ packed form
14465D518680l35089M56889l61875j38900N16926l00998J66620L85071j93621
14456D713703K05998N5388k5093q5988J53564J93901K14757n7385l7941j59625
14446E171279K12316J17125J96700J20018J8291l70108K72935J72310k03271J92766
14436E900361M73069m22930L90955q8265J19140N00669k20968k98915L47480m3292
14426F657304L69259J71015M3784J76284j23257K12985R3144J9577L4728N62008
14416H216831J47061j39687J07055J02906M33915m22073J00690K58340L97471
14407I202509j28326L70680J14303P8775j05903K05565L69790k29938O42698J05100
14397A0625253Q3256K77926L85396j12474R8367L86141k7708N50940J6948M513
$$ plain form
14387 12288558 12555034 12941532 13045832 13432189 13618382 13731259 14137762 14233258 14589453
14378 14589453 14849693 15078729 15453327 15666289 16096401 16425611 16766425 16816357 17293364
14369 17293364 17465366 18260904 18785732 18559023 19212350 19541530 20094397 20507485 20773782
14360 20773782 21251440 21717216 22063242 23022035 23245508 23733730 24642083 24974907 25673284
14351 25673284 26350545 26795082 27562019 28419863 28559460 29640835 30612456 31013329 31862844
14342 31862844 33177054 34056300 34918176 35871117 36708507 37842993 39035247 39872764 41272965
14333 41272965 42814559 43788767 44842139 46367517 47673159 49647527 50966627 52730200
14325 52730200 54709790 56547001 58339319 60207813 62427787 64860130 66759813 69551810
$$ packed form
14387A2288558K66476L86498J04300L86357J86193J12877M06503R5496L56195
14378A4589453K60240K29036L74598K12962M30112L29210L40814M9932M77007
14369A7293364J72002P95538N24828k26709O53327L29180N52867M13088K66297
14360B0773782M77658M65776L46026R58793K23473M88222R08353L32824O98377
14351B5673284O77261M44537P66937Q57844J39597J081375R71621M00873Q49515
14342C1862844J314210Q79246Q61876R52941Q37390J134486J192254Q37517J400201
14333D1272965J541594R74208J053372J525378J305642J974368J319100J763573
14325E2730200J979590J837211J792318J868494K219974K432343J899683K791997
$$ plain form
14317 69551810 72443362 74641079 77755972 80657919 83974535 87466983 90860331 94465480
14309 94465480 98156921 102956524 107447383 111775309 116673890 122228308 127612858 133845046
14301 133845046 140125251 146633986 153593874 161340742 169210186 177823225 186606154 196147798
14293 196147798 206060204 216731637 227548322 238944754 251356861 264049642 276778543
14286 276778543 290430233 304498309 318625865 333066925 346882420 361009588 374840863
14279 374840863 387789512 399720671 410975795 420764113 428406036 433265199 435083155
14272 435083155 435215515 435653532 435448038 433070731 428570306 422698932 414425262 404199228
14264 404199228 392319355 379400978 365894094 351615291 337311308 322902547 308305326
$$ packed form
14317F9551810K891552K197717L114893K901947L316616L492448L393348L605149
14309I4465480L691441M799603M490859M327926M898581N554418N384550O232188
14301A33845046O280205O508735O959888P746868P869444Q613039Q782929R541644
14293A96147798R912406J0671433J0816685J1396432J2412107J2692781J2728901
14286B76778543J3651690J4068076J4127556J4441060J3815495J4127168J3831275
14279C74840863J2948649J1931159J1255124R788318P641923M859163J817956
14272D35083155J32360M38017k05494k377307m500425n871374q273670j0226034
14264D04199228j1879873j2918377j3506884j4278803j4303983j4408761j4597221
$$ plain form
14257 308305326 294325262 281053694 267995062 255111278 242641394 230855842 219490147
14250 219490147 208883762 198683360 189080790 179726490 171409811 163191380 155849172 148285999
14242 148285999 141915557 135142634 129253114 123445381 118448372 113414500 108444458 103716536
14234 103716536 99460629 95800107 91946539 88303457 85306476 81498651 78465446 75214505
14226 75214505 72741545 70283991 67439486 64984467 62728972 60768127 58670568 57038408
14218 57038408 54828275 53294237 51337065 50054318 48509012 47178651 45236670 44085548
14210 44085548 42850968 41572615 40403079 39837835 38385768 37300095 36253762 35106351
14202 35106351 34253539 33257983 32691652 31492029 30763167 30119955 29208658 28824875 27918798
$$ packed form
14257C08305326j3980064j3271568j3058632j2883784j2469884j1785552j1365695
14250B19490147j0606385j0200402r602570r354300q316679q218431p342208p563173
14242A48285999o370442o772923n889520n807733m997009n033872m970042m727922
14234A03716536m255907l660522l853568l643082k996981l807825l033205l250941
14226G5214505k472960k457554k844505k455019k255495j960845k097559j632160
14218E7038408k210133j534038j957172j282747j545306j330361j941981j151122
14210D4085548j234580j278353j169536n65244j452067j085673j046333j147411
14202C5106351q52812r95556n66331j199623p28862o43212r11297l83783r06077
$$ plain form
14193 27918798 27364598 26680170 26070408 25316761 24512577 24105865 23615685 23156752 22693905
14184 22693905 22259905 21635746 21285706 20887390 20094048 19844022 19376031 19121721 18668228
14175 18668228 18231519 18153948 17663881 17063579 16974104 16668438 16134336 15894497 15689124 15321180
14165 15321180 15056570 14997358 14753095 14320099 13729489 13698409 13278247 13513145 12865241 12668009
14155 12668009 12606163 12231878 12386631 12015931 11624938 11655004 11470677 10975506 11120177 10867369
14145 10867369 10447484 10499765 10327392 10307830 10112727 10073546 9854865 9546574 9300973 9735753
14135 9735753 9409530 9198659 8880801 8696619 8898562 8824560 8519827 8562630 8627679 8079446
14125 8079446 8168381 8063536 8065681 7818550 7702620 7668022 7346033 7262911 7019712 6945602
$$ packed form
14193B7918798n54200o84428o09762p53647q04184m06712m90180m58933m62847
14184B2693905m34000o24159l50040l98316p93342k50026m67991k54310m53493
14175A8668228m36709p7571m90067o00302q9475l05666n34102k39839k05373l67944
14165A5321180k64610n9212k44263m32996n90610l1080m20162K34898o47904j97232
14155A2668009o1846l74285J54753l70700l90993L0066j84327m95171J44671k52808
14145A0867369m19885N2281j72373j9562j95103l9181k18681l08291k45601M34780
14135I735753l26223k10871l17858j84182K01943p4002l04733M2803O5049n48233
14125H079446Q8935j04845K145k47131j15930l4598l21989q3122k43199p4110
$$ plain form
14115 6945602 7300008 7142632 7097175 6951801 6380113 7062889 6654406 6414503 6561492 6289398
14105 6289398 6174687 6251776 6365858 5949480 5908710 5855485 5724015 5851187 5818913 5529304
14095 5529304 5349916 5529000 5508300 5320562 5186460 5196174 5133873 5472541 4826588 5177209
14085 5177209 4976165 4724097 4906419 4792091 4993352 4592175 4669511 4909061 4487376 4750777
14075 4750777 4727841 4495171 4502343 4385884 4465561 4364383 3989928 3786992 4033160 4007966
14065 4007966 4074347 4255724 4042003 4020599 4184958 3843342 4056841 4008892 3695467 3774118
14055 3774118 3766774 3680379 3594961 3772654 3429736 3641391 3414015 3242836 3359893 3098976
14045 3098976 3301289 3131486 3505512 3331714 3218738 3214080 2897592 3350724 3019055 2941865
$$ packed form
14115F945602L54406j57376m5457j45374n71688O82776m08483k39903J46989k72094
14105F289398j14711P7089J14082m16378m0770n3225j31470J27172l2274k89609
14095E529304j79388J79084k0700j87738j34102R714o2301L38668o45953L50621
14085E177209k01044k52068J82322j14328K01261m01177P7336K39550m21685K63401
14075D750777k2936k32670P172j16459P9677j01178l74455k02936K46168k5194
14065D007966O6381J81377k13721k1404J64359l41616K13499m7949l13425P8651
14055C774118p344q6395q5418J77693l42918K11655k27376j71179J17057k60917
14045C098976K02313j69803L74026j73798j12976m658l16488M53132l31669p7190
$$ plain form
14035 2941865 3324523 2993431 3071600 3197457 2986689 2858925 2692639 3092989 2859646 2846689
14025 2846689 2699459 2591463 2678616 2535808 3000629 2702632 2394334 2606903 2882696 2721922
14015 2721922 2432060 2346730 2328200 2260509 2400361 2421195 2499850 2365584 2527073 2051812
14005 2051812 2329154 2112735 2464485 2131685 2205175 2388772 2132970 2338614 1951169 1713514
13995 1713514 1928480 2527824 2328579 2659423 2627162 3475158 5694539 9232939 17470711
13986 17470711 34931829 34307656 19466111 10820871 7307346 5683374 4514170 4058662
13978 4058662 3640418 3361939 3010420 3112302 2929702 2496667 2624085 2757371 2586625
13969 2586625 2251420 2559615 2428841 2436568 2304151 2415261 2499443 2293273 2366693 2228549
$$ packed form
14035B941865L82658l31092P8169J25857k10768j27764j66286M00350k33343j2957
14025B846689j47230j07996Q7153j42808M64821k97997l08298K12569K75793j60774
14015B721922k89862q5330j8530o7691J39852K0834P8655j34266J61489m75261
14005B051812K77342k16419L51750l32800P3490J83597k55802K05644l87445k37655
13995A713514K14966N99344j99245L30844l2261Q47996K219381L538400Q237772
13986A7470711J7461118o24173j4841545q645240l513525j623972j169204m55508
13978D058662m18244k78479l51519J01882j82600m33035J27418J33286j70746
13969B586625l35205L08195j30774P727j32417J11110Q4182k06170P3420j38144
$$ plain form
13959 2228549 2083397 2189667 2260316 1858686 2078068 1952493 2059637 2022162 1834337 2092349
13949 2092349 1751403 1903472 1897780 2034861 1826024 1612078 1812385 1742032 1483549 1753163
13939 1753163 1769134 1472995 1488314 1833731 1782453 1490175 1511686 1480895 1990733 1557859
13929 1557859 1578680 1741946 1679998 1479684 1534817 1762007 1514950 1405444 1672368 1585090
13919 1585090 1570659 1477957 1681297 1798343 1552032 1223391 1414267 1475299 951798 1512569
13909 1512569 1464729 1452377 1393335 1341242 1295935 1274924 1536751 1169158 1465139 1087334
13899 1087334 1317868 1218798 1403239 1105116 1331590 1453760 1156016 1191066 1487936 1135189
13889 1135189 1269416 1024127 1156339 1171757 1311508 1131518 1182740 1089360 1092469 944723
$$ packed form
13959B228549j45152J06270P0649m01630K19382j25575J07144l7475j87825K58012
13949B092349l40946J52069n692J37081k08837k13946K00307p0353k58483K69614
13939A753163J5971k96139J5319L45417n1278k92278K1511l0791N09838m32874
13929A557859K0821J63266o1948k00314N5133K27190k47057j09506K66924q7278
13919A585090j4431r2702K03340J17046k46311l28641J90876O1032n23501N60771
13909A512569m7840j2352n9042n2093m5307k1011K61827l67593K95981l77805
13899A087334K30534r9070J84441k98123K26474J22170k97744L5050K96870l52747
13889A135189J34227k45289J32212J5418J39751j79990N1222r3380L109j47746
$$ plain form
13879 944723 1292263 1205193 1206648 1100816 1241327 985566 1318557 1268333 1037814 1095431
13869 1095431 1106518 1292670 1305338 1252631 1142391 884213 1459423 627697 1492464 838782
13859 838782 681190 1312521 1182655 979927 1059784 997396 1174162 1191502 973440 737726
13849 737726 1001046 970846 959141 984038 898704 999749 1307922 939911 861628 1144912
13839 1144912 971355 935209 867597 1058496 1085648 1078847 988236 1092153 873004 882034 916444
13828 916444 831577 757780 941908 846578 858117 620841 855447 860555 582886 937890 703561
13817 703561 1113588 988671 982835 708128 963423 351880 905836 678946 740729 593386
13807 593386 648289 582001 718051 872622 793655 650797 778101 820785 672755 691352
$$ packed form
13879I44723L47540q7070J455j05832J40511k55761L32991n0224k30519N7617
13869A095431J1087J86152J2668n2707j10240k58178N75210F27697Q64767o53682
13859H38782j57592O31331j29866k02728P9857o2388J76766J7340k18062k35714
13849G37726K63320l0200j1705K4897q5334J01045L08173l68011p8283K83284
13839A144912j73557l6146o7612J90899K7152o801r0611J03917k19149R030L4410
13828I16444q4867p3797J84128r5330J1539k37276K34606N108k77669L55004k34329
13817G03561M10027j24917n836k74707K55295C51880N53956k26890O1783j47343
13807E93386N4903o6288J36050J54571p8967j42858J27304M2684j48030J8597
$$ plain form
13797 691352 1077417 794817 715226 689413 498505 633701 679572 932503 823888 659496
13787 659496 851982 798877 450716 581102 1036729 799573 541244 641961 521151 740905
13777 740905 934620 614227 608154 604713 894981 595190 666059 379707 950280 591398
13767 591398 520237 682995 544076 485215 927278 749721 690593 834126 743067 626950
13757 626950 727885 760411 671742 512682 890040 722467 658004 511582 751376 386121
13747 386121 700973 535336 841070 932930 946926 757277 566707 867604 590885 434296
13737 434296 672505 603212 702769 577872 605021 103636 622668 394989 903199 655403
13727 655403 927793 850142 361649 675300 494168 552466 541721 534035 610645 574164 370218
$$ packed form
13797F91352L86065k82600p9591k5813j90908J35196M5871K52931j08615j64392
13787F59496J92486n3105l48161J30386M55627k37156k58329J00717j20810K19754
13777G40905J93715l20393o073l441K90268k99791P0869k86352N70573l58882
13767E91398p1161J62758j38919n8861M42063j77557n9128J43533r1059j16117
13757F26950J00935L2526q8669j59060L77358j67573o4463j46422K39794l65255
13747C86121L14852j65637L05734R1860J3996j89649j90570L00897k76719j56589
13737D34296K38209o9293R9557j24897K7149A03636N19032k27679N08210k47796
13727F55403K72390p7651C61649L13651j81132N8298j0745p686P6610l6481k03946
$$ plain form
13716 370218 522332 492339 651604 726107 532993 714940 559404 545958 547185 948903
13706 948903 329551 420454 580945 740034 349073 542344 464373 245704 802731 114576
13695 622478 657243 202096 601577 452341 131884 464403 193754 615602 380770 645445
13685 645445 498358 447567 441121 395041 392380 453527 520972 260362 578531 627032 551151
13674 551151 466120 486857 568597 315236 372753 259471 483818 608664 559379 627606 475492
13663 475492 759441 332483 552552 296527 708037 405239 328225 452510 759872 417030
13653 417030 513355 637551 644356 543732 339547 658092 555230 570410 272412 442820
13643 442820 110530 730247 209530 673269 185872 466171 693973 162591 565839 567748
$$ packed form
13716C70218J52114k9993J59265P4503j93114J81947j55536j3446J227M01718
13706I48903C29551R0903J60491J59089C49073J93271p7971k18669N57027A14576
13695F22478L4765B02096L99481j49236A31884L32519A93754M21848k34832K64675
13685F45445j47087n0791o446m6080k661O1147O7445B60362L18169M8501p5881
13674E51151q5031K0737Q1740k53361N7517j13282K24347J24846m9285O8227j52114
13663D75492K83949C32483K20069k56025M11510l02798p7014J24285L07362l42842
13653D17030R6325J24196O805j00624k04185L18545j02862J5180B72412J70408
13643D42820A10530O19717B09530M63739A85872K80299K27802A62591M03248J909
$$ plain form
13633 567748 491568 506472 284067 185014 337960 424343 527834 335703 421905 665971
13623 665971 416397 426258 189841 409811 427548 455210 505857 502144 397949 173105 328992
13612 328992 375375 239370 349158 271183 40665 245876 439045 244471 365157 239566
13602 239566 469685 325205 448699 169465 401835 281505 360510 465926 339369 268093
13592 268093 233454 352957 404046 111970 243281 386148 562317 358149 252404 469593
13582 469593 374667 525856 422670 386484 409334 506144 488786 407991 321910 433733 275221
13571 275221 463463 438093 10939 334195 129826 399044 223211 501186 323631 458919
13561 458919 202949 114882 420835 574036 384012 582719 341874 297430 330272 273891
$$ packed form
13633E67748p6180J4904k22405r9053J52946Q6383J03491j92131Q6202K44066
13623F65971k49574R861A89841K19970J7737K7662N0647l713j04195A73105J55887
13612C28992M6383j36005J09788p7975D0665K05211J93169j94574J20686j25591
13602B39566K30119j44480J23494A69465K32370j20330P9005J05416j26557p1276
13592B68093l4639J19503N1089A11970J31311J42867J76169k04168j05745K17189
13582D69593r4926J51189j03186l6186K2850R6810j7358q0795q6081J11823j58512
13571B75221J88242k5370A0939L23256A29826K69218j75833K77975j77555J35288
13561D58919B02949q8067L05953J53201j90024J98707k40845m4444L2842n6381
$$ plain form
13551 273891 352212 209673 50760 188152 370598 407957 102491 325150 420195 259360
13541 259360 349135 499565 404225 367929 113112 400429 177360 547075 25928 221224
13531 221224 186768 387888 250575 335870 165958 354353 645493 541378 133491 361662
13521 361662 347439 418072 187663 162876 294475 314967 299474 254740 -200232 118071 -16419
13509 342531 308327 88511 381162 245743 252745 243006 316000 198580 -126586 391209 229824
13498 229824 -26857 232948 338204 363516 320122 100886 -26367 328397 210750 241287
13488 241287 434354 143894 -16135 237996 420843 107522 176571 241733 3523 432362
13478 432362 426789 -118730 -4038 305756 387836 -91237 263488 305123 290720 489722 447666
$$ packed form
13551B73891P8321j42539E0760J37392J82446L7359A02491K22659R5045j60835
13541B59360Q9775J50430r5340l6296A13112K87317A77360L69715B5928J95296
13531B21224l4456K01120j37313Q5295A65958J88395K91140j04115A33491K28171
13521C61662j4223P0633A87663k4787J31599K0492j5493m4734b00232A18071a6419
13509C42531l4204H8511K92651j35419P002r739P2994j17420a26586C91209j61385
13498B29824b6857B32948J05256K5312m3394A00886b6367C28397j17647L0537
13488B41287J93067A43894a6135B37996J82847A07522O9049O5162C523M28839
13478D32362n573a18730d038C05756Q2080i1237B63488M1635j4403J99002m2056
$$ plain form
13467 447666 318977 151745 93607 87539 407208 348972 145521 447325 75847 329753
13457 329753 230315 330857 354477 246439 269732 52337 366341 -52286 319866 55361 255824
13446 255824 258097 96686 374859 274315 247030 488132 141643 317148 536901 56633
13435 114075 223177 174834 138305 86333 563611 136499 363957 546835 -125362 22651
13424 256794 368649 390439 143078 165674 61422 282738 108573 311582 251740 266097
13414 266097 43803 118669 462671 93286 300183 39414 -205271 220058 159265 248487 49268
13402 -283527 328191 239698 360615 225274 100926 334447 334332 82111 90613 296823 242083
13391 242083 -18558 264652 241028 -78598 456323 265363 75614 42351 110098 73458 277189
$$ packed form
13467D47666j28689A51745n8138o068L19669n8236A45521L01804G5847K53906
13457C29753r9438J00542K3620j08038K3293E2337L14004e2286C19866E5361K00463
13446B55824K273I6686K78173j00544k7285K41102A41643J75505K19753E6633
13435A14075J09102m8343l6529n1972M77278A36499K27458J82878a25362B2651
13424B56794J11855K1790A43078K2596F1422K21316A08573K03009n9842J4357
13414B66097D3803P4866L44002I3286K06897C9414b05271B20058o0793Q9222D9268
13402b83527C28191q8493J20917j35341A00926K33521j15H2111Q502K06210n4740
13391B42083a8558B64652k3624g8598D56323j90960G5614l3263O7747l6640K03731
$$ plain form
13380 277189 433311 215646 106094 366214 390711 286604 19476 149998 116594 122696
13370 122696 371351 488348 115810 421371 303594 308608 290368 -115605 223940 199890
13360 199890 -15433 -53935 475949 193382 319206 -60883 105347 395993 337353 -61187
13349 18162 368505 505348 40935 -121597 156551 308981 500995 551780 6475 380611
13339 380611 135179 513517 -13738 252790 -53533 347369 148215 228959 90356 309876
13329 309876 368562 366262 220428 85090 -60652 365114 66716 203143 297610 215565 245112
13318 245112 305772 256025 75851 322113 327646 516483 61491 100411 -14245 191322 138290
13307 138290 364536 79463 -18283 95617 -27770 -82342 163890 182534 383092 378300 102997
$$ packed form
13380B77189J56122B15646A06094K60120K4497j04107A9476J30522l3404O102
13370A22696K48655J16997A15810L05561j17777N014j8240a15605B23940k4050
13360A99890a5433l8502D75949A93382J25824f0883A05347K90646n8640f1187
13349A8162L50343J36843D0935a21597A56551J52430J92014N0785F475L74136
13339C80611A35179L78338a3738B52790e3533C47369A48215Q0744I0356K19520
13329C09876N8686k300j45834H5090f0652C65114F6716J36427R4467q2045K9547
13318B45112O0660m9747G5851K46262N533J88837F1491L8920a4245A91322n3032
13307A38290K26246G9463a8283I5617b7770n4572A63890J8644K00558m792A02997
$$ plain form
13295 141094 89235 -143574 343826 233297 177557 229934 5076 86052 94588 193918 185632
13284 185632 18631 100908 156801 206352 38656 110969 153884 -45842 368176 -94199 273370
13272 -150895 335710 193287 276490 -63175 186639 -43098 455530 7693 314832 112646
13261 -29487 139568 278674 215052 333613 -184839 -15729 177033 266602 134383 -45553
13250 239763 5029 -88400 73084 -106584 356739 61491 -225928 67123 184545 114822 138791
13239 138791 209309 -43740 -114015 217252 175642 263022 -34041 -34692 -124358 -303306 11377
13227 -24908 204729 268277 50865 133099 227470 269407 144023 241385 277994 187042 301896
13216 301896 72470 306405 199321 183188 137229 56199 166545 66965 47786 191972 350114
$$ packed form
13295A41094n1859a43574C43826j10529n5740N2377E076Q0976Q536R9330q286
13284A85632A8631Q2277N5893M9551C8656P2313M2915d5842C68176i4199B73370
13272a50895C35710j42423Q3203f3175A86639d3098D55530G693L07139A12646
13261b9487A39568J39106o3622J18561a84839a5729A77033Q9569j32219d5553
13250B39763E029h8400G3084a06584C56739F1491b25928F7123J17422o9723K3969
13239A38791P0518d3740p0275B17252m1610Q7380c4041o51q9666j78948A1377
13227b4908B04729O3548E0865Q2234R4371M1937j25384R7362L6609r0952J14854
13216C01896G2470K33935j07084j6133m5959E6199J10346F6965j9179J44186J58142
$$ plain form
13205 350114 149649 -152403 79188 331613 418970 61387 144890 62988 20214 384790 111279
13193 121053 -14577 -7534 -85490 167045 137208 -160558 144993 64839 20034 188165 314275
13182 314275 -36743 183825 -150010 244364 38874 -267919 182646 36184 -29398 333497
13171 70599 309769 191457 -311791 78097 190069 33628 128577 111473 21895 210863 173517
13160 173517 274150 36293 58080 197411 140865 142275 -4692 102985 80328 40021 103232
13149 103232 -30035 197267 218050 88474 139813 11123 85368 48093 70026 88672 215719
13138 215719 151282 120229 305279 9094 103495 161275 21146 -80474 -69871 -81755 67939
13126 -14734 -180457 309953 127482 168136 250284 262493 320901 143341 319018 146164
$$ packed form
13205C50114A49649a52403G9188K52425Q7357F1387Q3503F2988B0214L64576A11279
13193A21053a4577P043p7956A67045k9837a60558A44993F4839B0034J68131J26110
13182C14275c6743A83825a50010B44364C8874b67919A82646C6184b9398C33497
13171G0599K39170j18312c11791G8097J11972C3628R4949j7104B1895J88968l7346
13160A73517J00633C6293K1787J39331n6546J410d692A02985k2657D0021O3211
13149A03232c0035A97267K0783H8474N1339A1123P4245l7275K1933J8646J27047
13138B15719o4437l1053J85050I094R4401N7780B1146h0474J0603j1884F7939
13126a4734j65723C09953A27482M0654Q2148J2209N8408A43341J75677A46164
$$ plain form
13115 -103259 410001 -74645 180228 141771 -177603 377914 211237 -65332 436328 210434
13104 133417 -41146 -203480 69588 -264407 121533 55195 31701 165456 180119 -93650 -292514
13093 -292514 189842 112038 70235 235849 -154890 138124 21377 -2206 -133448 286609
13082 100850 218335 313298 -48539 35029 331158 150235 415802 29298 -142851 248052
13071 -469366 -206602 3814 191887 303749 -32057 117177 130085 75840 193489 30259 7987
13059 345679 130765 -99628 33569 237390 239145 84623 -88922 -76572 323191 73871 192829
13048 192829 64873 44636 -43252 -120315 410976 315049 44810 73134 114194 203118 114656
13037 114656 186135 -62735 -7469 84246 126783 74594 -219128 201922 270028 47159 162344
$$ packed form
13115a03259D10001g4645A80228l8457a77603C77914j66677f5332D36328B10434
13104A33417d1146j62334F9588b64407A21533E5195k3494J33755J4663i3650j98864
13093b92514A89842p7804m1803J65614a54890A38124B1377b206j31242B86609
13082A00850J17485R4963d8539C5029K96129A50235K65567B9298a42851B48052
13071d69366b06602C814J88073J11862c2057A17177J2908n4245J17649C0259G987
13059C45679A30765i9628C3569K03821J755H4623h8922J2350C23191G3871J18958
13048A92829F4873k0237d3252p7063D10976r5927D4810K8324M1060Q8924q8462
13037A14656P1479f2735g469H4246M2537n2189b19128B01922O8106D7159J15185
$$ plain form
13026 162344 435135 68485 20063 110556 8586 82813 391389 92809 204507 -195748 194781
13014 422499 255377 -53537 147970 -38135 -186278 -76155 78161 69413 130790 -100183 114780
13002 76683 -2515 -42551 144814 137700 68531 180512 52550 10712 25052 -160020 384409
12990 55476 19162 117205 258706 -115095 -195153 20380 113652 -20491 72629 -88954 122886
12978 165271 24424 268944 -252385 78986 -107474 -150501 296218 67206 -162861 59118
12967 469952 234348 -8040 437544 -65487 103987 -65203 -123481 288175 -250376 247324
12956 -238205 -209195 38740 71586 108032 44398 -97451 177019 54205 -79058 69745 39265
12945 39265 319925 -15575 81014 178205 198782 318486 15110 151805 -135909 109785 274666
$$ packed form
13026A62344K72791F8485B0063R0493H586P4227L08576I2809J11698a95748A94781
13014D22499j67122e3537A47970c8135j48143g6155G8161q748O1377a00183A14780
13002G6683b515m0036A44814p114F8531J11981E2550A0712J4340a60020C84409
12990E5476A9162R8043J41501a15095q0058B0380R3272b0491G2629h8954A22886
12978A65271B4424K44520b52385G8986a07474m3027B96218F7206a62861E9118
12967D69952B34348h040D37544f5487A03987f5203n8278B88175b50376B47324
12956b38205K9010C8740L2846L6446D4398i7451A77019E4205g9058F9745l0480
12945C9265K80660a5575H1014R7191K0577J19704A5110J36695a35909A09785J64881
$$ plain form
12934 274666 168862 -224358 -80855 739 168550 295998 84846 219121 60376 -166215 -13547
12922 157543 427570 98005 386475 -117445 -293024 62987 -110133 122369 352884 109623
12911 119411 204754 -54107 -171011 59801 28883 -199812 127733 -174879 61193 -215555
12900 161043 81042 140098 -47618 -10961 57276 -99091 -335772 -47226 -153817 -269578 106756
12888 178647 7189 134834 91644 49695 -22306 64319 199556 -26233 156353 311698 -1428
12876 42218 270706 -370080 85253 267426 58117 176324 -66709 -714 192831 104151 -137183
12864 23714 188993 76021 -187187 -197478 -140179 -269016 141402 236988 133379 -113912
12853 86433 -158762 284428 -34940 31472 85767 -200000 -112501 121141 -91880 -34073 147282
$$ packed form
12934B74666j05804b24358h0855G39J67811J27448H4846J34275F0376a66215a3547
12922A57543K70027I8005K88470a17445j75579F2987a10133A22369K30515A09623
12911A19411Q5343e4107j16904E9801B8883a99812A27733a74879F1193b15555
12900A61043q0001N9056d7618a0961E7276i9091k36681d7226j06591j15761A06756
12888A78647G189J27645m3190m1949b2306F4319J35237b6233A56353J55345a428
12876D2218K28488c70080H5253J82173E8117J18207f6709g14A92831q8680a37183
12864B3714J65279G6021a87187j0291N7299j28837A41402R5586j03609a13912
12853H6433a58762B84428c4940C1472N4295b00000Q7499A21141i1880c4073A47282
$$ plain form
12841 415148 7342 -106574 267267 32245 81220 -38577 3373 373373 -183623 92862 125785
12830 125785 118455 -91098 -126355 -167227 41860 60018 -61753 -478 168493 338383 154471
12818 224959 56759 154542 -132544 -137563 -142965 168710 -44608 -93004 130039 -238893 104197
12806 -93659 -535163 -7516 199328 -10048 -79386 59633 192831 -75542 -18277 20246 -13159
12794 65588 24844 -111436 164767 -188533 -79664 354074 -175285 -120843 -231772 -97120
12783 164488 -79491 -38069 434451 19640 54644 238262 -155047 -57963 -100260 253653 -66853
12771 263777 136898 -185684 -102198 -82972 11316 -237273 76826 28376 108983 138042 19207
12759 190886 144045 -195434 -173173 131362 65589 -54525 221758 13363 297370 -193187
$$ packed form
12841D15148G342a06574B67267C2245M8975c8577C373L70000a83623I2862L2923
12830A25785p330i1098l5257m0872D1860J8158f1753d78A68493J69890A54471
12818B24959E6759R7783a32544n019n402A68710d4608m8396A30039b38893A04197
12806i3659m41504g516A99328a0048o9338E9633J33198g5542a8277B0246a3159
12794F5588B4844a11436A64767a88533g9664C54074a75285N4442j10929i7120
12783A64488g9491c8069D34451A9640L5004J83618a55047e7963m2297B53653f6853
12771B63777j26879a85684Q3486J9226A1316b37273G6826B8376Q0607K9059A9207
12759A90886m6841a95434K2261A31362F5589e4525B21758A3363K84007a93187
$$ plain form
12748 -156337 40761 153050 324981 -126538 81844 -85274 122543 221288 109739 19688
12737 465303 261380 179470 -110692 114844 83113 27657 -61933 31184 216677 -210716
12726 9525 -378486 34249 -216436 54180 380665 57356 197913 -2786 287476 88942 101842
12715 101842 26306 -106149 8020 -228439 181862 -19617 159225 5126 67450 -96026 -7604
12703 245254 273594 61664 145317 144943 -45884 -185182 -56976 176103 -42971 109014 9892
12691 3679 178232 146977 -36743 67734 173715 4258 296313 241122 149104 55882 294606
12680 294606 89048 103424 388980 244630 -263033 -52852 103494 -11616 67788 -98331 75192
12668 -199233 -21298 179817 -108635 61379 236614 68304 145140 -50666 59200 76909 285537
$$ packed form
12748a56337D0761J12289J71931a26538H1844h5274A22543R8745A09739A9688
12737D65303k03923q1910a10692A14844l1731B7657f1933C1184J85493b10716
12726I525c78486C4249b16436E4180L26485E7356J40557b786B87476H8942J2900
12715A01842B6306a06149H020b28439A81862a9617A59225E126O2324i6026g604
12703B45254K8340F1664Q3653l74d5884j39298e6976A76103d2971A09014I892
12691C679J74553l1255c6743F7734J05981D258K92055n5191r2018E5882K38724
12680B94606H9048J4376K85556j44350b63033e2852A03494a1616F7788i8331G5192
12668a99233b1298A79817a08635F1379J75235F8304P6836e0666E9200J7709K08628
$$ plain form
12657 285537 89260 106825 65797 -55413 84639 151768 -170733 189361 101669 274636 -76709
12645 -147558 -13939 203909 116169 274762 173510 -21421 -177725 50998 219411 232574
12635 232574 6824 196427 -80971 231493 379986 237521 133280 511328 77666 303718
12625 303718 388784 -13909 9978 -10168 450667 133251 301176 19763 -367931 81872 -122987
12613 26580 65179 148732 -64017 -133091 90170 207131 62840 -61338 187980 198191 81864
12601 284685 23093 -218330 161208 -231367 335402 114286 -19 371621 -5195 -63547 269364
12589 335793 -111394 69364 247232 7248 166417 178987 -240397 -116472 65782 25142 -20288
12577 -238979 154446 178451 125182 359438 139272 -220681 156203 157318 -129061 -293114
$$ packed form
12657B85537H9260J7565m1028e5413H4639O7129a70733A89361q7692J72967g6709
12645a47558a3939B03909q7740J58593j01252b1421j56304E0998J68413J3163
12635B32574F824J89603h0971B31493J48493j42465j04241L78048G7666K26052
12625C03718Q5066a3909I978a0168D50667A33251J67925A9763c67931H1872a22987
12613B6580L8599Q3553f4017o9074I0170J16961F2840f1338A87980J0211H1864
12601B84685B3093b18330A61208b31367C35402A14286a9C71621e195n8352B69364
12589C35793a11394F9364J77868G248J59169J2570b40397a16472F5782B5142b0288
12577b38979A54446K4005n3269K34256A39272b20681A56203J115a29061j64053
$$ plain form
12567 -293114 111228 59664 -29800 -32273 120423 -90689 -158197 -4728 457236 -161212 76301
12555 55764 -89944 127619 -227852 306395 51855 -319540 -26657 103637 -41650 -209804
12545 -209804 -67920 -28864 -211629 262383 -132266 -344302 -33761 -72669 -225049 -71744
12534 320934 -20836 67542 -109636 317837 -137422 -319220 -227966 10095 75931 -91451 56016
12522 40410 50901 -80113 265451 183872 40526 -311640 54918 -9327 156846 113446 -71829
12510 99333 166578 371465 -55490 72472 349993 160110 165253 -130377 192164 -85874 -116666
12499 -116666 -145646 -256822 -75407 37152 -133708 46035 35228 -24769 270946 -82457 -148971
12488 -148971 26730 113454 120757 -83749 14983 -111491 51719 -118329 -236972 -7459 42669
$$ packed form
12567b93114A11228n1564b9800k473A20423i0689o7508d728D57236a61212G6301
12555E5764h9944A27619b27852C06395E1855c19540b6657A03637d1650j68154
12545b09804f7920b8864j82765B62383a32266k12036c3761l8908j52380g1744
12534C20934b0836F7542a09636C17837a37422j81798R1254A0095O5836i1451E6016
12522D0410J0491h0113B65451q1579D0526c11640E4918i327A56846m3400g1829
12510I9333O7245K04887e5490G2472K77521A60110N143a30377A92164h5874l0792
12499a16666k8980j11176g5407C7152a33708D6035j0807b4769B70946h2457o6514
12488a48971B6730Q6724P303h3749A4983a11491E1719a18329j18643g459D2669
$$ plain form
12476 108238 -101736 -50532 -323225 -33252 -24706 -297903 117345 170766 137337 -200595 -77374
12464 -71004 185828 12415 193151 -188879 -18905 -80360 388470 -70227 -19914 -46697 -19795
12452 50788 -57544 -80931 103108 -43878 -130439 -161148 145973 -115688 -88869 -13299 -77682
12441 -77682 -89051 -54319 -107524 154851 -92447 -163632 -262711 -97341 69769 36001 78507
12430 78507 121922 176225 36083 16934 -195312 156871 128892 97462 -196736 -27118 -66562
12419 -66562 284920 225955 -124219 -207906 -42634 -116454 168730 -57670 39775 46693 38510
12408 38510 40321 -164050 306935 114705 48271 -254430 139655 171089 -156190 360478
12397 -176324 10116 -208435 -109117 -88121 200585 -42566 28969 15989 -101981 -21241 -12936
$$ packed form
12476A08238a01736e0532k72693c3252Q546k73197A17345N3421l3429b00595g7374
12464g1004A85828A2415J80736a88879a8905o1455C88470g0227a9914k6783a9795
12452E0788e7544k3387A03108d3878q6561l0709A45973a15688K6819a3299o4383
12441g7682j1369L4732n3205A54851i2447p1185r9079i7341F9769l3768M2506
12430G8507M3415N4303C6083A6934a95312A56871k7979l1430a96736b7118l9444
12419f6562B84920n8965a24219q3687d2634p3820A68730e7670C9775O918q183
12408C8510J811a64050C06935A14705D8271b54430A39655L1434a56190C60478
12397a76324A0116b08435R9318K0996B00585d2566B8969j2980a01981b1241Q305
$$ plain form
12386 -12936 205784 273738 -90769 88567 10241 -123684 -109485 -48114 -151842 -30052 -175114
12375 -175114 179861 488740 -12879 -85745 -67364 107924 -270424 145103 -203743 -166395
12365 -166395 84070 -311668 -3929 -113964 -19769 -52346 -388428 113720 106888 35034 159552
12354 159552 99401 -99160 -52555 -35670 153467 -8747 -90160 309745 140479 36529 -161903
12342 320889 -67302 64956 -171712 -341380 -323501 -282421 59593 -17972 25723 -51938 -85100
12331 -85100 106 179510 40331 -407762 26588 18278 5943 -75939 -76136 166905 179855 47816
12318 -25152 296531 46176 -159426 -33217 238210 32477 53839 -79533 -15469 162797 66891
12306 -97158 -70286 -24657 -362559 -57677 -74346 79785 -153985 -49915 147475 -39865 62074
$$ packed form
12386a2936B05784O7954i0769H8567A0241a23684J4199d8114j03728c0052j45062
12375a75114A79861L08879a2879p2866J8381A07924b70424A45103b03743L7348
12365a66395H4070c11668c929j10035a9769l2577l36082A13720o832C5034J24518
12354A59552o0151i9160M6605J6885A53467h747q1413C09745A40479C6529a61903
12342C20889f7302F4956a71712j69668J7879M1080E9593a7972B5723e1938l3162
12331h5100A06J79404D0331d07762B6588q310E943g5939j97A66905J2950D7816
12318b5152B96531D6176a59426c3217B38210C2477K1362g9533a5469A62797F6891
12306i7158K6872b4657l37902e7677j6669G9785a53985d9915A47475c9865F2074
$$ plain form
12294 10392 232552 38593 100608 354697 -37480 -64904 72532 51942 109642 422336 96179
12282 443614 -170340 6621 32813 -56770 15200 -44368 220103 40407 151937 223928 30806
12270 -96807 379276 383836 -66494 112145 124719 -95671 12722 88486 113356 58844 119184
12259 119184 116749 -161559 364712 128244 -13780 1064 45766 242842 112579 -183846 -408282
12248 -408282 278635 16686 -166135 -46806 141476 -62772 -148443 -79036 -29189 -117625 -30491
12236 242031 496114 150095 123748 346593 307810 56619 -37642 32399 161970 401662
12226 401662 21955 228372 8664 127534 115740 83344 64453 170466 397013 128018 472681
12215 472681 258151 545341 252535 -118053 207840 -336627 251410 82514 128909 117033
$$ packed form
12294A0392K22160C8593O2015K54089c7480k7424G2532k0590N7700L12694I6179
12282D43614a70340F621K6192e6770A5200d4368B20103D0407J11530P1991C0806
12270i6807C79276M560f6494A12145J2574i5671A2722P5764K4870n4512O0340
12259A19184k435a61559C64712A28244a3780A064M4702J97076A12579a83846k24436
12248d08282B78635A6686a66135d6806A41476f2772q5671O9407b9189q8436c0491
12236B42031K54083A50095k6347K22845l8783E6619c7642C2399J29571K39692
12226D01662B1955K06417H664J18870j1794l2396j8891J06013K26547A28018L44663
12215D72681k14530K87190B52535a18053B07840c36627B51410H2514M6395j1876
$$ plain form
12205 117033 46811 62087 599260 184974 -58566 252065 146436 -175018 244450 -173788
12194 101300 186226 91403 502765 109076 436136 -9727 198844 217618 46984 -279067 69155
12182 228180 441738 228235 -48037 -29617 331305 54697 66264 69932 40120 -148650 12424
12170 -45689 183111 -134613 111297 -70754 27493 144617 202575 22343 132578 404108
12160 404108 -348 166292 -6467 -67877 -11953 -159152 -101003 351417 33152 -98231 628 117370
12148 117370 63280 -55776 187335 -181546 42459 -96639 20193 262722 -2858 445561 197340
12136 116666 -6122 -237156 257468 111825 -349622 -183224 -53798 -204486 -202644 -186031 -159990
12125 -159990 -22824 -148271 368315 -136150 -41124 61985 244708 114255 37501 -108930
$$ packed form
12205A17033D6811J5276N37173A84974e8566B52065j05629a75018B44450a73788
12194A01300Q4926I1403M11362A09076L27060i727A98844J8774D6984b79067F9155
12182B28180K13558k13503d8037J8420C31305E4697J1567L668k9812a48650A2424
12170d5689A83111a34613A11297g0754B7493J17124N7958B2343J10235K71530
12160D04108c48A66292f467o1410a1953j47199N8149C51417C3152i8231F28J16742
12148A17370n4090e5776A87335a81546D2459i6639B0193K42529b858D45561A97340
12136A16666f122k31034B57468A11825c49622J66398e3798j50688J842J6613K6041
12125a59990b2824j25447C68315a36150d1124F1985J82723A14255C7501a08930
$$ plain form
12114 -79306 166606 -64784 -166 -100758 -229127 257666 354003 104111 -5306 380321 -7990
12102 7485 -31011 98266 109720 -255497 -147228 -65141 -137732 89204 39994 204172 -18605
12090 -300643 100644 -240629 -43108 -199995 132500 13621 -112516 -106006 -105955 46660 30201
12079 30201 -216025 -74692 -277382 -125528 28227 -330277 -323202 -125479 104592 -241454
12068 121465 151162 562670 1026272 1696628 891546 146616 -177684 133515 -65956 37667
12057 299391 214364 -60512 -159422 20420 116249 -200340 73097 29920 72064 196504 -104167
12045 -260314 -188168 97210 -151419 195984 131177 49295 -199615 376125 -131171 48627
12034 -100276 -312987 -146398 -97177 -210882 11333 -167468 -63813 -221866 28552 187083
$$ packed form
12114g9306A66606f4784a66j00592j28369B57666R6337A04111e306C80321g990
12102G485c1011I8266J1454b55497J08269f5141p2591H9204C9994J64178a8605
12090c00643A00644b40629d3108j56887A32500A3621a12516O510N1D6660j6459
12079C0201b16025g4692k02690a25528B8227c30277P075a25479A04592b41454
12068A21465K9697M11508M63602O70356q05082A46616a77684A33515f5956C7667
12057B99391q5027f0512r8910B0420R5829b00340G3097B9920M2144J24440a04167
12045b60314P2146I7210a51419A95984o4807D9295a99615C76125a31171D8627
12034a00276k12711a46398M9221j13705A1333a67468f3813j58053B8552J58531
$$ plain form
12024 187083 98941 -16697 -376251 -18725 330866 -68158 82577 194001 67090 89576 127272
12013 127272 28187 102605 389204 5992 15527 70966 43315 -161488 -11789 33653 272280
12002 272280 -146089 -261990 244712 -354366 -404214 154462 211731 -153145 -12602 -93542
11992 -93542 75349 -70040 -100065 86031 -79201 -286993 -296669 -89915 169331 -194828 298410
11980 -125867 63578 -51994 -127264 73913 -174013 142020 -145377 63519 103855 -44397 54419
11968 179755 -81628 -118130 -24646 37416 -58621 -87917 -85401 96282 -126028 49866 194493
11957 194493 -50421 -17617 410 292101 123570 -182127 61273 -199240 138617 118028 34978
11945 17882 109421 91005 79678 -338075 241712 -144376 95730 -50956 75391 49306 328985
$$ packed form
12024A87083q8142a6697l59554a8725C30866f8158H2577J11424F7090K2486L7696
12013A27272B8187P4418K86599E992R535N5439k7651a61488a1789C3653K38627
12002B72280a46089j15901B44712c54366m9848A54462N7269a53145a2602q0940
11992i3542G5349g0040l0025H6031g9201k07792r676h9915A69331a94828B98410
11980a25867F3578e1994p5270G3913a74013A42020a45377F3519M0336d4397E4419
11968A79755h1628l6502b4646C7416e8621k9296K516I6282a26028D9866J44627
11957A94493e0421a7617D10K91691A23570a82127F1273a99240A38617k0589C4978
11945A7882R1539j8416j1327c38075B41712a44376I5730e0956G5391k6085K79679
$$ plain form
11934 328985 26945 10922 73721 -83 -33067 -122927 260561 -155007 128767 82857 -52008
11922 -75670 -49333 204137 324004 -181629 -11801 -324330 -261625 -994 151664 -27543 178959
11910 38203 123486 -86620 -13572 283860 -110808 -401487 56623 18282 -142101 -199042 311460
11898 216528 -120173 -31382 -5845 45656 -112161 128270 279720 37021 -128706 79463 -53334
11886 -135286 -83648 211865 61674 114913 -6644 -151066 -128030 -419724 10181 78720 47685
11875 47685 -213854 -235299 -238832 -353493 3979 -32072 -28396 -23223 -65340 9715 -81026 -113760
11863 -113760 -102808 57135 53337 197604 -151930 -349393 114924 -25017 -112388 236313 -111579
11851 -175184 188318 283479 -124232 96220 919 -73035 117328 64959 133622 204290 -188711
$$ packed form
11934C28985B6945A0922O2799h3l2984q9860B60561a55007A28767m5910e2008
11922g5670K6337B04137J19867a81629a1801l12529O2705i94A51664b7543A78959
11910C8203Q5283h6620a3572B83860a10808k90679E6623A8282a42101n6941C11460
11898B16528a20173c1382e845D5656a12161A28270J51450C7021a28706G9463e3334
11886a35286N1638B11865F1674N3239f644j44422K3036k91694A0181O8539l1035
11875D7685b13854k1445l533j14661C979c2072L676N173m2117I715h1026l2734
11863a13760J0952E7135l798J44267a51930j97463A14924b5017q7371B36313a11579
11851a75184A88318R5161a24232I6220I19g3035A17328n2369O8663P0668a88711
$$ plain form
11839 -141372 103330 -70774 -312577 28086 40605 205900 -24095 196194 79400 -3348 -130371
11828 -130371 -79149 -422764 94630 -42627 -198682 -164074 -211709 -130854 -64221 -68510 -139795
11817 -139795 -289423 93438 6802 242653 120386 -320961 -66635 -340593 49293 47579 19658
11805 55761 40279 -199186 -52424 -95528 -231627 21936 334947 336742 19772 69299 -63713
11793 -394407 174284 191518 113849 40981 289969 -271419 110879 -186517 144616 -105469
11782 -307550 -172540 -143380 -281878 -22776 -97374 341660 -27374 -182611 -53848 -46925 -30624
11771 -30624 6139 -216481 12024 27361 119852 -264800 120830 221378 -284 -13178 85329
11759 -17786 -80294 -117560 -30695 -208913 -455833 -65457 64080 -273758 73150 -80009 -11320
$$ packed form
11839a41372A03330g0774k41803B8086J2519J65295b4095A96194G9400c348j27023
11828a30371N1222l43615I4630d2627j56055L4608m7635Q0855f4221m289p1285
11817a39795j49628I3438F802K35851A20386c20961f6635k73958D9293j714A9658
11805E5761j5482a99186e2424m3104j36099B1936L13011J795A9772M9527f3713
11793c94407A74284J7234p7669D0981K48988b71419A10879a86517A44616a05469
11782c07550J35010K9160j38498b2776p4598C41660b7374j55237e3848O923J6301
11771c0624F139b16481A2024J5337R2491b64800A20830J00548b84j2894H5329
11759a7786o2508l7266c0695j78218k46920f5457F4080b73758G3150h0009a1320
$$ plain form
11747 -445241 385892 141350 263101 36498 92966 -113607 -70094 -60559 -86365 -265927 36846
11735 110393 21849 -128984 -118891 351799 137374 -10923 -231055 213619 878 65322 78762
11724 78762 279804 63907 176871 -48092 174442 103785 68181 -100605 -64901 190644 122968
11713 122968 -138436 194543 1238 69260 253142 344712 -261733 298341 -68932 99611 -33759
11701 -5251 -179544 247103 -114135 -17591 -123605 63481 -163041 151025 -203334 -318063
11691 -318063 129779 99991 -57245 4805 -46518 -295462 141191 154875 87775 118040 -141804
11679 -66009 -19939 187606 -207330 234699 224784 -126950 -300998 -23221 -248958 -72645 65514
11667 -76343 193362 72633 275807 -323038 -39275 -57422 -24417 312918 151406 255641
$$ packed form
11747d45241C85892A41350J21751C6498N6468a13607M3513R535k5806j79562C6846
11735A10393B1849a28984J0093C51799A37374a0923k20132B13619H78O4444J3440
11724G8762K01042F3907J12964d8092A74442p0657l5604a00605L5704A90644o7676
11713A22968a38436A94543A238O8022J83882R1570b61733B98341f8932I9611c3759
11701e251j74293B47103a14135a7591j06014F3481a63041A51025b03334j14729
11691c18063A29779k9788e7245D805d6518k48944A41191J3684o7100L0265a41804
11679f6009a9939A87606b07330B34699r915a26950j74048b3221k25737g2645F5514
11667g6343A93362G2633K03174c23038c9275j8147b4417C12918A51406J04235
$$ plain form
11657 255641 -254855 450940 54745 -391026 120472 15739 58657 -70876 -124746 -336939
11647 -336939 260312 29555 124783 -25253 -159863 -142583 -183470 192448 103026 117877 -118094
11635 155751 299543 130988 139791 163988 178213 7023 -123255 70 -55447 153637 8764 462657
11623 462657 60551 61592 19409 158964 -217645 -117351 249023 76817 122584 249689 44577
11611 -105610 77702 -78892 39284 12319 -23514 -398049 -183069 -84512 210402 135137 76798
11600 76798 -292411 187045 419543 -45014 -116289 178718 -123704 -252341 200297 -235708
11589 -21921 382972 226444 148033 166823 -53317 408512 422534 51281 39647 -23668 120963
11577 -3175 253918 -91260 212669 337936 135167 329514 -459949 5675 -37065 168548 232773
$$ packed form
11657B55641b54855D50940E4745c91026A20472A5739M2918g0876n3870k12193
11647c36939B60312B9555R5228b5253j34610J7280m0887A92448q9422J4851a18094
11635A55751J43792A30988Q803K4197J4225G023a23255G0e5447A53637H764M53893
11623D62657F0551J041A9409J39555b17645J00294B49023G6817M5767J27105D4577
11611a05610G7702g8892C9284A2319b3514l74535a83069h4512B10402p5265n8339
11600G6798b92411A87045K32498d5014p1275A78718a23704j28637B00297b35708
11589b1921C82972j56528p8411J8790e3317D08512J4022E1281j1634b3668A20963
11577c175B53918i1260B12669J25267A35167J94347d59949E675c7065A68548O4225
$$ plain form
11566 232773 -259413 84928 87931 154944 233593 48887 11075 21895 277772 242228 -19911
11554 287549 -129157 -47361 197179 -311700 -129982 157911 159017 -286542 -194004 -100608
11544 -100608 137475 47345 237910 105480 36720 -148590 -223870 23396 197499 319346
11534 319346 -182578 -140945 53737 124212 149277 138673 299762 165996 -477074 23993 55618
11523 55618 81687 191429 -2575 171301 -40524 82475 39577 89936 66407 -120053 -27942
11511 237549 -20256 284614 1937 204654 202321 -241038 21397 170456 227052 393580 -199225
11499 -111939 108721 170484 190069 37141 -271298 -125077 79888 443031 -155184 195811
11488 -87045 -17246 466867 219986 332573 -23825 392273 30486 102532 435627 24605 320279
$$ packed form
11566B32773b59413H4928L003O7013P8649D8887A1075J0820K55877l5544a9911
11554B87549a29157d7361A97179c11700a29982A57911J106b86542R2538R3396
11544a00608A37475D7345J90565A05480C6720a48590p5280B3396J74103J21847
11534C19346a82578M1633E3737P0475K5065j0604J61089j33766d77074B3993L1625
11523E5618K6069J09742b575A71301d0524H2475C9577N0359k3529a20053b7942
11511B37549b0256B84614A937K02717k333b41038B1397J49059N6596J66528a99225
11499a11939A08721O1763J9585C7141b71298a25077G9888L63143a55184A95811
11488h7045a7246D66867B19986J12587b3825C92273C0486P2046L33095B4605K95674
$$ plain form
11477 320279 326623 -125384 -69114 192793 113664 16811 -69541 -322968 178591 151499 69739
11465 -366505 -44584 -5185 200278 -61973 285048 100891 196660 264557 161802 90499 -158179
11453 106613 46913 22398 65878 345554 37393 -56833 155062 29389 1103 -93613 259142
11441 -9108 123833 152193 27671 228143 237732 -289778 -31755 108865 -163441 30440 339993
11430 339993 -89441 208012 -32946 -166233 -23790 -231633 50200 -145604 168164 227965
11420 227965 -246686 -154480 395673 -186744 143696 -30159 -215684 78126 -5626 295886
11409 -3176 204075 164648 -97417 68312 -230990 173389 -112400 175949 95978 101908 -244090
11397 20957 231605 -185129 141884 -14980 921 247736 225346 -23436 359919 -71493 -361669
$$ packed form
11477C20279O344a25384N6270A92793p9129A6811f9541k53427A78591k7092F9739
11465c66505d4584e185B00278f1973B85048A00891R5769O7897j02755p1303a58179
11453A06613D6913B2398M3480K79676C7393e6833A55062B9389A103i3613B59142
11441i108A23833K8360B7671K00472R589b89778c1755A08865a63441C0440L09553
11430C39993h9441B08012c2946j33287b3790k07843E0200a45604A68164N9801
11420B27965b46686R2206C95673a86744A43696c0159j85525G8126e626B95886
11409c176B04075l9427i7417F8312b30990A73389a12400A75949p9971N930b44090
11397B0957K10648a85129A41884a4980I21K46815k2390b3436C59919g1493k90176
$$ plain form
11386 -361669 -44491 197790 -148582 54664 -66398 284479 -118684 -69569 30323 115899 120715
11375 120715 -104917 78291 76607 201349 213822 231763 -97752 102777 -47862 17253 -13029
11363 245943 328237 -156451 -134371 -324019 49751 -260641 25513 -141057 -56491 -237066
11353 -237066 32811 -364511 -17872 -64290 -187468 221077 -193901 96139 -155202 47345
11342 22221 -11523 88870 115979 -58442 137957 -106217 -186234 205106 -94900 97132 -177230
11330 356060 126480 -171163 -65529 113438 -6600 239857 -120335 -182384 -130200 -82882 -167654
11319 -167654 218832 313282 170251 52743 -60232 13005 -171950 -120023 -327930 203254
11308 133576 -13330 -103681 82069 -172979 241818 27468 120642 -95882 -205896 161560 145411
$$ packed form
11386c61669d4491A97790a48582E4664f6398B84479a18684M9115C0323Q5576M816
11375A20715a04917G8291j684J24742J2473J7941i7752A02777d7862A7253a3029
11363B45943Q2294a56451K2080j89648D9751b60641B5513a41057e6491j80575
11353b37066C2811c64511a7872m6418j23178B21077a93901I6139a55202D7345
11342B2221a1523H8870K7109e8442A37957a06217q0017B05106i4900I7132a77230
11330C56060A26480a71163f5529A13438f600B39857a20335o2049N2184M7318q4772
11319a67654B18832R4450j43031E2743f0232A3005a71950N1927k07907B03254
11308A33576a3330r0351H2069a72979B41818B7468R3174i5882j10014A61560j6149
$$ plain form
11297 145411 -179529 -81948 -67021 -277659 -202947 226000 -66246 112741 -186133 454902
11286 -133729 42945 61459 -83801 47494 -15696 -58879 -73342 381932 78120 -196592 48446
11274 -168216 -215530 -344229 -292120 -141046 -309829 197491 -14936 -40490 160652 77743
11263 10335 11087 9940 78137 -50563 -29623 -177335 -293859 94051 125282 151251 -162838 -81769
11251 -81769 -159710 -219574 46392 -41141 29820 202510 -43185 91494 8638 81607 -207694
11239 -231917 214577 -93010 -267136 341956 -175045 -159241 102572 -114414 109227 -200603
11228 35266 111131 -80644 45202 -13052 -34729 -110626 37112 299368 -144833 -213233 -69917
11216 -141566 -154298 353336 -176352 29079 -168709 350477 -11429 56516 -62393 -158046 21197
$$ packed form
11297A45411a79529h1948J4927k10638P4712B26000f6246A12741a86133D54902
11286a33729D2945J8514h3801D7494a5696m3183j4463C81932G8120a96592D8446
11274a68216m7314j28699N2109a41046j68783A97491a4936k5554A60652G7743
11263A0335P52j147O8197e0563K0940j47712j16524I4051L1231K5969a62838Q1069
11251h1769p7941n9864D6392d1141B9820J72690d3185I1494H638P2969b07694
11239b31917B14577i3010j74126C41956a75045J5804A02572a14414A09227b00603
11228C5266P5865h0644D5202a3052k1677p5897C7112K62256a44833o8400f9917
11216a41566j2732C53336a76352B9079a68709C50477a1429E6516f2393r5653B1197
$$ plain form
11204 -335187 -56868 -30 -379322 -147288 -145481 -127645 -549713 53025 78751 104759 -166094
11192 -23856 -127073 -190071 -228412 -54308 -59229 10963 23664 -51260 129549 -32068 -214456
11181 -214456 1791 117052 -263257 173621 251653 -324125 270495 264981 -66616 130850 -167539
11169 120209 147990 96273 -289886 -124266 -93446 191038 -98727 -125478 98031 56952 -75909
11157 183203 -9440 245751 -40598 26907 -54653 94393 -215480 -115804 139712 106839 -9485
11145 147192 111052 -241341 -104275 -74367 80037 -140699 -65286 355555 77309 25951 37806
11134 37806 -102089 -71246 27365 -11205 100594 -220685 63475 -46048 42191 109362 100980
11123 100980 -58414 -33542 167749 7632 -62298 -165687 63304 149191 -148006 48936 -297971
$$ packed form
11204c35187e6868c0l79292a47288J807J7836m22068E3025K5726K6008a66094
11192b3856j03217o2998l8341e4308m921A0963J2701e1260A29549c2068j82388
11181b14456A791J15261b63257A73621P8032c24125B70495n514f6616A30850a67539
11169A20209K7781n1717b89886a24266L0820A91038i8727k6751I8031m1079g5909
11157A83203i440B45751d0598B6907e4653I4393b15480R9676A39712l2873i485
11145A47192l6140b41341a04275K9908H0037a40699f5286C55555G7309B5951J1855
11134C7806a02089L0843B7365a1205A00594b20685F3475d6048D2191O7171q382
11123A00980e8414K4872A67749G632f2298j03389F3304Q5887a48006D8936b97971
$$ plain form
11111 -190603 -58996 149090 336030 202421 -279467 194237 18159 131838 218776 300940
11101 300940 296504 -3565 88570 -8237 311969 255538 422333 -5343 66193 -33983 181971 238983
11089 238983 153344 290408 130028 37793 361432 73675 164846 192579 286949 75501 542535
11078 542535 187478 190780 383178 212189 123801 192116 407653 13829 155161 431211
11068 431211 424285 318050 474186 312868 576689 433666 392246 308777 410501 263428
11058 263428 549625 498282 421208 841707 584266 679619 561840 524858 588755 1024871
11048 1024871 942799 565643 806551 541288 522533 431689 743190 1088672 868623 632047
11038 632047 804460 457768 677844 521375 401751 974058 290468 812421 584997 785574
$$ packed form
11111a90603e8996A49090J86940j33609b79467A94237A8159J13679Q6938Q2164
11101C00940m436c565H8570h237C11969n6431J66795e343F6193c3983A81971N7012
11089B38983q5639J37064A30028C7793L23639G3675R1171K7733R4370G5501M67034
11078E42535A87478L302J92398j70989q8388O8315K15537A3829J41332K76050
11068D31211o926j06235J56136j61318K63821j43023m1420q3469J01724j47073
11058B63428K86197n1343p7074M20499k57441R5353j17779l6982O3897M36116
11048A024871q2072l77156K40908k65263j8755r0844L11501L45482k20049k36576
11038F32047J72413l46692K20076j56469j19624N72307B90468N21953k27424K00577
$$ plain form
11028 785574 746246 519144 561023 823476 354057 561105 707839 431433 1122155 714571
11018 714571 787114 270345 567694 938836 557497 566072 469973 422934 727152 485171
11008 485171 672889 633484 447483 741346 704970 620626 603026 484252 516680 827146
10998 827146 333495 852372 616019 630874 407157 726693 846567 804211 977482 646842
10988 646842 885532 578300 1053244 814862 919531 715657 987041 1266249 1137703 1389221
10978 1389221 1397449 1666052 2055225 2143046 2515498 2730321 2754589 2698341 2354790 2445841
10968 2445841 2277000 2110826 1689222 1658688 1374932 1402446 1460520 1832132 1424302 1574198
10958 1574198 1604049 1344639 1654478 1175702 1044438 1079509 793129 558804 835061 259061
$$ packed form
11028G85574l9328k27102M1879K62453C54057K07048J46734k76406O90722m07584
11018G14571P2543B70345K97349L71142l81339Q575r6099m7039L04218k41981
11008D85171J87718l9405j86001K93863l6376q4344j7600j18774L2428L10466
10998H27146C33495N18877k36353J4855k23717L19536J19874m2356J73271l30640
10988F46842K38690l07232M74944k38382J04669k03874K71384K79208j28546K51518
10978A389221Q228K68603L89173Q7821L72452K14823K4268n6248l43551R1051
10968B445841j68841j66174m21604l0534k83756K7514N8074L71612m07830J49896
10958A574198K9851k59410L09839m78776j31264L5071k86380k34325K76257B59061
$$ plain form
10947 260763 567766 181339 459463 -77180 485449 200048 11305 264675 35365 78115
10937 78115 170313 228314 178399 229054 324319 87015 -313277 110582 -60573 229161 60496
10925 135212 84952 -127784 183900 -449763 21671 349470 156025 39004 -208779 32060
10914 64755 39147 319043 -62215 -27406 -162977 210630 -60409 -286531 -153206 -100937 49968
10902 96458 114533 -188538 70552 -222681 -124252 -198416 -198831 -24895 173927 168032 55715 -91094
10889 -75454 -128574 -120140 -43278 -242709 -154902 -301319 -220960 -45578 -6032 210574 53266
10877 119553 -35941 -386819 136573 -172010 -9749 324333 -14748 -95306 131941 119276 -422869
10865 -25414 92722 -238577 75350 -44386 21156 214199 143655 -156185 95043 -12543 -399030
$$ packed form
10947B60763L07003A81339K78124g7180D85449B00048A1305K53370C5365M2750
10937G8115R2198N8001m9915N0655R5265H7015c13277A10582f0573B29161F0496
10925A35212n0260a27784A83900d49763B1671L27799A56025C9004b08779C2060
10914F4755k5608K79896f2215b7406j35571B10630f0409k26122J33325N2269D9968
10902I6458J8075a88538G0552b22681R8429p4164m15b4895A73927n895E5715i1094
10889g5454n3120Q434d3278j99431Q7807j46417Q0359d5578f032B10574E3266
10877A19553c5941l50878A36573a72010i749C24333a4748q0558A31941j2665d22869
10865b5414I2722b38577G5350d4386B1156J93043p0544a56185I5043a2543l86487
$$ plain form
10854 -399030 -9816 58538 121038 29559 78423 26077 80210 -86535 -152201 -64263 145049
10842 266397 67606 128183 19510 -40905 66521 80414 41175 -65764 -173638 91380 108493
10831 108493 243085 -257094 70305 95041 -230714 199450 -108116 164320 72888 80082
10821 80082 183280 -44371 72884 -60513 -105177 106445 105802 61199 142866 -100931 -27427
10809 -180619 102339 30632 83109 -285372 -199172 238501 -224613 -144745 -34443 106633
10798 111789 -245208 -31248 271448 -29858 80307 -19528 -283381 15929 -348036 68667 424347
10787 424347 -261689 -38068 374958 268627 -30910 180984 2834 -131753 82312 -52826 156630
10775 -220777 -16871 -380180 193890 13505 -5224 15658 269752 386484 -90139 -98323 -13431
$$ packed form
10854c99030i816E8538O2500B9559M8864B6077N4133h6535o5666f4263A45049
10842B66397F7606O0577A9510d0905F6521J3893l9239f5764j07874I1380J7113
10831A08493J34592b57094G0305K4736b30714A99450a08116A64320G2888P194
10821H0082J03198d4371G2884f0513m4664A06445o43m4603Q1667a00931b7427
10809a80619A02339C0632N2477b85372Q6200B38501b24613P9868c4443A06633
10798A11789b45208c1248B71448b9858H0307a9528k63853A5929c48036F8667L55680
10787D24347b61689c8068C74958j06331c0910A80984B834a31753H2312e2826A56630
10775b20777a6871l63309A93890A3505e224A5658K54094J16732i0139q184a3431
$$ plain form
10763 -346196 -103508 -120584 44534 2561 -27790 -124212 -123203 -519203 -119017 -177694 -80907
10751 -64424 -48523 -126992 -68925 -118575 -157273 22112 211247 172007 -82132 172444 -24665
10739 22262 -10837 157872 -17341 -204184 103295 -193963 67006 -146495 162477 243538
10729 243538 32400 -185291 -128120 -165548 23032 -36319 -255653 -140195 -198348 64157 -70920
10717 -122105 -38950 1495 252982 -57433 242627 -193952 243030 51934 -75456 -179673 -123126
10706 -123126 12649 -204757 -179379 -42174 215382 -20541 52403 127831 16362 -95560 68436
10694 71636 33887 -125740 -61223 -237540 160902 -309322 178870 -49847 -272510 -165720
10684 -165720 -160868 9630 -21776 34752 -27038 -12969 40360 221086 -294686 -297015 -145578
$$ packed form
10763c46196a03508j7076D4534B561b7790r6422J009l96000a19017n8677h0907
10751f4424J5901p8469N8067m9650l8698B2112J89135l9240h2132A72444b4665
10739B2262a0837A57872a7341j86843A03295a93963F7006a46495A62477Q1061
10729B43538C2400a85291N7171l7428B3032c6319k19334J15458n8153F4157g0920
10717a22105c8950A495K51487e7433B42627a93952B43030E1934g5456j04217N6547
10706a23126A2649b04757K5378d2174B15382b0541E2403P5428A6362i5560F8436
10694G1636C3887a25740f1223j76317A60902c09322A78870d9847k22663J06790
10684a65720M852I630b1776C4752b7038a2969D0360J80726b94686k329a45578
$$ plain form
10672 89522 54606 84471 -148028 118421 50945 -7332 99679 6747 33206 -1539 208424 209651
10660 209651 102270 -165016 -130849 122898 408409 -73267 234164 31137 65955 95136
10650 95136 143454 -251498 -48230 -7880 -177531 220619 -100903 151626 237778 -157516 -50256
10638 146460 -31301 -39290 -134770 -40624 -344004 159589 77633 67754 -77611 -88553 -170749
10627 -170749 54163 -80621 -55195 125334 -5890 125426 -80518 73167 34584 50941 136943
10616 136943 -39273 -304137 -342320 -190520 40248 -130610 -111991 -45622 -123661 248169 125005
10605 125005 -289333 30710 -97184 -172878 92668 -629017 -28294 -29798 -80864 -233062 -63099
10593 173959 119972 -398435 -251751 -185419 4075 -53320 46720 -140691 74676 15643 -26816
$$ packed form
10672H9522l4916K9865a48028A18421E0945g332I9679F747K6459a539B08424J227
10660B09651A02270a65016L4167A22898K85511g3267B34164C1137L4818K9181
10650I5136M8318b51498d8230g880j69651B20619a00903A51626Q6152a57516e0256
10638A46460c1301p989r5480d0624l03380A59589G7633r879g7611j0942q2196
10627a70749E4163h0621K5426A25334e890A25426h0518G3167C4584J6357Q6002
10616A36943c9273k64864l8183J51800D0248a30610J8619d5622p8039B48169j23164
10605A25005b89333C0710i7184p5694I2668f29017b8294j504n1066j52198f3099
10593A73959n3987c98435J46684O6332D075e3320D6720a40691G4676A5643b6816
$$ plain form
10581 -255932 -347130 47324 -132693 -248744 -91042 220409 -380735 123008 39598 -179683
10570 -97140 -137853 -80632 117167 80847 286469 -281084 -206274 -38294 -103628 -60490 7601
10558 -22386 -50205 -365774 -109957 -253687 -119988 -333783 8992 -11655 -235398 20338 42801
10547 42801 -205440 177346 -21914 73058 -127575 100015 190862 -292040 32517 -321654
10536 -349844 -231718 12981 86618 -305610 74786 -196145 -163713 144700 43129 166032
10526 166032 234725 -304157 -144935 -390615 -43272 -221389 16083 -181937 30486 177012
10516 177012 70733 191238 94836 -38257 159175 45545 91366 -18362 -16137 9735 -69766
10504 -60612 -84208 226334 -119200 24920 -14167 -119492 80673 -263138 273262 -246961
$$ packed form
10581b55932r1198D7324a32693j16051i1042B20409c80735A23008C9598a79683
10570i7140m0713N7221A17167l6320K05622b81084P4810c8294o5334M3138G601
10558b2386k7819l15569a09957j43730a19988k13795H992a1655k23743B0338K2463
10547D2801b05440A77346b1914G3058a27575A00015R0847b92040C2517c21654
10536c49844J18126A2981P3637c05610G4786a96145L2432A44700D3129J22903
10526A66032O8693c04157a44935k45680d3272j78117A6083a81937C0486J46526
10516A77012G0733J20505I4836c8257A59175D5545M5821a8362K225I735f9766
10504f0612k3596B26334a19200B4920a4167j05325H0673b63138B73262b46961
$$ plain form
10493 210208 235362 99114 -240333 -159024 57202 -120012 103491 368934 12877 -148097
10482 585052 553120 339853 191544 -36021 29094 -68402 -54790 -27843 -105878 -137844 68589
10470 119302 125273 78381 -31237 -180702 74026 63409 -167031 -196653 157123 -74279 -179293
10459 -179293 86456 -125193 222497 147811 50552 242999 -236556 -278782 -49431 -86185 -27222
10447 39534 42290 254160 18748 205378 102142 83642 -102610 -207272 -163739 -17699 166202
10435 -372684 -293309 -5763 -398966 116788 213882 107929 -16003 -267420 13441 158274 17894
10423 309858 -17381 98589 73052 -174298 102481 122350 209124 -231092 -51295 113541 -68208
10411 -237090 -231166 74492 -69612 -195200 -192577 35960 49508 126930 30856 -126009 43306
$$ packed form
10493B10208K5154I9114b40333Q1309E7202a20012A03491K65443A2877a48097
10482E85052l1932k13267j48309c6021B9094f8402J3612K6947p8035l1966F8589
10470A19302N971m6892c1237j49465G4026j0617a67031k9622A57123g4279j05014
10459a79293H6456a25193B22497p4686E0552J92447b36556m2226d9431l6754b7222
10447C9534K756K11870A8748J86630A02142j8500a02610j04662M3533a7699A66202
10435c72684P9375e763l93203A16788R7094j05953a6003k51417A3441J44833A7894
10423C09858a7381I8589k5537a74298A02481J9869Q6774b31092e1295A13541f8208
10411b37090N924G4492f9612j25588K623C5960J3548P7422C0856a26009D3306
$$ plain form
10399 200541 420686 65147 -202269 -65628 447442 -204388 363824 -47779 -37342 253504
10388 107126 119674 80843 -187183 -127839 -23937 100932 222710 193996 -351412 34615 206209
10377 206209 251796 310379 182650 199781 -17757 96322 273944 35272 88451 431959 544668
10366 544668 693856 541244 172297 160894 327465 383445 416881 308908 379105 122847
10355 393405 -105834 250807 217881 352146 517980 539270 548824 339228 161216 293222
10345 293222 423330 190749 89662 -199848 107413 284076 77832 159620 128062 7806 -149528
10333 198575 53903 -73556 266201 229920 -182847 59749 -152734 334158 -139475 159964
10322 120372 245154 95200 22616 -157710 104490 58063 136525 49876 52841 124735 -128964
$$ packed form
10399B00541K20145F5147b02269f5628D47442b04388C63824d7779J0437B53504
10388A07126J2548l8831a87183N9344b3937A00932J21778k8714c51412C4615J71594
10377B06209M5587N8583j27729J7131a7757I6322J77622C5272N3179L43508J12709
10366E44668J49188j52612A72297j1403J66571N5980L3436j07973P0197A22847
10355C93405a05834B50807l2926J34265J65834K1290R554k09596A61216J32006
10345B93222J30108A90749H9662a99848A07413J76663G7832Q1788l1558G806a49528
10333A98575E3903g3556B66201l6281a82847E9749a52734C34158a39475A59964
10322A20372J24782I5200B2616a57710A04490m6427P8462D9876K965P1894a28964
$$ plain form
10310 82577 -222816 106912 -37901 103819 173358 -81372 -43471 -173305 -153368 237676 -18937
10298 161461 102864 118544 152173 122697 4366 163727 308885 48750 178908 -275215 -134292
10286 -203199 372106 117453 -25312 -5302 -262902 -184670 184781 304426 -171093 95950
10275 -71629 318834 -86170 41847 50134 -279393 -226630 279759 404962 -170885 -180462 -56496
10263 278578 162969 312601 359675 -2944 639273 41581 490631 145362 195874 -181484
10252 3756 102765 1959 -58746 -85029 -60906 110689 -77687 -67327 -23189 78777 78289 -219607
10239 -233103 -194243 125879 -87220 92063 -257728 -66304 108999 -63809 -27859 16989 -70850
10227 -185561 46895 -99567 70027 -84474 -84170 56903 79080 -216218 31876 102635 -18977 138126
$$ packed form
10310H2577b22816A06912c7901A03819O9539h1372L7901j29834J9937B37676a8937
10298A61461n8597J5680L3629k9476D366J59361J45158D8750J30158b75215a34292
10286b03199C72106A17453b5312e302k57600P8232A84781J19645a71093I5950
10275g1629C18834h6170D1847Q287b79393N2763B79759J25203a70885r577e6496
10263B78578j15609J49632M7074b944F39273D1581M49050A45362N0512a81484
10252C756R9009A959e8746k6283K4123A10689g7687J0360b3189G8777m88b19607
10239b33103L8860A25879h7220I2063b57728f6304A08999f3809b7859A6989g0850
10227a85561D6895i9567G0027h4474L04E6903K2177b16218C1876P0759a8977A38126
$$ plain form
10214 -97708 81112 -171956 202648 126280 -137184 338208 13634 -134279 -170676 -237973 -144695
10203 -144695 -225119 212556 79239 -42345 -6523 -115134 104981 -177590 -155203 33972 106750
10192 106750 103352 -125203 -76652 -310868 -34208 -30049 47711 18409 189058 -231479 -14326
10180 -67894 -3857 128754 -131063 -196585 64787 -180852 -235303 -115032 179555 139749 -441793
10168 106501 43751 144857 179299 98621 -66362 -182159 -212318 -48261 -172035 109617 83653
10157 83653 -58036 -120895 -481589 -234575 -358432 -37554 -119228 -38335 -186485 29255 54462
10146 54462 -369611 -151859 67159 -226098 192432 -53965 17286 11385 -171918 -178616 185750
10134 -152208 -229901 -243644 -36902 -92963 174349 -115141 -176630 161798 95831 17393 122557
$$ packed form
10214i7708H1112a71956B02648p6368a37184C38208A3634a34279l6397o7297R3278
10203a44695q0424B12556G9239d2345f523j08611A04981a77590K2387C3972P2778
10192A06750l398a25203M8551k34216c4208M159D7711A8409J70649b31479a4326
10180f7894c857A28754a31063o5522F4787a80852n4451a15032A79555l9806d41793
10168A06501D3751J01106L4442q0678f6362j15797l0159d8261j23774A09617k5964
10157H3653e8036o2859l60694b34575j23857c7554q1674c8335j48150B9255K5207
10146E4462c69611a51859F7159b26098A92432e3965A7286n901a71918o698A85750
10134a52208p7693j3743c6902n6061A74349a15141o1489A61798o5967A7393J05164
$$ plain form
10123 122557 -169134 35575 -400191 -342394 12619 -80272 -150064 -199487 126247 275348 -16488
10111 -113195 -69198 -170697 96551 -315566 -50377 102033 -226245 33454 20636 -299971
10100 61104 -33447 71013 269959 112091 277872 89605 192230 -81705 149096 -124547
10089 -37948 -57312 -146575 302139 275271 -253504 -231892 -218440 -165844 -54938 133298 -178779
10077 -300829 95171 -47221 -35643 -30732 -121506 21949 -31015 181669 132304 63674 124925
10066 124925 -239293 75048 -47178 -137940 24351 -94542 69912 -109998 59272 -186453 -212565
10055 -212565 -66924 -225133 111672 264015 31062 74388 -200827 216366 -216134 307945
10044 -170672 -254485 -16273 -261254 -351082 294558 -2905 111127 1355 22594 -51734 50492
$$ packed form
10123A22557a69134C5575d00191N7797A2619h0272o9792m9423A26247J49101a6488
10111a13195M3997j01499I6551c15566e0377A02033b26245C3454j2818b99971
10100F1104c3447G1013J98946A12091J65781H9605J02625h1705A49096a24547
10089c7948j9364q9263C02139k6868b53504K1612J3452N2596e4938A33298a78779
10077c00829I5171d7221J1578M911r0774B1949c1015A81669m9365F3674O1251
10066A24925b39293G5048d7178r0762B4351i4542F9912a09998E9272a86453k6112
10055b12565f6924j58209A11672J52343C1062M3326b00827B16366b16134C07945
10044a70672q3813a6273k44981q9828B94558b905A11127A355K1239e1734E0492
$$ plain form
10032 -57029 -288908 22259 192137 176873 291380 -34151 -278362 7361 68936 158396 -37596
10020 -141154 -29413 -223514 89272 -26859 -97092 -109900 265532 72933 73221 -182281 -72752
10008 -76293 -296829 170614 -57760 246669 -168118 -30794 16050 -158198 -18960 11944 -337283
9996 -148639 181246 -234808 -82450 170922 -241238 -166425 -77373 285307 -50159 -217771
9986 -217771 -21163 -119454 95398 -161454 -345881 -103639 52485 -183800 -318268 -256388 -222877
9975 -222877 83657 103541 138786 -229182 -76565 115444 189239 152216 -1020 -132516 -181177
9964 -181177 -204423 -291587 -247145 -160369 79536 -131377 -68395 -196460 -54939 35556 118901
9953 118901 2798 -171948 -114192 3585 -5203 -112321 133570 230970 107658 -305265 90042
$$ packed form
10032e7029k31879B2259J69878j5264J14507c4151k44211G361O1575Q9460c7596
10020a41154b9413j94101H9272b6859p0233j2808B65532G2933K88a82281g2752
10008g6293k20536A70614e7760B46669a68118c0794A6050a58198a8960A1944c37283
9996a48639A81246b34808h2450A70922b41238P4813g7373B85307e0159j67612
9986b17771b1163r8291I5398a61454j84427a03639E2485a83800j34468O1880L3511
9975b22877H3657J9884L5245b29182g6565A15444P3795l7023a020j31496m8661
9964a81177k3246q7164M4442Q6776G9536a31377O2982j28065e4939C5556Q3345
9953A18901B798a71948N7756C585e203j07118A33570R7400A07658c05265I0042
$$ plain form
9941 228257 -341923 -221045 -71184 -47525 128252 69649 65595 -322024 365753 14806 133330
9930 133330 -224408 -129253 45436 -176464 -52809 235280 -383945 -230290 -59451 -171839
9920 -171839 -249136 -126371 7823 140151 -96420 -376069 -110665 58242 177264 98619 73817
9909 73817 -150654 -32880 -248195 116446 142933 1265 -144111 -88897 -114947 -249902 208716
9897 -220182 -93896 -227883 32457 85172 -255576 305852 -90863 -54608 -31378 72768 128693
9886 128693 144853 -170842 -100941 -157189 -109480 -151918 135614 46201 89144 -104992 -345490
9875 -345490 100669 -83740 -46241 -454167 -249659 98508 -31777 155070 255989 -44070 -147691
9864 -147691 -131094 -201538 -118322 26915 -110843 -80972 -225336 -23986 194704 360738 -324731
$$ packed form
9941B28257c41923J20878g1184K3659A28252n8603m054c22024C65753A4806J18524
9930A33330b24408R5155D5436a76464e2809B35280c83945J53655e9451j12388
9920a71839p7297J22765G823J32328i6420k79649a10665E8242J19022p8645k4802
9909G3817a50654c2880k15315A16446K6487A265a44111N5214k6050j34955B08716
9897b20182i3896j33987C2457N2715b55576C05852i0863L6255K3230G2768N5925
9886A28693J6160a70842O9901n6248M7709m2438A35614D6201M2943a04992k40498
9875c45490A00669h3740L7499m07926K04508I8508c1777A55070J00919d4070j03621
9864a47691J6597p0444Q3216B6915a10843K9871j44364b3986A94704J66034c24731
$$ plain form
9852 20643 -484670 -191196 168413 -310298 -358561 -69636 -351605 50763 55366 -371825 -32212
9840 101437 45043 -337031 -176084 -253676 -230573 -4562 -194916 -73533 137212 106534 -319884
9828 71634 -174624 -330437 -36860 -84782 -94203 -71104 -49632 122990 -76303 -130306 123888
9816 -206557 -411326 -297434 172727 -157572 -417736 133243 -137595 -114267 -89527 62143
9805 -163870 -225186 -156334 -103363 -62473 -76261 -134500 9163 -316508 98215 82659 86403 -97473
9792 47155 -81669 -97607 -17211 -393077 -322901 101986 -125393 234244 -115722 -32700 -217570
9781 -217570 -203150 80312 420453 -307610 119391 86618 -90686 -48088 -185073 -54560 55462
9769 171506 117818 245228 145871 66059 507556 -17056 32927 395795 -235668 49957 -74827
$$ packed form
9852B0643d84670a91196A68413c10298m8263f9636k81969E0763M603c71825c2212
9840A01437D5043c37031J60947p7592K3103d562j90354g3533A37212l0678c19884
9828G1634a74624j55813c6860m7922r421K3099K1472A22990g6303n4003A23888
9816b06557k04769J13892A72727a57572k60164A33243a37595K3328K4740F2143
9805a63870o1316O8852N2971M0890j3788n8239I163c16508I8215j5556L744i7473
9792D7155h1669j5938a7211l75866P0176A01986a25393B34244a15722c2700j84870
9781b17570J4420H0312L40141c07610A19391l2773i0686M2598j36985e4560E5462
9769A71506n3688J27410r9357F6059M41497a7056C2927L62868b35668D9957g4827
$$ plain form
9757 -223941 -221135 -123089 -18544 112188 10741 -370272 -80872 23333 -227377 115817 89194
9746 89194 -206766 -96275 -385988 171039 -191768 -134792 -140942 -357015 37420 -12634 -155064
9735 -155064 -25994 244798 -376618 -38890 -323121 -105650 -139061 -400915 -15458 -75200 -119033
9724 -119033 -144816 -376491 -55963 161397 -156600 219012 -44165 70797 -285421 -24872 -21218
9713 -21218 -20648 -154998 6220 -344719 230597 173406 206865 148309 -186615 -128271 213324
9701 96855 -87562 -59074 292844 -346688 88544 -155714 -466156 113498 -235841 -44528 -155472
9690 -155472 -36658 37141 -109493 -116657 -341948 64157 -605059 62120 -113994 -341617 -173282
9679 -173282 -140255 -35510 60201 202033 -105574 77851 -48286 108434 -177412 16585 103933
$$ packed form
9757b23941K806R8046a8544A12188A0741c70272h0872B3333b27377A15817k6623
9746H9194b06766i6275k89713A71039a91768N6976o150k16073C7420a2634j42430
9735a55064b5994B44798c76618c8890k84231a05650l3411k61854a5458n9742m3833
9724a19033k5783k31675e5963A61397a56600B19012d4165G0797b85421b4872L654
9713b1218N70j34350F220c44719B30597n7191L3459n8556a86615N8344B13324
9701I6855h7562K8488B92844c46688H8544a55714l10442A13498b35841d4528j10944
9690a55472c6658C7141a09493p164k25291F4157f05059F2120a13994k27623J68335
9679a73282L3027c5510F0201J41832a05574G7851d8286A08434a77412A6585Q7348
$$ plain form
9668 103933 -145088 -263594 67755 -79894 -273110 -128818 -147867 22391 -389946 70563 -1021
9656 -128181 70081 -162874 74254 -264759 -277686 138096 169125 -40557 -1027 126279 267330
9645 267330 -165037 -321282 -305532 92972 174596 -84029 -144709 -82055 -26281 -349118 -46498
9633 -12306 -199286 -201221 55768 46835 -45849 -296780 -87837 -167454 -109869 58686 146502 11461
9620 52125 -244748 146251 -235276 339934 287095 189301 -131412 45869 124870 -24469 -136516
9609 -136516 -163585 -49242 -101833 -171125 234854 107155 -167918 -41343 -109492 -340780 -213893
9598 -213893 -334626 -147637 -280976 -98006 166642 -170674 84817 19936 -463385 -117511
9587 7822 166059 303331 -102063 -422800 -67073 -232812 -238590 -179515 -35139 -329460 -7116
$$ packed form
9668A03933a45088j18506F7755g9894j93216a28818j9049B2391c89946G0563a021
9656a28181G0081a62874G4254b64759j2927A38096L1029d0557a027A26279J41051
9645B67330a65037j56245J5750I2972Q1624h4029o0680O2654b6281l22837d6498
9633a2306j86980j935E5768q933d5849k50931h7837p9617N7585E8686Q7816A1461
9620E2125b44748A46251b35276C39934n2839r7794a31412D5869P9001b4469j12047
9609a36516k7069d9242n2591o9292B34854A07155a67918d1343o8149k31288J26887
9598b13893j20733a47637j33339i8006A66642a70674H4817A9936d63385a17511
9587G822J58237J37272a02063l20737f7073j65739n778N9075c5139k94321g116
$$ plain form
9575 64652 31482 -67118 -146557 -188904 -80516 62264 72808 -104810 -116804 70945 176200
9564 176200 -319695 329455 133331 -151825 -210895 -6384 135220 252746 71824 -8361 113616
9552 -111234 -171704 -389610 84134 22626 33225 -68945 -62719 -22429 -103478 175497 51111
9540 10668 89694 9761 5798 81735 -281093 -58503 -25755 -270955 107259 -106799 -232483
9529 -232483 -189020 -30907 46203 -157312 116791 -120662 -116156 -86339 -105435 3102 102471
9518 102471 61133 119322 70904 -166647 -285003 -112405 50668 -67218 87540 102409 -186718
9506 28978 -130712 18847 126104 70487 -190970 -229530 -392875 42191 101276 -28539 192419
9494 -119258 -144065 139026 -260060 -151867 -11319 101543 192717 -121337 -173284 -13992 42161
$$ packed form
9575F4652C1482f7118p9439m2347h0516F2264J0544a04810j1994G0945J05255
9564A76200c19695C29455A33331a51825n9070f384A35220J17526G1824h361A13616
9552a11234o0470k17906H4134B2626J0599f8945O226b2429q1049A75497E1111
9540A0668P9026I761l963P5937b81093e8503b5755k45200A07259a06799j25684
9529b32483M3463c0907D6203a57312A16791a20662M506K9817j9096C102R9369
9518A02471m1338N8189m8418a66647j18356a12405E0668f7218H7540J4869a86718
9506B8978a30712A8847J07257n5617a90970l8560j63345D2191N9085b8539A92419
9494a19258k4807A39026b60060J08193a1319A01543R1174a21337n1947a3992D2161
$$ plain form
9482 -129895 -194434 -148399 2459 -473422 -31893 -13849 258786 4897 96405 -261382 -337878
9471 -337878 -116796 -169683 -324133 -69784 169670 -97510 90861 306119 33621 -121650 28362
9459 43111 218743 -11290 -48252 -267069 -133131 -250783 49570 97356 176853 22057 -278689
9447 25200 -445962 -116745 162046 -125324 -352621 -185353 -36956 -219487 98169 -43961
9436 -295234 235394 -30611 -163319 65591 -36234 -346026 -134318 -195228 52345 -80379 -73094
9425 -73094 -230648 -92407 171459 97504 -189207 -486350 16839 -128929 -72821 -286670 256129
9413 -13558 64971 -13157 118575 -112860 48175 -79795 -380096 -115276 213069 37033 -170845
9401 -101138 17027 170079 9788 -140055 43720 -237231 -118086 78944 -240272 -421342 -148909
$$ packed form
9482a29895o4539M6035B459d73422c1893a3849B58786D897R1508b61382p6496
9471c37878a16796n2887j54450f9784A69670i7510I0861K15258C3621a21650B8362
9459D3111J75632a1290l6962k18817a33131j17652D9570M7786P9497B2057b78689
9447B5200d45962a16745A62046a25324k27297J67268c6956j82531I8169d3961
9436b95234B35394c0611j32708F5591c6234l09792a34318o0910E2345h0379P285
9425g3094j57554i2407A71459p3955a89207k97143A6839a28929N6108k13849B56129
9413a3558F4971a3157A18575a12860D8175g9795l00301a15276B13069C7033a70845
9401a01138A7027J53052I788a40055D3720b37231a18086G8944b40272j81070a48909
$$ plain form
9389 251087 -16479 -320728 92508 69857 76100 279654 59704 46072 151033 143657 50934
9377 26571 -359319 -122074 -46489 -118884 8023 -203455 239169 50736 235552 56149 -403515
9365 138857 195005 -23330 218101 225788 -391935 -265466 -105036 -229727 -324464 245368 36243
9353 -143219 -64215 98848 32777 108467 66859 97215 -65267 -289241 -209343 93245 -105377
9341 232564 -323920 17113 -45065 235862 -50868 -13031 -339202 131792 149157 -158171 26713
9329 233879 -265717 106855 -258592 -132907 -277859 63570 -265702 227086 -91372 -708 31532
9317 149319 -57770 45474 -63985 -316441 -38192 398174 -103325 49234 60929 117872 -34523
9305 -166309 34259 184395 -185338 -70597 -293526 158272 -206600 -85812 15587 -67814 5599
$$ packed form
9389B51087a6479l04249I2508k2651O243K03554E9704j3632J04961p376E0934
9377B6571c59319a22074d6489p2395H023b03455B39169E0736J84816E6149d03515
9365A38857N6148b3330B18101P687c91935J26469a05036j24691r4737B45368C6243
9353a43219f4215I8848C2777P5690m1608L0356f5267k23974P9898I3245a05377
9341B32564c23920A7113d5065B35862e0868a3031l26171A31792J7365a58171B6713
9329B33879b65717A06855b58592J25685j44952F3570b65702B27086i1372g08C1532
9317A49319e7770D5474f3985k52456c8192C98174a03325D9234J1695N6943c4523
9305a66309C4259J50136a85338g0597k22929A58272b06600h5812A5587f7814E599
$$ plain form
9293 36624 -293549 -38858 -234844 -229604 76501 -231293 -273004 -14874 100460 -191955 -89118
9281 86693 -162094 68090 -187637 128677 -114102 113328 -42659 -245133 -117152 -207127
9271 -207127 -102161 -78457 79275 -255517 -16025 -248397 -106236 177997 221102 -9135 -242292
9260 -242292 -67798 -311751 -180119 -232366 -96745 -38581 -88735 122925 -212839 -70735 -212313
9249 -212313 -147375 -76631 -265873 -42975 -1728 -465855 109743 42724 86998 153147 -39762
9237 89357 106486 -119406 -317908 -436014 -254337 -165820 3194 192938 198766 -14269 179168
9225 -98120 115161 156237 52132 -134267 115619 -12631 -204887 242913 -357546 -235610
9215 -235610 -71819 7506 12353 35501 -53217 178296 22819 -72234 101899 -101818 137492
$$ packed form
9293C6624b93549c8858j95986N240G6501b31293m1711a4874A00460a91955h9118
9281H6693a62094F8090a87637A28677a14102A13328d2659k02474a17152q9975
9271b07127a02161K3704G9275b55517a6025k32372a06236A77997M3105i135k33157
9260b42292f7798k43953J31632n2247i6745c8581n0154A22925b12839g0735j41578
9249b12313O4938P0744j89242d2975a728m64127A09743D2724M4274O6149c9762
9237H9357J7129a19406j98502j18106J81677Q8517C194J89744N828a4269A79168
9225i8120A15161M1076E2132a34267A15619a2631j92256B42913c57546J21936
9215b35610g1819G506M847K3148e3217A78296B2819g2234A01899a01818A37492
$$ plain form
9203 -224891 -126253 201425 -1940 -86872 -131787 -137990 -47449 -32425 -117475 -185719 113692 87771
9191 87771 119190 22083 -94829 -2423 -121938 37739 -307656 12940 -120657 -73325 -74924 -397894
9179 -397894 -72329 -340656 112597 213149 -20941 -122994 -53312 190674 -99223 121758
9168 -363908 132009 43394 -452238 63094 -441589 67301 -197585 -348867 158424 205837
9158 205837 -91981 622 248158 -4098 -311481 -121043 -129385 -71203 70505 -254319 6666 13135
9146 13135 458628 53328 98882 -24022 -47448 177033 -108428 186089 -236539 30046 73724
9135 73724 9703 -85569 -160440 -57408 137570 -118180 250477 -89114 -174096 -265358 262056
9123 -657096 -170477 268346 201912 102800 -212421 184634 -85273 -125027 -74559 2949 -109503
$$ packed form
9203b24891R8638B01425a940q4932m4915o203d7449J5024q5050o8244A13692k5921
9191H7771L1419B2083i4829b423j19515C7739c07656A2940a20657M7332j599l22970
9179c97894g2329k68327A12597J00552b0941j02053e3312A90674i9223A21758
9168c63908A32009D3394d52238F3094d41589F7301a97585j51282A58424M7413
9158B05837i1981F22K47536d098l07383a21043q342N8182G0505b54319F666O469
9146A3135M45493E3328M5554b4022k3426A77033a08428A86089b36539C0046M3678
9135G3724I703h5569p4871e7408A37570a18180B50477h9114q4982r1262B62056
9123f57096a70477B68346o6434r9112b12421A84634h5273l9754N0468B949a09503
$$ plain form
9111 31225 168117 147113 -173152 145027 137431 -128353 251281 -235399 414054 -294849
9100 -132034 84340 1444 53030 -47011 -247686 -129849 106730 -157936 12037 -344799 92172
9088 -295036 -341385 -285710 -244175 -77086 29521 78938 -157608 35293 -198458 -447114 -258958
9077 -258958 158525 -197015 160652 -333953 -16794 -112879 12814 -175566 66632 68595 -61877
9065 55439 48788 -109770 -113744 -49775 9141 218676 -89399 -158831 27557 -108769 -243663 8426
9052 -139522 238493 -184039 151310 -190304 -106401 12488 -92450 176949 -44670 -105107 -147541
9041 -147541 -198243 -370947 -43117 -137015 -31706 -108777 241438 -337596 -43162 -213720 -19560
9029 4532 -121775 91244 -28853 290146 -95131 -42105 -65453 -181583 -89920 92624 -154642
$$ packed form
9111C1225J36892k1004a73152A45027p596a28353B51281b35399D14054b94849
9100a32034H4340A444N1586d7011k00675J17837A06730a57936A2037c44799I2172
9088b95036m6349N5675M1535g7086B9521M9417a57608C5293a98458k48656J88156
9077b58958A58525a97015A60652c33953a6794r6085A2814a75566F6632J963f1877
9065E5439o651a09770l974d9775I141K09535h9399o9432B7557a08769j34894H426
9052a39522B38493a84039A51310a90304Q3903A2488i2450A76949d4670o0437m2434
9041a47541n0702j72704d3117r3898c1706p7071B41438c37596d3162j70558a9560
9029D532a21775I1244b8853B90146i5131d2105k3348j16130h9920I2624a54642
$$ plain form
9017 -129633 175577 -39496 -319340 -13090 23355 73336 -92521 291662 -85482 -185360 192681
9005 -190124 143532 -95966 -99189 -236908 238388 115678 -4420 -371688 105892 -305840 198028
8993 -188852 -37578 -35159 -110895 -114062 182888 -219189 -75514 -241849 207747 -52129 19190
8981 -238218 -345260 157169 -179782 -4582 -447181 -30753 -62387 43496 -191964 144495 -135564
8969 -40788 -29979 10864 66376 -21653 -56642 48158 -141179 171428 76049 179315 218097
8958 218097 -159032 76214 -368719 -29874 44631 -159617 -103557 -99985 -120832 -119447 -276370
8947 -276370 -289696 115139 -81203 125304 -4272 2696 103 -44790 46101 194564 -231401 -12722
8934 44749 311292 30174 346825 59200 -48634 31204 -130709 10061 57335 -37464 416664
$$ packed form
9017a29633A75577c9496k79844a3090B3355M9981i2521B91662h5482r9878A92681
9005a90124A43532i5966l223j37719B38388A15678d420l67268A05892c05840A98028
8993a88852c7578K419p5736l167A82888b19189g5514j66335B07747e2129A9190
8981b38218j07042A57169a79782d582m42599c0753l1634D3496a91964A44495a35564
8969d0788J0809A0864N5512b1653l4989D8158a41179A71428G6049J03266L8782
8958B18097a59032G6214c68719b9874D4631a59617N6060L572k0847J385j56923
8947b76370j3326A15139h1203A25304d272B696A03d4790D6101J48463b31401a2722
8934D4749K66543C0174L16651E9200d8634C1204a30709A0061M7274c7464D16664
$$ plain form
8922 375204 1551529 382191 70462 99153 -84688 -192123 -150453 182314 78132 42659 -226131
8910 -384700 9352 150344 -271136 -63697 96525 109375 21158 193972 85740 -378932 -84532
8898 40036 -52174 101466 -198327 -141076 -195919 61897 -33348 -341896 -173265 -43843 63953
8886 -6485 50838 155541 99452 31871 27317 -363040 88221 -7279 -121359 253478 23968 90641
8874 90641 -224323 -183798 -50152 -11157 181594 111726 -275263 118459 78669 41818 302622
$$ packed form
8922C75204J176325C82191G0462K8691h4688j07435M1670A82314G8132l5473b26131
8910c84700I352J40992b71136f3697I6525J2850B1158J72814H5740c78932h4532
8898D0036e2174A01466a98327N7251n4843F1897c3348l08548J68631d3843F3953
8886f485E0838J04703n6089C1871m554c63040H8221g279j14080B53478B3968O6673
8874I0641b24323M0525e0152a1157A81594o9868b75263A18459l9790l6851K60804
$$ [...]
##END NTUPLES=NMR SPECTRUM
##END=
