##TITLE=NES1101_ptc160_9887098_N1h69xq1Zi
##JCAMPDX= 6.0         $$ Bruker NMR JCAMP-DX V2.0
##DATA TYPE= NMR SPECTRUM
##DATA CLASS= NTUPLES
##ORIGIN= BRUKER
##OWNER= Administrator
$$ 1.72 TOPSPIN		Version 2.1
$$ 2016-08-28 17:21:28.726 -0500  Administrator@X
$$ Compression mode = diff/dup
##.OBSERVE FREQUENCY= 400.02188249412
##.OBSERVE NUCLEUS= ^1H
##.ACQUISITION MODE= SIMULTANEOUS (DQD)
##.ACQUISITION SCHEME= undefined
##.AVERAGES= 64
##.DIGITISER RES= 22
##SPECTROMETER/DATA SYSTEM= spect
##.PULSE SEQUENCE= noesygpps1d.comp
##.SOLVENT NAME= COFFEE_meoh
##.SHIFT REFERENCE= INTERNAL, COFFEE_meoh, 1, 14.96059
##AUDIT TRAIL= $$ (NUMBER, WHEN, WHO, WHERE, PROCESS, VERSION, WHAT)
$$ ##TITLE= Audit trail, TOPSPIN		Version 2.1
$$ ##JCAMPDX= 5.01
$$ ##ORIGIN= Bruker BioSpin GmbH
$$ ##OWNER= Administrator
$$ $$ E:\/data/COFFEE/nmr/NES1101_ptc160_9887098_N1h69xq1Zi/12/pdata/1/auditp.txt
$$ ##AUDIT TRAIL=  $$ (NUMBER, WHEN, WHO, WHERE, PROCESS, VERSION, WHAT)
(   1,<2016-08-28 17:21:23.508 -0500>,<Administrator>,<X>,<go>,<TOPSPIN 2.1>,
      <created by zg
	started at 2016-08-28 17:09:53.742 -0500,
	POWCHK enabled, PULCHK disabled,
       configuration hash MD5:
       21 0F 79 D6 B3 7B B4 F6 88 20 88 DB 03 48 BD 9F
       data hash MD5: 64K
       4F 96 82 0C 61 3A 27 9D 87 08 48 E1 46 CF 92 75>)
(   2,<2016-08-28 17:21:26.695 -0500>,<Administrator>,<X>,<proc1d>,<TOPSPIN 2.1>,
      <Start of raw data processing
       efp LB = 0.3 FT_mod = 6 PKNL = 1 PHC0 = 0 PHC1 = 0 SI = 128K 
       data hash MD5: 128K
       D8 82 DF 1C AA E0 8D 21 BE 72 76 16 CF 2A E6 42>)
(   3,<2016-08-28 17:21:27.554 -0500>,<Administrator>,<X>,<proc1d>,<TOPSPIN 2.1>,
      <pk PHC0 = -84.89685 PHC1 = 0 
       data hash MD5: 128K
       77 C4 05 13 C3 0E 39 5D F8 B7 9A 81 6A 55 33 AD>)
(   4,<2016-08-28 17:21:27.929 -0500>,<Administrator>,<X>,<proc1d>,<TOPSPIN 2.1>,
      <abs ABSG = 1 
       data hash MD5: 128K
       03 02 38 7A 16 7C C1 C7 4D FC A1 61 F2 40 51 80>)
(   5,<2016-08-28 17:21:28.023 -0500>,<Administrator>,<X>,<proc1d>,<TOPSPIN 2.1>,
      <abs ABSG = 2 
       data hash MD5: 128K
       F4 E7 A4 DE 4A A3 E8 55 26 A3 56 71 40 9B 3D F5>)
(   6,<2016-08-28 17:21:28.101 -0500>,<Administrator>,<X>,<proc1d>,<TOPSPIN 2.1>,
      <abs ABSG = 3 
       data hash MD5: 128K
       18 4E A9 8C 8D 17 40 AC 8A 94 65 41 2F 85 50 7E>)
(   7,<2016-08-28 17:21:28.179 -0500>,<Administrator>,<X>,<proc1d>,<TOPSPIN 2.1>,
      <abs ABSG = 4 
       data hash MD5: 128K
       B5 EA 16 AF C0 75 B4 34 B5 D0 0F 45 C2 61 A2 3C>)
(   8,<2016-08-28 17:21:28.304 -0500>,<Administrator>,<X>,<proc1d>,<TOPSPIN 2.1>,
      <abs ABSG = 5 
       data hash MD5: 128K
       1C 23 44 5F D3 89 AB 29 62 02 7A 1B FB ED D5 F3>)
$$ ##END=
$$ 
$$ $$ hash MD5
$$ $$ D7 89 6B ED 80 B5 7A 70 D9 78 CE 57 FE 0D 35 5C
##$RELAX= 
##$RELAX= 
##$RELAX= 
##$RELAX= 
##$RELAX= 
##$RELAX= 
##$RELAX= 
##$RELAX= 
$$ Bruker specific parameters
$$ --------------------------
##$DU= <E:\>
##$EXPNO= 12
$$ [...]
##$TP07= 0
##$TPNAME0= <>
##$TPNAME1= <>
##$TPNAME2= <>
##$TPNAME3= <>
##$TPNAME4= <>
##$TPNAME5= <>
##$TPNAME6= <>
##$TPNAME7= <>
##$TPOAL= (0..7)
0.5 0.5 0.5 0.5 0.5 0.5 0.5 0.5
##$TPOFFS= (0..7)
0 0 0 0 0 0 0 0
##$TUNHIN= 0
##$TUNHOUT= 0
##$TUNXOUT= 0
##$USERA1= <user>
##$USERA2= <user>
##$USERA3= <user>
##$USERA4= <user>
##$USERA5= <user>
##$V9= 5
##$VALIST= <valist>
##$VCLIST= <CCCCCCCCCCCCCCC>
##$VD= 0
##$VDLIST= <DDDDDDDDDDDDDDD>
##$VPLIST= <PPPPPPPPPPPPPPP>
##$VTLIST= <TTTTTTTTTTTTTTT>
##$WBST= 2048
##$WBSW= 25
##$XGAIN= (0..3)
0 0 0 0
##$XL= 0
##$YL= 0
##$YMAX_a= 6001328
##$YMIN_a= -11029082
##$ZGOPTNS= <>
##$ZL1= 120
##$ZL2= 120
##$ZL3= 120
##$ZL4= 120
##$ABSF1= 14.96059
##$ABSF2= -5.597591
##$ABSG= 5
##$ABSL= 3
##$ALPHA= 0
##$AQORDER= 0
##$ASSFAC= 0
##$ASSFACI= 0
##$ASSFACX= 0
##$ASSWID= 0
##$AUNMP= <proc_prof1d_extract.lims>
##$AXLEFT= 0
##$AXNAME= <>
##$AXNUC= <1H>
##$AXRIGHT= 0
##$AXTYPE= 0
##$AXUNIT= <>
##$AZFE= 0.1
##$AZFW= 0.1
##$BCFW= 0
##$BC_mod= 0
##$BYTORDP= 0
##$COROFFS= 0
##$CY= 15
##$DATMOD= 1
##$DC= 0
##$DFILT= <>
##$DTYPP= 0
##$F1P= 0
##$F2P= 0
##$FCOR= 0.5
##$FTSIZE= 131072
##$FT_mod= 6
##$GAMMA= 0
##$GB= 0
##$INTBC= 1
##$INTSCL= 1
##$ISEN= 128
##$LB= 0.3
##$LEV0= 0
##$LPBIN= 0
##$MAXI= 10000
##$MC2= 0
##$MEAN= 0
##$ME_mod= 0
##$MI= 0
##$NCOEF= 0
##$NC_proc= -2
##$NLEV= 6
##$NOISF1= 0
##$NOISF2= 0
##$NSP= 0
##$NTH_PI= 0
##$NZP= 0
##$OFFSET= 14.96059
##$PC= 1
##$PHC0= -84.89685
##$PHC1= 0
##$PH_mod= 1
##$PKNL= yes
##$PPARMOD= 0
##$PPDIAG= 0
##$PPIPTYP= 0
##$PPMPNUM= 2147483647
##$PPRESOL= 1
##$PSCAL= 4
##$PSIGN= 0
##$PYNMP= <proc.py>
##$REVERSE= no
##$SF= 400.020009799961
##$SI= 131072
##$SIGF1= 0
##$SIGF2= 0
##$SINO= 400
##$SIOLD= 131072
##$SPECTYP= <>
##$SREGLST= <1H.CDCl3>
##$SSB= 0
##$STSI= 131072
##$STSR= 0
##$SW_p= 8223.68421052631
##$SYMM= 0
##$S_DEV= 0
##$TDeff= 65536
##$TDoff= 0
##$TI= <>
##$TILT= no
##$TM1= 0
##$TM2= 0
##$TOPLEV= 0
##$USERP1= <user>
##$USERP2= <user>
##$USERP3= <user>
##$USERP4= <user>
##$USERP5= <user>
##$WDW= 1
##$XDIM= 131072
##$YMAX_p= 373715986
##$YMIN_p= -10784
##$CURPLOT= <Network HP LaserJet P1505>
##$CURPRIN= <$Network HP LaserJet P1505>
##$DFORMAT= <normdp>
##$LAYOUT= <+/1D_H.xwp>
##$LFORMAT= <normlp>
##$PFORMAT= <normpl>
##$SURQMSG= 1
$$ End of Bruker specific parameters
$$ ---------------------------------
##NTUPLES= NMR SPECTRUM
##VAR_NAME=  FREQUENCY,     SPECTRUM/REAL,   SPECTRUM/IMAG
##SYMBOL=    X,             R,               I
##VAR_TYPE=  INDEPENDENT,   DEPENDENT,       DEPENDENT
##VAR_FORM=  AFFN,          ASDF,            ASDF
##VAR_DIM=   131072,        131072,          131072
##UNITS=     HZ,            ARBITRARY UNITS, ARBITRARY UNITS
##FACTOR=    0.0627417313425164, 1,          1
##FIRST=     8223.62146879497, 2534,         -51414
##LAST=      0,             4553,            -50790
##MIN=       0,             -10784,          0
##MAX=       8223.62146879497, 373715986,    0
$$ Real data points
##PAGE= N=1
##DATA TABLE= (X++(R..R)), XYDATA
$$ [...]
$$ plain form
61801 615897 587259 561113 537535 516193 497019 480294 465956 453441 442474 433462 426748 421842
61789 421842 417813 414119 410682 407372 403985 400687 397974 396006 394261 392055 389251 386266 383478 380830
61775 380830 378109 375460 373393 372157 371225 369677 367084 363819 360403 356850 352931 348923 345728 344114
61761 344114 344053 344880 345953 347035 348171 349412 350664 351688 352239 352348 352454 353104 354423 356035 357582 359101
61745 359101 360671 361908 362312 362068 362010 362615 363469 363975 364164 364412 364790 365181 365776 366822 368087 369163 370235
61728 370235 371849 373924 375738 377085 378715 381199 383996 386203 387759 389297 391079 392772 394162 395472
61714 395472 396911 398445 400217 402659 405834 408912 410726 410867 409926 408562 406665 403685 399603 395091 390738
61699 390738 386635 382885 379936 377873 375816 372684 368395 363758 359347 355231 351688 349247 347814 346530
$$ packed form
61801F15897k8638k6146k3578k1342j9174j6725j4338j2515j0967r012o714m906
61789D21842m029l694l437l310l387l298k713j968j745k206k804k985k788k648
61775C80830k721k649k067j236r32j548k593l265l416l553l919m008l195j614
61761C44114o1Q27J073J082J136J241J252J024N51J09J06O50J319J612J547J519
61745C59101J570J237M04k44n8O05Q54N06J89K48L78L91N95J046J265J076J072
61728C70235J614K075J814J347J630K484K797K207J556J538J782J693J390J310
61714C95472J439J534J772K442L175L078J814J41r41j364j897k980m082m512m353
61699C90738m103l750k949k063k057l132m289m637m411m116l543k441j433j284
$$ plain form
61685 346530 344839 343017 341358 339514 337116 334395 331745 329222 326983 325590 325273 325406 325363 325385 325895 326422
61669 326422 326087 324907 323779 323262 323162 323230 323516 323973 324376 324744 325308 326019 326548 326813 327030 327271 327487 327933
61651 327933 329087 331094 333729 336848 340364 343897 347015 349931 353366 357616 362153 366239 369535 372168
61637 372168 374590 377360 380567 383509 385357 386032 385960 385148 383180 380033 376200 372023 367613 363310 359431
61622 359431 355550 351039 346473 343466 342638 342683 342052 340799 340105 340626 341980 343388 344087 343470 341504 338818
61606 338818 335976 332891 329244 325065 320448 315194 309296 303414 298251 293699 289186 284625 280458 276922
61592 276922 273833 271021 268454 265986 263414 260758 258109 255268 251957 248356 245074 242532 240614 238884
61578 238884 236962 234772 232648 231099 230313 229971 229655 229143 228164 226275 223394 220233 217760 216321 215505 214661
$$ packed form
61685C46530j691j822j659j844k398k721k650k523k239j393l17J33m3K2N10N27
61669C26422l35j180j128n17j00O8K86M57M03L68N64P11N29K65K17K41K16M46
61651C27933J154K007K635L119L516L533L118K916L435M250M537M086L296K633
61637C72168K422K770L207K942J848O75p2q12j968l147l833m177m410m303l879
61622C59431l881m511m566l007q28M5o31j253o94N21J354J408O99o17j966k686
61606C38818k842l085l647m179m617n254n898n882n163m552m513m561m167l536
61592B76922l089k812k567k468k572k656k649k841l311l601l282k542j918j730
61578B38884j922k190k124j549p86l42l16n12r79j889k881l161k473j439q16q44
$$ plain form
61562 214661 213332 211413 209313 207794 207325 207699 208490 209616 211148 212849 214288 215231 215643 215549 215316 215697
61546 215697 217086 218908 220260 221012 221718 222617 223309 223472 223288 223060 222912 223009 223662 224949 226482 227741 228504
61529 228504 228887 229126 229367 229542 229459 229022 228187 226704 224249 221079 218141 216146 214833 213561 212298 211424
61513 211424 210813 209848 208355 206853 205749 204812 203624 202136 200606 199394 198914 199371 200372 201074 200884 199835
61497 199835 198313 196749 195548 194907 194607 194297 194011 194036 194287 194270 193810 193397 193636 194663 196205 197862 199168
61480 199168 199757 199683 199397 199326 199655 200478 201758 203111 204061 204592 205097 205669 205976 205968 206175 206979 208002 208626 208784
61461 208784 208861 209042 209185 209159 208987 208739 208585 208829 209606 210584 211211 211215 210725 210017 209385 209169 209578 210410 211131 211408
61441 211408 211554 212339 214243 216918 219474 221347 222708 224045 225675 227920 231314 236068 241397 245962 249017
$$ packed form
61562B14661j329j919k100j519m69L74P91J126J532J701J439R43M12r4k33L81
61546B15697J389J822J352P52P06Q99O92J63j84k28j48R7O53J287J533J259P63
61529B28504L83K39K41J75q3m37q35j483k455l170k938j995j313j272j263q74
61513B11424o11r65j493j502j104r37j188j488j530j212m80M57J001P02j90j049
61497A99835j522j564j201o41l00l10k86K5K51j7m60m13K39J027J542J657J306
61480A99168N89p4k86p1L29Q23J280J353R50N31N05N72L07qK07Q04J023O24J58
61461B08784P7J81J43k6j72k48j54K44P77R78O27Mm90p08o32k16M09Q32P21K77
61441B11408J46P85J904K675K556J873J361J337J630K245L394M754N329M565L055
$$ plain form
61426 249017 250734 251437 251190 250269 249427 249267 249736 250517 251612 253222 255305 257602 259876 261928 263603 264975
61410 264975 266279 267449 268042 267785 266938 265905 264794 263538 262035 259950 256851 252928 249182 246435 244517
61395 244517 242865 241500 240818 240728 240756 240883 241520 242590 243292 242992 241897 240708 239947 239753 239918 240030 239921 240082
61377 240082 241266 243522 246004 247885 249115 250049 250734 250975 250891 251038 251906 253515 255510 257563 259643 261882
61361 261882 264214 266348 268256 270518 273765 277773 281549 284462 286954 289979 294035 299051 304836 311184
61347 311184 317653 323720 329212 334256 338749 342258 344638 346540 349019 352742 357679 363414 369419 375116
61333 375116 380048 384166 387724 390710 392577 392815 391629 389777 387774 385574 383033 380257 377352 374206
61319 374206 370831 367684 365307 363780 362864 362571 363224 364944 367428 370344 373661 377478 381718 386266 391242
$$ packed form
61426B49017J717P03k47r21q42j60M69P81J095J610K083K297K274K052J675J372
61410B64975J304J170N93k57q47j033j111j256j503k085l099l923l746k747j918
61395B44517j652j365o82r0K8J27O37J070P02l00j095j189p61j94J65J12j09J61
61377B40082J184K256K482J881J230R34O85K41q4J47Q68J609J995K053K080K239
61361B61882K332K134J908K262L247M008L776K913K492L025M056N016N785O348
61347C11184O469O067N492N044M493L509K380J902K479L723M937N735O005N697
61333C75116M932M118L558K986J867K38j186j852k003k200k541k776k905l146
61319C74206l375l147k377j527r16k93O53J720K484K916L317L817M240M548M976
$$ plain form
61304 391242 396965 403547 410623 417490 423531 428485 432302 434829 435837 435432 434209 432783 431304 429574
61290 429574 427472 424965 421900 418250 414521 411451 409140 406854 403881 400273 396580 393249 390654 389306
61276 389306 389505 390846 392572 394459 396959 400320 403942 406914 409083 411318 414607 418980 423445 427061
61262 427061 430002 433408 438187 444165 450491 456535 462114 467089 471196 474348 476793 478910 481055 483594
61248 483594 486809 490642 494715 498644 502147 504928 506741 507655 507895 507372 505738 502968 499440 495230 489816
61233 489816 482934 475329 468144 461826 456197 451390 448035 446417 446073 446377 447072 448059 449182 450452 452102
61218 452102 454133 456141 457907 459914 462930 467280 472690 478622 484435 489460 493295 496058 498191 500116
61204 500116 502175 504584 507172 509452 511382 513968 518588 525679 534427 543888 554084 565711 578905
$$ packed form
61304C91242N723O582P076O867O041M954L817K527J008m05j223j426j479j730
61290D29574k102k507l065l650l729l070k311k286k973l608l693l331k595j348
61276C89306J99J341J726J887K500L361L622K972K169K235L289M373M465L616
61262D27061K941L406M779N978O326O044N579M975M107L152K445K117K145K539
61248D83594L215L833M073L929L503K781J813R14K40n23j634k770l528m210n414
61233D89816o882p605p185o318n629m807l355j618l44L04O95R87J123J270J650
61218D52102K031K008J766K007L016M350N410N932N813N025L835K763K133J925
61204E00116K059K409K588K280J930K586M620P091Q748R461J0196J1627J3194
$$ plain form
61191 578905 592558 605014 615448 624469 633157 641602 648711 653637 656990 660247 664205 668483 672447
61178 672447 676026 679390 682339 684429 685558 686078 686378 686584 686689 686667 686269 684898 681982 677600 672446 666991
61162 666991 660855 653284 644117 633932 623328 612537 601806 591590 582101 573077 564349 556305 549473
61149 549473 543955 539549 535992 532679 528489 522505 514761 505893 496337 486366 476529 467311 458582 450134
61135 450134 442677 437439 434652 433212 432037 431026 430454 430303 430740 432622 436763 442962 450236 457834 465638
61120 465638 473804 482544 492233 503386 516412 531465 548459 567152 587333 608899 631608 654872
61108 654872 678174 701674 725874 750559 774530 796618 816551 834512 850287 863301 873297 880583
61096 880583 885641 888669 889413 887346 882193 874324 864391 852625 838919 823677 807999 792663 777335
$$ packed form
61191E78905J3653J2456J0434R021Q688Q445P109M926L353L257L958M278L964
61178F72447L579L364K949K090J129N20L00K06J05k2l98j371k916m382n154n455
61162F66991o136p571r167j0185j0604j0791j0731j0216r489r024q728q044o832
61149E49473n518m406l557l313m190n984p744q868r556r971r837r218q729q448
61135D50134p457n238k787j440j175j011n72j51M37J882M141O199P274P598P804
61120D65638Q166Q740R689J1153J3026J5053J6994J8693K0181K1566K2709K3264
61108F54872K3302K3500K4200K4685K3971K2088J9933J7961J5775J3014R996P286
61096H80583N058L028P44k067n153p869r933j1766j3706j5242j5678j5336j5328
$$ plain form
61083 777335 761175 743900 725984 708098 690770 674335 658799 643787 628835 613708 598484
61072 598484 583707 570406 559456 550657 542938 535683 529363 524588 521224 518863 517550 517465 518348 519878
61058 519878 522213 525563 529647 534236 539846 547135 555890 565447 575857 587733 601021 614905 629137
61045 629137 644629 662369 682328 703831 726600 751026 777723 807113 839363 874528 912722
61034 912722 954058 998280 1044599 1092136 1140469 1189664 1240076 1292439 1347991 1408198 1474426
61023 1474426 1547917 1629748 1720489 1820279 1929616 2050055 2184385 2336944 2514121 2723644
61013 2723644 2972703 3267283 3613844 4021114 4500319 5065800 5737660 6544153 7521266
61004 7521266 8708498 10135198 11788058 13567430 15271660 16650296 17513935 17826768
$$ packed form
61083G77335j6160j7275j7916j7886j7328j6435j5536j5012j4952j5127j5224
61072E98484j4777j3301j0950q799p719p255o320m775l364k361j313q5Q83J530
61058E19878K335L350M084M589N610P289Q755R557J0410J1876J3288J3884J4232
61045F29137J5492J7740J9959K1503K2769K4426K6697K9390L2250L5165L8194
61034I12722M1336M4222M6319M7537M8333M9195N0412N2363N5552O0207O6228
61023A474426P3491Q1831R0741R9790J09337J20439J34330J52559J77177K09523
61013B723644K49059K94580L46561M07270M79205N65481O71860Q06493R77113
61004G521266J187232J426700J652860J779372J704230J378636Q63639L12833
$$ plain form
60996 17826768 17712694 17381111 17041010 16853820 16911192 17203435 17590936 17831433 17681724
60987 17681724 17014984 15868244 14394469 12773255 11149694 9621426 8247831 7056819
60979 7056819 6049368 5209256 4514508 3943125 3473963 3087939 2769587 2506188 2285947
60970 2285947 2098512 1936668 1795806 1671894 1561238 1461705 1372397 1291967 1218603 1151752
60960 1151752 1092417 1041215 997098 958227 923163 890788 860008 830179 801324 773534 746648
60949 746648 720850 697026 676042 657914 641989 627744 615135 604320 595163 586942 578639 569772
60937 569772 560801 552421 544613 536814 528829 520995 513409 505626 497276 488544 479855 471483 463654 456617
60923 456617 450354 444456 438515 432505 426718 421507 417086 413396 410183 407371 405249 404040 403464 403078 402883
$$ packed form
60996A7826768j14074l31583l40101j87190N7372K92243L87501K40497j49709
60987A7681724o66740j146740j473775j621214j623561j528268j373595j191012
60979G056819j007451q40112o94748n71383m69162l86024l18352k63399k20241
60970B285947j87435j61844j40862j23912j10656r9533q9308q0430p3364o6851
60960A151752n9335n1202m4117l8871l5064l2375l0780k9829k8855k7790k6886
60949G46648k5798k3824k0984j8128j5925j4245j2609j0815r157q221q303q867
60937E69772q971q380p808p799p985p834p586p783q350q732q689q372p829p037
60923D56617o263n898n941o010n787n211m421l690l213k812k122j209n76l86j95
$$ plain form
60908 402883 403136 403689 404036 403956 403567 402747 401146 398897 396783 395415 394708 394349 394312 394635 395048 395129 394562 393160
60890 393160 390983 388566 386594 385094 383329 380667 377190 373277 369144 365158 362063 360322 359519 358873 358126
60875 358126 357559 357408 357810 359074 361436 364607 368083 371921 376702 382620 389090 395431 401607 408033 414852
60860 414852 421615 427624 432472 436368 440022 444169 449097 454519 459756 464081 467114 469174 471123 473593
60846 473593 476410 478952 481015 483042 485501 488389 491432 494499 497537 500251 502147 502985 503107 503286 504213
60831 504213 506074 508624 511643 515311 520042 526022 533133 541342 550934 562140 574666 587819 601108
60818 601108 614510 628163 642055 656167 670754 686145 702193 718065 732680 745375 756123
60807 756123 765130 772244 776802 778132 776257 771998 766290 759461 751239 741346 729843 716959 702890
$$ packed form
60908D02883K53N53L47q0l89q20j601k249k114j368p07l59l7L23M13Q1n67j402
60890C93160k177k417j972j500j765k662l477l913m133l986l095j741q03o46p47
60875C58126n67j51M02J264K362L171L476L838M781N918O470O341O176O426O819
60860D14852O763O009M848L896L654M147M928N422N237M325L033K060J949K470
60846D73593K817K542K063K027K459K888L043L067L038K714J896Q38J22J79R27
60831E04213J861K550L019L668M731N980P111Q209R592J1206J2526J3153J3289
60818F01108J3402J3653J3892J4112J4587J5391J6048J5872J4615J2695J0748
60807G56123R007P114M558J330j875m259n708o829q222r893j1503j2884j4069
$$ plain form
60794 702890 687885 672401 657065 642477 628912 616013 602894 588943 574623 561181 549452
60783 549452 539294 530243 522170 514949 507989 500674 492990 485202 477177 468714 460430 453493 448276 443902
60769 443902 439404 434752 430402 426360 422241 417910 413551 409228 404801 400172 395290 390025 384357 378548
60755 378548 372758 366662 359941 353149 347567 343900 341464 338928 335735 332522 330263 329209 328664 327620
60741 327620 325536 322590 319286 315951 312609 309235 305908 302675 299455 296247 293335 291099 289613 288628
60727 288628 288020 288093 289225 291271 293532 295408 296873 298201 299443 300435 301165 301789 302256 302281 301806 301165 300531
60710 300531 299458 297322 294114 290418 286631 282565 277953 273040 268444 264614 261609 259266 257334 255576
60696 255576 253974 252808 252234 251820 250824 249025 247024 245532 244650 244030 243513 243227 243206 243275 243341 243498 243839 244442
$$ packed form
60794G02890j5005j5484j5336j4588j3565j2899j3119j3951j4320j3442j1729
60783E49452j0158r051q073p221o960p315p684p788q025q463q284o937n217m374
60769D43902m498m652m350m042m119m331m359m323m427m629m882n265n668n809
60755C78548n790o096o721o792n582l667k436k536l193l213k259j054n45j044
60741C27620k084k946l304l335l342l374l327l233l220l208k912k236j486r85
60727B88628o08P3J132K046K261J876J465J328J242R92P30O24M67K5m75o41o34
60710C00531j073k136l208l696l787m066m612m913m596l830l005k343j932j758
60696B55576j602j166n74m14r96j799k001j492q82o20n17k86k1O9O6J57L41O03
$$ plain form
60678 244442 245483 247016 248614 249741 250579 251999 254397 257060 259157 260999 263582 267004 270008 271353
60664 271353 271160 270655 270881 271915 273083 273635 273342 272680 272459 273207 274928 277455 280772 284867 289398 293794
60648 293794 297765 301639 306064 311325 316893 321704 324937 326538 327045 327037 326769 326074 324423 321246 316502 310947
60632 310947 305653 301240 297644 294455 291194 287438 283138 278899 275617 273655 272579 271732 270818 269886 269049
60617 269049 268391 267926 267485 266805 265861 264935 264278 263845 263432 262846 261927 260711 259703 259643 260752 262399 263731
60600 263731 264446 264755 264867 264775 264428 263807 262907 261877 261108 260957 261361 261876 262048 261743 261258 261200 261993 263353 264415
60581 264415 264602 264214 264022 264507 265730 267654 270212 273170 276300 279668 283475 287702 292263 297478 304034
60566 304034 312352 322170 332745 343205 352668 360303 365455 367675 366729 362818 356784 349843 342968 336605
$$ packed form
60678B44442J041J533J598J127Q38J420K398K663K097J842K583L422L004J345
60664B71353j93n05K26J034J168N52k93o62k21P48J721K527L317M095M531M396
60648B93794L971L874M425N261N568M811L233J601N07qk68o95j651l177m744n555
60632C10947n294m413l596l189l261l756m300m239l282j962j076q47r14r32q37
60617B69049o58m65m41o80r44r26o57m33m13n86r19j216j008o0J109J647J332
60600B63731P15L09J12r2l47o21r00j030p69j51M04N15J72l05m85n8P93J360J062
60581B64415J87l88j92M85J223J924K558K958L130L368L807M227M561N215O556
60566C04034Q318R818J0575J0460R463P635N152K220r46l911o034o941o875o363
$$ plain form
60552 336605 330909 326079 322452 320476 320552 322706 326429 331051 336289 342244 348985 356489 364842 374008 383226
60537 383226 391071 396485 399540 400977 401285 400432 398312 395032 390853 386173 381573 377643 374668 372563 371110
60522 371110 370054 369068 367830 366309 364828 363776 363306 363361 363865 364770 366015 367621 369854 373126 377602 383049
60506 383049 389294 396732 406085 417619 430961 445908 463126 483709 508135 535966 566472 599072
60494 599072 633081 667352 700375 730462 755737 774178 783969 783835 773119 751941 721627 684846
60482 684846 644971 605041 567090 532074 500203 471445 445995 424231 406136 390907 377358
60471 377358 364746 353112 342904 334436 327606 321969 317069 312805 309387 306776 304317 301201 297278
60458 297278 293176 289538 286393 283359 280176 276889 273683 270808 268555 267019 265859 264476 262524 260124
$$ packed form
60552C36605n696m830l627j976P6K154L723M622N238N955O741P504Q353R166R218
60537C83226P845N414L055J437L08q53k120l280m179m680m600l930k975k105j453
60522C71110j056r86j238j521j481j052m70N5N04R05J245J606K233L272M476N447
60506C83049O245P438R353J1534J3342J4947J7218K0583K4426K7831L0506L2600
60494E99072L4009L4271L3023L0087K5275J8441R791j34j0716k1178l0314l6781
60482F84846l9875l9930l7951l5016l1871k8758k5450k1764j8095j5229j3549
60471C77358j2612j1634j0208q468o830n637m900m264l418k611k459l116l923
60458B97278m102l638l145l034l183l287l206k875k253j536j160j383j952k400
$$ plain form
60444 260124 257620 255288 253381 252250 252174 253095 254669 256580 258625 260463 261490 261157 259362 256494 253150
60429 253150 249912 247192 245101 243521 242496 242489 243995 246903 250481 254120 257771 261466 264660 266394 266139
60414 266139 264286 261787 259491 257856 257074 257205 258097 259287 260232 260740 261105 261677 262372 262835 263043 263483 264606
60397 264606 266307 268058 269385 270171 270746 271826 274021 277117 280072 282052 283277 284511 286019 287499 288860
60382 288860 290342 291825 292725 292918 293195 294374 296318 298311 300056 301794 303636 305384 307007 308769 310766
60367 310766 312671 314110 315078 315877 316821 318013 319250 320147 320609 321107 322248 324102 326313 328867 332261 336740
60351 336740 341866 347200 352992 359730 367254 374836 381979 388484 393759 396722 396718 394155 389930 384550 378126
60336 378126 370912 363463 356353 350049 344896 340872 337500 334395 331802 330186 329364 328572 327421 326176 324991
$$ packed form
60444B60124k504k332j907j131p6R21J574J911K045J838J027l33j795k868l344
60429B53150l238k720k091j580j025pJ506K908L578L639L651L695L194J734k55
60414B66139j853k499k296j635p82J31Q92J190R45N08L65N72O95M63K08M40J123
60397B64606J701J751J327P86N75J080K195L096K955J980J225J234J508J480J361
60382B88860J482J483R00J93K77J179J944J993J745J738J842J748J623J762J997
60367C10766J905J439R68P99R44J192J237Q97M62M98J141J854K211K554L394M479
60351C36740N126N334N792O738P524P582P143O505N275K963mk563m225n380o424
60336C78126p214p449p110o304n153m024l372l105k593j616q22p92j151j245j185
$$ plain form
60321 324991 323509 321646 320102 319470 319300 318821 318307 318844 320780 323303 325732 328352 331610 335295 339173
60306 339173 343793 349986 357905 367276 378216 390944 404765 418144 429929 439812 447436 451770 451819
60293 451819 447554 439717 429083 416298 402270 388242 375349 364160 354639 346538 339897 335070 332087
60280 332087 330166 328277 326168 324413 323411 322851 322312 321832 321494 320864 319312 316694 313394 309907 306641
60265 306641 303846 301400 298950 296573 294974 294561 294651 294117 292651 290850 289269 288026 287257 287232 287804 288319
60249 288319 288302 287882 287403 287032 286855 286993 287503 288487 290314 293137 296136 297943 298219 298191 299117 300700 301672 301560
60231 301560 301103 301075 301526 302295 303527 305277 307096 308458 309416 310457 311850 313465 315177 317102 319329 321656
60215 321656 323772 325597 327283 329003 330929 333378 336691 340839 345339 349695 353805 357809 361757 365583
$$ packed form
60321C24991j482j863j544o32j70m79n14N37J936K523K429K620L258L685L878
60306C39173M620O193P919R371J0940J2728J3821J3379J1785R883P624M334M9
60293D51819m265p837j0634j2785j4028j4028j2893j1189r521q101o641m827k983
60280C32087j921j889k109j755j002n60n39m80l38o30j552k618l300l487l266
60265C06641k795k446k450k377j599m13R0n34j466j801j581j243p69k5N72N15
60249B88319j7m20m79l71j77J38N10R84J827K823K999J807K76k8R26J583R72j12
60231C01560m57k8M51P69J232J750J819J362R58J041J393J615J712J925K227K327
60215C21656K116J825J686J720J926K449L313M148M500M356M110M004L948L826
$$ plain form
60201 365583 369222 372503 375191 377463 380136 383976 388812 393811 398530 403145 407586 411100 413015 413479
60187 413479 413140 412508 411941 411792 412027 411996 411048 409195 406797 403866 400194 395955 391678 387765 384424 381891
60171 381891 380106 378319 375710 372463 369644 367925 367005 366351 365798 365138 363864 361918 360178 359590 360039 360639
60155 360639 360852 360791 360599 360252 360091 360907 363149 366284 369161 370860 371210 370813 370747 371945 374537 377824 380977
60138 380977 383719 386327 389211 392646 396727 401328 406123 410749 414927 418384 420859 422342 423172 423721 424051
60123 424051 424072 423886 423690 423478 423232 423364 424495 426575 428630 429682 429725 429508 429598 429986 430436 430802 430987 430931 430687
60104 430687 430261 429411 427875 425833 423859 422317 421029 419620 417968 416209 414495 412863 411218 409383 407347
60089 407347 405496 404389 404198 404529 404816 404763 404412 404089 404301 405414 407303 409557 411988 414556 416753 417729
$$ packed form
60201C65583L639L281K688K272K673L840M836M999M719M615M441L514J915M64
60187D13479l39o32n67j49K35l1r48j853k398k931l672m239m277l913l341k533
60171C81891j785j787k609l247k819j719r20o54n53o60j274j946j740n88M49O00
60155C60639K13o1j92l47j61Q16K242L135K877J699L50l97o6J198K592L287L153
60138C80977K742K608K884L435M081M601M795M626M178L457K475J483Q30N49L30
60123D24051K1j86j96k12k46J32J131K080K055J052M3k17R0L88M50L66J85n6k44
60104D30687m26q50j536k042j974j542j288j409j652j759j714j632j645j835k036
60089D07347j851j107j91L31K87n3l51l23K12J113J889K254K431K568K197R76
$$ plain form
60073 417729 417345 416602 416422 416427 415489 413268 410461 407597 404371 400402 396016 391810 387791 383442 378513 373376
60057 373376 368597 364421 360740 357395 354382 351808 349746 348200 347235 347019 347631 348818 350055 350972 351771
60042 351771 353192 355928 359934 364343 368205 371288 374088 377150 380669 384674 389114 393544 397098 399167
60028 399167 399929 399915 399225 397498 394480 390284 385154 379407 373566 368127 363030 357617 351328 344381 337738
60013 337738 332383 328537 325446 322128 318485 315504 314146 314231 314739 314940 314793 314412 313765 312948 312220 311529 310440
59996 310440 308745 306855 305399 304724 304959 306177 308195 310450 312430 314156 315965 317932 319776 321316 322832
59981 322832 324844 327592 330746 333637 335803 337216 337960 337904 336899 335206 333455 332151 331405 331071 330893 330567
59965 330567 329951 329325 329200 329824 331002 332297 333194 333280 332641 332036 332220 333122 334067 334760 335467 336285 336921 337384
$$ packed form
60073D17729l84p43j80Nr38k221k807k864l226l969m386m206m019m349m929n137
60057C73376m779m176l681l345l013k574k062j546r65k16O12J187J237R17P99
60042C51771J421K736M006M409L862L083K800L062L519M005M440M430L554K069
60028C99167P62j4o90j727l018m196n130n747n841n439n097n413o289o947o643
60013C37738n355l846l091l318l643k981j358Q5N08K01j47l81o47q17p28o91j089
59996C10440j695j890j456o75K35J218K018K255J980J726J809J967J844J540J516
59981C22832K012K748L154K891K166J413P44n6j005j693j751j304p46l34j78l26
59965C30567o16o26j25O24J178J295Q97Q6o39o05J84R02R45O93P07Q18O36M63
$$ plain form
59947 337384 338120 339128 339665 339366 339053 339721 341151 342265 342549 342360 341976 341152 339692 337794 335635 333150
59931 333150 330364 327504 324619 321554 318502 316146 315015 314987 315680 317011 318985 321149 322662 323006 322487
59916 322487 322033 322566 324489 327637 331672 336450 341903 347679 353220 358287 363184 368222 373205 377701 381690
59901 381690 385475 388903 391118 391411 390115 388272 386478 384463 381869 379028 376664 375101 374135 373602 373712
59886 373712 374802 377056 380491 384940 389977 395041 399782 404166 408304 412352 416561 421099 425687 429577
59872 429577 431967 432385 430811 427736 424059 420477 416885 412658 407612 402346 397594 393742 391121 390207 391089
59857 391089 393171 395887 399457 404535 411286 419156 427256 434559 440019 443128 444363 444705 444793 444897 445381
59842 445381 446479 447562 447273 444682 439951 433763 426588 418732 410682 402957 395744 388993 382832 377723
$$ packed form
59947C37384P36J008N37k99l13O68J430J114K84j89l84q24j460j898k159k485
59931C33150k786k860k885l065l052k356j131k8O93J331J974K164J513L44n19
59916C22487m54N33J923L148M035M778N453N776N541N067M897N038M983M496L989
59901C81690L785L428K215K93j296j843j794k015k594k841k364j563r66n33J10
59886C73712J090K254L435M449N037N064M741M384M138M048M209M538M588L890
59872D29577K390M18j574l075l677l582l592m227n046n266m752l852k621r14Q82
59857C91089K082K716L570N078O751P870Q100P303N460L109J235L42Q8J04M84
59842D45381J098J083k89k591m731o188p175p856q050p725p213o751o161n109
$$ plain form
59828 377723 374180 372369 371934 372220 372659 372903 372631 371533 369709 367806 366356 365089 363226 360384 356837
59813 356837 353037 349397 346522 345062 345064 345851 346846 348194 350350 353307 356524 359393 361488 362500 362279 361004
59797 361004 359118 356983 354563 351451 347295 342284 337138 332482 328375 324599 321225 318557 316645 315289
59783 315289 314462 314238 314265 313845 312750 311513 310666 310084 309329 308297 307179 306170 305514 305506 306095 306754 307144 307631
59765 307631 308721 310282 311843 313485 315814 319003 322391 325185 327120 328372 329221 330035 331290 333296 336001
59750 336001 339085 342140 344806 347083 349548 352913 357230 361803 366039 370090 374361 378671 382269 384648
59736 384648 386012 386938 387851 388907 390149 391534 392883 393970 394752 395428 396169 396781 396828 396181 395388 395235 395915
59719 395915 396779 397010 396412 395441 394621 394126 393850 393661 393474 393201 392733 392054 391366 391092 391573 392649 393673 394123
$$ packed form
59828C77723l543j811m35K86M39K44k72j098j824j903j450j267j863k842l547
59813C56837l800l640k875j460KP87R95J348K156K957L217K869K095J012k21j275
59797C61004j886k135k420l112m156n011n146m656m107l776l374k668j912j356
59783C15289q27k24K7m20j095j237q47n82p55j032j118j009o56qN89O59L90M87
59765C07631J090J561J561J642K329L189L388K794J935J252Q49Q14J255K006K705
59750C36001L084L055K666K277K465L365M317M573M236M051M271M310L598K379
59736C84648J364R26R13J056J242J385J349J087P82O76P41O12M7o47p93j53O80
59719C95915Q64K31n98r71q20m95k76j89j87k73m68o79o88k74M81J076J024M50
$$ plain form
59701 394123 394170 394386 394901 395160 394659 393637 392783 392441 392429 392522 392725 393005 393166 393180 393360 393898 394439 394429 393770 392835
59681 392835 391899 390894 389760 388631 387481 385883 383472 380545 377853 375731 373668 370907 367335 363613
59667 363613 360430 357808 355244 352447 349719 347566 346064 344830 343545 342351 341591 341309 341178 340946 340821
59652 340821 341358 342994 345746 349256 352958 356213 358523 359887 360861 362016 363207 363603 362541 360246 357513
59637 357513 354895 352450 350184 348356 347225 346778 346847 347286 347887 348313 348384 348274 348178 347862 346847 345079 343123
59620 343123 341587 340533 339594 338435 336907 334921 332481 329909 327844 326932 327467 329175 331250 332809 333670
59605 333670 334620 336573 339400 341936 343246 343524 343553 343615 343371 342584 341526 340599 339888 339179 338307 337428 337025 337506
59587 337506 338698 339913 340679 341157 341610 341787 341269 340175 338938 337523 335479 332854 330372 328569 327244
$$ packed form
59701C94123M7K16N15K59n01j022q54l42j2R3K03K80J61J4J80N38N41j0o59r35
59681C92835r36j005j134j129j150j598k411k927k692k122k063k761l572l722
59667C63613l183k622k564k797k728k153j502j234j285j194p60k82j31k32j25
59652C40821N37J636K752L510L702L255K310J364R74J155J191L96j062k295k733
59637C57513k618k445k266j828j131m47O9M39O01M26P1j10r6l16j015j768j956
59620C43123j536j054r39j159j528j986k440k572k065r12N35J708K075J559Q61
59605C33670R50J953K827K536J310K78K9O2k44p87j058r27p11p09q72q79m03M81
59587C37506J192J215P66M78M53J77n18j094j237j415k044k625k482j803j325
$$ plain form
59572 327244 325984 324702 323435 322123 320876 320027 319663 319554 319755 320664 322163 323378 323771 323851 324175 324368 323946
59555 323946 323619 324615 326925 329267 330837 332137 333911 336177 338638 341291 344186 347168 350325 354251 359463
59540 359463 365848 373010 380979 390500 402888 419390 439836 461423 479365 489499 490505 483946 472798
59527 472798 460101 448218 438465 431270 426785 425153 426110 428799 432293 436069 439787 443037 445553 447315
59513 447315 448113 447362 444733 440636 435770 430484 424857 418980 412746 405793 398185 390802 384481 379066 373884
59498 373884 368884 364590 361093 357874 354655 351677 349048 346539 344300 343110 343474 344859 346252 347183 347854
59483 347854 348474 348934 349096 349191 349864 351812 355268 359805 364815 370163 376089 382422 388279 392771 395795 397852
59467 397852 399307 400136 400301 400010 399545 399105 398924 399351 400616 402573 404888 407511 410880 415578 421851 429482
$$ packed form
59572C27244j260j282j267j312j247q49l64j09K01R09J499J215L93Q0L24J93m22
59555C23946l27R96K310K342J570J300J774K266K461K653K895K982L157L926N212
59540C59463O385P162P969R521J2388J6502K0446K1587J7942J0134J006o559j1148
59527D72798j2697j1883r753p195m485j632R57K689L494L776L718L250K516J762
59513D47315P98p51k629m097m866n286n627n877o234o953p608p383o321n415n182
59498C73884n000m294l497l219l219k978k629k509k239j190L64J385J393R31O71
59483C47854O20M60J62R5O73J948L456M537N010N348N926O333N857M492L024K057
59467C97852J455Q29J65k91m65m40j81M27J265J957K315K623L369M698O273P631
$$ plain form
59451 429482 437988 446816 455478 463816 472149 480876 489826 498265 505601 511705 516268 518244 516507 511011
59437 511011 502941 493754 484445 475593 467490 459969 452540 445024 437792 431215 425181 419485 414493 410998
59423 410998 409510 409930 411943 415412 420369 426789 434554 443589 454021 466210 480519 497042 515614
59410 515614 536018 557699 578874 596175 605939 606379 598603 585599 570486 555679 542984 533739
59398 533739 528698 527965 530905 535671 538934 536911 527505 511656 492443 472885 454541 437774 422681
59385 422681 409508 398429 389257 381505 374803 369317 365618 363932 363567 363382 362829 362305 362369 362969 363681 364474
59369 364474 365838 368082 370781 373119 374730 376091 377984 380667 383686 386575 389504 392997 397162 401573
59355 401573 405962 410633 415989 421952 428167 434658 441974 450656 460749 471820 483369 495246 507775
$$ packed form
59451D29482Q506Q828Q662Q338Q333Q727Q950Q439P336O104M563J976j737n496
59437E11011q070r187r309q852q103p521p429p516p232o577o034n696m992l495
59423D10998j488M20K013L469M957O420P765R035J0432J2189J4309J6523J8572
59410E15614K0404K1681K1175J7301R764M40p776j3004j5113j4807j2695r245
59398E33739n041p33K940M766L263k023r406j5849j9213j9558j8344j6767j5093
59385D22681j3173j1079r172p752o702n486l699j686l65j85n53n24O4O00P12P93
59369C64474J364K244K699K338J611J361J893K683L019K889K929L493M165M411
59355D01573M389M671N356N963O215O491P316Q682J0093J1071J1549J1877J2529
$$ plain form
59342 507775 521326 535725 550169 563781 576116 587075 596619 604821 611862 617609 621370 622559 621541
59329 621541 619364 616504 612269 605668 596545 585674 574069 562543 551739 542091 533631 526050 519021
59316 519021 512393 506145 500450 495798 492759 491432 491355 492137 494040 497711 503532 511493 521361 532294 542157
59301 542157 547981 547748 541632 531279 518238 503546 488454 474617 463244 454520 448043 443429 440295
59288 440295 438130 436569 435623 435409 435836 436766 438207 440131 442364 444902 448038 451872 455931 459714 463469
59273 463469 468015 473790 480463 487545 495083 503548 513160 523456 533498 542603 550867 558772 566192 572058
59259 572058 575224 575476 573373 569373 563595 556272 547901 538814 529054 518830 508688 499035 489829 481016
59245 481016 473013 466392 461298 457449 454566 452486 450975 449926 449755 451107 453899 457039 459507 461509
$$ packed form
59342E07775J3551J4399J4444J3612J2335J0959R544Q202P041N747L761J189j018
59329F21541k177k860m235o601r123j0871j1605j1526j0804r648q460p581p029
59316E19021o628o248n695m652l039j327p7P82J903L671N821P961R868J0933R863
59301E42157N824k33o116j0353j3041j4692j5092j3837j1373q724o477m614l134
59288D40295k165j561r46k14M27R30J441J924K233K538L136L834M059L783L755
59273D63469M546N775O673P082P538Q465R612J0296J0042R105Q264P905P420N866
59259E72058L166K52k103m000n778p323q371r087r760j0224j0142r653r206q813
59245D81016q003o621n094l849k883k080j511j049j71J352K792L140K468K002
$$ plain form
59231 461509 464061 467476 470825 473120 474453 475543 476454 476396 474735 471674 467823 463444 458397 452614 446440
59216 446440 440510 435250 430427 425329 419627 413909 409047 405276 402317 400242 399453 399678 399763 398823 397165
59201 397165 395705 394926 394805 395300 396392 397879 399530 401261 402843 403779 403818 403352 402954 402809 402963 403683 405153
59184 405153 407129 409419 412346 416181 420474 424611 428747 433407 438365 442779 446469 450256 454844 460086
59170 460086 465563 471195 476969 482655 488174 493873 500054 506562 513047 519377 525585 531692 537768 543847
59156 543847 549624 554487 557929 559590 558906 555321 549166 541924 535182 529423 524071 518446 512420 506345
59142 506345 500715 495816 491510 487326 482853 478002 472932 467904 463216 459096 455599 452748 450641 449209
59128 449209 448022 446776 445958 446474 448527 451325 454096 456909 460215 464105 468473 473567 479774 486944 494415
$$ packed form
59231D61509K552L415L349K295J333J090R11n8j661l061l851m379n047n783o174
59216D46440n930n260m823n098n702n718m862l771k959k075p89K25Q5r40j658
59201C97165j460p79j21M95J092J487J651J731J582R36L9m66l98j45J54P20J470
59184D05153J976K290K927L835M293M137M136M660M958M414L690L787M588N242
59170D60086N477N632N774N686N519N699O181O508O485O330O208O107O076O079
59156E43847N777M863L442J661o84l585o155p242o742n759n352n625o026o075
59142E06345n630m899m306m184m473m851n070n028m688m120l497k851k107j432
59128D49209j187j246q18N16K053K798K771K813L306L890M368N094O207P170P471
$$ plain form
59113 494415 501786 509330 517523 526380 535432 544224 552678 560901 568765 575876 582021 587430 592415 596890
59099 596890 600510 603171 605066 606304 606700 605985 604040 601010 597403 593894 590676 587195 582950 578472 574953
59084 574953 572925 571849 570988 570007 568483 565596 560920 555113 549279 543825 538338 532397 526039 519499 512886
59069 512886 506232 499650 493311 487302 481518 475756 470017 464652 460082 456416 453515 451327 449855 448879
59055 448879 448110 447638 447858 448905 450430 451977 453198 453727 453340 452414 451809 452109 453234 454844 456680 458401
59039 458401 459571 460118 460475 461075 462013 463262 464802 466398 467789 469276 471612 475034 478949 482940 487497
59024 487497 493234 499823 506373 512580 518894 525688 532824 540106 547674 555831 564587 573407 581287 587235
59010 587235 590898 592708 593366 593324 592715 591546 589932 588421 588026 589532 592671 596476 600509 605238 611044
$$ packed form
59113D94415P371P544Q193Q857R052Q792Q454Q223P864P111O145N409M985M475
59099E96890L620K661J895J238L96p15j945l030l607l509l218l481m245m478l519
59084E74953k028j076q61r81j524k887m676n807n834n454n487n941o358o540o613
59069E12886o654o582o339o009n784n762n739n365m570l666k901k188j472r76
59055D48879p69m72K20J047J525J547J221N29l87r26o05L00J125J610J836J721
59039D58401J170N47L57O00R38J249J540J596J391J487K336L422L915L991M557
59024D87497N737O589O550O207O314O794P136P282P568Q157Q756Q820P880N948
59010E87235L663J810O58m2o09j169j614j511l95J506L139L805M033M729N806
$$ plain form
58995 611044 617475 623782 629690 635239 640308 644677 648206 650678 651844 651770 650644 647985 642799 634993 625983
58980 625983 617307 609199 601182 593515 587216 582955 580687 580188 581243 583489 586697 591081 596827 603540
58966 603540 610720 618549 627551 637581 647800 657577 666901 675958 684778 693209 700773 706675 710408 712140
58952 712140 712136 710104 705664 699169 691419 682805 673419 663810 654807 646571 638453 629940 621286 613223 606417
58937 606417 601025 596357 591245 585273 579362 574597 570941 567883 565829 565685 567177 568834 569827 570814 572655
58922 572655 575241 578004 580800 583796 587006 590307 593516 596379 599048 602667 608745 617738 628759 640787
58908 640787 653372 666041 677872 688125 696664 703490 708659 712978 717898 724043 730408 735531 738912
58895 738912 740817 741492 741381 741574 743137 746111 749866 754308 760254 768777 780587 795692 813053 830761
$$ packed form
58995F11044O431O307N908N549N069M369L529K472J166p4j126k659n186p806r010
58980F25983q676q108q017p667o299m261k268m99J055K246L208M384N746O713
58966F03540P180P829R002J0030J0219R777R324R057Q820Q431P564N902L733J732
58952G12140mk032m440o495p750q614r386r609r003q236q118q513q654q063o806
58937F06417n392m668n112n972n911m765l656l058k054j44J492J657R93R87J841
58922E72655K586K763K796K996L210L301L209K863K669L619O078Q993J1021J2028
58908F40787J2585J2669J1831J0253Q539O826N169M319M920O145O365N123L381
58895G38912J905O75j11J93J563K974L755M442N946Q523J1810J5105J7361J7708
$$ plain form
58881 830761 847219 862231 876545 890418 903054 913355 920729 925178 927022 926707 924527 920314 913476
58868 913476 903412 889911 873285 854284 833895 813162 793118 774595 757715 741619 725209
58857 725209 708346 691969 676881 662838 649101 635419 622081 609323 597203 585882 575568
58846 575568 566192 557484 549350 541879 535042 528726 523091 518537 515090 511982 508113 503006 497264 492028
58832 492028 488011 485135 482942 481039 479024 476446 473282 470241 468118 466910 466016 465310 465469 467126 470157
58817 470157 473976 478159 482530 486941 491236 495219 498545 500816 501966 502342 502390 502446 502745 503244 503433 502772
58801 502772 501445 500292 499841 499775 499441 498480 496843 494656 492352 490590 489655 489116 488221 486500 484038 481505
58785 481505 479896 479783 480764 482064 483661 486202 489802 493716 497453 501388 505746 509705 512218 513202 513203 512234
$$ packed form
58881H30761J6458J5012J4314J3873J2636J0301P374M449J844l15k180m213o838
58868I13476j0064j3501j6626j9001k0389k0733k0044j8523j6880j6096j6410
58857G25209j6863j6377j5088j4043j3737j3682j3338j2758j2120j1321j0314
58846E75568r376q708q134p471o837o316n635m554l447l108l869n107n742n236
58832D92028m017k876k193j903k015k578l164l041k123j208q94p06J59J657L031
58817D70157L819M183M371M411M295L983L326K271J150L76M8N6K99M99J89o61
58801E02772j327j153m51o6l34r61j637k187k304j762r35n39q95j721k462k533
58785D81505j609j13R81J300J597K541L600L914L737L935M358L959K513R84Jr69
$$ plain form
58769 512234 509713 505451 500076 494516 489473 485295 481863 478612 474963 470757 466138 461340 456794 453091
58755 453091 450381 448104 445781 443810 442989 443407 444368 445365 446599 448537 451370 454982 459080 463267 467282
58740 467282 471259 475604 480600 486295 492664 499610 506834 513950 520729 527094 532891 537901 542130 545971
58726 545971 550007 554594 559582 564476 568955 573091 576877 579807 581339 581706 581757 581991 582363 583097 584920 588103
58710 588103 591895 595459 598911 602894 607425 611703 614762 615899 614761 611597 607213 602204 596310 588861
58696 588861 579631 568833 556613 543130 529020 515265 502628 491499 482068 474148 467028 460105
58684 460105 453657 448502 444869 442063 439267 436296 433475 431147 429404 428099 427059 426398 426454 427252 428288
58669 428288 429212 430472 432864 436614 441364 446986 453828 462062 471134 479926 487197 491948 493844 493427 491605
$$ packed form
58769E12234k521m262n375n560n043m178l432l251l649m206m619m798m546l703
58755D53091k710k277k323j971q21M18R61R97J234J938K833L612M098M187M015
58740D67282L977M345M996N695O369O946P224P116O779O365N797N010M229L841
58726E45971M036M587M988M894M479M136L786K930J532L67N1K34L72P34J823L183
58710E88103L792L564L452L983M531M278L059J137j138l164m384n009n894p449
58696E88861r230j0798j2220j3483j4110j3755j2637j1129r431p920p120o923
58684D60105o448n155l633k806k796k971k821k328j743j305j040o61N6P98J036
58669D28288R24J260K392L750M750N622O842Q234R072Q792P271M751J896m17j822
$$ plain form
58654 491605 488854 485101 480364 475111 469980 465432 461779 459243 457762 456931 456257 455442 454396 453103 451595
58639 451595 450024 448697 447923 447750 447949 448462 449744 452369 456280 460820 465517 470424 475529 480285 484021
58624 484021 486483 487763 488126 488136 488527 489504 490550 491272 492107 493784 496471 499888 503916 508591 513713 518949
58608 518949 524104 528820 532280 533701 533070 531069 528508 526135 524557 523765 522955 521334 518938 516280 513579
58593 513579 510877 508545 506966 505934 505064 504626 505249 506910 508971 511249 514484 519685 527422 537533 548840
58578 548840 559383 567746 574307 580546 587170 593597 599216 604215 608943 613342 617542 622403 628888 637206
58564 637206 646944 657800 669851 683347 698499 715334 733548 752584 771920 791218 810176 828262
58552 828262 844456 857310 865710 869913 871399 871289 869312 864808 858272 851091 844036 836911 829479 821746
$$ packed form
58654D91605k751l753m737n253n131m548l653k536j481q31o74q15j046j293j508
58639D51595j571j327p74j73J99N13J282K625L911M540M697M907N105M756L736
58624D84021K462J280L63J0L91R77J046P22Q35J677K687L417M028M675N122N236
58608E18949N155M716L460J421o31k001k561k373j578p92q10j621k396k658k701
58593E13579k702k332j579j032q70m38O23J661K061K278L235N201P737J0111J1307
58578E48840J0543Q363O561O239O624O427N619M999M728M399M200M861O485Q318
58564F37206R738J0856J2051J3496J5152J6835J8214J9036J9336J9298J8958J8086
58552H28262J6194J2854Q400M203J486j10j977m504o536p181p055p125p432p733
$$ plain form
58538 821746 813198 802795 790120 775887 761010 745790 730406 715532 701951 689769 678432 667404
58526 667404 656738 647147 639551 634322 630995 628919 627959 628183 629204 630410 631622 632783 633192 632001 629567
58511 629567 627399 626499 626541 626904 627661 629096 630977 632860 634613 636117 636933 636729 635659 633972 631694 629109
58495 629109 627012 625935 625470 624927 624422 624751 626300 628650 631220 633849 636586 639315 641926 644753 648468
58480 648468 653366 659013 665018 672029 681356 693380 706963 720836 734872 749233 762873 773999
58468 773999 781831 786860 789452 789319 786695 782927 779325 776088 772863 769720 767091 765267 764459 764970 766869
58453 766869 769761 773138 776647 779895 782506 784551 786431 787980 788194 786190 782059 776452 769740 761954
58439 761954 753294 744375 736131 729553 725163 722630 721275 721073 722665 726240 730941 735705 740295 745222
$$ packed form
58538H21746q548j0403j2675j4233j4877j5220j5384j4874j3581j2182j1337j1028
58526F67404j0666r591p596n229l327k076r60K24J021J206J212J161M09j191k434
58511F29567k168r00M2L63P57J435J881J883J753J504Q16k04j070j687k278k585
58495F29109k097j077m65n43n05L29J549K350K570K629K737K729K611K827L715
58480F48468M898N647O005P011R327J2024J3583J3873J4036J4361J3640J1126
58468G73999P832N029K592j33k624l768l602l237l225l143k629j824q08N11J899
58453G66869K892L377L509L248K611K045J880J549K14k004m131n607o712p786
58439G61954q660q919q244o578m390k533j355k02J592L575M701M764M590M927
$$ plain form
58425 745222 751056 758109 766437 775736 785376 794802 803831 812528 820916 828769 835504 840413 843261 844434
58411 844434 844268 842674 839882 836976 834824 832818 829687 825332 820849 816871 813199 810130 808763 809519 811535
58396 811535 814082 817523 822215 827497 832590 837699 843470 849950 856758 863624 870144 875596 879725 883153
58382 883153 886402 889080 890657 891519 892528 893999 895777 897900 900492 903298 905914 908256 910332 911919
58368 911919 912981 914101 916032 919047 923025 927869 933545 940140 948118 958037 969685 982019 994196
58355 994196 1006111 1017611 1027989 1036819 1044663 1052264 1059483 1065574 1070171 1073558 1076377 1079532 1083962
58342 1083962 1089963 1096955 1104188 1111418 1118823 1126857 1136329 1147928 1161338 1175410 1189498 1203925 1218986
58329 1218986 1234366 1249891 1265918 1282428 1298519 1313342 1326806 1338961 1349587 1359037 1368538 1378880
$$ packed form
58425G45222N834P053Q328R299R640R426R029Q697Q388P853O735M909K848J173
58411H44434j66j594k792k906k152k006l131m355m483l978l672l069j367P56K016
58396H11535K547L441M692N282N093N109N771O480O808O866O520N452M129L428
58382H83153L249K678J577Q62J009J471J778K123K592K806K616K342K076J587
58368I11919J062J120J931L015L978M844N676O595P978R919J1648J2334J2177
58355I94196J1915J1500J0378Q830P844P601P219O091M597L387K819L155M430
58342A083962O001O992P233P230P405Q034R472J1599J3410J4072J4088J4427J5061
58329A218986J5380J5525J6027J6510J6091J4823J3464J2155J0626R450R501J0342
$$ plain form
58317 1378880 1389490 1399515 1409162 1419296 1430406 1442588 1455899 1470033 1484344 1498769 1514079
58306 1514079 1530662 1547842 1565036 1582706 1601437 1620894 1640514 1660522 1681406 1702977 1724692
58295 1724692 1746358 1767895 1789075 1810089 1831647 1853929 1876258 1898385 1921241 1945757 1971829
58284 1971829 1999097 2027729 2057730 2088498 2119885 2152656 2187019 2221797 2256045 2290501 2326472
58273 2326472 2364357 2404278 2447079 2493428 2542752 2594175 2647708 2703538 2761093 2819907 2880541
58262 2880541 2943640 3008953 3076226 3146141 3219403 3295886 3375443 3458365 3544253 3631842 3720928
58251 3720928 3812983 3908819 4007342 4107853 4211904 4321472 4436970 4558491 4687233 4824050
58241 4824050 4968334 5120026 5280980 5452604 5634053 5824613 6025868 6239516 6465275
$$ packed form
58317A378880J0610J0025R647J0134J1110J2182J3311J4134J4311J4425J5310
58306A514079J6583J7180J7194J7670J8731J9457J9620K0008K0884K1571K1715
58295A724692K1666K1537K1180K1014K1558K2282K2329K2127K2856K4516K6072
58284A971829K7268K8632L0001L0768L1387L2771L4363L4778L4248L4456L5971
58273B326472L7885L9921M2801M6349M9324N1423N3533N5830N7555N8814O0634
58262B880541O3099O5313O7273O9915P3262P6483P9557Q2922Q5888Q7589Q9086
58251C720928R2055R5836R8523J00511J04051J09568J15498J21521J28742J36817
58241D824050J44284J51692J60954J71624J81449J90560K01255K13648K25759
$$ plain form
58232 6465275 6703365 6956923 7229334 7521114 7832286 8165862 8525974 8914326 9331589
58223 9331589 9780685 10265662 10789010 11353290 11963870 12627169 13348200 14133177 14992665
58214 14992665 15938895 16982423 18135282 19415251 20843046 22438011 24221812 26225742
58206 26225742 28491936 31071924 34030412 37449002 41421517 46048140 51438740 57718595
58198 57718595 65026545 73515024 83364610 94803513 108117447 123657183 141851101
58191 141851101 163195523 188174059 217058976 249546148 284240269 318238613 347294737
58184 347294737 366870086 373715986 367056856 348642621 321783773 290131193 256855512
58177 256855512 224337581 194148028 167139770 143606663 123471700 106446209 92139871
$$ packed form
58232F465275K38090K53558K72411K91780L11172L33576L60112L88352M17263
58223I331589M49096M84977N23348N64280O10580O63299P21031P84977Q59488
58214A4992665R46230J043528J152859J279969J427795J594965J783801K003930
58206B6225742K266194K579988K958488L418590L972515M626623N390600O279855
58198E7718595P307950Q488479R849586J1438903J3313934J5539736J8193918
58191A41851101K1344422K4978536K8884917L2487172L4694121L3998344K9056124
58184C47294737J9575349O845900o659130j8414235k6858848l1652580l3275681
58177B56855512l2517931l0189553k7008258k3533107k0134963j7025491j4306338
$$ plain form
58170 92139871 80140480 70068399 61595773 54442443 48373453 43200071 38771204 34959533
58162 34959533 31657497 28780313 26262073 24046601 22085231 20340121 18782525 17387379
58154 17387379 16133165 15004717 13990388 13076641 12249210 11498193 10817523 10200115 9637327
58145 9637327 9122065 8648327 8208423 7794733 7404073 7036969 6692921 6369510 6065587
58136 6065587 5781767 5517504 5270454 5038913 4822439 4620082 4430249 4252211 4085749
58127 4085749 3929570 3782047 3643069 3513166 3391299 3275550 3165515 3061943 2964426 2871561
58117 2871561 2782997 2699169 2619269 2541577 2465818 2393280 2324560 2258917 2195843 2135585 2078044
58106 2078044 2022661 1969515 1919246 1871944 1827127 1784558 1743923 1704189 1664452 1625002 1586364
$$ packed form
58170I2139871j1999391j0072081q472626p153330o068990n173382m428867l811671
58162C4959533l302036k877184k518240k215472j961370j745110j557596j395146
58154A7387379j254214j128448j014329r13747q27431p51017o80670o17408n62788
58145I637327n15262m73738m39904m13690l90660l67104l44048l23411l03923
58136F065587k83820k64263k47050k31541k16474k02357j89833j78038j66462
58127D085749j56179j47523j38978j29903j21867j15749j10035j03572r7517r2865
58117B871561q8564q3828p9900p7692p5759p2538o8720o5643o3074o0258n7541
58106B078044n5383n3146n0269m7302m4817m2569m0635l9734l9737l9450l8638
$$ plain form
58095 1586364 1547966 1509151 1470796 1434412 1400225 1367736 1337526 1310648 1286610 1263806 1241727
58084 1241727 1220928 1201004 1180506 1159005 1137473 1116372 1095013 1073116 1051468 1030585 1010055
58073 1010055 989627 969713 950399 931102 911618 892579 874465 857034 840003 823562 808107
58062 808107 794113 782181 772348 763414 753929 743756 733763 724143 714195 703699 693253 683103 672863
58049 672863 662684 653502 645744 638771 632064 626015 620981 616371 611292 605583 599686 593915 588248 582558
58035 582558 576755 570811 564758 558539 551986 545081 537882 530036 520894 510588 500394 491394 483414 476011
58021 476011 469753 465351 462044 458235 453499 448701 444243 439630 434849 430781 427806 425164 422127 418839
58007 418839 415587 412225 408838 406132 404597 403956 403807 404109 404657 404870 404564 404257 404209 403773 402208 399581 396355
$$ packed form
58095A586364l8398l8815l8355l6384l4187l2489l0210k6878k4038k2804k2079
58084A241727k0799j9924k0498k1501k1532k1101k1359k1897k1648k0883k0530
58073A010055k0428j9914j9314j9297j9484j9039j8114j7431j7031j6441j5455
58062H08107j3994j1932r833q934r485j0173r993r620r948j0496j0446j0150j0240
58049F72863j0179r182p758o973o707o049n034m610n079n709n897n771n667n690
58035E82558n803n944o053o219o553o905p199p846r142j0306j0194r000p980p403
58021D76011o258m402l307l809m736m798m458m613m781m068k975k642l037l288
58007D18839l252l362l387k706j535o41j49L02N48K13l06l07m8m36j565k627l226
$$ plain form
57990 396355 392669 388618 384784 381782 379500 377346 375102 373047 371308 369549 367365 364753 362063 359603
57976 359603 357356 355102 352832 350937 349885 349718 349915 349676 348383 346097 343663 341984 341089 340334 339623 339725
57960 339725 341014 342592 343363 343406 343515 343824 343855 343639 343798 344615 345837 347389 349385 351459 352960 353919 355026
57943 355026 356532 358057 359642 362106 365925 370477 374915 379226 383976 389376 395087 400709 406055 411073
57929 411073 415684 419652 422577 424082 423980 422186 418746 414082 408822 403005 395876 387005 377229 367870
57915 367870 359346 351262 343559 336718 330973 326149 322260 319487 317648 316408 315894 316328 317179 317597 317555 317564
57899 317564 317365 316125 314068 312618 312520 312986 313224 313666 314960 316731 318280 319773 321775 324080 325831 326518
57883 326518 326222 325195 323826 322659 321789 320418 317580 313231 308168 302990 297521 291332 284557 278190 273519
$$ packed form
57990C96355l686m051l834l002k282k154k244k055j739j759k184k612k690k460
57976C59603k247k254k270j895j052j67J97k39j293k286k434j679q95p55p11J02
57960C39725J289J578P71M3J09L09L1k16J59Q17J222J552J996K074J501R59J107
57943C55026J506J525J585K464L819M552M438M311M750N400N711N622N346N018
57929D11073M611L968K925J505j02j794l440m664n260n817p129q871r776r359
57915C67870q524q084p703o841n745m824l889k773j839j240n14M34Q51M18m2R
57899C17564j99j240k057j450r8M66K38M42J294J771J549J493K002K305J751O87
57883C26518k96j027j369j167q70j371k838m349n063n178n469o189o775o367m671
$$ plain form
57868 273519 271074 270104 269351 268249 267033 265914 264870 264258 264847 266850 269530 272068 274364 276740 279428
57853 279428 282637 286580 291073 295555 299720 303669 307242 309848 311238 311837 311973 311450 310174 308465 306297
57838 306297 303035 298586 294092 290716 288230 285619 282604 279795 277704 276465 276385 277927 281108 285437 290418
57823 290418 295698 300944 306051 311360 317163 323103 328434 332639 335395 336199 334623 330845 325573 319572
57809 319572 313547 308118 303412 298913 294226 289745 286125 283383 281111 279281 278185 277763 277672 277909 278658
57794 278658 279548 279774 279054 277851 276539 274921 272759 270299 268087 266687 266676 268462 271839 276094 280723
57779 280723 285712 290987 295959 299908 302639 304516 306048 307556 309085 310469 311532 312172 312126 310797 307683
57764 307683 303018 297626 292072 286307 280322 274776 270535 267682 265398 262843 259979 257345 255236 253343
$$ packed form
57868B73519k445r70p53j102j216j119j044o12N89K003K680K538K296K376K688
57853B79428L209L943M493M482M165L949L573K606J390N99J36n23j276j709k168
57838C06297l262m449m494l376k486k611l015k809k091j239q0J542L181M329M981
57823B90418N280N246N107N309N803N940N331M205K756Q04j576l778n272o001
57809C19572o025n429m706m499m687m481l620k742k272j830j096m22r1K37P49
57794B78658Q90K26p20j203j312j618k162k460k212j400j1J786L377M255M629
57779B80723M989N275M972L949K731J877J532J508J529J384J063O40m6j329l114
57764C07683m665n392n554n765n985n546m241k853k284k555k864k634k109j893
$$ plain form
57750 253343 251187 248705 246234 244114 242544 241753 241899 242693 243384 243403 242876 242335 242077 241994 241916 241834 241702 241193
57732 241193 239842 237521 234755 232395 230848 229734 228517 227295 226630 226728 227184 227514 227464 226804 225396 223681
57716 223681 222559 222429 222781 223083 223552 224567 225716 226057 225151 223280 220864 218210 215813 214231 213509 213168
57700 213168 212912 212994 213733 215026 216594 218514 221162 224606 228215 231016 232470 232795 232524 231909 230936 229729
57684 229729 228543 227407 226268 225540 226044 228166 231505 235638 240830 247659 256380 267101 280262 296431
57670 296431 315873 338872 366321 399426 438513 481995 525951 564270 589932 597694 586626 560289
57658 560289 524429 484303 443469 404087 367776 336112 310229 289932 273646 259714 247635
57647 247635 237720 229883 223472 218194 214375 212066 210559 209181 208058 207547 207261 206329 204634 203203 203052
$$ packed form
57750B53343k156k482k471k120j570p91J46P94O91J9n27n41k58q3p8q2j32n09
57732B41193j351k321k766k360j547j114j217j222o65R8M56L30n0o60j408j715
57716B23681j122j30L52L02M69J015J149L41r06j871k416k654k397j582p22l41
57700B13168k56Q2P39J293J568J920K648L444L609K801J454L25k71o15r73j207
57684B29729j186j136j139p28N04K122L339M133N192O829Q721J0721J3161J6169
57670B96431J9442K2999K7449L3105L9087M3482M3956L8319K5662P762j1068k6337
57658E60289l5860m0126m0834l9382l6311l1664k5883k0297j6286j3932j2079
57647B47635r915p837o411n278l819k309j507j378j123n11k86r32j695j431j51
$$ plain form
57632 203052 203952 204697 204517 203817 203461 203730 204266 204696 204818 204325 203014 201307 199950 198988 197630 195466 193203
57615 193203 191682 190676 189345 187559 186063 185421 185492 185930 186597 187334 187789 187712 187168 186386 185602 185000 184570 184055
57597 184055 183281 182435 181751 181015 179703 177574 174861 172004 169507 167839 167082 166664 165797 164243 162444 160995
57581 160995 160210 160061 160294 160673 161243 162118 162921 162953 162234 161805 162430 163505 163964 163784 163661 163544 162670 161061
57563 161061 159827 159707 160261 160861 161561 162491 163280 163696 164209 165165 165953 165738 164792 164289 164877 166055 167032 167671
57545 167671 168375 169340 170150 170136 169072 167521 166457 166559 167845 169798 171669 172856 173339 173695 174426 175345 175880
57528 175880 175810 175311 174444 173158 171751 170753 170342 170372 170991 172590 175033 177493 179300 180417 181022 181239 181480
57511 181480 182339 183768 184937 185313 185306 185479 185728 185715 185544 185361 184758 183281 181253 179487 178327 177529 176829 176147
$$ packed form
57632B03052R00P45j80p00l56K69N36M30J22m93j311j707j357r62j358k164k263
57615A93203j521j006j331j786j496o42P1M38O67P37M55p7n44p82p84o02m30n15
57597A84055p74q46o84p36j312k129k713k857k497j668p57m18q67j554j799j449
57581A60995p85j49K33L79N70Q75Q03L2p19m29O25J075M59j80j23j17q74j609
57563A61061j234j20N54O00P00R30P89M16N13R56P88k15r46n03N88J178R77O39
57545A67671P04R65Q10j4j064j551j064J02J286J953J871J187M83L56P31R19N35
57528A75880p0m99q67j286j407r98m11L0O19J599K443K460J807J117O05K17K41
57511A81480Q59J429J169L76pJ73K49j3j71j83o03j477k028j766j160p98p00o82
$$ plain form
57493 176147 175347 174353 173407 172748 172162 171266 170073 168888 167816 166886 166472 166967 168088 169107 169859 170983 172955
57476 172955 175296 177026 177652 177487 177159 177033 177078 177153 177300 177601 177787 177336 176161 174954 174542 175058 176012 176987
57458 176987 177897 178687 179181 179317 179194 178809 178035 176933 175925 175516 175918 176884 177862 178424 178708 179324 180630 182237
57440 182237 183376 183652 183209 182374 181486 181002 181342 182436 183646 184275 184113 183538 183196 183549 184553 185750 186705
57423 186705 187368 187960 188645 189426 190246 191045 191806 192656 193756 195006 196002 196490 196686 196954 197270 197267 196759 196047 195739
57404 195739 196367 198040 200276 202239 203355 203701 203779 204020 204509 204964 204918 204242 203668 204403 206905 210257 213086
57387 213086 214885 216130 217419 219045 221238 224187 227642 230881 233312 234902 236022 237088 238355 239809
57373 239809 241201 242388 243603 245176 246986 248455 249090 248843 247948 246742 245686 245281 245724 246666 247431 247467
$$ packed form
57493A76147q00r94r46o59n86q96j193j185j072r30m14M95J121J019P52J124J972
57476A72955K341J730O26j65l28j26M5P5J47L01J86m51j175j207m12N16R54R75
57458A76987R10P90M94J36j23l85p74j102j008m09M02R66R78N62K84O16J306J607
57440A82237J139K76m43q35q88m84L40J094J210O29j62n75l42L53J004J197R55
57423A86705O63N92O85P81Q20P99P61Q50J100J250R96M88J96K68L16ln08p12l08
57404A95739O28J673K236J963J116L46P8K41M89M55m6o76n74P35K502L352K829
57387B13086J799J245J289J626K193K949L455L239K431J590J120J066J267J454
57373B39809J392J187J215J573J810J469O35k47q95j206j056m05M43R42P65L6
$$ plain form
57357 247467 246713 245626 244806 244514 244616 245008 245843 247233 248976 250803 252567 253924 254211 253182 251700 251127
57341 251127 252004 253757 255627 257367 258987 260376 261467 262364 263067 263307 262849 261772 260361 259002 258240 258543
57325 258543 259808 261343 262570 263495 264361 265148 265693 266084 266601 267340 268205 269247 270731 272721 274782 276282
57309 276282 277089 277786 279097 281162 283532 285744 287566 288714 288910 288515 288587 289740 291321 292259 292516 293000
57293 293000 294235 295910 297753 299982 302602 305002 306758 308261 310099 312232 314242 315990 317528 318756
57279 318756 319702 320924 323013 325782 328473 330752 333007 335637 338505 341241 343727 346061 348248 350097
57265 350097 351400 352189 352831 353799 355257 356988 358834 360961 363429 365764 367403 368533 370046 372494 375464
57250 375464 378201 380540 382912 385609 388435 391132 393771 396559 399417 402084 404597 407440 411079 415509
$$ packed form
57357B47467p54j087q20k92J02L92Q35J390J743J827J764J357K87j029j482n73
57341B51127Q77J753J870J740J620J389J091Q97P03K40m58j077j411j359p62L03
57325B58543J265J535J227R25Q66P87N45L91N17P39Q65J042J484J990K061J500
57309B76282Q07O97J311K065K370K212J822J148J96l95P2J153J581R38K57M84
57293B93000J235J675J843K229K620K400J756J503J838K133K010J748J538J228
57279C18756R46J222K089K769K691K279K255K630K868K736K486K334K187J849
57265C50097J303P89O42R68J458J731J846K127K468K335J639J130J513K448K970
57250C75464K737K339K372K697K826K697K639K788K858K667K513K843L639M430
$$ plain form
57236 415509 420356 425294 430178 434868 439184 443066 446666 450299 454373 459212 464689 470157 475056 479553
57222 479553 484244 489266 494184 498793 503497 508657 514103 519670 525772 532847 540513 547901 554675 561184
57208 561184 567622 573719 579383 585086 591310 597996 604817 611718 618893 626459 634400 642641 650955 659011
57194 659011 666722 674421 682472 690896 699588 708631 718036 727336 735971 744108 752649 762251 772656 783186
57180 783186 793553 803898 814235 824274 833806 843010 852314 862089 872448 883234 894133 904961
57168 904961 915861 927200 939340 952550 967003 982710 999518 1017339 1036285 1056396 1077355
57157 1077355 1098843 1121086 1144628 1169500 1195058 1220836 1247125 1274398 1302573 1331318 1360854
57146 1360854 1391847 1424527 1458423 1493056 1528453 1564768 1601841 1639464 1677920 1717927 1760078
$$ packed form
57236D15509M847M938M884M690M316L882L600L633M074M839N477N468M899M497
57222D79553M691N022M918M609M704N160N446N567O102P075P666P388O774O509
57208E61184O438O097N664N703O224O686O821O901P175P566P941Q241Q314Q056
57194F59011P711P699Q051Q424Q692R043R405R300Q635Q137Q541R602J0405J0530
57180G83186J0367J0345J0337J0039R532R204R304R775J0359J0786J0899J0828
57168I04961J0900J1339J2140J3210J4453J5707J6808J7821J8946K0111K0959
57157A077355K1488K2243K3542K4872K5558K5778K6289K7273K8175K8745K9536
57146A360854L0993L2680L3896L4633L5397L6315L7073L7623L8456M0007M2151
$$ plain form
57135 1760078 1804527 1851174 1899979 1951078 2004717 2061229 2121032 2184541 2251956 2323219 2398379
57124 2398379 2478008 2562977 2653664 2749714 2850934 2958229 3073211 3196990 3329911 3472554
57114 3472554 3626485 3793766 3976213 4175616 4394467 4636029 4903886 5201998 5535439
57105 5535439 5910948 6336964 6823736 7383764 8031913 8784935 9661146 10680789 11866202
57096 11866202 13240696 14826741 16645145 18715437 21055625 23680066 26596533 29803921
57088 29803921 33290003 37027939 40971808 45052187 49170942 53194793 56952869 60247821
57080 60247821 62884107 64703810 65613485 65592101 64682120 62972015 60577339 57625025 54243586
57071 54243586 50558972 46692724 42759142 38861166 35086684 31506102 28170936 25113460
$$ packed form
57135A760078M4449M6647M8805N1099N3639N6512N9803O3509O7415P1263P5160
57124B398379P9629Q4969R0687R6050J01220J07295J14982J23779J32921J42643
57114C472554J53931J67281J82447J99403K18851K41562K67857K98112L33441
57105E535439L75509M26016M86772N60028O48149P53022Q76211J019643J185413
57096A1866202J374494J586045J818404K070292K340188K624441K916467L207388
57088B9803921L486082L737936L943869M080379M118755M023851L758076L294952
57080F0247821K636286J819703R09675k1384r09981j710105k394676k952314l381439
57071E4243586l684614l866248l933582l897976l774482l580582l335166l057476
$$ plain form
57063 25113460 22348066 19874431 17681574 15751569 14062253 12589133 11307118 10192272
57055 10192272 9222933 8379730 7645146 7003521 6441342 5947106 5510869 5124250 4780684
57046 4780684 4475027 4202627 3959031 3740460 3544039 3367423 3208699 3066742 2941086
57037 2941086 2831132 2735996 2655437 2590465 2542523 2511903 2496203 2488872 2478753 2452867 2402228
57026 2402228 2326275 2231780 2127721 2021266 1917316 1819541 1730508 1651224 1581284 1519538 1464562
57015 1464562 1414884 1369325 1327203 1288230 1252299 1219417 1189537 1162169 1136180 1110266 1083845
57004 1083845 1057504 1032389 1009014 986794 964913 943406 923011 904073 886211 869189 853503
56993 853503 839724 827770 817295 808352 801113 795245 790291 786593 785183 786549 789794 792941 793728 790311
$$ packed form
57063B5113460k765394k473635k192857j930005j689316j473120j282015j114846
57055A0192272r69339q43203p34584o41625n62179m94236m36237l86619l43566
57046D780684l05657k72400k43596k18571j96421j76616j58724j41957j25656
57037B941086j09954r5136q0559o4972m7942l0620j5700p331j0119k5886n0639
57026B402228p5953r4495j04059j06455j03950r7775q9033p9284o9940o1746n4976
57015A464562m9678m5559m2122l8973l5931l2882k9880k7368k5989k5914k6421
57004A083845k6341k5115k3375k2220k1881k1507k0395j8938j7862j7022j5686
56993H53503j3779j1954j0475q943p239n868m954l698j410J366L245L147P87l417
$$ plain form
56979 790311 781877 768858 752387 733512 713135 692471 672993 655734 640893 628141 617089 607486
56967 607486 599314 592776 588030 585069 584096 585816 590922 599357 610372 623144 636764 649693 659767
56954 659767 664923 663781 655833 641801 623828 604590 585862 568142 551586 536651 523776 513138
56942 513138 505030 499867 497448 496829 497493 500249 506391 516240 529107 544487 562518 582938 603866
56929 603866 621868 633278 635625 628209 611833 588431 560911 532616 506041 481881 459667 439256
56917 439256 421212 405747 392136 379555 367981 357805 349019 341312 334680 329345 325159 321527 317917
56904 317917 314157 310353 306799 303905 301947 300897 300619 301112 302406 304458 307319 311200 316173 322102 329077
56889 329077 337605 348011 359876 372353 384681 395964 404741 409449 409405 405024 397229 387129 376089
$$ packed form
56979G90311q434j3019j6471j8875k0377k0664j9478j7259j4841j2752j1052r603
56967F07486q172o538m746k961r73J720N106Q435J1015J2772J3620J2929J0074
56954F59767N156j142p948j4032j7973j9238j8728j7720j6556j4935j2875j0638
56942E13138q108n163k419o19O64K756O142R849J2867J5380J8031K0420K0928
56929F03866J8002J1410K347p416j6376k3402k7520k8295k6575k4160k2214k0411
56917D39256j8044j5465j3611j2581j1574j0176q786p707o632n335m186l632l610
56904C17917l760l804l554k894j958j050k78M93J294K052K861L881M973N929O975
56889C29077Q528J0406J1865J2477J2328J1283Q777M708m4m381p795j0100j1040
$$ plain form
56876 376089 365487 356165 348400 342446 338678 337200 337773 340320 345152 352540 362346 374363 388842 406529
56862 406529 428236 454254 483723 514270 542375 564406 577591 580519 573404 558097 537466 514315
56850 514315 490722 468248 448391 432516 421459 415337 413733 416076 422060 431912 446217 465508
56838 465508 490144 520551 557167 599790 646924 695678 741911 780320 805143 812031 800090 772244
56826 772244 733552 689111 643056 598508 557608 521550 491006 466618 448826 437278 430892 428822
56814 428822 431238 438940 452396 471383 495357 523738 555668 589470 622220 649739 667489 672226
56802 672226 663250 642193 611828 575290 535959 497103 461102 429193 401958 379606 361729 347464
56790 347464 336371 328804 325101 324899 327751 333994 344321 358660 376035 395237 414834 432505 445196
$$ packed form
56876C76089j0602r322p765n954l768j478N73K547M832P388R806J2017J4479J7687
56862D06529K1707K6018K9469L0547K8105K2031J3185K928p115j5307k0631k3151
56850E14315k3593k2474j9857j5875j1057o122j604K343N984R852J4305J9291
56838D65508K4636L0407L6616M2623M7134M8754M6233L8409K4823O888j1941k7846
56826G72244l8692m4441m6055m4548m0900l6058l0544k4388j7792j1548o386k070
56814D28822K416P702J3456J8987K3974K8381L1930L3802L2750K7519J7750M737
56802F72226q976k1057l0365l6538l9331l8856l6001l1909k7235k2352j7877j4265
56790C47464j1093p567l703k02K852O243J0327J4339J7375J9202J9597J7671J2691
$$ plain form
56777 445196 450424 447280 436293 418921 397307 373860 350513 328443 308479 291273 276795 264196
56765 264196 252651 242143 233067 225349 218385 211743 205478 199804 194768 190298 186363 182994 180297 178337
56751 178337 176869 175319 173229 170701 168233 166210 164690 163567 162679 161824 160910 160104 159647 159568 159727 160011
56735 160011 160255 160107 159369 158445 158040 158319 158727 158754 158479 158147 157700 157060 156599 156804 157622 158546 159277 159904 160472
56716 160472 160897 161352 162297 163818 165252 165743 165063 163743 162559 162010 162128 162619 163274 164262 165778 167424 168345
56699 168345 168155 167370 166684 166202 165707 165309 165284 165491 165553 165489 165633 165913 165839 165284 164749 164624 164662 164395 163710 162782
56679 162782 161860 161354 161751 163031 164390 164880 164228 162861 161350 160035 158984 158072 157235 156767 157156 158456
56663 158456 160069 161321 161975 162077 161702 161168 161093 161793 162910 164023 165303 167112 169233 171107 172630 174074
$$ packed form
56777D45196N228l144j0987j7372k1614k3447k3347k2070j9964j7206j4478j2599
56765B64196j1545j0508r076p718o964o642o265n674n036m470l935l369k697j960
56751A78337j468j550k090k528k468k023j520j123q88q55r14q06m57p9J59K84
56735A60011K44j48p38r24m05K79M08K7k75l32m47o40m61K05Q18R24P31O27N68
56716A60472M25M55R45J521J434M91o80j320j184n49J18M91O55R88J516J646R21
56699A68345j90p85o86m82m95l98k5K07O2o4J44K80p4n55n35j25L8k67o85r28
56679A62782r22n06L97J280J359M90o52j367j511j315j051r12q37m68L89J300
56663A58456J613J252O54J02l75n34p5P00J117J113J280J809K121J874J523J444
$$ plain form
56647 174074 175315 175873 175823 176015 177103 178812 180395 181426 181892 181909 181696 181604 181860 182342 182747 182876 182722 182476
56629 182476 182476 182932 183607 184035 184079 183977 183803 183246 182103 180609 179058 177444 175754 174292 173299 172481 171400
56612 171400 170133 169115 168353 167353 165928 164570 163745 163217 162458 161504 160893 160849 160999 160976 160852 160759 160505 159978
56594 159978 159624 159978 160830 161449 161676 162131 163042 163514 162581 160676 159339 159540 160807 162047 162663 162660 162152 161251
56576 161251 160340 160057 160859 162604 164598 166123 166990 167547 168174 168922 169792 171169 173647 177373 181802 186219
56560 186219 190451 195067 200899 208271 216538 224428 230874 235516 238426 239724 239610 238497 236780 234557
56546 234557 231761 228426 224651 220572 216619 213453 211280 209482 207353 204976 202946 201484 200330 199288
56532 199288 198256 196919 195081 193184 191781 190630 189164 187827 187904 189709 191855 192797 192365 191321 190195
$$ packed form
56647A74074J241N58n0J92J088J709J583J031M66J7k13r2K56M82M05J29j54k46
56629A82476%M56O75M28M4j02j74n57j143j494j551j614j690j462r93q18j081
56612A71400j267j018p62j000j425j358q25n28p59r54o11m4J50k3j24r3k54n27
56594A59978l54L54Q52O19K27M55R11M72r33j905j337K01J267J240O16ln08r01
56576A61251r11k83Q02J745J994J525Q67N57O27P48Q70J377K478L726M429M417
56560A86219M232M616N832P372Q267P890O446M642K910J298j14j113j717k223
56546B34557k796l335l775m079l953l166k173j798k129k377k030j462j154j042
56532A99288j032j337j838j897j403j151j466j337P7J805K146R42m32j044j126
$$ plain form
56517 190195 189195 188588 188352 187886 186805 185691 185372 185765 186166 186423 186972 187720 187735 186362 184153 182410 182023
56500 182023 182885 184189 185214 185895 186675 187787 188899 189587 189827 189779 189428 188840 188449 188552 188660 187945 186305
56483 186305 184536 183423 183091 183243 183564 183741 183548 183116 182900 183223 183999 184895 185541 185701 185592 186051 187892 190903
56465 190903 193845 195687 196572 197320 198267 198985 199057 198743 198656 198943 198998 198110 196334 194522 193454 193098 192901 192580
56447 192580 192393 192661 193357 194203 194958 195493 195755 195760 195612 195482 195566 196013 196771 197583 198232 198733 199152 199363 199217 198916
56427 198916 198970 199671 200755 201694 202243 202637 203307 204433 205721 206575 206563 205835 205091 205078 206047 207665 209492 211463
56409 211463 213717 215954 217319 217212 216016 214737 214007 213823 214082 214822 215842 216630 216967 217265 218021 219213
56393 219213 220472 221504 222114 222102 221469 220605 219994 219862 220204 220870 221497 221730 221748 222251 223628 225477 227196 228688
$$ packed form
56517A90195j000o07k36m66j081j114l19L93M01K57N49P48J5j373k209j743l87
56500A82023Q62J304J025O81P80J112J112O88K40m8l51n88l91J03J08p15j640
56483A86305j769j113l32J52L21J77j93m32k16L23P76Q96O46J60j09M59J841L011
56465A90903K942J842Q85P48R47P18P2l14q7K87N5q88j776j812j068l56j97l21
56447A92580j87K68O96Q46P55N35K62Nj48j30Q4M47P58Q12O49N01M19K11j46l01
56427A98916N4P01J084R39N49L94O70J126J288Q54j2p28p44j3R69J618J827J971
56409B11463K254K237J365j07j196j279p30j84K59P40J020P88L37K98P56J192
56393B19213J259J032O10j2o33q64o11j32L42O66O27K33J8N03J377J849J719J492
$$ plain form
56375 228688 230123 231418 232427 233384 234646 236215 237898 239643 241225 241912 241107 239269 237627 236941 236958 237031
56359 237031 236871 236679 236895 237760 238890 239482 239320 239216 240002 241382 242449 243072 244032 245803 247977 249926 251312
56342 251312 251890 251587 251040 251367 253033 255401 257621 259481 261207 263075 265541 269108 273539 277578 280026
56327 280026 280949 281485 282658 284671 287168 289783 292437 295279 298320 301155 303192 304196 304402 304169 303792
56312 303792 303634 303993 304670 304993 304454 303189 301862 301323 302256 304678 307708 310300 312342 314658 317887 321841
56296 321841 326004 330051 333648 336396 338369 340214 342277 344101 345263 346318 348280 351412 355133 359028
56282 359028 363350 368417 373981 379490 384759 390111 395888 402021 408227 414558 421483 429309 437806 446702
56268 446702 456272 467015 478921 491615 505166 520143 536779 554719 573781 594383 616962 641500
$$ packed form
56375B28688J435J295J009R57J262J569J683J745J582O87q05j838j642o86J7P3
56359B37031j60j92K16Q65J130N92j62j04P86J380J067O23R60J771K174J949J386
56342B51312N78l03n47L27J666K368K220J860J726J868K466L567M431M039K448
56327B80026R23N36J173K013K497K615K654K842L041K835K037J004K06k33l77
56312C03792j58L59O77L23n39j265j327n39R33K422L030K592K042K316L229L954
56296C21841M163M047L597K748J973J845K063J824J162J055J962L132L721L895
56282C59028M322N067N564N509N269N352N777O133O206O331O925P826Q497Q896
56268D46702R570J0743J1906J2694J3551J4977J6636J7940J9062K0602K2579K4538
$$ plain form
56256 641500 668022 697088 729401 765296 805010 849199 898745 954209 1015708 1083056 1155754
56245 1155754 1233033 1314165 1398509 1485158 1572845 1660302 1746267 1828884 1905584 1973898 2032033
56234 2032033 2078389 2111098 2128673 2130821 2118209 2091747 2052630 2002751 1944415 1879589 1809752
56223 1809752 1736286 1660543 1583694 1506884 1431436 1358466 1288464 1221661 1158669 1100275 1046730
56212 1046730 997686 952763 911716 874081 839261 807079 777828 751567 727741 705735 685606
56201 685606 668013 653402 641366 630794 620723 611032 602261 594715 588027 581646 575494 569933 565329
56188 565329 561916 559823 558865 558421 557899 557255 556765 556388 555747 554766 553879 553466 553425 553579 554267 556138 559319 563093
56170 563093 566608 569780 573262 577620 582869 588793 595290 602192 609154 616166 623852 632792 642751 653107
$$ packed form
56256F41500K6522K9066L2313L5895L9714M4189M9546N5464O1499O7348P2698
56245A155754P7279Q1132Q4344Q6649Q7687Q7457Q5965Q2617P6700O8314N8135
56234B032033M6356L2709J7575K148j2612k6462l9117m9879n8336o4826o9837
56223A809752p3466p5743p6849p6810p5448p2970p0002o6803o2992n8394n3545
56212A046730m9044m4923m1047l7635l4820l2182k9251k6261k3826k2006k0129
56201F85606j7593j4611j2036j0572j0071r691q771p546o688o381o152n561m604
56188E65329l413k093r58m44n22o44m90l77o41r81q87m13m1J54O88J871L181L774
56170E63093L515L172L482M358N249N924O497O902O962P012P686Q940R959J0356
$$ plain form
56156 653107 663839 675520 688461 702569 718102 735864 756494 780123 806895 837285 871809
56145 871809 911105 956453 1009556 1071488 1142358 1221957 1309586 1402598 1495866 1583621 1661731
56134 1661731 1728190 1782533 1825894 1861285 1892657 1923077 1953571 1983022 2008656 2027201 2036677
56123 2036677 2037497 2031866 2022262 2010347 1996388 1978818 1954492 1919942 1872753 1812260 1739943 1659619
56111 1659619 1576446 1494858 1417476 1346062 1282656 1229002 1185279 1150151 1121839 1098781 1079828
56100 1079828 1064586 1053341 1046019 1041490 1038431 1036579 1036513 1038483 1042077 1046831 1052557 1059148 1066548 1074811
56086 1074811 1083829 1093102 1102030 1110236 1117539 1124110 1130824 1138780 1148085 1157668 1166722 1175740 1185735 1197118
56072 1197118 1209805 1223674 1238307 1252938 1267275 1281814 1296911 1312361 1328338 1345703 1364594
$$ packed form
56156F53107J0732J1681J2941J4108J5533J7762K0630K3629K6772L0390L4524
56145H71809L9296M5348N3103O1932P0870P9599Q7629R3012R3268Q7755P8110
56134A661731O6459N4343M3361L5391L1372L0420L0494K9451K5634J8545R476
56123B036677Q20n631r604j1915j3959j7570k4326l4550m7189o0493p2317q0324
56111A659619q3173q1588p7382p1414o3406n3654m3723l5128k8312k3058j8953
56100A079828j5242j1245p322m529l059j852o6J970L594M754N726O591P400Q263
56086A074811R018R273Q928Q206P303O571O714P956R305R583R054R018R995J1383
56072A197118J2687J3869J4633J4631J4337J4539J5097J5450J5977J7365J8891
$$ plain form
56061 1364594 1383795 1402461 1421541 1442395 1464873 1487903 1511170 1534964 1559050 1582993 1607086
56050 1607086 1631772 1656691 1681421 1706457 1732296 1758293 1783779 1809573 1836867 1865260 1893474
56039 1893474 1921532 1950566 1980806 2011406 2042049 2073271 2105506 2139336 2176362 2218202 2264730
56028 2264730 2314687 2367680 2424090 2483421 2544491 2607024 2671355 2736862 2802456 2868471 2936267
56017 2936267 3006120 3077393 3150693 3227883 3309890 3396278 3486988 3582697 3683426 3788694 3899012
56006 3899012 4015374 4137317 4263616 4394859 4533217 4679587 4833211 4994288 5164606
55997 5164606 5345201 5535651 5736165 5948186 6172471 6408803 6658193 6923357 7206619
55988 7206619 7509421 7834147 8184132 8561466 8967058 9403210 9873825 10381914 10929520
$$ packed form
56061A364594J9201J8666J9080K0854K2478K3030K3267K3794K4086K3943K4093
56050A607086K4686K4919K4730K5036K5839K5997K5486K5794K7294K8393K8214
56039A893474K8058K9034L0240L0600L0643L1222L2235L3830L7026M1840M6528
56028B264730M9957N2993N6410N9331O1070O2533O4331O5507O5594O6015O7796
56017B936267O9853P1273P3300P7190Q2007Q6388R0710R5709J00729J05268J10318
56006C899012J16362J21943J26299J31243J38358J46370J53624J61077J70318
55997E164606J80595J90450K00514K12021K24285K36332K49390K65164K83262
55988G206619L02802L24726L49985L77334M05592M36152M70615N08089N47606
$$ plain form
55979 10929520 11520571 12161369 12858059 13616356 14444120 15351643 16349548 17449642 18668194
55970 18668194 20025634 21543697 23247226 25169604 27353561 29848097 32710404 36012061
55962 36012061 39839342 44287833 49462331 55482540 62484144 70616715 80052021 91002353
55954 91002353 103733638 118570892 135905628 156191802 179886042 207284185 238215952
55947 238215952 271601444 305030908 334750766 356415122 366477557 363487976 348486061
55940 348486061 324326610 294516370 262282444 230148859 199863449 172459519 148379949
55933 148379949 127648867 110040972 95204404 82742710 72273690 63461167 56018577
55926 56018577 49703815 44318772 39705752 35735818 32300225 29310749 26698851 24408082
$$ packed form
55979A0929520N91051O40798O96690P58297Q27764R07523R97905J100094J218552
55970A8668194J357440J518063J703529J922378K183957K494536K862307L301657
55962C6012061L827281M448491N174498O020209P001604Q132571R435306J0950332
55954I1002353J2731285J4837254J7334736K0286174K3694240K7398143L0931767
55947B38215952L3385492L3429464K9719858K1664356J0062435k989581j5001915
55940C48486061k4159451k9810240l2233926l2133585l0285410k7403930k4079570
55933A48379949k0731082j7607895j4836568j2461694j0469020q812523p442590
55926E6018577o314762n385043m613020l969934l435593k989476k611898k290769
$$ plain form
55918 24408082 22388727 20599840 19010333 17594176 16326955 15188197 14162860 13238000
55910 13238000 12400637 11640132 10949239 10320895 9746528 9218838 8733331 8285719 7870475
55901 7870475 7483383 7122850 6787098 6472445 6175870 5897032 5636186 5392025 5163005
55892 5163005 4948867 4749416 4563446 4390165 4229850 4081599 3941825 3806446 3673582
55883 3673582 3543208 3415601 3291377 3171936 3058565 2951667 2851417 2758154 2671483 2590068
55873 2590068 2512885 2439640 2369426 2300315 2231164 2162778 2096572 2033136 1972790 1916462 1865030
55862 1865030 1818463 1776214 1737647 1701525 1665925 1629345 1591328 1551718 1510307 1467736 1425786
55851 1425786 1386070 1349006 1314333 1281713 1250335 1218959 1187159 1155906 1126407 1098942 1073227
$$ packed form
55918B4408082k019355j788887j589507j416157j267221j138758j025337r24860
55910A3238000q37363p60505o90893o28344n74367n27690m85507m47612m15244
55901G870475l87092l60533l35752l14653k96575k78838k60846k44161k29020
55892E163005k14138j99451j85970j73281j60315j48251j39774j35379j32864
55883C673582j30374j27607j24224j19441j13371j06898j00250r3263q6671q1415
55873B590068p7183p3245p0214o9111o9151o8386o6206o3436o0346n6328n1432
55862A865030m6567m2249l8567l6122l5600l6580l8017l9610m1411m2571m1950
55851A425786l9716l7064l4673l2620l1378l1376l1800l1253k9499k7465k5715
$$ plain form
55840 1073227 1049139 1026511 1004858 983879 963768 944671 926360 908733 892047 876394 861462
55829 861462 847085 833377 820196 807163 794409 782467 771159 759407 746509 732877 719183
55818 719183 705578 692153 679426 667781 656949 646458 636175 626154 616532 607779 600447 594336
55806 594336 588475 582181 575661 569520 564352 560897 559648 559948 560246 559646 558550 557531 556427 555036 553874
55791 553874 553605 554214 555300 556771 558867 561923 566478 573025 581110 588877 593754 593455 586604 573287 555352
55776 555352 535558 516004 497654 481268 467994 458779 453869 453023 455367 458719 459981 456975 449655
55763 449655 439376 427594 415471 403906 393373 384076 376435 370808 366643 362747 358666 354924 351559
55750 351559 347442 341708 334988 328428 322180 315638 308613 301422 294215 287024 280210 274233 269157 264831
$$ packed form
55840A073227k4088k2628k1653k0979k0111j9097j8311j7627j6686j5653j4932
55829H61462j4377j3708j3181j3033j2754j1942j1308j1752j2898j3632j3694
55818G19183j3605j3425j2727j1645j0832j0491j0283j0021r622q753p332o111
55806E94336n861o294o520o141n168l455j249L00K98o00j096j019j104j391j162
55791E53874k69O09J086J471K096L056M555O547Q085P767M877k99o851j3317j7935
55776E55352j9794j9554j8350j6386j3274r215m910q46K344L352J262l006p320
55763D49655j0279j1782j2123j1565j0533r297p641n627m165l896m081l742l365
55750C51559m117n734o720o560o248o542p025p191p207p191o814n977n076m326
$$ plain form
55736 264831 261231 258196 255170 251755 248197 244927 241973 239284 237211 236069 235427 234418 232597 230125
55722 230125 227222 223838 219883 215584 211619 208798 207316 206402 205157 203661 202736 202712 203182 203987 205516 207748
55706 207748 209886 211359 212414 213243 213244 211710 208580 204126 198606 192757 187783 184175 181128 177804 174529
55691 174529 172126 170712 169928 169765 170301 171107 171697 172232 173112 174219 175202 176069 176844 177121 176665 175979 175576 175175
55673 175175 174412 173794 174021 174801 175291 175387 175570 175761 175434 174748 174450 174643 174612 174068 173640 173894 174620 175387 176170
55654 176170 177128 178245 179377 180233 180232 178879 176437 173879 172058 171146 170802 170507 169853 168887 168125 167862 167601
55637 167601 166557 164567 162093 159539 157006 154580 152307 149983 147462 145048 143100 141382 139309 136733
55623 136733 134024 131463 129108 127154 125905 125359 125194 125119 124934 124413 123500 122416 121201 119480 117159 115019
$$ packed form
55736B64831l600l035l026l415l558l270k954k689k073j142o42j009j821k472
55722B30125k903l384l955m299l965k821j482r14j245j496r25k4M70Q05J529K232
55706B07748K138J473J055Q29Jj534l130m454n520n849m974l608l047l324l275
55691A74529k403j414p84j63N36Q06N90N35Q80J107R83Q67P75K77m56o86m03m01
55673A75175p63o18K27P80M90R6J83J91l27o86k98J93l1n44m28K54P26P67P83
55654A76170R58J117J132Q56jj353k442k558j821r12l44k95o54r66p62k63k61
55637A67601j044j990k474k554k533k426k273k324k521k414j948j718k073k576
55623A36733k709k561k355j954j249n46j65p5j85n21r13j084j215j721k321k140
$$ plain form
55607 115019 113927 113710 113396 112395 110836 108978 107002 105249 103980 102973 101956 101290 101503 102299 102757 102507
55591 102507 101990 101611 101336 101114 101009 100894 100648 100632 101297 102390 103251 103829 104608 105641 106511 107236 108256 109526
55573 109526 110646 112040 114877 119454 124652 129400 133660 137502 140280 141505 141644 141227 139799 136698 132310
55558 132310 127708 123359 119008 114536 110156 105924 101775 97978 94950 92661 90743 89124 88081 87667
55544 87667 87542 87397 87128 86617 85733 84732 84326 85079 86799 88631 89806 90293 90651 91270 91944 92343 92660 93349
55526 93349 94319 94882 94617 93830 92996 92197 91294 90290 89198 87889 86394 85123 84378 83787 82537 80249 77464
55509 77464 75236 74275 74437 75029 75554 76004 76358 76183 75075 73269 71409 69852 68659 68033 68140 68583 68760
55492 68760 68762 69271 70451 71609 72100 71906 71128 69647 67666 65903 64826 64212 63837 63944 64584 65072 64761 63930
$$ packed form
55607A15019j092k17l14j001j559j858j976j753j269j007j017o66K13P96M58k50
55591A02507n17l79k75k22j05j15k46j6O65J093Q61N78P79J033Q70P25J020J270
55573A09526J120J394K837M577N198M748M260L842K778J225J39m17j428l101m388
55558A32310m602m349m351m472m380m232m149l797l028k289j918j619j043m14
55544H7667j25j45k69n11q84j001m06P53J720J832J175M87L58O19O74L99L17O89
55526I3349R70N63k65p87q34p99r03j004j092j309j495j271p45n91j250k288k785
55509G7464k228r61J62N92N25M50L54j75j108j806j860j557j193o26J07M43J77
55492F8760KN09J180J158M91j94p78j481j981j763j077o14l75J07O40M88l11q31
$$ plain form
55474 63930 63380 63483 64131 65133 66064 66184 65197 63814 62872 62163 60890 59068 57653 57224 57382 57614 58051
55457 58051 58983 60157 61063 61695 62589 64107 65894 67103 67125 66098 64717 63587 62855 62402 62151 62071 62101 62264
55439 62264 62730 63584 64696 65893 67128 68302 69128 69362 69091 68646 68325 68301 68600 69068 69448 69546 69242 68426
55421 68426 67224 66154 65651 65444 64902 64013 63407 63277 62995 62164 61308 61022 61025 60694 60077 59648 59474 59352 59488
55402 59488 60270 61451 62316 62601 62621 62564 62299 61921 61784 61929 62021 61947 61902 61813 61321 60512 60051 60329 60987 61587 62201
55381 62201 62946 63366 62882 61676 60652 60509 61148 61968 62494 62647 62588 62414 62057 61514 61046 60994 61360 61744 61712
55362 61712 61131 60203 59302 58726 58371 57665 56153 54211 52898 52910 53873 54793 55063 54853 54635 54606 54622 54539 54428
55343 54428 54459 54635 54796 54883 55086 55674 56718 57995 59055 59452 59105 58501 58290 58606 59000 59120 59138 59289 59423
$$ packed form
55474F3930n50J03O48J002R31J20r87j383r42p09j273j822j415m29J58K32M37
55457E8051R32J174R06O32Q94J518J787J209K2j027j381j130p32m53k51q0L0J63
55439F2264M66Q54J112J197J235J174Q26K34k71m45l21k4K99M68L80R8l04q16
55421F8426j202j070n03k07n42q89o06j30k82q31q56k86Ll31o17m29j74j22J36
55402E9488P82J181Q65K85K0n7k65l78j37J45R2p4m5q9m92q09m61K78O58O00O14
55381F2201P45M20m84j206j024j43O39Q20N26J53n9j74l57n43m68n2L66L84l2
55362F1712n81r28r01n76l55p06j512j942j313J2R63R20K70k10k18k9J6q3j11
55343E4428L1J76J61Q7K03N88J044J277J060L97l47o04k11L16L94J20J8J51J34
$$ plain form
55324 59423 59374 59423 59903 60500 60576 60128 59813 59887 59690 58532 56709 55256 54882 55406 56106 56359 56024 55484 55304
55305 55304 55695 56256 56336 55663 54578 53717 53492 53843 54374 54736 54831 54728 54472 54088 53739 53671 53969 54477 55069 55883
55285 55883 57129 58651 59863 60301 60175 60165 60604 61120 61187 60797 60273 59658 58765 57804 57448 58020 58996 59566 59504
55266 59504 59218 59168 59497 60115 60898 61816 62944 64265 65468 66158 66333 66423 66731 67094 67225 67097 66866 66669 66642
55247 66642 66825 66891 66296 64905 63162 61524 60128 59210 59235 60170 61145 61334 60841 60229 59595 58699 57656 56819
55229 56819 56199 55613 55237 55380 55877 56296 56623 57139 57805 58374 58926 59627 60161 60186 60153 60736 61543 61411 60090
55210 60090 58615 57776 57263 56730 56629 57350 58368 59042 59613 60628 61889 62693 62775 62354 61625 60885 60829 61881
55192 61881 63349 63950 63198 61749 60405 59408 58784 58771 59495 60472 60819 60083 58817 58163 58687 59708 60092 59658
$$ packed form
55324E9423m9M9M80N97P6m48l15P4j97j158j823j453l74N24P00K53l35n40j80
55305E5304L91N61Q0o73j085q61k25L51N31L62R5j03k56l84l49o8K98N08N92Q14
55285E5883J246J522J212M38j26j0M39N16O7l90n24o15q93r61l56N72R76N70o2
55266E9504k86n0L29O18P83R18J128J321J203O90J75R0L08L63J31j28k31j97k7
55247F6642J83O6n95j391j743j638j396r18K5R35R75J89m93o12o34q96j043q37
55229E6819o20n86l76J43M97M19L27N16O66N69N52P01N34K5l3N83Q07j32j321
55210F0090j475q39n13n33j01P21J018O74N71J015J261Q04Q2m21p29p40n6J052
55192F1881J468O01p52j449j344r97o24j3P24R77L47p36j266o54N24J021L84m34
$$ plain form
55174 59658 59342 59877 60914 61676 61903 61643 60703 59053 57501 57147 58138 59514 60357 60604 60754 61258 62265
55157 62265 63545 64483 64519 63743 62839 62375 62397 62738 63309 63950 64277 64025 63510 63537 64688 66616 68108 68096 66730
55138 66730 65246 64627 64620 64356 63655 63240 63723 64822 65707 65815 65218 64453 64114 64500 65475 66679 67810 68606
55120 68606 68750 68042 66709 65348 64498 64323 64614 64982 65141 65190 65538 66388 67456 68356 69084 69851 70562 70838
55102 70838 70514 69806 68998 68257 67737 67504 67334 66935 66437 66380 67138 68582 70330 71945 72910 72904 72322 72085 72618
55083 72618 73358 73606 73503 73684 74199 74391 73843 72926 72276 72115 72351 72927 73755 74478 74709 74466 74084 73700 73109
55064 73109 72225 71401 71074 71273 71703 72219 72933 73849 74656 75057 75127 75169 75212 74827 73561 71523 69443 68014 67236
55045 67236 66599 65900 65604 66166 67306 68304 68869 69254 69568 69468 68692 67514 66507 66124 66606 67884 69325
$$ packed form
55174E9658l16N35J037P62K27k60r40j650j552l54R91J376Q43K47J50N04J007
55157F2265J280R38L6p76r04m64K2L41N71O41L27k52n15K7J151J928J492j2j366
55138F6730j484o19pk64p01m15M83J099Q85J08n97p65l39L86R75J204J131P96
55120F8606J44p08j333j361q50j75K91L68J59M9L48Q50J068R00P28P67P11K76
55102G0838l24p08q08p41n20k33j70l99m98n7P58J444J748J615R65on82k37N33
55083G2618P40K48j03J81N15J92n48r17o50j61K36N76Q28P23K31k43l82l84n91
55064G3109q84q24l27J99M30N16P14R16Q07M01P0M2M3l85j266k038k080j429p78
55045F7236o37o99k96N62J140R98N65L85L14j00p76j178j007l83M82J278J441
$$ plain form
55028 69325 70022 69628 68716 68027 67702 67497 67348 67287 67143 66845 66798 67390 68250 68537 67978 67103 66490 66211 66076 65894
55008 65894 65411 64437 63229 62368 62126 62272 62560 63023 63720 64623 65906 67864 70320 72563 74139 75323 76490
54991 76490 77443 77812 77798 77934 78280 78361 77952 77447 77355 77714 78150 78328 78241 78162 78386 78958 79629 80144 80508 80893 81382
54970 81382 81889 82260 82332 81963 81209 80435 80117 80426 81048 81396 81096 80369 79897 80140 80744 80855 80109 79045 78411
54951 78411 78323 78321 78050 77540 76997 76630 76643 77084 77743 78393 79051 79692 79830 78880 77053 75493 75270 76413 78086
54932 78086 79417 79968 79697 78892 78169 78173 79094 80493 81717 82502 83176 84264 85887 87600 88931 90004 91504
54915 91504 94006 97517 101691 106241 110992 115720 120143 123976 126845 128278 128017 126372 124014 121410 118535
54900 118535 115176 111374 107561 104276 101749 99657 97395 94687 91879 89510 87713 86281 85193 84760
$$ packed form
55028F9325O97l94r12o89l25k05j49o1j44k98m7N92Q60K87n59q75o13k79j35j82
55008F5894m83r74j208q61k42J46K88M63O97R03J283J958K456K243J576J184J167
54991G6490R53L69j4J36L46Q1m09n05r2L59M36J78q7p9K24N72O71N15L64L85M89
54970H1382N07L71P2l69p54p74l18L09O22L48l00p27m72K43O04J11p46j064o34
54951G8411q8kk71n10n43l67J3M41O59O50O58O41J38r50j827j560k23J143J673
54932G8086J331N51k71q05p23MR21J399J224P85O74J088J623J713J331J073J500
54915I1504K502L511M174M550M751M728M423L833K869J433k61j645k358k604k875
54900A18535l359l802l813l285k527k092k262k708k808k369j797j432j088m33
$$ plain form
54886 84760 85185 86244 87509 88653 89424 89605 89183 88407 87576 86964 87022 88202 90329 92503 94103 95675 98315
54869 98315 102345 107094 111892 116577 120915 124268 126230 127084 127126 125955 122988 118523 113730 109611 106331
54854 106331 103530 100867 98192 95557 93222 91502 90495 90036 89840 89523 88591 86760 84386 82328 81273
54839 81273 81237 81648 81753 81089 79874 78967 79113 80146 81134 81361 80907 80270 79792 79574 79582 79567 79151 78211 77051
54820 77051 76020 75202 74671 74722 75459 76333 76582 76108 75551 75444 75664 75881 76185 76979 78379 79983 81256 81975
54802 81975 82286 82452 82614 82736 82688 82422 82106 82089 82612 83547 84475 85079 85386 85577 85703 85724 85671 85536 85089 84132
54782 84132 82922 81974 81357 80597 79512 78798 79381 81364 83945 86236 87811 88646 89053 89684 91095 93088
54766 93088 94869 96078 97315 99303 101813 103912 105276 106793 109628 113878 118432 122137 124852 127232
$$ packed form
54886H4760M25J059J265J144P71J81m22p76q31o12N8J180K127K174J600J572K640
54869I8315M030M749M798M685M338L353J962Q54M2j171k967m465m793m119l280
54854A06331k801k663k675k635k335j720j007m59j96l17r32j831k374k058j055
54839H1273l6M11J05o64j215r07J46J033R88K27m54o37m78k18Qj5m16r40j160
54820G7051j031q18n31N1P37Q74K49m74n57j07K20K17L04P94J400J604J273P19
54802H1975L11J66J62J22m8k66l16j7N23R35R28O04L07J91J26K1n3j35m47r57
54782H4132j210r48o17p60j085p14N83J983K581K291J575Q35M07O31J411J993
54766I3088J781J209J237J988K510K099J364J517K835M250M554L705K715K380
$$ plain form
54752 127232 129646 131615 132345 131491 129228 125753 121186 115949 110907 106860 104019 102040 100452 98954 97519
54737 97519 96383 95850 95930 96211 96251 96037 95857 95720 95142 93669 91556 89682 88749 88674 88900 89223 90021 91697
54719 91697 94197 97271 100869 104884 108748 111888 114622 118002 122449 126979 130119 131269 130799 129203 126762
54704 126762 123864 120999 118265 115365 112224 109238 106746 104612 102541 100512 98702 97263 96365 96131 96232
54689 96232 95806 94224 91878 89845 88755 88295 87846 87257 86823 86743 86884 87029 87121 87204 87269 87271 87238 87181 86882 85953
54669 85953 84248 82148 80260 78903 78040 77616 77621 77820 77837 77722 78084 79354 81111 82483 83098 83285 83476 83803
54651 83803 84309 85107 86124 86933 87084 86565 85806 85289 85189 85259 85069 84424 83587 83043 82986 83188 83275 83047 82542 81988
54631 81988 81675 81712 81930 82177 82671 83789 85453 87016 87880 88003 87697 87170 86440 85464 84182 82570 80854
$$ packed form
54752A27232K414J969P30q54k263l475m567n237n042m047k841j979j588j498j435
54737I7519j136n33Q0K81M0k14j80j37n78j473k113j874r33p5K26L23P98J676
54719I1697K500L074L598M015L864L140K734L380M447M530L140J150m70j596k441
54704A26762k898k865k734k900l141k986k492k134k071k029j810j439q98k34J01
54689I6232m26j582k346k033j090m60m49n89m34q0J41J45R2Q3O5Kl3n7k99r29
54669H5953j705k100j888j357q63m24NJ99J7j15L62J270J757J372O15J87J91L27
54651H3803N06P98J017Q09J51n19p59n17j00P0j90o45q37n44n7K02Q7k28n05n54
54631H1988l13L7K18K47M94J118J664J563Q64J23l06n27p30r76j282j612j716
$$ plain form
54614 80854 79530 78937 78944 79241 79774 80624 81579 82213 82407 82509 82798 83051 82797 81905 80762 79942 79886 80838 82788
54595 82788 85249 87229 87773 86784 85175 84048 83726 83769 83718 83482 83005 82060 80692 79522 79219 79763 80535 81047
54577 81047 81297 81479 81708 82063 82590 83119 83400 83506 83836 84473 84835 84338 83262 82558 82760 83502 84239 85014 86114
54558 86114 87255 87697 87245 86596 86430 86576 86494 86285 86676 88007 89736 91059 91637 91557 91022 90356 90068 90539
54540 90539 91684 93106 94461 95536 96125 96104 95627 95129 95097 95833 97220 98637 99301 98912 97845 96680 95693
54523 95693 94910 94317 93767 92955 91812 90760 90246 90205 90352 90817 92006 93816 95458 96230 96137 95641 95131 94858
54505 94858 95134 96207 97869 99311 99553 98213 95931 93911 92873 92556 92338 92114 92252 92883 93649 94174 94418
54488 94418 94488 94423 94278 94190 94215 94280 94373 94598 95006 95557 96279 97269 98518 99942 101600 103598 105657 107035 107127
$$ packed form
54614H0854j324n93PK97N33Q50R55O34J94J02K89K53k54q92j143q20n6R52J950
54595H2788K461J980N44r89j609j127l22M3n1k36m77r45j368j170l03N44P72N12
54577H1047K50J82K29L55N27N29K81J06L30O37L62m97j076p04K02P42P37P75J100
54558H6114J141M42m52o49j66J46q2k09L91J331J729J323N78q0n35o66k88M71
54540I0539J145J422J355J075N89k1m77m98l2P36J387J417O64l89j067j165r87
54523I5693p83n93n50q12j143j052n14m1J47M65J189J810J642P72r3m96n10k73
54505I4858K76J073J662J442K42j340k282k020j038l17k18k24J38O31P66N25K44
54488I4418P0o5j45q8K5O5R3K25M08N51P22R90J249J424J658J998K059J378R2
$$ plain form
54469 107127 106083 104740 103944 103935 104299 104557 104791 105567 107123 108905 110161 110746 111014 111142 111045 110861 110930 111247
54451 111247 111444 111394 111381 111573 111756 111687 111244 110166 108277 106156 104919 104934 105257 104776 103464 102120 101343 101264
54433 101264 101829 102764 103520 103779 103824 103965 103957 103526 103126 103456 104322 104736 104184 103222 102716 102984 103800 104741 105355 105386
54413 105386 105018 104701 104669 104803 104896 104755 104193 103321 102721 102847 103317 103350 102928 102935 104007 105796 107520 108772 109559
54394 109559 110051 110614 111628 112973 113999 114317 114235 114164 114048 113725 113424 113400 113389 112998 112437 112266 112482 112462 111909
54375 111909 111385 111664 112878 114497 115970 117107 117916 118266 117888 116805 115618 115091 115313 115558 115177 114418 114060
54358 114060 114404 115004 115357 115500 115823 116583 117703 118847 119644 119957 119972 119887 119589 118862 117854 117073 116880 117293
54340 117293 118211 119531 120974 122229 123420 125060 127295 129542 131172 132221 133052 133609 133486 132577 131160
$$ packed form
54469A07127j044j343p96rL64K58K34P76J556J782J256N85K68J28r7j84O9L17
54451A11247J97n0j3J92J83o9m43j078j889k121j237J5L23m81j312j344p77p9
54433A01264N65R35P56K59M5J41qm31m00L30Q66M14n52r62n06K68Q16R41O14L1
54413A05386l68l17l2J34R3j41n62q72o00J26M70L3m22PJ072J789J724J252P87
54394A09559M92N63J014J345J026L18q2p1j16l23l01k4j1l91n61j71K16k0n53
54375A11909n24K79J214J619J473J137Q09L50l78j083j187n27K22K45l81p59l58
54358A14060L44O00L53J43L23P60J120J144P97L13J5q5k98p27j008p81j93M13
54340A17293R18J320J443J255J191J640K235K247J630J049Q31N57j23r09j417
$$ plain form
54325 131160 129446 127488 125472 123538 121369 118587 115701 113930 113701 113956 113436 112152 111008 110465 110395 110908
54309 110908 112269 113912 114560 113770 112613 112285 112667 112894 112779 112849 113196 113273 112912 112690 112936 113020 112169 110605
54291 110605 109308 108853 109033 109506 110208 110981 111385 111287 111252 111858 112776 113121 112721 112414 112822 113361 113041 111924 111094
54272 111094 111238 111893 112318 112488 112832 113415 113915 114242 114648 115205 115582 115493 115094 114815 114922 115438 116313 117491 118788
54253 118788 119889 120585 121039 121659 122669 123819 124599 124660 123971 122705 121188 119848 118924 118174 117105 115554
54237 115554 113859 112478 111676 111534 111923 112401 112494 112199 111840 111399 110468 109040 107752 106966 106137 104703 103182
54220 103182 102701 103580 105018 106090 106512 106516 106536 107015 107946 108629 108437 107820 107914 109089 110549 111515 112142 112957 114015
54201 114015 115050 115932 116502 116356 115320 113894 112747 111993 111347 110720 110149 109331 107820 105743 103855 102795
$$ packed form
54325A31160j714j958k016j934k169k782k886j771k29K55n20j284j144n43p0N13
54309A10908J361J643O48p90j157l28L82K27j15P0L47P7l61k22K46Q4q51j564
54291A10605j297m55J80M73P02P73M04r8l5O06R18L45m00l07M08N39l20j117q30
54272A11094J44O55M25J70L44N83N00L27M06N57L77q9l99k79J07N16Q75J178J297
54253A18788J101O96M54O20J010J150P80O1o89j266j517j340r24p50j069j551
54237A15554j695j381q02j42L89M78R3k95l59m41r31j428j288p86q29j434j521
54220A03182m81Q79J438J072M22MK0M79R31O83j92o17R4J175J460R66O27Q15J058
54201A14015J035Q82N70j46j036j426j147p54o46o27n71q18j511k077j888j060
$$ plain form
54185 102795 102602 103059 104094 105557 106835 107059 105856 103795 101977 101107 101042 101166 101036 100531 99746 99112 99436
54168 99436 101226 103847 105880 106549 106339 105990 105460 104401 103203 102799 103440 104314 104538 104124 103714 103705 103905 103973
54150 103973 103960 104302 105268 106533 107467 107850 108073 108572 109354 110222 111109 111888 112128 111516 110417 109634 109639 110288 111171
54131 111171 111896 112180 112086 112111 112620 113249 113322 112870 112644 112967 113238 112917 112465 112732 113733 114652 114952 114939 115165 115750
54111 115750 116446 116992 117180 116841 116019 115018 114108 113271 112467 111993 112252 113104 113784 113679 113050 112693 112939 113263
54093 113263 113009 112245 111704 111918 112662 113273 113337 112992 112673 112667 112905 113141 113310 113695 114643 116055 117278 117643 117158
54074 117158 116537 116455 116886 117323 117597 118178 119504 121213 122371 122460 121900 121488 121511 121606 121379 120952 120799 121165 121796
54055 121796 122335 122911 124158 126500 129563 132448 134542 135892 136891 137835 138839 139891 140900 141887 143228
$$ packed form
54185A02795j93M57J035J463J278K24j203k061j818q70o5J24j30n05p85o34L24
54168I9436J790K621K033O69k10l49n30j059j198m04O41Q74K24m14m10rK00O8
54150A03973j3L42R66J265R34L83K23M99P82Q68Q87P79K40o12j099p83NO49Q83
54131A11171P25K84r4K5N09O29P3m52k26L23K71l21m52K67J001R19L00j3K26N85
54111A15750O96N46J88l39q22j001r10q37q04m74K59Q52O80j05o29l57K46L24
54093A13263k54p64n41K14P44O11O4l45l19oK38K36J69L85R48J412J223L65m85
54074A17158o21q2M31M37K74N81J326J709J158Q9n60m12K3R5k27m27j53L66O31
54055A21796N39N76J247K342L063K885K094J350R99R44J004J052J009R87J341
$$ plain form
54040 143228 145472 148785 152737 156799 160896 165307 170157 175203 180077 184586 188780 192877 197111 201652
54026 201652 206671 212343 218580 224773 230068 234013 236703 238205 238125 235963 231709 225971 219669 213719 208664
54011 208664 204299 199789 194441 188302 181973 176091 171155 167413 164533 161658 158258 154806 152216 150772
53997 150772 150002 149398 148707 147624 145871 143714 141847 140553 139395 137929 136338 135118 134540 134631 135292 136135
53981 136135 136516 136143 135438 135005 134896 134724 134322 133894 133597 133329 133011 132748 132618 132458 131990 131106 129953 128841
53963 128841 128087 127890 128335 129488 131398 133865 136313 138058 138906 139422 140470 142412 144821 147031 148868
53948 148868 150630 152453 154053 155249 156441 158201 160515 162803 164697 166484 168727 171686 175215 178969
53934 178969 182594 185935 189161 192542 196002 199032 201191 202585 203859 205774 208723 212404 215919 218423
$$ packed form
54040A43228K244L313L952M062M097M411M850N046M874M509M194M097M234M541
54026B01652N019N672O237O193N295L945K690J502q0k162m254n738o302n950n055
54011B08664m365m510n348o139o329n882m936l742k880k875l400l452k590j444
53997A50772p70o04o91j083j753k157j867j294j158j466j591j220n78R1O61Q43
53981A36135L81l73p05m33j09j72m02m28k97k68l18k63j30j60m68q84j153j112
53963A28841p54j97M45J153J910K467K448J745Q48N16J048J942K409K210J837
53948A48868J762J823J600J196J192J760K314K288J894J787K243K959L529L754
53934A78969L625L341L226L381L460L030K159J394J274J915K949L681L515K504
$$ plain form
53920 218423 219818 220718 221798 223402 225808 229398 234285 239956 245556 250454 254441 257619 260347 263081
53906 263081 265865 267996 268498 267089 264490 261724 259252 256919 254580 252418 250587 248744 246288 243011
53892 243011 239241 235260 230958 226312 221851 218201 215290 212505 209613 207029 205109 203674 202471 201625
53878 201625 201402 201890 203248 205911 210191 215933 222971 231590 241944 252968 262340 267754 268126 263731
53864 263731 255594 244973 233141 221229 210011 199797 190626 182678 176384 171941 168787 165985 163231
53851 163231 161093 160047 159584 158642 156670 153964 151187 148948 147680 147430 147751 148099 148278 148258 147759 146500
53835 146500 144826 143648 143615 144630 146135 147508 148210 148026 147349 146889 146919 147142 147348 147768 148562 149409 149993 150605
53817 150605 151811 153651 155543 156967 157939 158851 160093 161860 164053 166250 167984 169206 170456 172474 175633
$$ packed form
53920B18423J395R00J080J604K406L590M887N671N600M898L987L178K728K734
53906B63081K784K131N02j409k599k766k472k333k339k162j831j843k456l277
53892B43011l770l981m302m646m461l650k911k785k892k584j920j435j203q46
53878B01625k23M88J358K663M280N742P038Q619J0354J1024R372N414L72m395
53864B63731q137j0621j1832j1912j1218j0214r171p948o294m443l154k802k754
53851A63231k138j046m63r42j972k706k777k239j268k50L21L48J79k0m99j259
53835A46500j674j178l3J015J505J373P02j84o77m60L0K23K06M20P94Q47N84O12
53817A50605J206J840J892J424R72R12J242J767K193K197J734J222J250K018L159
$$ plain form
53802 175633 179719 184198 188599 192679 196356 199647 202613 205121 206614 206489 204995 203548 203608 205198 206865
53787 206865 207239 206301 205041 204249 203945 203722 203274 202634 202079 201753 201265 199862 197227 193928 190836 188217 185641
53770 185641 182655 179226 175562 171859 168291 165035 162218 159954 158430 157719 157531 157330 156760 155802 154566
53755 154566 153181 151927 151160 150963 151010 150888 150445 149801 149241 149118 149660 150775 152236 154053 156324 158665 160244
53738 160244 160659 160350 159869 159186 158253 157765 158520 160132 161247 161228 160865 161104 161794 162259 162541 163384 165216 167758
53720 167758 170524 173187 175495 177347 179028 180992 183298 185590 187591 189322 190829 192015 192762 192950 192517
53705 192517 191924 192415 195204 200197 206059 211699 217126 222597 227618 231445 234146 236481 238819 240809 242137
53690 242137 243041 243864 244509 244672 244421 244229 244390 244561 244098 242851 241391 240245 239149 237506 235465 233934
$$ packed form
53802A75633M086M479M401M080L677L291K966K508J493j25j494j447O0J590J667
53787B06865L74r38j260p92l04k23m48o40n55l26m88j403k635l299l092k619k576
53770A85641k986l429l664l703l568l256k817k264j524p11j88k01n70r58j236
53755A54566j385j254p67j97M7j22m43o44n60j23N42J115J461J817K271K341J579
53738A60244M15l09m81o83r33m88P55J612J115j9l63K39O90M65K82Q43J832K542
53720A67758K766K663K308J852J681J964K306K292K001J731J507J186P47J88m33
53705A92517n93M91K789M993N862N640N427N471N021L827K701K335K338J990J328
53690B42137R04Q23O45J63k51j92J61J71m63j247j460j146j096j643k041j531
$$ plain form
53674 233934 233339 233071 232543 232195 232724 233682 233692 232059 229533 227414 226469 226750 227852 229043 229626 229501 229150
53657 229150 228893 228503 227716 226791 226315 226664 227827 229471 230974 231637 231253 230414 230053 230669 232016 233393 234237
53640 234237 234625 235297 236952 239430 241798 243346 244285 245310 246780 248488 249990 250947 251332 251629 252660 254934
53624 254934 258108 261263 263730 265590 267488 270010 273168 276433 279407 282396 286089 290668 295557 300150
53610 300150 304381 308384 312040 315264 318404 321864 325468 328678 331321 333687 335954 337977 339628 340878
53596 340878 341508 341236 340340 339743 340146 341314 342442 342987 342854 342041 340594 338878 337515 336847 336691 336805 337331
53579 337331 338472 339793 340262 339301 337549 336201 335556 334624 332348 328966 325813 323866 322811 321558 319428
53564 319428 316733 314318 312753 311997 311780 312091 313090 314622 316108 317067 317520 317733 317789 317692 317708 318256 319516 321367
$$ packed form
53674B33934n95k68n28l48N29R58J0j633k526k119r45K81J102J191N83j25l51
53657B29150k57l90p87r25m76L49J163J644J503O63l84q39l61O16J347J377Q44
53640B34237L88O72J655K478K368J548R39J025J470J708J502R57L85K97J031K274
53624B54934L174L155K467J860J898K522L158L265K974K989L693M579M889M593
53610C00150M231M003L656L224L140L460L604L210K643K366K267K023J651J250
53596C40878O30k72q96n97M03J168J128N45j33q13j447j716j363o68j56J14N26
53579C37331J141J321M69r61j752j348o45r32k276l382l153j947j055j253k130
53564C19428k695k415j565p56k17L11R99J532J486R59M53K13N6r7J6N48J260J851
$$ plain form
53546 321367 323745 326780 330561 334984 339826 344807 349604 354043 358333 362952 368263 374407 381451 389434
53532 389434 398244 407766 418155 429702 442323 455448 468550 481622 495024 509076 523844 539127
53520 539127 554513 569695 584920 600970 618567 637947 659037 681766 705936 731021 756460
53509 756460 782111 808198 834825 861688 888204 913773 938095 961506 984942 1009168 1033885
53498 1033885 1057843 1080005 1100520 1120405 1140421 1160497 1180241 1199705 1219395 1239510 1259501
53487 1259501 1278535 1296366 1313530 1330698 1348047 1365339 1382367 1399023 1414998 1429629 1442153
53476 1442153 1452024 1459034 1463282 1465091 1464906 1463120 1459890 1454986 1447741 1437367 1423608 1407272 1389986
53463 1389986 1373175 1357145 1341174 1324477 1306961 1288969 1270463 1250792 1229399 1206550 1183202
$$ packed form
53546C21367K378L035L781M423M842M981M797M439M290M619N311O144P044P983
53532C89434Q810R522J0389J1547J2621J3125J3102J3072J3402J4052J4768J5283
53520E39127J5386J5182J5225J6050J7597J9380K1090K2729K4170K5085K5439
53509G56460K5651K6087K6627K6863K6516K5569K4322K3411K3436K4226K4717
53498A033885K3958K2162K0515J9885K0016K0076J9744J9464J9690K0115J9991
53487A259501J9034J7831J7164J7168J7349J7292J7028J6656J5975J4631J2524
53476A442153R871P010M248J809j85j786l230m904p245j0374j3759j6336j7286
53463A389986j6811j6030j5971j6697j7516j7992j8506j9671k1393k2849k3348
$$ plain form
53452 1183202 1160267 1138200 1117118 1096921 1077220 1057534 1037849 1018886 1001564 986228 972539
53441 972539 960100 949071 940120 933746 929613 926590 923625 920732 919001 919527 922355 926551 931221 936340
53427 936340 942648 950868 961092 972880 985896 1000357 1016754 1035215 1055304 1076462 1098415 1121143
53415 1121143 1144747 1169581 1196308 1225442 1256854 1289930 1324250 1359956 1397487 1437130 1478881
53404 1478881 1522629 1568373 1616245 1666268 1718104 1771266 1825668 1881742 1939743 1999089 2058661
53393 2058661 2117720 2176240 2234428 2292288 2349724 2406556 2462152 2515319 2565023 2611204 2654619
53382 2654619 2695784 2734232 2768882 2798998 2824631 2846148 2863506 2876199 2883923 2887027 2886019 2880614
53370 2880614 2869505 2851196 2825011 2791246 2750622 2703863 2651908 2596192 2538389 2479696 2420483
$$ packed form
53452A183202k2935k2067k1082k0197j9701j9686j9685j8963j7322j5336j3689
53441I72539j2439j1029q951o374m133l023k965k893j731N26K828M196M670N119
53427I36340O308Q220J0224J1788J3016J4461J6397J8461K0089K1158K1953K2728
53415A121143K3604K4834K6727K9134L1412L3076L4320L5706L7531L9643M1751
53404A478881M3748M5744M7872N0023N1836N3162N4402N6074N8001N9346N9572
53393B058661N9059N8520N8188N7860N7436N6832N5596N3167M9704M6181M3415
53382B654619M1165L8448L4650L0116K5633K1517J7358J2693P724L104j008n405
53370B880614j1109j8309k6185l3765m0624m6759n1955n5716n7803n8693n9213
$$ plain form
53359 2420483 2360788 2301011 2241951 2184269 2128255 2074144 2022250 1972614 1924851 1878578 1833661
53348 1833661 1789705 1745725 1700907 1655584 1610897 1567592 1525775 1485806 1448604 1414651 1383262
53337 1383262 1353387 1324866 1298476 1274947 1254312 1236095 1219790 1205156 1192142 1180377 1168755
53326 1168755 1155993 1141864 1127507 1114156 1101947 1090398 1079608 1070241 1062539 1056069 1050528 1046072
53314 1046072 1042735 1040172 1038310 1037761 1039222 1042785 1048168 1055282 1064185 1074664 1086323 1099112 1113591
53301 1113591 1130563 1150422 1172677 1196120 1219737 1243670 1269109 1297064 1327377 1358993 1390845
53290 1390845 1422138 1452062 1479799 1504980 1527869 1548957 1568451 1586197 1601874 1615105 1625459
53279 1625459 1632493 1635909 1635681 1632067 1625517 1616585 1605816 1593479 1579245 1562322 1542156 1519072 1494047
$$ packed form
53359B420483n9695n9777n9060n7682n6014n4111n1894m9636m7763m6273m4917
53348A833661m3956m3980m4818m5323m4687m3305m1817l9969l7202l3953l1389
53337A383262k9875k8521k6390k3529k0635j8217j6305j4634j3014j1765j1622
53326A168755j2762j4129j4357j3351j2209j1549j0790r367p702o470n541m456
53314A046072l337k563j862n49J461L563N383P114Q903J0479J1659J2789J4479
53301A113591J6972J9859K2255K3443K3617K3933K5439K7955L0313L1616L1852
53290A390845L1293K9924K7737K5181K2889K1088J9494J7746J5677J3231J0354
53279A625459P034L416k28l614o550q932j0769j2337j4234j6923k0166k3084k5025
$$ plain form
53266 1494047 1467883 1440792 1412741 1383879 1354512 1324900 1295250 1265622 1235741 1205179 1173926
53255 1173926 1142600 1111869 1081900 1052600 1024101 996604 969896 943505 917318 891663 866686
53244 866686 842006 817123 791991 767098 743202 721032 700926 682563 665232 648558 632891
53233 632891 618868 606723 596177 586818 578351 570504 562908 555183 547018 538103 528098 516853 504658
53220 504658 492075 479403 466421 452910 439324 426568 415064 404393 394078 384335 375655 367982
53208 367982 360841 354200 348532 343859 339326 334021 327872 321390 314876 308289 301690 295332 289327 283532
53194 283532 277785 272027 266227 260425 254887 250025 246153 243413 241797 241000 240397 239481 238331 237336 236493
53179 236493 235346 233710 232014 230737 229859 229136 228556 228107 227364 225903 224045 222638 221995 221547 220761 219908
$$ packed form
53266A494047k6164k7091k8051k8862k9367k9612k9650k9628k9881l0562l1253
53255A173926l1326l0731k9969k9300k8499k7497k6708k6391k6187k5655k4977
53244H66686k4680k4883k5132k4893k3896k2170k0106j8363j7331j6674j5667
53233F32891j4023j2145j0546r359q467p847p596p725q165q915j0005j1245j2195
53220E04658j2583j2672j2982j3511j3586j2756j1504j0671j0315r743q680p673
53208C67982p141o641n668m673m533n305o149o482o514o587o599o358o005n795
53194B83532n747n758n800n802n538m862l872k740j616p97o03r16j150r95q43
53179B36493j147j636j696j277q78p23n80m49p43j461j858j407o43m48p86q53
$$ plain form
53163 219908 219496 219346 218816 217792 216820 216158 215297 213753 211938 210776 210610 210875 210823 210192 209124 207764 206193
53146 206193 204595 203260 202357 201755 201160 200489 200119 200564 201748 202774 202730 201725 200818 200840 201577 202213 202259 201739
53128 201739 200785 199524 198363 197928 198497 199681 200830 201597 201999 202067 201722 200969 200036 199197 198556 198047 197616 197221
53110 197221 196661 195552 193716 191584 190017 189578 190073 190917 191795 192747 193737 194459 194659 194379 193730 192618 190878
53093 190878 188536 185821 183050 180647 179119 178759 179406 180668 182271 184047 185765 187273 188780 190588 192506
53078 192506 193903 194481 194663 194960 195253 195026 194075 192649 191031 189399 188011 187125 186625 186078 185283 184567 184423
53061 184423 185084 186444 188145 189652 190529 190814 190899 190986 190895 190567 190380 190694 191380 192088 192778 193553 194153 194049 193090
53042 193090 191638 190008 188137 185981 183870 182158 180683 178903 176633 174461 173274 173395 174254 174952 175081
$$ packed form
53163B19908m12j50n30j024r72o62q61j544j815j162j66K65n2o31j068j360j571
53146B06193j598j335r03o02n95o71l70M45J184J026m4j005r07K2P37O36M6n20
53128B01739r54j261j161m35N69J184J149P67M02O8l45p53r33q39o41n09m31l95
53110A97221n60j109j836k132j567m39M95Q44Q78R52R90P22K00k80o49j112j740
53093A90878k342k715k771k403j528l60O47J262J603J776J718J508J507J808J918
53078A92506J397N78J82K97K93k27r51j426j618j632j388q86n00n47p95p16j44
53061A84423O61J360J701J507Q77K85Q5Q7r1l28j87L14O86P08O90P75O00j04r59
53042A93090j452j630j871k156k111j712j475j780k270k172j187J21Q59O98J29
$$ plain form
53027 175081 174905 174781 174652 174233 173523 172934 172962 173838 175383 177050 178231 178717 178832 178975 179157 179150 178960 178864 179057
53008 179057 179496 180022 180388 180230 179408 178373 177875 178223 179084 180015 180873 181658 182252 182466 182175 181402 180520 180313
52990 180313 181352 183169 184430 184163 182569 180628 179288 179117 180134 181614 182492 182368 181877 181771 182106 182639
52974 182639 183519 184891 186201 186688 186553 186873 188276 190265 192005 193265 194342 195499 196809 198234 199584
52959 199584 200521 200828 200592 200101 199635 199344 199101 198503 197274 195660 194196 193076 192067 191033 190170 189559 188867
52942 188867 187690 186009 184153 182501 181323 180637 180134 179524 179092 179553 181087 182819 183578 183015 181677 180258
52926 180258 179177 178730 179098 180069 181122 181912 182461 182740 182458 181558 180678 180666 181585 182510 182475 181371 179770 178148
52908 178148 176661 175503 174934 174802 174472 173526 172288 171369 170926 170657 170284 169661 168643 167360 166506 166816 168156
$$ packed form
53027A75081j76j24j29m19p10n89K8Q76J545J667J181M86J15J43J82pj90r6J93
53008A79057M39N26L66j58q22j035m98L48Q61R31Q58P85N94K14k91p73q82k07
52990A80313J039J817J261k67j594j941j340j71J017J480Q78j24m91j06L35N33
52974A82639Q80J372J310M87j35L20J403J989J740J260J077J157J310J425J350
52959A99584R37L07k36m91m66k91k43n98j229j614j464j120j009j034q63o11o92
52942A88867j177j681j856j652j178o86n03o10m32M61J534J732P59n63j338j419
52926A80258j081m47L68R71J053P90N49K79k82r00q80j2R19R25l5j104j601j622
52908A78148j487j158n69j32l30r46j238r19m43k69l73o23j018j283q54L10J340
$$ plain form
52891 168156 169567 170310 170479 170577 170924 171616 172589 173456 173638 172937 171740 170586 169824 169733 170431 171497 172263 172737
52873 172737 173676 175361 177005 177977 178993 181199 184393 187123 188458 188763 188645 188098 187074 186116 185848 186163
52857 186163 186405 186117 185340 184423 183755 183481 183222 182298 180444 178134 176061 174533 173465 172679 172001 171311 170693
52840 170693 170323 170077 169529 168559 167612 167047 166570 165704 164593 163837 163676 163794 163930 164199 164734 165385 165913 166199
52822 166199 166197 165980 165880 166278 167041 167482 167068 165996 164908 164202 163828 163577 163338 163168 163307 164048 165399 166973
52804 166973 168402 169726 171090 172192 172447 171760 170752 169998 169375 168473 167383 166657 166552 166722 166698 166293 165433
52787 165433 164002 162172 160622 160031 160415 161188 161788 162033 161986 161849 161951 162482 163121 163274 162817 162300 162208 162285 161896
52768 161896 160900 159814 159185 159044 159065 158979 158734 158380 157968 157598 157486 157843 158606 159377 159877 160403 161488 163005
$$ packed form
52891A68156J411P43J69R8L47O92R73Q67J82p01j197j154p62r1O98J066P66M74
52873A72737R39J685J644R72J016K206L194K730J335L05j18n47j024r58k68L15
52857A86163K42k88p77r17o68k74k59r24j854k310k073j528j068p86o78o90o18
52840A70693l70k46n48r70r47n65m77q66j111p56j61J18J36K69N35O51N28K86
52822A66199kk17j00L98P63M41m14j072j088p06l74k51k39j70J39P41J351J574
52804A66973J429J324J364J102K55o87j008p54o23r02j090p26j05J70k4m05q60
52787A65433j431j830j550n91L84P73O00K45m7j37J02N31O39J53m57n17r2P7l89
52768A61896r96j086o29j41K1q6k45l54m12l70j12L57P63P71N00N26J085J517
$$ plain form
52750 163005 164012 163831 162962 162514 162955 163881 164894 166065 167425 168596 169249 169573 170008 170742 171724 172887 174123
52733 174123 175259 176306 177502 178880 180075 180800 181303 182008 182930 183747 184309 184661 184714 184289 183410 182217 180686
52716 180686 178831 177083 175972 175461 174986 174212 173313 172518 171877 171549 171815 172554 173161 173180 172709 171996 171107 170186
52698 170186 169594 169507 169732 170193 171111 172387 173304 173332 172854 172607 172836 173448 174526 175948 176893 176673 175949 176197
52680 176197 177851 179761 180664 180402 179474 178144 176535 175007 173858 172985 172316 172261 173242 174917 176282 176539
52664 176539 175664 174271 173173 172925 173494 174341 174898 174931 174523 173991 173900 174811 176748 179073 181044 182265 182616
52647 182616 182118 181086 180053 179254 178424 177288 175997 174843 173920 173317 173258 173654 173872 173399 172565 172177 172670
52630 172670 173970 175885 178151 180289 181986 183490 185081 186358 186681 186242 185947 186169 186347 186085 185925 186514
$$ packed form
52750A63005J007j81q69m48M41R26J013J171J360J171O53L24M35P34R82J163J236
52733A74123J136J047J196J378J195P25N03P05R22Q17N62L52N3m25q79j193j531
52716A80686j855j748j111n11m75p74q99p95o41l28K66P39O07J9m71p13q89r21
52698A70186n92q7K25M61R18J276R17K8m78k47K29O12J078J422R45k20p24K48
52680A76197J654J910R03k62r28j330j609j528j149q73o69n5R81J675J365K57
52664A76539q75j393j098k48N69Q47N57L3m08n32r1R11J937K325J971J221L51
52647A82616m98j032j033p99q30j136j291j154r23o03n9L96K18m73q34l88M93
52630A72670J300J915K266K138J697J504J591J277L23m39k95K22J78k62j60N89
$$ plain form
52614 186514 187505 187886 187242 186271 186033 186948 188429 189376 189154 188213 187639 188040 189101 190264 191420 192685 193832
52597 193832 194439 194460 194236 193921 193305 192319 191395 191120 191648 192693 193955 195276 196412 197000 197015 197057 197837 199374
52579 199374 200980 202050 202547 202672 202490 202129 201965 202196 202457 202201 201339 200158 198865 197602 196705 196367 196153
52562 196153 195393 194099 192978 192497 192425 192384 192315 192238 192056 191796 191585 191214 190272 188969 188238 188589 189325 189425 188851
52543 188851 188402 188548 188984 189279 189420 189625 189970 190309 190426 190229 189883 189659 189605 189620 189937 191159 193464 196071
52525 196071 197869 198424 198111 197501 196960 196668 196569 196369 195821 194967 193968 193021 192646 193518 195556 197612 198731 199419
52507 199419 200925 203495 206216 208445 210453 212483 214119 215008 215393 215431 214633 212584 209747 206968 204574
52492 204574 202466 200763 199677 198984 198259 197567 197322 197467 197325 196458 195266 194557 194745 195604 196629 197447 197950
$$ packed form
52614A86514R91L81o44r71k38R15J481R47k22r41n74M01J061J163J156J265J147
52597A93832O07K1k24l15o16r86r24k75N28J045J262J321J136N88J5M2P80J537
52579A99374J606J070M97J25j82l61j64K31K61k56q62j181j293j263q97l38k14
52562A96153p60j294j121m81p2m1o9p7j82k60k11l71r42j303p31L51P36J00n74
52543A88851m49J46M36K95J41K05L45L39J17j97l46k24n4J5L17J222K305K607
52525A96071J798N55l13o10n41k92r9k00n48q54r99r47l75Q72K038K056J119O88
52507A99419J506K570K721K229K008K030J636Q89L85L8p98k049k837k779k394
52492B04574k108j703j086o93p25o92k45J45j42q67j192p09J88Q59J025Q18N03
$$ plain form
52475 197950 198110 197781 196893 195857 195464 196128 197408 198610 199639 200893 202450 203920 205174 206733 209189
52460 209189 212493 216072 219466 222548 225220 227100 227651 226680 224756 222950 221863 220940 219059 215876 212227
52445 212227 209098 206638 204511 202786 201884 201774 201869 201797 201717 201653 201096 199716 198125 197309 197418 197680 197547 197391
52427 197391 197814 198762 199708 200450 201284 202473 203927 205429 206816 207885 208455 208692 209151 210320 212254 214785
52411 214785 217901 221672 226017 230843 236424 243271 251452 260218 268414 275078 279528 281143 279550 275135
52397 275135 269100 262754 256844 251575 247062 243451 240707 238564 236760 235206 233931 233014 232597 232741 233225
52382 233225 233643 233792 233862 234271 235426 237538 240331 242952 244629 245658 247339 250606 255074 259776 264421
52367 264421 269292 274181 278303 281399 284152 287130 289906 291703 292497 292911 293267 293344 293060 292835 293145 294057
$$ packed form
52475A97950J60l29q88j036l93O64J280J202J029J254J557J470J254J559K456
52460B09189L304L579L394L082K672J880N51r71j924j806j087r23j881l183l649
52445B12227l129k460k127j725r02j10R5p2q0o4n57j380j591q16J09K62j33j56
52427A97391M23R48R46P42Q34J189J454J502J387J069N70K37M59J169J934K531
52411B14785L116L771M345M826N581O847Q181Q766Q196O664M450J615j593m415
52397B75135o035o346n910n269m513l611k744k143j804j554j275r17m17J44M84
52382B33225M18J49P0M09J155K112K793K621J677J029J681L267M468M702M645
52367B64421M871M889M122L096K753K978K776J797P94M14L56P7k84k25L10R12
$$ plain form
52351 294057 295410 297197 299487 302127 304781 307338 310140 313698 318186 323297 328613 334027 339730 345900
52337 345900 352627 360139 368878 379174 390912 403610 416801 430316 444307 459060 474781 491526
52325 491526 509335 528318 548463 569402 590589 611742 632905 654054 674800 694540 712698
52314 712698 728859 742942 755403 766988 778065 788324 797282 804859 811323 816910 821718 825759 828876
52301 828876 830774 831402 831107 830210 828629 826286 823616 821145 818659 815315 810666 805102 799171 792962 786447
52286 786447 780046 774484 770226 767378 766028 766394 768683 773004 779409 787855 798051 809522 821906 835158
52272 835158 849388 864493 880008 895390 910449 925401 940427 955218 968958 980699 989817 996457
52260 996457 1001607 1006386 1010849 1013790 1014184 1012711 1011314 1011187 1011646 1011091 1008608 1004503 999818 995691 992717
$$ packed form
52351B94057J353J787K290K640K654K557K802L558M488N111N316N414N703O170
52337C45900O727P512Q739J0296J1738J2698J3191J3515J3991J4753J5721J6745
52325D91526J7809J8983K0145K0939K1187K1153K1163K1149K0746J9740J8158
52314G12698J6161J4083J2461J1585J1077J0259Q958P577O464N587M808M041L117
52301H28876J898O28k95q97j581k343k670k471k486l344m649n564n931o209o515
52286G86447o401n562m258k848j350L66K289M321O405Q446J0196J1471J2384J3252
52272H35158J4230J5105J5515J5382J5059J4952J5026J4791J3740J1741R118O640
52260I96457N150M779M463K941L94j473j397j27M59n55k483m105m685m127k974
$$ plain form
52245 992717 990340 986921 980866 971836 960813 949184 937935 927468 917768 908711 900296 892605 885549
52232 885549 879011 873368 869468 867738 867554 867887 868292 868811 869269 869408 869704 871202 874288 878173 881946 885643
52216 885643 889909 895081 901083 907830 915074 922007 927688 932000 935769 939813 944282 949003 953921 958848
52202 958848 963137 966196 968292 970423 973330 976911 980629 984093 987071 989386 991219 993242 995880 998485
52188 998485 999791 999346 998076 997200 997004 996965 996672 996072 995055 993330 990745 987363 983206 978269 972743 966891
52172 966891 960773 954463 948464 943382 939182 935338 931894 929692 929132 929252 928641 927044 925545 925353 926826
52157 926826 929536 932765 935885 938722 941619 944888 948181 950668 951828 951794 951020 949955 949070 948818 949448 951023
52141 951023 953653 957370 961810 966405 971021 976124 982172 989109 996560 1004280 1012320 1021094 1031423 1044196
$$ packed form
52245I92717k377l419o055r030j1023j1629j1249j0467r700r057q415p691p056
52232H85549o538n643l900j730j84L33M05N19M58J39K96J498L086L885L773L697
52216H85643M266N172O002O747P244O933N681M312L769M044M469M721M918M927
52202I58848M289L059K096K131K907L581L718L464K978K315J833K023K638K605
52188I98485J306m45j270q76j96l9k93o00j017j725k585l382m157m937n526n852
52172I66891o118o310n999n082m200l844l444k202n60J20o11j597j499j92J473
52157I26826K710L229L120K837K897L269L293K487J160l4p74j065q85k52O30J575
52141I51023K630L717M440M595M616N103O048O937P451P720Q040Q774J0329J2773
$$ plain form
52127 1044196 1059703 1077467 1096889 1117808 1140324 1164416 1189985 1216939 1244847 1272813 1300089
52116 1300089 1326584 1352318 1376553 1398086 1416431 1432092 1445510 1456250 1463552 1467320 1468099 1466242
52104 1466242 1461536 1453695 1442960 1430141 1416220 1402022 1388122 1374859 1362361 1350641 1339849 1330442
52092 1330442 1322912 1317196 1312556 1308201 1303934 1299895 1295856 1291248 1286027 1281043 1277294 1275128 1274506 1275723
52078 1275723 1279369 1285612 1294019 1304171 1316022 1329472 1343999 1359012 1374346 1390023 1405628 1420401
52066 1420401 1433971 1446640 1458667 1469528 1478168 1483981 1487235 1488542 1488098 1485587 1480709 1473595 1464676
52053 1464676 1454249 1442273 1428622 1413507 1397512 1381139 1364358 1346740 1328080 1308771 1289455
52042 1289455 1270335 1250940 1230629 1209332 1187841 1167429 1149107 1133187 1119444 1107555 1097315
$$ packed form
52127A044196J5507J7764J9422K0919K2516K4092K5569K6954K7908K7966K7276
52116A300089K6495K5734K4235K1533J8345J5661J3418J0740P302L768P79j857
52104A466242m706p841j0735j2819j3921j4198j3900j3263j2498j1720j0792r407
52092A330442p530n716m640m355m267m039m039m608n221m984l749k166o22J217
52078A275723L646O243Q407J0152J1851J3450J4527J5013J5334J5677J5605J4773
52066A420401J3570J2669J2027J0861Q640N813L254J307m44k511m878p114q919
52053A464676j0427j1976j3651j5115j5995j6373j6781j7618j8660j9309j9316
52042A289455j9120j9395k0311k1297k1491k0412j8322j5920j3743j1889j0240
$$ plain form
52031 1097315 1088552 1081090 1074854 1069806 1065664 1061860 1057932 1053830 1049597 1044868 1038915 1031221 1021859 1011401
52017 1011401 1000660 990444 981112 972179 962627 951777 939732 926845 913027 897899 881447 864135
52005 864135 846360 828205 809868 792018 775392 760089 745503 730928 716028 700704 684842
51994 684842 668506 652341 637502 624950 614816 606474 599186 592602 586727 581576 576978 572653 568393
51981 568393 564118 559715 554838 548877 541248 531829 521164 510147 499456 489298 479721 471026 463664
51968 463664 457699 452682 448233 444583 442279 441464 441807 443096 445499 449124 453670 458728 464130 469704 474986
51953 474986 479481 483104 486030 488257 489545 489613 488146 484886 480166 475153 471029 468058 466024 465433 467428
51938 467428 472318 479040 486542 495047 505317 517102 529077 540070 549644 557446 562688 564585 563036
$$ packed form
52031A097315q763p462o236n048m142l804l928m102m233m729n953p694r362j0458
52017A011401j0741j0216r332q933r552j0850j2045j2887j3818j5128j6452j7312
52005H64135j7775j8155j8337j7850j6626j5303j4586j4575j4900j5324j5862
51994F84842j6336j6165j4839j2552j0134q342p288o584n875n151m598m325m260
51981E68393m275m403m877n961p629r419j0665j1017j0691j0158r577q695p362
51968D63664n965n017m449l650k304q15L43J289K403L625M546N058N402N574N282
51953D74986M495L623K926K227J288O8j467l260m720n013m124k971k034n91J995
51938D67428M890O722P502Q505J0270J1785J1975J0993R574P802N242J897j549
$$ plain form
51925 563036 558659 552262 544245 534433 522549 508941 494672 480726 467389 454625 442642 431622
51913 431622 421199 410880 400953 392271 385090 378750 372723 367439 363708 361808 361535 362804 365730 370236
51899 370236 375995 382692 390149 398319 407395 417739 429363 441449 452621 461726 468305 472493 474771
51886 474771 475785 476075 475727 474304 471190 466064 459113 450900 442136 433615 426255 420884 417762 416444 416331
51871 416331 417246 419198 421793 424401 426916 429734 432753 434936 435258 433634 430454 425611 418760 410411 402075
51856 402075 395087 389695 385376 381736 378917 377452 377852 380107 383521 387181 390566 393447 395337 395554 393949
51841 393949 391143 387844 384255 380371 376401 372545 368621 364380 360053 356258 353406 351493 350391 350057
51827 350057 350476 351657 353603 356039 358263 359580 359839 359246 357702 354798 350579 345877 341627 338142 335288
$$ packed form
51925E63036m377o397q017r812j1884j3608j4269j3946j3337j2764j1983j1020
51913D31622j0423j0319r927q682p181o340o027n284l731j900k73J269K926M506
51899C70236N759O697P457Q170R076J0344J1624J2086J1172R105O579M188K278
51886D74771J014K90l48j423l114n126o951q213q764q521p360n371l122j318j13
51871D16331R15J952K595K608K515K818L019K183L22j624l180m843o851q349q336
51856D02075o988n392m319l640k819j465M00K255L414L660L385K881J890K17j605
51841C93949k806l299l589l884l970l856l924m241m327l795k852j913j102l34
51827C50057M19J181J946K436K224J317K59n93j544k904m219m702m250l485k854
$$ plain form
51812 335288 333046 331525 330606 330088 330130 331159 333255 335999 339017 342241 345374 347448 347474 345465 342421 339180
51796 339180 335715 331722 327508 323832 320947 318287 315232 311876 308816 306469 304885 304088 304171 305001 306140
51781 306140 307232 308287 309415 310491 311330 312035 312873 313809 314483 314701 314697 314793 315103 315762 317197 319815 323520
51764 323520 327855 332650 338220 344831 352219 359757 366899 373273 378546 382418 384704 385183 383438 379080
51750 379080 372237 363748 354805 346417 339114 332980 327874 323736 320717 319006 318599 319404 321588 325635 331886
51735 331886 340111 349676 360007 370714 381274 390876 398819 405037 410174 415190 420867 427402 434072
51722 434072 439241 441101 438806 432963 424935 415744 405848 395833 386844 379992 375407 372115 368768 364431
51708 364431 358845 352395 346009 340876 337832 336911 337546 339251 341874 345118 348063 349570 349263 347864 346483
$$ packed form
51812C35288k242j521r19n18M2J029K096K744L018L224L133K074K6k009l044l241
51796C39180l465l993m214l676k885k660l055l356l060k347j584p97Q3Q30J139
51781C06140J092J055J128J076Q39P05Q38R36O74K18mR6L10O59J435K618L705
51764C23520M335M795N570O611P388P538P142O374N273L872K286M79j745m358
51750C79080o843q489q943q388p303o134n106m138l019j711m07Q05K184M047O251
51735C31886Q225R565J0331J0707J0560R602P943O218N137N016N677O535O670
51722D34072N169J860k295n843q028r191r896j0015q989o852m585l292l347m337
51708C64431n586o450o386n133l044r21O35J705K623L244K945J507l07j399j381
$$ plain form
51693 346483 345767 345874 346885 348778 351080 352970 353792 353230 351076 347353 342738 338343 334708 331420 328026
51678 328026 324906 322713 321340 320162 319197 319299 321033 323991 327457 331288 335781 341019 346721 352502 357922
51663 357922 362388 365349 366602 366301 364750 362260 359051 355226 351052 347427 345800 347357 352327 360043
51649 360043 369272 378289 385165 388740 389378 388348 386401 383246 378381 371973 364771 357482 350467 343828
51635 343828 337561 331675 326310 321694 317954 315010 312659 310722 309156 308136 307913 308420 309062 309171 308650
51620 308650 308052 307974 308565 309566 310572 311238 311475 311483 311390 310887 309496 307266 304827 302641 300534 298213 295948
51603 295948 294416 293996 294485 295460 296769 298748 302068 307240 314166 322289 331158 340472 349491 356897 361721
51588 361721 364145 364951 364492 362730 360102 357617 355998 355294 355445 356666 359003 362098 365870 371086 378754
$$ packed form
51693C46483p16J07J011J893K302J890Q22n62k154l723m615m395l635l288l394
51678C28026l120k193j373j178r65J02J734K958L466L831M493N238N702N781N420
51663C57922M466K961J253l01j551k490l209l825m174l625j627J557M970P716
51649C60043R229R017O876L575O38j030j947l155m865o408p202p289p015o639
51635C43828o267n886n365m616l740k944k351j937j566j020k23N07O42J09n21
51620C08650n98p8N91J001J006O66K37Qr3n03j391k230k439k186k107k321k265
51603B95948j532m20M89R75J309J979L320N172O926Q123Q869R314R019P406M824
51588C61721K424Q06m59j762k628k485j619p04J51J221K337L095L772N216P668
$$ plain form
51573 378754 389085 401401 414866 428865 442835 456333 469437 482704 496459 510284 523394
51562 523394 535399 546707 558447 572265 590025 613283 642725 677956 717632 759612 801006
51551 801006 838456 868966 890839 903921 908854 906103 895721 877872 853286 823132 788700 751370
51539 751370 712770 674625 638305 604535 573565 545553 520751 499318 480971 464882 450103
51528 450103 436232 423618 412893 404378 397938 393124 389185 385094 380047 374111 368150 362911 358327
51515 358327 353872 349371 345242 341970 339600 337691 335601 332854 329479 326061 323280 321369 320068 319052
51501 319052 318122 316988 315296 313095 311034 309792 309465 309812 310893 313027 316153 319640 322881 325826 328888
51486 328888 332576 337240 342825 348744 354256 359038 362970 365314 364735 360633 354034 346578 338942 330896
$$ packed form
51573C78754J0331J2316J3465J3999J3970J3498J3104J3267J3755J3825J3110
51562E23394J2005J1308J1740J3818J7760K3258K9442L5231L9676M1980M1394
51551H01006L7450L0510K1873J3082M933k751j0382j7849k4586l0154l4432l7330
51539G51370l8600l8145l6320l3770l0970k8012k4802k1433j8347j6089j4779
51528D50103j3871j2614j0725q515o440m814l939m091n047n936n961n239m584
51515C58327m455m501m129l272k370j909k090k747l375l418k781j911j301j016
51501C19052r30j134j692k201k061j242l27L47J081K134L126L487L241K945L062
51486C28888L688M664N585N919N512M782L932K344n79m102o599p456p636q046
$$ plain form
51472 330896 322658 315271 309393 304484 299627 294717 290405 287199 285025 283425 281786 279529 276524 273343
51458 273343 270870 269583 269290 269462 269679 269929 270688 272572 275740 279698 283863 288144 292736 297599 302547
51443 302547 307800 314075 322030 331825 343153 355295 366974 376549 382769 385545 385980 385618 385494 385660
51429 385660 385460 384194 381470 377073 370973 363727 356535 350357 345084 340069 335375 331822 329697 328101
51415 328101 326029 323579 321508 319999 318581 317170 316446 316983 318509 320354 322251 324353 326680 328898 330558
51400 330558 331299 330927 329668 328375 328101 329254 331364 333863 336901 341098 346699 353446 361302 370796 382427
51385 382427 396152 411825 429770 450409 473624 499200 527847 560977 599239 641977 688545
51374 688545 739241 793940 850034 902751 947833 983471 1009704 1026867 1035072 1034606 1025948 1009349
$$ packed form
51472C30896q238p387n878m909m857m910m312l206k174j600j639k257l005l181
51458B73343k473j287k93J72K17K50P59J884L168L958M165M281M592M863M948
51443C02547N253O275P955R795J1328J2142J1679R575O220K776M35l62j24J66
51429C85660k00j266k724m397o100p246p192o178n273n015m694l553k125j596
51415C28101k072k450k071j509j418j411p24N37J526J845J897K102K327K218J660
51400C30558P41l72j259j293k74J153K110K499L038M197N601O747P856R494J1631
51385C82427J3725J5673J7945K0639K3215K5576K8647L3130L8262M2738M6568
51374F88545N0696N4699N6094N2717M5082L5638K6233J7163Q205m66q658j6599
$$ plain form
51362 1009349 984828 952646 913596 868925 820231 769426 718443 668861 621844 578349 539108
51351 539108 504401 474111 448091 426242 408209 393292 380829 370414 361550 353388 345253 337358
51339 337358 330585 325494 321825 319042 316960 315578 314602 313499 312007 310257 308395 306379 304235 302263
51325 302263 300804 299857 299110 298324 297562 296996 296604 296183 295680 295272 294977 294314 292648 289953 286985 284593 283042
51308 283042 282097 281490 281076 280698 280272 279884 279601 279280 278906 278970 280084 282150 284324 285894 286830 287298 287042 285639
51290 285639 283236 280749 279321 279707 282029 285912 290814 296306 302092 307852 313259 318128 322350 325683
51276 325683 327814 328671 328405 327055 324585 321335 318080 315399 313236 311290 309519 308035 306798 305802 305337
51261 305337 305702 306693 307672 308004 307313 305492 302809 299860 297157 294873 293035 291672 290461 288657 285896
$$ packed form
51362A009349k4521l2182l9050m4671m8694n0805n0983m9582m7017m3495l9241
51351E39108l4707l0290k6020k1849j8033j4917j2463j0415q864q162q135p895
51339C37358o773n091l669k783k082j382r76j103j492j750j862k016k144j972
51325C02263j459r47p47p86p62n66l92m21n03m08k95o63j666k695k968k392j551
51308B83042r45o07m14l78m26l88k83l21l74O4J114K066K174J570R36M68k56j403
51290B85639k403k487j428L86K322L883M902N492N786N760N407M869M222L333
51276C25683K131Q57k66j350k470l250l255k681k163j946j771j484j237r96m65
51261C05337L65R91R79L32o91j821k683k949k703k284j838j363j211j804k761
$$ plain form
51246 285896 282855 280604 279440 278856 278514 278620 279376 280601 281969 283137 283631 283123 281922 280729 279866 279203
51230 279203 278773 278775 278888 278381 277231 276466 276936 278348 279953 281631 283685 286045 288358 290534 292549 293901
51214 293901 293968 292849 291305 289917 288839 288248 288375 288990 289470 289620 290001 291194 293096 295174 297104 298874
51198 298874 300416 301463 301791 301488 300941 300548 300368 300169 299858 299753 300282 301517 303176 304956 306632 307976
51182 307976 308892 309635 310598 311833 312945 313434 312943 311281 308566 305404 302596 300515 298942 297539 296271
51167 296271 295260 294533 294058 293909 294230 295081 296370 297883 299399 300923 302680 304794 306919 308448 309076 309072
51151 309072 308992 309234 309777 310204 310119 309689 309624 310321 311207 311287 310284 308801 307470 306396 305471 304690 303935 302944 301752
51132 301752 300785 300269 299932 299597 299733 300961 303225 305822 308179 310307 312560 315102 317538 319026 318997 317873
$$ packed form
51246B85896l041k251j164n84l42J06P56J225J368J168M94n08j201j193q63o63
51230B79203m30KJ13n07j150p65M70J412J605J678K054K360K313K176K015J352
51214B93901O7j119j544j388j078n91J27O15M80J50L81J193J902K078J930J770
51198B98874J542J047L28l03n47l93j80j99l11j05N29J235J659J780J676J344
51182C07976R16P43R63J235J112M89m91j662k715l162k808k081j573j403j268
51167B96271j011p27m75j49L21Q51J289J513J516J524J757K114K125J529O28m
51151C09072q0K42N43M27q5m30o5O97Q86Q0j003j483j331j074r25p81p55r91j192
51132C01752r67n16l37l35J36J228K264K597K357K128K253K542K436J488k9j124
$$ plain form
51116 317873 316757 316246 315967 315529 315395 316269 317972 319607 320713 321644 322840 324309 325932 327803 330085 332817
51100 332817 335913 339026 341471 342771 343296 343894 344862 345776 346460 347401 348920 350563 351857 353186 355256 357978
51084 357978 360556 362497 363813 364259 363176 360446 357068 354294 352448 350964 349343 347723 346615 346496 347680
51069 347680 350253 353964 358363 363137 368230 373632 379339 385726 393768 404539 418261 433802 449074
51056 449074 461968 471207 476828 480222 483670 489415 498650 510973 524723 538109 550423 562267 574494
51043 574494 586807 597562 605035 608814 609857 609431 608289 606750 604921 602353 597579 588569 574089 554663
51029 554663 532201 508801 486025 465051 446899 432120 420467 411225 403937 398626 395368 393898
51017 393898 393721 394445 395987 398600 402629 408017 414048 419825 425117 430441 436291 442599 449086 455766 462808
$$ packed form
51116C17873j116n11k79m38j34Q74J703J635J106R31J196J469J623J871K282K732
51100C32817L096L113K445J300N25N98R68R14O84R41J519J643J294J329K070K722
51084C57978K578J941J316M46j083k730l378k774j846j484j621j620j108j19J184
51069C47680K573L711M399M774N093N402N707O387Q042J0771J3722J5541J5272
51056D49074J2894R239N621L394L448N745R235J2323J3750J3386J2314J1844J2227
51043E74494J2313J0755P473L779J043m26j142j539j829k568m774r010j4480j9426
51029E54663k2462k3400k2776k0974j8152j4779j1653r242p288n311l258j470
51017C93898j77P24J542K613M029N388O031N777N292N324N850O308O487O680P042
$$ plain form
51002 462808 470224 478013 486431 495764 505971 516848 528375 540655 553647 567229 581270 595331
50990 595331 608574 620466 631435 642379 653612 664795 675731 686537 697080 706918 715951 724497
50978 724497 732444 738997 743626 746827 749668 753099 758130 766084 778103 794585 815504 840912 870759
50965 870759 904589 941978 983062 1028121 1076852 1128514 1182591 1238836 1296837 1355976 1415575
50954 1415575 1474521 1530993 1583263 1630764 1673804 1712377 1746006 1774750 1799418 1820488 1837603
50943 1837603 1850674 1860951 1870356 1879886 1888954 1896054 1899813 1899743 1896418 1890907 1883900 1875460 1865510 1854035
50929 1854035 1840568 1823931 1802938 1777191 1746929 1712336 1673333 1629852 1582022 1530256 1475441
50918 1475441 1418906 1361984 1305649 1250714 1198068 1148498 1102423 1060038 1021468 986613 955149
$$ packed form
51002D62808P416P789Q418R333J0207J0877J1527J2280J2992J3582J4041J4061
50990E95331J3243J1892J0969J0944J1233J1183J0936J0806J0543R838R033Q546
50978G24497P947O553M629L201K841L431N031P954J2019J6482K0919K5408K9847
50965H70759L3830L7389M1084M5059M8731N1662N4077N6245N8001N9139N9599
50954A415575N8946N6472N2270M7501M3040L8573L3629K8744K4668K1070J7115
50943A837603J3071J0277R405R530R068P100L759p0l325n511p007q440r950j1475
50929A854035j3467j6637k0993k5747l0262l4593l9003m3481m7830n1766n4815
50918A475441n6535n6922n6335n4935n2646m9570m6075m2385l8570l4855l1464
$$ plain form
50907 955149 927009 902543 881783 863832 847429 832000 817759 804929 793348 782717 772747 763156
50895 763156 753939 745588 738516 732298 726056 719688 714137 710261 707930 706553 705952 706263 707277 708481 709742
50880 709742 711497 714115 717295 720425 723521 727543 733437 740929 748711 756066 763844 773464 785332 798878
50866 798878 813776 830259 848271 867351 887769 910879 937634 967328 998599 1031444 1067522
50855 1067522 1108587 1155219 1207099 1264022 1326512 1395744 1472883 1558156 1650628 1749203 1853788
50844 1853788 1965048 2083017 2206434 2333592 2463392 2595126 2727368 2857399 2981723
50835 2981723 3097062 3200895 3291319 3366652 3425501 3467372 3493183 3505042 3505487 3496931 3481638
50824 3481638 3461995 3440705 3420782 3405283 3396793 3396921 3405922 3422425 3443359 3464472 3481355 3490189
$$ packed form
50907I55149k8140k4466k0760j7951j6403j5429j4241j2830j1581j0631r970r591
50895G63156r217q351p072o218o242o368n551l876k331j377o01L11J014J204J261
50880G09742J755K618L180L130L096M022N894P492P782P355P778R620J1868J3546
50866G98878J4898J6483J8012J9080K0418K3110K6755K9694L1271L2845L6078
50855A067522M1065M6632N1880N6923O2490O9232P7139Q5273R2472R8575J04585
50844A853788J11260J17969J23417J27158J29800J31734J32242J30031J24324
50835B981723J15339J03833R0424P5333N8849M1871K5811J1859M45q556j5293
50824C481638j9643k1290j9923j5499q490J28R001J6503K0934K1113J6883Q834
$$ plain form
50812 3490189 3487712 3471023 3437927 3387561 3320355 3237314 3139526 3028351 2905838 2774753 2638217
50801 2638217 2499339 2361121 2226634 2098996 1980820 1873534 1777520 1693016 1620527 1560134
50791 1560134 1510822 1471001 1439509 1415641 1398439 1386601 1379062 1375058 1373556 1373180 1372848 1371969 1369898
50778 1369898 1365836 1359549 1351606 1342463 1331802 1319210 1304998 1289771 1273511 1255796 1236748 1217021
50766 1217021 1196783 1175301 1151789 1126309 1099709 1073066 1047352 1023280 1001036 980282 960665
50755 960665 942413 926349 913303 903567 896836 892596 890534 890635 893021 897775 904883 914254 925851
50742 925851 939902 956899 977153 1000421 1026305 1055033 1087506 1124476 1166129 1212658 1264651
50731 1264651 1322298 1384447 1449163 1515282 1582904 1652289 1722792 1793149 1862375 1929993 1995545
$$ packed form
50812C490189k477j6689l3096n0366o7206q3041r7788j11175j22513j31085j36536
50801B638217j38878j38218j34487j27638j18176j07286r6014q4504p2489o0393
50791A560134m9312l9821l1492k3868j7202j1838p539m004j502l76l32q79k071
50778A369898m062o287p943r143j0661j2592j4212j5227j6260j7715j9048j9727
50766A217021k0238k1482k3512k5480k6600k6643k5714k4072k2244k0754j9617
50755I60665j8252j6064j3046r736o731m240k062J01K386M754P108R371J1597
50742I25851J4051J6997K0254K3268K5884K8728L2473L6970M1653M6529N1993
50731A264651N7647O2149O4716O6119O7622O9385P0503P0357O9226O7618O5552
$$ plain form
50720 1995545 2058219 2116911 2170335 2217007 2255278 2283616 2301048 2307405 2303186 2289254 2266880 2238195
50708 2238195 2206476 2175636 2149118 2128964 2115660 2108787 2107937 2113078 2123863 2138652 2154606 2169002
50696 2169002 2180089 2186398 2185616 2174784 2151599 2115260 2066368 2006649 1938763 1865734 1790280 1714885
50684 1714885 1642314 1575318 1515625 1463669 1419500 1383510 1356136 1337446 1327376 1325935 1332880 1347608
50672 1347608 1369664 1398847 1434411 1474594 1517429 1561527 1605518 1647267 1684617 1716824 1744450
50661 1744450 1767881 1786863 1801715 1814121 1825979 1837827 1848884 1858476 1866921 1875075 1883417 1891785
50649 1891785 1899931 1908182 1917483 1928773 1942505 1958929 1978674 2002750 2031850 2065857 2104047 2145668
50637 2145668 2190318 2237918 2288221 2340126 2391563 2440409 2485623 2527343 2566136 2602690 2638049
$$ packed form
50720A995545O2674N8692N3424M6672L8271K8338J7432O357m219j3932k2374k8685
50708B238195l1719l0840k6518k0154j3304o873q50N141J0785J4789J5954J4396
50696B169002J1087O309p82j0832k3185l6339m8892n9719o7886p3029p5454p5395
50684A714885p2571o6996n9693n1956m4169l5990k7374j8690j0070j441O945J4728
50672A347608K2056K9183L5564M0183M2835M4098M3991M1749L7350L2207K7626
50661A744450K3431J8982J4852J2406J1858J1848J1057R592Q445Q154Q342Q368
50649A891785Q146Q251R301J1290J3732J6424J9745K4076K9100L4007L8190M1621
50637B145668M4650M7600N0303N1905N1437M8846M5214M1720L8793L6554L5359
$$ plain form
50626 2638049 2672865 2705138 2728578 2734292 2715326 2670627 2605362 2527886 2446168 2366186 2292318
50615 2292318 2228017 2175578 2135609 2107353 2089701 2081716 2082258 2089523 2101186 2114691 2127247 2135817
50603 2135817 2137509 2130131 2112398 2083770 2044232 1994168 1934502 1867130 1795048 1721513 1648726 1577536
50591 1577536 1508473 1442704 1381635 1325945 1275499 1230081 1189742 1154438 1123817 1097551 1075540
50580 1075540 1057612 1043219 1031641 1022386 1015278 1010148 1006556 1003832 1001459 999452 998294 998467 1000117
50567 1000117 1003214 1007824 1014057 1021896 1031383 1042909 1057034 1073979 1093480 1115188 1139085 1165495
50555 1165495 1194865 1227552 1263630 1302814 1344565 1388233 1433028 1477935 1521837 1563702 1602663
50544 1602663 1638196 1670571 1701041 1731298 1762791 1796733 1834452 1877111 1924967 1977482 2034423
$$ packed form
50626B638049L4816L2273K3440N714j8966m4699o5265p7476q1718p9982p3868
50615B292318o4301n2439l9969k8256j7652p985N42P265J1663J3505J2556Q570
50603B135817J692p378j7733k8628l9538n0064n9666o7372p2082p3535p2787p1190
50591A577536o9063o5769o1069n5690n0446m5418m0339l5304l0621k6266k2011
50580A075540j7928j4393j1578r255p108n130l592k724k373k007j158J73J650
50567A000117L097M610O233P839R487J1526J4125J6945J9501K1708K3897K6410
50555A165495K9370L2687L6078L9184M1751M3668M4795M4907M3902M1865L8961
50544A602663L5533L2375L0470L0257L1493L3942L7719M2659M7856N2515N6941
$$ plain form
50533 2034423 2096589 2165261 2241272 2324799 2415677 2513570 2618178 2729615 2848308 2974003
50523 2974003 3104948 3238423 3372000 3503937 3632400 3754843 3868343 3970193 4057883 4128704
50513 4128704 4179766 4208670 4214232 4196594 4156623 4095296 4013901 3914921 3802407 3681104 3555201
50502 3555201 3428166 3303637 3185985 3079732 2988624 2915341 2861749 2828924 2816881 2824496 2849836
50491 2849836 2890370 2942662 3001794 3061218 3113442 3151172 3168289 3160430 3125431 3063700 2978108
50480 2978108 2873168 2753936 2625330 2491908 2357707 2225968 2098940 1978000 1864004
50471 1864004 1757717 1660000 1571536 1492316 1421540 1358174 1301512 1251119 1206454 1166885 1131969
50460 1131969 1101420 1074822 1051663 1031644 1014637 1000348 988397 978839 972131 968310 966503 965617
$$ packed form
50533B034423O2166O8672P6011Q3527R0878R7893J04608J11437J18693J25695
50523B974003J30945J33475J33577J31937J28463J22443J13500J01850Q7690P0821
50513D128704N1062K8904N562j7638l9971o1327q1395r8980j12514j21303j25903
50502C555201j27035j24529j17652j06253r1108p3283n3592l2825j2043P615K5340
50491B849836M0534N2292N9132N9424N2224L7730J7117p859l4999o1731q5592
50480B978108j04940j19232j28606j33422j34201j31739j27028j20940j13996
50471A864004j06287r7717q8464p9220p0776o3366n6662n0393m4665l9569l4916
50460A131969l0549k6598k3159k0019j7007j4289j1951r558o708l821j807q86
$$ plain form
50448 965617 965318 966006 967988 971108 975153 980209 986434 993732 1001823 1010518 1019751 1029411 1039306 1049317
50434 1049317 1059509 1069957 1080433 1090365 1099331 1107630 1116263 1126226 1137958 1151495 1166939 1184483
50422 1184483 1204102 1225517 1248650 1273975 1302326 1334436 1370718 1411433 1456935 1507676 1563892
50411 1563892 1625331 1691354 1761348 1834836 1911046 1988459 2064982 2138643 2208017 2272081 2329924
50400 2329924 2380765 2424081 2459451 2486137 2502808 2507720 2499244 2476387 2439045 2388015 2324893 2251957
50388 2251957 2171976 2088027 2003370 1921305 1844781 1775941 1716097 1666163 1626981 1599125 1582602
50377 1582602 1576958 1581535 1595309 1616500 1642582 1670699 1697874 1720847 1736219 1741123 1733834 1713776
50365 1713776 1681334 1637920 1585969 1528310 1467300 1404642 1341902 1280779 1222620 1167906 1116552
$$ packed form
50448I65617k99O88J982L120M045N056O225P298Q091Q695R233R660R895J0011
50434A049317J0192J0448J0476R932Q966Q299Q633R963J1732J3537J5444J7544
50422A184483J9619K1415K3133K5325K8351L2110L6282M0715M5502N0741N6216
50411A563892O1439O6023O9994P3488P6210P7413P6523P3661O9374O4064N7843
50400B329924N0841M3316L5370K6686J6671M912q476k2857l7342n1030o3122p2936
50388B251957p9981q3949q4657q2065p6524o8840n9844m9934l9182k7856j6523
50377A582602n644M577J3774K1191K6082K8117K7175K2973J5372M904p289k0058
50365A713776l2442m3414n1951n7659o1010o2658o2740o1123n8159n4714n1354
$$ plain form
50354 1116552 1068687 1024841 985290 949477 916312 885047 855741 828938 805032 783971 765483
50343 765483 749457 736015 725140 716339 709026 703340 700269 700520 703396 707241 710996 714839 719202 723839
50329 723839 728284 732740 737796 743459 749139 754654 760624 767705 775890 784881 794743 805909 818777 833546
50315 833546 850136 867829 884998 899467 909296 913410 911898 906042 897805 888851 879962 871511 864291
50302 864291 859337 856891 855995 855490 855220 855957 858336 862282 867493 873957 881640 889997 898301 906397 914621
50287 914621 922874 930339 936500 942009 947958 954498 960818 966553 972637 980648 991858 1007050 1026352
50274 1026352 1048181 1068377 1081227 1082187 1070095 1047301 1018042 986561 956035 928456 904932 885808
50262 885808 870679 858757 849612 843441 840491 840352 842041 844663 847804 851432 855693 860732 866440 872350
$$ packed form
50354A116552m7865m3846l9551l5813l3165l1265k9306k6803k3906k1061j8488
50343G65483j6026j3442j0875q801p313n686l071K51K876L845L755L843M363M637
50329G23839M445M456N056N663N680N515N970P081Q185Q991R862J1166J2868J4769
50315H33546J6590J7693J7169J4469R829M114j512n856q237q954q889q451p220
50302H64291m954k446q96n05k70P37K379L946N211O464P683Q357Q304Q096Q224
50287I14621Q253P465O161N509N949O540O320N735O084Q011J1210J5192J9302
50274A026352K1829K0196J2850R60j2092k2794k9259l1481l0526k7579k3524j9124
50262H85808j5129j1922r145o171k950j39J689K622L141L628M261N039N708N910
$$ plain form
50248 872350 877961 883164 888244 893597 899513 905984 912374 917523 920705 922496 924264 926776 929751 932859
50234 932859 936599 941805 948674 956758 965777 976041 988118 1002464 1019405 1039113 1061292 1084911
50222 1084911 1108410 1130320 1149808 1166747 1181376 1194013 1205114 1215434 1225823 1236732 1247898
50211 1247898 1258416 1266913 1271697 1271007 1263311 1247486 1223041 1190647 1152530 1111791 1070948 1031236
50199 1031236 993431 958942 929569 906323 888906 876285 867242 860185 852873 842854 828268 808300
50187 808300 783257 754535 724403 695277 668805 645553 625420 608150 593401 580584 568967
50176 568967 558058 547825 538591 530780 524697 520318 517227 514840 512830 511219 510051 509152 508387 508025
50162 508025 508594 510387 513303 517128 521752 527084 533094 540029 548375 558276 569046 579448 588527 596174
$$ packed form
50248H72350N611N203N080N353N916O471O390N149L182J791J768K512K975L108
50234I32859L740N206O869Q084R019J0264J2077J4346J6941J9708K2179K3619
50222A084911K3499K1910J9488J6939J4629J2637J1101J0320J0389J0909J1166
50211A247898J0518Q497M784o90p696j5825k4445l2394l8117m0739m0843l9712
50199A031236l7805l4489k9373k3246j7417j2621r043p057p312j0019j4586j9968
50187H08300k5043k8722l0132k9126k6472k3252k0133j7270j4749j2817j1617
50176E68967j0909j0233r234p811o083m379l091k387k010j611j168q99p65l62
50162E08025N69J793K916L825M624N332O010O935Q346R901J0770J0402R079P647
$$ plain form
50148 596174 602962 609477 615742 621170 625112 627492 628829 629611 629794 629070 627541 625940 625199 625969 628545
50133 628545 633035 639305 646872 655153 664048 674075 685667 698405 711279 723854 736841 751322
50121 751322 767743 785954 805865 827536 850782 875379 901744 930940 963869 1000992 1042954
50110 1042954 1090765 1144814 1204084 1266752 1331167 1395721 1458294 1516803 1570543 1620561 1668701
50099 1668701 1716640 1765599 1816035 1867068 1916482 1961458 1999062 2026145 2039629 2037652 2020411
50088 2020411 1989677 1947693 1896715 1839088 1777034 1712243 1646006 1579830 1515584 1454858 1398329
50077 1398329 1345893 1297361 1252965 1213159 1177860 1145962 1115831 1086473 1058112 1031435 1006422
50066 1006422 982215 958108 934372 911981 891797 874174 859110 846464 836044 827700 821427 817182
$$ packed form
50148E96174O788O515O265N428L942K380J337P82J83p24j529j601p41P70K576
50133F28545M490O270P567Q281Q895J0027J1592J2738J2874J2575J2987J4481
50121G51322J6421J8211J9911K1671K3246K4597K6365K9196L2929L7123M1962
50110A042954M7811N4049N9270O2668O4415O4554O2573N8509N3740N0018M8140
50099A668701M7939M8959N0436N1033M9414M4976L7604K7083J3484j977j7241
50088B020411l0734m1984n0978n7627o2054o4791o6237o6176o4246o0726n6529
50077A398329n2436m8532m4396l9806l5299l1898l0131k9358k8361k6677k5013
50066A006422k4207k4107k3736k2391k0184j7623j5064j2646j0420q344o273m245
$$ plain form
50054 817182 814590 812982 811894 811432 811976 813628 816182 819618 824277 830325 837217 843990 850069 855531 860545
50039 860545 864844 867953 869778 870678 870873 869971 867271 862622 856855 851214 846327 841846 837194 832423 828069
50024 828069 824272 820485 816241 811889 808150 804996 801350 796118 789397 782548 777068 773467 771075 768706
50010 768706 765477 761167 756082 750712 745466 740612 736303 732628 729799 728465 729759 734741 743617 755781
49996 755781 770807 789200 811805 838679 869064 902446 939014 978808 1020916 1063948 1106845
49985 1106845 1148674 1187945 1222914 1252658 1277370 1297487 1313141 1324663 1333156 1340072 1346209 1351118
49973 1351118 1353188 1350130 1339720 1320450 1291674 1253411 1206467 1152811 1095312 1036750 979238 924521
49961 924521 874154 828898 788431 752336 721140 695674 675513 658919 644603 632925 624932 620690
$$ packed form
50054H17182k592j608j088m62N44J652K554L436M659O048O892O773O079N462N014
50039H60545M299L109J825R00J95r02k700m649n767n641m887m481m652m771m354
50024H28069l797l787m244m352l739l154l646n232o721o849n480l601k392k369
50010G68706l229m310n085n370n246m854m309l675k829j334J294M982Q876J2164
49996G55781J5026J8393K2605K6874L0385L3382L6568L9794M2108M3032M2897
49985A106845M1829L9271L4969K9744K4712K0117J5654J1522Q493O916O137M909
49973A351118K070l058j0410j9270k8776l8263m6944n3656n7499n8562n7512n4717
49961I24521n0367m5256m0467l6095l1196k5466k0161j6594j4316j1678p993m242
$$ plain form
49949 620690 619140 619380 621435 625629 631720 638993 646902 655228 663551 670931 676335 679380 680512 680546 680084
49934 680084 679200 677293 673087 665091 652507 635903 616960 597532 578860 561462 545496 531145
49922 531145 518761 508770 501430 496619 493781 492080 490794 489684 488982 488893 489140 489247 489206 489639 491140 493728
49906 493728 497079 501027 505564 510482 515446 520492 526229 533382 542210 552380 563326 574680 586367
49893 586367 598226 609539 619145 626229 630973 634261 636741 638335 638569 637096 633778 628454 620895 611029
49879 611029 599095 585515 570642 554707 538074 521460 505733 491478 478895 468150 459606 453490
49867 453490 449407 446493 444134 442469 442080 443196 445261 447386 449299 451684 455428 460651 466740 473310
49853 473310 480613 488895 497830 507060 516965 528329 541237 554712 567471 578653 587746 594258 597869
$$ packed form
49949F20690j550K40K055M194O091P273P909Q326Q323P380N404L045J132L4m62
49934F80084q84j907m206p996j2584j6604j8943j9428j8672j7398j5966j4351
49922E31145j2384r991p340m811k838j701j286j110p02q9K47J07m1M33J501K588
49906D93728L351L948M537M918M964N046N737P153Q828J0170J0946J1354J1687
49893E86367J1859J1313R606P084M744L288K480J594K34j473l318n324p559r866
49879F11029j1934j3580j4873j5935j6633j6614j5727j4255j2583j0745q544o116
49867D53490m083k914k359j665l89J116K065K125J913K385L744N223O089O570
49853D73310P303Q282Q935R230R905J1364J2908J3475J2759J1182R093O512L611
$$ plain form
49840 597869 598847 598131 596885 595801 594620 592331 587954 581201 572467 562456 552065 542320 533927 526828
49826 526828 520465 514536 509235 504847 501529 499550 499337 501041 504346 508878 514562 521448 529472 538604
49812 538604 548993 560651 573113 585630 597551 608343 617458 624561 629864 633932 637093 639273 640463
49799 640463 640976 640899 639487 635624 629075 620949 612477 603523 592808 579606 564722 549607 535107 521480
$$ packed form
49840E97869R78p16j246j084j181k289m377o753q734j0011j0391r745q393p099
49826E26828o363n929n301m388l318j979k13J704L305M532N684O886Q024R132
49812E38604J0389J1658J2462J2517J1921J0792R115P103N303M068L161K180J190
49799F40463N13p7j412l863o549q126q472q954j0715j3202j4884j5115j4500j3627
$$ [...]
##END NTUPLES=NMR SPECTRUM
##END=
