##TITLE=coffee_type ROVE100
COFFEE_meoh_noesyp64 COFFEE_meoh {C:\Bruker\TOPSPIN} Administrator 14
##JCAMPDX= 6.0         $$ Bruker NMR JCAMP-DX V2.0
##DATA TYPE= NMR SPECTRUM
##DATA CLASS= NTUPLES
##ORIGIN= Bruker BioSpin GmbH
##OWNER= Administrator
$$ 1.72 TOPSPIN		Version 2.1
$$ 2012-05-18 15:49:55.089 -0700  Administrator@X
$$ Compression mode = diff/dup
##.OBSERVE FREQUENCY= 400.13188235
##.OBSERVE NUCLEUS= ^1H
##.ACQUISITION MODE= SIMULTANEOUS (DQD)
##.ACQUISITION SCHEME= undefined
##.AVERAGES= 64
##.DIGITISER RES= 22
##SPECTROMETER/DATA SYSTEM= spect
##.PULSE SEQUENCE= noesygpps1d.comp
##.SOLVENT NAME= COFFEE_meoh
##.SHIFT REFERENCE= INTERNAL, COFFEE_meoh, 1, 14.98061
##AUDIT TRAIL= $$ (NUMBER, WHEN, WHO, WHERE, PROCESS, VERSION, WHAT)
$$ ##TITLE= Audit trail, TOPSPIN		Version 2.1
$$ ##JCAMPDX= 5.01
$$ ##ORIGIN= Bruker BioSpin GmbH
$$ ##OWNER= Administrator
$$ $$ C:\Bruker\TOPSPIN/data/Administrator/nmr/12-COFFEE-2502/82/pdata/1/auditp.txt
$$ ##AUDIT TRAIL=  $$ (NUMBER, WHEN, WHO, WHERE, PROCESS, VERSION, WHAT)
(   1,<2012-02-25 16:16:42.000 -0500>,<Administrator>,<TOPSPIN>,<go>,<TOPSPIN 2.1>,
      <created by zg
	started at 2012-02-25 16:05:11.734 -0500,
	POWCHK enabled, PULCHK disabled,
       configuration hash MD5:
       B0 76 FB 9C 50 81 44 7D 18 B3 26 32 4E 60 AD 96
       data hash MD5: 64K
       A7 51 7B 53 85 EE FD 23 0B 68 5E D4 20 B4 59 24>)
(   2,<2012-02-25 16:16:44.906 -0500>,<Administrator>,<TOPSPIN>,<proc1d>,<TOPSPIN 2.1>,
      <Start of raw data processing
       efp LB = 0.3 FT_mod = 6 PKNL = 1 PHC0 = 0 PHC1 = 0 SI = 128K 
       data hash MD5: 128K
       B2 04 E0 8F 15 2D DC DB 4E 96 55 5E 92 4E 0B 94>)
(   3,<2012-02-25 16:16:46.109 -0500>,<Administrator>,<TOPSPIN>,<proc1d>,<TOPSPIN 2.1>,
      <pk PHC0 = 26.16394 PHC1 = 0 
       data hash MD5: 128K
       7F CA 8E 1C 03 EF 38 8A F8 0B AB AC 6B 05 44 B3>)
(   4,<2012-02-25 16:16:46.359 -0500>,<Administrator>,<TOPSPIN>,<proc1d>,<TOPSPIN 2.1>,
      <abs ABSG = 1 
       data hash MD5: 128K
       1C 5A 5F D6 43 D9 15 6F DB 3C 46 92 64 44 68 77>)
(   5,<2012-02-25 16:16:46.453 -0500>,<Administrator>,<TOPSPIN>,<proc1d>,<TOPSPIN 2.1>,
      <abs ABSG = 2 
       data hash MD5: 128K
       B7 3E C2 8E C5 26 8C FB 68 E7 EE 3E 47 74 BB AD>)
(   6,<2012-02-25 16:16:46.578 -0500>,<Administrator>,<TOPSPIN>,<proc1d>,<TOPSPIN 2.1>,
      <abs ABSG = 3 
       data hash MD5: 128K
       A5 CA 87 75 E4 BE 9F 1D B6 BD FB 02 4B 3A 56 5A>)
(   7,<2012-02-25 16:16:46.750 -0500>,<Administrator>,<TOPSPIN>,<proc1d>,<TOPSPIN 2.1>,
      <abs ABSG = 4 
       data hash MD5: 128K
       E4 87 3F A0 88 9B 78 C2 A1 18 AF 7F FE 9C 4A 8D>)
(   8,<2012-02-25 16:16:46.812 -0500>,<Administrator>,<TOPSPIN>,<proc1d>,<TOPSPIN 2.1>,
      <abs ABSG = 5 
       data hash MD5: 128K
       5A A0 E0 79 A8 03 48 F9 69 70 36 0A 47 52 63 F6>)
(   9,<2012-02-25 16:16:46.953 -0500>,<Administrator>,<TOPSPIN>,<audit>,<TOPSPIN 2.1>,
      <user comment:
       ICON-NMR User ID: Administrator
$$ [...]
150 150 150 150 150 150 150 150
##$TP07= 0
##$TPNAME0= <>
##$TPNAME1= <>
##$TPNAME2= <>
##$TPNAME3= <>
##$TPNAME4= <>
##$TPNAME5= <>
##$TPNAME6= <>
##$TPNAME7= <>
##$TPOAL= (0..7)
0.5 0.5 0.5 0.5 0.5 0.5 0.5 0.5
##$TPOFFS= (0..7)
0 0 0 0 0 0 0 0
##$TUNHIN= 0
##$TUNHOUT= 0
##$TUNXOUT= 0
##$USERA1= <user>
##$USERA2= <user>
##$USERA3= <user>
##$USERA4= <user>
##$USERA5= <user>
##$V9= 5
##$VALIST= <valist>
##$VCLIST= <CCCCCCCCCCCCCCC>
##$VD= 0
##$VDLIST= <DDDDDDDDDDDDDDD>
##$VPLIST= <PPPPPPPPPPPPPPP>
##$VTLIST= <TTTTTTTTTTTTTTT>
##$WBST= 1024
##$WBSW= 4
##$XGAIN= (0..3)
0 0 0 0
##$XL= 0
##$YL= 0
##$YMAX_a= 12040373
##$YMIN_a= -8206069
##$ZGOPTNS= <>
##$ZL1= 120
##$ZL2= 120
##$ZL3= 120
##$ZL4= 120
##$ABSF1= 14.98061
##$ABSF2= -5.57192
##$ABSG= 5
##$ABSL= 3
##$ALPHA= 0
##$AQORDER= 0
##$ASSFAC= 0
##$ASSFACI= 0
##$ASSFACX= 0
##$ASSWID= 0
##$AUNMP= <proc_prof1d_extract>
##$AXLEFT= 0
##$AXNAME= <>
##$AXNUC= <1H>
##$AXRIGHT= 0
##$AXTYPE= 0
##$AXUNIT= <>
##$AZFE= 0.1
##$AZFW= 0.1
##$BCFW= 0
##$BC_mod= 0
##$BYTORDP= 0
##$COROFFS= 0
##$CY= 15
##$DATMOD= 1
##$DC= 0
##$DFILT= <>
##$DTYPP= 0
##$F1P= 0
##$F2P= 0
##$FCOR= 0.5
##$FTSIZE= 131072
##$FT_mod= 6
##$GAMMA= 0
##$GB= 0
##$INTBC= 1
##$INTSCL= 1
##$ISEN= 128
##$LB= 0.3
##$LEV0= 0
##$LPBIN= 0
##$MAXI= 10000
##$MC2= 0
##$MEAN= 0
##$ME_mod= 0
##$MI= 0
##$NCOEF= 0
##$NC_proc= -3
##$NLEV= 6
##$NOISF1= 0
##$NOISF2= 0
##$NSP= 0
##$NTH_PI= 0
##$NZP= 0
##$OFFSET= 14.98061
##$PC= 1
##$PHC0= 26.16394
##$PHC1= 0
##$PH_mod= 1
##$PKNL= yes
##$PPARMOD= 0
##$PPDIAG= 0
##$PPIPTYP= 0
##$PPMPNUM= 2147483647
##$PPRESOL= 1
##$PSCAL= 4
##$PSIGN= 0
##$PYNMP= <proc.py>
##$REVERSE= no
##$SF= 400.13
##$SI= 131072
##$SIGF1= 0
##$SIGF2= 0
##$SINO= 400
##$SIOLD= 131072
##$SPECTYP= <>
##$SREGLST= <1H.CDCl3>
##$SSB= 0
##$STSI= 131072
##$STSR= 0
##$SW_p= 8223.68421052632
##$SYMM= 0
##$S_DEV= 0
##$TDeff= 65536
##$TDoff= 0
##$TI= <>
##$TILT= no
##$TM1= 0
##$TM2= 0
##$TOPLEV= 0
##$USERP1= <user>
##$USERP2= <user>
##$USERP3= <user>
##$USERP4= <user>
##$USERP5= <user>
##$WDW= 1
##$XDIM= 131072
##$YMAX_p= 478111542
##$YMIN_p= -484096536
##$CURPLOT= <Network HP LaserJet P1505>
##$CURPRIN= <$Network HP LaserJet P1505>
##$DFORMAT= <normdp>
##$LAYOUT= <+/1D_H.xwp>
##$LFORMAT= <normlp>
##$PFORMAT= <normpl>
##$SURQMSG= 1
$$ End of Bruker specific parameters
$$ ---------------------------------
##NTUPLES= NMR SPECTRUM
##VAR_NAME=  FREQUENCY,     SPECTRUM/REAL,   SPECTRUM/IMAG
##SYMBOL=    X,             R,               I
##VAR_TYPE=  INDEPENDENT,   DEPENDENT,       DEPENDENT
##VAR_FORM=  AFFN,          ASDF,            ASDF
##VAR_DIM=   131072,        131072,          131072
##UNITS=     HZ,            ARBITRARY UNITS, ARBITRARY UNITS
##FACTOR=    0.0627417313425165, 1,          1
##FIRST=     8223.62146879498, -2108,        -106777
##LAST=      0,             2078,            -106750
##MIN=       0,             -484096536,      0
##MAX=       8223.62146879498, 478111542,    0
$$ Real data points
##PAGE= N=1
##DATA TABLE= (X++(R..R)), XYDATA
$$ [...]
$$ plain form
61973 1845919 1803624 1766017 1733564 1705639 1680910 1659000 1640323 1624095 1608122 1591182 1574135
61962 1574135 1557758 1540800 1521342 1499078 1475029 1449790 1423405 1396671 1371293 1348666 1329100
61951 1329100 1312234 1297735 1285756 1276978 1271918 1270084 1270516 1273412 1280332 1292143 1307603 1324668 1342300
61938 1342300 1360050 1376638 1390276 1400147 1406486 1409394 1408413 1402981 1392502 1376447 1355384 1331460
61926 1331460 1306566 1280214 1250568 1217594 1183966 1152672 1124934 1100614 1079228 1059867 1041344
61915 1041344 1023505 1007851 996120 988616 984437 982730 982982 984511 986557 988996 992571 998348 1007038
61902 1007038 1018622 1032416 1047681 1064418 1083385 1105280 1130136 1157606 1187423 1219431 1253697
61891 1253697 1291014 1332966 1380847 1434549 1492942 1555492 1623256 1698085 1780992 1871432 1968123
$$ packed form
61973A845919m2295l7607l2453k7925k4729k1910j8677j6228j5973j6940j7047
61962A574135j6377j6958j9458k2264k4049k5239k6385k6734k5378k2627j9566
61951A329100j6866j4499j1979q778n060j834M32K896O920J1811J5460J7065J7632
61938A342300J7750J6588J3638R871O339K908r81n432j0479j6055k1063k3924
61926A331460k4894k6352k9646l2974l3628l1294k7738k4320k1386j9361j8523
61915A041344j7839j5654j1731p504m179j707K52J529K046K439L575N777Q690
61902A007038J1584J3794J5265J6737J8967K1895K4856K7470K9817L2008L4266
61891A253697L7317M1952M7881N3702N8393O2550O7764P4829Q2907R0440R6691
$$ plain form
61880 1968123 2070108 2176655 2286326 2397086 2507812 2619089 2731638 2844199 2953856
61871 2953856 3058361 3157125 3249734 3334684 3410395 3476625 3533853 3581629 3618686 3644826 3661870
61860 3661870 3672571 3679251 3683937 3689365 3699190 3717047 3745475 3785711 3838349 3904074 3983544 4076510
61848 4076510 4181283 4295355 4416417 4542563 4671735 4801545 4929823 5055040 5176209
61839 5176209 5292954 5406122 5517960 5631185 5747707 5868163 5992031 6117304 6239888
61830 6239888 6353689 6451377 6524866 6565629 6566061 6521773 6432707 6301826 6133134 5931328 5702767
61819 5702767 5455730 5199337 4942140 4691005 4450309 4222149 4008065 3810528 3632045
61810 3632045 3473021 3331903 3207918 3102404 3016474 2948415 2894807 2853879 2826488 2814005
$$ packed form
61880A968123J01985J06547J09671J10760J10726J11277J12549J12561J09657
61871B953856J04505R8764R2609Q4950P5711O6230N7228M7776L7057K6140J7044
61860C661870J0701O680M686N428R825J7857K8428M0236N2638O5725P9470R2966
61848D076510J04773J14072J21062J26146J29172J29810J28278J25217J21169
61839E176209J16745J13168J11838J13225J16522J20456J23868J25273J22584
61830F239888J13801R7688P3489M0763M32m4288q9066j30881j68692k01806k28561
61819E702767k47037k56393k57197k51135k40696k28160k14084j97537j78483
61810C632045j59024j41118j23985j05514q5930o8059n3608m0928k7391j2483
$$ plain form
61800 2814005 2816672 2834272 2866974 2914710 2976534 3051483 3139565 3241087 3355293 3480217 3613581
61789 3613581 3753073 3895965 4039294 4180595 4317818 4448275 4568205 4673630 4761177 4827888
61779 4827888 4871188 4890153 4886817 4865534 4831010 4787529 4739832 4693348 4652605 4619960 4596517
61768 4596517 4583679 4582648 4592534 4609901 4630223 4648969 4661355 4662446 4648326 4616606 4565421 4492976
61756 4492976 4399021 4286174 4158574 4019375 3870450 3714440 3555840 3399460 3248361 3103758
61746 3103758 2966523 2838205 2720666 2615089 2521454 2438855 2366204 2302697 2247833 2201329
61736 2201329 2163116 2133218 2111459 2097355 2090306 2089703 2094944 2105757 2122525 2145765 2175102 2209442
61724 2209442 2248579 2294108 2348144 2411633 2484554 2567277 2660757 2765603 2882025 3010904 3154079
$$ packed form
61800B814005K667J7600L2702M7736O1824P4949Q8082J01522J14206J24924J33364
61789C613581J39492J42892J43329J41301J37223J30457J19930J05425Q7547O6711
61779D827888M3300J8965l336k1283l4524m3481m7697m6484m0743l2645k3443
61768D596517j2838j031R886J7367K0322J8746J2386J091j4120l1720n1185p2445
61756D492976r3955j12847j27600j39199j48925j56010j58600j56380j51099j44603
61746C103758j37235j28318j17539j05577r3635q2599p2651o3507n4864m6504
61736B201329l8213k9898k1759j4104p049o03N241J0813J6768K3240K9337L4340
61724B209442L9137M5529N4036O3489P2921Q2723R3480J04846J16422J28879J43175
$$ plain form
61713 3154079 3313344 3489841 3684736 3899735 4136384 4395210 4675992 4978608 5303175
61704 5303175 5649197 6014427 6393951 6779720 7160636 7522834 7849898 8123631 8326357
61695 8326357 8444290 8470087 8403392 8249878 8019763 7726294 7384396 7009513 6616321 6217175
61685 6217175 5821252 5435275 5064831 4714586 4387439 4084437 3805874 3551966 3322271
61676 3322271 3115090 2927992 2758722 2605435 2466620 2341255 2228745 2128342 2038829 1958961
61666 1958961 1887780 1824212 1766915 1715069 1668797 1628037 1591171 1555647 1519927 1484105 1448418
61655 1448418 1411997 1373572 1332854 1290546 1247257 1203215 1159041 1116056 1075337 1036869 1000139
61644 1000139 965271 932969 903377 875742 849546 825437 804453 786515 770195 753953 737263
$$ packed form
61713C154079J59265J76497J94895K14999K36649K58826K80782L02616L24567
61704E303175L46022L65230L79524L85769L80916L62198L27064K73733K02726
61695H326357J17933K5797o6695j53514k30115k93469l41898l74883l93192l99146
61685F217175l95923l85977l70444l50245l27147l03002k78563k53908k29695
61676C322271k07181j87098j69270j53287j38815j25365j12510j00403q9513p9868
61666A958961p1181o3568n7297n1846m6272m0760l6866l5524l5720l5822l5687
61655A448418l6421l8425m0718m2308m3289m4042m4174m2985m0719l8468l6730
61644A000139l4868l2302k9592k7635k6196k4109k0984j7938j6320j6242j6690
$$ plain form
61633 737263 720575 704623 689882 676401 663951 652365 641727 632142 623421 615103 606705 597965
61621 597965 589033 580453 572573 564870 556486 547700 540152 534998 531436 527989 524676 522690 522150 521598 519993
61606 519993 517984 516668 516118 515795 515492 515146 514573 514356 516402 522466 532141 543055 552989 561319 568756
61591 568756 576621 586374 598978 614258 631191 648931 667266 686057 704723 722458 738571 752367
61579 752367 763043 770139 773999 775339 774210 769836 761945 752009 742454 734427 727070 719469 712534 708022
61565 708022 706225 705902 706437 708638 712946 718002 721780 723324 722670 719781 714468 706859 697087 684787 669606
61550 669606 651934 632596 612237 591630 572051 554446 538526 523560 509819 498270 488900 480375
61538 480375 471687 463362 456735 452469 450093 448721 448048 448714 451450 455741 459881 462789 465139 467969 470867
$$ packed form
61633G37263j6688j5952j4741j3481j2450j1586j0638r585q721q318q398q740
61621E97965q932q580p880p703q384q786p548n154l562l447l313j986n40n52j605
61606E19993k009j316n50l23l03l46n73k17K046O064R675J0914R934Q330P437
61591E68756P865R753J2604J5280J6933J7740J8335J8791J8666J7735J6113J3796
61579G52367J0676P096L860J340j129m374p891r936r555q027p357p601o935m512
61565G08022j797l23N35K201M308N056L778J544o54k889n313p609r772j2300j5181
61550F69606j7672j9338k0359k0607j9579j7605j5920j4966j3741j1549r370q525
61538D80375q688q325o627m266k376j372o73O66K736M291M140K908K350K830K898
$$ plain form
61523 470867 472848 474690 478849 486707 497093 508029 518806 529783 541244 553380 566679 581357
61511 581357 596766 612201 627977 644925 662992 681092 698392 715185 732318 750030 767433
61500 767433 782976 795571 805469 813902 821701 828465 833317 836264 838518 841567 846076 851509 856628 860570
61486 860570 863658 867009 871251 875933 880313 884282 888160 891973 895497 898803 902181 905458 907794 908267
61472 908267 906449 902476 896938 890818 885327 881433 879370 878539 878152 878333 880620 886931 897802 911932
61458 911932 927662 944547 963221 984273 1007946 1034782 1065779 1101568 1141808 1185729 1233191
61447 1233191 1285081 1342536 1405746 1473611 1544882 1619638 1699123 1783879 1872599 1963194 2054258
61436 2054258 2144469 2230827 2308755 2374315 2425557 2461438 2480606 2482312 2468125 2441635 2406149
$$ packed form
61523D70867J981J842M159P858J0386J0936J0777J0977J1461J2136J3299J4678
61511E81357J5409J5435J5776J6948J8067J8100J7300J6793J7133J7712J7403
61500G67433J5543J2595R898Q433P799O764M852K947K254L049M509N433N119L942
61486H60570L088L351M242M682M380L969L878L813L524L306L378L277K336M73
61472I08267j818l973n538o120n491l894k063q31l87J81K287O311J0871J4130
61458I11932J5730J6885J8674K1052K3673K6836L0997L5789M0240M3921M7462
61447A233191N1890N7455O3210O7865P1271P4756P9485Q4756Q8720R0595R1064
61436B054258R0211Q6358P7928O5560N1242L5881J9168J706j4187k6490l5486
$$ plain form
61425 2406149 2363204 2313324 2257644 2198424 2138340 2079735 2024447 1973845 1928644 1888752 1853620
61414 1853620 1822992 1797258 1776912 1761807 1751172 1744266 1740634 1739646 1740239 1741405 1742812 1744770 1747840
61401 1747840 1752687 1759974 1769929 1782098 1795943 1811637 1829866 1850762 1873481 1896989 1920933 1945573
61389 1945573 1971236 1998225 2026958 2057658 2089830 2122396 2154483 2185878 2216590 2246275 2274228
61378 2274228 2299825 2322692 2342510 2358800 2370972 2378626 2381998 2382339 2381729 2382118 2384278 2387714 2391605
61365 2391605 2395743 2400494 2406051 2411909 2416917 2419608 2418516 2412558 2401450 2385774 2366587 2344903 2321485
61352 2321485 2296901 2271592 2245842 2219792 2193529 2167204 2141062 2115386 2090387 2066119 2042532
61341 2042532 2019701 1998053 1978373 1961420 1947397 1935844 1926274 1919132 1915956 1918471 1927568 1943298
$$ packed form
61425B406149m2945m9880n5680n9220o0084n8605n5288n0602m5201l9892l5132
61414A853620l0628k5734k0346j5105j0635o906l632r88N93J166J407J958L070
61401A747840M847P287R955J2169J3845J5694J8229K0896K2719K3508K3944K4640
61389A945573K5663K6989K8733L0700L2172L2566L2087L1395L0712K9685K7953
61378B274228K5597K2867J9818J6290J2172P654L372L41o10L89K160L436L891
61365B391605M138M751N557N858N008K691j092n958j1108j5676j9187k1684k3418
61352B321485k4584k5309k5750k6050k6263k6325k6142k5676k4999k4268k3587
61341B042532k2831k1648j9680j6953j4023j1553r570p142l176K515R097J5730
$$ plain form
61329 1943298 1965604 1994644 2030472 2072902 2121881 2177604 2239993 2308403 2382124 2460985 2545146
61318 2545146 2634575 2728924 2827327 2927444 3024825 3114255 3192316 3258319 3312586 3354360 3381848
61307 3381848 3393758 3390053 3371361 3338609 3293625 3239507 3179550 3115527 3047362 2974803 2899273
61296 2899273 2823759 2751007 2682528 2619558 2564115 2517950 2480569 2449504 2423020 2401777 2387196
61285 2387196 2378881 2374621 2372577 2372342 2373558 2374274 2371333 2362294 2346918 2327042 2305223 2283271 2261701
61272 2261701 2240328 2219231 2199251 2181827 2168403 2159510 2154102 2150214 2146820 2144820 2145603 2148849 2152501
61259 2152501 2154917 2156213 2157213 2157893 2157459 2155403 2151672 2146043 2138191 2128587 2118676 2109736 2101812 2094271
61245 2094271 2087249 2082057 2079904 2080523 2082516 2084826 2087297 2089639 2090581 2088653 2083588 2076316 2067455 2056153
$$ packed form
61329A943298K2306K9040L5828M2430M8979N5723O2389O8410P3721P8861Q4161
61318B545146Q9429R4349R8403J00117R7381Q9430P8061O6003N4267M1774K7488
61307C381848J1910l705j8692l2752m4984n4118n9957o4023o8165p2559p5530
61296B899273p5514p2752o8479o2970n5443m6165l7381l1065k6484k1243j4581
61285B387196q315m260k044k35J216P16k941r039j5376j9876k1819k1952k1570
61272B261701k1373k1097j9980j7424j3424q893n408l888l394k000P83L246L652
61259B152501K416J296J000O80m34k056l731n629p852r604r911q940p924p541
61245B094271p022n192k153O19J993K310K471K342R42j928n065p272q861j1302
$$ plain form
61231 2056153 2040558 2019411 1993473 1965644 1939401 1916626 1896951 1879378 1864088 1852119 1843777
61220 1843777 1838285 1834959 1833777 1834679 1837250 1841422 1847792 1856844 1868526 1883003 1901136 1923689 1950606
61207 1950606 1981556 2016618 2055951 2099372 2146889 2199008 2255778 2316020 2378452 2443225 2511240
61196 2511240 2581900 2652388 2719335 2780477 2834682 2881302 2920193 2951876 2976965 2995351 3006146
61185 3006146 3008499 3002458 2989045 2969398 2943782 2911583 2872159 2825304 2770876 2708781 2640047 2567530
61173 2567530 2494795 2424307 2357058 2293462 2233806 2177981 2125734 2077339 2033365 1993724 1957623
61162 1957623 1924490 1894146 1865871 1838117 1809570 1779835 1748832 1716331 1682657 1649134 1617110
61151 1617110 1586995 1558933 1533883 1513078 1496512 1482702 1469952 1457309 1444527 1431993 1420927
$$ packed form
61231B056153j5595k1147k5938k7829k6243k2775j9675j7573j5290j1969q342
61220A843777n492l326j182R02K571M172O370R052J1682J4477J8133K2553K6917
61207A950606L0950L5062L9333M3421M7517N2119N6770O0242O2432O4773O8015
61196B511240P0660P0488O6947O1142N4205M6620L8891L1683K5089J8386J0795
61185C006146K353o041j3413j9647k5616l2199l9424m6855n4428o2095o8734p2517
61173B567530p2735p0488o7249o3596n9656n5825n2247m8395m3974l9641l6101
61162A957623l3133l0344k8275k7754k8547k9735l1003l2501l3674l3523l2024
61151A617110l0115k8062k5050k0805j6566j3810j2750j2643j2782j2534j1066
$$ plain form
61140 1420927 1412804 1407994 1405247 1402834 1400035 1397469 1396532 1398865 1405889 1418109 1434781 1454615 1476834
61127 1476834 1501254 1527411 1554038 1579502 1602317 1621114 1634628 1642351 1645191 1645113 1643922 1642350 1640121
61114 1640121 1636733 1632208 1627040 1621066 1612404 1598241 1577345 1551425 1523317 1494189 1463440 1431047
61102 1431047 1398637 1367905 1339170 1312178 1287292 1265021 1245156 1227445 1212535 1201129 1192502
61091 1192502 1184937 1177569 1170992 1166237 1164143 1165584 1171212 1180642 1192592 1205787 1218945 1229920 1236057
61078 1236057 1235913 1229970 1219462 1205211 1187785 1167796 1145619 1121556 1096659 1072575 1050182 1029216
61066 1029216 1009611 992162 977206 963753 950958 939617 930938 924376 918000 910838 903595 897081
61054 897081 891046 884845 878354 871825 865493 859673 854772 850915 847849 845386 843705 843283 844802 848913
$$ packed form
61140A420927q123m810k747k413k799k566r37K333P024J2220J6672J9834K2219
61127A476834K4420K6157K6627K5464K2815J8797J3514P723K840p8j191j572k229
61114A640121l388m525n168n974q662j4163k0896k5920k8108k9128l0749l2393
61102A431047l2410l0732k8735k6992k4886k2271j9865j7711j4910j1406q627
61091A192502p565p368o577m755k094J441N628R430J1950J3195J3158J0975O137
61078A236057j44n943j0508j4251j7426j9989k2177k4063k4897k4084k2393k0966
61066A029216j9605j7449j4956j3453j2795j1341q679o562o376p162p243o514
61054H97081o035o201o491o529o332n820m901l857l066k463j681m22J519M111
$$ plain form
61040 848913 855511 863311 870778 877597 884699 892707 900783 907200 910640 910868 908531 904528 899331 892785
61026 892785 884738 875755 866831 858424 850166 841592 832879 824785 818080 812985 808948 805205 801786 799654
61012 799654 799434 800491 801859 803592 806231 809364 811976 814251 817690 823202 830343 838820 849300 861925
60998 861925 875226 887614 899000 909986 920387 929865 939213 949471 960205 970209 979698 990146
60986 990146 1001820 1013044 1022482 1030951 1040290 1051317 1063407 1075256 1085635 1094292 1102823 1113931
60974 1113931 1129164 1147739 1167954 1189061 1211370 1235359 1261488 1290247 1321551 1354538 1388744
60963 1388744 1425163 1465371 1509817 1557728 1608507 1662498 1720446 1782832 1849732 1920799 1995510
60952 1995510 2073866 2156730 2244919 2338091 2435118 2535605 2640601 2751808 2870400 2996448
$$ packed form
61040H48913O598P800P467O819P102Q008Q076O417L440K28k337m003n197o546
61026H92785q047q983q924q407q258q574q713q094o705n095m037l743l419k132
61012G99654k20J057J368J733K639L133K612K275L439N512P141Q477J0480J2625
60998H61925J3301J2388J1386J0986J0401R478R348J0258J0734J0004R489J0448
60986I90146J1674J1224R438Q469R339J1027J2090J1849J0379Q657Q531J1108
60974A113931J5233J8575K0215K1107K2309K3989K6129K8759L1304L2987L4206
60963A388744L6419M0208M4446M7911N0779N3991N7948O2386O6900P1067P4711
60952A995510P8356Q2864Q8189R3172R7027J00487J04996J11207J18592J26048
$$ plain form
60942 2996448 3129222 3268330 3414954 3571627 3740409 3921821 4116090 4324595 4548866
60933 4548866 4788644 5042311 5309265 5590572 5887204 6199254 6527833 6876958 7252801
60924 7252801 7661470 8107829 8595752 9129034 9712604 10353687 11062012 11849240 12728660
60915 12728660 13715352 14826184 16080061 17498914 19108475 20938707 23026152 25417376
60907 25417376 28166469 31324825 34936006 39042830 43677969 48794451 54152945 59273991
60899 59273991 63560764 66557667 68165135 68652762 68490741 68155730 68019415 68287296 68919021
60890 68919021 69567842 69656676 68621221 66180542 62446372 57816849 52768590 47696381
60882 47696381 42856781 38380762 34308420 30627860 27311884 24340373 21702190 19386343
$$ packed form
60942B996448J32774J39108J46624J56673J68782J81412J94269K08505K24271
60933D548866K39778K53667K66954K81307K96632L12050L28579L49125L75843
60924G252801M08669M46359M87923N33282N83570O41083P08325P87228Q79420
60915A2728660R86692J110832J253877J418853J609561J830232K087445K391224
60907B5417376K749093L158356L611181M106824M635139N116482N358494N121046
60899E9273991M286773K996903J607468M87627j62021l35011j36315K67881O31725
60890F8919021O48821Q8834j035455k440679l734170m629523n048259n072209
60882D7696381m839600m476019m072342l680560l315976k971511k638183k315847
$$ plain form
60874 19386343 17375669 15645788 14165578 12898533 11806791 10856499 10021099 9281267
60866 9281267 8622810 8034124 7504750 7025796 6590997 6196352 5838603 5514526 5221132
60857 5221132 4955049 4711413 4484424 4269413 4063788 3866227 3676260 3494691 3322844
60848 3322844 3160666 3006626 2859969 2721769 2592997 2472741 2359298 2252053 2151240
60839 2151240 2056688 1967911 1884823 1807169 1733628 1662620 1593992 1529114 1469251 1414370 1363419
60828 1363419 1315360 1269909 1227502 1188397 1151844 1116644 1082564 1050478 1020921 993326 967081
60817 967081 942454 919896 899192 879919 862028 845300 828953 812507 796404 781092 766196
60806 766196 751424 737571 725620 715393 706060 697534 690369 684602 679712 675418 671626 667758 663094
$$ packed form
60874A9386343k010674j729881j480210j267045j091742r50292q35400p39832
60866I281267o58457n88686n29374m78954m34799l94645l57749l24077k93394
60857E221132k66083k43636k26989k15011k05625j97561j89967j81569j71847
60848C322844j62178j54040j46657j38200j28772j20256j13443j07245j00813
60839B151240r4552q8777q3088p7654p3541p1008o8628o4878n9863n4881n0951
60828A363419m8059m5451m2407l9105l6553l5200l4080l2086k9557k7595k6245
60817I67081k4627k2558k0704j9273j7891j6728j6347j6446j6103j5312j4896
60806G66196j4772j3853j1951j0227r333q526p165n767m890m294l792l868m664
$$ plain form
60793 663094 657625 651908 646315 641117 636943 634303 632932 632347 632618 633800 635176 636160 637515 640412 644561
60778 644561 648561 651844 654913 657776 659760 660975 662265 663233 661907 657382 651544 647096 644715 643215
60764 643215 641873 641344 642418 644910 648093 651658 655819 660500 664782 667664 669485 671925 676046 680944
60750 680944 685214 689146 694148 700228 705638 709307 712064 714814 716916 717390 716607 715455 713585 709837 704147
60735 704147 697777 691638 685385 678417 671089 664456 659055 654137 648164 640234 631115 622715 616465 612413
60721 612413 609688 607215 603997 599575 594659 590670 588281 587036 586624 587484 589438 590861 590603 590138 592371
60706 592371 598330 606237 613770 619966 624734 628024 630344 633171 637768 643951 650692 657545 664700 671917
60692 671917 678292 683186 686755 689410 691340 692823 694453 696573 698851 700838 702607 704042 703658 699197
$$ packed form
60793F63094n469n717n593n198m174k640j371n85K71J182J376R84J355K897M149
60778F44561M000L283L069K863J984J215J290R68j326m525n838m448k381j500
60764F43215j342n29J074K492L183L565M161M681M282K882J821K440M121M898
60750F80944M270L932N002O080N410L669K757K750K102M74p83j152j870l748n690
60735G04147o370o139o253o968p328o633n401m918n973p930r119q400o250m052
60721F12413k725k473l218m422m916l989k389j245m12Q60J954J423k58m65K233
60706E92371N959P907P533O196M768L290K320K827M597O183O741O853P155P217
60692F71917O375M894L569K655J930J483J630K120K278J987J769J435l84m461
$$ plain form
60678 699197 689936 677780 665401 653729 641920 629270 616101 602874 589660 576816 565176 555008
60666 555008 545540 536028 526576 517341 507948 498673 491334 487436 485677 482845 477421 470963 465570 461400
60652 461400 457510 453902 451320 449659 447972 445936 444066 442435 440288 437284 434151 431619 429601 427974
60638 427974 427327 428098 429613 431028 432762 435752 439373 441505 441135 439746 439406 440414 441786 443294 445634
60623 445634 448801 451687 453676 455580 458391 461858 465062 467964 471608 476915 483915 492115 500954 509727
60609 509727 517715 524805 531665 538900 546397 554059 562902 574428 588598 603216 615947 626397 635546
60596 635546 643746 650506 656078 661778 668208 674372 679353 683939 689409 695211 699140 699787 697850 694931
60582 694931 691920 688783 685088 680274 673896 666051 657353 648273 638860 629337 620663 614087 610125 608059
$$ packed form
60678F99197r261j2156j2379j1672j1809j2650j3169j3227j3214j2844j1640j0168
60666E55008r468r512r452r235r393r275p339l898j759k832n424o458n393m170
60652D61400l890l608k582j661j687k036j870j631k147l004l133k532k018j627
60638D27974o47P71J515J415J734K990L621K132l70j389l40J008J372J508K340
60623D45634L167K886J989J904K811L467L204K902L644N307P000Q200Q839Q773
60609E09727P988P090O860P235P497P662Q843J1526J4170J4618J2731J0450R149
60596F35546Q200O760N572N700O430O164M981M586N470N802L929O47j937k919
60582F94931l011l137l695m814o378p845q698r080r413r523q674o576l962k066
$$ plain form
60568 608059 606514 604586 602547 601369 601635 603171 605694 609140 613010 616068 617557 618453 620750 625520 632248
60553 632248 639769 647206 654231 661354 669842 680403 691964 702717 712482 722949 735405 749440 764334
60540 764334 780382 797830 815460 831390 844912 856594 866969 875994 883452 888892 891241 889364
60528 889364 883211 873826 862153 848366 832502 815169 797356 779894 763432 748767 736708 727294
60516 727294 719209 710515 700517 690668 683061 678046 674013 669586 665191 662127 660953 661363 662907 664944
60502 664944 666381 666488 665904 666132 668041 671460 676101 682011 688899 695636 700982 704791 708305 713232 720410
60487 720410 729323 738879 748496 758109 767407 775927 784183 793870 806285 820978 836572 852523 869484
60474 869484 888383 909880 934404 961805 991065 1021205 1052562 1086702 1125147 1168795 1218316
$$ packed form
60568F08059j545j928k039j178K66J536K523L446L870L058J489Q96K297M770O728
60553F32248P521P437P025P123Q488J0561J1561J0753R765J0467J2456J4035J4894
60540G64334J6048J7448J7630J5930J3522J1682J0375R025P458N440K349j877
60528H89364o153r385j1673j3787j5864j7333j7813j7462j6462j4665j2059r414
60516G27294q085q694r998r849p607n015m033m427m395l064j174M10J544K037
60502F64944J437J07n84K28J909L419M641N910O888O737N346L809L514M927P178
60487G20410Q913R556R617R613R298Q520Q256R687J2415J4693J5594J5951J6961
60474H69484J8899K1497K4524K7401K9260L0140L1357L4140L8445M3648M9521
$$ plain form
60463 1218316 1274149 1335991 1403138 1475764 1555335 1643595 1741647 1850083 1968975 2096978 2230676
60452 2230676 2365358 2496333 2619286 2729733 2822824 2894077 2940508 2961365 2957844 2932009 2885928
60441 2885928 2821939 2743555 2655669 2563680 2472436 2385741 2306371 2236357 2177353 2130553 2096103
60430 2096103 2073010 2060404 2058937 2070348 2095534 2133595 2182804 2241570 2307841 2378049 2447369
60419 2447369 2510970 2564830 2605934 2632632 2645049 2644751 2633810 2614395 2589101 2561083 2533341 2507950
60407 2507950 2486228 2469595 2459913 2458850 2467207 2485267 2513741 2553985 2607243 2674269 2756056 2854453
60395 2854453 2971358 3107555 3263174 3439495 3639524 3866342 4121460 4405395 4719401
60386 4719401 5065770 5446356 5861391 6309599 6788035 7290139 7803226 8307948 8780340
$$ packed form
60463A218316N5833O1842O7147P2626P9571Q8260R8052J08436J18892J28003J33698
60452B230676J34682J30975J22953J10447R3091P1253M6431K0857l521k5835m6081
60441B885928o3989p8384q7886r1989r1244q6695p9370p0014n9004m6800l4450
60430B096103k3093j2606j467J1411K5186L8061M9209N8766O6271P0208O9320
60419B447369O3601N3860M1104K6698J2417k98j0941j9415k5294k8018k7742k5391
60407B507950k1722j6633r682j063Q357J8060K8474M0244N3258O7026Q1787R8397
60395B854453J16905J36197J55619J76321K00029K26818K55118K83935L14006
60386D719401L46369L80586M15035M48208M78436N02104N13087N04722M72392
$$ plain form
60377 8780340 9194592 9525232 9749525 9850906 9822125 9665895 9393191 9021309 8572516 8071937
60367 8071937 7543976 7009124 6482986 5976945 5498739 5052887 4641784 4266899 3928656
60358 3928656 3625459 3353808 3109863 2890659 2693889 2517413 2359526 2219157 2095022
60349 2095022 1984731 1885357 1794901 1712679 1638221 1570440 1508154 1450815 1398120 1349191 1302881
60338 1302881 1258976 1218459 1182221 1149993 1120887 1094523 1070987 1049906 1030246 1011095 992155
60327 992155 973494 955376 938339 922833 908632 895130 882279 870529 859804 849447 839584 831476
60315 831476 825794 821312 816331 810802 805954 802171 798449 793934 788885 783806 778560 772744 766296 759356
60301 759356 751980 744322 736740 729425 722232 715045 707986 701150 694394 687503 680371 673097 666162 660306
$$ packed form
60377H780340M14252L30640K24293J01381k8781j56230k72704l71882m48793n00579
60367H071937n27961n34852n26138n06041m78206m45852m11103l74885l38243
60358C928656l03197k71651k43945k19204j96770j76476j57887j40369j24135
60349B095022j10291r9374r0456q2222p4458o7781o2286n7339n2695m8929m6310
60338A302881m3905m0517l6238l2228k9106k6364k3536k1081j9660j9151j8940
60327I92155j8661j8118j7037j5506j4201j3502j2851j1750j0725j0357r863q108
60315H31476n682m482m981n529m848l783l722m515n049n079n246n816o448o940
60301G59356p376p658p582p315p193p187p059o836o756o891p132p274o935n856
$$ plain form
60287 660306 655789 652004 648313 644998 642671 640933 638658 635674 633195 632313 632990 634973 638530 643367 647586
60272 647586 648968 647313 644771 643887 645710 649561 653950 657677 660581 663433 667009 671337 675894 680210
60258 680210 684046 687419 690832 695008 699818 703819 705573 705328 704738 705012 706005 707109 708316 710139 713036
60243 713036 717138 722057 726722 729832 730769 729725 726813 721702 714489 706370 698722 691737 684514 676312
60229 676312 667204 657744 648702 641073 635523 631570 627938 624065 620694 618644 617578 616528 615162 613865
60215 613865 612926 612408 612636 614049 616560 619797 623929 629422 635807 641562 645680 648685 651581 654507 657169
60200 657169 660192 665168 673282 684211 696257 707313 716126 723221 730498 739525 750340 762070 774234
60187 774234 786920 800245 814463 830384 848823 869632 892005 915744 941480 969576 999591
$$ packed form
60287F60306m517l785l691l315k327j738k275k984k479q82O77J983L557M837M219
60272F47586J382j655k542q84J823L851M389L727K904K852L576M328M557M316
60258F80210L836L373L413M176M810M001J754k45n90K74R93J104J207J823K897
60243G13036M102M919M665L110R37j044k912n111p213q119p648o985p223q202
60229F76312r108r460r042p629n550l953l632l873l371k050j066j050j366j297
60215F13865r39n18K28J413K511L237M132N493O385N755M118L005K896K926K662
60200F57169L023M976Q114J0929J2046J1056Q813P095P277R027J0815J1730J2164
60187G74234J2686J3325J4218J5921J8439K0809K2373K3739K5736K8096L0015
$$ plain form
60176 999591 1031115 1064551 1100783 1140469 1183674 1229534 1276133 1321512 1365273 1408709 1453003
60165 1453003 1497737 1541416 1582802 1621271 1656548 1688877 1719008 1747088 1771676 1790696 1803527
60154 1803527 1811484 1816095 1817696 1816178 1812433 1808078 1803874 1799414 1794778 1791689 1792158 1796328 1802686 1810515
60140 1810515 1821196 1836704 1857726 1883910 1915080 1951013 1990478 2031930 2075368 2122344 2173665
60129 2173665 2227897 2282575 2336105 2387888 2437301 2483363 2525037 2561207 2590653 2612680 2627642
60118 2627642 2636236 2638468 2633953 2623189 2607836 2589544 2569089 2547044 2524877 2504744 2488183 2475473
60106 2475473 2466566 2462418 2464959 2475729 2494872 2521780 2556444 2599767 2652488 2714086 2782752 2856189
60094 2856189 2932218 3008683 3082854 3151111 3209593 3255425 3287278 3304825 3308114 3297891 3276041
$$ packed form
60176I99591L1524L3436L6232L9686M3205M5860M6599M5379M3761M3436M4294
60165A453003M4734M3679M1386L8469L5277L2329L0131K8080K4588J9020J2831
60154A803527P957M611J601j518l745m355m204m460m636l089M69M170O358P829
60140A810515J0681J5508K1022K6184L1170L5933L9465M1452M3438M6976N1321
60129B173665N4232N4678N3530N1783M9413M6062M1674L6170K9446K2027J4962
60118B627642Q594K232m515j0764j5353j8292k0455k2045k2167k0133j6561j2710
60106B475473q907m148K541J0770J9143K6908L4664M3323N2721O1598O8666P3437
60094B856189P6029P6465P4171O8257N8482M5832L1853J7547L289j0223k1850
$$ plain form
60083 3276041 3245011 3206774 3162797 3114883 3065437 3016841 2971161 2930554 2897310 2873077 2858225
60072 2858225 2852167 2854197 2864187 2882844 2911261 2949963 2998607 3056992 3125895 3206158 3297347 3398365
60060 3398365 3509226 3630803 3762615 3902253 4047662 4198618 4354758 4513042 4668372
60051 4668372 4816089 4952732 5074893 5178930 5262027 5322598 5359542 5372066 5360375 5325634
60041 5325634 5268922 5190975 5093263 4978607 4850415 4712022 4567239 4420802 4277340 4139989
60031 4139989 4010513 3890499 3781728 3685362 3601575 3530394 3472481 3428699 3399170 3383168 3379581
60020 3379581 3386815 3402380 3423498 3448620 3477739 3510572 3544793 3576765 3603856 3625398 3641542
60009 3641542 3652105 3656881 3656444 3652154 3645536 3637702 3628944 3618613 3605776 3590318 3573452 3557269 3544029
$$ packed form
60083C276041l1030l8237m3977m7914m9446m8596m5680m0607l3244k4233j4852
60072B858225o058K030R990J8657K8417L8702M8644N8385O8903Q0263R1189J01018
60060C398365J10861J21577J31812J39638J45409J50956J56140J58284J55330
60051D668372J47717J36643J22161J04037Q3097O0571L6944J2524j1691l4741
60041E325634n6712p7947r7712j14656j28192j38393j44783j46437j43462j37351
60031D139989j29476j20014j08771r6366q3787p1181n7913m3782k9529j6002l587
60020C379581P234J5565K1118K5122K9119L2833L4221L1972K7091K1542J6144
60009C641542J0563M776m37m290o618p834q758j0331j2837j5458j6866j6183j3240
$$ plain form
59996 3544029 3535589 3532733 3534862 3540933 3551109 3567135 3590759 3621938 3658589 3697667 3736403 3772934
59984 3772934 3806000 3833978 3854501 3865626 3867268 3860891 3848049 3830161 3809508 3788835 3769306 3749960
59972 3749960 3729953 3710289 3692387 3675760 3658215 3637788 3613455 3584423 3549983 3510010 3464786
59961 3464786 3414453 3359320 3300404 3238769 3174558 3107513 3038339 2968695 2900082 2833622 2770799
59950 2770799 2713218 2661466 2615214 2574800 2541814 2517633 2502101 2494196 2493529 2500624 2516073 2539961
59938 2539961 2572069 2612275 2660569 2716564 2778942 2845592 2914599 2984986 3056184 3126951 3195153
59927 3195153 3258454 3314784 3362316 3399653 3426132 3441550 3445466 3437161 3416511 3384688 3343984 3297017
59915 3297017 3245809 3191245 3133515 3073415 3013090 2955238 2901937 2854673 2815003 2784295 2762821
$$ packed form
59996C544029q440k856K129O071J0176J6026K3624L1179L6651L9078L8736L6531
59984C772934L3066K7978K0523J1125J642o377j2842j7888k0653k0673j9529j9346
59972C749960k0007j9664j7902j6627j7545k0427k4333k9032l4440l9973m5224
59961C464786n0333n5133n8916o1635o4211o7045o9174o9644o8613o6460o2823
59950B770799n7581n1752m6252m0414l2986k4181j5532p905o67P095J5449K3888
59938B539961L2108M0206M8294N5995O2378O6650O9007P0387P1198P0767O8202
59927C195153O3301N6330M7532L7337K6479J5418L916q305k0650l1823m0704m6967
59915C297017n1208n4564n7730o0100o0325n7852n3301m7264l9670l0708k1474
$$ plain form
59904 2762821 2749866 2744763 2747119 2756086 2770414 2789820 2815628 2849292 2890466 2936897 2986117 3036857
59892 3036857 3088803 3141356 3192955 3241837 3287245 3329469 3368544 3403507 3433390 3458548 3480315
59881 3480315 3499607 3516597 3531689 3546050 3560984 3577450 3596537 3619959 3649787 3687870 3735566
59870 3735566 3793649 3862403 3942169 4033887 4138707 4256822 4386717 4525422 4669259 4814510
59860 4814510 4957758 5095378 5222419 5332434 5419294 5479183 5510267 5510887 5479551 5417235 5328615
59849 5328615 5220023 5096513 4961420 4818180 4671472 4526303 4386346 4253295 4127723
59840 4127723 4010586 3904047 3810774 3732413 3668916 3619361 3583083 3559711 3548365 3547388 3555322
59829 3555322 3572199 3599469 3638143 3686904 3742419 3801443 3861807 3921077 3975371 4020743 4055253
$$ packed form
59904B762821j2955n103K356Q967J4328J9406K5808L3664M1174M6431M9220N0740
59892C036857N1946N2553N1599M8882M5408M2224L9075L4963K9883K5158K1767
59881C480315J9292J6990J5092J4361J4934J6466J9087K3422K9828L8083M7696
59870C735566N8083O8754P9766R1718J04820J18115J29895J38705J43837J45251
59860D814510J43248J37620J27041J10015Q6860N9889L1084O20l1336o2316q8620
59849E328615j08592j23510j35093j43240j46708j45169j39957j33051j25572
59840D127723j17137j06539r3273p8361o3497m9555l6278k3372j1346r77P934
59829C555322J6877K7270L8674M8761N5515N9024O0364N9270N4294M5372L4510
$$ plain form
59818 4055253 4078280 4087797 4079767 4050834 4000825 3932344 3848972 3754399 3652066 3544276 3431994
59807 3431994 3316457 3200677 3088355 2981341 2878999 2780128 2684577 2592740 2504515 2419872
59797 2419872 2340128 2267621 2203667 2147418 2097249 2052800 2014897 1983702 1958040 1936940 1920821
59786 1920821 1910304 1904493 1901484 1900276 1901095 1903964 1908201 1913603 1920943 1930604 1941612 1952851 1964572
59773 1964572 1977693 1991956 2005805 2018256 2030047 2042574 2056179 2069829 2082045 2091542 2097021 2097151
59761 2097151 2091450 2081142 2068711 2056465 2045713 2037094 2030958 2027223 2025540 2025938 2028532 2031883 2032476
59748 2032476 2027083 2015712 2001463 1987806 1976940 1970391 1969374 1973583 1980343 1985826 1987091 1983209 1975410
59735 1975410 1966500 1959226 1954420 1950989 1947823 1944931 1942328 1938880 1933397 1926559 1920778 1918051 1918536 1921279
$$ packed form
59818D055253K3027R517q030k8933n0009o8481q3372r4573j02333j07790j12282
59807C431994j15537j15780j12322j07014j02342r8871r5551r1837q8225q4643
59797B419872p9744p2507o3954n6249n0169m4449l7903l1195k5662k1100j6119
59786A920821j0517n811l009j208Q19K869M237N402P340R661J1008J1239J1721
59773A964572J3121J4263J3849J2451J1791J2527J3605J3650J2216R497N479J30
59761B097151n701j0308j2431j2246j0752q619o136l735j683L98K594L351N93
59748B032476n393j1371j4249j3657j0866o549j017M209O760N483J265l882p799
59735A975410q910p274m806l431l166k892k603l448n483o838n781k727M85K743
$$ plain form
59721 1921279 1925830 1932921 1943861 1959610 1980570 2007152 2040125 2080123 2127197 2181318 2243003 2312775
59709 2312775 2390268 2474816 2566892 2667954 2778636 2898060 3025028 3158471 3295642 3430540
59699 3430540 3554953 3660682 3740580 3788942 3802781 3783122 3734499 3663177 3575923 3479483 3379905
59688 3379905 3282083 3190018 3106825 3033782 2970036 2914405 2867337 2830354 2803961 2787129 2778696
59677 2778696 2778176 2785101 2798721 2818807 2845982 2880809 2923140 2972793 3030366 3096891 3172950 3258395
59665 3258395 3352749 3455734 3567782 3690245 3824838 3972651 4133882 4308624 4497629 4702064
59655 4702064 4922777 5159961 5413214 5681519 5963186 6256177 6558594 6868539 7183088
59646 7183088 7497421 7805533 8102508 8386333 8657517 8917285 9166635 9406932 9640280
$$ packed form
59721A921279M551P091J0940J5749K0960K6582L2973L9998M7074N4121O1685O9772
59709B312775P7493Q4548R2076J01062J10682J19424J26968J33443J37171J34898
59699C430540J24413J05729P9898M8362J3839j9659m8623p1322q7254r6440r9578
59688C379905r7822r2065q3193p3043o3746n5631m7068l6983k6393j6832q433
59677B778696n20O925J3620K0086K7175L4827M2331M9653N7573O6525P6059Q5445
59665C258395R4354J02985J12048J22463J34593J47813J61231J74742J89005K04435
59655D702064K20713K37184K53253K68305K81667K92991L02417L09945L14549
59646G183088L14333L08112K96975K83825K71184K59768K49350K40297K33348
$$ plain form
59637 9640280 9868468 10091717 10308893 10518578 10719358 10909035 11083936 11239181 11369743
59628 11369743 11471780 11543522 11585085 11597534 11582525 11542922 11483235 11408895 11325264 11237525 11151051
59617 11151051 11071273 11003303 10951885 10921173 10913945 10931324 10973984 11043562 11142415 11272298 11433819
59606 11433819 11626709 11849480 12098735 12369686 12657424 12956598 13259281 13553919 13827003
59597 13827003 14065321 14256352 14387594 14447176 14425974 14319648 14129768 13863931 13534332 13154682
59587 13154682 12737500 12294196 11837083 11379818 10934769 10510024 10109139 9733217 9382503
59578 9382503 9056322 8752402 8466572 8192747 7923300 7650439 7368230 7073871 6767675
59569 6767675 6452679 6134286 5819140 5513246 5220941 4945427 4689224 4453358 4236830
$$ packed form
59637I640280K28188K23249K17176K09685K00780J89677J74901J55245J30562
59628A1369743J02037P1742M1563J2449j5009l9603n9687p4340q3631q7739q6474
59617A1151051p9778o7970n1418l0712p228J7379M2660O9578R8853J29883J61521
59606A1433819J92890K22771K49255K70951K87738K99174L02683K94638K73084
59597A3827003K38318J91031J31242N9582k1202j06326j89880k65837l29599l79650
59587A3154682m17182m43304m57113m57265m45049m24745m00885l75922l50714
59578I382503l26181l03920k85830k73825k69447k72861k82209k94359l06196
59569F767675l14996l18393l15146l05894k92305k75514k56203k35866k16528
$$ plain form
59560 4236830 4038010 3856379 3692169 3544743 3412459 3294010 3188648 3095018 3011049 2935438
59550 2935438 2868115 2808642 2755202 2706008 2660848 2620251 2583625 2549266 2515934 2483484 2451977
59539 2451977 2420916 2389519 2357215 2323734 2288939 2252675 2214691 2174898 2133744 2092111 2050849
59528 2050849 2010794 1973078 1938636 1907174 1877532 1849536 1824683 1804388 1788363 1775449 1765147
59517 1765147 1757181 1750352 1743457 1737390 1734939 1737968 1745569 1755311 1765562 1776313 1788426 1802483 1818093
59504 1818093 1834136 1850113 1867228 1887532 1911764 1938534 1965955 1993666 2022990 2055442 2091397
59493 2091397 2130080 2170663 2213408 2259657 2310595 2366255 2426115 2490475 2560602 2637395 2720475
59482 2720475 2808868 2902257 3001139 3105821 3215481 3328259 3442219 3556217 3669753 3782042
$$ packed form
59560D236830j98820j81631j64210j47426j32284j18449j05362r3630q3969p5611
59550B935438o7323n9473n3440m9194m5160m0597l6626l4359l3332l2450l1507
59539B451977l1061l1397l2304l3481l4795l6264l7984l9793m1154m1633m1262
59528B050849m0055l7716l4442l1462k9642k7996k4853k0295j6025j2914j0302
59517A765147p966o829o895o067k451L029P601R742J0251J0751J2113J4057J5610
59504A818093J6043J5977J7115K0304K4232K6770K7421K7711K9324L2452L5955
59493B091397L8683M0583M2745M6249N0938N5660N9860O4360P0127P6793Q3080
59482B720475Q8393R3389R8882J04682J09660J12778J13960J13998J13536J12289
$$ plain form
59472 3782042 3891395 3995352 4090805 4173799 4240110 4287266 4316204 4330260 4332347 4323482 4303996
59461 4303996 4275125 4238714 4195846 4146767 4092441 4035674 3980207 3928767 3882178 3840318 3803687
59450 3803687 3774053 3754062 3746431 3753108 3774626 3810272 3859193 3921242 3996413 4083738 4181102 4285607
59438 4285607 4393124 4497711 4592733 4673015 4735074 4775291 4789492 4775302 4733859 4668077 4579985
59427 4579985 4470934 4343817 4203735 4056542 3907580 3761377 3621234 3488876 3365255
59418 3365255 3251605 3149086 3057797 2977341 2908320 2852143 2809147 2777956 2757129 2746630 2747199
59407 2747199 2758850 2780395 2810139 2846943 2890981 2943355 3004450 3072748 3145914 3222732 3302795
59396 3302795 3384032 3461803 3531236 3589829 3637072 3672051 3692285 3694793 3677778 3641390 3587446
$$ packed form
59472C782042J09353J03957R5453Q2994O6311M7156K8938J4056K087q865j9486
59461D303996k8871l6411m2868m9079n4326n6767n5467n1440m6589m1860l6631
59450C803687k9634j9991p631O677K1518L5646M8921O2049P5171Q7325R7364J04505
59438D285607J07517J04587R5022Q0282O2059M0217J4201j4190m1443o5782q8092
59427D579985j09051j27117j40082j47193j48962j46203j40143j32358j23621
59418C365255j13650j02519r1289q0456o9021n6177m2996l1191k0827j0499N69
59407B747199J1651K1545K9744L6804M4038N2374O1095O8298P3166P6818Q0063
59396C302795Q1237P7771O9433N8593M7243L4979K0234K508j7015l6388n3944
$$ plain form
59385 3587446 3518688 3438059 3348288 3251592 3149392 3042535 2932410 2821947 2714932 2613966
59375 2613966 2519308 2429899 2345313 2266588 2195417 2132686 2077722 2028873 1984991 1946332 1913869
59364 1913869 1887791 1866912 1849563 1834831 1822948 1814711 1810746 1811254 1816394 1826622 1842314 1863070
59352 1863070 1887792 1915608 1946517 1981219 2020698 2065585 2114752 2164199 2208567 2244796 2274029
59341 2274029 2299721 2324901 2351891 2383168 2420698 2464722 2514378 2569045 2627649 2687031 2742930
59330 2742930 2793238 2839456 2884843 2932181 2983318 3039424 3100866 3167340 3238454 3313808 3392848
59319 3392848 3475589 3563436 3658256 3760633 3869906 3985635 4107767 4235482 4367612 4504642
59309 4504642 4648859 4801929 4963577 5133201 5311248 5498041 5692692 5894619 6105373
$$ packed form
59385C587446o8758q0629q9771r6696j02200j06857j10125j10463j07015j00966
59375B613966r4658q9409q4586p8725p1171o2731n4964m8849m3882l8659l2463
59364A913869k6078k0879j7349j4732j1883q237l965N08N140J0228J5692K0756
59352A863070K4722K7816L0909L4702L9479M4887M9167M9447M4368L6229K9233
59341B274029K5692K5180K6990L1277L7530M4024M9656N4667N8604N9382N5899
59330B742930N0308M6218M5387M7338N1137N6106O1442O6474P1114P5354P9040
59319C392848Q2741Q7847R4820J02377J09273J15729J22132J27715J32130J37030
59309D504642J44217J53070J61648J69624J78047J86793J94651K01927K10754
$$ plain form
59300 6105373 6327480 6561565 6805468 7055792 7309422 7563619 7815451 8061297 8296990
59291 8296990 8518788 8724442 8913059 9084099 9237261 9373121 9492584 9595286 9679696 9745203
59281 9745203 9792651 9821915 9830175 9813636 9769684 9695949 9588446 9443091 9259357 9041317 8795226
59270 8795226 8527437 8244482 7953308 7660313 7370808 7089795 6822388 6572548 6341638
59261 6341638 6128636 5931671 5749287 5580697 5425389 5282653 5151374 5030240 4918049
59252 4918049 4813763 4716402 4625023 4538704 4456475 4377394 4300716 4225734 4151353 4076170 3999294
59241 3999294 3921001 3842494 3765074 3689437 3615434 3542508 3470641 3400770 3333850 3269681 3207364
59230 3207364 3146858 3089193 3035035 2984094 2936414 2893151 2855243 2822130 2792897 2768129 2749449
$$ packed form
59300F105373K22107K34085K43903K50324K53630K54197K51832K45846K35693
59291H296990K21798K05654J88617J71040J53162J35860J19463J02702Q4410O5507
59281I745203M7448K9264Q260j6539m3952p3735j07503j45355j83734k18040k46091
59270H795226k67789k82955k91174k92995k89505k81013k67407k49840k30910
59261F341638k13002j96965j82384j68590j55308j42736j31279j21134j12191
59252D918049j04286r7361r1379q6319q2229p9081p6678p4982p4381p5183p6876
59241C999294p8293p8507p7420p5637p4003p2926p1867o9871o6920o4169o2317
59230C207364o0506n7665n4158n0941m7680m3263l7908l3113k9233k4768j8680
$$ plain form
59219 2749449 2737491 2731602 2731662 2738945 2754496 2777469 2805926 2839023 2877614 2922578 2973160 3027438
59207 3027438 3084162 3143504 3205743 3269588 3332158 3390558 3443361 3490775 3533291 3569314 3593612
59196 3593612 3598949 3580607 3539626 3481302 3411179 3333376 3251856 3171014 3094209 3022887 2957837
59185 2957837 2900277 2851053 2809731 2775386 2747796 2727300 2714123 2708280 2709501 2716863 2729293 2746899
59173 2746899 2770786 2800982 2835559 2872654 2912383 2955775 3002837 3053038 3106960 3165800 3229327
59162 3229327 3295830 3364343 3435902 3512289 3594484 3682734 3777381 3878925 3987450 4102489 4223645
59151 4223645 4351318 4486530 4629776 4780227 4936669 5099025 5268066 5443418 5622804
59142 5622804 5803587 5983805 6160742 6329297 6482872 6615378 6721544 6796152 6834788 6835743
$$ packed form
59219B749449j1958n889O0P283J5551K2973K8457L3097L8591M4964N0582N4278
59207C027438N6724N9342O2239O3845O2570N8400N2803M7414M2516L6023K4298
59196C593612N337j8342m0981n8324p0123p7803q1520q0842p6805p1322o5050
59185B957837n7560m9224m1322l4345k7590k0496j3177n843J221P362J2430J7606
59173B746899K3887L0196L4577L7095L9729M3392M7062N0201N3922N8840O3527
59162C229327O6503O8513P1559P6387Q2195Q8250R4647J01544J08525J15039J21156
59151D223645J27673J35212J43246J50451J56442J62356J69041J75352J79386
59142E622804J80783J80218J76937J68555J53575J32506J06166P4608L8636R55
$$ plain form
59132 6835743 6800347 6731207 6630814 6501916 6348462 6175670 5989376 5795372 5599106 5405621
59122 5405621 5219214 5042618 4876614 4721200 4577283 4446607 4330034 4226938 4136516 4058450
59112 4058450 3991617 3933451 3881680 3835885 3796306 3761871 3730501 3700737 3672046 3644173 3617289
59101 3617289 3592169 3569082 3546955 3524670 3502403 3480307 3456577 3428557 3395600 3359250 3320702
59090 3320702 3279668 3235880 3190119 3143219 3095224 3045924 2995250 2942930 2888782 2833676 2779322
59079 2779322 2726976 2677305 2631431 2590787 2555620 2524805 2497540 2474027 2454143 2436827 2421566
59068 2421566 2409323 2400945 2395405 2390737 2386390 2383818 2385025 2391080 2401804 2416398 2434567 2457324 2486237
59055 2486237 2521370 2560272 2599605 2637782 2675668 2714851 2755688 2797210 2838512 2879588 2920371
$$ packed form
59132F835743l5396o9140j00393j28898j53454j72792j86294j94004j96266j93485
59122E405621j86407j76596j66004j55414j43917j30676j16573j03096r0422p8066
59112D058450o6833n8166n1771m5795l9579l4435l1370k9764k8691k7873k6884
59101C617289k5120k3087k2127k2285k2267k2096k3730k8020l2957l6350l8548
59090C320702m1034m3788m5761m6900m7995m9300n0674n2320n4148n5106n4354
59079B779322n2346m9671m5874m0644l5167l0815k7265k3513j9884j7316j5261
59068B421566j2243q378n540m668m347k572J207O055J0724J4594J8169K2757K8913
59055B486237L5133L8902L9333L8177L7886L9183M0837M1522M1302M1076M0783
$$ plain form
59044 2920371 2959334 2993949 3022712 3045810 3063248 3073392 3074675 3068359 3058284 3047929 3038857 3032024
59032 3032024 3029145 3032091 3041791 3058159 3080203 3105638 3131211 3154163 3173051 3186692 3192913 3189013
59020 3189013 3173259 3145430 3106101 3055760 2994596 2922908 2841839 2753711 2661484 2567794 2474567
59009 2474567 2383224 2294788 2209851 2128928 2052700 1981518 1915020 1853099 1797064 1748779 1708361
58998 1708361 1673707 1642753 1615379 1592629 1574912 1561916 1553745 1551023 1553829 1561310 1572620 1587646
58986 1587646 1606310 1627313 1648135 1666616 1682484 1697125 1711911 1727117 1742531 1758652 1777069
58975 1777069 1800102 1830289 1869630 1918651 1976484 2042247 2115731 2195894 2279160 2360177 2434115
58964 2434115 2497178 2545228 2573851 2581020 2569075 2543144 2507747 2465270 2417177 2365653 2313757
$$ packed form
59044B920371L8963L4615K8763K3098J7438J0144J283o316j0075j0355r072o833
59032C032024k879K946R700J6368K2044K5435K5573K2952J8888J3641O221l900
59020C189013j5754k7829l9329n0341o1164p1688q1069q8128r2227r3690r3227
59009B474567r1343q8436q4937q0923p6228p1182o6498o1921n6035m8285m0418
58998A708361l4654l0954k7374k2750j7717j2996q171k722K806P481J1310J5026
58986A587646J8664K1003K0822J8481J5868J4641J4786J5206J5414J6121J8417
58975A777069K3033L0187L9341M9021N7833O5763P3484Q0163Q3266Q1017P3938
58964B434115O3063M8050K8623P169j1945k5931l5397m2477m8093n1524n1896
$$ plain form
58953 2313757 2264368 2219289 2179406 2145509 2118706 2099758 2087968 2080913 2075594 2070133 2064545 2059787
58941 2059787 2055976 2051775 2045725 2037644 2027974 2016020 1999888 1978216 1950970 1918385 1880404 1837715
58929 1837715 1792102 1744984 1696734 1648323 1602374 1561117 1524139 1489655 1457471 1429188 1405837
58918 1405837 1386834 1371266 1358919 1349970 1344709 1343572 1346687 1353585 1363981 1378241 1396130 1416080
58906 1416080 1437175 1461063 1490065 1523736 1559213 1594705 1630554 1666741 1701525 1733139 1761001
58895 1761001 1784680 1803512 1818067 1830453 1842355 1854230 1867082 1883187 1903804 1927659 1953169
58884 1953169 1981133 2013699 2051264 2091528 2131057 2166730 2196306 2218922 2235208 2246350 2253238
58873 2253238 2256790 2258563 2260443 2263996 2270420 2280593 2294855 2313110 2335280 2361120 2389721 2420085
$$ packed form
58953B313757m9389m5079l9883l3897k6803j8948j1790p055n319n461n588m758
58941B059787l811m201o050q081r670j1954j6132k1672k7246l2585l7981m2689
58929A837715m5613m7118m8250m8411m5949m1257l6978l4484l2184k8283k3351
58918A405837j9003j5568j2347q949n261j137L115O898J0396J4260J7889J9950
58906A416080K1095K3888K9002L3671L5477L5492L5849L6187L4784L1614K7862
58895A761001K3679J8832J4555J2386J1902J1875J2852J6105K0617K3855K5510
58884A953169K7964L2566L7565M0264L9529L5673K9576K2616J6286J1142O888
58873B253238L552J773J880L553O424J0173J4262J8255K2170K5840K8601L0364
$$ plain form
58861 2420085 2452321 2487296 2524987 2564473 2605923 2651292 2702180 2757972 2816995 2878839 2944862
58850 2944862 3017008 3096858 3185345 3282894 3390076 3508026 3637547 3778024 3928526 4090081
58840 4090081 4265433 4456008 4660501 4876944 5104687 5343366 5591388 5846541 6106798
58831 6106798 6369022 6627712 6876464 7110099 7324161 7512907 7669195 7786285 7859133 7884666
58821 7884666 7862277 7794173 7684457 7537679 7358518 7152344 6925323 6683977 6434696 6183109
58811 6183109 5933454 5688824 5451933 5224864 5008174 4801626 4606230 4424313 4257015
58802 4257015 4103101 3961041 3830818 3712509 3604376 3503864 3409520 3320390 3234203 3147756
58792 3147756 3058898 2967085 2872584 2776392 2680560 2587296 2497910 2413507 2336127 2267768 2208333
$$ packed form
58861B420085L2236L4975L7691L9486M1450M5369N0888N5792N9023O1844O6023
58850B944862P2146P9850Q8487R7549J07182J17950J29521J40477J50502J61555
58840D090081J75352J90575K04493K16443K27743K38679K48022K55153K60257
58831F106798K62224K58690K48752K33635K14062J88746J56288J17090P2848K5533
58821G884666k2389o8104j09716j46778j79161k06174k27021k41346k49281k51587
58811F183109k49655k44630k36891k27069k16690k06548j95396j81917j67298
58802D257015j53914j42060j30223j18309j08133j00512r4344q9130q6187q6447
58792C147756q8858r1813r4501r6192r5832r3264q9386q4403p7380o8359n9435
$$ plain form
58781 2208333 2155686 2107783 2063961 2024443 1989685 1960310 1936840 1919212 1906923 1899411 1895959 1895744
58769 1895744 1898617 1905405 1916818 1932473 1951597 1974098 2000291 2030171 2063820 2101961 2145188 2193048
58757 2193048 2244701 2300065 2359560 2423156 2490460 2561302 2635533 2712913 2794055 2880860 2975075
58746 2975075 3076930 3186066 3303159 3429619 3566268 3713387 3871557 4041316 4222380
58737 4222380 4414286 4617489 4832803 5060091 5298230 5545623 5799410 6054567 6305052
58728 6305052 6545659 6771753 6977692 7156780 7302716 7410274 7475194 7494812 7468699 7397806
58718 7397806 7283658 7129670 6942633 6731111 6502241 6261062 6012195 5760226 5508565
58709 5508565 5259773 5017160 4784310 4562820 4352355 4153474 3968538 3798958 3643227
$$ packed form
58781B208333n2647m7903m3822l9518l4758k9375k3470j7628j2289p512l452k15
58769A895744K873O788J1413J5655J9124K2501K6193K9880L3649L8141M3227M7860
58757B193048N1653N5364N9495O3596O7304P0842P4231P7380Q1142Q6805R4215
58746B975075J01855J09136J17093J26460J36649J47119J58170J69759J81064
58737D222380J91906K03203K15314K27288K38139K47393K53787K55157K50485
58728F305052K40607K26094K05939J79088J45936J07558O4920J9618k6113p0893
58718G397806j14148j53988j87037k11522k28870k41179k48867k51969k51661
58709E508565k48792k42613k32850k21490k10465j98881j84936j69580j55731
$$ plain form
58700 3643227 3499036 3366170 3245882 3138115 3040769 2951684 2870361 2797648 2734454 2681117
58690 2681117 2637701 2604373 2581075 2566910 2560562 2561829 2572435 2594853 2630703 2680590 2744656 2822246
58678 2822246 2911439 3009897 3115785 3226527 3336493 3436798 3517639 3570706 3590476 3575237
58668 3575237 3527660 3453611 3359882 3253138 3140139 3027100 2917957 2813785 2714267 2619315
58658 2619315 2529236 2444051 2362988 2284431 2206517 2128260 2049975 1972351 1895708 1820629 1748424
58647 1748424 1679717 1613183 1547132 1482238 1421312 1366305 1316763 1271298 1229202 1190241 1154153
58636 1154153 1121204 1092581 1069626 1052925 1042024 1035339 1030457 1025511 1020516 1016650 1014205 1012150 1009672
58623 1009672 1006974 1004277 1001261 998196 996668 998317 1003283 1010542 1019368 1029862 1042421 1057426 1075605
$$ packed form
58700C643227j44191j32866j20288j07767r7346q9085q1323p2713o3194n3337
58690B681117m3416l3328k3298j4165o348J267J0606K2418L5850M9887O4066P7590
58678B822246Q9193R8458J05888J10742J09966J00305Q0841N3067J9770j5239
58668C575237m7577p4049r3729j06744j12999j13039j09143j04172r9518r4952
58658B619315r0079q5185q1063p8557p7914p8257p8285p7624p6643p5079p2205
58647A748424o8707o6534o6051o4894o0926n5007m9542m5465m2096l8961l6088
58636A154153l2949k8623k2955j6701j0901o685m882m946m995l866k445k055k478
58623A009672k698k697l016l065j528J649M966P259Q826J0494J2559J5005J8179
$$ plain form
58610 1075605 1098211 1126353 1160102 1198548 1241056 1288116 1340220 1395929 1451936 1505185 1553934
58599 1553934 1596493 1630516 1654707 1670167 1678696 1680453 1674503 1660753 1639753 1611225 1574618 1530977
58587 1530977 1482718 1431613 1378452 1324501 1271658 1221118 1173485 1130299 1093588 1063394 1037275
58576 1037275 1012958 990229 969748 951460 935210 921864 912648 907748 906148 906487 907820 909992 913522
58563 913522 918669 924688 930713 937250 945916 957564 971583 987163 1004372 1023806 1045966 1071187
58551 1071187 1099405 1129838 1161584 1194735 1230299 1269051 1311001 1355875 1403538 1454289 1509305
58540 1509305 1570220 1637365 1709186 1784447 1864123 1949572 2039613 2131314 2222897 2313409 2399774
58529 2399774 2477066 2542519 2596876 2640802 2672146 2688235 2689238 2677900 2657335 2630423 2600202
$$ packed form
58610A075605K2606K8142L3749L8446M2508M7060N2104N5709N6007N3249M8749
58599A553934M2559L4023K4191J5460Q529J757n950j3750k1000k8528l6607m3641
58587A530977m8259n1105n3161n3951n2843n0540m7633m3186l6711l0194k6119
58576A037275k4317k2729k0481j8288j6250j3346r216m900j600L39J333K172L530
58563I13522N147O019O025O537Q666J1648J4019J5580J7209J9434K2160K5221
58551A071187K8218L0433L1746L3151L5564L8752M1950M4874M7663N0751N5016
58540A509305O0915O7145P1821P5261P9676Q5449R0041R1701R1583R0512Q6365
58529B399774P7292O5453N4357M3926L1344J6089J003j1338k0565k6912l0221
$$ plain form
58518 2600202 2569330 2539778 2513941 2495215 2486507 2488948 2502783 2528449 2565858 2613732 2671018 2738563
58506 2738563 2818425 2912018 3019682 3141372 3276723 3424574 3582949 3748988 3917977 4082228
58496 4082228 4230920 4350995 4429222 4455520 4425825 4342043 4209851 4037690 3837216 3621904
58486 3621904 3403108 3187728 2979893 2783300 2600801 2433071 2279478 2139907 2014656
58477 2014656 1903016 1803152 1713250 1632055 1558657 1492609 1433960 1382418 1336732 1295621 1259008
58466 1259008 1227500 1200801 1177414 1155989 1136371 1119049 1104057 1090798 1078883 1068811 1061503
58455 1061503 1057203 1055148 1054297 1053829 1052988 1051471 1050598 1053046 1060238 1070732 1082453 1095862 1113290 1135453
58441 1135453 1160541 1186943 1215163 1246461 1281123 1318974 1360506 1406542 1457456 1513513 1575650
$$ packed form
58518B600202l0872k9552k5837j8726q708K441J3835K5666L7409M7874N7286O7545
58506B738563P9862R3593J07664J21690J35351J47851J58375J66039J68989J64251
58496D082228J48692J20075P8227K6298k9695q3782j32192j72161k00474k15312
58486C621904k18796k15380k07835j96593j82499j67730j53593j39571j25251
58477B014656j11640r9864q9902q1195p3398o6048n8649n1542m5686m1111l6613
58466A259008l1508k6699k3387k1425j9618j7322j4992j3259j1915j0072p308
58455A061503m300k055q51m68q41j517q73K448P192J0494J1721J3409J7428K2163
58441A135453K5088K6402K8220L1298L4662L7851M1532M6036N0914N6057O2137
$$ plain form
58430 1575650 1645481 1724579 1813593 1911603 2016620 2127194 2242853 2361772 2478381 2584597
58420 2584597 2673673 2742345 2790097 2817897 2827212 2818381 2789536 2738300 2664621 2571112 2461350
58409 2461350 2339526 2211202 2082203 1956459 1836398 1724895 1624442 1534409 1451707 1374836
58399 1374836 1305173 1243902 1190147 1142993 1102874 1069671 1041409 1016226 993989 974841 957848
58388 957848 942330 928903 917912 908178 898511 889256 881410 875507 872133 871992 874412 877343 879895 883560
58374 883560 890037 899419 911374 926316 944083 963071 981964 1000820 1019203 1034845 1045639 1051583
58362 1051583 1053370 1050611 1043094 1032424 1020551 1007708 993560 979479 967856 959499 953158 947359
58350 947359 941659 936545 933107 932534 935288 941038 949489 960509 973441 987471 1002719 1019443 1036062
$$ packed form
58430A575650O9831P9098Q9014R8010J05017J10574J15659J18919J16609J06216
58420B584597Q9076O8672M7752K7800R315q831k8845n1236p3679r3509j09762
58409B461350j21824j28324j28999j25744j20061j11503j00453r0033q2702p6871
58399A374836o9663o1271n3755m7154m0119l3203k8262k5183k2237j9148j6993
58388I57848j5518j3427j0991r734r667r255p846n903l374j41K420K931K552L665
58374H83560O477R382J1955J4942J7767J8988J8893J8856J8383J5642J0794N944
58362A051583J787k759p517j0670j1873j2843j4148j4081j1623q357o341n799
58350I47359n700n114l438n73K754N750Q451J1020J2932J4030J5248J6724J6619
$$ plain form
58337 1036062 1049898 1060139 1067989 1073356 1073948 1068823 1060479 1051650 1041915 1029184 1012918 994287 974649
58324 974649 955495 938578 924539 912538 902433 895850 893883 895284 898334 902936 909555 917810 927608
58311 927608 939837 954164 967851 978788 988332 999222 1011910 1024852 1037238 1049463 1061793 1074363
58299 1074363 1087779 1102238 1116792 1130751 1144871 1159980 1175536 1190761 1206101 1222473 1240181
58288 1240181 1259533 1281092 1304290 1327270 1349084 1370563 1392195 1412978 1432292 1450684 1467717
58277 1467717 1481421 1491327 1499741 1508434 1516411 1522660 1528676 1536317 1545443 1555653 1567925 1582441 1597243
58264 1597243 1611432 1627353 1647188 1669681 1692834 1717473 1745178 1774750 1803831 1832439 1862132
58253 1862132 1893368 1926409 1963058 2004427 2048320 2091382 2132544 2172144 2209675 2245037 2280045
$$ packed form
58337A036062J3836J0241P850N367N92n125q344q829r735j2731j6266j8631j9638
58324I74649j9154j6917j4039j2001j0105o583j967J401L050M602O619Q255R798
58311I27608J2229J4327J3687J0937R544J0890J2688J2942J2386J2225J2330J2570
58299A074363J3416J4459J4554J3959J4120J5109J5556J5225J5340J6372J7708
58288A240181J9352K1559K3198K2980K1814K1479K1632K0783J9314J8392J7033
58277A467717J3704R906Q414Q693P977O249O016P641R126J0210J2272J4516J4802
58264A597243J4189J5921J9835K2493K3153K4639K7705K9572K9081K8608K9693
58253A862132L1236L3041L6649M1369M3893M3062M1162L9600L7531L5362L5008
$$ plain form
58242 2280045 2315778 2350239 2381563 2411792 2444451 2480004 2516656 2554076 2593295 2634262 2676360
58231 2676360 2720191 2766567 2815379 2867658 2926550 2993620 3066448 3142576 3223467 3311783 3407394
58220 3407394 3509335 3619123 3738786 3868192 4007828 4161470 4332314 4519097 4719930
58211 4719930 4937008 5172943 5424810 5686231 5952727 6220142 6479989 6721609 6937565
58202 6937565 7122904 7271966 7381704 7456975 7507868 7543183 7570459 7599236 7638168 7690171 7755372
58191 7755372 7837116 7940091 8064842 8209832 8377172 8570656 8789909 9032174 9298212 9590732
58181 9590732 9908880 10250222 10616508 11011613 11435636 11887008 12368381 12884100 13434068
58172 13434068 14016917 14637489 15304831 16025101 16803078 17647341 18565413 19555536 20611098
$$ packed form
58242B280045L5733L4461L1324L0229L2659L5553L6652L7420L9219M0967M2098
58231B676360M3831M6376M8812N2279N8892O7070P2828P6128Q0891Q8316R5611
58220C407394J01941J09788J19663J29406J39636J53642J70844J86783K00833
58211D719930K17078K35935K51867K61421K66496K67415K59847K41620K15956
58202F937565J85339J49062J09738P5271N0893L5315K7276K8777L8932N2003O5201
58191G755372Q1744J02975J24751J44990J67340J93484K19253K42265K66038K92520
58181I590732L18148L41342L66286L95105M24023M51372M81373N15719N49968
58172A3434068N82849O20572O67342P20270P77977Q44263R18072R90123J055562
$$ plain form
58163 20611098 21731169 22919031 24173645 25492564 26881647 28352284 29910369 31557414
58155 31557414 33300905 35153552 37123809 39217476 41447586 43832694 46387783 49128761
58147 49128761 52085246 55298909 58813853 62684132 66990387 71834810 77319612 83543261
58139 83543261 90615369 98660174 107808532 118202800 130003411 143370298 158452634
58132 158452634 175447593 194703172 216769884 242363270 272237619 306858292 345731504
58125 345731504 386601144 425189279 456073799 474499080 478111542 467604325 446032469
58118 446032469 417390896 385306173 352363101 320073973 289188515 260045794 232832588
58111 232832588 207729128 184943122 164648766 146898392 131587287 118489491 107321210
$$ packed form
58163B0611098J120071J187862J254614J318919J389083J470637J558085J647045
58155C1557414J743491J852647J970257K093667K230110K385108K555089K740978
58147D9128761K956485L213663L514944L870279M306255M844423N484802O223649
58139H3543261P072108Q044805R148358J0394268J1800611J3366887J5082336
58132A58452634J6994959J9255579K2066712K5593386K9874349L4620673L8873212
58125C45731504M0869640L8588135L0884520J8425281L612462j0507217k1571856
58118D46032469k8641573l2084723l2943072l2289128l0885458k9142721k7213206
58111B32832588k5103460k2786006k0294356j7750374j5311105j3097796j1168281
$$ plain form
58104 107321210 97792942 89642830 82651736 76641500 71468939 67024792 63228422 60013902
58096 60013902 57323943 55118019 53373942 52075659 51212640 50798466 50876106 51497217 52706008
58087 52706008 54531514 56954749 59884967 63240571 67083947 71559185 76525891 81225304
58079 81225304 84446380 85170756 83131262 78820741 73077889 66696079 60272541 54195840
58071 54195840 48653984 43675633 39216667 35230236 31681521 28541274 25787362 23399327
58063 23399327 21342571 19568487 18032539 16700123 15535021 14498008 13560570 12707617
58055 12707617 11924610 11194237 10507816 9867703 9275100 8725354 8216732 7752729 7332791
58046 7332791 6950328 6602326 6291786 6018075 5773273 5550211 5346093 5156476 4974323
$$ packed form
58104A07321210r528268q150112o991094o010236n172561m444147l796370l214520
58096F0013902k689959k205924j744077j298283q63019m14174P7640O21111J208791
58087E2706008J825506K423235K930218L355604L843376M475238M966706M699413
58079H1225304L221076P24376k039494m310521n742852o381810o423538o076701
58071E4195840n541856m978351m458966l986431l548715l140247k753912k388035
58063B3399327k056756j774084j535948j332416j165102j037013r37438q52953
58055A2707617p83007p30373o86421o40113n92603n49746n08622m64003m19938
58046G332791l82463l48002l10540k73711k44802k23062k04118j89617j82153
$$ plain form
58037 4974323 4797987 4633072 4484086 4350702 4233398 4135194 4055587 3989399 3933411 3887331
58027 3887331 3846263 3799147 3737402 3659425 3564886 3451379 3319759 3176890 3029593 2880214
58017 2880214 2730322 2583751 2443230 2308325 2179246 2058773 1948359 1846239 1751397 1665571
58007 1665571 1589404 1520294 1456025 1397080 1343775 1294498 1248455 1206935 1170207 1136200 1103439
57996 1103439 1072259 1042154 1011301 979800 950124 923177 897122 871110 846830 825243 805135
57985 805135 786155 769985 757136 745706 734654 725285 718140 711398 703769 696213 689549 683084 676768
57972 676768 671814 667948 662822 655455 647567 640362 632882 624824 617960 612948 607452 599421 590090 581927
57958 581927 575549 570204 565481 561097 556753 553592 554209 560074 570314 583651 599714 617894 637232
$$ packed form
58037D974323j76336j64915j48986j33384j17304r8204p9607o6188n5988m6080
58027C887331m1068m7116o1745p7977r4539j13507j31620j42869j47297j49379
58017B880214j49892j46571j40521j34905j29079j20473j10414j02120r4842q5826
58007A665571p6167o9110o4269n8945n3305m9277m6043m1520l6728l4007l2761
57996A103439l1180l0105l0853l1501k9676k6947k6055k6012k4280k1587k0108
57985H05135j8980j6170j2849j1430j1052r369p145o742p629p556o664o465o316
57972F76768m954l866n126p367p888p205p480q058o864n012n496q031r331q163
57958E81927o378n345m723m384m344l161O17N865J0240J3337J6063J8180J9338
$$ plain form
57945 637232 658469 684093 715248 750466 788456 830172 877137 929580 987206 1049811 1116014
57934 1116014 1182976 1248130 1309528 1364148 1408368 1440924 1462997 1474300 1471719 1453420 1422071
57923 1422071 1382309 1336965 1287420 1235477 1182605 1128640 1073282 1017965 964766 914485 867175
57912 867175 823513 784260 749269 718252 691689 669944 652401 638323 627555 619590 613169 607671
57900 607671 603661 601051 598018 592726 584871 574492 560720 543203 523686 504748 487683 472686
57888 472686 460037 449743 440822 432382 424855 418963 414074 408845 403160 398283 395279 394190 394607 396379
57874 396379 399851 405782 414590 425412 436551 447319 458659 471450 485055 498249 510795 523144
57862 523144 535153 546053 555243 562133 565436 563606 556213 544359 529549 512461 492882 470590
$$ packed form
57945F37232K1237K5624L1155L5218L7990M1716M6965N2443N7626O2605O6203
57934A116014O6962O5154O1398N4620M4220L2556K2073J1303k581j8299l1349
57923A422071l9762m5344m9545n1943n2872n3965n5358n5317n3199n0281m7310
57912H67175m3662l9253l4991l1017k6563k1745j7543j4078j0768p965o421n498
57900F07671m010k610l033n292p855j0379j3772j7517j9517j8938j7065j4997
57888D72686j2649j0294q921q440p527n892m889n229n685m877l004j089M17J772
57874C96379L472N931Q808J0822J1139J0768J1340J2791J3605J3194J2546J2349
57862E23144J2009J0900R190O890L303j830p393j1854j4810j7088j9579k2292
$$ plain form
57850 470590 446146 420870 396139 372830 351294 331371 312214 292777 273073 254491 238289
57839 238289 224220 211339 199636 189860 182083 175542 169857 165492 163022 162735 164656 168021 171007 172218
57825 172218 172473 174069 178238 184279 191104 198391 205995 213354 219902 225385 229584 232394 234183 235297
57811 235297 235236 233084 228676 222660 215688 208390 201773 196523 192138 187831 183955 181399 179903 178424 176983
57796 176983 176652 177784 179844 183012 188298 195746 204099 212613 221634 230983 239497 246981 255061 264902
57782 264902 275194 283495 288800 291709 292704 291436 287635 281977 275773 269953 264313 257832 249780 240242
57768 240242 229554 218080 207041 198521 193516 190725 188424 186741 186616 187320 186940 185147 183579 183498 184820
57753 184820 187376 191083 194545 195500 193382 189857 186271 182197 177173 172083 167708 163299 157874 152049
$$ packed form
57850D70590k4444k5276k4731k3309k1536j9923j9157j9437j9704j8582j6202
57839B38289j4069j2881j1703r776p777o541n685m365k470k87J921L365K986J211
57825A72218K55J596M169O041O825P287P604P359O548N483M199K810J789J114
57811B35297o1k152m408o016o972p298o617n250m385m307l876k556j496j479j441
57796A76983l31J132K060L168N286P448Q353Q514R021R349Q514P484Q080R841
57782B64902J0292Q301N305K909R95j268l801n658o204n820n640o481q052r538
57768B40242j0688j1474j1039q520n005k791k301j683j25P04l80j793j568q1J322
57753A84820K556L707L462R55k118l525l586m074n024n090m375m409n425n825
$$ plain form
57739 152049 147505 145149 144528 144764 145690 148320 154007 162605 172015 180546 189072 199460 211483 223243
57725 223243 234217 245483 256747 265663 270794 273050 273341 271073 266163 260474 255724 251629 247582 244643
57711 244643 244254 246215 249400 253327 257586 260892 262342 262802 263569 264296 263538 260626 255756 248899 240098
57696 240098 230474 221613 213981 206730 198802 189657 179495 169402 160720 153577 146642 138965 131365 125444
57682 125444 122066 121369 123181 126498 129607 131830 134296 137896 141364 142740 142149 141665 142682 144636 146203
57667 146203 146661 146106 145268 145231 146662 149207 151994 154616 157312 160507 164554 169589 175313 181223 187284
57652 187284 193897 201077 208380 215811 224000 233130 242572 252021 262141 273609 286368 300311 315838
57639 315838 333282 352733 374758 399980 427281 453854 478060 500910 523457 543967 559309
$$ packed form
57739A52049m544k356o21K36R26K630N687Q598R410Q531Q526J0388J2023J1760
57725B23243J0974J1266J1264Q916N131K256K91k268m910n689m750m095m047k939
57711B44643l89J961L185L927M259L306J450M60P67P27p58k912m870o857q801
57696B40098r624q861p632p251p928r145j0162j0093q682p143o935p677p600n921
57682A25444l378o97J812L317L109K223K466L600L468J376n91m84J017J954J567
57667A46203M58n55q38l7J431K545K787K622K696L195M047N035N724N910O061
57652A87284O613P180P303P431Q189R130R442R449J0120J1468J2759J3943J5527
57639C15838J7444J9451K2025K5222K7301K6573K4206K2850K2547K0510J5342
$$ plain form
57628 559309 568336 572281 572538 569914 565799 562153 559899 558622 558258 560292 566975 579974 599771 625682
57614 625682 656443 691410 731291 777603 831894 895965 971952 1061081 1162752 1276017 1401657
57603 1401657 1541124 1692455 1847375 1992416 2112925 2197548 2241750 2248960 2228099 2188678
57593 2188678 2137011 2075839 2006208 1929062 1845487 1756521 1663488 1568601 1474691 1383878 1296632
57582 1296632 1212569 1132006 1056186 986135 922120 864375 813415 769112 730073 694623 662110
57571 662110 632946 607732 586622 569094 553991 540225 527761 517482 509877 504439 500635 498705
57559 498705 499005 501252 505151 511160 519761 530255 541222 552234 564523 579807 598898 621495 646931
57546 646931 674875 705492 739135 775906 815401 856724 898892 941635 985765 1032085 1079468
$$ packed form
57628E59309R027L945K57k624m115l646k254j277l64K034O683J2999J9797K5911
57614F25682L0761L4967L9881M6312N4291O4071P5987Q9129J01671J13265J25640
57603A401657J39467J51331J54920J45041J20509Q4623M4202P210k0861l9421
57593B188678n1667o1172o9631p7146q3575q8966r3033r4887r3910r0813q7246
57582A296632q4063q0563p5820p0051o4015n7745n0960m4303l9039l5450l2513
57571F62110k9164k5214k1110j7528j5103j3766j2464j0279p605n438l804j930
57559D98705L00K247L899O009Q601J0494J0967J1012J2289J5284J9091K2597K5436
57546F46931K7944L0617L3643L6771L9495M1323M2168M2743M4130M6320M7383
$$ plain form
57535 1079468 1124535 1163792 1195499 1218764 1231649 1231650 1218083 1192793 1158300 1116168 1067331 1012920
57523 1012920 954364 893277 831482 770567 711383 654558 601200 552341 507932 467351 430466
57512 430466 397077 365922 335942 308218 284636 264536 244914 224457 205167 188978 174900
57501 174900 161079 147868 136876 128002 119365 109751 99561 89585 80055 70859 61837 53039 45121
57488 45121 39011 34650 30663 25953 21030 17274 15521 15925 18288 21814 25248 28148 31598 37081 45160
57473 45160 55508 67334 79239 89673 98308 106297 114666 123439 132849 144136 158083 173760 189781
57460 189781 206003 222921 240299 257637 275375 294375 314558 335144 356017 378001 401937
57449 401937 428191 456735 487131 518670 550794 582884 613557 641257 665984 689055 710193
$$ packed form
57535A079468M5067L9257L1707K3265J2885Jj3567k5290l4493m2132m8837n4411
57523A012920n8556o1087o1795o0915n9184n6825n3358m8859m4409m0581l6885
57512D30466l3389l1155k9980k7724k3582k0100j9622k0457j9290j6189j4078
57501A74900j3821j3211j0992q874q637r614j0190r976r530r196r022q798p918
57488D5121o110m361l987m710m923l756j753M04K363L526L434K900L450N483Q079
57473D5160J0348J1826J1905J0434Q635P989Q369Q773R410J1287J3947J5677J6021
57460A89781J6222J6918J7378J7338J7738J9000K0183K0586K0873K1984K3936
57449D01937K6254K8544L0396L1539L2124L2090L0673K7700K4727K3071K1138
$$ plain form
57438 710193 725990 732566 729120 717685 700083 676408 646232 610051 569496 526769 483797 441537
57426 441537 400307 360954 324994 293249 265106 239586 216356 195275 175956 158380 143027
57415 143027 129737 117339 105022 93096 81873 70918 60108 50175 41343 32688 23758 15619
57403 15619 9261 4342 754 -29 3233 9437 16463 23779 32171 41868 52678 65328 80849 98961
57389 98961 118620 139848 163590 190108 218909 249856 282889 316880 350103 381541 410322 434192
57377 434192 450127 456668 454530 444905 428205 404441 373849 337164 295976 252557 208567 164362
57365 164362 120167 77158 36415 -2307 -39419 -73910 -104410 -131302 -156142 -179371 -200304 -219136
57353 -219136 -237088 -254422 -270037 -283492 -295856 -307938 -318976 -328007 -335644 -343605 -352845 -362754
$$ packed form
57438G10193J5797O576l446j1435j7602k3675l0176l6181m0555m2727m2972m2260
57426D41537m1230l9353l5960l1745k8143k5520k3230k1081j9319j7576j5353
57415A43027j3290j2398j2317j1926j1223j0955j0810r933q832q655q930q139
57403A5619o358D342G54b9C233O204P026P316Q392R697J0810J2650J5521J8112
57389I8961J9659K1228K3742K6518K8801L0947L3033L3991L3223L1438K8781K3870
57377D34192J5935O541k138r625j6700k3764l0592l6685m1188m3419m3990m4205
57365A64362m4195m3009C6415b307l7112l4491l0500k6892k4840k3229k0933j8832
57353b19136j7952j7334j5615j3455j2364j2082j1038r031p637p961r240r909
$$ plain form
57341 -362754 -371951 -379556 -385833 -391760 -397987 -404291 -410021 -414671 -417856 -419378 -419746 -420112 -421150 -422409 -423243
57326 -423243 -423921 -425316 -427931 -431687 -436300 -441427 -446847 -452727 -459204 -465580 -470787 -474973 -479791 -486706
57312 -486706 -495710 -505881 -516196 -525584 -533442 -540631 -548848 -558532 -568471 -577670 -586052 -593021 -597343 -599386
57298 -599386 -601518 -605008 -608307 -609846 -610872 -613752 -618787 -624509 -629995 -635144 -639603 -643104 -646187 -649273
57284 -649273 -651947 -654403 -658431 -665354 -673957 -681975 -688668 -694512 -699476 -703357 -706906 -710917 -714874 -717904
57270 -717904 -720207 -722238 -723601 -724191 -725179 -727188 -728753 -728491 -727577 -728092 -729835 -730787 -729938 -727759 -724831 -721886
57254 -721886 -720306 -720585 -721136 -720515 -719803 -720746 -722744 -724049 -724935 -726909 -729430 -730170 -728418 -725663 -722830 -719332
57238 -719332 -715058 -711078 -707960 -705138 -702351 -700317 -699800 -701092 -704227 -708700 -713522 -718569 -725011 -733289
$$ packed form
57341c62754r197p605o277n927o227o304n730m650l185j522l68l66j038j259q34
57326d23243o78j395k615l756m613n127n420n880o477o376n207m186m818o915
57312d86706r004j0171j0315r388p858p189q217r684r939r199q382o969m322k043
57298e99386k132l490l299j539j026k880n035n722n486n149m459l501l083l086
57284f49273k674k456m028o923q603q018o693n844m964l881l549m011l957l030
57270g17904k303k031j363n90r88k009j565K62R14n15j743r52Q49K179K928K945
57254g21886J580k79n51O21P12r43j998j305q86j974k521p40J752K755K833L498
57238g19332M274L980L118K822K787K034N17j292l135m473m822n047o442q278
$$ plain form
57224 -733289 -741915 -749717 -757867 -767788 -778354 -787314 -794392 -800672 -805859 -808586 -808785 -807602 -805522 -802611
57210 -802611 -799863 -798292 -797398 -796360 -795745 -796189 -796805 -797211 -799668 -806481 -816329 -825768 -833228 -838901 -842106
57195 -842106 -842147 -840875 -840924 -841833 -841001 -838039 -835100 -833297 -831885 -830757 -830800 -831903 -833318 -835620 -839630 -844035
57179 -844035 -847014 -849606 -854319 -860801 -866069 -868768 -870139 -871128 -871686 -872679 -875366 -878962 -881437 -882265 -881669
57164 -881669 -878091 -869847 -858623 -847863 -838195 -827970 -817506 -808694 -800664 -790054 -775950 -760835
57152 -760835 -746224 -730578 -711516 -686835 -653710 -610551 -559550 -504049 -444031 -377890 -307671
57141 -307671 -237850 -169378 -99745 -28928 39661 104466 167124 228016 285256 339065 392680
57130 392680 448008 504477 562615 624113 687656 749488 809155 870179 934031 997929 1059577
$$ packed form
57224g33289q626p802q150r921j0566q960p078o280n187k727j99J183K080K911
57210h02611K748J571Q94J038O15m44o16m06k457o813r848r439p460n673l205
57195h42106m1J272m9r09Q32K962K939J803J412J128m3j103j415k302m010m405
57179h44035k979k592m713o482n268k699j371r89n58r93k687l596k475q28N96
57164h81669L578Q244J1224J0760R668J0225J0464Q812Q030J0610J4104J5115
57152g60835J4611J5646J9062K4681L3125M3159N1001N5501O0018O6141P0219
57141c07671O9821O8472O9633b8928C9661O4805O2658O0892N7240N3809N3615
57130C92680N5328N6469N8138O1498O3543O1832N9667O1024O3852O3898O1648
$$ plain form
57119 1059577 1119550 1178067 1234126 1289012 1346002 1405305 1463628 1519803 1576202 1633525 1688981
57108 1688981 1740819 1789927 1835743 1875603 1909651 1941666 1973532 2003543 2031435 2060180 2091389
57097 2091389 2123805 2157769 2196233 2239751 2285242 2331038 2378281 2425988 2469682 2506106 2534358
57086 2534358 2551478 2552342 2535130 2501724 2451732 2381339 2288391 2172753 2031427 1859881 1658728
57075 1658728 1432187 1179172 892754 568947 208729 -188837 -627294 -1105873 -1620496
57066 -1620496 -2172534 -2767993 -3407367 -4085891 -4805283 -5575905 -6406788 -7304253 -8281483
57057 -8281483 -9357510 -10544293 -11845984 -13272903 -14844129 -16574512 -18472703 -20555102
57049 -20555102 -22848608 -25377160 -28159973 -31225499 -34611707 -38350590 -42470339 -47016290
$$ packed form
57119A059577N9973N8517N6059N4886N6990N9303N8323N6175N6399N7323N5456
57108A688981N1838M9108M5816L9860L4048L2015L1866L0011K7892K8745L1209
57097B091389L2416L3964L8464M3518M5491M5796M7243M7707M3694L6424K8252
57086B534358J7120Q64j7212l3406m9992p0393r2948j15638j41326j71546k01153
57075A658728k26541k53015k86418l23807B08729a88837m38457m78579n14623
57066a620496n52038n95459o39374o78524p19392p70622q30883q97465r77230
57057h281483j076027j186783j301691j426919j571226j730383j898191k082399
57049b0555102k293506k528552k782813l065526l386208l738883m119749m545951
$$ plain form
57041 -47016290 -52051489 -57635004 -63823743 -70703299 -78396583 -87037577 -96758638 -107702716
57033 -107702716 -120015075 -133818174 -149226857 -166380074 -185395019 -206270987 -228880357
57026 -228880357 -253010184 -278228915 -303618553 -327861301 -349977430 -370155954 -389717001
57019 -389717001 -410012179 -431163540 -451656111 -468926647 -480355778 -484096536 -479519226
57012 -479519226 -467216646 -448601272 -425323579 -398840104 -370272969 -340457394 -310042654
57005 -310042654 -279602309 -249718413 -220980593 -193909688 -168893324 -146178490 -125882695
56998 -125882695 -107996141 -92401165 -78917524 -67336160 -57426753 -48950983 -41693170
56991 -41693170 -35475595 -30145165 -25562477 -21610032 -18195759 -15239489 -12665512 -10412319
$$ packed form
57041d7016290n035199n583515o188739o879556p693284q640994r721061j0944078
57033a07702716j2312359j3803099j5408683j7153217j9014945k0875968k2609370
57026b28880357k4129827k5218731k5389638k4242748k2116129k0178524j9561047
57019c89717001k0295178k1151361k0492571j7270536j1429131l740758M577310
57012d79519226J2302580J8615374K3277693K6483475K8567135K9815575L0414740
57005c10042654L0440345K9883896K8737820K7070905K5016364K2714834K0295795
56998a25882695J7886554J5594976J3483641J1581364R909407Q475770P257813
56991d1693170O217575N330430M582688L952445L414273K956270K573977K253193
$$ plain form
56983 -10412319 -8436896 -6702387 -5170384 -3809062 -2597995 -1519115 -551203 322884
56974 1112621 1827690 2481603 3084024 3637580 4145529 4614712 5047950 5441691 5794747
56965 5794747 6112002 6396538 6645799 6858853 7039991 7191581 7310300 7394036 7445970 7468347
56955 7468347 7458430 7414058 7337292 7229125 7085981 6904487 6685011 6429057 6140128 5830449
56945 5830449 5520614 5227953 4958906 4714525 4497395 4309470 4148602 4012114 3900882
56936 3900882 3816836 3759705 3729207 3727777 3758780 3823998 3923401 4053985 4207575 4371795 4531685
56925 4531685 4666051 4744974 4740897 4647116 4481885 4273058 4042880 3806412 3574538 3351980
56915 3351980 3136898 2927676 2727959 2542766 2373725 2221138 2086868 1971651 1872561 1786262
$$ packed form
56983a0412319J975423J734509J532003J361322J211067J078880e51203C22884
56974A112621P15069O53913O02421N53556N07949M69183M33238L93741L53056
56965E794747L17255K84536K49261K13054J81138J51590J18719Q3736N1934K2377
56955G468347r917m4372p6766j08167j43144j81494k19476k55954k88929l09679
56945E830449l09835k92661k69047k44381k17130j87925j60868j36488j11232
56936C900882q4046n7131l0498j430L1003O5218R9403J30584J53590J64220J59890
56925D531685J34366P8923m077r3781j65231k08827k30178k36468k31874k22558
56915C351980k15082k09222j99717j85193j69041j52587j34270j15217r9090q6299
$$ plain form
56905 1786262 1712283 1650619 1598865 1554363 1516886 1487181 1465113 1450752 1444586 1444878 1447147 1447444
56893 1447444 1443757 1433799 1415172 1388912 1359325 1328865 1296548 1262446 1229591 1199569 1170154 1139587
56881 1139587 1109794 1083218 1059687 1038483 1020379 1005658 993139 982923 976976 975389 975534 976607
56869 976607 981202 990046 998646 1001566 996984 985128 966057 941765 917031 895035 874586 853939
56857 853939 834321 817265 801773 787050 775101 767565 762644 758163 755131 755292 757609 760202 763430
56844 763430 768037 772460 775113 777274 780574 783598 784170 783388 784139 786855 789650 791492 792519 792351 790718
56829 790718 788788 787640 786489 784388 782170 780418 777004 769136 756723 741505 724230 705159 686238
56816 686238 670220 658159 649663 644752 643615 645532 649846 657183 668242 682571 700023 721946 749110
$$ packed form
56905A786262p3979o1664n1754m4502l7477k9705k2068j4361o166K92K269K97
56893A447444l687r958j8627k6260k9587l0460l2317l4102l2855l0022k9415l0567
56881A139587k9793k6576k3531k1204j8104j4721j2519j0216n947j587J45J073
56869I76607M595Q844Q600K920m582j1856j9071k4292k4734k1996k0449k0647
56857H53939j9618j7056j5492j4723j1949p536m921m481l032J61K317K593L228
56844G63430M607M423K653K161L300L024N72p82P51K716K795J842J027j68j633
56829G90718j930j148j151k101k218j752l414p868j2413j5218j7275j9071j8921
56816F86238j6018j2061q496m911j137J917M314P337J1059J4329J7452K1923K7164
$$ plain form
56803 749110 779819 811981 845773 882619 922777 965427 1009323 1051334 1085982 1108776 1119138
56792 1119138 1118675 1108493 1090369 1068642 1047991 1030128 1014773 1002584 994722 990639 989046 990606
56780 990606 997491 1010750 1029996 1055053 1086112 1123027 1166233 1217334 1276509 1339441 1398090 1443911
56768 1443911 1469654 1470511 1446589 1403863 1350610 1293040 1235236 1181211 1134124 1094131 1059459 1029491
56756 1029491 1005141 987019 975304 970865 974526 985515 1002340 1024764 1053362 1087714 1126297 1166964
56744 1166964 1205623 1235540 1250336 1247614 1228516 1195161 1150734 1100760 1051081 1004271 959910
56733 959910 918065 880301 847628 819890 797547 782091 774220 772946 776600 783572 792426 802882
56721 802882 816492 834714 856243 877383 894627 905617 908344 901538 886079 864621 839783 813626
$$ packed form
56803G49110L0709L2162L3792L6846M0158M2650M3896M2011L4648K2794J0362
56792A119138m63j0182j8124k1727k0651j7863j5355j2189p862m083j593J560
56780I90606O885J3259J9246K5057L1059L6915M3206N1101N9175O2932N8649M5821
56768A443911K5743Q57k3922m2726n3253n7570n7804n4025m7087l9993l4672k9968
56756A029491k4350j8122j1715m439L661J0989J6825K2424K8598L4352L8583M0667
56744A166964L8659K9917J4796k722j9098l3355m4427m9974m9679m6810m4361
56733I59910m1845l7764l2673k7738k2343j5456p871j274L654O972Q854J0456
56721H02882J3610J8222K1529K1140J7244J0990K727o806j5459k1458k4838k6157
$$ plain form
56709 813626 788218 764959 743440 722414 701772 682395 664522 647771 632387 618874 606571
56698 606571 594293 582315 572233 564718 558730 553084 547638 542731 538471 534735 531149 527109 522349
56685 522349 517278 512370 507781 503926 501392 499636 497005 492963 489075 486724 485189 483304 481636 481292
56671 481292 481751 481574 480329 478199 474954 471164 469182 470622 473735 475579 476039 477333 480094 482518 483181
56656 483181 482306 480228 476870 473022 470200 468941 468678 469116 470098 470465 469008 466474 464807 464477 464246 463263
56640 463263 461513 458514 453700 447963 442759 437872 432229 426760 423904 424023 424796 424697 424751 426132 428348 430779
56624 430779 434042 438700 444292 450544 457898 465896 472611 476923 480175 484573 490780 497732 503827 507777
56610 507777 509259 509318 509374 509696 509725 509749 510905 513565 517193 521864 528350 536577 545646 555560 567073 579491
$$ packed form
56709H13626k5408k3259k1519k1026k0642j9377j7873j6751j5384j3513j2303
56698F06571j2278j1978j0082p515n988n646n446m907m260l736l586m040m760
56685E22349n071m908m589l855k534j756k631m042l888k351j535j885j668l44
56671D81292M59j77j245k130l245l790j982J440L113J844M60J294K761K424O63
56656D83181q75k078l358l848k822j259k63M38R82L67j457k534j667l30k31r83
56640D63263j750k999m814n737n204m887n643n469k856J19P73r9N4J381K216K431
56624D30779L263M658N592O252P354P998O715M312L252M398O207O952O095L950
56610E07777J482N9N6L22K9K4J156K660L628M671O486Q227R069R914J1513J2418
$$ plain form
56594 579491 590642 599749 608539 618566 628971 637720 643557 645909 644447 639736 632982 624215 612095
56581 612095 596413 579411 563600 549525 536634 524923 514479 504628 494933 486221 479448 474382
56569 474382 470411 467671 466215 464939 462656 459586 456679 454111 451558 449341 448028 447326 446555 445888 446029
56554 446029 446869 447564 447893 448601 450284 452617 454718 455788 455492 454277 453291 453512 454958 456968 459006 460879
56538 460879 462533 464164 466266 469078 472080 474600 476827 479681 483555 487641 490835 493074 495279 497960
56524 497960 500337 501248 500678 499793 499584 500182 501569 504064 507618 511393 514689 517725 520899 523926 526432
56509 526432 528811 531656 534804 537753 540577 543650 546898 550150 553729 557892 562257 566651 571846 578420
56495 578420 585571 592157 598209 604146 609403 613567 618169 625267 634359 642656 648543 652906 656844 660071
$$ packed form
56594E79491J1151R107Q790J0027J0405Q749N837K352j462m711o754q767j2120
56581F12095j5682j7002j5811j4075j2891j1711j0444r851r695q712o773n066
56569D74382l971k740j456j276k283l070k907k568k553k217j313p02p71o67J41
56554D46029Q40O95L29P08J683K333K101J070k96j215r86K21J446K010K038J873
56538D60879J654J631K102K812L002K520K227K854L874M086L194K239K205K681
56524D97960K377R11n70q85k09N98J387K495L554L775L296L036L174L027K506
56509E26432K379K845L148K949K824L073L248L252L579M163M365M394N195O574
56495E78420P151O586O052N937N257M164M602P098R092Q297N887M363L938L227
$$ plain form
56481 660071 662198 663845 665489 666379 665477 662613 658239 652786 646665 640207 633542 627093 621703 617213 611562
56466 611562 603000 592900 584527 579072 574796 570136 565343 560633 555103 548605 542744 538624 535106 530600
56452 530600 525387 520940 517927 515951 514433 512856 510923 509137 508444 509008 510292 512353 515410 517875 516881
56437 516881 511747 505106 499557 495031 490692 487372 486151 485990 485031 483352 482403 482347 481959 480922 480352 480953
56421 480953 482109 482954 483251 483122 482867 483074 484169 485823 487368 488579 489598 490491 491472 493097 495591 498442
56405 498442 501198 504061 507036 509327 510582 512138 515795 521567 527714 532966 537810 543357 549647 555437
56391 555437 559562 562339 565473 570267 576116 581274 585014 588251 592057 596469 600862 604505 606611 606953
56377 606953 606823 608241 611778 616116 619998 623220 625225 624501 620488 614798 609349 604348 599245 594456 590701
$$ packed form
56481F60071K127J647J644Q90r02k864m374n453o121o458o665o449n390m490n651
56466F11562q562j0100q373n455m276m660m793m710n530o498n861m120l518m506
56452E30600n213m447l013j976j518j577j933j786o93N64J284K061L057K465r94
56437E16881n134o641n549m526m339l320j221j61r59j679r49n6l88j037n70O01
56421D80953J156Q45K97j29k55K07J095J654J545J211J019Q93R81J625K494K851
56405D98442K756K863K975K291J255J556L657N772O147N252M844N547O290N790
56391E55437M125K777L134M794N849N158L740L237L806M412M393L643K106L42
56377F06953j30J418L537M338L882L222K005p24m013n690n449n001n103m789l755
$$ plain form
56362 590701 587526 583943 579944 576171 572712 569388 566514 564071 560822 555726 549784 544962 541568 538072
56348 538072 533433 528243 523543 519634 516289 513196 510098 507212 505480 505659 507228 508799 509547 509664 509632
56333 509632 509703 509863 509792 509054 507795 506926 507164 508369 510190 512592 515087 516342 515547 513648 512097 510842
56317 510842 508710 505562 502965 502581 504589 507715 510339 511664 512237 513166 514713 516185 517360 518991 521253
56302 521253 522762 522148 519982 518104 517499 517680 517638 516521 514006 510953 509267 510137 512773 515506 517416 518223
56286 518223 517637 516169 515733 517894 521827 525397 527846 530084 532668 535127 537299 539853 543289 547541 552788
56271 552788 559501 567348 575001 581364 586321 590208 593371 596420 600227 605349 611793 619258 627213 634873
56257 634873 641616 647343 652194 656291 660083 664293 668984 673307 676711 679688 682724 685479 687877 690875
$$ packed form
56362E90701l175l583l999l773l459l324k874k443l249n096n942m822l394l496
56348E38072m639n190m700l909l345l093l098k886j732J79J569J571P48J17l2
56333E09632P1J60p1p38j259q69K38J205J821K402K495J255p95j899j551j255
56317E10842k132l148k597l84K008L126K624J325N73R29J547J472J175J631K262
56302E21253J509o14k166j878o05J81m2j117k515l053j686Q70K636K733J910Q07
56286E18223n86j468m36K161L933L570K449K238K584K459K172K554L436M252N247
56271E52788O713P847P653O363M957L887L163L049L807N122O444P465P955P660
56257F34873O743N727M851M097L792M210M691M323L404K977L036K755K398K998
$$ plain form
56243 690875 694877 698261 699046 697528 695756 694820 694130 693148 692260 691848 691754 691716 691322 689736 686685 683489 681935
56226 681935 682268 683449 685033 687342 690020 692062 693404 694926 696669 697624 697711 698402 700653 703411 705012
56211 705012 705227 705204 706034 708009 710777 713698 716306 718660 721084 723674 726395 729346 732424 735105 737253
56196 737253 739795 743803 749250 755446 762243 769805 777575 784642 791049 797712 805081 812833 820833 829609
56182 829609 839824 851688 864468 876222 884993 891083 897102 904706 912591 919089 925248 933079 941908
56169 941908 949136 954128 958640 963472 967408 969690 971011 971587 970807 969510 970051 973027 976154 977495 977700
56154 977700 977898 977473 975551 972940 971009 970053 970145 972093 975941 979823 981985 982930 984039 985072 984796 983443
56138 983443 982824 984174 987049 990216 992654 993962 994505 994919 995064 994020 991510 988559 986296 985037 985006 986703
$$ packed form
56243F90875M002L384P85j518j772r36o90r82q88m12r4l8l94j586l051l196j554
56226F81935L33J181J584K309K678K042J342J522J743R55Q7O91K251K758J601
56211G05012K15k3Q30J975K768K921K608K354K424K590K721K951L078K681K148
56196G37253K542M008N447O196O797P562P770P067O407O663P369P752Q000Q776
56182H29609J0215J1864J2780J1754Q771O090O019P604P885O498O159P831Q829
56169I41908P228M992M512M832L936K282J321N76p80j297N41K976L127J341K05
56154I77700J98m25j922k611j931r56R2J948L848L882K162R45J109J033k76j353
56138I83443o19J350K875L167K438J308N43M14J45j044k510k951k263j259l1J697
$$ plain form
56122 986703 989761 992638 994549 996669 1000263 1004493 1007404 1008436 1008793 1009803 1012054 1015731 1020730 1026588
56108 1026588 1033066 1040453 1048783 1057444 1066342 1076667 1089408 1103603 1117162 1129217 1140744 1153044
56096 1153044 1166474 1180625 1195117 1210183 1226759 1245670 1266421 1287299 1307194 1326929 1348370
56085 1348370 1372636 1399645 1428972 1460641 1495410 1534707 1580077 1632522 1692509 1760346 1835932
56074 1835932 1918556 2008074 2106247 2215673 2337347 2470748 2616663 2778289 2958565 3157379
56064 3157379 3371689 3596791 3826533 4053770 4272172 4477387 4666490 4837977 4993106
56055 4993106 5135297 5266268 5383214 5480554 5553283 5597752 5611295 5593785 5549471 5485582 5408764
56044 5408764 5322977 5229215 5125178 5005551 4864641 4699954 4513660 4311594 4101538 3891324
$$ packed form
56122I86703L058K877J911K120L594M230K911J032L57J010K251L677M999N858
56108A026588O478P387Q330Q661Q898J0325J2741J4195J3559J2055J1527J2300
56096A153044J3430J4151J4492J5066J6576J8911K0751K0878J9895J9735K1441
56085A348370K4266K7009K9327L1669L4769L9297M5370N2445N9987O7837P5586
56074A835932Q2624Q9518R8173J09426J21674J33401J45915J61626J80276J98814
56064C157379K14310K25102K29742K27237K18402K05215J89103J71487J55129
56055D993106J42191J30971J16946R7340P2729M4469J3543j7510m4314o3889p6818
56044E408764q5787r3762j04037j19627j40910j64687j86294k02066k10056k10214
$$ plain form
56034 3891324 3686945 3492240 3310374 3144498 2996246 2864777 2748489 2646886 2559812 2486001
56024 2486001 2423666 2371698 2329086 2294086 2265370 2243185 2227950 2218303 2211776 2206811 2202917 2199666
56012 2199666 2196764 2194292 2191615 2187092 2180414 2174210 2171459 2172057 2173857 2176318 2180868 2187951 2196285 2205509
55998 2205509 2217596 2234646 2256496 2281124 2306622 2332327 2358651 2386144 2414627 2443511 2473042
55987 2473042 2504374 2538080 2573700 2611255 2651750 2695233 2739996 2785076 2831991 2882412 2935692
55976 2935692 2990677 3048531 3111322 3178858 3249310 3322089 3397704 3475703 3555501 3638782 3728256
55965 3728256 3824151 3924477 4028758 4139047 4257319 4384407 4521684 4671171 4833397 5007121
55955 5007121 5191510 5386604 5591554 5804591 6025104 6253862 6490951 6735589 6988157
$$ packed form
56034C891324k04379j94705j81866j65876j48252j31469j16288j01603q7074p3811
56024B486001o2335n1968m2612l5000k8716k2185j5235r647o527m965l894l251
56012B199666k902k472k677m523o678o204k751N98J800K461M550P083Q334R224
55998B205509J2087J7050K1850K4628K5498K5705K6324K7493K8483K8884K9531
55987B473042L1332L3706L5620L7555M0495M3483M4763M5080M6915N0421N3280
55976B935692N4985N7854O2791O7536P0452P2779P5615P7999P9798Q3281Q9474
55965C728256R5895J00326J04281J10289J18272J27088J37277J49487J62226J73724
55955E007121J84389J95094K04950K13037K20513K28758K37089K44638K52568
$$ plain form
55946 6988157 7250511 7524057 7809329 8107540 8420647 8749886 9096018 9460860 9846895
55937 9846895 10255845 10689417 11150344 11640392 12158702 12705353 13285712 13907979 14577418
55928 14577418 15296854 16071688 16909075 17811431 18775325 19797738 20879364 22021114 23222505
55919 23222505 24485711 25817521 27225485 28715316 30293080 31966385 33742724 35630802
55911 35630802 37644514 39801776 42119383 44614451 47312028 50246851 53459355 56999932
55903 56999932 60940984 65377355 70409951 76133074 82638984 90028199 98416057 107942589
55895 107942589 118784162 131152435 145287954 161473093 180048260 201381231 225801748
55888 225801748 253577605 284895842 319619850 356683847 393454032 425742317 448855854
$$ packed form
55946F988157K62354K73546K85272K98211L13107L29239L46132L64842L86035
55937I846895M08950M33572M60927M90048N18310N46651N80359O22267O69439
55928A4577418P19436P74834Q37387R02356R63894J022413J081626J141750J201391
55919B3222505J263206J331810J407964J489831J577764J673305J776339J888078
55911C5630802K013712K157262K317607K495068K697577K934823L212504L540577
55903E6999932L941052M436371N032596N723123O505910P389215Q387858R526532
55895A07942589J0841573J2368273J4135519J6185139J8575167K1332971K4420517
55888B25801748K7775857L1318237L4724008L7063997L6770185L2288285K3113537
$$ plain form
55881 448855854 459250512 455806328 439998492 415024299 384545001 351710495 318739181
55874 318739181 286946769 256986984 229128647 203484836 180150409 159227588 140769506
55867 140769506 124717798 110894734 99046225 88893260 80166257 72625366 66071021
55860 66071021 60341977 55305622 50852274 46894523 43363159 40199521 37352774 34782321
55852 34782321 32456545 30346884 28425707 26669701 25060959 23583480 22221833 20963888
55844 20963888 19801062 18724447 17723699 16790854 15921858 15112617 14356170 13645511 12976877
55835 12976877 12348454 11757779 11202138 10679836 10189371 9728356 9294412 8886022 8501688
55826 8501688 8139283 7796817 7472662 7164669 6870635 6590097 6324141 6072844 5834402
$$ packed form
55881D48855854J0394658l444184j5807836k4974193l0479298l2834506l2971314
55874C18739181l1792412k9959785k7858337k5643811k3334427k0922821j8458082
55867A40769506j6051708j3823064j1848509j0152965q727003p540891o554345
55860F6071021n729044n036355m453348l957751l531364l163638k846747k570453
55852C4782321k325776k109661j921177j756006j608742j477479j361647j257945
55844B0963888j162826j076615j000748r32845q68996q09241p56447p10659o68634
55835A2976877o28423n90675n55641n22302m90465m61015m33944m08390l84334
55826H501688l62405l42466l24155l07993k94034k80538k65956k51297k38442
$$ plain form
55817 5834402 5607200 5391070 5186132 4992510 4812191 4649314 4507318 4387055 4288247 4210573
55807 4210573 4151487 4104170 4059290 4008363 3944954 3864562 3765494 3649638 3521271 3385253 3246500
55796 3246500 3109688 2977973 2852485 2733875 2623600 2522903 2431459 2348228 2273224 2207534
55786 2207534 2151942 2105912 2067029 2030719 1991519 1945955 1894153 1838247 1780062 1720973 1662961
55775 1662961 1608247 1557926 1511754 1469260 1430567 1396355 1367457 1344286 1326466 1313302 1304505
55764 1304505 1299715 1297445 1295536 1292794 1289028 1283343 1274038 1260907 1246197 1232366 1220074 1209046 1199177
55751 1199177 1189503 1177682 1162430 1145491 1129451 1114391 1098574 1081789 1065913 1052251 1040235
55740 1040235 1029056 1019128 1011507 1006902 1005440 1006474 1008492 1010009 1010492 1009736 1006893 1001370 994337 988009
$$ packed form
55817E834402k27202k16130k04938j93622j80319j62877j41996j20263r8808p7674
55807D210573n9086m7317m4880n0927o3409q0392r9068j15856j28367j36018j38753
55796C246500j36812j31715j25488j18610j10275j00697r1444q3231p5004o5690
55786B207534n5592m6030l8883l6310l9200m5564n1802n5906n8185n9089n8012
55775A662961n4714n0321m6172m2494l8693l4212k8898k3171j7820j3164q797
55764A304505m790k270j909k742l766n685r305j3131j4710j3831j2292j1028r869
55751A199177r674j1821j5252j6939j6040j5060j5817j6785j5876j3662j2016
55740A040235j1179r928p621m605j462J034K018J517M83p56k843n523p033o328
$$ plain form
55726 988009 983456 980329 978609 979223 982801 989085 997691 1008125 1018798 1027392 1032614 1034475 1032506 1025058
55712 1025058 1011009 991062 966682 938824 908466 877365 847192 818411 790864 765066 742195
55701 742195 723037 707421 694501 683252 673089 664268 657414 652533 648964 646348 644912 644641 644976
55688 644976 645591 646499 646870 644665 638290 628003 614945 599466 581336 561085 539991 518809 497542
55675 497542 476544 456975 439802 425035 412301 401628 393067 385779 378224 369592 360767 353502 348630
55662 348630 345333 342149 338217 333351 327435 320363 312432 304326 296753 290319 285391 281599 277854 273529
55648 273529 269346 266385 264616 263402 263136 264897 268329 271346 272576 272853 273461 274032 273274 270906 267575
55633 267575 263367 257691 250574 243074 236309 230817 226858 224594 223823 224014 224691 225523 226271 227121 228857 232103
$$ packed form
55726I88009m553l127j720O14L578O284Q606J0434J0673Q594N222J861j969p448
55712A025058j4049j9947k4380k7858l0358l1101l0173k8781k7547k5798k2871
55701G42195j9158j5616j2920j1249j0163q821o854m881l569k616j436k71L35
55688F44976O15R08L71k205o375j0287j3058j5479j8130k0251k1094k1182k1267
55675D97542k0998j9569j7173j4767j2734j0673q561p288p555q632q825p265m872
55662C48630l297l184l932m866n916p072p931q106p573o434m928l792l745m325
55648B73529m183k961j769j214k66J761L432L017J230K77O08N71p58k368l331
55633B67575m208n676p117p500o765n492l959k264p71J91O77Q32P48Q50J736L246
$$ plain form
55617 232103 236480 241049 245505 250366 255961 261752 266752 270209 272034 273105 275140 279477 285553 290992
55603 290992 293631 293313 291416 288869 285184 279538 272342 265170 259062 253502 247427 240845 234814 230044
55589 230044 226286 223143 220687 219084 218303 218464 219656 221087 221365 220265 219397 220179 221840 222474 221640 220789
55573 220789 221253 222883 224619 225435 224628 222118 218730 215530 212717 209803 206745 204021 201554 198686 195555
55558 195555 193484 193335 194207 194478 193507 191725 189668 187746 186472 185911 185090 182809 179102 175159 171835 169077
55542 169077 166879 165818 166033 166500 166268 166063 167678 171659 176488 180337 182902 184907 186593 187650 188428
55527 188428 190046 193082 196974 201115 205817 211675 218664 226516 235477 245843 257136 268737 281402
55514 281402 297099 316962 340036 364554 390022 417501 448014 481228 515845 550999 586909
$$ packed form
55617B32103M377M569M456M861N595N791N000L457J825J071K035M337O076N439
55603B90992K639l18j897k547l685n646p196p172o108n560o075o582o031m770
55589B30044l758l143k456j603p81J61J192J431K78j100q68P82J661O34q34q51
55573B20789M64J630J736Q16q07k510l388l200k813k914l058k724k467k868l131
55558A95555k071j49Q72K71r71j782k057j922j274n61q21k281l707l943l324k758
55542A69077k198j061K15M67k32k05J615L981M829L849K565K005J686J057P78
55527A88428J618L036L892M141M702N858O989P852Q961J0366J1293J1601J2665
55514B81402J5697J9863K3074K4518K5468K7479L0513L3214L4617L5154L5910
$$ plain form
55503 586909 623885 660602 693620 718905 733952 738398 732874 717849 693935 663008 628348 593104
55491 593104 558500 523883 488696 453976 421396 391307 362713 335256 310004 287757 267678
55480 267678 248678 231393 217375 206563 196900 186735 176553 167913 161486 156570 151911 146539 140316
55467 140316 134036 128735 124692 121416 118574 116356 114799 113441 112002 110796 110098 109508 108328 106275 103656
55452 103656 101317 100526 102137 105402 108286 109614 110358 112152 115048 117556 118633 118693 118722 119171 119882 120509
55436 120509 120801 120869 121290 122631 124873 127564 130340 132801 134107 133493 131337 128982 127211 125467 122922
55421 122922 119696 116474 113422 110271 107229 104950 103483 101957 99724 97272 95532 94583 93612 92075 90330
55406 90330 88889 87526 85565 82972 80720 79846 80277 80773 80072 78095 76026 75180 75707 76352 75516 72699
$$ packed form
55503E86909L6976L6717L3018K5285J5047M446n524j5025k3914l0927l4660l5244
55491E93104l4604l4617l5187l4720l2580l0089k8594k7457k5252k2247k0079
55480B67678j9000j7285j4018j0812r663j0165j0182q640o427m916m659n372o223
55467A40316o280n301m043l276k842k218j557j358j439j206o98n90j180k053k619
55452A03656k339p91J611L265K884J328P44J794K896K508J077O0K9M49P11O27
55436A20509K92O8M21J341K242K691K776K461J306o14k156k355j771j744k545
55421A22922l226l222l052l151l042k279j467j526k233k452j740r49r71j537j745
55406I0330j441j363j961k593k252q74M31M96p01j977k069q46N27O45q36k817
$$ plain form
55390 72699 69030 66376 65812 66912 68529 70093 71864 73952 75593 75760 74214 71591 68764 66636 66158
55375 66158 67622 69910 71454 72238 73849 76882 79305 78470 74261 69165 65543 64030 64453 66764 70426
55360 70426 73952 75996 76520 76322 75897 75466 75683 77456 80898 85028 88755 91867 94891 98154 101261 103561
55344 103561 104997 106241 107837 109380 109863 108750 106505 104089 102299 101541 101816 102622 103128 102752 101613 100393
55328 100393 99761 99759 99586 98164 95195 91548 88273 85411 82278 78829 76006 74519 73714 72107 68907 64861
55312 64861 61693 60631 61338 62419 63252 64836 68167 72205 74655 74880 74736 75967 77872 78478 77186 75156
55296 75156 73619 73000 73430 74835 76359 76740 75698 74211 73096 72102 70861 69984 70264 71098 70685 68144
55280 68144 64808 62935 63371 64869 65561 64624 62595 60699 60216 61882 65212 68606 70777 72100 73996
$$ packed form
55390G2699l669k654n64J100J617J564J771K088J641J67j546k623k827k128m78
55375F6158J464K288J544P84J611L033K423q35m209n096l622j513M23K311L662
55360G0426L526K044N24j98m25m31K17J773L442M130L727L112L024L263L107K300
55344A03561J436J244J596J543M83j113k245k416j790p58K75Q06N06l76j139j220
55328A00393o32kj73j422k969l647l275k862l133l449k823j487q05j607l200m046
55312F4861l168j062P07J081Q33J584L331M038K450K25j44J231J905O06j292k030
55296G5156j537o19M30J405J524L81j042j487j115r94j241q77K80Q34m13k541
55280F8144l336j873M36J498O92r37k029j896m83J666L330L394K171J323J896
$$ plain form
55265 73996 76951 79725 80650 79191 76100 72633 69923 68528 68112 67827 67310 67017 67348 67886 67894 67239 66453
55248 66453 66022 65928 65740 65005 63760 62709 62558 63192 63918 64418 64825 64874 64055 62863 62780 64349 66251 67061
55230 67061 67056 67325 68063 68918 70232 72370 74309 74543 73317 72422 72695 73173 73023 72793 73216 74045 74842 75835
55212 75835 77157 78113 78033 77275 76616 76233 75863 75444 75002 74393 73690 73306 73309 73241 73062 73358 73959 73381 70779 67738
55192 67738 66827 68727 71999 75262 78082 79753 78989 75544 71099 67748 66324 66627 68369 71121 74020
55177 74020 76347 78097 79426 80034 79696 78853 77950 76691 74920 73773 74594 76661 77424 75642 73151 72554
55161 72554 74003 75448 75597 75148 75016 74860 74160 73728 74894 77573 80222 81739 82361 82432 81407 78877 75944
55144 75944 74486 75123 76772 78267 79538 80860 81818 81761 80791 79423 77565 74814 71816 70288 71128 73218
$$ packed form
55265G3996K955K774R25j459l091l467k710j395m16k85n17k93L31N38Qo55p86
55248F6453m31r4j88p35j245j051j51O34P26N00M07M9q19j192q3J569J902Q10
55230F7061nK69P38Q55J314K138J939K34j226q95K73M78j50k30M23Q29P97R93
55212G5835J322R56q0p58o59l83l70m19m42o09p03l84Lo8j79K96O01n78k602l041
55192F7738r11J900L272L263K820J671p64l445m445l351j424L03J742K752K899
55177G4020K327J750J329O08l38q43r03j259j771j147Q21K067P63j782k491n97
55161G2554J449J445J49m49j32j56p00m32J166K679K649J517O22P1j025k530k933
55144G5944j458O37J649J495J271J322R58n7r70j368j858k751k998j528Q40K090
$$ plain form
55128 73218 74785 75465 76332 78168 80572 82677 83905 83846 82226 79514 77032 76009 76642 78320 80313 81873
55112 81873 82122 80588 77928 75691 75150 76304 77724 77293 73754 68221 63846 63123 65477 68161 69453
55097 69453 70003 70843 71379 70357 68083 66329 66128 66869 67768 69031 70940 72655 73011 72150 71432 71656 72142
55080 72142 71749 70267 68528 67571 67837 68908 69876 70264 70577 71527 72776 73143 72292 71408 71739 73092 74443
55063 74443 75436 76396 77258 77558 77403 77502 78049 78356 77810 76539 75036 73775 73331 74086 75551 76643 76980 77265
55045 77265 78246 80038 82686 86442 90928 94929 97691 99727 101603 102789 102624 101755 101475 102096 103065 104275
55029 104275 105990 107662 108193 107467 106381 105157 102966 99723 96989 96210 96925 97666 97897 97987 97732 96234
55013 96234 93388 90456 88686 87976 87352 86278 84915 83312 81088 78094 74907 72319 70621 69682 69454
$$ packed form
55128G3218J567O80Q67J836K404K105J228n9j620k712k482j023O33J678J993J560
55112H1873K49j534k660k237n41J154J420m31l539n533m375p23K354K684J292
55097F9453N50Q40N36j022k274j754k01P41Q99J263J909J715L56q61p18K24M86
55080G2142l93j482j739r57K66J071R68L88L13R50J249L67q51q84L31J353J351
55063G4443R93R60Q62L00j55R9N47L07n46j271j503j261m44P55J465J092L37K85
55045G7265R81J792K648L756M486M001K762K036J876J186j65q69k80O21R69J210
55029A04275J715J672N31p26j086j224k191l243k734p79P15P41K31R0k55j498
55013I6234k846k932j770p10o24j074j363j603k224k994l187k588j698r39k28
$$ plain form
54998 69454 69892 70635 71446 72795 75167 77745 78865 78227 77563 78302 79535 79497 78299 77624 77969 77946 76671
54981 76671 75436 76148 79073 82850 86011 87767 87962 87167 86569 87021 88261 89430 90192 91007 92419 94390
54965 94390 96246 97191 97122 96939 97680 99317 100952 102153 103343 104691 105653 106229 107726 111240 115851 119413
54949 119413 120957 121440 122170 123406 124633 125433 125776 125934 126311 127052 127790 128201 128751 130366 133265 136624 139546
54932 139546 141887 143948 145863 147618 149329 151020 152337 152833 152521 151922 151523 151346 151121 150782 150573 150496 149846
54915 149846 147719 144127 140145 136677 133497 129996 126438 123734 122204 121349 120844 120924 121702 122929 124660
54900 124660 127266 130390 132847 134278 136011 139316 143393 146218 147028 146832 146687 146804 147384 148892 150983
54885 150983 152404 152751 153335 155430 158517 161282 163707 166953 171571 177079 183241 190484 198815 207364 215482
$$ packed form
54998F9454M38P43Q11J349K372K578J120o38o64P39J233l8j198o75L45k3j275
54981G6671j235P12K925L777L161J756J95p95n98M52J240J169P62Q15J412J971
54965I4390J856R45o9j83P41J637J635J201J190J348R62N76J497L514M611L562
54949A19413J544M83P30J236J227Q00L43J58L77P41P38M11N50J615K899L359K922
54932A39546K341K061J915J755J711J691J317M96l12n99l99j77k25l39k09p7o50
54915A49846k127l592l982l468l180l501l558k704j530q55n05Q0P78J227J731
54900A24660K606L124K457J431J733L305M077K825Q10j96j45J17N80J508K091
54885A50983J421L47N84K095L087K765K425L246M618N508O162P243Q331Q549Q118
$$ plain form
54870 215482 223631 232803 243590 255865 268638 280015 288158 292800 295206 296314 295671 292597 287393
54857 287393 280560 271622 259914 246181 232274 219259 206834 194801 184141 176147 170950 167365
54845 167365 164010 160311 156603 153506 151311 150006 149709 150660 152605 154705 156418 158158 160696 164308 168983
54830 168983 174992 182511 191055 200176 210509 223046 237178 250535 261285 269876 277837 285336 290592
54817 290592 291546 287605 279823 269861 258946 247708 236606 226123 216374 206944 197612 189066 182407
54804 182407 177835 174258 170285 165440 160444 156660 155299 156796 160804 166680 173676 180563 185784 188757
54790 188757 190733 193446 196934 199491 199839 198488 196562 194040 189829 183360 175621 168474 162977 158451
54776 158451 153481 147874 143004 139832 137353 133855 129220 124914 122061 120705 120655 121600 122305 121224 118494
$$ packed form
54870B15482Q149R172J0787J2275J2773J1377Q143M642K406J108o43l074n204
54857B87393o833q938j1708j3733j3907j3015j2425j2033j0660p994n197l585
54845A67365l355l699l708l097k195j305k97R51J945K100J713J740K538L612M675
54830A68983O009P519Q544R121J0333J2537J4132J3357J0750Q591P961P499N256
54817B90592R54l941p782r962j0915j1238j1102j0483r749r430r332q546o659
54804A82407m572l577l973m845m996l784j361J497M008N876O996O887N221K973
54790A88757J976K713L488K557L48j351j926k522m211o469p739p147n497m526
54776A58451m970n607m870l172k479l498m635m306k853j356n0R45P05j081k730
$$ plain form
54761 118494 116107 115527 116116 116370 115676 114326 112906 112256 112983 114351 114700 113599 112511 112635 113382 113924 114774
54744 114774 116439 117731 117161 115334 114213 114519 115370 116060 116484 116179 114789 113552 114580 118320 123123 127580
54728 127580 131799 136028 139671 142499 145611 150311 156905 165187 175041 185693 195405 203173 210263 219100
54714 219100 230843 244754 259559 274431 288683 301302 311261 318157 322553 325689 328529 330808 331353
54701 331353 329588 326402 323145 320212 317208 314274 312458 312537 314070 315965 317675 319388 321209 322743 323624
54686 323624 323963 323889 322977 320772 317757 315091 313247 311611 309589 307324 304824 301323 296562 292190 290646
54671 290646 292556 296196 299707 302984 307070 312450 318373 323319 325708 324532 319785 312138 302099 289771
54657 289771 275555 260657 246587 234259 223739 214599 206368 198808 191906 185569 179544 173865 169205
$$ packed form
54761A18494k387n80N89K54o94j350j420o50P27J368L49j101j088J24P47N42Q50
54744A14774J665J292n70j827j121L06Q51O90M24l05j390j237J028L740M803M457
54728A27580M219M229L643K828L112M700O594Q282R854J0652R712P768P090Q837
54714B19100J1743J3911J4805J4872J4252J2619R959O896M396L136K840K279N45
54701C31353j765l186l257k933l004k934j816P9J533J895J710J713J821J534Q81
54686C23624L39p4r12k205l015k666j844j636k022k265k500l501m761m372j544
54671B90646J910L640L511L277M086N380N923M946K389j176m747p647j0039j2328
54657B89771j4216j4898j4070j2328j0520r140q231p560o902o337o025n679m660
$$ plain form
54644 169205 166254 164701 163232 160695 157035 153180 150375 149566 150839 153300 155784 157732 159072 159499 158644
54629 158644 156990 155847 155996 156915 157765 158569 159931 162018 164444 166973 169717 172654 175357 177379 178738
54614 178738 180024 182111 185632 190421 195429 199372 201686 202906 204089 205762 207415 208148 207828 207468 208421
54599 208421 211332 215817 220709 224526 226330 226707 227642 230829 236189 242367 248435 254620 261728 270473 281236
54584 281236 293697 306834 319951 333697 349408 367352 386171 404050 419765 432678 442560 449584
54572 449584 453737 454056 449175 438920 424744 408473 391412 374865 360438 349047 340144 332529 325538
54559 325538 319076 313026 307119 301074 294639 287954 282004 277890 275293 272421 267970 262349 256539 250728
54545 250728 244969 240200 237268 235397 232918 229424 226092 223830 222239 220570 218696 216683 214207 211031
$$ packed form
54644A69205k951j553j469k537l660l855k805q09J273K461K484J948J340M27q55
54629A58644j654j143J49R19Q50Q04J362K087K426K529K744K937K703K022J359
54614A78738J286K087L521M789N008L943K314J220J183J673J653P33l20l60R53
54599B08421K911M485M892L817J804L77R35L187N360O178O068O185P108Q745J0763
54584B81236J2461J3137J3117J3746J5711J7944J8819J7879J5715J2913R882P024
54572D49584M153L19m881j0255j4176j6271j7061j6547j4427j1391q903p615o991
54559C25538o462o050n907o045o435o685n950m114k597k872m451n621n810n811
54545B50728n759m769k932j871k479l494l332k262j591j669j874k013k476l176
$$ plain form
54531 211031 207687 205104 203780 203633 204513 206371 208798 210666 210748 209026 207233 207554 210585 214882 218578
54516 218578 220933 222132 222282 221247 219181 216664 214426 213261 213835 216112 219241 222433 225640 228980 232025
54501 232025 234361 236481 239270 242678 245700 247661 248855 249952 251519 254178 258430 263973 269655 274351
54487 274351 277613 279595 280930 282624 285257 288089 289654 289571 289172 289996 292355 295782 300157 305635 311856
54472 311856 318049 323885 329735 336148 343422 351465 359607 366609 371442 374050 375034 374647 372588 368717 363284
54457 363284 356402 348022 338898 330889 325397 321591 317025 310275 302403 295549 290619 286911 283641 281003
54443 281003 279589 279414 279971 280923 282242 283742 285000 285975 287451 290509 295570 302120 309282 316295 322376
54428 322376 326765 329507 331947 335583 340263 344234 346375 347691 349938 353314 356461 358597 360647 363974
$$ packed form
54531B11031l344k583j324j47Q80J858K427J868Q2j722j793L21L031M297L696
54516B18578K355J199J50j035k066k517k238j165N74K277L129L192L207L340L045
54501B32025K336K120K789L408L022J961J194J097J567K659M252N543N682M696
54487B74351L262J982J335J694K633K832J565q3l99Q24K359L427M375N478O221
54472C11856O193N836N850O413P274Q043Q142P002M833K608R84l87k059l871n433
54457C63284o882q380r124q009n492l806m566o750p872o854m930l708l270k638
54443B81003j414j75N57R52J319J500J258R75J476L058N061O550P162P013O081
54428C22376M389K742K440L636M680L971K141J316K247L376L147K136K050L327
$$ plain form
54414 363974 368715 373668 377372 379022 378754 377440 376000 374702 373188 371097 368445 365628 363393 362564 363148
54399 363148 363925 363768 363202 363615 364828 364826 362486 359406 358021 358825 360554 362338 364213 365821 366069 364422
54383 364422 361564 358406 355123 351424 347112 342192 336950 332176 328680 326329 324007 320827 316978 313181
54369 313181 309834 307038 304944 303549 302391 301113 300307 301233 304445 309040 313486 316880 319044 319822 319117
54354 319117 317752 317436 319130 321848 323749 324127 323632 322813 321525 319879 318707 318611 319369 320733 323015 326266
54338 326266 329537 331754 332993 334262 336289 338918 341283 342208 340994 338356 336016 334809 333792 331842
54324 331842 329411 327837 327491 327564 327241 326068 323660 320129 316586 314066 312137 309520 305913 302193 299152
54309 299152 297208 296988 298569 300153 299251 295761 292405 291430 292134 292464 291731 290693 290015 289888 290603 292242
$$ packed form
54414C63974M741M953L704J650k68j314j440j298j514k091k652k817k235q29N84
54399C63148P77j57n66M13J213kk340l080j385Q04J729J784J875J608K48j647
54383C64422k858l158l283l699m312m920n242m774l496k351k322l180l849l797
54369C13181l347k796k094j395j158j278q06R26L212M595M446L394K164P78p05
54354C19117j365l16J694K718J901L78m95q19j288j646j172r6P58J364K282L251
54338C26266L271K217J239J269K027K629K365R25j214k638k340j207j017j950
54324C31842k431j574l46P3l23j173k408l531l543k520j929k617l607l720l041
54309B99152j944k20J581J584r02l490l356r75P04L30p33j038o78j27P15J639
$$ plain form
54293 292242 294010 294838 294650 294347 294659 295530 296457 296980 296879 296301 295576 294718 293339 291185 288437 285310 281844
54276 281844 278355 275606 274160 273877 274237 274707 274590 273098 269972 265626 260475 254788 249380 245501 243411
54261 243411 241742 239055 235462 232089 229554 227681 226116 224273 221249 216822 212179 208674 206172 203711
54247 203711 201397 200211 199889 198608 195333 191262 188168 186307 184881 183688 183048 182339 179902 174804 168095
54232 168095 161938 157750 155355 153610 151567 149110 146835 145521 145626 146941 148371 148191 145066 139365 133445
54217 133445 130192 130905 134463 138522 141360 142621 142649 141736 140153 138450 137192 136409 135622 134480 133246 132655
54201 132655 133416 135630 138397 140267 140541 140100 140455 141983 143670 144659 145333 146451 147812 148399 147662 146148
54185 146148 144862 144291 144038 143350 142052 140923 140881 141893 143179 144440 146096 148120 149483 149310 147878 145811
$$ packed form
54293B92242J768Q28j88l03L12Q71R27N23j01n78p25q58j379k154k748l127l466
54276B81844l489k749j446k83L60M70j17j492l126m346n151n687n408l879k090
54261B43411j669k687l593l373k535j873j565j843l024m427m643l505k502k461
54247B03711k314j186l22j281l275m071l094j861j426j193o40p09k437n098o709
54232A68095o157m188k395j745k043k457k275j314J05J315J430j80l125n701n920
54217A33445l253P13L558M059K838J261K8r13j583j703j258p83p87j142j234n91
54201A32655P61K214K767J870K74m41L55J528J687R89O74J118J361N87p37j514
54185A46148j286n71k53o88j298j129m2J012J286J261J656K024J363j73j432k067
$$ plain form
54169 145811 143065 139701 137102 137144 140029 143851 146395 146693 144957 142065 139411 138205 138280 138127 136697 134733
54153 134733 133833 134513 135733 136054 134703 131637 127261 122418 118350 116078 115487 115186 113733 111202 109204
54138 109204 109084 110473 112024 113138 114184 115236 115594 114840 113621 112855 112677 112570 112079 110958 109047 106580
54122 106580 104394 103292 103336 104030 105029 106243 107442 108174 108065 106973 105040 102900 101517 101329 101680 101602 101061
54105 101061 100934 101830 103536 105608 107828 109832 110932 110775 109799 108676 107613 106594 105853 105569 105338 104624
54089 104624 103700 103584 104745 106375 107172 106595 105130 103630 102793 103080 104611 106788 108248 107729 105405 103163
54073 103163 103000 104888 106683 106502 104835 103695 103951 104430 103799 102382 101520 101774 102541 103119 103359 103324 103076
54056 103076 102994 103704 105373 107378 108923 109677 109659 108840 107259 105356 103803 102906 102392 101851 101261 100891 100777
$$ packed form
54169A45811k746l364k599M2K885L822K544K98j736k892k654j206P5j53j430j964
54153A34733r00O80J220L21j351l066m376m843m068k272n91l01j453k531j998
54138A09204j20J389J551J114J046J052L58p54j219p66j78j07m91j121j911k467
54122A06580k186j102M4O94R99J214J199P32j09j092j933k140j383j88L51p8n41
54105A01061j27Q96J706K072K220K004J100j57r76j123j063j019p41k84k31p14
54089A04624r24j16J161J630P97n77j465j500q37K87J531K177J460n19k324k242
54073A03163j63J888J795j81j667j140K56M79o31j417q62K54P67N78K40l5k48
54056A03076q2P10J669K005J545P54j8q19j581j903j553q97n14n41n90l70j14
$$ plain form
54039 100777 100577 100110 99866 100562 102155 103606 103842 102758 101191 100187 100428 101910 103854 105121 105140 104273
54023 104273 103156 102095 101516 102354 105049 108328 109982 109159 107263 106359 107276 109488 112206 115037 117893
54008 117893 120699 123170 124812 125262 124625 123219 121119 118415 115819 114395 114621 116193 118714 121763 124302
53993 124302 125047 124018 122934 123395 125221 127155 128610 130008 131861 134371 137561 141025 143767 145113 145659
53978 145659 146585 148128 149475 150179 150824 152124 154096 156465 159397 163396 168746 175292 182521 189738 196429
53963 196429 202644 208826 215055 220644 224701 227114 228828 231124 234554 238530 242016 244635 246989 249902
53949 249902 253448 256793 258831 258974 257526 255357 253062 250481 247203 243375 239504 235571 230994 225673
53935 225673 220434 216188 213104 210776 208549 205455 200720 194878 189708 186434 184651 183552 183313 184309 185655
$$ packed form
54039A00777k00m67k44O96J593J451K36j084j567j004K41J482J944J267J9q67
54023A04273j117j061n79Q38K695L279J654q23j896r04R17K212K718K831K856
54008A17893K806K471J642M50o37j406k100k704k596j424K26J572K521L049K539
53993A24302P45j029j084M61J826J934J455J398J853K510L190L464K742J346N46
53978A45659R26J543J347P04O45J300J972K369K932L999N350O546P229P217O691
53963A96429O215O182O229N589M057K413J714K296L430L976L486K619K354K913
53949B49902L546L345K038J43j448k169k295k581l278l828l871l933m577n321
53935B25673n239m246l084k328k227l094m735n842n170l274j783j099k39R96J346
$$ plain form
53920 185655 185814 184342 182040 179643 177375 175524 174308 173191 171439 169347 167946 167510 167369 167211 167444
53905 167444 168133 168745 169254 170421 172548 174811 176195 176356 175461 174180 173940 175875 179095 181340 182000 183293
53889 183293 187483 194049 200609 205737 209690 213125 216377 219628 222679 224832 225952 227275 230219 234681
53875 234681 239421 243853 248406 253328 258083 261944 264464 265595 266212 268178 272679 278485 282963 284976
53861 284976 285766 286886 288449 289925 291556 294030 297362 300901 304280 307723 311593 316026 321009 326634
53847 326634 333138 340490 347788 353494 356979 359639 363622 369283 374626 377596 378256 378353 379393 381614 384258
53832 384258 386163 386375 384750 381980 378838 375674 372730 370418 368822 367168 364201 358937 351086 341310
53818 341310 331313 322940 316586 310941 304870 299008 294787 292341 290325 287568 283910 279459 273989 267467
$$ packed form
53920A85655J59j472k302k397k268j851j216j117j752k092j401m36j41j58K33
53905A67444O89O12N09J167K127K263J384J61q95j281k40J935L220K245O60J293
53889A83293M190O566O560N128L953L435L252L251L051K153J120J323K944M462
53875B34681M740M432M553M922M755L861K520J131O17J966M501N806M478K013
53861B84976P90J120J563J476J631K474L332L539L379L443L870M433M983N625
53847C26634O504P352P298N706L485K660L983N661N343K970O60R7J040K221K644
53832C84258J905K12j625k770l142l164k944k312j596j654k967n264p851r776
53818C41310r997q373o354n645o071n862m221k446k016k757l658m451n470o522
$$ plain form
53804 267467 260520 254051 248633 244369 240908 237624 234222 231118 228761 226760 224345 221532 218929 216487
53790 216487 213544 210246 207743 206518 205680 204564 203859 204211 204741 204184 202758 201571 200807 199984 199555 200559
53774 200559 202597 203886 203746 203613 204916 207137 208796 209390 209436 209384 209294 209202 209013 208489 207838 207815 208727 209944
53756 209944 210969 212246 214132 215776 216033 215049 213918 213162 212564 212173 212253 212374 211871 211294 212092 214495 217045
53739 217045 218863 221162 225499 231349 236674 240490 243742 247727 252664 257939 262823 266648 269123 271039
53725 271039 274104 279285 285538 290825 294355 297138 300226 303203 304919 305135 304637 303980 302969 301483 300009
53710 300009 299061 298524 297863 296611 294561 292017 289917 289067 288993 288387 287017 286316 287363 289156 289874 289250 288572
53693 288572 288651 288841 287991 285494 281481 276801 272623 269293 265818 261378 256999 254474 253809 253119 251181 248724
$$ packed form
53804B67467o947o469n418m264l461l284l402l104k357k001k415k813k603k442
53790B16487k943l298k503j225q38j116p05L52N30n57j426j187p64q23m29J004
53774B00559K038J289j40j33J303K221J659N94M6n2r0r2j89n24o51k3R12J217
53756B09944J025J277J886J644K57r84j131p56n98l91Q0J21n03n77P98K403K550
53739B17045J818K299M337N850N325L816L252L985M937N275M884L825K475J916
53725B71039L065N181O253N287L530K783L088K977J716K16m98o57j011j486j474
53710C00009r48n37o61j252k050k544k100q50p4o06j370p01J047J793P18o24o78
53693B88572P9J90q50k497m013m680m178l330l475m440m379k525o65o90j938k457
$$ plain form
53677 248724 246853 245594 244681 244503 245399 246805 247945 248670 248999 248587 247391 246120 245298 244528 243473 242821
53661 242821 243284 244169 244109 243086 242737 244510 248113 251852 254106 254490 253946 253785 254562 256007 257843 260037
53645 260037 262291 264190 266144 269144 273078 276314 277819 278756 280962 284569 288304 291590 295033 299083
53631 299083 303484 308078 313090 318588 324442 330753 337488 343928 349465 354864 361711 370478 379907 388188
53617 388188 393947 396468 396344 395949 397829 402159 406824 410231 412746 414975 416228 415879 415124 415902 418453
53602 418453 421034 422048 421681 421485 422844 425729 428626 429869 429371 428786 429682 431922 434004 434407 432322 427901
53586 427901 422609 418846 418227 420189 422687 423964 423221 420155 414958 408755 403178 399206 396804 395571 395099
53571 395099 394682 393526 391644 390039 389616 390272 391281 392167 392832 393236 393492 394142 395885 398902 402688 406557
$$ packed form
53677B48724j871j259r13j78Q96J406J140P25L29m12j196j271q22p70j055o52
53661B42821M63Q85o0j023l49J773L603L739K254L84n44j61P77J445J836K194
53645B60037K254J899J954L000L934L236J505R37K206L607L735L286L443M050
53631B99083M401M594N012N498N854O311O735O440N537N399O847Q767R429Q281
53617C88188N759K521j24l95J880M330M665L407K515K229J253l49p55P78K551
53602D18453K581J014l67j96J359K885K897J243m98n85Q96K240K082M03k085m421
53586D27901n292l763o19J962K498J277p43l066n197o203n577l972k402j233m72
53571C95099m17j156j882j605m23O56J009Q86O65M04K56O50J743L017L786L869
$$ plain form
53555 406557 410178 413632 417121 420651 423927 426729 429595 434013 441483 452132 464315 475774 485150
53542 485150 492495 498658 504440 510111 515385 519825 523537 527514 533098 540922 550362 559867 567850 573710
53528 573710 578540 584618 593553 604704 615743 624765 631435 636284 639810 642473 644669 646187 646439 645827
53514 645827 646081 648389 651817 654581 656293 657735 658749 657948 654815 650853 647951 646438 645321 643775 641758
53499 641758 639526 637167 634536 631429 627976 624802 622535 621239 620703 621055 622416 624147 625338 625984 626800
53484 626800 627899 628877 630299 633602 638890 644220 647972 650792 654156 658271 662908 669233 678851 691309
53470 691309 704353 716759 729429 743537 759116 775923 794313 814607 836576 860193 885972
53459 885972 913962 943268 973225 1004261 1036866 1070466 1104255 1138722 1175439 1215494 1258729
$$ packed form
53555D06557L621L454L489L530L276K802K866M418P470J0649J2183J1459R376
53542D85150P345O163N782N671N274M440L712L977N584P824R440R505P983N860
53528E73710M830O078Q935J1151J1039R022O670M849L526K663K196J518K52o12
53514F45827K54K308L428K764J712J442J014q01l133l962k902j513j117j546k017
53499F41758k232k359k631l107l453l174k267j296n36L52J361J731J191O46Q16
53484F26800J099R78J422L303N288N330L752K820L364M115M637O325R618J2458
53470F91309J3044J2406J2670J4108J5579J6807J8390K0294K1969K3617K5779
53459H85972K7990K9306K9957L1036L2605L3600L3789L4467L6717M0055M3235
$$ plain form
53448 1258729 1304235 1351028 1398500 1446956 1497671 1551965 1610190 1671856 1736382 1803359 1872478
53437 1872478 1943764 2017445 2092968 2168541 2242514 2314950 2387067 2459511 2532347 2606600 2684246
53426 2684246 2766229 2851689 2939777 3030987 3125709 3222426 3318479 3412058 3502363 3588493 3669588
53415 3669588 3745843 3817953 3885438 3946751 4001240 4049953 4094443 4136111 4177056 4219886 4265617
53404 4265617 4312789 4359696 4406400 4453255 4498394 4538544 4572134 4599930 4622417 4638198 4645613
53393 4645613 4644660 4636395 4621211 4598577 4567944 4529188 4482685 4429676 4372225 4311971 4248948 4182176
53381 4182176 4111249 4036746 3959280 3879096 3796874 3714129 3632127 3550733 3469001 3386711 3304614
53370 3304614 3223155 3141934 3061113 2982652 2909162 2841630 2779286 2721811 2670566 2627089 2591353
$$ packed form
53448A258729M5506M6793M7472M8456N0715N4294N8225O1666O4526O6977O9119
53437A872478P1286P3681P5523P5573P3973P2436P2117P2444P2836P4253P7646
53426B684246Q1983Q5460Q8088R1210R4722R6717R6053R3579R0305Q6130Q1095
53415C669588P6255P2110O7485O1313N4489M8713M4490M1668M0945M2830M5731
53404D265617M7172M6907M6704M6855M5139M0150L3590K7796K2487J5781P415
53393D645613r53q265j5184k2634l0633l8756m6503n3009n7451o0254o3023o6772
53381D182176p0927p4503p7466q0184q2222q2745q2002q1394q1732q2290q2097
53370C304614q1459q1221q0821p8461p3490o7532o2344n7475n1245m3477l5736
$$ plain form
53359 2591353 2562361 2539874 2524640 2517382 2518550 2528675 2547880 2575140 2609045 2649292 2696447 2750187
53347 2750187 2808898 2871190 2936813 3005837 3078128 3154081 3234672 3320011 3408851 3500391 3595797
53336 3595797 3696896 3803947 3915767 4031756 4152886 4280883 4417198 4562588 4716820
53327 4716820 4878714 5046943 5220776 5399681 5582489 5767488 5953284 6139333 6326050
53318 6326050 6514667 6706322 6900523 7094877 7286775 7474684 7657164 7831647 7995837
53309 7995837 8150119 8297116 8438560 8573647 8700797 8820054 8933303 9042725 9149353
53300 9149353 9252481 9350032 9439718 9519840 9588588 9642834 9678259 9690461 9675268 9628626 9548003
53289 9548003 9434580 9293017 9128525 8944921 8745634 8534927 8316692 8092699 7863250
$$ packed form
53359B591353k8992k2487j5234p258J168J0125J9205K7260L3905M0247M7155N3740
53347B750187N8711O2292O5623O9024P2291P5953Q0591Q5339Q8840R1540R5406
53336C595797J01099J07051J11820J15989J21130J27997J36315J45390J54232
53327D716820J61894J68229J73833J78905J82808J84999J85796J86049J86717
53318F326050J88617J91655J94201J94354J91898J87909J82480J74483J64190
53309G995837J54282J46997J41444J35087J27150J19257J13249J09422J06628
53300I149353J03128R7551Q9686Q0122O8748N4246L5425J2202j5193m6642q0623
53289I548003j13423j41563j64492j83604j99287k10707k18235k23993k29449
$$ plain form
53280 7863250 7629233 7392664 7155488 6918932 6684001 6451598 6221739 5993308 5765168
53271 5765168 5537492 5311886 5090387 4874606 4665729 4464931 4273201 4090670 3916698
53262 3916698 3751133 3595234 3450813 3318659 3198329 3089213 2991046 2903598 2826822 2761297
53252 2761297 2707455 2664168 2629199 2601324 2580847 2567502 2559149 2553550 2550489 2551136 2556073 2564973 2577495
53239 2577495 2593189 2610924 2629711 2650006 2673206 2700012 2730251 2764101 2802428 2845961 2895071
53228 2895071 2950248 3011624 3077976 3147337 3218920 3293529 3371778 3452907 3535764 3619988 3705578
53217 3705578 3792014 3878589 3965214 4052173 4139145 4224897 4308043 4388064 4465705 4542223 4618014
53206 4618014 4692222 4763998 4833587 4901382 4966233 5025794 5078414 5123540 5160229 5186614 5201263
$$ packed form
53280G863250k34017k36569k37176k36556k34931k32403k29859k28431k28140
53271E765168k27676k25606k21499k15781k08877k00798j91730j82531j73972
53262C916698j65565j55899j44421j32154j20330j09116r8167q7448p6776o5525
53252B761297n3842m3287l4969k7875k0477j3345q353n599l061O47M937Q900J2522
53239B577495J5694J7735J8787K0295K3200K6806L0239L3850L8327M3533M9110
53228B895071N5177O1376O6352O9361P1583P4609P8249Q1129Q2857Q4224Q5590
53217C705578Q6436Q6575Q6625Q6959Q6972Q5752Q3146Q0021P7641P6518P5791
53206D618014P4208P1776O9589O7795O4851N9561N2620M5126L6689K6385J4649
$$ plain form
53195 5201263 5203782 5193474 5168647 5128161 5072575 5002802 4918679 4820207 4709413 4589500 4462537
53184 4462537 4329291 4191017 4049912 3907832 3766072 3626769 3493003 3366572 3246413
53175 3246413 3129926 3015328 2902219 2790537 2679797 2569140 2457504 2343803 2227551
53166 2227551 2109575 1991983 1877189 1766721 1660815 1559262 1462760 1373137 1291930 1218939
53156 1218939 1152641 1091870 1036543 986830 942364 902589 867347 836645 809975 786153 763817
53145 763817 742193 721578 703067 687382 673935 661266 648279 634754 620829 606579 592143
53134 592143 577682 563088 548246 533638 520066 507630 495614 483625 472229 462137 453382 445634
53122 445634 438651 431986 424999 417765 411320 406202 401325 395227 388064 381380 376059 371557 367143 362867
$$ packed form
53195E201263K519j0308k4827m0486n5586o9773q4123r8472j10794j19913j26963
53184D462537j33246j38274j41105j42080j41760j39303j33766j26431j20159
53175C246413j16487j14598j13109j11682j10740j10657j11636j13701j16252
53166B227551j17976j17592j14794j10468j05906j01553r6502q9623q1207p2991
53156A218939o6298o0771n5327m9713m4466l9775l5242l0702k6670k3822k2336
53145G63817k1624k0615j8511j5685j3447j2669j2987j3525j3925j4250j4436
53134E92143j4461j4594j4842j4608j3572j2436j2016j1989j1396j0092q755p748
53122D45634o983o665o987p234o445n118m877o098p163o684n321m502m414m276
$$ plain form
53108 362867 358951 355089 350852 346258 341574 336967 332637 328802 325253 321433 317336 313896 311872 310594
53094 310594 308476 304889 301040 298676 298131 297920 296316 293062 289311 286044 283063 279730 276253 273587 272122
53079 272122 270965 268829 265308 261150 257487 255033 253912 253945 254881 256243 257241 257286 256681 256345 256637 256964 256995
53062 256995 257554 259476 261968 263241 262709 261461 260467 259569 258666 258497 259386 260349 260633 261212 263247 265711 266376
53045 266376 265061 264003 264492 264903 262988 258750 253724 248527 242742 236639 231294 227005 223059 219244 216197
53030 216197 213829 210863 206775 203008 201148 200728 200135 199083 198714 199437 200170 200027 199460 199085 198448 196830
53014 196830 194713 193563 194342 196820 200191 203887 207827 212159 216635 220169 221427 220140 217543 215290
53000 215290 214243 214513 216043 218585 221387 223496 224351 224047 223363 223537 225258 227561 228573 227912 227427 228700
$$ packed form
53108C62867l916l862m237m594m684m607m330l835l549l820m097l440k024j278
53094C10594k118l587l849k364n45k11j604l254l751l267k981l333l477k666j465
53079B72122j157k136l521m158l663k454j121L3R36J362R98M5o05l36K92L27L1
53062B56995N59J922K492J273n32j248r94q98r03j69Q89R63K84N79K035K464O65
53045B66376j315j058M89M11j915m238n026n197n785o103n345m289l946l815l047
53030B16197k368k966m088l767j860m20n93j052l69P23P33j43n67l75o37j618
53014A96830k117j150P79K478L371L696L940M332M476L534J258j287k597k253
53000B15290j047K70J530K542K802K109Q55l04o84J74J721K303J012o61m85J273
$$ plain form
52984 228700 230747 231412 230354 229157 228889 229143 229411 229703 229520 227825 224747 222002 220736 219922 217688 213558
52968 213558 208659 204320 200957 197781 193255 186682 179603 174601 172120 169590 164491 157251 150127 144251
52954 144251 139126 134353 130440 128041 127358 128022 128827 128201 125975 124063 124176 125388 125397 123807 122413 122252
52938 122252 122156 120769 118497 116622 115588 115033 114762 114866 115292 115760 115801 114841 112943 111453 111936 114175 116291
52921 116291 117186 117623 118253 118041 116040 113710 113628 116171 119102 120635 121399 122822 124859 126302 126593 126208
52905 126208 125563 124519 123055 121575 120185 118318 115683 113250 112572 114196 117314 120980 124786 128067 129366
52890 129366 127773 124514 122168 122060 123037 123026 121217 118493 116209 115010 114539 113897 112484 110671 109604 110311
52874 110311 112926 116684 120435 123299 125137 126404 127388 127760 127161 125979 125046 124699 124576 124194 123176 121140
$$ packed form
52984B28700K047O65j058j197k68K54K68K92j83j695l078k745j266q14k234m130
52968B13558m899m339l363l176m526o573p079n002k481k530n099p240p124n876
52954A44251n125m773l913k399o83O64Q05o26k226j912J13J212Rj590j394j61
52938A22252r6j387k272j875j034n55k71J04M26M68M1r60j898j490M83K239K116
52921A16291Q95M37O30k12k001k330q2K543K931J533P64J423K037J443K91l85
52905A26208o45j044j464j480j390j867k635k433o78J624L118L666L806L281J299
52890A29366j593l259k346j08R77j1j809k724k284j199m71o42j413j813j067P07
52874A10311K615L758L751K864J838J267R84L72n99j182r33l47j23l82j018k036
$$ plain form
52858 121140 118200 115595 114845 116014 117566 118341 118943 120704 123860 127310 129700 130380 129809 129486 130886 133960
52842 133960 137174 139484 141575 144482 147763 150123 151467 153084 155797 159068 162140 165072 168094 170730
52828 170730 172345 173237 174455 176476 178448 178913 177131 173595 169430 165500 162101 159173 156452 153593 150586
52813 150586 148011 146426 145487 144247 142373 140331 138063 134451 128902 122848 118642 117146 117280 117851 118889
52798 118889 120931 123767 126395 128003 128773 129716 131567 133768 134924 134586 133975 134360 135300 135489 134932 135041
52782 135041 136529 138521 140103 141602 143691 146138 148134 149132 148681 146181 141681 136515 132371 130070 129864
52767 129864 132174 136914 142336 145854 146290 144503 141677 137879 132777 126995 122046 119165 118641 120003 122352
52752 122352 124597 125827 125766 124847 123683 122356 120291 117108 113638 111587 111803 113253 114227 114208 113835 113363
$$ packed form
52858A21140k940k605p50J169J552P75O02J761L156L450K390O80n71l23J400L074
52842A33960L214K310K091K907L281K360J344J617K713L271L072K932L022K636
52828A70730J615Q92J218K021J972M65j782l536m165l930l399k928k721k859l007
52813A50586k575j585r39j240j874k042k268l612n549o054m206j496J34N71J038
52798A18889K042K836K628J608P70R43J851K201J156l38o11L85R40J89n57J09
52782A35041J488J992J582J499K089K447J996R98m51k500m500n166m144k301k06
52767A29864K310M740N422L518M36j787k826l798n102n782m949k881n24J362K349
52752A22352K245J230o1r19j164j327k065l183l470k051K16J450R74j9l73m72
$$ plain form
52736 113363 112335 110958 110586 112107 114615 116532 117520 118444 119914 121793 123904 126194 128220 129449 130255
52721 130255 131821 134689 138115 141207 144044 147198 150587 153424 155202 156427 158360 161921 166571 170444
52707 170444 172104 171951 171193 169723 166410 161663 158052 157298 157910 157142 154368 150894 147191 142448 136884
52692 136884 132494 130631 130249 129364 127249 124418 121445 118770 117008 116402 116220 115354 113342 110521 107619
52677 107619 105564 105048 105718 106373 106460 106695 107619 108408 108101 107285 107226 107763 107523 106198 105120 105152 105388 104765 104009
52658 104009 104937 108173 112357 115488 116554 115996 115050 114681 114869 114905 114395 113725 113430 113399 112950 111513 109108
52641 109108 106341 104132 103177 103427 104262 105329 106895 109143 111505 113137 113811 113887 113609 113064 112746 113394 114996
52624 114996 116608 117547 118156 118811 118712 116614 112710 108876 106801 106533 107161 108219 109791 111676 113200 113832
$$ packed form
52736A13363j028j377l72J521K508J917R88R24J470J879K111K290K026J229Q06
52721A30255J566K868L426L092K837L154L389K837J778J225J933L561M650L873
52707A70444J660j53p58j470l313m747l611p54O12p68k774l474l703m743n564
52692A36884m390j863l82q85k115k831k973k675j762o06j82q66k012k821k902
52677A07619k055n16O70O55Q7K35R24P89l07q16n9N37k40j325j078L2K36o23p56
52658A04009R28L236M184L131J066n58r46l69J88L6n10o70k95l1m49j437k405
52641A09108k767k209r55K50Q35J067J566K248K362J632O74P6k78n45l18O48J602
52624A14996J612R39O09O55r9k098l904l834k075k68O28J058J572J885J524O32
$$ plain form
52608 113832 113587 112889 112385 112722 113997 115412 115817 114640 112251 109695 108267 108824 110952 113109 114217 114750
52592 114750 115599 116365 115877 114248 113070 113292 114086 114352 114339 115010 116549 118298 119619 120148 119640 118278 116982
52575 116982 116919 118784 122514 127128 130864 132507 133025 134826 138767 142959 145456 146970 149612 153798 157999
52560 157999 161094 163326 165063 166144 166568 166477 165283 162222 157991 154410 151979 149176 144941 140584 138149
52545 138149 137751 137726 136885 135541 134498 134033 133916 133732 132961 131176 128408 125243 122556 121116 121165 122192 123304
52528 123304 123963 124249 124394 124364 124093 123880 124258 125425 126831 127411 126423 124168 121635 119377 117187 115098 114018
52511 114018 114661 116344 117699 118374 119180 120666 122413 123646 123692 121995 118750 115585 114503 115761 117667
52496 117667 118652 118689 118467 118366 118682 119732 121114 121882 122053 122928 125023 126786 126510 124777 123749 124452 125889
$$ packed form
52608A13832k45o98n04L37J275J415M05j177k389k556j428N57K128K157J108N33
52592A14750Q49P66m88j629j178K22P94K66j3O71J539J749J321N29n08j362j296
52575A16982o3J865L730M614L736J643N18J801L941M192K497J514K642M186M201
52560A57999L095K232J737J081M24r1j194l061m231l581k431k803m235m357k435
52545A38149l98k5q41j344j043m65j17j84p71j785k768l165k687j440M9J027J112
52528A23304O59K86J45l0k71k13L78J167J406N80r88k255k533k258k190k089j080
52511A14018O43J683J355O75Q06J486J747J233M6j697l245l165j082J258J906
52496A17667R85L7k22j01L16J050J382P68J71Q75K095J763k76j733j028P03J437
$$ plain form
52479 125889 126530 125622 123222 120078 117456 116142 115411 113830 111308 109692 110957 115155 120362 124379 126388
52464 126388 127202 128160 129837 131838 133562 134672 134870 133860 131886 129897 128826 128986 130129 131528 131940
52449 131940 130434 127701 125739 125630 126354 126352 125481 124673 124413 124479 124716 125153 125803 127006 129315 132240 133887
52432 133887 132979 130625 128800 127620 125533 121932 118069 115412 114459 115194 117304 119780 121591 122917 124484
52417 124484 125691 125023 122649 120884 121365 123306 125451 128128 131921 135595 137102 136227 134763 134319 135126
52402 135126 136697 138327 138911 137504 134506 131632 130310 130534 131299 131646 131248 130487 130131 130607 131552 132351 133005
52385 133005 133983 135251 136021 135719 134795 134314 134891 136158 137235 137588 137543 137921 139159 140895 142554 144136 146021
52368 146021 148108 149568 149733 148890 147904 147252 146818 146551 146751 147415 147862 147587 147210 147754 148924 148957 146664 142948
$$ packed form
52479A25889O41r08k400l144k622j314p31j581k522j616J265M198N207M017K009
52464A26388Q14R58J677K001J724J110J98j010j974j989j071J60J143J399M12
52449A31940j506k733j962j09P24kq71q08k60O6K37M37O50J203K309K925J647
52432A33887r08k354j825j180k087l601l863k657r53P35K110K476J811J326J567
52417A24484J207o68k374j765M81J941K145K677L793L674J507q75j464m44Q07
52402A35126J571J630N84j407k998k874j322K24P65L47l98p61l56M76R45P99O54
52385A33005R78J268P70l02r24m81N77J267J077L53m5L78J238J736J659J582J885
52368A46021K087J460J65q43r86o52m34k67K00O64M47k75l77N44J170L3k293l716
$$ plain form
52350 142948 139716 137843 136921 136482 136420 136346 135637 134407 133523 133321 132993 131763 130161 129680 131394 135117 139549
52333 139549 143028 144624 144841 144970 145616 146236 146204 145789 145782 146657 148431 150845 153283 155021 156015 157044 158538
52316 158538 159635 158983 156341 153005 150846 151216 154321 158882 162550 163508 162068 160432 160696 163111 166250
52301 166250 168646 170082 171335 172898 174419 175634 177323 180456 184431 187179 187534 186728 186928 188840 191468
52286 191468 193713 195266 196096 195990 194922 193395 192185 191862 192481 193505 194244 194542 194778 194953 194223 191930
52270 191930 188727 186081 184838 184787 185410 186354 187155 187210 186248 184658 183394 183659 186185 190295 194095 196271
52254 196271 197458 199217 202042 205265 208488 211837 214820 216307 216109 215550 215928 217306 219317 222163 225953
52239 225953 229824 232819 235337 238749 243550 248531 251928 253086 253005 253436 255284 257797 259563 260330 261329
$$ packed form
52350A42948l232j873r22m39o2p4p09j230q84k02l28j230j602m81J714L723M432
52333A39549L479J596K17J29O46O20l2m15pQ75J774K414K438J738R94J029J494
52316A58538J097o52k642l336k159L70L105M561L668R58j440j636K64K415L139
52301A66250K396J436J253J563J521J215J689L133L975K748L55q06K00J912K628
52286A91468K245J553Q30j06j068j527j210l23O19J024P39K98K36J75p30k293
52270A91930l203k646j243n1O23R44Q01N5r62j590j264K65K526M110L800K176
52254A96271J187J759K825L223L223L349K983J487j98n59L78J378K011K846L790
52239B25953L871K995K518L412M801M981L397J158q1M31J848K513J766P67R99
$$ plain form
52224 261329 263657 266997 270229 272669 274198 274884 275228 276181 278067 279938 280901 281675 283783 287395 291149
52209 291149 294145 296875 299903 302814 305122 307225 309554 311444 311880 311170 310961 312457 315089 317163 317648
52194 317648 317255 317808 320398 324221 327542 329712 331624 334076 336604 338488 340101 342282 344887 347015 348480
52179 348480 349986 351798 353411 354852 357210 361253 366252 370879 374638 377780 380457 382882 385848 389972
52165 389972 394443 397524 398593 398977 400463 403564 407546 411626 415607 419502 422920 425046 425393 424708 424807
52150 424807 427012 430942 435376 440070 445727 452145 457625 460925 462810 464833 467333 469815 472702 477103
52136 477103 482811 488070 491887 495362 499861 504811 508455 510279 511455 513047 514989 517118 519961 523592
52122 523592 526406 526302 523210 519568 517831 518055 518445 517873 516961 516621 516422 515110 512529 510272 510123 512055
$$ packed form
52224B61329K328L340L232K440J529O86L44R53J886J871R63P74K108L612L754
52209B91149K996K730L028K911K308K103K329J890M36p10k09J496K632K074M85
52194C17648l93N53K590L823L321K170J912K452K528J884J613K181K605K128J465
52179C48480J506J812J613J441K358M043M999M627L759L142K677K425K966M124
52165C89972M471L081J069L84J486L101L982M080L981L895L418K126L47o85R9
52150D24807K205L930M434M694N657O418N480L300J885K023K500K482K887M401
52136D77103N708N259L817L475M499M950L644J824J176J592J942K129K843L631
52122E23592K814j04l092l642j737K24L90n72r12l40j99j312k581k257j49J932
$$ plain form
52106 512055 514073 514151 512266 510378 510347 512062 513849 514393 513696 512236 510087 507322 504547 502268 500148 497596
52090 497596 494781 492224 489707 486644 483451 481398 480798 480466 479515 478598 478604 478961 478244 475951 472745 469362
52074 469362 466236 463809 462172 460529 458099 455450 453859 453258 452067 449409 446372 444358 443169 441607
52060 441607 439318 436989 435035 433113 430944 428822 427022 425255 423074 420637 418837 418556 419749 421373
52046 421373 422476 423362 425256 428780 433288 437884 442364 446621 449800 450922 450123 448528 447051 446046 445954
52031 445954 447403 450484 454559 458933 463157 466689 469003 470268 471259 472440 473736 475401 478255 482604
52017 482604 487587 492120 495971 499425 502513 505268 508260 512036 516199 519718 522070 523546 524513 524997 525047
52002 525047 525081 525701 527278 529540 531571 532552 532769 533358 534719 535812 535615 534686 534405 535180 536413 537865 539746
$$ packed form
52106E12055K018P8j885j888l1J715J787N44o97j460k149k765k775k279k120k552
52090D97596k815k557k517l063l193k053o00l32r51r17OL57p17k293l206l383
52074D69362l126k427j637j643k430k649j591o01j191k658l037k014j189j562
52060D41607k289k329j954j922k169k122j800j767k181k437j800k81J193J624
52046D21373J103Q86J894L524M508M596M480M257L179J122p99j595j477j005r2
52031D45954J449L081M075M374M224L532K314J265R91J181J296J665K854M349
52017D82604M983M533L851L454L088K755K992L776M163L519K352J476R67M84N0
52002E25047L4O20J577K262K031R81K17N89J361J093j97r29k81P75J233J452J881
$$ plain form
51985 539746 541502 541900 540699 539108 538039 536881 534687 531736 529127 527417 526359 525558 524698 523466 521877
51970 521877 520281 518615 516053 512000 506929 501593 495965 489908 484505 481443 480941 481257 480561 478559 475987
51955 475987 473360 470844 468724 467182 465746 463587 460456 456939 453695 450702 447406 443415 438923 434460
51941 434460 430412 426831 423537 420160 416072 410649 403894 396736 390367 385151 380229 374315 366912 358841
51927 358841 351543 345717 340593 334668 327206 318851 310699 303062 295387 287170 278664 270740 264316 259868
51913 259868 257175 255429 253680 251316 248241 244805 241593 239001 236778 234063 230068 224749 218702 212569
51899 212569 206717 201489 197539 195619 195747 196578 196109 193522 190185 188263 188372 189162 189161 188218 186933 185581
51883 185581 184160 182759 181180 178762 175340 171907 169516 167930 166233 164435 163408 163265 162930 161600 159888
$$ packed form
51985E39746J756L98j201j591j069j158k194k951k609j710j058q01q60j232j589
51970E21877j596j666k562m053n071n336n628o057n403l062n02L16o96k002k572
51955D75987k627k516k120j542j436k159l131l517l244k993l296l991m492m463
51941D34460m048l581l294l377m088n423o755p158o369n216m922n914p403q071
51927C58841p298n826n124n925p462q355q152p637p675q217q506p924o424m448
51913B59868k693j746j749k364l075l436l212k592k223k715l995n319o047o133
51899B12569n852n228l950j920J28Q31m69k587l337j922J09P90jr43j285j352
51883A85581j421j401j579k418l422l433k391j586j697j798j027j43l35j330j712
$$ plain form
51868 159888 159173 160310 163033 166057 167791 167692 167055 167739 169904 171739 171752 170564 169977 170842 172403 173326 172807
51851 172807 170955 168673 167141 167119 168600 170982 173340 174710 174641 173510 171891 169670 166425 162652 159781
51836 159781 158658 158737 159160 159966 161727 164518 167785 170773 172576 172198 169315 164901 160789 158610 159094 161757
51820 161757 164939 166814 166923 166368 166153 165880 164549 162088 159428 157530 156990 158131 160630 163275 164908
51805 164908 165522 165878 166248 166214 165561 164681 164062 163979 164568 165704 166886 167721 168343 168825 168517 166757 164167 162380
51787 162380 162394 163777 165567 167340 169349 172184 176386 181812 187348 191769 194941 197705 200667 203736 206757
51772 206757 209863 213041 216023 218723 221376 224286 228006 233511 241233 250002 257903 264358 270342 276354
51758 276354 281342 284092 284632 283665 281502 278270 274316 269630 263716 256848 250738 246834 244457 241560 237109
$$ packed form
51868A59888p15J137K723L024J734r9o37O84K165J835J3j188n87Q65J561R23n19
51851A72807j852k282j532k2J481K382K358J370o9j131j619k221l245l773k871
51836A59781j123P9M23Q06J761K791L267K988J803l78k883m414m112k179M84K663
51820A61757L182J875J09n55k15k73j331k461k660j898n40J141K499K645J633
51805A64908O14L56L70l4o53q80o19q3N89J136J182Q35O22M82l08j760k590j787
51787A62380J4J383J790J773K009K835M202N426N536M421L172K764K962L069L021
51772B06757L106L178K982K700K653K910L720N505P722Q769P901O455N984O012
51758B76354M988K750N40r67k163l232l954m686n914o868o110l904k377k897m451
$$ plain form
51743 237109 231847 227078 223645 221897 221645 222012 222002 221364 220452 219366 217733 215229 211932 208441 206160 206941
51727 206941 211501 218214 224156 227358 227564 225289 221224 216606 213002 211222 210857 211046 211202 210998 210377 209745
51711 209745 209521 209461 209060 208681 209371 211356 213560 215012 215883 216592 216647 215195 212326 209137 206670 205245 204603
51694 204603 204335 204394 205358 207808 211253 214247 215933 216808 217489 217418 215692 212722 210059 208636 208019 207373 206391
51677 206391 205138 203767 202644 202160 202084 201564 200098 198185 196747 196175 196181 196322 196341 196067 195292 193936 192406
51660 192406 191579 192002 192954 192750 190478 187099 184318 182625 181210 179627 178507 178383 178823 179324 180291 182206
51644 182206 184322 185179 184315 182582 180729 178566 175924 173704 173211 174689 177060 179167 180847 182647 184832
51629 184832 186983 188503 189241 189465 189404 189114 188823 189159 190778 193730 197273 200249 201654 201254 199912 199129
$$ packed form
51743B37109n262m769l433j748k52L67j0o38r12j086j633k504l297l491k281P81
51727B06941M560O713N942L202K06k275m065m618l604j780l65J89J56k04o21o32
51711B09745k24o0m01l79O90J985K204J452Q71P09N5j452k869l189k467j425o42
51694B04603k68N9R64K450L445K994J686Q75O81p1j726k970k663j423o17o46r82
51677B06391j253j371j123m84p6n20j466j913j438n72OJ41J9k74p75j356j530
51660A92406q27M23R52k04k272l379k781j693j415j583j120j24M40N01R67J915
51644A82206K116Q57q64j733j853k163k642k220m93J478K371K107J680J800K185
51629A84832K151J520P38K24o1k90k91L36J619K952L543K976J405m00j342p83
$$ plain form
51613 199129 199803 201377 202546 202808 202934 203788 205193 206343 206911 207257 207721 208283 208925 209836 211095 212557 214155
51596 214155 215948 217711 218835 218890 217996 216426 214258 211691 209264 207284 205418 203452 202196 202824 205312
51581 205312 208257 210422 211848 213229 214864 216586 218132 219126 219200 218643 218507 219512 221195 222640 223669
51566 223669 224594 225216 225014 224250 223879 224208 224482 224191 223916 224314 224864 224331 222101 218498 214144 209735 206297
51549 206297 204746 204843 205058 203845 200938 197288 194043 191873 190995 191301 192182 192523 191299 188329 184384 180587
51533 180587 177920 177120 178449 181224 184088 186293 188400 191067 193447 193769 191606 188669 186994 187037 187946
51518 187946 188906 189580 189880 190126 191019 192719 194269 194712 194483 194839 196137 197622 198764 199745 200490 200402 199513
51501 199513 198994 199843 201718 203713 205676 208012 210594 212631 213501 213150 211890 210440 209954 211221 213663
$$ packed form
51613A99129O74J574J169K62J26Q54J405J150N68L46M64N62O42R11J259J462J598
51596B14155J793J763J124N5q94j570k168k567k427j980j866j966j256O28K488
51581B05312K945K165J426J381J635J722J546R94P4n57j36J005J683J445J029
51566B23669R25O22k02p64l71L29K74k91k75L98N50n33k230l603m354m409l438
51549B06297j551R7K15j213k907l650l245k170q78L06Q81L41j224k970l945l797
51533A80587k667q00J329K775K864K205K107K667K380L22k163k937j675M3R09
51518A87946R60O74L00K46Q93J700J550M43k29L56J298J485J142R81P45q8q89
51501A99513n19Q49J875J995J963K336K582K037Q70l51j260j450m86J267K442
$$ plain form
51486 213663 215703 216379 216232 216438 217493 219037 220666 222464 224653 226995 228793 229581 229731 230123 231230 232796
51470 232796 234450 236244 238259 240100 241401 242703 245065 248645 252206 254438 255313 255749 256277 256641 256515
51455 256515 255971 255119 253914 252621 251926 252013 251858 250267 247612 245707 245490 245523 243665 239984 237016 236861 238745
51438 238745 239955 238700 235506 232172 230082 229449 229570 229582 229286 229213 229493 228835 225447 219273 212636 208103
51422 208103 206159 205561 205420 205918 207083 208035 207914 206733 204726 201599 197241 192710 189427 187512 185888
51407 185888 184159 183316 184132 185788 186815 186709 185751 183798 180409 176114 172411 170200 168931 167603 165945
51392 165945 164318 163187 163128 164685 167513 170017 170584 169061 166618 164423 162939 162219 162095 162086 161747 161345 161725
51375 161725 163435 166259 169556 172528 174187 173823 171920 170176 170127 171860 174293 176467 178228 179844 181391
$$ packed form
51486B13663K040O76j47K06J055J544J629J798K189K342J798P88J50L92J107J566
51470B32796J654J794K015J841J301J302K362L580L561K232Q75M36N28L64j26
51455B56515n44q52j205j293o95Q7j55j591k655j905k17L3j858l681k968j55J884
51438B38745J210j255l194l334k090o33J21J2k96p3K80o58l388o174o637m533
51422B08103j944n98j41M98J165R52j21j181k007l127m358m531l283j915j624
51407A85888j729q43Q16J656J027j06r58j953l389m295l703k211j269j328j658
51392A65945j627j131n9J557K828K504N67j523k443k195j484p20j24rl39m02L80
51375A61725J710K824L297K972J659l64j903j744m9J733K433K174J761J616J547
$$ plain form
51360 181391 182577 183092 183117 183418 184682 186679 188362 188961 188699 188305 188247 188775 190269 192897 195970 198235 199023
51343 199023 198861 198881 199844 201589 203056 202825 200196 196000 191976 189050 186537 183346 179603 176542 174969
51328 174969 174422 173935 173080 172088 171423 171557 172727 174415 175391 174876 173645 173337 174484 175728 175250 172591 168838
51311 168838 165534 163815 164016 165280 165744 164054 160908 158441 157862 158385 158692 158517 158179 157417 155774 153692
51295 153692 152116 151119 150018 148810 148279 148425 148114 146935 146236 147254 149145 150161 150166 150543 151897 153358
51279 153358 154276 155079 156005 156358 155748 154892 154276 153139 150933 148898 148783 150450 152152 152866 152921 152488 151138
51262 151138 149242 148171 148279 147938 145651 142235 139867 139593 140687 141833 141906 140223 137369 135520 136609
51247 136609 140109 143748 146390 148812 151343 152422 150567 146780 143708 142840 143557 144587 145249 145351 144968
$$ packed form
51360A81391J186N15K5L01J264J997J683N99k62l94n8N28J494K628L073K265P88
51343A99023j62K0R63J745J467k31k629m196m024k926k513l191l743l061j573
51328A74969n47m87q55r92o65J34J170J688R76n15j231l08J147J244m78k659l753
51311A68838l304j719K01J264M64j690l146k467n79N23L07j75l38p62j643k082
51295A53692j576r97j101j208n31J46l11j179o99J018J891J016NL77J354J461
51279A53358R18Q03R26L53o10q56o16j137k206k035j15J667J702P14N5m33j350
51262A51138j896j071J08l41k287l416k368k74J094J146P3j683k854j849J089
51247A36609L500L639K642K422K531J079j855l787l072q68P17J030O62J02l83
$$ plain form
51232 144968 144679 145240 146587 147717 147943 147838 148481 150039 151634 152523 152925 153482 154183 154181 152810 150601 148972
51215 148972 148815 149652 150322 150264 149816 149528 149743 150777 152841 155436 157313 157456 155876 153208 149995 146895
51199 146895 145100 145559 147580 149060 148581 146847 145593 145559 146193 147035 148415 150595 153017 154990 156584 158161
51183 158161 159321 159238 158184 157801 159287 161873 163847 164746 165587 166935 167854 167254 165497 163878 163041 162792
51167 162792 163123 164322 165959 166786 166132 164719 163609 163024 162750 163078 164410 166201 167164 166679 165334 163963
51151 163963 162801 161908 161908 163644 167033 170572 172264 171287 168837 167148 167510 169414 171643 173737 175887 177883
51135 177883 179059 179348 179529 180095 180482 179990 179076 179201 181438 185501 190023 193549 195408 195960 196081 196310 196437
51118 196437 195837 194108 191437 188561 186252 184696 183549 182792 183100 184876 187307 189259 190848 193083 195952
$$ packed form
51232A44968k89N61J347J130K26j05O43J558J595Q89M02N57P01kj371k209j629
51215A48972j57Q37O70n8m48k88K15J034K064K595J877J43j580k668l213l100
51199A46895j795M59K021J480m79j734j254l4O34Q42J380K180K422J973J594J577
51183A58161J160q3j054l83J486K586J974Q99Q41J348R19o00j757j619q37k49
51167A62792L31J199J637Q27o54j413j110n85k74L28J332J791R63m85j345j371
51151A63963j162q93%J736L389L539J692r77k450j689L62J904K229K094K150J996
51135A77883J176K89J81N66L87m92r14J25K237M063M522L526J859N52J21K29J27
51118A96437o00j729k671k876k309j556j147p57L08J776K431J952J589K235K869
$$ plain form
51103 195952 198195 199356 200775 203695 207543 211122 214489 218294 221931 224058 224713 225332 226496 227185 226681
51088 226681 225851 225768 226196 226377 226540 227502 229029 229704 228582 226351 224518 223698 223066 221496 219014 216762 215476
51071 215476 214542 212889 210375 207634 204955 202185 199667 198215 197918 197776 196964 195768 194966 194933 195701 197116
51055 197116 198425 198405 196669 194395 193133 193192 193753 194139 194334 194551 194946 195592 196243 196348 195757 195081 194800 194439
51037 194439 193369 192128 192014 193366 195188 196684 198348 201050 204525 207325 208237 207575 207062 208328 211315
51022 211315 214203 215120 213817 211546 209719 209171 210268 212854 215998 218548 220192 221517 222902 223883 223906
51007 223906 223190 222578 222813 224064 225735 226633 225900 224127 223089 224010 226392 228885 230811 232407 233947 235330
50991 235330 236503 237819 239882 243199 247821 252994 257380 260146 261841 263871 267013 270706 273807 275797
$$ packed form
51103A95952K243J161J419K920L848L579L367L805L637K127O55O19J164O89n04
51088B26681q30q3M28J81J63R62J527O75j122k231j833q20o32j570k482k252j286
51071B15476r34j653k514k741k679k770k518j452k97j42q12j196q02l3P68J415
51055A97116J309k0j736k274j262N9N61L86J95K17L95O46O51J05n91o76k81l61
51037A94439j070j241j14J352J822J496J664K702L475K800R12o62n13J266K987
51022B11315K888R17j303k271j827n48J097K586L144K550J644J325J385R81K3
51007B23906p16o12K35J251J671Q98p33j773j038R21K382K493J926J596J540J383
50991B35330J173J316K063L317M622N173M386K766J695K030L142L693L101J990
$$ plain form
50977 275797 277227 279265 282804 287768 293188 298028 301927 305068 307692 310070 312688 315763 318639 320408
50963 320408 321290 322587 324761 326332 325596 322952 320486 319252 318068 315252 310565 304935 299175 293871 289909
50948 289909 287881 286987 285555 282988 280540 279766 280596 281277 279936 276001 270490 265289 261955 260917 261757
50933 261757 263995 267211 270500 272639 273220 273101 273227 273411 272860 271648 270893 271498 273340 275867 278949 282713
50917 282713 286744 289827 290691 289123 286493 285102 286712 291423 297834 304249 309875 315151 320996 327629
50903 327629 334126 339403 343562 347754 352599 357422 361388 364816 368680 373299 378369 384020 390898 399117
50889 399117 407928 416623 425025 432933 439902 446225 453565 463725 476844 491228 505058 517929 530648
50876 530648 543972 558018 572917 589519 608637 629454 649288 665520 677535 686369 692892 697088
$$ packed form
50977B75797J430K038L539M964N420M840L899L141K624K378K618L075K876J769
50963C20408Q82J297K174J571p36k644k466j234j184k816m687n630n760n304l962
50948B89909k028q94j432k567k448p74Q30O81j341l935n511n201l334j038Q40
50933B61757K238L216L289K139N81j19J26J84n51j212p55O05J842K527L082L764
50917B82713M031L083Q64j568k630j391J610M711O411O415N626N276N845O633
50903C27629O497N277M159M192M845M823L966L428L864M619N070N651O878Q219
50889C99117Q811Q695Q402P908O969O323P340J0160J3119J4384J3830J2871J2719
50876E30648J3324J4046J4899J6602J9118K0817J9834J6232J2015Q834O523M196
$$ plain form
50864 697088 698995 699435 699468 699552 699323 697768 693727 686884 678382 669855 661692 652936 642922 632236 621856
50849 621856 612258 603765 596795 591116 585682 580013 575110 572154 570900 570126 569009 567094 563704 558876
$$ packed form
50864F97088J907M40L3Q4k29j555m041o843q502q527q163q756j0014j0686j0380
50849F21856r598q493o970n679n434n669m903k956j254p74j117j915l390m828
$$ [...]
##END NTUPLES=NMR SPECTRUM
##END=
