##TITLE=coffee_type ROVE100A
COFFEE_meoh_noesyp64 COFFEE_meoh {C:\Bruker\TOPSPIN} Administrator 13
##JCAMPDX= 6.0         $$ Bruker NMR JCAMP-DX V2.0
##DATA TYPE= NMR SPECTRUM
##DATA CLASS= NTUPLES
##ORIGIN= Bruker BioSpin GmbH
##OWNER= Administrator
$$ 1.72 TOPSPIN		Version 2.1
$$ 2012-05-18 15:45:49.089 -0700  Administrator@X
$$ Compression mode = diff/dup
##.OBSERVE FREQUENCY= 400.13188235
##.OBSERVE NUCLEUS= ^1H
##.ACQUISITION MODE= SIMULTANEOUS (DQD)
##.ACQUISITION SCHEME= undefined
##.AVERAGES= 64
##.DIGITISER RES= 22
##SPECTROMETER/DATA SYSTEM= spect
##.PULSE SEQUENCE= noesygpps1d.comp
##.SOLVENT NAME= COFFEE_meoh
##.SHIFT REFERENCE= INTERNAL, COFFEE_meoh, 1, 14.98061
##AUDIT TRAIL= $$ (NUMBER, WHEN, WHO, WHERE, PROCESS, VERSION, WHAT)
$$ ##TITLE= Audit trail, TOPSPIN		Version 2.1
$$ ##JCAMPDX= 5.01
$$ ##ORIGIN= Bruker BioSpin GmbH
$$ ##OWNER= Administrator
$$ $$ C:\Bruker\TOPSPIN/data/Administrator/nmr/12-COFFEE-2302/142/pdata/1/auditp.txt
$$ ##AUDIT TRAIL=  $$ (NUMBER, WHEN, WHO, WHERE, PROCESS, VERSION, WHAT)
(   1,<2012-02-23 23:56:22.328 -0500>,<Administrator>,<TOPSPIN>,<go>,<TOPSPIN 2.1>,
      <created by zg
	started at 2012-02-23 23:44:52.094 -0500,
	POWCHK enabled, PULCHK disabled,
       configuration hash MD5:
       B0 76 FB 9C 50 81 44 7D 18 B3 26 32 4E 60 AD 96
       data hash MD5: 64K
       D2 94 A5 54 8E 0C 4F C2 20 FD 87 F2 E8 42 B2 B2>)
(   2,<2012-02-23 23:56:25.281 -0500>,<Administrator>,<TOPSPIN>,<proc1d>,<TOPSPIN 2.1>,
      <Start of raw data processing
       efp LB = 0.3 FT_mod = 6 PKNL = 1 PHC0 = 0 PHC1 = 0 SI = 128K 
       data hash MD5: 128K
       33 11 7B D2 3C 5A 54 85 DB B1 D0 FF 62 89 49 1F>)
(   3,<2012-02-23 23:56:26.578 -0500>,<Administrator>,<TOPSPIN>,<proc1d>,<TOPSPIN 2.1>,
      <pk PHC0 = 24.32373 PHC1 = 0 
       data hash MD5: 128K
       05 36 F6 5F 18 27 F3 37 C3 2B 00 CF 03 AD C9 D5>)
(   4,<2012-02-23 23:56:26.828 -0500>,<Administrator>,<TOPSPIN>,<proc1d>,<TOPSPIN 2.1>,
      <abs ABSG = 1 
       data hash MD5: 128K
       11 04 78 18 BF DC E7 41 CD E1 D5 18 9B AE 32 78>)
(   5,<2012-02-23 23:56:26.906 -0500>,<Administrator>,<TOPSPIN>,<proc1d>,<TOPSPIN 2.1>,
      <abs ABSG = 2 
       data hash MD5: 128K
       E0 39 AC F3 64 48 79 AD 6D B5 DB 4D 6C 17 60 DF>)
(   6,<2012-02-23 23:56:27.000 -0500>,<Administrator>,<TOPSPIN>,<proc1d>,<TOPSPIN 2.1>,
      <abs ABSG = 3 
       data hash MD5: 128K
       72 63 B5 F7 B3 39 E2 59 DE D2 FE 38 BC 2A 20 3B>)
(   7,<2012-02-23 23:56:27.219 -0500>,<Administrator>,<TOPSPIN>,<proc1d>,<TOPSPIN 2.1>,
      <abs ABSG = 4 
       data hash MD5: 128K
       D3 B3 2F E5 3C 46 DA 0D BE B5 DF 1A 70 6E DB C8>)
(   8,<2012-02-23 23:56:27.266 -0500>,<Administrator>,<TOPSPIN>,<proc1d>,<TOPSPIN 2.1>,
      <abs ABSG = 5 
       data hash MD5: 128K
       06 12 BE A2 80 2D 98 EC A3 FF 39 16 00 8C 3E 1E>)
(   9,<2012-02-23 23:56:27.375 -0500>,<Administrator>,<TOPSPIN>,<audit>,<TOPSPIN 2.1>,
      <user comment:
       ICON-NMR User ID: Administrator
$$ [...]
150 150 150 150 150 150 150 150
##$TP07= 0
##$TPNAME0= <>
##$TPNAME1= <>
##$TPNAME2= <>
##$TPNAME3= <>
##$TPNAME4= <>
##$TPNAME5= <>
##$TPNAME6= <>
##$TPNAME7= <>
##$TPOAL= (0..7)
0.5 0.5 0.5 0.5 0.5 0.5 0.5 0.5
##$TPOFFS= (0..7)
0 0 0 0 0 0 0 0
##$TUNHIN= 0
##$TUNHOUT= 0
##$TUNXOUT= 0
##$USERA1= <user>
##$USERA2= <user>
##$USERA3= <user>
##$USERA4= <user>
##$USERA5= <user>
##$V9= 5
##$VALIST= <valist>
##$VCLIST= <CCCCCCCCCCCCCCC>
##$VD= 0
##$VDLIST= <DDDDDDDDDDDDDDD>
##$VPLIST= <PPPPPPPPPPPPPPP>
##$VTLIST= <TTTTTTTTTTTTTTT>
##$WBST= 1024
##$WBSW= 4
##$XGAIN= (0..3)
0 0 0 0
##$XL= 0
##$YL= 0
##$YMAX_a= 13449227
##$YMIN_a= -6567652
##$ZGOPTNS= <>
##$ZL1= 120
##$ZL2= 120
##$ZL3= 120
##$ZL4= 120
##$ABSF1= 14.98061
##$ABSF2= -5.57192
##$ABSG= 5
##$ABSL= 3
##$ALPHA= 0
##$AQORDER= 0
##$ASSFAC= 0
##$ASSFACI= 0
##$ASSFACX= 0
##$ASSWID= 0
##$AUNMP= <proc_prof1d_extract>
##$AXLEFT= 0
##$AXNAME= <>
##$AXNUC= <1H>
##$AXRIGHT= 0
##$AXTYPE= 0
##$AXUNIT= <>
##$AZFE= 0.1
##$AZFW= 0.1
##$BCFW= 0
##$BC_mod= 0
##$BYTORDP= 0
##$COROFFS= 0
##$CY= 15
##$DATMOD= 1
##$DC= 0
##$DFILT= <>
##$DTYPP= 0
##$F1P= 0
##$F2P= 0
##$FCOR= 0.5
##$FTSIZE= 131072
##$FT_mod= 6
##$GAMMA= 0
##$GB= 0
##$INTBC= 1
##$INTSCL= 1
##$ISEN= 128
##$LB= 0.3
##$LEV0= 0
##$LPBIN= 0
##$MAXI= 10000
##$MC2= 0
##$MEAN= 0
##$ME_mod= 0
##$MI= 0
##$NCOEF= 0
##$NC_proc= -3
##$NLEV= 6
##$NOISF1= 0
##$NOISF2= 0
##$NSP= 0
##$NTH_PI= 0
##$NZP= 0
##$OFFSET= 14.98061
##$PC= 1
##$PHC0= 24.32373
##$PHC1= 0
##$PH_mod= 1
##$PKNL= yes
##$PPARMOD= 0
##$PPDIAG= 0
##$PPIPTYP= 0
##$PPMPNUM= 2147483647
##$PPRESOL= 1
##$PSCAL= 4
##$PSIGN= 0
##$PYNMP= <proc.py>
##$REVERSE= no
##$SF= 400.13
##$SI= 131072
##$SIGF1= 0
##$SIGF2= 0
##$SINO= 400
##$SIOLD= 131072
##$SPECTYP= <>
##$SREGLST= <1H.CDCl3>
##$SSB= 0
##$STSI= 131072
##$STSR= 0
##$SW_p= 8223.68421052632
##$SYMM= 0
##$S_DEV= 0
##$TDeff= 65536
##$TDoff= 0
##$TI= <>
##$TILT= no
##$TM1= 0
##$TM2= 0
##$TOPLEV= 0
##$USERP1= <user>
##$USERP2= <user>
##$USERP3= <user>
##$USERP4= <user>
##$USERP5= <user>
##$WDW= 1
##$XDIM= 131072
##$YMAX_p= 503389736
##$YMIN_p= -157326876
##$CURPLOT= <Network HP LaserJet P1505>
##$CURPRIN= <$Network HP LaserJet P1505>
##$DFORMAT= <normdp>
##$LAYOUT= <+/1D_H.xwp>
##$LFORMAT= <normlp>
##$PFORMAT= <normpl>
##$SURQMSG= 1
$$ End of Bruker specific parameters
$$ ---------------------------------
##NTUPLES= NMR SPECTRUM
##VAR_NAME=  FREQUENCY,     SPECTRUM/REAL,   SPECTRUM/IMAG
##SYMBOL=    X,             R,               I
##VAR_TYPE=  INDEPENDENT,   DEPENDENT,       DEPENDENT
##VAR_FORM=  AFFN,          ASDF,            ASDF
##VAR_DIM=   131072,        131072,          131072
##UNITS=     HZ,            ARBITRARY UNITS, ARBITRARY UNITS
##FACTOR=    0.0627417313425165, 1,          1
##FIRST=     8223.62146879498, 1100,         -95159
##LAST=      0,             5818,            -96106
##MIN=       0,             -157326876,      0
##MAX=       8223.62146879498, 503389736,    0
$$ Real data points
##PAGE= N=1
##DATA TABLE= (X++(R..R)), XYDATA
$$ [...]
60862D0647103l912802l500719l115815k759526k431482k134581j874118j651740
60854A9266320j463951j306259j174608j063412r66866q82703q10871p48297o89023
60845A0160330o30121n73661n22009m74954m32636l97402l70576l49947l32316
60836F076708l16317l01226k85294k67287k48269k30184k13826j99106j85849
60827C829350j73328j60419j47384j36124j27740j21058j14420j07609j01156
60818B640112r5248r0206q6569q3685p9689p4018o8580o5149o2961o0225n6705
60807A817077n3253m9866m6010m2206l9598l8253l7281l6262l5306l4015l1762
60796A373265k8966k6884k5969k5313k3913k1865k0148j9594j9930j9756j7844
$$ plain form
60862 40647103 36734301 33233582 30117767 27358241 24926759 22792178 20918060 19266320
60854 19266320 17802369 16496110 15321502 14258090 13291224 12408521 11597650 10849353 10160330
60845 10160330 9530209 8956548 8434539 7959585 7526949 7129547 6758971 6409024 6076708
60836 6076708 5760391 5459165 5173871 4906584 4658315 4428131 4214305 4015199 3829350
60827 3829350 3656022 3495603 3348219 3212095 3084355 2963297 2848877 2741268 2640112
60818 2640112 2544864 2454658 2368089 2284404 2204715 2130697 2062117 1996968 1934007 1873782 1817077
60807 1817077 1763824 1713958 1667948 1625742 1586144 1547891 1510610 1474348 1439042 1405027 1373265
60796 1373265 1344299 1317415 1291446 1266133 1242220 1220355 1200207 1180613 1160683 1140927 1123083
60785A123083j4730j2333j1583j1235r792p738o807p473q404q377p648p253p596
60772A002114q142q164p555o803o148n140l569k404k647l290j917J987N810O907
60758I61039N759M737M835N263N626O525P995R073R219Q937Q603P847O511N291
60744A057260M817M767M314L068J331k92j478k623m441o786q439q753q824r971
60730A023950j1517j1633j0168r079r617j0602j0246q501o757o003o166o628o726
60717I10307o105n165m724m922n000m514m017m047m110l307j496O40K236K644
60703H68420J933J376K561N337P500P387O006N540O479P505P669P246O562N464
60689I46985M143L331L254L311K959K072M91j759l668m046l503m279p367j1117
$$ plain form
60785 1123083 1108353 1096020 1084437 1073202 1063410 1055672 1048865 1041392 1032988 1024611 1016963 1009710 1002114
60772 1002114 993972 985808 978253 971450 965302 960162 956593 954189 951542 948252 946335 948322 954132 961039
60758 961039 966798 971535 976370 981633 987259 993784 1001779 1010852 1020071 1029008 1037611 1045458 1051969 1057260
60744 1057260 1062077 1066844 1071158 1074226 1075557 1075265 1073787 1071164 1066723 1059937 1051498 1042745 1033921 1023950
60730 1023950 1012433 1000800 990632 981553 971936 961334 951088 942587 935830 929827 923661 917033 910307
60717 910307 904202 899037 894313 889391 884391 879877 875860 871813 867703 864396 862900 863540 865776 868420
60703 868420 870353 871729 874290 879627 887127 894514 900520 906060 912539 920044 927713 934959 941521 946985
60689 946985 951128 954459 957713 961024 963983 966055 966546 964787 961119 957073 953570 949291 941924 930807
60675I30807j3528j4687j5700j6425j6010j4939j4558j4756j4007j2029j0506
60664G73662j0584j1184j0777r463q169o947n532m649n137o175o105m980m685
60651F79275o095p613p275n228l193k263k164k321k669l461m775o155o526m954
60637F14583j866Q59J672R02Q0O0N04Q86J202J678K391L273L956L855K920K210
60621F39165K876M625N975O199O087O507P096P057O582O642P679R220J0627J1545
60607G37882J1667J0743R176Q076Q331R649J0903J1493J1999J3204J4677J5040
60595H72840J3789J2215J1853J2445J2332J0671Q372O677N799N292M898M397L218
60582I84798R90j812m306o014o912p142p240q111j0018j1791j1923j0311q331
$$ plain form
60675 930807 917279 902592 886892 870467 854457 839518 824960 810204 796197 784168 773662
60664 773662 763078 751894 741117 731654 723485 716538 711006 706357 701220 695045 688940 683960 679275
60651 679275 673180 665567 658292 653064 649871 647608 645444 643123 640454 636993 632218 626063 619537 614583
60637 614583 612717 613576 615248 616150 616230 616290 616794 617680 618882 620560 622951 626224 630180 634035 636955 639165
60621 639165 642041 646666 652641 658840 664927 671434 678530 685587 692169 698811 706490 715710 726337 737882
60607 737882 749549 760292 769468 777544 785875 795524 806427 817920 829919 843123 857800 872840
60595 872840 886629 898844 910697 923142 935474 946145 954517 961194 966993 972285 977183 981580 984798
60582 984798 985788 983976 979670 973656 966744 959602 952362 944251 934233 922442 910519 900208 891877
60569H91877p193o896o739o164m961l276j663o71k47J38O85J145J482K083L083
60554H62683L959M161L815L585M121N736Q111J0174J0782R956R078R511J1277
60541I56949J3341J4762J5284J5205J5224J6105J7922J9750K0566K0168J8847
60530A144123J6562J3255R671O819M476J282l293q007j1499j4020j6656j9428
60518A123285k1239k1475k0549j8977j6984j5167j4410j4634j4572j3335j1443
60507I40500r686p911n842m347m509n674n902m440k649k029k315k095n92J707
60493H84216L649M304L766L418M713P296R058Q650P251P063Q614J0403J0953J0362
60479I83716R885J0736J3214J6442J8975K0140K0741K1982K4049K6240K8094K9675
$$ plain form
60569 891877 884684 877788 871049 864885 859924 856648 854985 854314 854067 854205 854890 856035 857517 859600 862683
60554 862683 866642 870803 874618 878203 882324 888060 896171 906345 917127 927083 936161 945672 956949
60541 956949 970290 985052 1000336 1015541 1030765 1046870 1064792 1084542 1105108 1125276 1144123
60530 1144123 1160685 1173940 1183611 1190430 1194906 1196188 1192895 1184888 1173389 1159369 1142713 1123285
60518 1123285 1102046 1080571 1060022 1041045 1024061 1008894 994484 979850 965278 951943 940500
60507 940500 930814 922903 917061 912714 908205 902531 896629 892189 889540 887511 885196 883101 882509 884216
60493 884216 887865 892169 895935 899353 904066 911362 920420 929070 936321 943384 951998 962401 973354 983716
60479 983716 993601 1004337 1017551 1033993 1052968 1073108 1093849 1115831 1139880 1166120 1194214 1223889
60467A223889L1019L2252L4144L7624M2717M8666N5009O1568O7562P2180P6326
60456A782956Q2431R1778J03129J14778J26607J38712J48917J53714J51744J44795
60446C039561J34892J21755J04044Q2241N8925L6282J4345p839k9810m9061o3006
60435C442329p1261p5790p8799q0535p9247p3305o3338n2096m1894l2306k0906
60424B772852o446R450K4327L7813N1212O4475P5249Q1531Q3929Q4175Q2255P6487
60412C437309O6180N2971L9349K6945J6681R624O725P849J1645J6675K2529K9842
60400C744324L9300N0780O3701P8059R4607J13841J35362J58676J84194K12811
60390D875655K44799K79809L17792L59090M03576M50580M99749N50908O02288
$$ plain form
60467 1223889 1254908 1287160 1321304 1358928 1401645 1450311 1505320 1566888 1634450 1706630 1782956
60456 1782956 1865387 1957165 2060294 2175072 2301679 2440391 2589308 2743022 2894766 3039561
60446 3039561 3174453 3296208 3400252 3482493 3541418 3577700 3592045 3584206 3554396 3505335 3442329
60435 3442329 3371068 3295278 3216479 3135944 3056697 2983392 2920054 2867958 2826064 2793758 2772852
60424 2772852 2766406 2775856 2800183 2837996 2889208 2953683 3028932 3110463 3194392 3278567 3360822 3437309
60412 3437309 3503489 3556460 3595809 3622754 3639435 3649059 3655784 3663633 3675278 3691953 3714482 3744324
60400 3744324 3783624 3834404 3898105 3976164 4070771 4184612 4319974 4478650 4662844 4875655
60390 4875655 5120454 5400263 5718055 6077145 6480721 6931301 7431050 7981958 8584246
60381H584246O49444O86377P07176P05864O75654O10367N07804L71842K11412
60372A3710186L8021j35944k98296m38560n49628o28400o75408o94237o90721
60363I637013o71312o41281o04261n63126n20501m78084m36271l95280l56355
60354D970542l21252k90771k64385k41135k20161k00532j81641j63990j48733
60345B937942j36097j25046j14767j05546r7497q9554q0903p2847o7692o5766
60335A982227o4622o1631n6467n0799m6232m3144m0970l8938l6545l3761l0924
60324A478194k8520k6956k6254k5793k4705k2925k1502k1362k2006k2127k1297
60313A214747k0227j9430j8585j7419j6322j5659j5116j4200j2847j1222r522
$$ plain form
60381 8584246 9233690 9920067 10627243 11333107 12008761 12619128 13126932 13498774 13710186
60372 13710186 13748207 13612263 13313967 12875407 12325779 11697379 11021971 10327734 9637013
60363 9637013 8965701 8324420 7720159 7157033 6636532 6158448 5722177 5326897 4970542
60354 4970542 4649290 4358519 4094134 3852999 3632838 3432306 3250665 3086675 2937942
60345 2937942 2801845 2676799 2562032 2456486 2358989 2269435 2188532 2115685 2047993 1982227
60335 1982227 1917605 1855974 1799507 1748708 1702476 1659332 1618362 1579424 1542879 1509118 1478194
60324 1478194 1449674 1422718 1396464 1370671 1345966 1323041 1301539 1280177 1258171 1236044 1214747
60313 1214747 1194520 1175090 1156505 1139086 1122764 1107105 1091989 1077789 1064942 1053720 1044198
60302A044198q225p962q636r310r358r163r194r098q342p151o149n479n025n080
60288I36026o016p560r010r822r489p576m756l141m222o727p799o354m041k850
60274H46663k993l500l597k868j044J581M044N536N894N123L285J170J44P45K088
60259H62271L154L883M602N215N601N935O037N278L829L003L469M076L562K463
60245I22378K050K210J996J668K430M324N991O615O619O437O013N572N415M910
60231I84628L197Q83n80j282k695m836n856n211m918o358p978p915o985o960p399
60216I19735o660m944l827l376k271m45Q72J734L626O679Q977R359Q896Q868R116
60201I56339R250R660J0369J0395R448Q806R488J0897J2255J3905J5972J7316
$$ plain form
60302 1044198 1035973 1028011 1019375 1010065 1000707 991544 982350 973252 964910 957759 951610 946131 941106 936026
60288 936026 930010 922450 913440 903618 894129 886553 881797 878656 874434 867707 859908 853554 849513 846663
60274 846663 843670 840170 836573 833705 832661 834242 838286 843822 849716 854839 858124 859294 859438 860183 862271
60259 862271 865425 869308 873910 879125 884726 890661 896698 901976 905805 908808 912277 916353 919915 922378
60245 922378 924428 926638 928634 930302 932732 937056 943047 949662 956281 962718 968731 974303 979718 984628
60231 984628 987825 988708 988128 986846 984151 979315 973459 968248 963330 956972 948994 941079 934094 927134 919735
60216 919735 913075 908131 904304 900928 898657 898212 899084 900818 904444 911123 920100 929459 938355 947223 956339
60201 956339 965589 975249 985618 996013 1005461 1014267 1023755 1034652 1046907 1060812 1076784 1094100
60189A094100J7418J7968K0738K4983K8774L1890L5220L8141L9204L9276M1229
60178A428941M5944N0911N3836N5562N8187O1911O5179O6817O6623O4780O1982
60167B080673N9423N7426N4797N0644M6007M2156L8058L1473K2461J3865P890
60156B504873L920L78k923n311o809p690p346n074j542J846M777Q019J1784J5561
60142B514463J9470K4299K9863L4816L8784M3159M8858N4561N8528O1080O3657
60131B991538O6008O6275O3722N9665N5327N0295M3706L5762K7304J8866J0770
60120C489238L304l800j1242j8815k5051k8853l0572l0775k8963k4706j9181j4015
60108C256569r036k637N757J5017K4106L3032M1798M9863N7341O5480P4987Q4621
$$ plain form
60189 1094100 1111518 1129486 1150224 1175207 1203981 1235871 1271091 1309232 1348436 1387712 1428941
60178 1428941 1474885 1525796 1579632 1635194 1693381 1755292 1820471 1887288 1953911 2018691 2080673
60167 2080673 2140096 2197522 2252319 2302963 2348970 2391126 2429184 2460657 2483118 2496983 2504873
60156 2504873 2508793 2509171 2506248 2500937 2494128 2486438 2479092 2474018 2472476 2474322 2479099 2487118 2498902 2514463
60142 2514463 2533933 2558232 2588095 2622911 2661695 2704854 2753712 2808273 2866801 2927881 2991538
60131 2991538 3057546 3123821 3187543 3247208 3302535 3352830 3396536 3432298 3459602 3478468 3489238
60120 3489238 3492542 3488742 3477500 3458685 3433634 3404781 3374209 3343434 3314471 3289765 3270584 3256569
60108 3256569 3247533 3244896 3250653 3265670 3289776 3322808 3364606 3414469 3471810 3537290 3612277 3696898
60096C696898R2389R7489J00318J01113R9536R5320Q8292P7902O3638M6115K7143
60085D586153Q515q744k3819l5601m3323m7379m8832m8083m4466l7428k7649j6593
60073D212751n101P053K0187L3882M7590O1556P6404R1955J07128J21180J34344
60062D908929J46950J58519J68210J75816J81599J85321J86047J83003J76190
60053F470584J65980J52521J35855J16462R5314P3236N0221K5522j405k9963n8522
60042G195805q5464j09945j31434j48929j61230j67986j69942j67916j62188j53250
60032E737521j42573j31595j20155j06769r0726p3095n5398l8222k1818p134M967
60021D955003J5099K4492L2716L7688L8422L6316L2955K7973K0519J1809M224
$$ plain form
60096 3696898 3789287 3886776 3987094 4088207 4187743 4283063 4371355 4449257 4512895 4559010 4586153
60085 4586153 4594668 4585924 4562105 4526504 4483181 4435802 4386970 4338887 4294421 4256993 4229344 4212751
60073 4212751 4207650 4214703 4234890 4268772 4316362 4377918 4454322 4546277 4653405 4774585 4908929
60062 4908929 5055879 5214398 5382608 5558424 5740023 5925344 6111391 6294394 6470584
60053 6470584 6636564 6789085 6924940 7041402 7136716 7209952 7260173 7285695 7284290 7254327 7195805
60042 7195805 7110341 7000396 6868962 6720033 6558803 6390817 6220875 6052959 5890771 5737521
60032 5737521 5594948 5463353 5343198 5236429 5145703 5072608 5017210 4978988 4957170 4950036 4955003
60021 4955003 4970102 4994594 5027310 5064998 5103420 5139736 5172691 5200664 5221183 5232992 5237216
60010E237216j878q480j6592k4464l0057l3767l7275m0757m2957m3526m3392m2695
59998D871376m0119l5024k8807k3000j6939q645K339J4281K5428L5619M5301N4008
59986D895818O0637O4816O7081O7673O5902O1094N3890M6023L8602L1103K2471
59975E475110J2982M150l388j0878j9698k9397l8673m7633n7541o8242p7651q4463
59963E054678q9874r5514j00971j04614j05957j05635j03769j00012r4869q9288
59953D064175q2972p4729o4699n4527m5019l5231k4536j3977m540M506J4320K4564
59941C707335L4020M2404N0300N7862O4814P1321P7527Q2373Q4035Q1644P5877
59930D429512O7925N8627M8530L7907K6613J4445J660j1277k4209l6955m8666
$$ plain form
60010 5237216 5235338 5226858 5210266 5185802 5155745 5121978 5084703 5043946 5000989 4957463 4914071 4871376
59998 4871376 4831257 4796233 4767426 4744426 4727487 4718842 4721181 4735462 4760890 4796509 4841810 4895818
59986 4895818 4956455 5021271 5088352 5156025 5221927 5283021 5336911 5382934 5421536 5452639 5475110
59975 5475110 5488092 5492242 5488854 5477976 5458278 5428881 5390208 5342575 5285034 5216792 5139141 5054678
59963 5054678 4964804 4869290 4768319 4663705 4557748 4452113 4348344 4248332 4153463 4064175
59953 4064175 3981203 3906474 3841775 3787248 3742229 3706998 3682462 3668485 3663945 3668451 3682771 3707335
59941 3707335 3741355 3783759 3834059 3891921 3956735 4028056 4105583 4187956 4271991 4353635 4429512
59930 4429512 4497437 4556064 4604594 4642501 4669114 4683559 4685219 4673942 4649733 4612778 4564112
59919D564112n8111o4605o8189o9307o8726o7241o4685n9771n1842m2307l3206
59908C916122k4712j5369m619O337J6390K5683L4459M2102M8068N2782N6792N9891
59896D213926O1840O3140O4140O3977O1433N6610N0861M5243L9694L3807K7731
59885D782402K2243J8195J5922J5016J4805J5270J7325K2053K9838M0287N2576
59874E045932O5696P8858R2067J06063J21299J37297J53104J67922J80823J90307
59864F339368J94959J94394J88980J78553J61946J38002J06869P0313L0976q657
59854G595703m6917q2710j14751j41385j61473j75151j83255j86219j84083j77531
59844F142228j68048j56791j43932j29567j14589r9891q5157o9460n3018l7235
$$ plain form
59919 4564112 4506001 4441396 4373207 4303900 4235174 4167933 4103248 4043477 3991635 3949328 3916122
59908 3916122 3891410 3876041 3871422 3877759 3894149 3919832 3954291 3996393 4044461 4097243 4154035 4213926
59896 4213926 4275766 4338906 4403046 4467023 4528456 4585066 4635927 4681170 4720864 4754671 4782402
59885 4782402 4804645 4822840 4838762 4853778 4868583 4883853 4901178 4923231 4953069 4993356 5045932
59874 5045932 5111628 5190486 5282553 5388616 5509915 5647212 5800316 5968238 6149061 6339368
59864 6339368 6534327 6728721 6917701 7096254 7258200 7396202 7503071 7573384 7604360 7595703
59854 7595703 7548786 7466076 7351325 7209940 7048467 6873316 6690061 6503842 6319759 6142228
59844 6142228 5974180 5817389 5673457 5543890 5429301 5329410 5244253 5174793 5121775 5084540
59834E084540k2755q564O202K0529L2631M2273N0646N8102O3288O4753O2312N6367
59822E510324M6917L3831J7436j675k2734m4270o4425q2330r8513j13219j25214
59811E056128j33107j37221j39213j40394j41201j41607j40950j37925j31961
59802C812549j24268j16481j08775j00471r1851q3831p6053o7195n7209m7658
59792B938757l9491l2085k5009j9123j5172j2605j0650r377q776p827n589k534
59780B750519K42K580N127Q086J0797J2391J2306J0568P914N205K322j808p707
59767B818542j4525k1032k6708l1307l4156l4704l3451l1709l0654l0777l1712
59756B497807l2333l1562k9380k6515k3108j8594j3045p407k012L904J0559J6787
$$ plain form
59834 5084540 5061785 5053221 5059423 5079952 5112583 5154856 5205502 5263604 5326892 5391645 5453957 5510324
59822 5510324 5557241 5591072 5608508 5606833 5584099 5539829 5475404 5393074 5294561 5181342 5056128
59811 5056128 4923021 4785800 4646587 4506193 4364992 4223385 4082435 3944510 3812549
59802 3812549 3688281 3571800 3463025 3362554 3270703 3186872 3110819 3043624 2986415 2938757
59792 2938757 2899266 2867181 2842172 2823049 2807877 2795272 2784622 2775245 2766469 2758642 2753053 2750519
59780 2750519 2750761 2753341 2758468 2766554 2777351 2789742 2802048 2812616 2820530 2825735 2828057 2826249 2818542
59767 2818542 2804017 2782985 2756277 2724970 2690814 2656110 2622659 2590950 2560296 2529519 2497807
59756 2497807 2465474 2433912 2404532 2378017 2354909 2336315 2323270 2315863 2313851 2317755 2328314 2345101
59744B345101K1798K6486L1992L7914M3211M7848N2198N5612N6985N6014N2592
59733B827751M5900L5882K5083J7020J2869J1371J1642J3870J7020J8357J6490
59722C053255J3358J1967J3285J6534K1510K9035L9364N1373O3587P5431Q7464
59711C476163J00678J15472J31066J45958J58990J69577J76658J77802J69851
59702D822215J50615J20163Q1039L7570n352m3622p4765r7920j13225j21090j22070
59691D633558j17319j08856r8705q7694p5617o2667m9959l8299k7178j5807m460
59680C946997O027J5693K5404L5711M6604N8019O9610Q0282Q9270R7647J07571
59669D578835J19814J33154J46446J60096J74891J90680K07072K24536K43706
$$ plain form
59744 2345101 2366899 2393385 2425377 2463291 2506502 2554350 2606548 2662160 2719145 2775159 2827751
59733 2827751 2873651 2909533 2934616 2951636 2964505 2975876 2987518 3001388 3018408 3036765 3053255
59722 3053255 3066613 3078580 3091865 3108399 3129909 3158944 3198308 3249681 3313268 3388699 3476163
59711 3476163 3576841 3692313 3823379 3969337 4128327 4297904 4474562 4652364 4822215
59702 4822215 4972830 5092993 5174032 5211602 5206250 5162628 5087863 4989943 4876718 4755628 4633558
59691 4633558 4516239 4407383 4308678 4220984 4145367 4082700 4032741 3994442 3967264 3951457 3946997
59680 3946997 3953024 3968717 3994121 4029832 4076436 4134455 4204065 4284347 4373617 4471264 4578835
59669 4578835 4698649 4831803 4978249 5138345 5313236 5503916 5710988 5935524 6179230
59660F179230K64071K84303L03654L22182L39953L56818L72774L87478L99298
59651I209761M05816M05899M00692L92106L80827L66681L50689L35733L24659
59642A2572863L18218L15257L14309L14166L13262L09706L02301K90807K74837
59633A5325726K53319K25642J92771J56489J18042P8359L9318L659k6543n0723
59623A6316059o8905q0553q4750q1269p1028n5361l4903r398K1199N5600R1721
59612A5998412J28364J65876K04937K45270K85624L24066L57748L83222L97973
59603A8491492M01118L91809L67626L25685K65114J87488R5452p431j15453k21207
59593B0181693l18293m03119m73667n27756n63618n81698n84812n76303n58514
$$ plain form
59660 6179230 6443301 6727604 7031258 7353440 7693393 8050211 8422985 8810463 9209761
59651 9209761 9615577 10021476 10422168 10814274 11195101 11561782 11912471 12248204 12572863
59642 12572863 12891081 13206338 13520647 13834813 14148075 14457781 14760082 15050889 15325726
59633 15325726 15579045 15804687 15997458 16153947 16271989 16350348 16389666 16393325 16366782 16316059
59623 16316059 16247154 16166601 16081851 16000582 15929554 15874193 15839290 15829892 15851091 15906691 15998412
59612 15998412 16126776 16292652 16497589 16742859 17028483 17352549 17710297 18093519 18491492
59603 18491492 18892610 19284419 19652045 19977730 20242844 20430332 20525784 20518353 20402900 20181693
59593 20181693 19863400 19460281 18986614 18458858 17895240 17313542 16728730 16152427 15593913
59584A5593913n33103n02361m69799m39467m14953l99021l93519l98568m11615
59575A1631507m28110m43821m56170m63309m63153m54464m38397m17687l94395
59566G672001l69186l42513l15447k89311k65351k44485k26466k09475j91804
59557E217963j73912j57681j43618j30337j17122j05324r6198q8621q0441p1455
59547D053254o3740n9029n6953n5985n5226n4785n4945n5682n7006n9116o1751
59536C419036o3671o3604o1891o0387o0201o0207n8612n5312n1656m8260m4426
59525B790809l9760l5035l0995k7373k3699k0179j7139j4161j0542o271k037J600
59513B565218M647P504J0524J3678J6585J9020K1204K3332K5075K6192K7284K9251
$$ plain form
59584 15593913 15060810 14558449 14088650 13649183 13234230 12835209 12441690 12043122 11631507
59575 11631507 11203397 10759576 10303406 9840097 9376944 8922480 8484083 8066396 7672001
59566 7672001 7302815 6960302 6644855 6355544 6090193 5845708 5619242 5409767 5217963
59557 5217963 5044051 4886370 4742752 4612415 4495293 4389969 4293771 4205150 4124709 4053254
59547 4053254 3989514 3930485 3873532 3817547 3762321 3707536 3652591 3596909 3539903 3480787 3419036
59536 3419036 3355365 3291761 3229870 3169483 3109282 3049075 2990463 2935151 2883495 2835235 2790809
59525 2790809 2751049 2716014 2685019 2657646 2633947 2613768 2596629 2582468 2571926 2565655 2563618 2565218
59513 2565218 2569865 2577369 2587893 2601571 2618156 2637176 2658380 2681712 2706787 2732979 2760263 2789514
59501B789514L2029L4784L7295M0226M3865M7596N1032N4842N9858O5937P2185
59490C329163P7938Q3165Q8384R4464J02028J10645J19050J26411J32971J39101
59480D403320J44309J47710J49188J49436J48729J46142J40544J32397J23965
59471E685740J16874J09595R8465Q1655O1232M0759K1940M594j1218k4628l4926
59460F150082m1667m4372m3494m0984l8037l2858k2838q682O038J9635L3907N0280
59448E987010O6968Q1421R3280J02915J08734J08073R9946Q5202O4774L9318J0055
59437F847696k1511n4335q7280j18367j45678j68346j85815j97030k01568k00789
59427E466977j96532j89270j78785j65927j52232j38279j23907j09648r6424q3984
$$ plain form
59501 2789514 2821543 2856327 2893622 2933848 2977713 3025309 3076341 3131183 3191041 3256978 3329163
59490 3329163 3407101 3490266 3578650 3673114 3775142 3885787 4004837 4131248 4264219 4403320
59480 4403320 4547629 4695339 4844527 4993963 5142692 5288834 5429378 5561775 5685740
59471 5685740 5802614 5912209 6010674 6092329 6153561 6194320 6216260 6220854 6209636 6185008 6150082
59460 6150082 6108415 6064043 6020549 5979565 5941528 5908670 5885832 5877150 5883188 5902823 5936730 5987010
59448 5987010 6053978 6135399 6228679 6331594 6440328 6548401 6648347 6733549 6798323 6837641 6847696
59437 6847696 6826185 6771850 6684570 6566203 6420525 6252179 6066364 5869334 5667766 5466977
59427 5466977 5270445 5081175 4902390 4736463 4584231 4445952 4322045 4212397 4115973 4031989
59417D031989p1164n7741m4716l2631k0789q542L680J4961K4978L4284M3961N4796
59405C973066O6271P6728Q5100R2047R8547J03910J06202J04309R8553Q9647P8158
59394D972538O4680M9241L0729Q265j6662m0761o1883q0268r6698j10783j21745
59383D596653j29651j34977j37693j37625j35281j31539j26772j20811j13606
59374C428698j05517r7206q9475q2943p7492p2068o5359n6888m7602l9451l3895
59363B660802l0380k6510k0403j2860o560k988q05K452P629J3462J8430K2427
59351B624696K6428L1065L6047M0969M5904N0624N3568N2694M7823M1577L7432
59340C088827L7092L9993M4761N0529N7213O5171P4339Q3143Q8617Q8669Q4505
$$ plain form
59417 4031989 3960825 3903084 3858368 3825737 3804948 3796406 3800086 3815047 3840025 3874309 3918270 3973066
59405 3973066 4039337 4116065 4201165 4293212 4391759 4495669 4601871 4706180 4804733 4894380 4972538
59394 4972538 5037218 5086459 5117188 5125453 5108791 5068030 5006147 4925879 4829181 4718398 4596653
59383 4596653 4467002 4332025 4194332 4056707 3921426 3789887 3663115 3542304 3428698
59374 3428698 3323181 3225975 3136500 3053557 2976065 2903997 2838638 2781750 2734148 2694697 2660802
59363 2660802 2630422 2603912 2583509 2570649 2564089 2561101 2560296 2562748 2570377 2583839 2602269 2624696
59351 2624696 2651124 2682189 2718236 2759205 2805109 2855733 2909301 2961995 3009818 3051395 3088827
59340 3088827 3125919 3165912 3210673 3261202 3318415 3383586 3457925 3541068 3629685 3718354 3802859
59329C802859Q0161P9307Q2658Q8459R4860J01395J08570J16659J25301J34164
59319D814393J43528J53785J64520J74695J83952J93294K04204K17287K32030
59310F481688K47527K63242K79332K96482L15081L34364L52552L67987L79765
59301I318020L87257L89565L85886L76108L60818L41019L17924K92631K65853
59292A2435081K38268K10981J84895J59630J33912J07224Q0141N2693K3410r394
59282A3616841m6038q5656j27095j69022k09807k47892k81862l10040l31103l45437
59272A1462889l54619l58963l56988l48253l35268l21053l06033k89054k70520
59263H522138k52444k35662k19077k01845j84591j68128j52456j37601j24230
$$ plain form
59329 3802859 3883020 3962327 4044985 4133444 4228304 4329699 4438269 4554928 4680229 4814393
59319 4814393 4957921 5111706 5276226 5450921 5634873 5828167 6032371 6249658 6481688
59310 6481688 6729215 6992457 7271789 7568271 7883352 8217716 8570268 8938255 9318020
59301 9318020 9705277 10094842 10480728 10856836 11217654 11558673 11876597 12169228 12435081
59292 12435081 12673349 12884330 13069225 13228855 13362767 13469991 13550132 13602825 13626235 13616841
59282 13616841 13570803 13485147 13358052 13189030 12979223 12731331 12449469 12139429 11808326 11462889
59272 11462889 11108270 10749307 10392319 10044066 9708798 9387745 9081712 8792658 8522138
59263 8522138 8269694 8034032 7814955 7613110 7428519 7260391 7107935 6970334 6846104
59254F846104j12756j02591r2881q3421p4613o7074o1436n7880n5692n3867n2366
59243F031527n2182n3959n7040o0121o2496o4369o6271o8406p0540p2514p4672
59232E328957p7381q0101q1459q0523p7627p3761o9686o5794o2088n7993n2818
59221D549726m6799m0871l5048k8052j9122r211K60Q871J6617K3058K8119L2740
59209D480288L7424M0936M1671L9636L5871L0668K3717J5299N944m548j6343k8317
59197D702246l8903m7736n5067o0203o2132o1290n9068n5759n0569m3441l5354
59186D132724k6807j7512p426L081J3646K3040K8421K7492K1375J3703P105K300
59174D221142K26K353Q420J6121K3869L2125M1338N0629N9463O8811P9387R0151
$$ plain form
59254 6846104 6733348 6630757 6537876 6454455 6379842 6312768 6251332 6193452 6137760 6083893 6031527
59243 6031527 5979345 5925386 5868346 5808225 5745729 5681360 5615089 5546683 5476143 5403629 5328957
59232 5328957 5251576 5171475 5090016 5009493 4931866 4858105 4788419 4722625 4660537 4602544 4549726
59221 4549726 4502927 4462056 4427008 4398956 4379834 4370623 4370883 4379754 4396371 4419429 4447548 4480288
59209 4480288 4517712 4558648 4600319 4639955 4675826 4706494 4730211 4745510 4751454 4746906 4730563 4702246
59197 4702246 4663343 4615607 4560540 4500337 4438205 4376915 4317847 4262088 4211519 4168078 4132724
59186 4132724 4105917 4088405 4080979 4084060 4097706 4120746 4149167 4176659 4198034 4211737 4218842 4221142
59174 4221142 4221368 4223721 4232141 4248262 4272131 4304256 4345594 4396223 4455686 4524497 4603884 4694035
59162D694035R9853J08866J18351J28595J39310J50739J63316J76723J90209K03542
59152F173539K17097K31156K45394K58512K68405K73300K72699K66596K54101
59143H460799K34082K06890J74084J36475R3988M7673K49m5745q8821j27304j59073
59132H933297j83426k01677k14936k22617k24145k20767k14515k06431j96922
59123G047861j86850j76960j66964j56432j46148j37477j30636j24352j17109
59114E704933j08383r8925r0156q2833p6223o9161o1798n5254m9614m3740l7499
59103D931347l2542k9866k7959k4743k0401j6828j4706j2630r261n240k489k082
59091D732600l370n226p721j1835j7479k2835k6500k9461l3579l8725m3049m5950
$$ plain form
59162 4694035 4793888 4902754 5021105 5149700 5289010 5439749 5603065 5779788 5969997 6173539
59152 6173539 6390636 6621792 6867186 7125698 7394103 7667403 7940102 8206698 8460799
59143 8460799 8694881 8901771 9075855 9212330 9306318 9353991 9354240 9308495 9219674 9092370 8933297
59132 8933297 8749871 8548194 8333258 8110641 7886496 7665729 7451214 7244783 7047861
59123 7047861 6861011 6684051 6517087 6360655 6214507 6077030 5946394 5822042 5704933
59114 5704933 5596550 5497625 5407469 5324636 5248413 5179252 5117454 5062200 5012586 4968846 4931347
59103 4931347 4898805 4868939 4840980 4816237 4795836 4779008 4764302 4751672 4742411 4737171 4734682 4732600
59091 4732600 4729230 4724004 4716283 4704448 4686969 4664134 4637634 4608173 4574594 4535869 4492820 4446870
59079D446870m8929n3060n7229n9665o0103n9653n9296n9079n8244n5975n2526
59068C823111m9339m7244m5044m1162l6151l1836k8189k3291j6514r609l937J251
59056C492046O861J2118J5857J8303K0497K3079K6290L0043L3373L5058L5154
59045C748679L4586L3191K9972K5593K2323K0960K0184J9748K1634K6634L2420
59034D035924L6842M0794M5510M9269M9352M5720L9915L1508J8472N91j9840m0521
59022D333536o0239p7923r2688j04804j15015j22984j27713j29221j28382j25557
59012C249010j20757j14755j08567j02150r5001q7775q1820p7215p2614o7091
59002B321265o1180n5854n1316m6895m1882l6595l2433l0106k7961k3547j7034
$$ plain form
59079 4446870 4397941 4344881 4287652 4227987 4167884 4108231 4048935 3989856 3931612 3875637 3823111
59068 3823111 3773772 3726528 3681484 3640322 3604171 3572335 3544146 3520855 3504341 3494732 3490795 3492046
59056 3492046 3498907 3511025 3526882 3545185 3565682 3588761 3615051 3645094 3678467 3713525 3748679
59045 3748679 3783265 3816456 3846428 3872021 3894344 3915304 3935488 3955236 3976870 4003504 4035924
59034 4035924 4072766 4113560 4159070 4208339 4257691 4303411 4343326 4374834 4393306 4393897 4374057 4333536
59022 4333536 4273297 4195374 4102686 3997882 3882867 3759883 3632170 3502949 3374567 3249010
59012 3249010 3128253 3013498 2904931 2802781 2707780 2620005 2538185 2460970 2388356 2321265
59002 2321265 2260085 2204231 2152915 2106020 2064138 2027543 1995110 1965004 1937043 1913496 1896462
58991A896462j1339q353o911n417m316m500n259n472n141m024o95M940J0026J2214
58977A862215J3297J6735K2727K8528L2699L6062L8957M0560M0690L9659L6327
58966B208456K9157J9431J0906N719K786M43j653l682o232q768r531p992n845
58953B233195m603l674j708J271M006N503N848O101P527J0171J2294J1958Q920
58940B296809M082k229j0055j8346k5413l0822l5392l9417m2379m4309m5809m6652
58928A960068m5896m3516m0554l7483l3815k9337k4512j9606j4677j0274o868
58917A653530l911q48J401J776J519L168P171J1528J4814J7471J9922K1697K3000
58904A772238K4858K6961K7387K5441K2912K1438K0385J8466J5940J3993J3216
$$ plain form
58991 1896462 1885123 1876770 1869859 1864442 1860126 1855626 1850367 1844895 1839754 1835730 1835035 1839975 1850001 1862215
58977 1862215 1875512 1892247 1914974 1943502 1976201 2012263 2051220 2091780 2132470 2172129 2208456
58966 2208456 2237613 2257044 2267950 2273669 2276455 2276898 2275245 2271563 2265331 2256563 2247032 2239040 2233195
58953 2233195 2228592 2224918 2223210 2224481 2228487 2233990 2239838 2245939 2253466 2263637 2275931 2287889 2296809
58940 2296809 2300891 2298662 2288607 2270261 2244848 2214026 2178634 2139217 2096838 2052529 2006720 1960068
58928 1960068 1914172 1870656 1830102 1792619 1758804 1729467 1704955 1685349 1670672 1660398 1653530
58917 1653530 1649619 1648771 1650172 1651948 1653467 1656635 1663806 1675334 1690148 1707619 1727541 1749238 1772238
58904 1772238 1797096 1824057 1851444 1876885 1899797 1921235 1941620 1960086 1976026 1990019 2003235
58893B003235J3735J5620J8141J9804K0176K0644K2494K5301K8045L0481L2445
58882B250121L3020L1772K9910K9054K9608L1326L4421L8706M2448M3840M3550
58871B637776M4405M8301N4314O0009O3873O6236O8522P2105P7574Q4600R2279
58860C369994R9683J06335J12194J17273J21471J25268J30306J38295J48966J60205
58850D629990J70926J82795J97885K15501K32804K48271K62945K78265K94178
58841F713560L09718L24111L36633L46231L51710L51877L45366L31032L08677
58832I718915K78813K41662J97038J45195Q7385K5753l6780r6888j51895k00339
58822A0208859k41162k73084k95664l10317l19150l23150l22416l17582l09798
$$ plain form
58893 2003235 2016970 2032590 2050731 2070535 2090711 2111355 2133849 2159150 2187195 2217676 2250121
58882 2250121 2283141 2314913 2344823 2373877 2403485 2434811 2469232 2507938 2550386 2594226 2637776
58871 2637776 2682181 2730482 2784796 2844805 2908678 2974914 3043436 3115541 3193115 3277715 3369994
58860 3369994 3469677 3576012 3688206 3805479 3926950 4052218 4182524 4320819 4469785 4629990
58850 4629990 4800916 4983711 5181596 5397097 5629901 5878172 6141117 6419382 6713560
58841 6713560 7023278 7347389 7684022 8030253 8381963 8733840 9079206 9410238 9718915
58832 9718915 9997728 10239390 10436428 10581623 10669008 10694761 10657981 10561093 10409198 10208859
58822 10208859 9967697 9694613 9398949 9088632 8769482 8446332 8123916 7806334 7496536
58813G496536k99737k87900k75484k63607k51887k39159k25456k12056j99729
58804E241521j88171j77050j66392j56069j46013j36854j29335j23283j18045
58795C900309j13402j09048j03935r7499r0816q5022p9330p2291o4396n7475n1912
58784B975183m6519m0869l5689l1017k5940k0326j4922r679l790K430P602J1494
58772B767958J5566K1076K7945L5385M2127M6512M8265M9955N4730O2588P0812
58761C242919P7749Q3997R0111R5759J01312J07855J15179J21989J28480J36365
58751D301715J46027J55960J65476J75605J86874J98600K10941K25259K41706
58742F008163K58623K74854K90365L04184L14392L20809L24947L26472L22460
$$ plain form
58813 7496536 7196799 6908899 6633415 6369808 6117921 5878762 5653306 5441250 5241521
58804 5241521 5053350 4876300 4709908 4553839 4407826 4270972 4141637 4018354 3900309
58795 3900309 3786907 3677859 3573924 3476425 3385609 3300587 3221257 3148966 3084570 3027095 2975183
58784 2975183 2928664 2887795 2852106 2821089 2795149 2774823 2759901 2750222 2746432 2748862 2756464 2767958
58772 2767958 2783524 2804600 2832545 2867930 2910057 2956569 3004834 3054789 3109519 3172107 3242919
58761 3242919 3320668 3404665 3494776 3590535 3691847 3799702 3914881 4036870 4165350 4301715
58751 4301715 4447742 4603702 4769178 4944783 5131657 5330257 5541198 5766457 6008163
58742 6008163 6266786 6541640 6832005 7136189 7450581 7771390 8096337 8422809 8745269
58733H745269L11056K92920K67884K33486J88635J36171P9873K1361l8244r6111
58723A0142300j49345j96955k38363k71947k96831l14128l24744l28160l25185
58714G696642l19343l13181l05360k94016k80820k68753k57597k44862k30139
58705E182571k15363k01472j87729j74112j61746j50798j40115j29109j18366
58696C703761j08375r9114r0610q2685p4424o5287n6237m8518m1754l4619k6833
58685B975305j9074j1341k966N841J3836K0252K5597L0743L5593L8520L6989K9411
58673C178706J6740J743j3258k7073l8451m6017m9899n1865n3199n3819n3839
58662B809769n4263n5510n6949n8684o1831o6156o9444p0409p0319p0530p0382
$$ plain form
58733 8745269 9056325 9349245 9617129 9850615 10039250 10175421 10255294 10276655 10238411 10142300
58723 10142300 9992955 9796000 9557637 9285690 8988859 8674731 8349987 8021827 7696642
58714 7696642 7377299 7064118 6758758 6464742 6183922 5915169 5657572 5412710 5182571
58705 5182571 4967208 4765736 4578007 4403895 4242149 4091351 3951236 3822127 3703761
58696 3703761 3595386 3496272 3405662 3322977 3248553 3183266 3127029 3078511 3036757 3002138 2975305
58685 2975305 2956231 2944890 2941924 2947765 2961601 2981853 3007450 3038193 3073786 3112306 3149295 3178706
58673 3178706 3195446 3197189 3183931 3156858 3118407 3072390 3022491 2970626 2917427 2863608 2809769
58662 2809769 2755506 2699996 2643047 2584363 2522532 2456376 2386932 2316523 2246204 2175674 2105292
58651B105292o9050o7448o6486o5017o1472n6352n1369m7197m3461l9935l6442
58640A501063l2706k9288k7239k5949k3123j8089j3127j0231q649p261o983q655
58628A289763j0576j0777j0087j0459j1458j1107r127o986n411l995k601j220
58616A195959Q44L879O806Q975J1799J6586K1892K5128K5973K6137K6449K6193
58604A396620K4775K2241J8596J4059R439M929k98o085j0365j1978j3050j6336
58592A432547k1366k5310k6818k6838k6421k5784k5071k4159k2263j9212j6403
58581A172902j4945j3735j0994o918l253j083l37m04R1K792P338J0918J1660J1061
58567A165093J1554J3283J5093J6908J9002K0499K0906K1767K4644K8685L2218
$$ plain form
58651 2105292 2036242 1968794 1902308 1837291 1775819 1719467 1668098 1620901 1577440 1537505 1501063
58640 1501063 1468357 1439069 1411830 1385881 1362758 1344669 1331542 1321311 1312662 1305401 1298418 1289763
58628 1289763 1279187 1268410 1258323 1247864 1236406 1225299 1216172 1209186 1203775 1199780 1197179 1195959
58616 1195959 1196803 1200682 1207488 1216463 1228262 1244848 1266740 1291868 1317841 1343978 1370427 1396620
58604 1396620 1421395 1443636 1462232 1476291 1485730 1490659 1490361 1484276 1473911 1461933 1448883 1432547
58592 1432547 1411181 1385871 1359053 1332215 1305794 1280010 1254939 1230780 1208517 1189305 1172902
58581 1172902 1157957 1144222 1133228 1126310 1123057 1121974 1121637 1121233 1121324 1124116 1131454 1142372 1154032 1165093
58567 1165093 1176647 1189930 1205023 1221931 1240933 1261432 1282338 1304105 1328749 1357434 1389652
58556A389652L5209L8125M0187M1168M3198M8053N4163N9068O3295O8821P5148
58545A956087Q0158Q3852Q8066R3084R7493J00834J03736J05811J05866J03482
58535B918469R8303Q8891P4606N7419L9486K0445j85j9742l4904m5977n5276o2555
58523C078980o5780o5489o4368o2968n9533n3827m7467m0609l1871k1671j2425
58512B552972n245P01N795R889J4326K0808K8523L5310M1257M7887N4390N8256
58500B864869N9242N8739N5137M4046K4027j248k7241n1853p3943r1916j04962
58489B754897j13304j16721j15167j10807j06571j02608r6864q9142q1500p4708
58479A747505o7659o0521n5074n1349m7169m1713l6648l3098l0207k7244k4513
$$ plain form
58556 1389652 1424861 1462986 1503173 1544341 1587539 1635592 1689755 1748823 1812118 1880939 1956087
58545 1956087 2036245 2120097 2208163 2301247 2398740 2499574 2603310 2709121 2814987 2918469
58535 2918469 3016772 3105663 3180269 3237688 3277174 3297619 3297434 3277692 3242788 3196811 3141535 3078980
58523 3078980 3013200 2947711 2883343 2820375 2760842 2707015 2659548 2618939 2587068 2565397 2552972
58512 2552972 2547727 2548428 2554223 2564112 2578438 2599246 2627769 2663079 2704336 2752223 2806613 2864869
58500 2864869 2924111 2982850 3037987 3082033 3106060 3104812 3077571 3025718 2951775 2859859 2754897
58489 2754897 2641593 2524872 2409705 2298898 2192327 2089719 1992855 1903713 1822213 1747505
58479 1747505 1679846 1619325 1564251 1512902 1465733 1424020 1387372 1354274 1324067 1296823 1272310
58468A272310k1837j8678j5852j4502j3654j1610r272q789r372q315n930n259
58456A129240o640o886m701k631k435k402q28J400L216N137P214Q330Q788J0576
58442A147378J3840J6173J6525J6801J8324J9919K0833K2467K5711K9344L2600
58431A379915L6606M1869M6899N0605N3593N5856N5769N2515M7222M0611L1949
58420A893409K1301J0496Q48q029j6621k4872l3305m2336n0428n5531n8058n9541
58408A577333n9004n4432m7546m2679m0572l7717l2652k8177k6033k3966k0083
58397A164472j6037j3674j2032r938q308p849p322n917m634l848k258M16K556
58384A075627L541M622N986O210N598O611R904J3291J5580J7851K0094K0505J9308
$$ plain form
58468 1272310 1250473 1231795 1215943 1201441 1187787 1176177 1166905 1158116 1148744 1140429 1134499 1129240
58456 1129240 1122600 1115714 1111013 1108382 1105947 1103545 1102717 1104117 1107333 1112470 1119684 1128014 1136802 1147378
58442 1147378 1161218 1177391 1193916 1210717 1229041 1248960 1269793 1292260 1317971 1347315 1379915
58431 1379915 1416521 1458390 1505289 1555894 1609487 1665343 1721112 1773627 1820849 1861460 1893409
58420 1893409 1914710 1925206 1926054 1918025 1901404 1876532 1843227 1800891 1750463 1694932 1636874 1577333
58408 1577333 1518329 1463897 1416351 1373672 1333100 1295383 1262731 1234554 1208521 1184555 1164472
58397 1164472 1148435 1134761 1122729 1112791 1104483 1096634 1089312 1083395 1078761 1074913 1072655 1073071 1075627
58384 1075627 1079168 1083790 1089776 1095986 1101584 1108195 1118099 1131390 1146970 1164821 1184915 1205420 1224728
58371A224728J9194K0580K0453J7366J3430R899N180r58n662p650r369j2266j4043
58358A280882j3046j1289j0532r315o544m231l728k870L02M242P004R395J2481
58345A252751J5149J6636J8291K0524K1244J9614J7858J7100J4931R697L651p17
58333A426729m052p314r058q332p021o727o324m884l701l225j672R50J199k505
58319A364063o473o518l117O41L069L543J479j860l558l093k962l917l483p97
58305A337017J476K073L337O341Q517Q629R412J2511J5397J6088J6339J7474J7783
58292A472394J6952J8104K2425K6451K7639K7783K8171K6819K3541K2000K3155
58281A735434K2362J6883J0594P231M823J206q58R54L514L628L398N283P031O572
$$ plain form
58371 1224728 1243922 1264502 1284955 1302321 1315751 1325650 1330830 1329872 1324210 1316560 1307191 1294925 1280882
58358 1280882 1267836 1256547 1246015 1236700 1230156 1225925 1222197 1219327 1219629 1223871 1230875 1240270 1252751
58345 1252751 1267900 1284536 1302827 1323351 1344595 1364209 1382067 1399167 1414098 1423795 1427446 1426729
58333 1426729 1422677 1415363 1406305 1397973 1390952 1384225 1377901 1373017 1369316 1366091 1364419 1365369 1366568 1364063
58319 1364063 1357590 1351072 1347955 1348596 1351665 1355208 1356687 1354827 1351269 1348176 1345214 1341297 1337814 1337017
58305 1337017 1338493 1340566 1343903 1350244 1358761 1367390 1376802 1389313 1404710 1420798 1437137 1454611 1472394
58292 1472394 1489346 1507450 1529875 1556326 1583965 1611748 1639919 1666738 1690279 1712279 1735434
58281 1735434 1757796 1774679 1785273 1792504 1797327 1798533 1797675 1798629 1802143 1805771 1809169 1814452 1821483 1828055
58267A828055O826J0459J4805J6909J8607K1689K3471K2374K2412K6459L0563
58256B042629L0765L0140L2866L6651L7460L6863L8119L9693L9101L8495L9930
58245B442712L9829L4803K8523K6073K5872K3850K1359K2072K5003K7192K9514
58234B746802L3674L7409L8642M0237M4968N0301N3706N7850O4803P0786P2841
58223C312019P4839Q0349Q5752Q7315Q8868R5072J03350J09846J17088J28006
58213D282504J38844J45995J53169J63531J71611J71631J66938J62242J53837
58204E710302J37307J17869J02974R1272P8999P0187O9896P4188P7694Q4363R9533
58193F714584J18367J33666J48424J69055J93034K15028K38104K66708K95988
$$ plain form
58267 1828055 1834881 1845340 1860145 1877054 1895661 1917350 1940821 1963195 1985607 2012066 2042629
58256 2042629 2073394 2103534 2136400 2173051 2210511 2247374 2285493 2325186 2364287 2402782 2442712
58245 2442712 2482541 2517344 2545867 2571940 2597812 2621662 2643021 2665093 2690096 2717288 2746802
58234 2746802 2780476 2817885 2856527 2896764 2941732 2992033 3045739 3103589 3168392 3239178 3312019
58223 3312019 3386858 3467207 3552959 3640274 3729142 3824214 3927564 4037410 4154498 4282504
58213 4282504 4421348 4567343 4720512 4884043 5055654 5227285 5394223 5556465 5710302
58204 5710302 5847609 5965478 6068452 6159724 6238723 6308910 6378806 6452994 6530688 6615051 6714584
58193 6714584 6832951 6966617 7115041 7284096 7477130 7692158 7930262 8196970 8492958
58184H492958L20550L45972L78495M11299M35177M55226M82508N16721N51624
58175A2390530N89813O36779O87687P35341P83802Q39258Q95970R46831R98534
58166A9504545J060083J126265J189690J258268J342318J435575J528159J626289
58158C0071192J738294J853865J959495K061604K171090K279710K378219K483464
58150D6996933K619025K782751K962293L167025L412933L693019L998677M355303
58142G3987959M801177N348809O004295O801358P771372Q902822J0177400J1617025
58134A35412217J3243625J5037701J7016375J9320698K2146621K5622812K9782696
58127B77582745L4411387L8548738M0173023L6955756K7935611J4595545J36781
$$ plain form
58184 8492958 8813508 9159480 9537975 9949274 10384451 10839677 11322185 11838906 12390530
58175 12390530 12980343 13617122 14304809 15040150 15823952 16663210 17559180 18506011 19504545
58166 19504545 20564628 21690893 22880583 24138851 25481169 26916744 28444903 30071192
58158 30071192 31809486 33663351 35622846 37684450 39855540 42135250 44513469 46996933
58150 46996933 49615958 52398709 55361002 58528027 61940960 65633979 69632656 73987959
58142 73987959 78789136 84137945 90142240 96943598 104714970 113617792 123795192 135412217
58134 135412217 148655842 163693543 180709918 200030616 222177237 247800049 277582745
58127 277582745 311994132 350542870 390715893 427671649 455607260 470202805 470339586
58120D70339586j2409581k1512887k7107635k9849077l0551239k9961649k8637277
58113B90310241k6893509k4894818k2769658k0617584j8484074j6406080j4457151
58106A45787367j2706203j1165761r818398q660407p684242o851959o124408n493093
58098G7282896m955064m482833m046711l642632l273427k926594k593661k288173
58090D9073801k022900j790146j581677j404289j258403j124535r87112q49071
58082C8055668p09744n53029l70111j69132M7733K90024N54737Q27937J118958
58073C9093041J462037J880550K382564K978681L643992M271667M756447N138248
58065F5607227N534184N840726N609456M381343K160395n20883k993968m843116
$$ plain form
58120 470339586 457930005 436417118 409309483 379460406 348909167 318947518 290310241
58113 290310241 263416732 238521914 215752256 195134672 176650598 160244518 145787367
58106 145787367 133081164 121915403 112097005 103436598 95752356 88900397 82775989 77282896
58098 77282896 72327832 67844999 63798288 60155656 56882229 53955635 51361974 49073801
58090 49073801 47050901 45260755 43679078 42274789 41016386 39891851 38904739 38055668
58082 38055668 37345924 36792895 36422784 36253652 36301385 36591409 37146146 37974083 39093041
58073 39093041 40555078 42435628 44818192 47796873 51440865 55712532 60468979 65607227
58065 65607227 71141411 76982137 82591593 86972936 89133331 88612448 85618480 80775364
58057H0775364n965239o430578o384866o013216n486903m915858m358106l848128
58049C7372470l395929k986778k610274k277253j996172j754662j539900j357064
58041A9454438j211998j094075r91571r07624q46105p96200p44876o92186o42425
58032A1527378n92460n40139m92872m56780m27021l97711l71824l53279l39067
58023G556225l26756l20059l19615l17539l08060k94838k81754k65692k44638
58014D877274k23936k08052j94098j79094j65682j55557j45236j33323j24130
58005C348166j19445j14590j06980j00638r7894r4760q9009q4673q3794q1659
57995B374724p5191o8560o5440o2889n7942n3408n1987n0929m7406m3434m1117
$$ plain form
58057 80775364 74810125 68379547 61994681 55981465 50494562 45578704 41220598 37372470
58049 37372470 33976541 30989763 28379489 26102236 24106064 22351402 20811502 19454438
58041 19454438 18242440 17148365 16156794 15249170 14403065 13606865 12861989 12169803 11527378
58032 11527378 10934918 10394779 9901907 9445127 9018106 8620395 8248571 7895292 7556225
58023 7556225 7229469 6909410 6589795 6272256 5964196 5669358 5387604 5121912 4877274
58014 4877274 4653338 4445286 4251188 4072094 3906412 3750855 3605619 3472296 3348166
58005 3348166 3228721 3114131 3007151 2906513 2808619 2713859 2624850 2540177 2456383 2374724
57995 2374724 2299533 2230973 2165533 2102644 2044702 1991294 1939307 1888378 1840972 1797538 1756421
57984A756421l8612l4833l2554l3113l3481l2035l1498l2996l3035k9758k6379
57973A398127k5124k3594k0404j8499j9471k0328j9301j9128k1157k2017j9627
57962A169477j6996j6507j5939j3590j1812j1899j0990p756n754p192q569o540
57950A035933l265j869j293L97K052K795N032J0214J5524J8422K0605K3974K6736
57937A155257K7067K6703K7181K6248K1632J4936Q245L72j0017k0635k8325l2751
57925A215913l4574l3239k9416k6250k5272k4173k1379j9269j9907k1106k0074
57914I41254j7696j5957j4178j1185q397p384o833n039k946j859o24J995M481
57901H55632N064M798N394O096N342L572J852k97l527o896r561j2192j4932j6193
$$ plain form
57984 1756421 1717809 1682976 1650422 1617309 1583828 1551793 1520295 1487299 1454264 1424506 1398127
57973 1398127 1373003 1349409 1329005 1310506 1291035 1270707 1251406 1232278 1211121 1189104 1169477
57962 1169477 1152481 1135974 1120035 1106445 1094633 1082734 1071744 1063988 1058234 1051042 1042473 1035933
57950 1035933 1032668 1030799 1029506 1029903 1031955 1034750 1039782 1049996 1065520 1083942 1104547 1128521 1155257
57937 1155257 1182324 1209027 1236208 1262456 1284088 1299024 1307269 1307641 1297624 1276989 1248664 1215913
57925 1215913 1181339 1148100 1118684 1092434 1067162 1042989 1021610 1002341 982434 961328 941254
57914 941254 923558 907601 893423 882238 873841 866457 859624 854585 851639 849780 849156 851151 855632
57901 855632 860696 865494 870888 876984 882326 885898 887750 887453 883926 877030 867469 855277 840345 824152
57887H24152j5316j4037j3573j2701j0584q707p929o373k625J473L624M438N561
57874G47403O689O912P048Q204R698J0516J1272J2766J4238J4661J4218J3073
57862H76698J0613P265M914M024K420j400n843q718j0059j0968j1687j2463j4291
57849H30505j7129j9101j8986j7741j6544j5242j3901j3706j4985j6213j6182
57838F50775j5298j4076j2363j0730j0249j0209q627n604l440k905k465j744k129
57825E50936l103j886J756M324L994L466N187P437P695O594N806N049L914L751
57811F04920N030N470L518J175O31O25j034l639n141n517n881o049n480m885m676
57796E79067l708j629m45j412k510j338J482M134O685R804J2284J2508J1030R537
$$ plain form
57887 824152 808836 794799 781226 768525 757941 749234 741305 734932 732307 733780 737404 741842 747403
57874 747403 754092 761004 768052 776256 785954 796470 807742 820508 834746 849407 863625 876698
57862 876698 887311 894576 899490 903514 905934 904534 898691 889973 879914 868946 857259 844796 830505
57849 830505 813376 794275 775289 757548 741004 725762 711861 698155 683170 666957 650775
57838 650775 635477 621401 609038 598308 588059 577850 569223 563619 560179 557274 554809 553065 550936
57825 550936 547833 545947 547703 552027 556021 559487 564674 572111 579806 586400 592206 597255 601169 604920
57811 604920 609950 615420 618938 620113 620744 621369 620335 616696 611555 606038 600157 594108 588628 583743 579067
57796 579067 575359 573730 573285 571873 569363 568025 569507 573641 580326 590130 602414 614922 625952 635489
57782F35489Q597Q128Q351Q609P274M432K464K330J851n20l080m206n251p461
57768F67007q959p938o255o500p746p553o165n321m809l646k895l813m774l532
57754E87101j147j08O8J650M133M751L047J333P35Mj670l587n330p107q308q047
57738E67518o995o510o300n132l411k711l022k691r55J424L764N845P107P354
57724E55285P821R625J1611J1658R746P786O750N846M473L319L346M665O296O473
57710F54700M158Q77j98K096N602Q032R399J0005Q502M288k96k770l916n806q011
57695F86662q716q300q694r949j0490j0275j0816j2249j2988j2321j1068r794
57683E61002q330o917n921m679k472j82P63M82Lp72k456m338n155n028m661l518
$$ plain form
57782 635489 644086 652214 660565 669174 676448 680880 683344 685674 687525 687005 683925 679719 674468 667007
57768 667007 658048 650110 643855 637355 629609 622056 615891 610570 605761 602115 599220 595407 590633 587101
57754 587101 585954 585846 585914 587564 591697 596448 599495 600828 601563 601567 599897 596310 590980 583873 575565 567518
57738 567518 560523 554013 547713 542581 539170 536459 533437 530746 529791 531215 534979 540824 547931 555285
57724 555285 563106 572731 584342 596000 605746 613532 620282 626128 630601 633920 637266 641931 648227 654700
57710 654700 658858 659735 659537 661633 667235 675267 684666 694671 703173 707461 707165 704395 700479 694673 686662
57695 686662 677946 669646 660952 651003 640513 630238 619422 607173 594185 581864 570796 561002
57683 561002 552672 545755 539834 535155 532683 532501 533264 533746 533749 532977 530521 526183 521028 516000 511339 507821
57667E07821j034J304J631Q60J446L466M605M028L497M363N825O726P113P573
57653E59224Q550J0469J3016J4439J3275J0629R043R306J0108J0651J1579J3300
57641F93589J5247J7012J8686K0020K0821K2041K4892K8820L1853L2896L2345
57630I58222L0659K7876K4390K0795J7145J3696J1900J2996J6073J9112K1614
57619A174478K4562K8311L2469L7480M4304N2498O0560O8233P6608Q5939R5309
57608A780751J04658J15158J27010J38651J48766J57613J65296J69413J65033
57599C072349J46891J12355O3910R118m2754q4865j14392j31816j39892j42371
57589B748533j41844j38624j32360j23927j14760j05309r5592q6411p8432p0874
$$ plain form
57667 507821 506787 508091 509722 510582 512028 515494 520099 524127 527624 531987 537812 544538 551651 559224
57653 559224 567774 578243 591259 605698 618973 629602 638645 647951 658059 668710 680289 693589
57641 693589 708836 725848 744534 764554 785375 807416 832308 861128 892981 925877 958222
57630 958222 988881 1016757 1041147 1061942 1079087 1092783 1104683 1117679 1133752 1152864 1174478
57619 1174478 1199040 1227351 1259820 1297300 1341604 1394102 1454662 1522895 1599503 1685442 1780751
57608 1780751 1885409 2000567 2127577 2266228 2414994 2572607 2737903 2907316 3072349
57599 3072349 3219240 3331595 3395505 3404623 3361869 3277004 3162612 3030796 2890904 2748533
57589 2748533 2606689 2468065 2335705 2211778 2097018 1991709 1896117 1809706 1731274 1660400
57579A660400o2760n4792m8344m3234l8329l3629k9832k6328k1849j6860j3140
57568A271303j0933q656n643l107j793m43K516O947J1376J4555J6354J7677J9673
57555A329826K2546K5441K7950L0965L5209L9900M4006M7891N2243N6245N8543
57544A770765N9402O0075O0335N8424N3283M5242L4654K1502O533q699k3099l6427
57532B101990m8365n8188o5257o9324p0773p0965p1321p1411o9295o4724o0405
57521A381962n8481n7478n4727n0299m6121m2397l7824l2765k9320k8198k7892
57510I16460k7117k5979k4561k2518k0282j8940j8485j7694j5857j3385j0818
57499G00824q509p059o793p130p513q187q962q468o199l890k965k110K23K495
$$ plain form
57579 1660400 1597640 1542848 1494504 1451270 1412941 1379312 1349480 1323152 1301303 1284443 1271303
57568 1271303 1260370 1251714 1246071 1242964 1241171 1240728 1243244 1250191 1261567 1276122 1292476 1310153 1329826
57555 1329826 1352372 1377813 1405763 1436728 1471937 1511837 1555843 1603734 1655977 1712222 1770765
57544 1770765 1830167 1890242 1950577 2009001 2062284 2107526 2142180 2163682 2170215 2161516 2138417 2101990
57532 2101990 2053625 1995437 1930180 1860856 1790083 1719118 1647797 1576386 1507091 1442367 1381962
57521 1381962 1323481 1266003 1211276 1160977 1114856 1072459 1034635 1001870 972550 944352 916460
57510 916460 889343 863364 838803 816285 796003 777063 758578 740884 725027 711642 700824
57499 700824 692315 685256 678463 671333 663820 655633 646671 638203 632004 628114 625149 623039 623262 625757
57485F25757K274N62M82K226K953J663N48J115K280L145M529O648Q108Q388Q878
57470F79556J0299J1385J1344J1444J2860J4829J6208J7197J8353J9520K0791
57459H43786K3065K6520K9830L1902L3364L5604L9251M4003M8835N2071N2488
57448A260719N0682M8253M5543M1421L5162K7016J7087N477o365j6394k4228l0938
57436A453435l6576l9969m1194m2040m3297m3710m2345m0117l8057l5869l3016
57425A017245k9792k6525k3193k0341j8903j8459j7263j4582j1588r420p899o575
57413H12705n436m086j766J177L339M223M706N286N557N772P072R597J2239J4694
57399H75079J7896K1847K5072K6965K8628L0604L1886L2249L3427L6515L9924
$$ plain form
57485 625757 628031 628593 629075 631301 634254 635917 636465 637580 639860 643005 647534 654182 662290 670678 679556
57470 679556 689855 701240 712584 724028 736888 751717 767925 785122 803475 822995 843786
57459 843786 866851 893371 923201 955103 988467 1024071 1063322 1107325 1156160 1208231 1260719
57448 1260719 1311401 1359654 1405197 1446618 1481780 1508796 1525883 1531360 1524995 1508601 1484373 1453435
57436 1453435 1416859 1376890 1335696 1293656 1250359 1206649 1164304 1124187 1086130 1050261 1017245
57425 1017245 987453 960928 937735 917394 898491 880032 862769 848187 836599 827179 819280 812705
57413 812705 807269 803183 801417 802594 805933 810156 814862 820148 825705 831477 838549 848146 860385 875079
57399 875079 892975 914822 939894 966859 995487 1026091 1057977 1090226 1123653 1160168 1200092
57388A200092M1469M1004L9524L6958L2423K5774J7649Q639p96j0337k0186l0292
57376A381921l8953m3883m5316m6200m8336n0161m9631m7370m5257m3396m0529
57365H82889l6589l2859l0118k8124k6544k5029k2827j9744j7111j6373j6824
57354F10747j6152j3436j0399r169r646r793q214n715m154m256n046n261m556
57341E04950l254j716m94k74r84j615j617j731k595l365k833j142P30K449L996
57326D90505M716M299L941M766N627M556K065Q70K095L820L913K655J739J975
57312E37542K735K958K213J182J018J920K865L133L159L092J974l26j803q20J239
57297E62081J956J540K178M413O517P046N965L743J446J026L132N433N503M691
$$ plain form
57388 1200092 1241561 1282565 1322089 1359047 1391470 1417244 1434893 1443532 1442736 1432399 1412213 1381921
57376 1381921 1342968 1299085 1253769 1207569 1159233 1109072 1059441 1012071 966814 923418 882889
57365 882889 846300 813441 783323 755199 728655 703626 680799 661055 643944 627571 610747
57354 610747 594595 581159 570760 561591 551945 542152 533938 528223 524069 519813 514767 509506 504950
57341 504950 501696 499980 499486 499212 498228 496613 494996 493265 490670 487305 484472 483330 484060 486509 490505
57326 490505 495221 499520 503461 508227 513854 518410 520475 521345 523440 527260 531173 533828 535567 537542
57312 537542 540277 543235 545448 546630 547648 549568 552433 555566 558725 561817 563791 563465 561662 560842 562081
57297 562081 564037 565577 567755 572168 578685 585731 591696 595439 596885 597911 601043 606476 611979 616670
57283F16670O213J0088J3207J4130J4406J5023J5111J4786J5888J8664K0701K0411
57271G95298J9025J7982J6811J4974J3567J3541J3997J3603J2427J1382J1019
57260I53626J1488J2602J3626J4070J4561J5719J6697J6479J5898J6310J6985
57249A118061J6196J4309J3160J2904J2261J1347J1313J1641J1001J0406J1944
57238A254543J4583J5061J3061J1603J2004J2466J2380J3577J6158J7248J5646
57227A408330J3953J4194J4927J4624J4584J6292J8949K1545K4602K7887K9329
57216A619216K8210K6879K7382K8945L0393L2182L4131L4079L1079K7499K5699
57205A945694K4786K2745J9678J6963J4963J3321J1887J0107P279M476M086O500
$$ plain form
57283 616670 622883 632971 646178 660308 674714 689737 704848 719634 735522 754186 774887 795298
57271 795298 814323 832305 849116 864090 877657 891198 905195 918798 931225 942607 953626
57260 953626 965114 977716 991342 1005412 1019973 1035692 1052389 1068868 1084766 1101076 1118061
57249 1118061 1134257 1148566 1161726 1174630 1186891 1198238 1209551 1221192 1232193 1242599 1254543
57238 1254543 1269126 1284187 1297248 1308851 1320855 1333321 1345701 1359278 1375436 1392684 1408330
57227 1408330 1422283 1436477 1451404 1466028 1480612 1496904 1515853 1537398 1562000 1589887 1619216
57216 1619216 1647426 1674305 1701687 1730632 1761025 1793207 1827338 1861417 1892496 1919995 1945694
57205 1945694 1970480 1993225 2012903 2029866 2044829 2058150 2070037 2080144 2087423 2091899 2095985 2102485
57193B102485R478J1558J3536J5875J7580J8699K0819K3872K5505K4894K4109
57182B308410K4363K4309K3441K3714K5825K7312K6384K4539K3481K2630K1746
57171B576154K2597K5692K8391K8883K9130L1507L5187L8182M0369M2316M3771
57160B942179M5407M9321N5562O0920O3207O4139O5956O8046O9059O9417O9440
57149C622653O7749O3840N9642N6481N3220M9168M5978M4744M4314M4398M7156
57138D199343N3460O0739O6614P1717P7011Q1563Q4881Q7940R0026Q8304Q2731
57127E044329P7624P6083P6489P6611P7128P8669P9574P9228P9628Q1066Q0554
57116E906983P7245P4870P5760P6902P5409P3464P4044P5794P6058P5406P5396
$$ plain form
57193 2102485 2111963 2123521 2137057 2152932 2170512 2189211 2210030 2233902 2259407 2284301 2308410
57182 2308410 2332773 2357082 2380523 2404237 2430062 2457374 2483758 2508297 2531778 2554408 2576154
57171 2576154 2598751 2624443 2652834 2681717 2710847 2742354 2777541 2815723 2856092 2898408 2942179
57160 2942179 2987586 3036907 3092469 3153389 3216596 3280735 3346691 3414737 3483796 3553213 3622653
57149 3622653 3690402 3754242 3813884 3870365 3923585 3972753 4018731 4063475 4107789 4152187 4199343
57138 4199343 4252803 4313542 4380156 4451873 4528884 4610447 4695328 4783268 4873294 4961598 5044329
57127 5044329 5121953 5198036 5274525 5351136 5428264 5506933 5586507 5665735 5745363 5826429 5906983
57116 5906983 5984228 6059098 6134858 6211760 6287169 6360633 6434677 6510471 6586529 6661935 6737331
57105F737331P5208P3857P2465P1330O8243O2595N7374N4264N0785M5050L9164
57094G407666L5081L1331K6742K3021K0979J8701J6037J6124K0038K4965K9700
57083G670385L6362M4612N0596N3545N6284N6806M7424K5704j669k9222n8472
57072G952355q9917j18754j43273j68388j95860k20511k41401k66933l02929l45589
57062E858800l92139m47761n15146n88109o63089p46191q41352G21988c26322
57052a490564j294454j431400j570470j718630j879956k047166k217467k400969
57044a6051076k602097k809185l014503l226859l451869l679528l905229m140991
57036d2881337m390100m634740m865465n094822n323405n527233n702389n881421
$$ plain form
57105 6737331 6812539 6886396 6958861 7030191 7098434 7161029 7218403 7272667 7323452 7368502 7407666
57094 7407666 7442747 7474078 7500820 7523841 7544820 7563521 7579558 7595682 7615720 7640685 7670385
57083 7670385 7706747 7751359 7801955 7855500 7911784 7968590 8016014 8041718 8040049 8010827 7952355
57072 7952355 7862438 7743684 7600411 7432023 7236163 7015652 6774251 6507318 6204389 5858800
57062 5858800 5466661 5018900 4503754 3915645 3252556 2506365 1665013 721988 -326322
57052 -1490564 -2785018 -4216418 -5786888 -7505518 -9385474 -11432640 -13650107 -16051076
57044 -16051076 -18653173 -21462358 -24476861 -27703720 -31155589 -34835117 -38740346 -42881337
57036 -42881337 -47271437 -51906177 -56771642 -61866464 -67189869 -72717102 -78419491 -84300912
57028h4300912o076494o252185o373278o378962o037195m977295l124586j136743
57020a24657650j63740r47537l138830n538411o959892o868354n410845l106106
57012a56791365n35511J875447L962182N752084P288887Q543323R470214J0072747
57004a10361992J0378772J0404086J0173963R747651R190484Q543069P836482
56997d4087485P111802O402112N714816N051047M426337L857054L343845K884201
56989e296271K485892f57269A215649J629213J418111J238458J080158R34397
56981G515986Q04393O94752O00312N15135M42099L83904L34440K88202K48594
56972A1827817K18400J91660J63742J39942J25422J15502J04409R4817Q9920Q4318
$$ plain form
57028 -84300912 -90377406 -96629591 -103002869 -109381831 -115419026 -120396321 -123520907 -124657650
57020 -124657650 -124821390 -125768927 -128907757 -134446168 -141406060 -148274414 -153685259 -156791365
57012 -156791365 -157326876 -155451429 -151489247 -145737163 -138448276 -129904953 -120434739 -110361992
57004 -110361992 -99983220 -89579134 -79405171 -69657520 -60467036 -51923967 -44087485
56997 -44087485 -36975683 -30573571 -24858755 -19807708 -15381371 -11524317 -8180472 -5296271
56989 -5296271 -2810379 -657269 1215649 2844862 4262973 5501431 6581589 7515986
56981 7515986 8320379 9015131 9615443 10130578 10572677 10956581 11291021 11579223 11827817
56972 11827817 12046217 12237877 12401619 12541561 12666983 12782485 12886894 12981711 13071631 13155949
56962A3155949P1664N4090L5830J4604j2346m0207o2528p9600r3968j03717j07220
56951A2832551j08801j12924j18044j22131j28358j39231j50973j59795j67968
56942A1624326j77620j84641j85317j83530j84722j87804j89279j90453j94252
56933I946708j99520k04539k11734k23082k35100k43841k50289k55802k57228
56924G865573k52140k43746k35012k22977k04438j81486j55193j20062p1857j4005
56914F164657N2691J38528K47145L49219L88841L25357J67166l5472k25192l66155
56904G206785m50310m87265m90896m72337m40213m01760l61209l19648k78771
56895C504376k42774k14863j94426j79535j69266j61612j52650j40826j29039
$$ plain form
56962 13155949 13227613 13281703 13317533 13332137 13319791 13279584 13217056 13137456 13043488 12939771 12832551
56951 12832551 12723750 12610826 12492782 12370651 12242293 12103062 11952089 11792294 11624326
56942 11624326 11446706 11262065 11076748 10893218 10708496 10520692 10331413 10140960 9946708
56933 9946708 9747188 9542649 9330915 9107833 8872733 8628892 8378603 8122801 7865573
56924 7865573 7613433 7369687 7134675 6911698 6707260 6525774 6370581 6250519 6178662 6164657
56914 6164657 6217348 6355876 6603021 6952240 7341081 7666438 7833604 7798132 7572940 7206785
56904 7206785 6756475 6269210 5778314 5305977 4865764 4464004 4102795 3783147 3504376
56895 3504376 3261602 3046739 2852313 2672778 2503512 2341900 2189250 2048424 1919385
56886A919385j19835j11682j02747r4697q9250q4221p6760o7759n9517n1842m3954
56875A017121l7402l3327k9347k2898j5405r853o671n331p256j3354k1015k7119
56863G88143l1905l6643m0012m0266l8585l6855l4507l0770k7314k5254k2559
56852D23473j8092j5018j5941j7704j5777j1309q779q862q825q268r209j1334
56840B74355j2153j1336j0549r582o796k886m00R4m4m73j249n10L286P807R464
56825B39028Q724Q764R722Q747N398K495J304J42j655k321j120K64Q88K035M487
56810B86902O913Q239R446J1899J5503J9279K2552K5196K7722L1114L5662M0352
56798E40779M4002M5889M4396L7057K3889R080k891j1468j8330k3265k4600k2539
$$ plain form
56886 1919385 1799550 1687868 1585121 1490424 1401174 1316953 1240193 1172434 1112917 1061075 1017121
56875 1017121 979719 946392 917045 894147 878742 868889 862218 856887 849631 836277 815262 788143
56863 788143 756238 719595 679583 639317 600732 563877 529370 498600 471286 446032 423473
56852 423473 405381 390363 374422 356718 340941 329632 320853 311991 303166 294898 285689 274355
56840 274355 262202 250866 240317 230735 223939 221053 220653 220747 220703 220230 218981 218471 221757 229564 239028
56825 239028 247752 256516 266238 274985 280383 282878 284182 284324 282669 280348 279228 279492 280380 282415 286902
56810 286902 293815 302054 311500 323399 338902 358181 380733 405929 433651 464765 500427 540779
56798 540779 584781 630670 675066 712123 736012 745092 742201 730733 712403 689138 664538 641999
56786F41999j9094j5267j0864o354k331K296R042J7206K4795L1595L9206M8710
56774G60939O0156P3150Q5147R0182Q2501O1934L3760L892k3635m5469n8930o4072
56762A059555o3700o0545n5601m9097m1543l3583k5873j8872j2164m730L408J1090
56750G08345J8337K6983L7706M8163N5388N7997N4505M2444K2067j113k0631l4640
56738A015551m4739n1293n3388n1953m9169m5300l9329l2193k6229k1787j7254
56727E82917j2226p842m196n9N025J0593J6691K2870K6382K4186J6629O704l776
56714F83898j4636k4546l1093l3867l4852l5275l4486l2215k9645k7669k5916
56703C59698k3862k1432j8491j5244j2838j2083j2007j1197r920r271q999q062
$$ plain form
56786 641999 622905 607638 596774 590420 588089 590385 599427 616633 641428 673023 712229 760939
56774 760939 821095 894245 979392 1069574 1152075 1214009 1247769 1251661 1228026 1182557 1123627 1059555
56762 1059555 995855 935310 879709 830612 789069 755486 729613 710741 698577 693847 697255 708345
56750 708345 726682 753665 791371 839534 894922 952919 1007424 1049868 1071935 1070822 1050191 1015551
56738 1015551 970812 919519 866131 814178 765009 719709 680380 648187 621958 600171 582917
56727 582917 570691 562849 558653 558594 563619 574212 590903 613773 640155 664341 680970 687674 683898
56714 683898 669262 644716 613623 579756 544904 509629 475143 442928 413283 385614 359698
56703 359698 335836 314404 295913 280669 267831 255748 243741 232544 222624 213353 204354 196292
56691A96292o622n660n286n170n659o744p068n978n180o138p286o440m509l828
56677A14724m059l075j099m36j401j886r41J78O60J041J418J296J130J666K100
56662A11316J318L89J034K297J744m73j877j614r49j87J356K522J130j995l517
56647A12494k585j760k292k212l49J373J279N31N94Q08L51J82J143K112J778P12
56631A14159K10M45R85J662K081J536L82Q5J248K947M399N731O611O023M129K652
56615A55285K625L145L078K511J927J319Q06Q69J419J762J810K240L273M364N200
56600A91633N757N619M525L380L253L492K472P2k079k786k355j640j389k194l798
56585B03962m984n392o422q830j0815j0588r450r754j1044j1119r960r248q743
$$ plain form
56691 196292 189670 184010 178724 173554 167895 161151 154083 148105 142925 136787 129501 123061 118552 114724
56677 114724 110665 107590 106491 106055 104654 102768 101827 102005 102665 103706 105124 106420 107550 109216 111316
56662 111316 112634 113023 114057 116354 118098 117625 115748 114134 113185 112998 114354 116876 118006 116011 112494
56647 112494 109909 108149 105857 103645 103296 104669 105948 106479 107073 107881 108232 108414 109557 111669 113447 114159
56631 114159 114369 114814 115799 117461 119542 121078 121460 121545 122793 125740 130139 135870 142481 148504 152633 155285
56615 155285 157910 161055 164133 166644 168571 169890 170696 171565 172984 174746 176556 178796 182069 186433 191633
56600 191633 197390 203009 207534 210914 214167 217659 220131 220203 218124 215338 212983 211343 209954 207760 203962
56585 203962 198978 193586 187164 178334 167519 156931 147481 137727 126683 115564 105604 96356 87613
56572H7613o652l447j727k021k135j044k48n79q26l33m8j48O43K474L644L338
56556G8504K641K250J607R28J457L075M183M610N890Q017Q698O924M594L492L073
56541A39943K435K097K586L215L295K888J897L46l33J323L971M696L351K676L683
56526A78069M242L211K532L602M630L579J380L10R88K475L688L675K158N32N58
56511B15629J811K493K685L949N689N458L502L161N522P395O406M599M822O628
56497B79749Q136R238J0577J1645J2045J2526J3006J1933R407Q329J0395J3258
56485D10244J3897J2567J1233J0284R039P611O125L857J001o05l38k04j589k865
56471D80257k390j598k657n000o783q065r910j1692j1819j0296q465p140o532
$$ plain form
56572 87613 80961 77514 75787 73766 71631 70587 70339 69760 68934 68601 68553 68405 69048 71522 75166 78504
56556 78504 81145 83395 85002 85930 87387 90462 94645 99255 105145 113162 121860 128784 133378 136870 139943
56541 139943 142378 144475 147061 150276 153571 156459 158356 158702 158369 159692 163663 168359 171710 174386 178069
56526 178069 182311 185522 188054 191656 196286 199865 201245 201555 202543 205018 208706 212381 214539 215071 215629
56511 215629 217440 219933 222618 226567 232256 237714 241216 244377 249899 257294 263700 268299 273121 279749
56497 279749 287885 297123 307700 319345 331390 343916 356922 368855 378262 386591 396986 410244
56485 410244 424141 436708 447941 458225 467264 474875 481000 484857 485858 485253 484915 484711 483122 480257
56471 480257 477867 476269 473612 468612 461829 453764 443854 432162 420343 410047 401582 394442 387910
56458C87910o842p456o901n088m034m966o406o697o513p036p550o922n904n826
56444B99769o284o007m950l837k837k088k275l383m190m030l494k573k55K956
56430B56522M497L231J208L97K1j158k299k246j634j362j023n49j111k515k348
56415B49631K92K811K977K105K036J944Q99O84K776M991M767L501L932N093M071
56400B92510J370M37K322M586N339N235N375N746N905N442M060K635L021N369
56386C49352P081O272M510M167M946N354N583O294O437N204M357N640P364O723
56372D29284M193K550K669L137K976J965m55l837n647m332k109j854k937l089
56358D22514k650l402m681m476l305l332m460m856m459m527m681l859l185m145
$$ plain form
56458 387910 381068 373612 366711 361623 357589 352623 346217 339520 333007 325971 318421 311499 305595 299769
56444 299769 293485 287478 282528 278691 275854 273766 271491 268108 263918 259888 256394 253821 253566 256522
56430 256522 261019 264250 265458 265855 265876 264718 262419 260173 258539 257177 256154 255605 254494 251979 249631
56415 249631 249923 252734 255711 257816 259852 261796 262695 263379 266155 271146 275913 279414 283346 288439 292510
56400 292510 293880 294317 296639 301225 306564 311799 317174 322920 328825 334267 338327 340962 343983 349352
56386 349352 356433 362705 367215 371382 376328 381682 387265 393559 399996 405200 409557 415197 422561 429284
56372 429284 433477 436027 438696 441833 444809 446774 446319 442482 436835 432503 430394 428540 425603 422514
56358 422514 419864 416462 411781 407305 404000 400668 396208 391352 386893 382366 377685 373826 370641 366496
56344C66496n027l258l48j62k730m252l191j859j685j312k09O6p81q50L16N83
56328C41797r57k233j624l84k89j237k303l067l051j877n00l59j090j148n95p04
56312C20379j043J17K218K464J80j839j418J04K89j177k810l218j847O59K524
56297C15582K564J803J902K438J850M67J10Q98J150M34J56Q32J324J175J324K150
56281C36159K894L397M372N742O598O807O850O402N174M600O177Q583Q993P082
56267D19830N092M213L536K529J829J609J563K375M667O982P498P149Q039R393
56253D86304Q627O144N238P032R097R638R399Q866P109M453L135M030N532O274
56239E80878O328N266K274j160j927K36K038J316m35j217j199j088o26kl23j549
$$ plain form
56344 366496 361469 358211 357863 357701 354971 350719 347528 345669 343984 342672 342463 342529 341748 340898 341214 341797
56328 341797 340840 338607 336983 336599 336310 335073 332770 329703 326652 324775 324275 323916 322826 321678 321083 320379
56312 320379 319336 319453 321671 324135 324315 322476 321058 321162 321451 320274 317464 314246 312399 313058 315582
56297 315582 318146 319949 321851 324289 326139 326606 326716 327614 328764 329198 329354 330186 331510 332685 334009 336159
56281 336159 339053 342450 346822 352564 359162 365969 372819 379221 384395 388995 395172 403755 412748 419830
56267 419830 424922 429135 432671 435200 437029 438638 440201 442576 447243 454225 461723 468872 476911 486304
56253 486304 494931 501075 506313 513345 522442 532080 541479 550345 557454 561907 565042 569072 574604 580878
56239 580878 587206 592472 594746 593586 591659 591895 593933 595249 594814 593597 592398 591310 590684 590682 590359 588810
56223E88810k161j647j074p49J08R87K51j780k751j950j008m00J421M411N872
56208E88340M526K657K608L765M532M836N215N634O461Q533J1166J2361J1782
56195F72416J1419J2407J3601J4044J4539J5750J6949J7418J7230J6379J5112
56184H37264J5019J7203J9629J9190J6304J4195J3756J2710J0101P706O433N106
56172I94616L583L246L590K244n04j262J028L082K366N65J31Q38J571K445L285
56157A020824K870J168k22q69j933l256l323k576l070m336l794k002k679o304
56143I90498q566p033m548l871l577j887j33L51Q01J947K135R74Q73K586L246
56128I73796J307p01q45q78k014k133k24R20k76r09J145L221K886K451M225N737
$$ plain form
56223 588810 586649 585002 583928 583179 583287 584274 584525 582745 579994 578044 577036 576636 578057 582468 588340
56208 588340 592866 595523 598131 601896 606428 611264 616479 622113 628574 637107 648273 660634 672416
56195 672416 683835 696242 709843 723887 738426 754176 771125 788543 805773 822152 837264
56184 837264 852283 869486 889115 908305 924609 938804 952560 965270 975371 983077 989510 994616
56172 994616 998199 1001445 1005035 1007279 1006775 1005513 1006541 1009623 1011989 1012554 1012685 1013523 1015094 1017539 1020824
56157 1020824 1023694 1024862 1024640 1023771 1021838 1018582 1015259 1012683 1009613 1005277 1001483 999481 996802 990498
56143 990498 981932 974899 970351 966480 962903 961016 960883 961234 962035 963982 966117 967091 967964 970550 973796
56128 973796 975103 974402 973557 972679 970665 968532 968308 969228 968952 968043 969188 972409 975295 977746 981971 987708
56112I87708M452L209N638R510J0156P960P122Q920J1159J2719J3996J4207J2515
56099A109271J0796J1539J3991J5655J6254J7103J8168J8885K0455K4173K8793
56088A305083L2184L4224L5833L6997L7889L9819M2862M4829M4608M3939M3984
56077A742251M3348M1765M2254M6889N3754O0648O8443P8041Q7900R7544J09529
56066B472366J24715J39795J53288J69535J92427K19219K45019K69321K92644
56057D278329L10262L15208L05617K84518K54914K19929J85411J57170J36408
56048F447766J20995J08870R7109Q1026N8624L3555J0444r725k6713l8523m6569
56037F836859n8962q2893j16628j53548j90220k25164k53702k70661k75981k72542
$$ plain form
56112 987708 992160 995369 1001007 1010517 1020673 1028633 1035755 1044675 1055834 1068553 1082549 1096756 1109271
56099 1109271 1120067 1131606 1145597 1161252 1177506 1194609 1212777 1231662 1252117 1276290 1305083
56088 1305083 1337267 1371491 1407324 1444321 1482210 1522029 1564891 1609720 1654328 1698267 1742251
56077 1742251 1785599 1827364 1869618 1916507 1970261 2030909 2099352 2177393 2265293 2362837 2472366
56066 2472366 2597081 2736876 2890164 3059699 3252126 3471345 3716364 3985685 4278329
56057 4278329 4588591 4903799 5209416 5493934 5748848 5968777 6154188 6311358 6447766
56048 6447766 6568761 6677631 6774740 6855766 6914390 6947945 6958389 6948664 6921951 6883428 6836859
56037 6836859 6777897 6695004 6578376 6424828 6234608 6009444 5755742 5485081 5209100 4936558
56027D936558k61194k42878k22096k02659j82987j61008j40177j24962j13783
56018C284814j02499r1474q3011p5272o5460n5872n0138m6332m0531l4118l0598
56007B609509k8158k2691j5634j1330r085n186n54J190J371M387R869J3827J6018
55994B563533J9256K3201K5676K8150L2974L7523L8196L7706M1002M6469M9007
55983B942693M9257N1617N5328N6054N4530N5194N7903N9050N9313O2278O7145
55972C570362P0625P3863P9625Q5289Q7010Q7855R3084J00539J04982J08395J16000
55961D577629J25485J30992J34697J43099J54609J62513J67735J76562J88091
55952E961412J96587K04377K19234K40245K59365K75981K96570L20967L42618
$$ plain form
56027 4936558 4675364 4432486 4210390 4007731 3824744 3663736 3523559 3398597 3284814
56018 3284814 3182315 3090841 3007830 2932558 2867098 2811226 2761088 2714756 2674225 2640107 2609509
56007 2609509 2581351 2558660 2543026 2531696 2522611 2517425 2516871 2518061 2519432 2523819 2533688 2547515 2563533
55994 2563533 2582789 2605990 2631666 2659816 2692790 2730313 2768509 2806215 2847217 2893686 2942693
55983 2942693 2991950 3043567 3098895 3154949 3209479 3264673 3322576 3381626 3440939 3503217 3570362
55972 3570362 3640987 3714850 3794475 3879764 3966774 4054629 4147713 4248252 4353234 4461629 4577629
55961 4577629 4703114 4834106 4968803 5111902 5266511 5429024 5596759 5773321 5961412
55952 5961412 6157999 6362376 6581610 6821855 7081220 7357201 7653771 7974738 8317356
55943H317356L62022L86049M14204M39383M62079M89740N22327N53067N83595
55934A2529822O23267O72809P23480P72820Q26355Q83583R37961R91089J051082
55925B0012268J116891J180474J244301J319620J407809J500940J599586J710948
55917C1092837J830407J945195K055289K169879K286139K395766K510515K654532
55909D8940559K831861L028770L246515L501133L792389M108311M463096M896204
55901G8808838N433153O084313O879549P856998R015160J0326348J1801598J3491747
55893A49697704J5432802J7663539K0289625K3424265K7043628L0993261L5082189
55886C19627013L8862831M1126423L9912433L3589556K2253020Q018460o151957
$$ plain form
55943 8317356 8679378 9065427 9479631 9919014 10381093 10870833 11393160 11946227 12529822
55934 12529822 13153089 13825898 14549378 15322198 16148553 17032136 17970097 18961186 20012268
55925 20012268 21129159 22309633 23553934 24873554 26281363 27782303 29381889 31092837
55917 31092837 32923244 34868439 36923728 39093607 41379746 43775512 46286027 48940559
55909 48940559 51772420 54801190 58047705 61548838 65341227 69449538 73912634 78808838
55901 78808838 84241991 90326304 97205853 105062851 114078011 124404359 136205957 149697704
55893 149697704 165130506 182794045 203083670 226507935 253551563 284544824 319627013
55886 319627013 358489844 399616267 439528700 473118256 495371276 503389736 497237779
55879D97237779j7961606k6414298l1522536l3806065l3991193l2816222l0861467
55872B89864392k8501149k5976554k3449420k0998612j8650034j6443414j4441033
55865A41404176j2676176j1138648r813585q694140p753986o948195o250036n656185
55857G2473225n151983m702963m286269l902843l553804l230932k935156k679258
55849D2030017k465353k279995k115237j974160j852411j735159j617184j507554
55841B6482964j410385j318346j228584j147588j076229j006152r35008q70064
55833A7490608q13412p58491p04444o59043o23810n90512n56146n27585n07487
55824A1749678m88984m68361m50190m35532m17486l93083l68237l46442l23462
$$ plain form
55879 497237779 479276173 452861875 421339339 387533274 353542081 320725859 289864392
55872 289864392 261363243 235386689 211937269 190938657 172288623 155845209 141404176
55865 141404176 128728000 117589352 107775767 99081627 91327641 84379446 78129410 72473225
55857 72473225 67321242 62618279 58332010 54429167 50875363 47644431 44709275 42030017
55849 42030017 39564664 37284669 35169432 33195272 31342861 29607702 27990518 26482964
55841 26482964 25072579 23754233 22525649 21378061 20301832 19295680 18360672 17490608
55833 17490608 16677196 15918705 15214261 14555218 13931408 13340896 12784750 12257165 11749678
55824 11749678 11260694 10792333 10342143 9906611 9489125 9096042 8727805 8381363 8057901
55815H057901k97509k74049k55713k37265k15069j92665j72823j52892j31914
55806F128002j13987j00815q8903p7758p3257p9405r3456j11542j32121j52001
55796E104757j66600j76387j85848j94548j96861j92012j85961j81508j74992
55787C450040j65024j55704j48320j38364j24349j11539j03192r5526q5078p4028
55777B248916o4565n4783m3886l4930k8739k1275j0460L15Q495J5716K1654K1187
55765B057645J1825j614j3509k3361l2026l7810m0157m2222m6018m9526n1486
55754A731741n4109n8049n9813n7511n4288n2796n0950m6379m0579l5607l1035
55743A190625k6942k5361k5883k4513j9675j4769j2126r461n280k464k843l110
$$ plain form
55815 8057901 7760392 7486343 7230630 6993365 6778296 6585631 6412808 6259916 6128002
55806 6128002 6014015 5913200 5824297 5746539 5673282 5593877 5500421 5388879 5256758 5104757
55796 5104757 4938157 4761770 4575922 4381374 4184513 3992501 3806540 3625032 3450040
55787 3450040 3285016 3129312 2980992 2842628 2718279 2606740 2503548 2408022 2322944 2248916
55777 2248916 2184351 2129568 2085682 2050752 2022013 2000738 1990278 1990593 1999088 2014804 2036458 2057645
55765 2057645 2069470 2067856 2054347 2030986 1998960 1961150 1920993 1878771 1832753 1783227 1731741
55754 1731741 1677632 1619583 1559770 1502259 1447971 1395175 1344225 1297846 1257267 1221660 1190625
55743 1190625 1163683 1138322 1112439 1087926 1068251 1053482 1041356 1031895 1026615 1024151 1021308 1018198
55731A018198k53L255L648J419j003l410o113p625p411p682r427j0103q075n692
55717I59726n069m693l156k365l829n573o091p659j2211j7401k0092k0579k0323
55704H30685j8926j6424j5038j5607j5685j4130j3697j5936j7811j7005j6437
55693F53989j9306k3488k5399k5944k7919l0503l1047k9806k8294k5362j9477
55682C67444j2792q682o988n607m642m988n022l024r40j491l318l276j740j315
55668C03619j807j038N69O27r09k177l372o112r500j0772r548p800o169l871j727
55653B40013j550k722k966k225k304k850j415K246N299N783M574K907Q08j358
55639B44240k335j815j020r03j340k117l215m063m032l488l130k836k382k292
$$ plain form
55731 1018198 1017945 1021200 1024848 1026267 1025264 1021854 1015741 1008116 1000705 993023 983596 973493 965418 959726
55717 959726 954657 949964 946808 944443 940614 935041 928950 921291 909080 891679 871587 851008 830685
55704 830685 811759 795335 780297 764690 749005 734875 721178 705242 687431 670426 653989
55693 653989 634683 611195 585796 559852 531933 501430 470383 440577 412283 386921 367444
55682 367444 354652 345970 338982 333375 328733 323745 318723 315699 314759 313268 309950 306674 304934 303619
55668 303619 301812 300774 301343 301970 301061 298884 295512 289400 279900 269128 259580 251780 245611 241740 240013
55653 240013 238463 235741 232775 230550 228246 225396 223981 226227 231526 237309 241883 244790 245598 244240
55639 244240 241905 240090 239070 238167 236827 234710 231495 227432 223400 219912 216782 213946 211564 209272
55625B09272k544j695J036M016N493O313Q150J0344J1072J0548J0311J0168Q593
55612B91077N649K917P89j648m326o200p342q760j0326j0990j0786j0550r978
55599B19526q196o003n286o180o810n912l988j990n32k47j247k318k185j153k36
55584A67243O18J807K486J646R1n66k86j23j16K40J57j476l771m662l832k706
55568A56750j999j402j249k135l053k316l37O95Q5o07k39M81O04J12q46k340l934
55551A38270m930n340n388m506k366n27r18k881l665k120M3R56Q70J028J719K129
55535A12374J500R2q02j55J245J512N41N13K531M454L871J646M03Q36J823K918
55519A35302M189M722M001L888O333R833J1314J0956J1846J5022J8270K0143K1813
$$ plain form
55625 209272 206728 205033 206069 210085 215578 221891 230041 240385 251457 262005 272316 282484 291077
55612 291077 296726 299643 300432 298784 294458 288258 280916 272156 261830 250840 240054 229504 219526
55599 219526 211330 205327 200041 193861 187051 181139 177151 175161 174629 174382 173135 170817 168632 167479 167243
55584 167243 167861 169668 172154 173800 173891 173325 173039 172916 172800 173040 173197 171721 167950 163288 159456 156750
55568 156750 154751 153349 152100 149965 146912 144596 144259 144954 145039 144432 144193 144674 145278 145390 144544 142204 138270
55551 138270 133340 128000 122612 118106 115740 115213 114295 111414 107749 105629 105672 106628 107498 108526 110245 112374
55535 112374 113874 113966 113164 113009 114254 115766 116307 116820 119351 123805 127676 129322 129725 130561 132384 135302
55519 135302 139491 144213 148214 152102 158435 168268 179582 190538 202384 217406 235676 255819 277632
55506B77632K4280K6818K9036L1764L4779L6125L4644L1001K5597J8012R117J124
55494E79929n505j2623k0753k7481l0933l2364l3613l4155l2592k9319k5795k2595
55482B72201j9870j8328j8125j7889j6367j4143j2328j0730q646o493n208m834
55470A19240m953n710p041p686o472m162k646k520k589j750l56M63J76p72j668
55455G1554k245k548k319j229Q1J72j229k434k057j096j214j863j207O28J654
55440E4648J356J430K709L807L604K823K064M46k382m759n225m616m365m157l059
55425D4324j790j848l091m054m209m261m448m115k947j388K07J666K318J424n53
55410A7235k097k361j930j639j493j162q56r64j265j310G85a436l634m023k254
$$ plain form
55506 277632 301912 328730 357766 389530 424309 460434 495078 526079 551676 569688 578805 579929
55494 579929 574424 561801 541048 513567 482634 450270 416657 382502 349910 320591 294796 272201
55482 272201 252331 234003 215878 197989 181622 167479 155151 144421 135775 129282 124074 119240
55470 119240 114287 108577 101536 93850 87378 83216 80570 78050 75461 73711 73355 73818 73994 73222 71554
55455 71554 69309 66761 64442 63213 63294 63466 62237 59803 57746 56650 55436 53573 52366 52994 54648
55440 54648 56004 57434 60143 63950 67554 70377 72441 72887 70505 65746 60521 55905 51540 47383 44324
55425 44324 42534 40686 37595 33541 29332 25071 20623 16508 13561 12173 12380 14046 16364 17788 17235
55410 17235 15138 12777 10847 9208 7715 6553 5697 4733 3468 2158 785 -1436 -5070 -9093 -11347
55395a1347P18K858L323a732b48l82j973j593Q93E3M012L375K592J473k69j302
55379I934l71J242J201m54j483q37K01L00m38j342j906j440L53K398L235K891
55363A3484K455K093J204J60J0N08M07k98l82K85M95l7k19L36P31O87J103K259
55345B5281L272L660L764L465K415J578K298L723L576J739N12Q18R35j98j277
55330E5561j346j485k400k926k405k162k985l473k561j448j302j205k23N88K49
55315C0477j58M91J155M91q41j680k352l202l085j444n0l97j181p31n2p69j826
55298A4846j249K41M60n66j136j121j568j925q65O18K60j604k336j175r4k42n02
55281B042j07J9o24B87b64f0F02J018J157O60K3J06L07o50A060a184p54K51j71
$$ plain form
55395 -11347 -10629 -7771 -4448 -1732 -248 -630 -2603 -4196 -3303 53 4065 7440 10032 11505 11236 9934
55379 9934 9563 10805 12006 11552 10069 9232 9433 9733 9295 7953 6047 4607 4960 7358 10593 13484
55363 13484 15939 18032 19236 19396 19406 19914 20321 20023 19641 19926 20421 20384 20165 20501 21232 21919 23022 25281
55345 25281 28553 32213 35977 39442 41857 43435 45733 49456 53032 54771 55283 56101 57036 56838 55561
55330 55561 54215 52730 50330 47404 44999 42837 39852 36379 33818 32370 31068 29863 29640 30228 30477
55315 30477 30319 30810 31965 32456 31615 29935 27583 24381 21296 19852 19802 19405 18224 17493 17441 16672 14846
55298 14846 13597 13838 14298 13732 12596 11475 9907 7982 7117 7735 7995 6391 4055 2880 2786 2544 2042
55281 2042 1935 1954 1330 287 -264 -60 602 1620 2777 3437 3460 3566 3873 3223 1060 -1184 -1938 -1687 -1858
55262a858n36L40d42A714K009J184p35A368a380r2A139L067K028J405J278O46
55246I563j97q9Q28J103n2j874l049k798j343J83P00M39N36J136J038k55j411
55229D458j145j81j12j104bj755r99l55o4J19O74f21B011K235Q30J02R44J922
55211H044J022j564l441A318oK570L086J365r48j833r39N8m03j697F66A71J026
55194A197J204L43l84o30H39d47j306p92l22l90o91o70k69K52Q00J213Q77n68
55176b313k261k735j571K10J475J887J421O3j586k365j846q93l14K08J219K336
55160g065K821a640C63J065k4n89l12K52P29J531K629K870J735O06Q20J488J055
55143A4218K4L1Q76R22J57K64J495K047J142L68R26J669J117k81j200j317r47
$$ plain form
55262 -1858 -2394 -2054 -442 1714 3723 4907 4172 1368 -1380 -1472 1139 4206 6234 7639 8917 9563
55246 9563 9366 9277 10105 11208 11156 9282 6233 3435 2092 2275 2975 3414 3950 5086 6124 5869 4458
55229 4458 3313 3132 3020 1916 -2 -1757 -2756 -3111 -3175 -3056 -2382 -621 2011 4246 5076 5178 6122 8044
55211 8044 9066 7502 4061 1318 1312 3882 6968 8333 7385 5552 4613 4671 4268 2571 666 171 1197
55194 1197 2401 2744 2360 1730 839 -447 -1753 -2545 -2867 -3257 -3948 -4618 -4887 -4635 -3835 -2622 -1745 -2313
55176 -2313 -4574 -7309 -8880 -8670 -7195 -5308 -3887 -3824 -5410 -7775 -9621 -10514 -10828 -10620 -9401 -7065
55160 -7065 -4244 -1640 363 1428 1404 815 503 755 1484 3015 5644 8514 10249 10855 11675 13163 14218
55143 14218 14242 14273 15149 16071 16228 16492 17987 20034 21176 21544 22470 24139 25256 24975 23775 22458 21511
55126B1511q1R39J004k20j377j177k08K02o6l35o07j229j699j194l7N58O6q90
55108A5160j534j619j260p34k40M24J498K406K129Q80J58M21K5k227m614m379
55092F494j507J269K003J278L73m12r11l06J633L451L354J310j002k100j850r43
55076A2134M4Q04J011L27j086k214j864N4K097K589J299m66j362j141l51N32J278
55059A3685J643J501J271J738L149M619M877L654J970R34N88K69k80p30q33o45
55043C7410k12L42N17L4l09O02K380L162K005K50l35J25K34l98q90q53r89j755
55025D1320k563k709k229j341N9J770K773K228O63n43p81o62r01j373j523j250
55009C2938r39q98j077j329j609j864j986j901j519o01Q77K124J908O9j720j517
$$ plain form
55126 21511 21430 22369 23373 23153 21776 20599 20391 20593 20527 20192 19585 18356 16657 15463 15426 15984 16050 15160
55108 15160 13626 12007 10747 10013 9773 10197 11695 14101 16230 17110 17268 17689 17714 15487 10873 6494
55092 6494 4987 6256 8259 9537 9910 9498 8587 8281 9914 13365 16719 18029 17027 14927 13077 12134
55076 12134 12178 12982 13993 14320 13234 11020 9156 9210 11307 13896 15195 14729 13367 12226 11875 12407 13685
55059 13685 15328 16829 18100 19838 22987 27606 32483 36137 38107 39041 39629 39898 39618 38888 38055 37410
55043 37410 37198 37540 38057 38091 37782 38384 40764 43926 45931 46181 45846 45971 46205 45807 44917 44064 43075 41320
55025 41320 38757 36048 33819 32478 32537 34307 37080 39308 39971 39428 38647 37985 37084 35711 34188 32938
55009 32938 31999 31101 30024 28695 27086 25222 23236 21335 19816 19215 20092 22216 24124 24193 22473 20956
54993B0956N60K394K409J273O26R03J265J124O61l9j149k160j850J03K232K900
54977C2208K248J641J564J271N27L38J394K824L308K798K364K691L584M511M844
54962F8115L923J746m24j172n87l8m01j325k174k581j986P3K789M290L676K006
54946G5930P26P8l49m32J65J199K035K217J447j41j299m40K148M039L560J726
54930I2609K58r12k498l511k345K53J628O86r81j626j285q36o72q17j121r21L13
54913G8222J776J932O25p05r64l92N60J803K751K400Q44o04j250j570j569k72
54897H3587K360M631N265M922M546L753K251J284J967L210L268K511K723M074
54883A30352M947M795N103O849Q713Q897P731P218Q433J0409J1640J1952J2299
$$ plain form
54993 20956 21516 23910 26319 27592 28218 29121 30386 31510 32171 32132 30983 28823 26973 27076 29308 32208
54977 32208 34456 36097 37661 38932 39459 39797 41191 44015 47323 50121 52485 55176 58760 63271 68115
54962 68115 72038 73784 73360 72188 71601 71563 71162 69837 67663 65082 63096 63169 65958 70248 73924 75930
54946 75930 76656 76734 76385 75953 76118 77317 79352 81569 83016 82875 81576 81136 83284 87323 90883 92609
54930 92609 92867 91955 89457 85946 83601 83854 85482 86168 85187 83561 82276 81440 80768 79951 78830 77909 78222
54913 78222 79998 81930 82555 81850 80886 80494 81054 82857 85608 88008 88852 88248 86998 85428 83859 83587
54897 83587 85947 90578 95843 100765 105311 109064 111315 112599 114566 117776 121044 123555 126278 130352
54883 130352 135299 140094 145197 152046 160759 169656 177387 184605 193038 203447 215087 227039 239338
54870B39338J3038J3052J1017P133L016j21k472m769p109r027j0252j1001j1705
54857B30138j2598j3288j2842j0906q655p721q109q157o873n211m429m226l492
54844A23631k086p39L02J408K447K659J847R75J270L054N547P657Q865R521J0232
54829A76590J1076J1537J1171J0087Q854Q110P933P290M666q3m963p863q925r825
54815B25655j1187j2157j2325j2262j1964j0649q590p286p080o373m226k033j331
54802A18192j474j061k94k74r67j536j889k282k076o08J243J923J348P75Q58J097
54786A12975R81M89l22j182j459j106j195k383l608l613l006l209m076m241l498
54771H1547k928k881k654k177k209k638k285q22N89R37L04r67k624l688k927o59
$$ plain form
54870 239338 252376 265428 276445 283578 286594 286473 284001 279232 272123 263096 252844 241843 230138
54857 230138 217540 204252 191410 180504 171849 164128 156019 147862 140989 135778 131349 127123 123631
54844 123631 121545 120806 121108 122516 124963 127622 129469 130444 131714 134768 140315 147972 156837 166358 176590
54829 176590 187666 199203 210374 220461 229315 237425 245358 252648 257314 257231 252268 244405 235480 225655
54815 225655 214468 202311 189986 177724 165760 155111 146521 139235 132155 125782 121556 119523 118192
54802 118192 116718 115657 115363 115089 114122 112586 110697 108415 106339 105731 106974 108897 110245 111020 111878 112975
54786 112975 113956 114445 114123 112941 111482 110376 109181 106798 103190 99577 96571 93362 89286 85045 81547
54771 81547 78619 75738 73084 70907 68698 66060 63775 62953 63542 64479 64783 63816 61192 57504 54577 53918
54755E3918J187J463R84Q39P86J64o44o33O10K650M590N362M356K247N32k7J9
54738G8403m5r8M57J928L968N427M974K779J293K888O811R861J0286R428R233
54723A47593R852J0377J0510J0444J0232J0248J1252J3245J5027J5646J5224J3882
54711B93532J1085P001L184P49j121l538n780o314n234m081l540k876j573p0J341
54696B82765L034N069O650P109O775O417O238N808M658K719L53j854l400m104
54682C28237m113l819l672l745l423j971M61K808M298N118N594N325L771J256
54668C36125j270l358n332p597j0146j2721j4862j5855j5189j3351j1736j1445
54656B13263j2195j2675j1930j0291q726p578o325m669l234k677k594k138j497
$$ plain form
54755 53918 55105 56568 57552 58391 59177 59341 58697 58064 58674 61324 65914 71276 75632 77879 78411 78384 78403
54738 78403 78358 78260 78717 80645 84613 90040 95014 97793 99086 101974 108785 118646 128932 138360 147593
54723 147593 157445 167822 178332 188776 199008 209256 220508 233753 248780 264426 279650 293532
54711 293532 304617 311618 314802 315551 314430 310892 305112 298798 293564 289483 285943 283067 281494 281424 282765
54696 282765 285799 290868 297518 304627 311402 317819 324057 329865 334523 337242 337595 335741 332341 328237
54682 328237 324124 320305 316633 312888 309465 307494 307955 310763 315061 320179 325773 331098 334869 336125
54668 336125 334855 331497 326165 318568 308422 295701 280839 264984 249795 236444 224708 213263
54656 213263 201068 188393 176463 166172 157446 149868 143543 138874 135640 132963 130369 128231 126734
54643A26734j700k885l734l293k352k197k534j789M93K567K410K05j755j676j50
54628A08344Q86O00NL50J614K890L504L363K807K730M002O034O668M645J651N79
54612A50672K065M099M922M736M418M106L591K869J796L10o68J00K130L360L090
54597A91596L136M941P096P473O548O609Q319J0182J1238J2255J3928J5679J6963
54584C15963J8272J9965K1213K1108K0026J8835J7320J4574J0659O711L119j166
54572D86599o860j2628j6262j7247j7089j7003j6611j5475j4552j4893j5602j4780
54560C07597j2318j0220r825j0182r689q205o653n485m566m031m284n344o727
54547B10068p831q050o976n039l477l172l674l889l391k754k752l614m766n125
$$ plain form
54643 126734 125034 122149 118415 115122 112770 110573 108039 106250 106743 109310 111720 111925 110170 108494 108344
54628 108344 109230 109830 109835 110185 111799 114689 118193 121556 124363 127093 131095 137129 143797 148442 150093 150672
54612 150672 152737 156836 161758 166494 170912 175018 178609 181478 183274 183584 182916 183016 185146 188506 191596
54597 191596 194732 199673 206769 214242 220790 227399 235718 245900 257138 269393 283321 299000 315963
54584 315963 334235 354200 375413 396521 416547 435382 452702 467276 477935 484646 487765 486599
54572 486599 479739 467111 450849 433602 416513 399510 382899 367424 352872 337979 322377 307597
54560 307597 295279 285059 275234 265052 255363 247158 240505 235020 230454 226423 222139 216795 210068
54547 210068 202237 194187 187211 182172 178695 175523 171849 167960 164569 161815 159063 155449 150683 145558
54533A45558l979j825l9M01m71k142l908m586l081J60L077M099L671L123K805
54518A42863K090O86r25k035k101r76O51J523J098J44l92n85j004j635j924j495
54502A35983k94J405K781K969K383K578M111N524N324L970K794K083J543J723
54488A74877L188M910N365M862M962N790N908M979M457N117N822N667N766P576
54474B49246J0569J2813J3230J2321J1053R885Q588O531L388j28k721l901m470
54461C26404n417o977q911j0827j1928j1339r368p540o762o248n058l870l986
54448B28173n101n450m302l005l063l981l899k008L51J109k57k144k391m06K265
54433A95891L535K818J430Q99J226J196M16J91J742M097N014M031L177L907M699
$$ plain form
54533 145558 141579 139754 139715 140116 139645 137503 133595 129009 125928 126088 129165 133264 136935 140058 142863
54518 142863 144953 145639 144714 142679 140578 139602 140253 141776 142874 143018 142626 142041 141037 139402 137478 135983
54502 135983 135689 137094 139875 142844 145227 147805 151916 157440 162764 166734 169528 171611 173154 174877
54488 174877 178065 182975 188340 193202 198164 203954 209862 214841 219298 224415 230237 235904 241670 249246
54474 249246 259815 272628 285858 298179 309232 319117 327705 334236 337624 337496 334775 330874 326404
54461 326404 320987 314010 305099 294272 282344 271005 261637 254097 247335 241087 236029 232159 228173
54448 228173 223072 217622 213320 210315 207252 203271 199372 197364 197715 198824 198567 196423 194032 193626 195891
54433 195891 199426 202244 203674 204573 205799 206995 207411 207602 209344 213441 218455 222486 225663 229570 234269
54418B34269L163k48k529k037k91O09P85J560K841L137J848K08l15M74J861L230
54402B48565M091L761K003j10q68P0J052L99j455k565k079j161j149j872k361
54387B46321k382k178j464J91K029K406O33k199m530n690n756m826l082j164J05
54372B18414L73r7q28j506k048k384k327j769j049q13j325k140k631k449j350
54357A96071P60L139M252L333J509M99N97Q83J036J523K041J368o05k013j146
54342B13247J380L572M530M965N511N645M507K193j10j163p93J1K09j20j57K38
54326B43665J17j087k466k603j375m2K97l83j570k876l944m302l814k906k045
54311B14666j301p38q32j754k533j819K71J993K135J526J611K236K055Q21j43
$$ plain form
54418 234269 237432 237184 234655 232618 232327 232936 233721 235281 238122 241259 243107 243315 243000 243474 245335 248565
54402 248565 252656 256417 258420 258310 257442 257512 258564 258963 257508 254943 252864 251703 250554 248682 246321
54387 246321 243939 241761 240297 240488 242517 244923 245556 243357 238827 233137 227381 222555 219473 218309 218414
54372 218414 218787 218690 217862 216356 214308 211924 209597 207828 206779 205966 204641 202501 199870 197421 196071
54357 196071 196831 199970 204222 207555 209064 209563 210160 211043 212079 213602 215643 217011 216406 214393 213247
54342 213247 214627 218199 222729 227694 233205 238850 243357 245550 245440 244277 243484 243495 243704 243584 243427 243665
54326 243665 243782 242695 240229 237626 236251 236209 236506 236123 234553 231677 227733 223431 219617 216711 214666
54311 214666 213365 212627 211795 210041 207508 205689 205960 207953 210088 211614 213225 215461 217516 218337 218194
54296B18194J0N11M02l9r1J65L44P18J626K432K273J429Q94P87K95q63k008k611
54278B24468k863k962k755k314k111k298k541k856l844n598o989o807n278l842
54264A71410l334k943j440Q84K108R40j466k772k293j548j894k935l664l964l984
54249A43105l311j979j362k561m475n075m110l005k450j768o31K10J92n04j676
54234A10600l121l870k985j209l47p49j059o54n22j188j645j265j006j630k286
54219H7064k054j532j529j546r00k26l27n25J27Q34kk164l629l149j454J17R22
54202G0027R01L15j60J07R08J486J625J859K521L069K576P62j351j950j95K412
54186H4912L321J826j83q06j90O61J673K949L314J600j186k767k608k329k932
$$ plain form
54296 218194 218204 218715 219117 219078 218987 219152 219496 220214 221840 224272 226545 227974 228868 229655 229950 229087 227079 224468
54278 224468 221605 218643 215888 213574 211463 209165 206624 203768 199924 194326 187337 180530 175252 171410
54264 171410 168076 165133 163693 164577 166685 167625 166159 163387 161094 159546 157652 154717 151053 147089 143105
54249 143105 139794 137815 136453 133892 129417 124342 120232 117227 114777 113009 112378 112588 112780 112276 110600
54234 110600 107479 103609 100624 99415 99068 98319 97260 96606 96084 94896 93251 91986 90980 89350 87064
54219 87064 85010 83478 81949 80403 79503 79277 78950 78425 78552 79386 79384 77220 73591 70442 68988 69105 70027
54202 70027 70928 71243 71083 71190 72098 73584 75209 77068 79589 82658 85234 85996 84645 82695 82500 84912
54186 84912 88233 90059 89876 89070 88880 89541 91214 94163 97477 99077 97891 95124 92516 90187 87255
54171H7255l340k223l5J574J546K6k042l319k729m64J975L136K971K453K114J482
54155I0380j8j955l122k935k203k112k697k981k446j606j038p63p81j316k064
54140F2343k130j364q14j182j668j190m1P07P73P32R84J477J963J818M30j530
54124F1308k191r39L22k66j697j624P7J366J228O28K41n12j637j871o99M41jj750
54106E2424l401m014l484k251j239j153j335l29J989L973M399L878L405K831J726
54091E7419O83N52J029J069L27p39j604j903j418n42k01o03p15L06J805K600K624
54074F0689K544K377J572K82o02o31j62L93R10J145P84m2q54j359j367m83J262
54057F6458K643K112k49k478k794j342M30J499J819J705J341R04O64P61J019J068
$$ plain form
54171 87255 83915 81692 81657 83231 84777 84803 82761 79442 76713 76249 78224 81360 84331 86784 88898 90380
54155 90380 90362 88407 85285 82350 80147 78035 75338 72357 69911 68305 67267 66504 65723 64407 62343
54140 62343 60213 58849 58035 56853 55185 53995 53954 54661 55434 56166 57150 58627 60590 62408 62838 61308
54124 61308 59117 58178 58500 58234 56537 54913 54990 56356 57584 58212 58453 57941 56304 54433 53734 54175 54174 52424
54106 52424 49023 45009 41525 39274 38035 36882 35547 35218 37207 41180 45579 49457 52862 55693 57419
54091 57419 58102 58654 59683 60752 61079 60340 58736 56833 55415 54873 54672 54069 53354 53660 55465 58065 60689
54074 60689 63233 65610 67182 67464 66862 66231 66069 66462 67372 68517 69301 69259 68405 67046 65679 65196 66458
54057 66458 69101 71213 70964 68486 65692 64350 64780 66279 68098 69803 71144 72048 72712 73473 74492 75560
54041G5560N92m92j921l183l769l468k536j555j026r31p42K1J278K474L209L561
54025F7072L682L253J788m01j990j928p02K79M52N16Q98Q85l1r26n95N22Q89J35
54007G3798n34l10K16N32J268K830M009L349J360N6K69P08O9j035j064R8Q66J27
53989H6612j214j391o0J347J549Q69N29R93J745K240K424K398K209K002J894J780
53973A05926J690K087L159M069L865L120L519N528P547P904O896O058O193O874
53959A74435P399P309O339M676L200K787L428M435N299N815N646M599L250K462
53945B41079K184J521K60n05P0J023N10j804m169m931m445m177m493m513l963
53930B13647l835m668n386m932m062m111m601l822j792p26j868l501l237j188
$$ plain form
54041 75560 76152 75660 73739 70556 66787 63319 60783 59228 58202 57271 56529 56550 57828 60302 63511 67072
54025 67072 70754 74007 75795 75394 73404 71476 70774 71053 71505 72021 72919 73804 73773 72847 72252 72774 73663 73798
54007 73798 73264 72954 73170 73702 74970 77800 81809 85158 86518 86574 86843 87551 87620 86585 85521 85619 86485 86612
53989 86612 85398 84007 83947 85294 86843 87712 88241 89234 90979 93219 95643 98041 100250 102252 104146 105926
53973 105926 107616 109703 112862 116931 120796 123916 127435 132963 140510 148414 155310 161368 167561 174435
53959 174435 181834 189143 195482 200158 203358 206145 209573 214008 219307 225122 230768 235367 238617 241079
53945 241079 243263 244784 245044 244539 244609 245632 246142 244338 240169 235238 230793 226616 222123 217610 213647
53930 213647 209812 205144 199758 194826 190764 186653 182052 178230 176438 175712 173844 170343 167106 165918
53916A65918N08N33n17j547k105k149j732j241j232j824k614l135l066k216q66
53901A42715L1k93j359j753o17J521L282L449J705q72k212r24K163M712N242M302
53885A61092L194K398J705J193J244J850K652L624N011O451O826N562L613K531
53871B08946K708L239L463L794M646N451N509N214N414N791N080K934N42q90j257
53856B60584q80K11J691K628K584K337K827L900M917N802O609O738N756M612M753
53841C15069O172P471P835P789P893P856P254O234N075L822K627J756J042N7r41
53826C87011j072k26L96k58j847l331m283m881n182n150n033n093n199n278n746
53811C34828o850p929q148p756p702q007p464n462l315k971m639o377o237m379
$$ plain form
53916 165918 166426 166959 166442 164895 162790 160641 158909 157668 156436 154612 151998 148863 145797 143581 142715
53901 142715 142746 142453 141094 139341 138724 140245 143527 146976 148681 147809 145597 144673 146836 151548 156790 161092
53885 161092 164286 166684 168389 169582 170826 172676 175328 178952 183963 190414 197240 202802 206415 208946
53871 208946 211654 214893 218356 222150 226796 232247 237756 242970 248384 254175 259255 262189 262731 261841 260584
53856 260584 259704 259915 261606 264234 266818 269155 271982 275882 280799 286601 293210 299948 305704 310316 315069
53841 315069 321241 328712 336547 344336 352229 360085 367339 373573 378648 382470 385097 386853 387895 387952 387011
53826 387011 385939 385713 386109 385851 384004 380673 376390 371509 366327 361177 356144 351051 345852 340574 334828
53811 334828 327978 320049 311901 304145 296443 288436 280972 275510 272195 269224 264585 258208 251971 247592
53797B47592k691k579l604m399m416m336m876n761o020n064l320k036k325m085
53783A92080n793n873m278k343j067l28P4l21j514k126r00J263K110J018j76J99
53767A72025J420J605K66j422k379k532k142j312l97k8k93m97r3N82Q14M50l3
53750A66034p5O12J897L149L543K887K025K080L341M944N567M436K003j63n93
53735B01687O10J900K200K120K793M088M910M858M496M076L304K602L215N282
53721B48141O875O033L256R41O66J907L209L610K957J745Q63Q42J114N66j030
53706B81695k660l209k383n32J521K296M55l323o165n890l671k569l578m654l945
53691B43388k404k063k903l022j560J84O97J0r68j738k167k068j729k068l333
$$ plain form
53797 247592 244901 242322 238718 234319 229903 225567 220691 214930 208910 203846 200526 198490 196165 192080
53783 192080 186287 180414 176136 173793 172726 172398 172472 172151 170637 168511 167611 168874 170984 172002 171826 172025
53767 172025 173445 175050 175316 173894 171515 168983 166841 165529 165132 165104 164811 164314 164221 164803 165617 166067 166034
53750 166034 165959 166571 168468 171617 175160 178047 180072 182152 185493 190437 196004 200440 202443 202280 201687
53735 201687 202297 204197 206397 208517 211310 215398 220308 225166 229662 233738 237042 239644 242859 248141
53721 248141 255016 261049 264305 265246 265912 267819 271028 274638 277595 279340 280203 281045 282159 282725 281695
53706 281695 279035 275826 273443 272911 274432 276728 277183 273860 267695 261805 258134 255565 251987 247333 243388
53691 243388 240984 238921 236018 232996 231436 231620 232317 232327 231359 229621 227454 225386 223657 221589 218256
53676B18256m252l570k042j663k992m437m407k942j018P20J834J713K84j411k186
53661A91887k009j675j415o37Q39J953J335r97l195l251j219P87J126N83R30K203
53645A87245K775K080J472J869K243J590R12J644L083L300K118J224J397J547
53631B14499R57P39K089M282N509N084L947L367L829M925N766N668M758L810L315
53616B72544L072K683K020J108K63L77K198M921O292M962K136J74M5R74K067L098
53600C08934L781L446K035O42M51J411K352K190Q23q11j369j08K241L822L323
53585C33163J317l90p45m63r52k536m064m197k816j036K9L24N26R15R38Q8j203
53568C18898j988k000j800j814j838j618j237n83P42K432L143K155Q11J091K976
$$ plain form
53676 218256 214004 210434 208392 206729 203737 199300 194893 191951 190933 191653 193487 195200 195484 194073 191887
53661 191887 189878 188203 186788 186151 186990 188943 190278 189281 186086 182835 181616 182403 183529 184112 185042 187245
53645 187245 190020 192100 193572 195441 197684 199274 200186 201830 204913 208213 210331 211555 212952 214499
53631 214499 215456 216195 218284 222566 228075 233159 237106 240473 244302 249227 254993 260661 265419 269229 272544
53616 272544 275616 278299 280319 281427 281690 282067 284265 289186 295478 300440 302576 302750 302795 303769 305836 308934
53600 308934 312715 316161 318196 318838 319289 320700 323052 325242 326065 325254 323885 323777 326018 329840 333163
53585 333163 334480 334090 333345 332882 331930 329394 325330 321133 318317 317281 317310 317634 318160 319075 320013 320101 318898
53568 318898 316910 314910 313110 311296 309458 307840 306603 306020 306762 309194 312337 314492 315303 316394 319370
53553C19370M546M687M257M206M095L384K929L858N693O892O873O284N585M689
53539C87348L990M458O101P442P159N775M999N608O598O592N642N162O007P163
53525D70044O975N391M107M316N321N818N588N183M771M308M120M273L878K189
53511E36282k1j349j663j813j795q07Q57J684J160N08O67R05K31r99j853k173
53495E29821k193j696n63M48N01k53j147j988k699k563q96J746L900M642M130
53480E31190L155K760L797N925P294O303L617J648J994M088O304P599P987Q146
53466F01807Q859J0396J2179J3428J4069J4610J5357J6230J7325J8920K0822K2338
53454G86340K3055K3290K3640K4526K6082K8001K9577L0522L1665L3968L6857
$$ plain form
53553 319370 323916 328603 332860 337066 341161 344545 347474 351332 357025 363917 370790 377074 382659 387348
53539 387348 391338 395796 401897 409339 416498 422273 427272 432880 439478 446070 451712 456874 462881 470044
53525 470044 477019 482410 486517 490833 496154 501972 507560 512743 517514 521822 525942 530215 534093 536282
53511 536282 536261 534912 533249 531436 529641 528834 529691 531375 532535 533043 533710 534615 534846 533847 531994 529821
53495 529821 527628 525932 525369 525817 526318 526065 524918 522930 520231 517668 516772 518518 522418 527060 531190
53480 531190 534345 537105 540902 546827 554121 560424 564041 565689 567683 571771 578075 585674 593661 601807
53466 601807 610666 621062 633241 646669 660738 675348 690705 706935 724260 743180 764002 786340
53454 786340 809395 832685 856325 880851 906933 934934 964511 995033 1026698 1060666 1097523
53443A097523L8605L8793L9303M2051M6556N0666N3021N3660N2842N0824M8915
53432A612759M9105N1843N5164N6858N6846N6599N6971N7691N8667O0378O2762
53421B235643O4767O5516O5374O5373O6025O6967O7385O6498O4114O0907N7751
53410B946320N4643N0851M6312M2046L8774L6036L3321L1147L0166K9897K9465
53399C368978K8949K8745K8104K5828K2184J8522J5061J0656N066l05m616q898
53387C538274j4206j9850k4650k8822l3169l7257l9946m1358m2873m5251m8008
53376C162884n0614n3195n5825n7979n8998n8635n7136n5230n3839n3220n2554
53365B555659n1026m9003m7414m6136m4013m0466l6147l1766k7156k1899j6229
$$ plain form
53443 1097523 1136128 1174921 1214224 1256275 1302831 1353497 1406518 1460178 1513020 1563844 1612759
53432 1612759 1661864 1713707 1768871 1825729 1882575 1939174 1996145 2053836 2112503 2172881 2235643
53421 2235643 2300410 2365926 2431300 2496673 2562698 2629665 2697050 2763548 2827662 2888569 2946320
53410 2946320 3000963 3051814 3098126 3140172 3178946 3214982 3248303 3279450 3309616 3339513 3368978
53399 3368978 3397927 3426672 3454776 3480604 3502788 3521310 3536371 3547027 3552093 3551788 3547172 3538274
53387 3538274 3524068 3504218 3479568 3450746 3417577 3380320 3340374 3299016 3256143 3210892 3162884
53376 3162884 3112270 3059075 3003250 2945271 2886273 2827638 2770502 2715272 2661433 2608213 2555659
53365 2555659 2504633 2455630 2408216 2362080 2318067 2277601 2241454 2209688 2182532 2160633 2144404
53354B144404j0810o006j614K881Q010J3847J9772K5007K9543L4121L9218M4460
53342B342833M9131N2877N5788N8255O0935O4348O8268P1878P4767P7482Q0809
53331C057371Q4831Q8969R2791R6406J00274J04779J09981J15521J20868J25648
53321D097439J29721J32913J35013J36124J36902J38128J39995J41804J42426
53312E330465J41194J38467J35210J31962J28320J23621J17857J11540J04852
53303F463488R7528Q9753Q2610P7144P3128O9162O4059N7974N2009M6642M0791
53292G214288L2658K1566Q616m795j8886l5334n5050p6516r6644j13193j26097
53281F750613j36489j44985j51283j55244j57760j60093j62607j64516j64804
$$ plain form
53354 2144404 2133594 2127588 2125974 2128855 2136865 2150712 2170484 2195491 2225034 2259155 2298373 2342833
53342 2342833 2391964 2444841 2500629 2558884 2619819 2684167 2752435 2824313 2899080 2976562 3057371
53331 3057371 3142202 3231171 3323962 3420368 3520642 3625421 3735402 3850923 3971791 4097439
53321 4097439 4227160 4360073 4495086 4631210 4768112 4906240 5046235 5188039 5330465
53312 5330465 5471659 5610126 5745336 5877298 6005618 6129239 6247096 6358636 6463488
53303 6463488 6561016 6650769 6733379 6810523 6883651 6952813 7016872 7074846 7126855 7173497 7214288
53292 7214288 7246946 7268512 7277128 7272333 7253447 7218113 7163063 7086547 6989903 6876710 6750613
53281 6750613 6614124 6469139 6317856 6162612 6004852 5844759 5682152 5517636 5352832
53272E352832j63159j60192j57269j55925j56705j58252j58221j55454j50841
53263C936814j45756j40411j34344j27879j22049j17190j12475j06917j00143
53254B829650r2103q2817p2884o3750n6661n1290m5819l8791l0815k4026j9719
53243B250975j6899j3633r424n455k642m72K015N163R035J3678J8280K1098K1416
53230B293135K0963K2207K5636K9869L3936L8047M2224M5689M7937M9454N1045
53219B700142N3231N6263N9725O2217O2587O1584O1088O1544O1560O0269N8497
53208C358707N6877N4523N0802M7096M5163M4606M3592M1611L9860L8947L7738
53197C859522L4819K9987K3889J7099R957K723m674j2556k1033l0009l9652n0195
$$ plain form
53272 5352832 5189673 5029481 4872212 4716287 4559582 4401330 4243109 4087655 3936814
53263 3936814 3791058 3650647 3516303 3388424 3266375 3149185 3036710 2929793 2829650
53254 2829650 2737547 2654730 2581846 2518096 2461435 2410145 2364326 2325535 2294720 2270694 2250975
53243 2250975 2234076 2220443 2211019 2205564 2202922 2202450 2204465 2209628 2218663 2232341 2250621 2271719 2293135
53230 2293135 2314098 2336305 2361941 2391810 2425746 2463793 2506017 2551706 2599643 2649097 2700142
53219 2700142 2753373 2809636 2869361 2931578 2994165 3055749 3116837 3178381 3239941 3300210 3358707
53208 3358707 3415584 3470107 3520909 3568005 3613168 3657774 3701366 3742977 3782837 3821784 3859522
53197 3859522 3894341 3924328 3948217 3965316 3975273 3977996 3973322 3960766 3939733 3909724 3870072 3819877
53185C819877o1011p0568p7756q2922q7109r0729r3492r5369r6837r8054r8337
53174B867693r6902r3784q9777q5791q2639q1056q1150q1866q1750q0667p9990
53163A932321q0700q1935q2119q0932p9207p7357p4964p1761o7895o3140n7016
53152A115295n0012m3716l9207l6179l3903l2135l0642k8811k6539k4725k4056
53141G45370k3857k2932k1074j9002j7280j5998j5132j4588j4086j3570j3245
53130E54606j2972j2318j1605j1877j3106j3613j2405j0909j0757j0988r604p263
53118D17189o742q611j0101r246p690p777q816q354o022l857l224l329k966k174
53104C28280j751k192l447n007o025n951n208m665m470m038l131k229j770j796
$$ plain form
53185 3819877 3758866 3688298 3610542 3527620 3440511 3349782 3256290 3160921 3064084 2966030 2867693
53174 2867693 2770791 2677007 2587230 2501439 2418800 2337744 2256594 2174728 2092978 2012311 1932321
53163 1932321 1851621 1769686 1687567 1606635 1527428 1450071 1375107 1303346 1235451 1172311 1115295
53152 1115295 1065283 1021567 982360 946181 912278 880143 849501 820690 794151 769426 745370
53141 745370 721513 698581 677507 658505 641225 625227 610095 595507 581421 567851 554606
53130 554606 541634 529316 517711 505834 492728 479115 466710 455801 445044 434056 424452 417189
53118 417189 410447 401836 391735 382489 374799 367022 358206 349852 343830 339973 336749 333420 330454 328280
53104 328280 326529 324337 320890 315883 309858 303907 298699 294034 289564 285526 282395 280166 278396 276600
53090B76600k395l617m696m307k287l69l76k041l347k980j598o21n12o80o54o73
53074B45447j028j366j172p21r29k045l059k971k178j849k154k090j212m48o01
53059B21624r12p1J858L453L704K876J641L44o76r01k53N58O98j6j118j945j976
53042B28888j264o48r68j969k526k237j979k552l473l768l281k429j368k42J88
53027B00372o57j953k211j248l58m61j074j432j496j384p75M29J581K178K652
53012A94163L580M540M568L480K008Q12R3k2O05J608K180J815P44m06j106j198
52996B17464r91j094j788k570k708k235j918k130k309j874j315j749l338m777
52982A86668m750l624l070l868m802m248k361q66q08j534k081k482l119l622l422
$$ plain form
53090 276600 274205 270588 265892 261585 259298 258929 258553 256512 253165 250185 248587 247966 247454 246774 246120 245447
53074 245447 244419 243053 241881 241160 240231 238186 235127 232156 229978 228129 225975 223885 222673 222225 221624
53059 221624 220712 220641 222499 225952 229656 232532 234173 234517 233841 232940 232687 233245 233943 233927 232809 230864 228888
53042 228888 227624 226976 226008 224039 221513 219276 217297 214745 211272 207504 204223 201794 200426 200184 200372
53027 200372 199715 197762 195551 194303 193945 193484 192410 190978 189482 188098 187323 187752 189333 191511 194163
53012 194163 197743 202283 206851 210331 212339 213151 213244 213222 213827 215435 217615 219430 220174 219768 218662 217464
52996 217464 216473 215379 213591 211021 208313 206078 204160 202030 199721 197847 196532 194783 191445 186668
52982 186668 181918 178294 175224 171356 166554 162306 159945 159079 158271 156737 154656 152174 149055 145433 142011
52967A42011k906k974l513l370k058o13k85r27j307p69q4m84k171l996m675m130
52951A07749l336k963k632j741m79N09J082J519J691J153R1p09j056j753l113
52936I6012l892k647P4J926J477r4n47O43J858J578J96q11r04q17j047r39K27
52919I2293J880K587J759L13m76l41n4k98q00o92L68J573J715N60q21j158k27
52902I8181J117J832J360j76j938k747k043m96P23J212J520K069K396J737L6j816
52886A02967k703k259j152l59n1N19J769K895K823J745Q56O43K78r10k166k226
52870A02669r32O68J631J976K281K856L452L633L390L339L978M804M681L295J672
52855A43393Q86Q20P73O90Q99J008J71j490k876l489l952m516m234k681j429k324
$$ plain form
52967 142011 139105 136131 132618 129248 127190 126577 126292 125365 124058 123289 123205 122721 120550 116554 111879 107749
52951 107749 104413 101450 98818 97077 96598 97107 98189 99708 101399 102552 102643 101934 100878 99125 96012
52936 96012 92120 89473 89547 91473 92950 92856 92309 92952 94810 96388 96584 95773 94869 94052 93005 92066 92293
52919 92293 94173 96760 98519 98832 98356 98015 97961 97663 96863 96171 96539 98112 99827 100387 99566 98408 98181
52902 98181 99298 101130 102490 102314 100376 97629 95586 95090 95813 97025 98545 100614 103010 104747 104783 102967
52886 102967 100264 98005 96853 96494 96443 96962 98731 101626 104449 106194 107050 107693 107971 107061 104895 102669
52870 102669 101737 102405 104036 106012 108293 111149 114601 118234 121624 124963 128941 133745 138426 141721 143393
52855 143393 144279 145099 145872 146562 147461 148469 148640 147150 144274 140785 136833 132317 128083 125402 123973 121649
52839A21649m581n430l909k299k891m638m580j931J061K256J950J463R33l28k021
52824I6704k875k292r39L29J235J618J178K15j61O71J668J062j432l872l940j379
52808H7790J656K692J297p68j601j053l97n54j140j285q10k81j71l71m52j88K03
52791H4567K88o8l94q0P84J350J051M14M13J129J598J176O08J246L304N396N976
52774A08758M933L401K178Q87j165l742n662n912m391j755J038L027L624K997
52760A08216J903J068Q49J330K144K218M91k564m766m425k386j001j196j644r66
52745I9271L97J177J135R49Q09M53L75J638M071N796N334L464K100J850J583L55
52729A30757j275k088j693p73j86j62k78q2K50j1j184k559l156k940k718k851
$$ plain form
52839 121649 117068 111638 107729 105430 102539 97901 93321 91390 92451 94707 96657 98120 99053 98725 96704
52824 96704 93829 91537 90598 90927 92162 93780 94958 95173 95012 95683 97351 98413 96981 93109 89169 87790
52808 87790 89446 92138 93435 92667 91066 90013 89616 89062 87922 86637 85827 85546 85375 85004 84552 84364 84567
52791 84567 84855 84787 84393 84313 85097 86447 87498 87912 88325 89454 91052 92228 92836 94082 97386 102782 108758
52774 108758 113691 117092 119270 120157 118992 115250 109588 103676 99285 97530 98568 101595 105219 108216
52760 108216 110119 111187 112036 113366 115510 117728 118219 115655 110889 106464 104078 103077 101881 100237 99271
52745 99271 99668 100845 101980 102929 103738 104191 104566 106204 110275 116071 121405 124869 126969 128819 130402 130757
52729 130757 129482 127394 125701 124928 124742 124580 124302 124220 124470 124459 123275 120716 117560 114620 111902 109051
52713A09051k873k511k231k292k099j276o71j306k587k758j223O68J452J238R49
52698I1531P31P5q90j363j170j117j672k050j333J6N98p5j052j372j253j364j644
52681G6596j569j178r90r86n24N64J497J499P26n0k93M1O82J185J186P78L95K05
52663G9764p9o25j178j421j302q40j61L00K12J79J152K694K877P60j956k818j575
52646G5983q1L28Q2J47Q00J715K327J947M53j047j175l3Q27L98o67j144o21M54
52628H0693J374J534Q60j9n98j392k968m269l402m26K249K934K670L097L844L499
52612H9680K120R20J04j065k314k265o30J068J528J235J287J773J929J382N03
52597I7255p2J47J150K254K629K213J648J176L10j015j743p95J534L844N008M664
$$ plain form
52713 109051 106178 103667 101436 99144 97045 95769 95098 93792 91205 88447 87224 87892 89344 90582 91531
52698 91531 92262 92337 91447 90084 88914 87797 86125 84075 82742 82758 83356 83281 82229 80857 79604 78240 76596
52681 76596 75027 73849 72859 71873 71349 71913 73410 74909 75635 75585 75292 75333 76015 77200 78386 79164 79559 79764
52663 79764 79685 79060 77882 76461 75159 74319 74158 74458 74670 74849 76001 78695 81572 82332 80376 77558 75983
52646 75983 75902 76230 76312 76459 77259 78974 81301 83248 83701 82654 81479 81446 82273 82671 82004 80860 80239 80693
52628 80693 82067 83601 84461 84442 83844 82452 79484 75215 71813 71387 73636 76570 79240 82337 86181 89680
52612 89680 91800 92720 92824 91759 89445 87180 86550 87618 89146 90381 91668 93441 95370 96752 97255
52597 97255 97183 97330 98480 100734 103363 105576 107224 108400 108710 107695 105952 105157 106691 110535 115543 120207
52581A20207K859Q6k381l140k068n99k21j022j990k284j843j078m27j48l0N98
52565A06519K034L427L474K096P70P23J339J042o02k398l052k518j728j552k111
52550A07463k752k740k344k858m762o272n060j488J385J625P77J268K767K920
52536H9929J042r62j354n53K29Q13J555K073J658N40l22o19j046k078l005k580
52520H5320n34J858K862J864j49j636j759p59M68R23J95r45j054K94J789J976
52504I0713J139O00N44r9j513k289j500j80K89J90P16J927K803K920K728K264
52488A01252J011p48j668j004L44J081J046R35J054J134J039J019J256J654K053
52473A11458K332K313J778O99n96j471j319j72J127J738J735J821K114J946J028
$$ plain form
52581 120207 123066 123152 120771 117631 115563 114964 114743 113721 111731 109447 107604 106526 106099 105951 105921 106519
52565 106519 108553 111980 115454 117550 118320 119043 120382 121424 120822 118424 115372 112854 111126 109574 107463
52550 107463 104711 101971 99627 96769 92007 85735 80675 79187 80572 82197 82974 84242 87009 89929
52536 89929 90971 90009 88655 88102 88331 89144 90699 92772 94430 94970 94648 94029 92983 90905 87900 85320
52520 85320 84786 86644 89506 91370 91221 89585 87826 87067 87535 88458 88653 87708 86654 86948 88737 90713
52504 90713 91852 92452 92996 92897 91384 89095 87595 87415 87704 87894 88610 90537 93340 96260 98988 101252
52488 101252 102263 101515 99847 98843 99187 100268 101314 102249 103303 104437 105476 106495 107751 109405 111458
52473 111458 113790 116103 117881 118580 117984 116513 115194 115022 116149 117887 119622 121443 123557 125503 126531
52458A26531M1m16p43j593k706l264k955j980m26J479K797K544R05r40k010j897
52442A15367m18J823K960J455j625l520l275k670l156l711k898j337m23R0J255
52427I9917K559K441Q62o10j175j439j596r74K68P77J05m19J91J035Q92J59mM41
52409A03430O28L45K56Q25J794K516K296R09o90q27R08K715K489K61k048k926
52393A12881k458j520p83m80l49J46J009J400P30j94l0J252K288K104J056p6r60
52376A16016j287n48J126K489K451J548J298K080K457J006j718l753m005l144
52362A16016k181j126L02J435J370N53M03J248J761Q95o85j669j723j481j571
52347A13547k223l101l128j318J560L246K623J202J038K139L073L150K621J537
$$ plain form
52458 126531 126572 126156 125413 123820 121114 117850 114895 112915 112489 113968 116765 119309 120214 119274 117264 115367
52442 115367 114949 116772 119732 121187 119562 116042 112767 110097 106941 103230 100332 98995 98572 98662 99917
52427 99917 102476 104917 105779 105169 103994 102555 100959 99985 100253 101030 101135 100716 100907 101942 102834 102993 102989 103430
52409 103430 104058 104403 104659 105484 107278 109794 112090 112999 112309 111482 112390 115105 117594 117855 115807 112881
52393 112881 110423 108903 108120 107640 107291 107437 108446 109846 110576 110382 110352 111604 113892 115996 117052 116976 116016
52376 116016 114729 114181 115307 117796 120247 121795 123093 125173 127630 128636 126918 123165 119160 116016
52362 116016 113835 112709 113011 114446 115816 116369 116772 118020 119781 120676 119991 118322 116599 115118 113547
52347 113547 111324 108223 105095 103777 105337 108583 111206 112408 113446 115585 118658 121808 124429 125966
52333A25966L6p83p5J024O57q51j387m58j20j797m034m620l452j972q60L16J743
52316A09333L010L893M550M972M914M236K899R66j034k070j555m6J299J774J369
52301A38510M50m25o33LJ046J964K562K799K539J786Q58J42j06L12J342K409K915
52284A58473L058L461L960L551J896Kj027j171r65n95k41n53j788k964k820j558
52268A60719o68j066k070k385j513L9J507K425K661K256J432P03N90R95J254J090
52252A67969J110J774K339J771M59j56M25J394K320L678N170N313L680K156K548
52237B01950M011M426L505K755K923L206K981K642K423J894J072Q97J993L730
52223B40408N002N248M502L143J918J581K167K971L386L271K622J608R09J136
$$ plain form
52333 125966 126002 125219 125144 126168 126825 125974 124587 124129 124009 122212 118178 113558 110106 108134 107274 107590 109333
52316 109333 112343 116236 120786 125758 130672 134908 137807 138773 137739 135669 134114 134068 135367 137141 138510
52301 138510 138960 138535 137902 137905 138951 140915 143477 146276 148815 150601 151459 151601 151495 151807 153149 155558 158473
52284 158473 161531 164992 168952 172503 174399 174401 173374 172203 171238 170643 170402 169849 168061 165097 162277 160719
52268 160719 160051 158985 156915 154530 153017 153056 154563 156988 159649 161905 163337 164040 164630 165625 166879 167969
52252 167969 169079 170853 173192 174963 175422 175266 175691 177085 179405 183083 188253 193566 197246 199402 201950
52237 201950 205961 210387 213892 216647 219570 222776 225757 228399 230822 232716 233788 234685 236678 240408
52223 240408 245410 250658 255160 258303 260221 261802 263969 266940 270326 273597 276219 277827 278736 279872
52209B79872J831J946J440J439K388L205K907K109J961K323K194J575J629K898
52195C09717M337M592L612K428J740J331Q44O04J258K794M320M932M505L519K508
52180C53041J999K537M130N744O025M702K796J461J090J530K441L163K987K063
52166C95709J573K451M222N630O089N964N639N018L959K689J666J297J766K682
52152D46354L130K726K557M184P331R412Q311N097K987L579N201N268L401J422
52138E10960R26J848L381N231P391R237R627Q096N568L609L034L361L520K916
52124E78705J744O60L37J069K361L099K668J793J636K098J893N46o66l95R68J998
52108F00514K004J241k8j509k343j844o94k31o89j101r11m80j29Q3k65j475k604
$$ plain form
52209 279872 281703 283649 285089 286528 288916 292121 295028 297137 299098 301421 303615 305190 306819 309717
52195 309717 314054 318646 322258 324686 326426 327757 328601 329205 330463 333257 337577 342509 347014 350533 353041
52180 353041 355040 357577 361707 367451 373476 378178 380974 382435 383525 385055 387496 390659 393646 395709
52166 395709 397282 399733 403955 409585 415674 421638 427277 432295 436254 438943 440609 441906 443672 446354
52152 446354 449484 452210 454767 458951 466282 475694 484005 489102 492089 495668 500869 506137 509538 510960
52138 510960 511886 513734 517115 522346 529737 538974 548601 556697 562265 565874 568908 572269 575789 578705
52124 578705 580449 581109 581446 582515 584876 587975 590643 592436 594072 596170 598063 598609 597943 597548 598516 600514
52108 600514 602518 603759 603731 602222 599879 598035 597341 597110 596421 595320 594409 593929 593800 593883 593618 592143 589539
52091E89539k387j292j028j673j504j68J80j712l791l497j402N2J43l4k09j236
52075E69981l044m392m743m670m315l212j804j426k388l438l501k816k093j728
52061E26411k011k875l319k327o38j93j457k702k523j715j767k602k948k338j733
52046D95263k208l552m281l051k88J904J962O21k18J44R35J512J835J655P19j62
52030D92790J67J307J677J024Q75K063L498M066M085M098L845L391L651M662M878
52015E36077L490K065K349L773M699M915N152N117M070K746K585L348L314J954
52001E85654O31M38Q65J102J369K308L826N091N309M385L095K502K739K810K073
51986F24197J291J469K224K434J982J646J475O57r02k041j746l42R43R98n14k825
$$ plain form
52091 589539 587152 585860 584832 583159 581655 581487 581667 579955 576164 572667 571265 571317 571460 571426 571217 569981
52075 569981 566937 562545 557802 553132 548817 545605 543801 542375 539987 536549 533048 530232 528139 526411
52061 526411 524400 521525 518206 515879 515241 515048 513591 510889 508366 506651 504884 502282 499334 496996 495263
52046 495263 493055 489503 485222 482171 481883 483787 485749 486370 486152 486296 487231 488743 490578 492233 492952 492790
52030 492790 492957 494264 495941 496965 497840 499903 503401 507467 511552 515650 519495 522886 526537 531199 536077
52015 536077 539567 541632 543981 547754 552453 557368 562520 567637 571707 574453 577038 580386 583700 585654
52001 585654 586285 586723 587588 588690 590059 592367 596193 601284 606593 610978 614073 616575 619314 622124 624197
51986 624197 625488 626957 629181 631615 633597 635243 636718 637375 636473 634432 632686 632344 633287 634285 633771 630946
51970F30946m405m283l021j839j191q94j113k030k910k757j966j995l257m472
51956E94813m443l443k465j993j933k086k235k351k772l639m207l630k433k150
51942E55033l249m422m408l574l102l379l818l836l414k951k872l251l751m208
51928E04798m965o132o897o442n415n253o161o848o581o145o390p013p455p930
51914D15171q738r390r409r242r553j0150j0398j0202r813r082p829o627o445
51901B98293p472q838r484q954p504n806m486l816l817m487n437n604m242k262
51887B16084j571k640l750l232j503j26K63J04l57j291k551l705m640n419n730
51872A79936n249m309l406k341o79J139K120K120J962J994J464k35k431l772l669
$$ plain form
51970 630946 626541 622258 619237 617398 616207 615313 614200 612170 609260 606503 604537 602542 599285 594813
51956 594813 590370 586927 584462 582469 580536 578450 576215 573864 571092 567453 563246 559616 557183 555033
51942 555033 551784 547362 542954 539380 536278 532899 529081 525245 521831 518880 516008 512757 509006 504798
51928 504798 499833 493701 486804 480362 474947 469694 463533 456685 450104 443959 437569 430556 423101 415171
51914 415171 406433 397043 387634 378392 368839 358689 348291 338089 328276 319194 311365 304738 298293
51901 298293 290821 281983 272499 263545 256041 250235 245749 241933 238116 233629 228192 222588 218346 216084
51887 216084 214513 211873 208123 204891 203388 203262 203525 203629 203272 201981 199430 195725 191085 185666 179936
51872 179936 174687 170378 166972 164631 163952 165091 167211 169331 171293 173287 174751 174516 172085 168313 164644
51857A64644k727j917j600j291l38J114J982J323m91j992k002o16J077K014J897
51842A61077J199N71K35K6j20j06o6l90j074j504j234o19k97l36m15m89p92j261
51824A54405j514j413j264j391j686j675j016M3P97R03Q29J188J791K004J828
51809A53829J790J766Q91j050l121m348m364k740P58M602N771L143n72j800k31
51794A54324J586J941J339O14j89q00m46Q86K176K802L078L196K824K106J781
51779A77218J930J833J335J097J196Q67K20N34K080L191K606J397J208J797J888
51764B00397J547J947L201M129M151M010M411N163N783O108O128O023O450P844
51750B67292R365R335P117L925J538P07R08J088L96j296l247m513m877m856m785
$$ plain form
51857 164644 161917 160000 158400 157109 156771 157885 159867 161190 160699 158707 156705 156089 157166 159180 161077
51842 161077 162276 162847 163082 163108 162988 162882 162816 162426 161352 159848 158614 157995 157698 157362 156947 156458 155666 154405
51824 154405 152891 151478 150214 148823 147137 145462 144446 144489 145286 146189 147018 148206 149997 152001 153829
51809 153829 155619 157385 158276 157226 154105 149757 145393 142653 143411 148013 153784 156927 156355 154555 154324
51794 154324 155910 157851 159190 159804 159615 158815 158369 159255 161431 164233 167311 170507 173331 175437 177218
51779 177218 179148 180981 182316 183413 184609 185476 185696 186230 188310 191501 194107 195504 196712 198509 200397
51764 200397 201944 203891 207092 211221 215372 219382 223793 228956 234739 240847 246975 252998 259448 267292
51750 267292 276657 285992 293109 297034 298572 299279 300187 301275 301671 300375 297128 292615 287738 282882 278097
51735B78097m315l117j718j228k222l965m897m147k603k124l397m966m846k831
51721B31721o49J62k84r26j302j849k859l742l552k119l67O53P89N91L21k04p77
51704B15607o81K12Q23N1j828l484l992l390k182r22j21J33L47Q56J141N80l83
51687B02767o97k62j57j097k501l291l075k260j477j082q25n5J313K220J570k17
51671A90874j580j730j229o94j9P96J203J039Q95R90O92k03p69m12L7k84p75m96
51653A88335J01J06O9J131K643K570M40j896k859k830k768k748k662k867l158
51638A73607k467o35P66O19j8J60L38q56k378j846N75J995J017l32J5R47J73j988
51620A69692k924j318J423L197L308K380J409J118J451J536P73j25j0R92J691
$$ plain form
51735 278097 273782 270665 268947 267719 265497 261532 256635 252488 249885 247761 244364 239398 234552 231721
51721 231721 231072 231234 230950 230024 228722 226873 224014 220272 216720 214601 214234 214887 215676 216267 216588 216384 215607
51704 215607 214926 215138 215961 216012 214184 210700 206708 203318 201136 200214 200093 200226 200573 201429 202570 203150 202767
51687 202767 202070 201808 201651 200554 198053 194762 191687 189427 187950 186868 186043 185988 187301 189521 191091 190874
51671 190874 189294 187564 186335 185641 185622 186418 187621 188660 189555 190545 191237 191034 190265 189853 189890 189606 188831 188335
51653 188335 188436 188542 188611 189742 192385 194955 195395 193499 190640 187810 185042 182294 179632 176765 173607
51638 173607 171140 170505 171271 171890 171872 172032 172370 171514 169136 167290 167865 169860 170877 170545 170560 171507 171680 169692
51620 169692 166768 165450 166873 170070 173378 175758 177167 178285 179736 181272 182045 181920 181910 182902 184593
51605A84593J746K144L396M446M055K374M12j246k467k909k400j581j291j489
51591A89783j533j253j005p58j20O99Q25L3o49j41J341K631K964K492J593L71
51575A97273r73j702j087N87K036K343K058K301K904K362n5k972m305l506j605
51560A95659K87J624J906Q94n17p98L95J681J686N70n41q82k80J122K661L189
51544B08656K172M92n35n90l02r9N5J9n23j425k117k385k499k549k377k192k491
51527A91310l055k792j186O28R41n43k313k669j366M80J698K048J956J573N80
51512A87290r65j988j340O68K256K071O93k21O0P57Q57L77L7J72M19M12L40O85
51494A92580J561K560L147L078K384J217n9p89m27P98J860J848Q64k00p21q23
$$ plain form
51605 184593 186339 188483 191879 196325 200380 202754 203166 201920 199453 196544 194144 192563 191272 189783
51591 189783 188250 186997 185992 185234 185114 185813 186638 186671 186022 185881 187222 189853 192817 195309 196902 197273
51575 197273 196300 194598 193511 194098 196134 198477 200535 202836 205740 208102 208047 205075 200770 197264 195659
51560 195659 195946 197570 199476 200370 199853 199055 199450 201131 202817 203387 202846 201964 201684 202806 205467 208656
51544 208656 210828 211320 210785 210195 209893 209794 209849 209868 209345 207920 205803 203418 200919 198370 195993 193801 191310
51527 191310 188255 185463 184277 184905 185846 185303 182990 180321 178955 179435 181133 183181 185137 186710 187290
51512 187290 186325 184337 182997 183665 185921 187992 188685 188464 188524 189281 190138 190515 190552 190724 191143 191555 191895 192580
51494 192580 194141 196701 199848 202926 205310 206527 206468 205679 205252 206050 207910 209758 210622 210422 209701 208878
51478B08878p37r4J591L840N192M626K759J231J084K019L070L497L038J917R04
51463B42815Q72J793K522K087J038Q71K060L266K880J017n02j48J671L084K719
51448B68045R13r35j806j625q17M7K00r03k759l975l731k774k345k632k861k699
51432B39343k586k736k631j832o73J69L02l67j687l032l533k955k002j494j624
51417B12662k233l127l741l168j215R80K030J646M15j200k751l268k065l4R62
51402A95893K66r92j736k223k998l696l746l518l686l894l182j655n86q18j808
51387A61621k614k980l063k686j618k13P09O44j86r88q97L31J763J927N70o08
51371A51712J81K351L318J722p39j413J25J964K477J861J067M96K35N41J196J156
$$ plain form
51478 208878 208141 208047 209638 213478 218670 223296 226055 227286 228370 230389 233459 236956 239994 241911 242815
51463 242815 243687 245480 248002 250089 251127 251998 254058 257324 260204 261221 260719 260571 262242 265326 268045
51448 268045 268958 268023 266217 264592 263775 263822 264022 263119 260360 256385 252654 249880 247535 244903 242042 239343
51432 239343 236757 234021 231390 229558 228885 229054 229356 228989 227302 224270 220737 217782 215780 214286 212662
51417 212662 210429 207302 203561 200393 199178 200158 202188 203834 204249 203049 200298 197030 194965 194931 195893
51402 195893 196159 195167 193431 191208 188210 184514 180768 177250 173564 169670 166488 164833 164247 163429 161621
51387 161621 159007 156027 152964 150278 148660 148447 149156 149800 149614 148626 147729 148060 149823 151750 152320 151712
51371 151712 151893 154244 157562 159284 158545 157132 157257 159221 161698 163559 164626 165122 165357 165898 167094 168250
51355A68250q4j280p02J399K759J839l15j469p07R87K144K012P84o36j158m40
51339A73383N97O75l64j486j751j218l78N23J289J352K57j536k798k629j172O46
51323A65390J847J890Q98l89j027n21P85J993K311J557J29j445k842l786l740
51308A63050k271j6J159j84l162n099m382k302j397k400l666l484j967l25Q22
51293A34376J626K053J751Q38J19J51M97K28r62k366k934k321j176l93r1L04R34
51276A32634R81k49k061k840j740N45K547L052J634j016l244l716k736j599p83
51261A21409K33J294J202k73j365o12Q49P60j059k559k280p58Q45J987K412J911
51245A23996R40L80K53k53j175j464p92k69n57o06O09K188K581J876J365J361
$$ plain form
51355 168250 168166 166886 166184 167583 170342 172181 171866 170397 169690 170677 172821 174833 175617 174981 173823 173383
51339 173383 173980 174655 174291 172805 171054 169836 169458 169981 171270 172622 172879 171343 168545 165916 164744 165390
51323 165390 167237 169127 170025 169636 168609 168088 168873 170866 173177 174734 174863 173418 170576 166790 163050
51308 163050 160779 160763 161922 161738 158576 153477 149095 146793 145396 142996 139330 135846 133879 133554 134376
51293 134376 136002 138055 139806 140644 140763 140914 141411 141639 140677 138311 135377 133056 131880 131487 131396 131700 132634
51276 132634 133615 133366 131305 128465 126725 127270 129817 132869 134503 133487 130243 126527 123791 122192 121409
51261 121409 121642 122936 124138 123865 122500 121888 122737 123497 122438 119879 117599 116841 117686 119673 122085 123996
51245 123996 124936 125316 125569 125316 124141 122677 121885 121616 121059 120453 121062 123250 125831 127707 129072 130433
51229A30433R72j14j104j406j240q80l29R9o5o00p63m46k56m35n81n57o06m83
51211A21639L94J649J992J084J94L79J001Q61j02j112j793k187k080j259p2J048
51195A21636K156L183L273J732n79j870j430k50M07K62j54l21j07K28L15J69K72
51178A28922Q41J272Q55k26j081j179o69J19Q78J177P74M5m46p27j169j561j186
51161A26639J05J503K159K023J631J476J676J921J729J116Q05J282J864J475K06
51146A47610p10o32k81m78r18p11L12J353J461M08j006j446l42J307J937J224
51130A49088K35j90l71q37j410j664j598j289n76L86R11O89L29L85N29L80M24
51113A45421J188K013J723L31r61j425j510j797k136k058j523r63q76j375j860
$$ plain form
51229 130433 131405 131291 130187 128781 127541 126661 126332 126431 126366 125766 125003 124557 124301 123866 123285 122728 122122 121639
51211 121639 122033 123682 125674 126758 126952 127331 128332 129193 129091 127979 126186 123999 121919 120660 120588 121636
51195 121636 123792 126975 130248 131980 131401 129531 128101 127851 128258 128520 128366 128045 127938 128166 128481 128650 128922
51178 128922 129763 131035 131890 131664 130583 129404 128735 128854 129732 130909 131683 131728 131282 130555 129386 127825 126639
51161 126639 126744 128247 130406 132429 134060 135536 137212 139133 140862 141978 142783 144065 145929 147404 147610
51146 147610 146900 146268 145987 145509 144591 143880 144192 145545 147006 147414 146408 144962 144620 145927 147864 149088
51130 149088 149323 149133 148762 147925 146515 144851 143253 141964 141388 141774 142685 143374 143703 144088 144617 144997 145421
51113 145421 146609 148622 150345 150676 149715 148290 146780 144983 142847 140789 139266 138303 137427 136052 134192
51098A34192j374K23J733J935J154P90J464K514L244L650L691K924J475M66Q53
51083A58934K222L372L614K967J701L35k86J88R19Q10J00J67J515K779K297J68
51067A81802j895k515j899j091o68m46r0M78J162J767J937J369K34q07j241j204
51051A76893j233j538j693r91P70K771L572K409J77j363j487j136j345j673j078
51036A73055O0j4k016m172m066j482J331K247J378L92L27O63N05j02m59m78q10
51019A66359j622j974j009O46J518J152N14M43O05M99O12J548K556K187M99o39
51003A73894m8J004N24j392k753k424j328o08j1J065J997J741O43J26N89J012
50987A74031P76O27J265K085K225K026K372L024K796J374r2n53l69n41j083r93
$$ plain form
51098 134192 132818 133041 134774 136709 137863 138653 140117 142631 145875 149525 153216 156140 157615 158081 158934
51083 158934 161156 164528 168142 171109 172810 173145 172859 173047 173966 174776 174876 175043 176558 179337 181634 181802
51067 181802 179907 177392 175493 174402 173734 173288 173198 173676 174838 176605 178542 179911 180145 179338 178097 176893
51051 176893 175660 174122 172429 171438 172208 174979 178551 180960 181137 179774 178287 177151 175806 174133 173055
51036 173055 173115 173101 171085 166913 162847 161365 162696 164943 166321 166713 167040 167703 168208 168106 167647 167169 166359
51019 166359 164737 162763 161754 162400 163918 165070 165584 166027 166632 167131 167743 169291 171847 174034 174533 173894
51003 173894 173846 174850 175374 173982 171229 168805 167477 166869 166858 167923 169920 171661 172304 172430 173019 174031
50987 174031 174807 175434 176699 178784 181009 183035 185407 188431 191227 192601 192509 191956 191587 191046 189963 188970
50971A88970K44J805K622K864L628N071N767M517K240J118K041L831M995N183
50957B34896M683L592K238J529J979K878L220L005K859K765J997K33j851l057
50943B60966k522n11J361J342n06k261k577k251k528k919k206q19m44j428k314
50928B40383k080j205k96P90J919K261J536N21k58j057j561n14K358N217O149
50913B54163N297L919K415P56k0J373M342O772P596P717Q111Q425Q007P188O703
50898C32764O437N747M766M600O013Q319R876R776Q823Q738J0311J2627J4153
50885D42950J4323J3772J3245J2736J1856J0821J0592J1757J3486J4257J3833
50874E83628J3802J5457J7796J8633J7395J5428J3630J1310Q035N064L705L269
$$ plain form
50971 188970 189214 191019 193641 196505 200133 205204 210971 215488 217728 218846 220887 224718 229713 234896
50957 234896 239579 243171 245409 246938 248917 251795 255015 258020 260879 263644 265641 265874 264023 260966
50943 260966 258444 257933 259294 260636 260130 257869 255292 253041 250513 247594 245388 244569 244125 242697 240383
50928 240383 238303 237098 236802 237592 239511 241772 243308 243829 243571 242514 240953 240439 242797 248014 254163
50913 254163 259460 263379 265794 266550 266530 267903 272245 279017 286613 294330 302441 310866 318873 326061 332764
50898 332764 339201 344948 349714 354314 360327 368646 378522 388298 397121 405859 416170 428797 442950
50885 442950 457273 471045 484290 497026 508882 519703 530295 542052 555538 569795 583628
50874 583628 597430 612887 630683 649316 666711 682139 695769 707079 715114 720178 723883 727152
50862G27152J925q12l777n950p488r009j0816j2937j5042j6324j6045j4395j2326
50849F04156j0643r634r383r717j0006r696q985q338p497n770l338j410q27j066
50835E07846r59J50J993L705M322L550K179J381J446J695J663J721K287L031L281
50820E39291K812J832N60p55j597j586j025o31o44o11k06J79J3m63m72J24N00
50803E37321M2o83o58K14J191J867K476L095L527M140N775Q321J0301J0561R688
50788E97178R172R615J0565J1567J2695J4124J5748J7147J7796J7754J8182K0307
50776G71850K3591K5994K6603K6860K8280L0148L0857L0574L0950L2649L4766
50765A093122L6459L7723L8731L9705M1225M3360M4777M4238M2696M2249M3095
$$ plain form
50862 727152 729077 728265 724488 718538 711050 702041 691225 678288 663246 646922 630877 616482 604156
50849 604156 593513 583879 574496 564779 554773 545077 536092 527754 520257 514487 511149 509739 508912 507846
50835 507846 506887 507037 509030 512735 517057 520607 522786 524167 525613 527308 528971 530692 532979 536010 539291
50820 539291 542103 543935 544495 543740 542143 540557 539532 538901 538257 537646 537440 537619 537632 537169 536697 536821 537321
50803 537321 537363 536680 536022 536236 537427 539294 541770 544865 548392 552532 558307 566628 576929 587490 597178
50788 597178 606350 615965 626530 638097 650792 664916 680664 697811 715607 733361 751543 771850
50776 771850 795441 821435 848038 874898 903178 933326 964183 994757 1025707 1058356 1093122
50765 1093122 1129581 1167304 1206035 1245740 1286965 1330325 1375102 1419340 1462036 1504285 1547380
50754A547380M3321M1761L9229L6533L3326K9537K6074K3209J9798J5088R846
50743A865102M777n08n925r890j1292j1100j0563r230o312k786l8K570O719J2227
50729A823751J7293K1441K6087L2055L8568M5077N2243O0286O7937P4066P9173
50718B337977Q4090Q8054Q9286Q7127Q2696P7410P1546O4313N5075M4280L3299
50707C115153K3257J4157N276l868j3282k3041l3304m3656n3068o0953o7978p5291
50695B783402q2980q9653r3654r4533r3121r0298q6163q0663p4549o8963o4104
50684A864721n9166n3662m8095m2908l7681l2031k6556k1995j7899j3121p444
50673A504163j878K731O597J0506J4992K0032K5052K9128L1673L2921L3455L3434
$$ plain form
50754 1547380 1590701 1632462 1671691 1708224 1741550 1771087 1797161 1820370 1840168 1855256 1865102
50743 1865102 1869879 1869371 1863446 1853556 1842264 1831164 1820601 1811371 1805059 1802273 1802235 1804805 1811524 1823751
50729 1823751 1841044 1862485 1888572 1920627 1959195 2004272 2056515 2116801 2184738 2258804 2337977
50718 2337977 2422067 2510121 2599407 2686534 2769230 2846640 2918186 2982499 3037574 3081854 3115153
50707 3115153 3138410 3152567 3157843 3153975 3140693 3117652 3084348 3040692 2987624 2926671 2858693 2783402
50695 2783402 2700422 2610769 2517115 2422582 2329461 2239163 2153000 2072337 1997788 1928825 1864721
50684 1864721 1805555 1751893 1703798 1660890 1623209 1591178 1564622 1542627 1524728 1511607 1504163
50673 1504163 1502285 1505016 1511613 1522119 1537111 1557143 1582195 1611323 1642996 1675917 1709372 1742806
50661A742806L2751L1697L0799K9941K8300K5231K0879J5921J1215P670N800N169
50649A988179M614L281J302m84j263q12M60K061M009O544R206J0918J1480J2259
50635B051754J4581J7907K0464K1396K1367K1220K1149K1219K1656K2407K3174
50624B278294K4164K6113K9388L3592L8241M3094M7840N2160N6214O0423O4625
50613B754148O8237P1369P5008P9971Q6426R4639J05181J17974J31929J46032
50603C730914J59933J73065J84034J91639J95826J96877J94251J87048J75319
50594E388906J60304J43680J26996J11258R6328Q1015O4505M7395L0748J4483
50584F265618k507k0759l9470n7274p3061q5981r5324j00766j02507j01011r6863
$$ plain form
50661 1742806 1775557 1807254 1838053 1867994 1896294 1921525 1942404 1958325 1969540 1977210 1983010 1988179
50649 1988179 1992793 1996074 1997376 1996892 1995629 1994817 1995277 1997338 2001347 2007891 2017097 2028015 2039495 2051754
50635 2051754 2066335 2084242 2104706 2126102 2147469 2168689 2189838 2211057 2232713 2255120 2278294
50624 2278294 2302458 2328571 2357959 2391551 2429792 2472886 2520726 2572886 2629100 2689523 2754148
50613 2754148 2822385 2893754 2968762 3048733 3135159 3229798 3334979 3452953 3584882 3730914
50603 3730914 3890847 4063912 4247946 4439585 4635411 4832288 5026539 5213587 5388906
50594 5388906 5549210 5692890 5819886 5931144 6027472 6108487 6172992 6220387 6251135 6265618
50584 6265618 6263111 6242352 6202882 6145608 6072547 5986566 5891242 5790476 5687969 5586958 5490095
50573E490095r0792q3462p5241o6351n7213m8415m0507l4203l0562l0265l2526
50562D900558l5225l6656l7064l8099m0747m4108m6425m6956m6303m4961m2333
50551D441681l7708l1630k5446j9656j3672p343j822J558K704K485J383j104n917
50538D305513j3618k3937l5885m8426o0967p3001q3573r1854r8186j03609j08247
50527C564210j11046j11493j10345j08141j04240r8449r2422q7824q3711p7583
50517B578956o9014o0511n4246m9388m3585l6152k8659k2777j8416j4101q698
50506B173409k450L559Q711J3269J7418K0598K2316K3283K4899K7761L1370L5215
50494B399358L9365M3894M8694N4227O1584P1287Q2399R3342J03266J12403J21468
$$ plain form
50573 5490095 5399303 5315841 5240600 5174249 5117036 5068621 5028114 4993911 4963349 4933084 4900558
50562 4900558 4865333 4828677 4791613 4753514 4712767 4668659 4622234 4575278 4528975 4484014 4441681
50551 4441681 4403973 4372343 4346897 4327241 4313569 4306226 4304404 4305962 4308666 4311151 4312534 4311430 4305513
50538 4305513 4291895 4267958 4232073 4183647 4122680 4049679 3966106 3874252 3776066 3672457 3564210
50527 3564210 3453164 3341671 3231326 3123185 3018945 2920496 2828074 2740250 2656539 2578956
50517 2578956 2509942 2449431 2395185 2345797 2302212 2266060 2237401 2214624 2196208 2182107 2173409
50506 2173409 2170959 2174518 2183229 2196498 2213916 2234514 2256830 2280113 2305012 2332773 2364143 2399358
50494 2399358 2438723 2482617 2531311 2585538 2647122 2718409 2800808 2894150 2997416 3109819 3231287
50483C231287J30966J40679J49425J55572J58043J56777J52310J45488J37611
50474D558158J30186J23982J18650J13603J08863J04790J01366R8175R4788R0839
50464E643400Q6076Q0705P5553P1633O9672P0031P2616P6770Q1630Q6816R2172
50453F507074R6789R9109R8359R4905Q8654P8168O2437M2692K1071j875k6848
50442G160535n3158p8189r9843j18064j33453j45582j53456j56497j54362j46745
50432E921186j34351j19216j03099q6088o7826m9441l3128k0125j0316l690j029
50421E292877l136j0316k2660l9708n9815q0799j01399j21063j38280j50768j57974
50410D406959j61993j64819j65858j63490j58216j52436j47396j42014j34940
$$ plain form
50483 3231287 3362253 3502932 3652357 3807929 3965972 4122749 4275059 4420547 4558158
50474 4558158 4688344 4812326 4930976 5044579 5153442 5258232 5359598 5457773 5552561 5643400
50464 5643400 5729476 5810181 5885734 5957367 6027039 6097070 6169686 6246456 6328086 6414902 6507074
50453 6507074 6603863 6702972 6801331 6896236 6984890 7063058 7125495 7168187 7189258 7187383 7160535
50442 7160535 7107377 7029188 6929345 6811281 6677828 6532246 6378790 6222293 6067931 5921186
50432 5921186 5786835 5667619 5564520 5478432 5410606 5361165 5328037 5307912 5297596 5293906 5292877
50421 5292877 5289741 5279425 5256765 5217057 5157242 5076443 4975044 4853981 4715701 4564933 4406959
50410 4406959 4244966 4080147 3914289 3750799 3592583 3440147 3292751 3150737 3015797
50401C015797j26402j17671j09781j03201r7687r2044q4942p6555o8614o2299
50391B076601n6891n1164m5229m0072l5969l2322k8704k5063k1231j7270j4046
50380A708640j2291j1077q461m111j67J301J045J939N742J1285J5924J8316J9529
50367A747614K1705K5894L1336L6615M1137M5272M9443N3708N8198O3273O8912
50356B243107P4314P8454Q1097Q2987Q5085Q7561Q9638R0545R0651R1338R3450
50345C188227R6185R7927R7946R6770R5151R3394R1537Q9369Q6058Q0655P3298
50334D186517O5247N7368M9176L9632K8206J4721r77j8508l6610n3970o9959q4063
50322D176780r5321j03124j08016j10755j11063j08224j02555r5023q5791p4530
$$ plain form
50401 3015797 2889395 2771724 2661943 2558742 2461055 2369011 2284069 2207514 2138900 2076601
50391 2076601 2019710 1968546 1923317 1883245 1847276 1814954 1786250 1761187 1739956 1722686 1708640
50380 1708640 1696349 1685272 1676811 1672700 1672533 1673834 1674879 1676818 1682560 1693845 1709769 1728085 1747614
50367 1747614 1769319 1795213 1826549 1863164 1904301 1949573 1999016 2052724 2110922 2174195 2243107
50356 2243107 2317421 2395875 2476972 2559959 2645044 2732605 2822243 2912788 3003439 3094777 3188227
50345 3188227 3284412 3382339 3480285 3577055 3672206 3765600 3857137 3946506 4032564 4113219 4186517
50334 4186517 4251764 4309132 4358308 4397940 4426146 4440867 4439890 4421382 4384772 4330802 4260843 4176780
50322 4176780 4081459 3978335 3870319 3759564 3648501 3540277 3437722 3342699 3256908 3182378
50312C182378o2264n1370m3087l6079k8300j9652j2150p983p942j1397j7112k4183
50300B860859l2360m1298m9756n6245o0622o4172o7702p0372p0942o9512o7284
50289B210594o5048o2721o0101n7419n5168n3694n2725n1038m7241m1453l5756
50278A628230l2243l0922l0142k8720k6804k4873k2988k1159j9645j8484j7226
50267A355024j5429j3188j1132j0020j0226j1227j1759j0944r177p481o201m884
50255A233356l278j775p52l2Q76K314M253O164P323P709Q355J0323J3468J6784
50241A305088J9643K1995K3716K4715K5484K6453K6885K5540K2475J9012J5840
50230A556846J2497Q952O132M261K122j056m325o699q942j2378j6765k0715k3547
$$ plain form
50312 3182378 3120114 3068744 3025657 2989578 2961278 2941626 2929476 2921493 2913551 2902154 2885042 2860859
50300 2860859 2828499 2787201 2737445 2681200 2620578 2556406 2488704 2418332 2347390 2277878 2210594
50289 2210594 2145546 2082825 2022724 1965305 1910137 1856443 1803718 1752680 1705439 1663986 1628230
50278 1628230 1595987 1565065 1534923 1506203 1479399 1454526 1431538 1410379 1390734 1372250 1355024
50267 1355024 1339595 1326407 1315275 1305255 1295029 1283802 1272043 1261099 1251922 1244441 1238240 1233356
50255 1233356 1230078 1228303 1227551 1227519 1228395 1230709 1234962 1241126 1248449 1256158 1264513 1274836 1288304 1305088
50241 1305088 1324731 1346726 1370442 1395157 1420641 1447094 1473979 1499519 1521994 1541006 1556846
50230 1556846 1569343 1578295 1584427 1588688 1590810 1589754 1585429 1578730 1569788 1557410 1540645 1519930 1496383
50217A496383k5390k6176k5967k5855k6864k8082k7513k4866k2075k0634j9785
50206A223176j8047j5414j3155j1955j1104r523p148n117m553n277o096o378o612
50193A102797p039o788n247l512l169m222n463o348o976o675m628j964j088k328
50179A037350l210j910K87J319J397K102L581M544M458L963L342K277J127R60
50165A061587J937K814K583J690J085Q80N99L18P03J882K929K827J800J136J627
50150A086397K625L008K612K032J413N01j84M23K275L851M251M598O397R335J1702
50135A141236J2517J2185J1507J0984J1018J1798J3055J4506J6263J8272J9894
50124A293235K0844K2009K4121K6132K6289K4757K3699K4424K5831K6323K6181
$$ plain form
50217 1496383 1470993 1444817 1418850 1392995 1366131 1338049 1310536 1285670 1263595 1242961 1223176
50206 1223176 1205129 1189715 1176560 1164605 1153501 1143978 1136830 1131713 1127160 1121883 1115787 1109409 1102797
50193 1102797 1095758 1088970 1083723 1080211 1077042 1072820 1067357 1061009 1054033 1047358 1042730 1040766 1039678 1037350
50179 1037350 1034140 1032230 1032517 1033836 1035233 1037335 1040916 1045460 1049918 1053881 1057223 1059500 1060627 1061587
50165 1061587 1063524 1066338 1068921 1070611 1071696 1072576 1073175 1073493 1074196 1076078 1079007 1081834 1083634 1084770 1086397
50150 1086397 1089022 1092030 1094642 1096674 1098087 1098588 1098404 1098827 1101102 1104953 1109204 1113802 1120199 1129534 1141236
50135 1141236 1153753 1165938 1177445 1188429 1199447 1211245 1224300 1238806 1255069 1273341 1293235
50124 1293235 1314079 1336088 1360209 1386341 1412630 1437387 1461086 1485510 1511341 1537664 1563845
50113A563845K6948K9103L1316L2072L1376L0664L1259L3178L5611L8303M1698
50102A925373M5579M8734N0827N3659N9127O6369P2619P6929Q1334Q7946R6505
50091B665001J05700J15501J26820J39729J53290J66818J80318J93747K06662
50082D053586K18379K28001K34433K36746K34242K26045K11548J91907J70325
50073F005212J49759J30768J12344R4276P7488O2198M6890K9157O873k1183n4535
50062F639247r0523j25663j57854j86584k10961k28885k38843k41623k39370k33633
50052D685308k25181k14954k03836j91602j77400j61597j46175j32826j21305
50043C110432j10216r8948q8230p9068p1778o5960o0878n5816n0516m5414m1115
$$ plain form
50113 1563845 1590793 1619896 1651212 1683284 1714660 1745324 1776583 1809761 1845372 1883675 1925373
50102 1925373 1970952 2019686 2070513 2124172 2183299 2249668 2322287 2399216 2480550 2568496 2665001
50091 2665001 2770701 2886202 3013022 3152751 3306041 3472859 3653177 3846924 4053586
50082 4053586 4271965 4499966 4734399 4971145 5205387 5431432 5642980 5834887 6005212
50073 6005212 6154971 6285739 6398083 6492359 6569847 6632045 6678935 6708092 6714965 6693782 6639247
50062 6639247 6548724 6423061 6265207 6078623 5867662 5638777 5399934 5158311 4918941 4685308
50052 4685308 4460127 4245173 4041337 3849735 3672335 3510738 3364563 3231737 3110432
50043 3110432 3000216 2901268 2813038 2733970 2662192 2596232 2535354 2479538 2429022 2383608 2342493
50032B342493l7585l4197l0597k7149k4309k1967j9705j7378j5067j2636r765
50021B092138o467l267q30N15J001J322K207L876O071Q580J1388J4174J6257J7552
50007B164517J9048K1667K4940K7702K9894L2657L6502M0353M2847M3844M4329
49996B528300M5437M7945N1912N6317N9665O1553O3245O6132P0194P4467P8469
49985C203636Q2376Q6413R0966R6909J04687J13284J21123J28111J35859J45888
49975D309252J58522J73581J91010K10311K30384K50654K71795K94777L19536
49966F409822L44903L69001L89139M02238M06511M02574L92123L76029L54728
49957I847068L30134L05529K82992K61809K39870K15767J88713J57278J19414
$$ plain form
50032 2342493 2304908 2270711 2240114 2212965 2188656 2166689 2146984 2129606 2114539 2101903 2092138
50021 2092138 2085671 2082404 2081574 2082089 2083090 2084412 2086619 2090495 2096566 2105146 2116534 2130708 2146965 2164517
50007 2164517 2183565 2205232 2230172 2257874 2287768 2320425 2356927 2397280 2440127 2483971 2528300
49996 2528300 2573737 2621682 2673594 2729911 2789576 2851129 2914374 2980506 3050700 3125167 3203636
49985 3203636 3286012 3372425 3463391 3560300 3664987 3778271 3899394 4027505 4163364 4309252
49975 4309252 4467774 4641355 4832365 5042676 5273060 5523714 5795509 6090286 6409822
49966 6409822 6754725 7123726 7512865 7915103 8321614 8724188 9116311 9492340 9847068
49957 9847068 10177202 10482731 10765723 11027532 11267402 11483169 11671882 11829160 11948574
49948A1948574P3894K1060l7552r9507j61292k18875k69491l12737l49572l80156
49938A0214346m03150m17202m22764m22026m16999m08047l94532l76724l56502
49929F596400l35980l15875k95629k74833k53980k33874k15000j97622j81974
49920D291633j67928j54855j42298j30686j20925j13319j07176j01564r6150r1142
49910C065590q6582q1956p6735p1277o6861o4412o3182o1218n7372n2512m8452
49899B335031m5973m4303m2244l9260l5605l1922k8931k6983k5622k3767k0683
49888A969738j6753j3141j0598q677o279l080j59J182J105J292L185O571J0113
49875A934499J2756J4289J5094J5888J7430J9862K2579K5023K7407L0249L3786
$$ plain form
49948 11948574 12022468 12043528 12005976 11906469 11745177 11526302 11256811 10944074 10594502 10214346
49938 10214346 9811196 9393994 8971230 8549204 8132205 7724158 7329626 6952902 6596400
49929 6596400 6260420 5944545 5648916 5374083 5120103 4886229 4671229 4473607 4291633
49920 4291633 4123705 3968850 3826552 3695866 3574941 3461622 3354446 3252882 3156732 3065590
49910 3065590 2979008 2897052 2820317 2749040 2682179 2617767 2554585 2493367 2435995 2383483 2335031
49899 2335031 2289058 2244755 2202511 2163251 2127646 2095724 2066793 2039810 2014188 1990421 1969738
49888 1969738 1952985 1939844 1929246 1920569 1914290 1911210 1911051 1912233 1913338 1914630 1917815 1924386 1934499
49875 1934499 1947255 1961544 1976638 1992526 2009956 2029818 2052397 2077420 2104827 2135076 2168862
49864B168862L8113M3281M8589N2677N5273N8213O3447P0645P8227Q6179R5934
49853B859440J07568J19385J30755J43201J57769J73402J89152K05880K23891
49844D310443K40443K52067K58298K60652K58612K49463K32388K10276J86730
49835F459372J63417J41242J21864J06136R2159P6701N8030L5989R798k2355o0958
49824G181395j03473j45703j84495k18677k47685k70060k83894k88766k86546
49815E152096k79804k69561k55459k38022k19652k02715j87343j72047j56277
49806C171216j41448j29130j19015j09254r8647q7945p8796p1873o6445o1661
49796B207002n7477n3965n0366m5718m0260l5360l1936k9620k7743k6305k5514
$$ plain form
49864 2168862 2206975 2250256 2298845 2351522 2406795 2465008 2528455 2599100 2677327 2763506 2859440
49853 2859440 2967008 3086393 3217148 3360349 3518118 3691520 3880672 4086552 4310443
49844 4310443 4550886 4802953 5061251 5321903 5580515 5829978 6062366 6272642 6459372
49835 6459372 6622789 6764031 6885895 6992031 7084190 7160891 7218921 7254910 7264708 7242353 7181395
49824 7181395 7077922 6932219 6747724 6529047 6281362 6011302 5727408 5438642 5152096
49815 5152096 4872292 4602731 4347272 4109250 3889598 3686883 3499540 3327493 3171216
49806 3171216 3029768 2900638 2781623 2672369 2573722 2485777 2406981 2335108 2268663 2207002
49796 2207002 2149525 2095560 2045194 1999476 1959216 1923856 1891920 1862300 1834557 1808252 1782738
49785A782738k4986k4160k3159k2446k1833k0599j8623j6732j5719j5606j6056
$$ plain form
49785 1782738 1757752 1733592 1710433 1687987 1666154 1645555 1626932 1610200 1594481 1578875 1562819
$$ [...]
##END NTUPLES=NMR SPECTRUM
##END=
