##TITLE=coffee_type ROVE100C
COFFEE_meoh_noesyp64 COFFEE_meoh {C:\Bruker\TOPSPIN} Administrator 11
##JCAMPDX= 6.0         $$ Bruker NMR JCAMP-DX V2.0
##DATA TYPE= NMR SPECTRUM
##DATA CLASS= NTUPLES
##ORIGIN= Bruker BioSpin GmbH
##OWNER= Administrator
$$ 1.72 TOPSPIN		Version 2.1
$$ 2012-05-18 15:45:28.229 -0700  Administrator@X
$$ Compression mode = diff/dup
##.OBSERVE FREQUENCY= 400.13188235
##.OBSERVE NUCLEUS= ^1H
##.ACQUISITION MODE= SIMULTANEOUS (DQD)
##.ACQUISITION SCHEME= undefined
##.AVERAGES= 64
##.DIGITISER RES= 22
##SPECTROMETER/DATA SYSTEM= spect
##.PULSE SEQUENCE= noesygpps1d.comp
##.SOLVENT NAME= COFFEE_meoh
##.SHIFT REFERENCE= INTERNAL, COFFEE_meoh, 1, 14.98061
##AUDIT TRAIL= $$ (NUMBER, WHEN, WHO, WHERE, PROCESS, VERSION, WHAT)
$$ ##TITLE= Audit trail, TOPSPIN		Version 2.1
$$ ##JCAMPDX= 5.01
$$ ##ORIGIN= Bruker BioSpin GmbH
$$ ##OWNER= Administrator
$$ $$ C:\Bruker\TOPSPIN/data/Administrator/nmr/12-COFFEE-2302/122/pdata/1/auditp.txt
$$ ##AUDIT TRAIL=  $$ (NUMBER, WHEN, WHO, WHERE, PROCESS, VERSION, WHAT)
(   1,<2012-02-23 23:09:29.562 -0500>,<Administrator>,<TOPSPIN>,<go>,<TOPSPIN 2.1>,
      <created by zg
	started at 2012-02-23 22:57:59.297 -0500,
	POWCHK enabled, PULCHK disabled,
       configuration hash MD5:
       B0 76 FB 9C 50 81 44 7D 18 B3 26 32 4E 60 AD 96
       data hash MD5: 64K
       E0 65 37 04 3E 0D 82 18 3C 7B C9 6B 5E 22 7E 42>)
(   2,<2012-02-23 23:09:32.266 -0500>,<Administrator>,<TOPSPIN>,<proc1d>,<TOPSPIN 2.1>,
      <Start of raw data processing
       efp LB = 0.3 FT_mod = 6 PKNL = 1 PHC0 = 0 PHC1 = 0 SI = 128K 
       data hash MD5: 128K
       CB 1A D9 A0 96 7D AC 9E 78 E1 69 46 27 E9 4F 42>)
(   3,<2012-02-23 23:09:33.578 -0500>,<Administrator>,<TOPSPIN>,<proc1d>,<TOPSPIN 2.1>,
      <pk PHC0 = 24.47754 PHC1 = 0 
       data hash MD5: 128K
       99 20 2C CC E9 44 09 77 38 46 9B 1B 09 75 D5 DD>)
(   4,<2012-02-23 23:09:33.812 -0500>,<Administrator>,<TOPSPIN>,<proc1d>,<TOPSPIN 2.1>,
      <abs ABSG = 1 
       data hash MD5: 128K
       5A 83 F1 D0 D4 FE B0 12 DC 9B 09 9D FB 5E CF 59>)
(   5,<2012-02-23 23:09:33.906 -0500>,<Administrator>,<TOPSPIN>,<proc1d>,<TOPSPIN 2.1>,
      <abs ABSG = 2 
       data hash MD5: 128K
       EC A5 A8 2A 0E 82 0B 26 1B 9C 93 92 11 A2 F9 A7>)
(   6,<2012-02-23 23:09:34.047 -0500>,<Administrator>,<TOPSPIN>,<proc1d>,<TOPSPIN 2.1>,
      <abs ABSG = 3 
       data hash MD5: 128K
       85 26 62 48 3C 16 FC 03 75 66 4B 84 79 B9 25 37>)
(   7,<2012-02-23 23:09:34.219 -0500>,<Administrator>,<TOPSPIN>,<proc1d>,<TOPSPIN 2.1>,
      <abs ABSG = 4 
       data hash MD5: 128K
       A1 C8 31 EF 6F E5 15 C8 66 B0 A3 4D C9 A0 F0 1B>)
(   8,<2012-02-23 23:09:34.266 -0500>,<Administrator>,<TOPSPIN>,<proc1d>,<TOPSPIN 2.1>,
      <abs ABSG = 5 
       data hash MD5: 128K
       29 13 A1 E5 29 51 40 9E 6B FC 24 CC AE FD 9C F8>)
(   9,<2012-02-23 23:09:34.391 -0500>,<Administrator>,<TOPSPIN>,<audit>,<TOPSPIN 2.1>,
      <user comment:
       ICON-NMR User ID: Administrator
$$ [...]
150 150 150 150 150 150 150 150
##$TP07= 0
##$TPNAME0= <>
##$TPNAME1= <>
##$TPNAME2= <>
##$TPNAME3= <>
##$TPNAME4= <>
##$TPNAME5= <>
##$TPNAME6= <>
##$TPNAME7= <>
##$TPOAL= (0..7)
0.5 0.5 0.5 0.5 0.5 0.5 0.5 0.5
##$TPOFFS= (0..7)
0 0 0 0 0 0 0 0
##$TUNHIN= 0
##$TUNHOUT= 0
##$TUNXOUT= 0
##$USERA1= <user>
##$USERA2= <user>
##$USERA3= <user>
##$USERA4= <user>
##$USERA5= <user>
##$V9= 5
##$VALIST= <valist>
##$VCLIST= <CCCCCCCCCCCCCCC>
##$VD= 0
##$VDLIST= <DDDDDDDDDDDDDDD>
##$VPLIST= <PPPPPPPPPPPPPPP>
##$VTLIST= <TTTTTTTTTTTTTTT>
##$WBST= 1024
##$WBSW= 4
##$XGAIN= (0..3)
0 0 0 0
##$XL= 0
##$YL= 0
##$YMAX_a= 13591383
##$YMIN_a= -6098876
##$ZGOPTNS= <>
##$ZL1= 120
##$ZL2= 120
##$ZL3= 120
##$ZL4= 120
##$ABSF1= 14.98061
##$ABSF2= -5.57192
##$ABSG= 5
##$ABSL= 3
##$ALPHA= 0
##$AQORDER= 0
##$ASSFAC= 0
##$ASSFACI= 0
##$ASSFACX= 0
##$ASSWID= 0
##$AUNMP= <proc_prof1d_extract>
##$AXLEFT= 0
##$AXNAME= <>
##$AXNUC= <1H>
##$AXRIGHT= 0
##$AXTYPE= 0
##$AXUNIT= <>
##$AZFE= 0.1
##$AZFW= 0.1
##$BCFW= 0
##$BC_mod= 0
##$BYTORDP= 0
##$COROFFS= 0
##$CY= 15
##$DATMOD= 1
##$DC= 0
##$DFILT= <>
##$DTYPP= 0
##$F1P= 0
##$F2P= 0
##$FCOR= 0.5
##$FTSIZE= 131072
##$FT_mod= 6
##$GAMMA= 0
##$GB= 0
##$INTBC= 1
##$INTSCL= 1
##$ISEN= 128
##$LB= 0.3
##$LEV0= 0
##$LPBIN= 0
##$MAXI= 10000
##$MC2= 0
##$MEAN= 0
##$ME_mod= 0
##$MI= 0
##$NCOEF= 0
##$NC_proc= -3
##$NLEV= 6
##$NOISF1= 0
##$NOISF2= 0
##$NSP= 0
##$NTH_PI= 0
##$NZP= 0
##$OFFSET= 14.98061
##$PC= 1
##$PHC0= 24.47754
##$PHC1= 0
##$PH_mod= 1
##$PKNL= yes
##$PPARMOD= 0
##$PPDIAG= 0
##$PPIPTYP= 0
##$PPMPNUM= 2147483647
##$PPRESOL= 1
##$PSCAL= 4
##$PSIGN= 0
##$PYNMP= <proc.py>
##$REVERSE= no
##$SF= 400.13
##$SI= 131072
##$SIGF1= 0
##$SIGF2= 0
##$SINO= 400
##$SIOLD= 131072
##$SPECTYP= <>
##$SREGLST= <1H.CDCl3>
##$SSB= 0
##$STSI= 131072
##$STSR= 0
##$SW_p= 8223.68421052632
##$SYMM= 0
##$S_DEV= 0
##$TDeff= 65536
##$TDoff= 0
##$TI= <>
##$TILT= no
##$TM1= 0
##$TM2= 0
##$TOPLEV= 0
##$USERP1= <user>
##$USERP2= <user>
##$USERP3= <user>
##$USERP4= <user>
##$USERP5= <user>
##$WDW= 1
##$XDIM= 131072
##$YMAX_p= 507742361
##$YMIN_p= -218153831
##$CURPLOT= <Network HP LaserJet P1505>
##$CURPRIN= <$Network HP LaserJet P1505>
##$DFORMAT= <normdp>
##$LAYOUT= <+/1D_H.xwp>
##$LFORMAT= <normlp>
##$PFORMAT= <normpl>
##$SURQMSG= 1
$$ End of Bruker specific parameters
$$ ---------------------------------
##NTUPLES= NMR SPECTRUM
##VAR_NAME=  FREQUENCY,     SPECTRUM/REAL,   SPECTRUM/IMAG
##SYMBOL=    X,             R,               I
##VAR_TYPE=  INDEPENDENT,   DEPENDENT,       DEPENDENT
##VAR_FORM=  AFFN,          ASDF,            ASDF
##VAR_DIM=   131072,        131072,          131072
##UNITS=     HZ,            ARBITRARY UNITS, ARBITRARY UNITS
##FACTOR=    0.0627417313425165, 1,          1
##FIRST=     8223.62146879498, 6781,         -81504
##LAST=      0,             9553,            -80414
##MIN=       0,             -218153831,      0
##MAX=       8223.62146879498, 507742361,    0
$$ Real data points
##PAGE= N=1
##DATA TABLE= (X++(R..R)), XYDATA
$$ [...]
63111I95897J1055R928R616R970J0590J1408J2514J3619J4161J3985J3524J2996
$$ 995897 1006952 1016880 1026496 1036466 1047056 1058464 1070978 1084597 1098758 1112743 1126267 1139263
63099A139263J2048J0595R346Q664P595N208K522J486K089K141L26k272m284n848
$$ 1139263 1151311 1161906 1171252 1179916 1187511 1192719 1195241 1196727 1198816 1200957 1201283 1199011 1194727 1188879
63085A188879p221p461o182n153o096p843p897o207n067n496o159o091o102o712
$$ 1188879 1181658 1174197 1168015 1162862 1156766 1148923 1141026 1134819 1129752 1124256 1118097 1112006 1105904 1099192
63071A099192o826n601m027l356l294k938k412k340k613k844l219l827l901k930
$$ 1099192 1092366 1086765 1082738 1079382 1076088 1073150 1070738 1068398 1065785 1062941 1059722 1055895 1051994 1049064
63057A049064j773j458j557r42L65J381J756J797J368J70r75o57J223L243M324
$$ 1049064 1047291 1045833 1044276 1043334 1043699 1045080 1046836 1048633 1050001 1050171 1049196 1048539 1049762 1053005 1057329
63042A057329M672M806M875N138N973P028P397O979O623O624O225N062L948L595
$$ 1057329 1062001 1066807 1071682 1076820 1082793 1089821 1097218 1104197 1110820 1117444 1123669 1128731 1132679 1136274
63028A136274L535L165K977L800N399O677O845N845M078K333J455J455J485J152
$$ 1136274 1139809 1142974 1145951 1149751 1155150 1161827 1168672 1174517 1178595 1180928 1182383 1183838 1185323 1186475
63014A186475J226K308L680M327M436M754N026M511L680L960N637P265P553O712
$$ 1186475 1187701 1190009 1193689 1198016 1202452 1207206 1212232 1216743 1220423 1224383 1230020 1237285 1244838 1251550
63000A251550N613M532L338K026N88j106k748l577l389k977l031l238l114l105
$$ 1251550 1257163 1261695 1265033 1267059 1267647 1266541 1263793 1260216 1256827 1253850 1250819 1247581 1244467 1241362
62986A241362l954n366o185n876n009m273l821l630l747l817l136j627k36J74
$$ 1241362 1237408 1232042 1225857 1219981 1214972 1210699 1206878 1203248 1199501 1195684 1192548 1190921 1190685 1190859
62972A190859k00p12j371k502l621l759k920k273k538l088l175l203l926m997
$$ 1190859 1190659 1189947 1188576 1186074 1182453 1178694 1175774 1173501 1170963 1167875 1164700 1161497 1157571 1152574
62958A152574n426n205n420o571p767p867o789n256l849k760k094j851j730j241
$$ 1152574 1147148 1141943 1136523 1129952 1122185 1114318 1107529 1102273 1098424 1095664 1093570 1091719 1089989 1088748
62944A088748p7J603L151L925M095M586N796O770O581O152P309R975J1856J1632
$$ 1088748 1088671 1090274 1093425 1097350 1101445 1106031 1111827 1118597 1125178 1131330 1138639 1148614 1160470 1172102
62930A172102J0958J2095J4625J6198J5861J4870J4258J3389J1552R586Q877R355
$$ 1172102 1183060 1195155 1209780 1225978 1241839 1256709 1270967 1284356 1295908 1305494 1314371 1323726
62918A323726R423P713M345N10k774n349p642r988j2333j4601j7016j9889k3149
$$ 1323726 1333149 1340862 1345207 1345717 1342943 1337594 1329952 1319964 1307631 1293030 1276014 1256125 1232976
62905A232976k6260k8569k9815l0477l1408l2734l3335l2188l0070k8853k8798
$$ 1232976 1206716 1178147 1148332 1117855 1086447 1053713 1020378 988190 958120 929267 900469
62894I00469k7815k4264j9438j6082j5241j5780j6422j6799j6706j5850j4500
$$ 900469 872654 848390 828952 812870 797629 781849 765427 748628 731922 716072 701572
62883G01572j3329j2455j1565j0844j0626j0285q793o545n142n092n155m490l979
$$ 701572 688243 675788 664223 653379 642753 632468 623675 617130 611988 606896 601741 597251 593272
62870E93272m565n566n739n071m345l751l021k432k595l524m713n820o463n862
$$ 593272 588707 583141 577402 572331 567986 564235 561214 558782 556187 552663 547950 542130 535667 529805
62856E29805l617o45J574K512K572J961M55j679l483m196l830k814j673r83r84
$$ 529805 526188 525543 527117 529629 532201 534162 534617 532938 529455 525259 521429 518615 516942 515959 514975
62841E14975j213j013m35k1J63N70J174J341R85R76J816K568J953J39j443k046
$$ 514975 513762 512749 512314 512293 512456 513026 514200 515541 516526 517502 519318 521886 523839 523978 522535 520489
62825E20489k424l335m080l306r67J406K400K046J270Q75J386L039N170O279N704
$$ 520489 518065 514730 510650 507344 506377 507783 510183 512229 513499 514374 515760 518799 523969 530248 535952
62810E35952M804N384P194Q266P737O906P167Q247R201R744R678Q178N008J696
$$ 535952 540756 546140 553334 561600 569337 576243 583410 591657 600858 610602 620280 628458 633466 635162
62796F35162N0oR5k35n35j008k620n184o929o742n716n588o501p132o499m782
$$ 635162 635212 635206 635301 635066 634531 633523 630903 625719 618790 612048 606332 600744 594243 587111 580612 575830
62780E75830k829j578j643k750l778l913l482l064k276l90K001L103K104K28r19
$$ 575830 573001 571423 569780 567030 563252 559339 555857 552793 550517 550127 552128 555231 557335 557563 556644
62765E56644j268j715k242j861l49J051J056l20k193l793m527l919k361j337j897
$$ 556644 555376 553661 551419 549558 549209 550260 551316 550996 548803 545010 540483 536564 534203 532866 530969
62750E30969l207l599k770j847j403r06l33p11k290l543l146j964j727k518l024
$$ 530969 527762 524163 521393 519546 518143 517237 516904 516193 513903 510360 507214 505250 503523 501005 497981
62735D97981k729k250j777r17j63p27k305k702p98J539J775k0j732k245k213k129
$$ 497981 495252 493002 491225 490308 490145 489418 487113 484411 483613 485152 486927 486907 485175 482930 480717 478588
62719D78588j553o07m63j524k400j863q11r42k129k553j386J48P17O91J269K577
$$ 478588 477035 476428 475965 474441 472041 470178 469367 468425 466296 463743 462357 462505 463222 463913 465182 467759
62703D67759L535L286K149J131R30J380J757J699J799K832M525N749O127O510
$$ 467759 471294 474580 476729 477860 478790 480170 481927 483626 485425 488257 492782 498531 504658 511168
62689E11168P340P515N934L502K232K557K929K248J238Q34M22j094l237m249l422
$$ 511168 518508 526023 531957 535459 537691 540248 543177 545425 546663 547497 547919 546825 543588 539339 535917
62674E35917k046j736k544l334l530l670m171m416l683k554k467l708m842m572
$$ 535917 533871 532135 529591 526257 522727 519057 514886 510470 506787 504233 501766 498058 493216 488644
62660D88644l423k824l107l331k780j709o67M9K48o0k25O51K611M581N401M838
$$ 488644 485221 482397 479290 475959 473179 471470 470803 470852 471100 471040 470815 471466 474077 478658 484059 488897
62644D88897L668L208M517P289R695J0031Q634P466P941R851J2276J4513J6070
$$ 488897 492565 495773 500290 507579 517274 527305 535939 543405 551346 561197 573473 587986 604056
62631F04056J6739J6980J7430J7995J8335J9102K1393K4810K7412K8044K7457
$$ 604056 620795 637775 655205 673200 691535 710637 732030 756840 784252 812296 839753
62620H39753K6663K5601K4114K2791K1798K0120J7126J3799J1158Q475M479m84
$$ 839753 866416 892017 916131 938922 960720 980840 997966 1011765 1022923 1031398 1035877 1035393
62608A035393n083r202j3791j8743k2594k4578k5645k7027k8758l0015l0194k9241
$$ 1035393 1030310 1021108 1007317 988574 965980 941402 915757 888730 859972 829957 799763 770522
62596G70522k7440k5257k3111k1114j9163j7197j5324j3863j3252j3507j3762
$$ 770522 743082 717825 694714 673600 654437 637240 621916 608053 594801 581294 567532
62585E67532j3021j1508j0450j0308j0158r273q142p195n831l779k301k570l630
$$ 567532 554511 543003 532553 522245 512087 502814 494672 487477 481646 477867 475566 472996 469366
62572D69366l611k457j799k257k501j302P35J971J444l94k009j895o7J656J579
$$ 469366 465755 463298 461499 459242 456741 455439 456174 458145 459589 459195 457186 455291 455224 456880 458459
62557D58459J26q88o91j38LQ2O36J307J394R04O36J264K446K985K261J380J997
$$ 458459 458585 457697 457006 456868 456871 456953 457589 458896 460290 461194 461830 463094 465540 468525 470786 472166 474163
62540D74163L828M605L225J553J824L450M140L345K657L126M160N066N944O770
$$ 474163 477991 482596 485821 487374 489198 492648 496788 500133 502790 505916 510076 515142 521086 527856
62526E27856P114P055P063O846N674L981L137L413L596K947K041J286K41r07q88
$$ 527856 534970 542025 549088 555934 561608 565589 568726 572139 575735 578682 580723 582009 582250 581343 580455
62511E80455O25J783O66k144m290m461l515l043l562m272m128l066k025j789k168
$$ 580455 581080 582863 583529 581385 577095 572634 569119 566076 562514 558242 554114 551048 549023 547234 545066
62496E45066k648l201l829l858k754j224m85p23j367k353l899n316n617n130n053
$$ 545066 542418 539217 535388 531530 528776 527552 527067 526344 524977 522624 518725 513409 507792 502662 497609
62481D97609n507n509m802m014l141j665l24o74k501l615k843j346l82L45J221
$$ 497609 492102 486593 481791 477777 474636 472971 472647 471973 469472 465857 463014 461668 461286 461631 462852
62466D62852J523R71P61J780L150L738L790L890L586K456J384J503K675M065N232
$$ 462852 464375 465346 466107 467887 471037 474775 478565 482455 486041 488497 489881 491384 494059 498124 503356
62451E03356N833N420M595N099P617J0597J2426J3488J4823J6022J6172J5902
$$ 503356 509189 514609 519204 524303 531920 542517 554943 568431 583254 599276 615448 631350
62439F31350J6773J9029K1262K1946K0425J7189J4043J2949J3711J3822J1682
$$ 631350 648123 667152 688414 710360 730785 747974 762017 774966 788677 802499 814181
62428H14181Q616O407M436J135k953n895p374q723j0310j1104j0756j0186r920
$$ 814181 822797 829204 833640 834775 831822 825927 818553 809830 799520 788416 777660 767474 757554
62415G57554r469q629p948p737p693p518p001n783m091l256m186n809o381n861
$$ 757554 748085 739456 731508 723771 716078 708560 701559 695776 691685 688429 684243 678434 672053 666192
62401F66192n352m733k797K46K359K236P94k59o6J329L261M448L996K661K075
$$ 666192 660840 656107 653310 653556 655915 658151 658945 658686 658620 659949 663210 667658 671654 674315 676390
62386F76390K536K889K596K480K995L241K467J404J234J876J976L68k653n234
$$ 676390 678926 681815 684411 686891 689886 693127 695594 696998 698232 700108 702084 702452 699799 694565
62372F94565n384l171j064j177k629k933j619p24j578k976l233k429j595r16M5
$$ 694565 689181 686010 684946 683769 681140 678207 676588 675864 674286 671310 668077 665648 664053 663137 663182
62357F63182J132J854K517M048O622R116J0193R783R251R941J1566J2572J2296
$$ 663182 664314 666168 668685 672733 679355 688471 698664 708447 717698 727639 739205 751777 764073
62344G64073J2007J3177J5386J6975J7283J7094J7145J7372J7526J7500J7042
$$ 764073 776080 789257 804643 821618 838901 855995 873140 890512 908038 925538 942580
62333I42580J6144J5531J5628J5339J3217R765P107O148N643M449L219L134M279
$$ 942580 958724 974255 989883 1005222 1018439 1028204 1035311 1041459 1047102 1051551 1054770 1057904 1062183
62320A062183O075Q262J0556J2238J2982J3508J4721J6603J8563K0465K2836K6319
$$ 1062183 1068258 1076520 1087076 1099314 1112296 1125804 1140525 1157128 1175691 1196156 1218992 1245311
62308A245311L1068L6394M1039M4507M7984N3158N9985O6546P1231P4241P6797
$$ 1245311 1276379 1312773 1353812 1398319 1446303 1499461 1559446 1625992 1697223 1771464 1848261
62297A848261P9755Q3286Q6944Q9634R0245Q8562Q4857P8630O8833N5630M0885
$$ 1848261 1928016 2011302 2098246 2187880 2278125 2366687 2451544 2530174 2599007 2654637 2695522
62286B695522K6507J3180R35j0106k0164k9884l9452m8240n5773o2163o7256p0350
$$ 2695522 2722029 2735209 2736144 2726038 2705874 2675990 2636538 2588298 2532525 2470362 2403106 2332756
62274B332756p1328p1180p0759o9659o6845o1904n5510m9254m4975m3160m1988
$$ 2332756 2261428 2190248 2119489 2049830 1982985 1921081 1865571 1816317 1771342 1728182 1686194
62263A686194l9167l4823l1029k8345k4967k0115j6044j4940j5546j4977j2736
$$ 1686194 1647027 1612204 1581175 1552830 1527863 1507748 1491704 1476764 1461218 1446241 1433505
62252A433505j0709r847r135p687n698l209J3K857L079K78k789l180j203L94k0
$$ 1433505 1422796 1412949 1403814 1396127 1390429 1387220 1387233 1390090 1393169 1393447 1390658 1387478 1386275 1386669 1386649
62237A386649j564k790l411l689l331k002l17P57J302K235L795N233O222P435
$$ 1386649 1385085 1382295 1378884 1375195 1371864 1369862 1369545 1370302 1371604 1373839 1377634 1382867 1389089 1396524
62223A396524R297J1282J3058J5202J7794J9545J9631J9469K1049K4152K7026
$$ 1396524 1405821 1417103 1430161 1445363 1463157 1482702 1502333 1521802 1542851 1567003 1594029
62212A594029K9188L1572L4181L5935L7045L9244M3111M7270N1004N5331O0456
$$ 1594029 1623217 1654789 1688970 1724905 1761950 1801194 1844305 1891575 1942579 1997910 2058366
62201B058366O4458O6353O8487P3577Q0554Q5746Q7585Q8012Q9199R0840R1077
$$ 2058366 2122824 2189177 2257664 2331241 2411795 2497541 2585126 2673138 2762337 2853177 2944254
62190B944254Q8581Q2987P4229O2396M8228L3366J9696Q007k533j2959k2753l0483
$$ 2944254 3032835 3115822 3190051 3252447 3300675 3334041 3353737 3361744 3359211 3346252 3323499 3293016
62178C293016l6103m1120m6099m9539n0125m8706m6874m4823m1928l8426l5010
$$ 3293016 3256913 3215793 3169694 3120155 3070030 3021324 2974450 2929627 2887699 2849273 2814263
62167B814263l1478k7274k2890j9267j6219j2766q794n198k510m39J413L284N477
$$ 2814263 2782785 2755511 2732621 2713354 2697135 2684369 2675575 2670377 2667867 2667428 2668841 2672125 2677602
62154B677602P932R983J1333J2778J5033J7378J8571J8580J8332J8339J8813K0504
$$ 2677602 2685534 2695517 2706850 2719628 2734661 2752039 2770610 2789190 2807522 2825861 2844674 2865178
62142B865178K3798K7333K9330L0281L2624L7408M2805M6500M8259M9537N1552
$$ 2865178 2888976 2916309 2945639 2975920 3008544 3045952 3088757 3135257 3183516 3233053 3284605
62131C284605N4522N8084O1713O5023O7951P0430P2057P2583P2561P2835P3364
$$ 3284605 3339127 3397211 3458924 3523947 3591898 3662328 3734385 3806968 3879529 3952364 4025728
62120D025728P3171P1426O8149O4119O0704N9381O0526O2887O5002O6839O9268
$$ 4025728 4098899 4170325 4238474 4302593 4363297 4422678 4483204 4546091 4611093 4677932 4747200
62109D747200P2501P6251Q0879Q6776R2774R6891R8858J00323J02018J02281R9226
$$ 4747200 4819701 4895952 4976831 5063607 5156381 5253272 5352130 5452453 5554471 5656752 5755978
62098E755978R3196Q6032P8897P1761O4470N7168M9919M2641L5417K8660K2970
$$ 5755978 5849174 5935206 6014103 6085864 6150334 6207502 6257421 6300062 6335479 6364139 6387109
62087F387109J8805J5949J3503J0898Q815Q295R076R765R841J0330J2190J4920
$$ 6387109 6405914 6421863 6435366 6446264 6455079 6463374 6472450 6482215 6492056 6502386 6514576 6529496
62075F529496J7335J8824J9494J9870K0975K3744K7617L0568L1291L0683L0337
$$ 6529496 6546831 6565655 6585149 6605019 6625994 6649738 6677355 6707923 6739214 6769897 6800234
62064F800234L0421L0093K9443K9557L0783L2136L2732L2805L2841L2566L1346
$$ 6800234 6830655 6860748 6890191 6919748 6950531 6982667 7015399 7048204 7081045 7113611 7144957
62053G144957K9305K7342K6111K5303K4128K2247K0099J8163J6165J3422J0079
$$ 7144957 7174262 7201604 7227715 7253018 7277146 7299393 7319492 7337655 7353820 7367242 7377321
62042G377321P400O294N925M715K698J905L796P050Q949Q629P842Q412J0173J1966
$$ 7377321 7384721 7391015 7396940 7401655 7404353 7406258 7410054 7417104 7426053 7434682 7442524 7450936 7461109 7473075
62028G473075J3589J5566J7753J9468K0854K2749K5167K7082K8052K8904L0327
$$ 7473075 7486664 7502230 7519983 7539451 7560305 7583054 7608221 7635303 7663355 7692259 7722586
62017G722586L1789L2467L2299L1495K9849K7364K4864K3119K2030K1221K0746
$$ 7722586 7754375 7786842 7819141 7850636 7880485 7907849 7932713 7955832 7977862 7999083 8019829
62006H019829K0308J8721J5296J1171P918N363K079k273o729j1059j6394k3333
$$ 8019829 8040137 8058858 8074154 8085325 8093243 8098606 8100685 8098412 8091683 8080624 8064230 8040897
61994H040897l0749l7339m3594n1367o1848p4370q6945r7600j05381j10461j13437
$$ 8040897 8010148 7972809 7929215 7877848 7816000 7741630 7654685 7557085 7451704 7341243 7227806
61983G227806j14839j15388j16188j18099j21110j24664j28112j30485j30492
$$ 7227806 7112967 6997579 6881391 6763292 6642182 6517518 6389406 6258921 6128429
61974F128429j27645j23047j18174j13154j07053r9610r1876q5263q0716p8476
$$ 6128429 6000784 5877737 5759563 5646409 5539356 5439746 5347870 5262607 5181891 5103415
61964E103415p7801p7168p5658p3832p2459p1072o8952o6926o6532o7450o7532
$$ 5103415 5025614 4948446 4872788 4798956 4726497 4655425 4586473 4519547 4453015 4385565 4318033
61953D318033o5590o2555n9568n6486n2903m9223m5817m2347l8628l5234l2489
$$ 4318033 4252443 4189888 4130320 4073834 4020931 3971708 3925891 3883544 3844916 3809682 3777193
61942C777193k9933k7484k6083k6212k6690k6041k4599k4312k6813l2321l9942
$$ 3777193 3747260 3719776 3693693 3667481 3640791 3614750 3590151 3565839 3539026 3506705 3466763
61931C466763m8135n5163n9870o2232o3061o3433o4265o5756o6928o6424o4097
$$ 3466763 3418628 3363465 3303595 3241363 3178302 3114869 3050604 2984848 2917920 2851496 2787399
61920B787399o1078n8094n4658n0581m7092m5256m3945m0882l5657l0501k7607
$$ 2787399 2726321 2668227 2613569 2562988 2515896 2470640 2426695 2385813 2350156 2319655 2292048
61909B292048k6583k5231k2459j9477j7907j7426j6209j3544j0858r554q805o639
$$ 2292048 2265465 2240234 2217775 2198298 2180391 2162965 2146756 2133212 2122354 2112800 2103995 2097356
61897B097356k670J550M750P266R999J3203J6595J9824K2735K5779L0036L5750
$$ 2097356 2094686 2096236 2100986 2108252 2118251 2131454 2148049 2167873 2190608 2216387 2246423 2282173
61885B282173M1213M4637M7050N1409N8407O5153O8920P0377P1762P3431P4138
$$ 2282173 2323386 2368023 2415073 2466482 2524889 2590042 2658962 2729339 2801101 2874532 2948670
61874B948670P3707P3488P4316P5500P5774P4333P1167O7299O4324O2829O1646
$$ 2948670 3022377 3095865 3170181 3245681 3321455 3395788 3466955 3534254 3598578 3661407 3723053
61863C723053N9443N6612N4812N5249N8350O4472P3607Q4708R6519J08985J22881
$$ 3723053 3782496 3839108 3893920 3949169 4007519 4071991 4145598 4230306 4326825 4435810 4558691
61852D558691J38258J54247J70244J86285K02502K19227K37347K57227K77412
$$ 4558691 4696949 4851196 5021440 5207725 5410227 5629454 5866801 6124028 6401440
61843F401440K95862L12707L30321L50019L69871L86524L98030M03657M01457
$$ 6401440 6697302 7010009 7340330 7690349 8060220 8446744 8844774 9248431 9649888
61834I649888L87454L57455L09103K42362J59163O3367l9300j42118k38572l22941
$$ 9649888 10037342 10394797 10703900 10946262 11105425 11168792 11129492 10987374 10748802 10425861
61824A0425861l90480m38275m66592m78713m78544m68404m49560m24291l96044
$$ 10425861 10035381 9597106 9130514 8651801 8173257 7704853 7255293 6831002 6434958
61815F434958l67332l38505l09155k79850k51856k25801k01415j78373j56882
$$ 6434958 6067626 5729121 5419966 5140116 4888260 4662459 4461044 4282671 4125789
61806D125789j37571j20893j06401r2626p8330o3816n0171l7271k3847r883K623
$$ 4125789 3988218 3867325 3760924 3668298 3589968 3526152 3475981 3438710 3414863 3404980 3407603
61795C407603J2291K0406K8975L7770M4978N0260N5223O0647O4789O5195O1452
$$ 3407603 3419894 3440300 3469275 3507045 3552023 3602283 3657506 3718153 3782942 3848137 3909589
61784C909589N5421M9035M2314L3706K2475J0256l38q424j5007k0323k2714k1016
$$ 3909589 3965010 4014045 4056359 4090065 4112540 4122796 4122458 4114034 4099027 4078704 4055990 4034974
61772D034974j6627j1839p147j779M033R032J2651J4899J4845J1087L800n352
$$ 4034974 4018347 4006508 3999361 3997582 4001615 4010647 4023298 4038197 4053042 4064129 4067929 4062577
61760D062577j5392k6427l7745m7430n4526n9993o4656o7671o8027o6349o3980
$$ 4062577 4047185 4020758 3983013 3935583 3881057 3821064 3756408 3688737 3620710 3554361 3490381
61749C490381o1136n6990n0991m3182l3726k3183j2817l789L997J1574J9630K8106
$$ 3490381 3429245 3372255 3321264 3278082 3244356 3221173 3208356 3204567 3208564 3220138 3239768 3267874
61737C267874L6782M5610N4471O3180P1932Q1416R2205J04053J15963J27121J37787
$$ 3267874 3304656 3350266 3404737 3467917 3539849 3621265 3713470 3817523 3933486 4060607 4198394
61726D198394J49083J61826J75901J90982K07519K26555K48691K73701L01110
$$ 4198394 4347477 4509303 4685204 4876186 5083705 5310260 5558951 5832652 6133762
61717F133762L30814L63255L99227M39271M83023N29355N77329O26276O74589
$$ 6133762 6464576 6827831 7227058 7666329 8149352 8678707 9256036 9882312 10556901
61708A0556901P19237P57165P86178Q03188Q02211P75720P18070O26917N02288
$$ 10556901 11276138 12033303 12819481 13622669 14424880 15200600 15918670 16545587 17047875
61699A7047875L46691J66893k5631k17026l94000n45884o66246p53373q08419
$$ 17047875 17394566 17561459 17535828 17318802 16924802 16378918 15712672 14959299 14150880
61690A4150880q33108q30476q07131p71922p31033o85921o36866n86575n38778
$$ 14150880 13317772 12487296 11680165 10908243 10177210 9491289 8854423 8267848 7729070
61681G729070m94761m53326m13421l75372l40106l08436k80709k56141k33118
$$ 7729070 7234309 6780983 6367562 5992190 5652084 5343648 5062939 4806798 4573680
61672D573680k11131j91548j75379j61230j46967j32564j19670j09029j00082
$$ 4573680 4362549 4171001 3995622 3834392 3687425 3554861 3435191 3326162 3226080
61663C226080r2771q7836q5248q3939q3163q2700q1823p9764p7236p5747p5062
$$ 3226080 3133309 3045473 2960225 2876286 2793123 2710423 2628600 2548836 2471600 2395853 2320791
61652B320791p3153o9174o4685o1175n8071n4334n0367m7075m4302m1713l9989
$$ 2320791 2247638 2178464 2113779 2052604 1994533 1940199 1889832 1842757 1798455 1756742 1716753
61641A716753l9502l8698l5793l1632k8958k8820k9480k9154k8104k7303k6518
$$ 1716753 1677251 1638553 1602760 1571128 1542170 1513350 1483870 1454716 1426612 1399309 1372791
61630A372791k4991k3174k2351k2632k2423k0467j7766j6706j8126j9976j9559
$$ 1372791 1347800 1324626 1302275 1279643 1257220 1236753 1218987 1202281 1184155 1164179 1144620
61619A144620j6793j4247j3774j4333j3913j2445j1420j1255j0816r558q410q030
$$ 1144620 1127827 1113580 1099806 1085473 1071560 1059115 1047695 1036440 1025624 1016066 1007656 999626
61607I99626p545o000l928k527j937j400o24q4r9l39j43J106L560O373P994P693
$$ 999626 992081 986081 982153 979626 977689 976289 975665 975581 975482 975143 975000 976106 979666 986039 994033 1001726
61591A001726O545O299P477R196J0486J1066J0943J0162R047Q151P791P878Q062
$$ 1001726 1008271 1014570 1022047 1031243 1041729 1052795 1063738 1073900 1082947 1091098 1098889 1106767 1114829
61578A114829P809O701N085M002L958M276M259M308N074O116O607O812P494Q177
$$ 1114829 1122638 1129339 1134424 1138426 1142384 1146660 1150919 1155227 1160301 1166417 1173024 1179836 1187330 1195507
61564A195507P606N807M037K487k19m708r682j3757j6965j9550k0855k0664k0303
$$ 1195507 1203113 1208920 1212957 1215444 1215225 1210517 1200835 1187078 1170113 1150563 1129708 1109044 1088741
61551A088741k0980k1885k1401j9467j7372j5853j4712j3805j3061j1848r756
$$ 1088741 1067761 1045876 1024475 1005008 987636 971783 957071 943266 930205 918357 908601
61540I08601p736p106p536p327n761l914k903k469j711l62J161K492L779N665
$$ 908601 900865 893759 886223 878896 873135 869221 866318 863849 862138 861776 862937 865429 869208 874873
61526H74873Q610J1902J3866J3745J2875J3042J4088J4393J3415J2361J2293J2998
$$ 874873 883483 895385 909251 922996 935871 948913 963001 977394 990809 1003170 1015463 1028461
61514A028461J4022J5570J7737J9946K1638K2752K3143K2492K1295K0945K2127
$$ 1028461 1042483 1058053 1075790 1095736 1117374 1140126 1163269 1185761 1207056 1228001 1250128
61503A250128K3902K5013K5304K5164K4503K3245K2255K2474K3246K2607J9587
$$ 1250128 1274030 1299043 1324347 1349511 1374014 1397259 1419514 1441988 1465234 1487841 1507428
61492A507428J5510J2668J2035J2658J3137J3096J2864J2150R982O445L491K961
$$ 1507428 1522938 1535606 1547641 1560299 1573436 1586532 1599396 1611546 1621528 1627973 1631464 1634425
61480A634425M083M232K200n64k390l697n835q532r764q089m126L32L947O504
$$ 1634425 1638508 1642740 1644940 1644376 1641986 1638289 1632454 1623922 1614158 1606069 1601943 1602275 1606222 1612726
61466A612726Q591J1023J4237J7889K1099K3378K5515K9252L5626M3512N0446
$$ 1612726 1621317 1632340 1646577 1664466 1685565 1708943 1734458 1763710 1799336 1842848 1893294
61455A893294N5239N9275O4642P1602P8874Q5906R3559J02434J12054J22073J33012
$$ 1893294 1948533 2007808 2072450 2144052 2222926 2308832 2402391 2504825 2616879 2738952 2871964
61444B871964J44834J55863J64187J69510J72596J73330J70390J62611J49655
$$ 2871964 3016798 3172661 3336848 3506358 3678954 3852284 4022674 4185285 4334940
61435D334940J31494J08291Q1063N1715K2099o565l3275n6929p6792r2853j05340
$$ 4334940 4466434 4574725 4655788 4707503 4729602 4723037 4689762 4632833 4556041 4463188 4357848
61424D357848j14039j18486j18751j15726j10489j03520r4816q4726p4391o4980
$$ 4357848 4243809 4125323 4006572 3890846 3780357 3676837 3582021 3497295 3422904 3357924
61414C357924n6626m8523m0044l1414k3117j5189p407P1O745J2352J7122K1459
$$ 3357924 3301298 3252775 3212731 3181317 3158200 3143011 3135604 3135675 3142420 3154772 3171894 3193353
61402C193353K5630K9787L3994L7929M0775M1838M1497M1198M2037M3613M4795
$$ 3193353 3218983 3248770 3282764 3320693 3361468 3403306 3444803 3486001 3528038 3571651 3616446
61391C616446M5443M6418M7854M8546M7742M6428M5879M5784M5100M3938M2991
$$ 3616446 3661889 3708307 3756161 3804707 3852449 3898877 3944756 3990540 4035640 4079578 4122569
61380D122569M1458L7519L1064K4282J8993J5009J1648R103P220M501q8n274r009
$$ 4122569 4164027 4201546 4232610 4256892 4275885 4290894 4302542 4311645 4318865 4323366 4323278 4318004 4308995
61367D308995j1192j3447j6712k0430k3812k6466k7761k7077k4968k3017k2161
$$ 4308995 4297803 4284356 4267644 4247214 4223402 4196936 4169175 4142098 4117130 4094113 4071952
61356D071952k1978k1867k1827k1674k0446j7471j3611j0688r633r646r213p712
$$ 4071952 4049974 4028107 4006280 3984606 3964160 3946689 3933078 3922390 3912757 3903111 3893898 3886186
61344C886186n957n241o002p519q833r467r109p169l264K127Q187J4853K2823
$$ 3886186 3880229 3874988 3868986 3861467 3852634 3843167 3834058 3826889 3823625 3825752 3833939 3848792 3871615
61331C871615L2441M3186N4402O6021P8264R1053J04062J17051J29823J42043
$$ 3871615 3904056 3947242 4001644 4067665 4145929 4236982 4341044 4458095 4587918 4729961
61321D729961J53310J63373J71993J78663J82582J82869J78704J69273J53897
$$ 4729961 4883271 5046644 5218637 5397300 5579882 5762751 5941455 6110728 6264625
61312F264625J32514J06094P6325M4768J2482j9432m9345p5753r8271j17385j33245
$$ 6264625 6397139 6503233 6579558 6624326 6636808 6617376 6568031 6492278 6394007 6276622 6143377
61301F143377j45468j54312j61054j66462j69506j68625j64034j57721j51121
$$ 6143377 5997909 5843597 5682543 5516081 5346575 5177950 5013916 4856195 4705074
61292D705074j43757j34587j23825j12779j02404r2774q3721p5190o6919n8532
$$ 4705074 4561317 4426730 4302905 4190126 4087722 3994948 3911227 3836037 3769118 3710586
61282C710586n0271m3145l7788l3507k8906k3359j7467j2144p841m617k270j19
$$ 3710586 3660315 3617170 3579382 3545875 3516969 3493610 3476143 3463999 3456158 3451541 3449271 3449152
61270C449152K804O738J0714J3534J5003J5839J6553J6931J6461J4902J2455R716
$$ 3449152 3451956 3458694 3469408 3482942 3497945 3513784 3530337 3547268 3563729 3578631 3591086 3600802
61258C600802P271N161L003R17k30n9M12j47j738l296m307n195o342p743r505
$$ 3600802 3608073 3613234 3616237 3617154 3616924 3616865 3617277 3617130 3615392 3612096 3607789 3602594 3596252 3588509 3579004
61243C579004j1567j2942j2505j0737r493r656j0245j0328j0443j1296j2223j2130
$$ 3579004 3567437 3554495 3541990 3531253 3521760 3512104 3501859 3491531 3481088 3469792 3457569 3445439
61231C445439j1306j1125j2377j4770j7704k0662k3134k4856k5946k6342k5522
$$ 3445439 3434133 3423008 3410631 3395861 3378157 3357495 3334361 3309505 3283559 3257217 3231695
61220C231695k3342k0624j8162j5721j2800r905q072p327o545m733j800J905O008
$$ 3231695 3208353 3187729 3169567 3153846 3141046 3131141 3123069 3115742 3109197 3104464 3102664 3104569 3110577
61207C110577J0136J4164J8436K3277K8442L3512L8541M3601M7951N0574N1439
$$ 3110577 3120713 3134877 3153313 3176590 3205032 3238544 3277085 3320686 3368637 3419211 3470650
61196C470650N1527N1645N2027N3069N5397N8790O1867O3515O4199O5050O5722
$$ 3470650 3522177 3573822 3625849 3678918 3734315 3793105 3854972 3918487 3982686 4047736 4113458
61185D113458O3759N6421M3048K5334N429j5680l7644n9346p9070r5971j10209
$$ 4113458 4177217 4233638 4276686 4302020 4307449 4291769 4254125 4194779 4115709 4019738 3909529
61174C909529j21254j27299j27285j22698j16306j09534j02036r3431q4309p5551
$$ 3909529 3788275 3660976 3533691 3410993 3294687 3185153 3083117 2989686 2905377 2829826
61164B829826o7777o1422n6441n1795m6247m0073l5087l2479l1179k8973k4917
$$ 2829826 2762049 2700627 2644186 2592391 2546144 2506071 2470984 2438505 2407326 2378353 2353436
61153B353436k0092j6162j3669j1885j0075q405p315o300m162o30L016N469O882
$$ 2353436 2333344 2317182 2303513 2291628 2281553 2273148 2265833 2259533 2255371 2254741 2257757 2263226 2270108
61140B270108Q149R413J0223J0708J1331J1605J0479Q212O601O745P662P888P502
$$ 2270108 2278257 2287670 2297893 2308601 2319932 2331537 2342016 2350228 2356829 2363574 2371236 2379124 2386626
61127B386626P597Q372R002R126R208R224Q146N296J486j991n093q902j3977j9673
$$ 2386626 2394223 2402595 2411597 2420723 2429931 2439155 2447301 2452597 2454083 2452092 2446999 2438097 2424120 2404447
61113B404447k5155l0248l4922l8719m1259m2781m3666m3927m3747m3846m4503
$$ 2404447 2379292 2349044 2314122 2275403 2234144 2191363 2147697 2103770 2060023 2016177 1971674
61102A971674m4780m3819m2411m1939m2087m1132l8589l5901l4103l2319k9318
$$ 1971674 1926894 1883075 1840664 1798725 1756638 1715506 1676917 1641016 1606913 1574594 1545276
61091A545276k5200k0754j6440j2806j0570r246o991k943J460M736P573J1203
$$ 1545276 1520076 1499322 1482882 1470076 1459506 1450260 1443269 1440326 1441786 1446522 1454095 1465298
61079A465298J4821J6638J6781J7047J8102J8849J8357J6501J2855P093P88l286
$$ 1465298 1480119 1496757 1513538 1530585 1548687 1567536 1585893 1602394 1615249 1622342 1623130 1619844
61067A619844m319m373n456p238q336q333p542o135m616m153n160o241n768m135
$$ 1619844 1615525 1611152 1605696 1598458 1590122 1581789 1574247 1568112 1563496 1559343 1554183 1547942 1542174 1538039
61053A538039l413m794p194q507p858o368n682n985n969m919l854l794l796k275
$$ 1538039 1534626 1529832 1522638 1514131 1506273 1499905 1494223 1488238 1482269 1477350 1473496 1469702 1465906 1463631
61039A463631K76J768J684J761K990L964L217J415m2j109k320l295l800n196q772
$$ 1463631 1463907 1465675 1467359 1469120 1472110 1476074 1479291 1480706 1480664 1479555 1477235 1473940 1470140 1464944 1456172
61024A456172j3220j5811j5876j5222j5112j4924j4158j3760j4402j5106j4740
$$ 1456172 1442952 1427141 1411265 1396043 1380931 1366007 1351849 1338089 1323687 1308581 1293841
61013A293841j3721j2924j1877r560o397l960k803k071j283j056j652k055j353
$$ 1293841 1280120 1267196 1255319 1245759 1239362 1235402 1232599 1230528 1229245 1228189 1226537 1224482 1223129
61000A223129r0O53Q53J162J457J004L5PJ861M798P197Q255Q348Q213Q274Q552
$$ 1223129 1223039 1223692 1224545 1225707 1227164 1228168 1228203 1228210 1230071 1234869 1242066 1250321 1258669 1266882 1275156 1283708
60984A283708Q966R655J0923J2710J4305J5016J4994J4888J4887J4738J4676J5281
$$ 1283708 1292674 1302329 1313252 1325962 1340267 1355283 1370277 1385165 1400052 1414790 1429466 1444747
60972A444747J6373J7004J6914J7085J8252J9688K0095J9133J7488J5940J4886
$$ 1444747 1461120 1478124 1495038 1512123 1530375 1550063 1570158 1589291 1606779 1622719 1637605
60961A637605J4216J3144J0790P486M946M420N220N718N359M937N266O319P575
$$ 1637605 1651821 1664965 1675755 1683241 1688187 1692607 1697827 1703545 1708904 1713841 1719107 1725426 1733001
60948A733001Q726J0059J2234J5374J8470K0325K1227K2725K5612K9141L2506
$$ 1733001 1741727 1751786 1764020 1779394 1797864 1818189 1839416 1862141 1887753 1916894 1949400
60937A949400L5989M0136M4906N0237N6271O2421O7482P1460P5999Q2220Q9409
$$ 1949400 1985389 2025525 2070431 2120668 2176939 2239360 2306842 2378302 2454301 2536521 2625930
60926B625930R6526J03581J10540J16653J22093J28465J36222J43470J49070J55107
$$ 2625930 2722456 2826037 2936577 3053230 3175323 3303788 3440010 3583480 3732550 3887657
60916C887657J63973J74636J84371J92883K02068K12691K24178K37066K52892
$$ 3887657 4051630 4226266 4410637 4603520 4805588 5018279 5242457 5479523 5732415
60907E732415K71852K92796L15160L38608L61460L82014M01157M21610M45185
$$ 5732415 6004267 6297063 6612223 6950831 7312291 7694305 8095462 8517072 8962257
60898H962257M72896N06489N47064N93120O42823O97004P56980Q21204Q88384
$$ 8962257 9435153 9941642 10488706 11081826 11724649 12421653 13178633 13999837 14888221
60889A4888221R62867J052403J161763J293670J454644J652593J887802K153046
$$ 14888221 15851088 16903491 18065254 19358924 20813568 22466161 24353963 26507009
60881B6507009K444249K764682L118681L511682L958979M478638N059163N635406
$$ 26507009 28951258 31715940 34834621 38346303 42305282 46783920 51843083 57478489
60873E7478489O103452O352579O275185N770334M793773L445749J998663P90191
$$ 57478489 63581941 69934520 76209705 81980039 86773812 90219561 92218224 93008415
60865I3008415M4655k27819j84464l6807J1014k34020r20488k058490l458025
$$ 93008415 93053070 92825251 92640787 92603980 92614994 92380974 91460486 89401996 85943971
60856H5943971m799612n800882o338417o442348o215789n772797n219031m641578
$$ 85943971 81144359 75343477 69005060 62562712 56346923 50574126 45355095 40713517
60848D0713517m094041l595687l149034k754158k408596k105905j841462j615663
$$ 40713517 36619476 33023789 29874755 27120597 24712001 22606096 20764634 19148971
60840A9148971j428152j272959j142058j030244r34228q50327p75723p09548o50734
$$ 19148971 17720819 16447860 15305802 14275558 13341330 12491003 11715280 11005732 10354998
60831A0354998n96863n46475n00306m59125m22659l91422l66747l47728l30771
$$ 10354998 9758135 9211660 8711354 8252229 7829570 7438148 7071401 6723673 6392902
60822F392902l13562k97167k82858k69496k55475k40927k26281k10872j94685
$$ 6392902 6079340 5782173 5499315 5229819 4974344 4733417 4507136 4296264 4101579
60813D101579j79475j66508j54921j43771j33726j25145j16565j07068r8411r2671
$$ 4101579 3922104 3755596 3600675 3456904 3323178 3198033 3081468 2974400 2875989 2783318
60803B783318q9122q5445q0835p5955p0846o5028n9165n4769n2398n1280n0345
$$ 2783318 2694196 2608751 2527916 2451961 2381115 2316087 2256922 2202153 2149755 2098475 2048130
60792B048130m8671m5666m1802l8499l6460l4868l2940l1163l0066k8960k7121
$$ 2048130 1999459 1953793 1911991 1873492 1837032 1802164 1769224 1738061 1707995 1679035 1651914
60781A651914k5064k3495k2174k1131k1697k4497k7448k7872k6076k4825k5454
$$ 1651914 1626850 1603355 1581181 1560050 1538353 1513856 1486408 1458536 1432460 1407635 1382181
60770A382181k6462k6042k4179k1765j9245j6792j4703j2910j0859q454o463n540
$$ 1382181 1355719 1329677 1305498 1283733 1264488 1247696 1232993 1220083 1209224 1200770 1194307 1188767
60758A188767n319m895l806k227n26J013K191K952L448L991M760N613O220O542
$$ 1188767 1183448 1178553 1174747 1172520 1171994 1173007 1175198 1178150 1181598 1185589 1190349 1195962 1202182 1208724
60744A208724O947P632Q262Q576R159J0735J2739J3619J2893J1962J2102J2394
$$ 1208724 1215671 1223303 1231565 1240141 1249300 1260035 1272774 1286393 1299286 1311248 1323350 1335744
60732A335744J0759O814K680P70J392K862L369K294N4k568m768o063o830q115
$$ 1335744 1346503 1353317 1355997 1356767 1358159 1361021 1364390 1366684 1366738 1364170 1359402 1353339 1346509 1338394
60718A338394j0270j2019j1770r775p887o991o012m098k458k787m824o811p733
$$ 1338394 1328124 1316105 1304335 1294560 1286673 1279682 1273670 1269572 1267114 1264327 1259503 1252692 1244959
60705A244959p779p152n940m919m958n628n646m702l638k891k030q40L20J287
$$ 1244959 1237180 1230028 1224088 1219169 1214211 1208583 1202937 1198235 1194597 1191706 1189676 1188836 1189156 1190443
60691A190443K102K392J898J489K231L663M423M467N065O539P758Q027P696O670
$$ 1190443 1192545 1194937 1196835 1198324 1200555 1204218 1208641 1213108 1218173 1224712 1232470 1240497 1248193 1254863
60677A254863M188P02j929k932l679n375p298q377r023j0162j1529j2119j1621
$$ 1254863 1259051 1259753 1257824 1254892 1251213 1245838 1238540 1230163 1221140 1210978 1199449 1187330 1175709
60664A175709j0619r928j0205j1402j2455j2459j2091j2518j3121j2241j0220
$$ 1175709 1165090 1155162 1144957 1133555 1121100 1108641 1096550 1084032 1070911 1058670 1048450
60653A048450r361j0297j0912r948r112j0136j1980j2804j2750j2815j2781j2275
$$ 1048450 1039089 1028792 1017880 1007932 998820 988684 976704 963900 951150 938335 925554 913279
60641I13279j2203j3046j3231j1408q955p887p630o393m523l777m099l968l398
$$ 913279 901076 888030 874799 863391 854436 846549 838919 832526 828003 824226 820127 816159 812761
60628H12761l691m422l520o18K232L558L948M117L745K873K540L259M434N672
$$ 812761 809070 804648 801128 800510 802742 806300 810248 814365 818110 820983 823523 826782 831216 836888
60614H36888P115Q240Q128P263P300Q601R945J0989J2907J5724J7317J6411J4682
$$ 836888 844003 852243 860371 867634 874934 883535 893480 904469 917376 933100 950417 966828 981510
60601I81510J4224J4506J3750J2185J1804J3276J5028J5522J5071J4908J5448
$$ 981510 995734 1010240 1023990 1036175 1047979 1061255 1076283 1091805 1106876 1121784 1137232
60590A137232J6054J6180J6173J6745J7814J8399J8005J7597J8298J9413J8886
$$ 1137232 1153286 1169466 1185639 1202384 1220198 1238597 1256602 1274199 1292497 1311910 1330796
60579A330796J5813J1439P357L935J029r39j588j672k506m590p419j0285j2594
$$ 1330796 1346609 1358048 1365405 1369340 1370369 1369430 1367842 1366170 1363664 1359074 1351655 1341370 1328776
60566A328776j3706j3260j1858j0876j1258j2516j3084j1813r237p161o776p431
$$ 1328776 1315070 1301810 1289952 1279076 1267818 1255302 1242218 1230405 1221168 1214007 1207231 1199800
60554A199800p561o402m405k290m41R86K090L273M620N460N331N165O503R486
$$ 1199800 1192239 1185837 1181432 1179142 1178701 1179687 1181777 1185050 1189670 1195130 1200461 1205626 1212129 1221615
60540A221615J2703J5090J6959J8907K0817K2429K4044K6028K8305L0698L3118
$$ 1221615 1234318 1249408 1266367 1285274 1306091 1328520 1352564 1378592 1406897 1437595 1470713
60529A470713L5020L5501L4399L2622L0859K8635K5037J9849J3540O883Q68l786
$$ 1470713 1505733 1541234 1575633 1608255 1639114 1667749 1692786 1712635 1726175 1733058 1733926 1730140
60517A730140p514j1452j5708j8993k0501k0973k1234k0958j9973j9549k0707
$$ 1730140 1722626 1711174 1695466 1676473 1655972 1634999 1613765 1592807 1572834 1553285 1532578
60506A532578k2095k1490j9010j7001j6679j6784j5874j4166j2395j0425q067
$$ 1532578 1510483 1488993 1469983 1452982 1436303 1419519 1403645 1389479 1377084 1366659 1358592
60495A358592o026m898m033k445k16K020M237O530Q146Q319P848Q425J0421J2648
$$ 1358592 1352566 1347668 1343635 1341190 1340974 1342994 1347231 1353761 1361907 1370226 1378074 1386499 1396920 1409568
60481A409568J4377J6231J8583K0517K1292K1743K3142K5372K7373K8951L0940
$$ 1409568 1423945 1440176 1458759 1479276 1500568 1522311 1545453 1570825 1598198 1627149 1658089
60470A658089L3768L7030M0574M4998N0775N7722O5565P4315Q3883R3875J04166
$$ 1658089 1691857 1728887 1769461 1814459 1865234 1922956 1988521 2062836 2146719 2240594 2344760
60459B344760J15072J26646J38358J49747J60792J71202J79716J84519J83937
$$ 2344760 2459832 2586478 2724836 2874583 3035375 3206577 3386293 3570812 3754749
60450C754749J76571J61547J39362J12290Q3447N5567L0774J0706l950j3784j9800
$$ 3754749 3931320 4092867 4232229 4344519 4427966 4483533 4514307 4525013 4521063 4507279 4487479
60439D487479k2422k2068k0505k0615k4290l0970l8487m4940m9387n1045m8736
$$ 4487479 4465057 4442989 4422484 4401869 4377579 4346609 4308122 4263182 4213795 4162750 4114014
60428D114014m1561k9960j5650k79J5632L2510N0880P0851R1894J12760J32076
$$ 4114014 4072453 4042493 4026843 4026564 4042196 4074706 4125586 4196437 4288331 4401091 4533167
60417D533167J49441J65256J78721J86884J87134J80373J70210J59102J47102
$$ 4533167 4682608 4847864 5026585 5213469 5400603 5580976 5751186 5910288 6057390
60408F057390J34682J24765J20792J24380J36024J56567J86237K23411K66394
$$ 6057390 6192072 6316837 6437629 6562009 6698033 6854600 7040837 7264248 7530642
60399G530642L15830L73369M38292N07436N78609O52222P28890Q06844Q82194
$$ 7530642 7846472 8219841 8658133 9165569 9744178 10396400 11125290 11932134 12814328
60390A2814328R50113J004313J035869J033687R86785Q87081P31979N26053K80921
$$ 12814328 13764441 14768754 15804623 16838310 17825095 18712176 19444155 19970208 20251129
60381B0251129J3285k57562n12047p32739r06820j027704j095330j115345j097223
$$ 20251129 20264414 20006852 19494805 18762066 17855246 16827542 15732212 14616867 13519644
60372A3519644j051686r88564r16001q40231p65218o92893o24477n61323n04148
$$ 13519644 12467958 11479394 10563393 9723162 8957944 8265051 7640574 7079251 6575103
60363F575103m52326m05101l62878l26210k94082k64700k37794k14607j95487
$$ 6575103 6122777 5717676 5354798 5028588 4734506 4469806 4232012 4017405 3821918
60354C821918j78952j63469j48918j35998j25318j17247j11321j05570r7985q9200
$$ 3821918 3642966 3479497 3330579 3194581 3069263 2952016 2840695 2735125 2637140 2547940
60344B547940q2089p8010p4965p0600o5312o0853n7257n3251m8919m5674m3589
$$ 2547940 2465851 2387841 2312876 2242276 2176964 2116111 2058854 2005603 1956684 1911010 1867421
60333A867421m0803l6207l1271k8351k8053k8923k9144k7973k5970k4334k3920
$$ 1867421 1826618 1790411 1759140 1730789 1702736 1673813 1644669 1616696 1590726 1566392 1542472
60322A542472k4621k5750k6766k7281k6797k5174k3349k2614k2903k2644k0839
$$ 1542472 1517851 1492101 1465335 1438054 1411257 1386083 1362734 1340120 1317217 1294573 1273734
60311A273734j8512j7329j7288j6794j4855j2279j0453r753r534r079q124o913
$$ 1273734 1255222 1237893 1220605 1203811 1188956 1176677 1166224 1156471 1146937 1137858 1129734 1122821
60299A122821o225o924q862j0588j0920j0483j0775j1864j2175j0807q845p722
$$ 1122821 1116596 1109672 1100810 1090222 1079302 1068819 1058044 1046180 1034005 1023198 1014353 1006631
60287A006631p323o644n481m309l070j468j42k24j541k505k073p55N67J796L061
$$ 1006631 999308 992664 987183 982874 979804 978336 978194 977970 976429 973924 971851 971096 971663 973459 976520
60272I76520M060M658N358O405P052O601N626N289N735O114N999N860N948N593
$$ 976520 980580 985238 990596 997001 1004053 1010654 1016280 1021569 1027304 1033418 1039417 1045277 1051225 1056818
60258A056818M119K070J016K123M812O927O551M085K095K537M356M760K813N28
$$ 1056818 1060937 1063007 1064023 1066146 1070958 1077885 1084436 1088521 1090616 1093153 1097509 1102269 1105082 1105610
60244A105610j40n3j378m056n534m153j230R69K052L277N323P668R917J2431J5392
$$ 1105610 1105470 1105417 1104039 1099983 1094449 1090296 1089066 1090035 1092087 1095364 1100687 1108355 1118272 1130703 1146095
60229A146095J8172K0036K1016K1673K2223K2059K0092J5862J0535O283M137K977
$$ 1146095 1164267 1184303 1205319 1226992 1249215 1271274 1291366 1307228 1317763 1324046 1328183 1331160
60217A331160J345m45j143q68q32r17M88L713O642P338O424N845O473Q062J0414
$$ 1331160 1332505 1332060 1330917 1330049 1329217 1328300 1328788 1332501 1339143 1346481 1352905 1358750 1365223 1373285 1383699
60202A383699J3153J5215J5959J6294J7528J9666K1951K4405K7542L1021L4062
$$ 1383699 1396852 1412067 1428026 1444320 1461848 1481514 1503465 1527870 1555412 1586433 1620495
60191A620495L6936M0726M5748N1344N7008O2639O7899P2515P7050Q2104Q6955
$$ 1620495 1657431 1698157 1743905 1795249 1852257 1914896 1982795 2055310 2132360 2214464 2301419
60180B301419R0221R1841R3153R4942R6565R7015R5643R1800Q5176P6804O8549
$$ 2301419 2391640 2483481 2576634 2671576 2768141 2865156 2960799 3052599 3137775 3214579 3283128
60169C283128O1159N3818M5793L7404K8896J9637R331p43q584j3254j5427j6396
$$ 3283128 3344287 3398105 3443898 3481302 3510198 3529835 3539166 3538423 3529839 3516585 3501158 3484762
60157C484762j6853j6460j4431j0565n543j61N234J0520J5851K2292L1137M1706
$$ 3484762 3467909 3451449 3437018 3426453 3420910 3420749 3425983 3436503 3452354 3474646 3505783 3547489
60145C547489N1191N8069O4277P2129Q0303Q5445Q6952Q7123Q6702Q3670P7235
$$ 3547489 3598680 3656749 3721026 3793155 3873458 3958903 4045855 4132978 4219680 4303350 4380585
60134D380585O9779O3082N5310M4010L0218J7203O203m335j5892k8085l9398m8171
$$ 4380585 4450364 4513446 4568756 4612766 4642984 4660187 4666390 4662055 4646163 4618078 4578680 4530509
60122D530509n3009n3650n1459m8226m4504l9548l2541k3233j1917O12J3435K6351
$$ 4530509 4477500 4423850 4372391 4324165 4279661 4240113 4207572 4184339 4172422 4173034 4186469 4212820
60110D212820L9799N3693O7060P9303R0837J01809J11223J18054J22451J24864
$$ 4212820 4252619 4306312 4373372 4452675 4543512 4645321 4756544 4874598 4997049 5121913
60100E121913J24910J22089J16961J10469J02526R2183P8786O2332M3236K2591
$$ 5121913 5246823 5368912 5485873 5596342 5698868 5791051 5869837 5932169 5975405 5997996
60090E997996K259j5992l1049m1841m7172m6941m2691l5907k6376j3173L302K1387
$$ 5997996 6000255 5984263 5953214 5911373 5864201 5817260 5774569 5738662 5712286 5699113 5702415 5723802
60078E723802L9805N8371P7349R6952J17139J37300J56488J74615J92789K11705
$$ 5723802 5763607 5821978 5899327 5996279 6113418 6250718 6407206 6581821 6774610 6986315
60068F986315K30204K46135K58138K65976K69831K70013K66658K59106K46325
$$ 6986315 7216519 7462654 7720792 7986768 8256599 8526612 8793270 9052376 9298701
60059I298701K28577K07453J83464J55167J22057Q6713N2021J7441j9259n7117
$$ 9298701 9527278 9734731 9918195 10073362 10195419 10282132 10334153 10351594 10332335 10275218
60049A0275218r1804j20665j45299j68120j88604k04382k14384k19109k18828
$$ 10275218 10183414 10062749 9917450 9749330 9560726 9356344 9141960 8922851 8704023
60040H704023k13293k03049j89604j74077j56317j35730j12618q8607o5650m4508
$$ 8704023 8490730 8287681 8098077 7924000 7767683 7631953 7519335 7430728 7365078 7320570
60030G320570k4326m002J6150L4442M9264N9941O6324O8376O6400O0950N2274
$$ 7320570 7296244 7292242 7308392 7342834 7392098 7452039 7518363 7586739 7653139 7714089 7766363
60019G766363M0394K6103J1256k430j4749k6762l9272n1704o2447p0249p5337
$$ 7766363 7806757 7832860 7844116 7841686 7826937 7800175 7760903 7709199 7646752 7576503 7501166
60008G501166p9061q2274q4176q3103p8400p1168o3118n4927m5900l5086k2562
$$ 7501166 7422105 7339831 7255655 7172552 7094152 7022984 6959866 6904939 6859039 6823953 6801391
59997F801391r581K477J3087K2302K9721L4336L5592L4250L1830K9467K7535K6040
$$ 6801391 6791810 6794287 6807374 6829676 6859397 6893733 6929325 6963575 6995405 7024872 7052407 7078447
59985G078447K4979K4296K3690K2457J9667J4684P645q47j0450k1105l2452m3723
$$ 7078447 7103426 7127722 7151412 7173869 7193536 7208220 7215865 7215018 7204568 7183463 7151011 7107288
59973G107288n4372o4454p4250q3840r3098j01782j09571j16243j21591j24917
$$ 7107288 7052916 6988462 6914212 6830372 6737274 6635492 6525921 6409678 6288087 6163170
59963F163170j25050j21639j15986j09705j02794r4009q2903p0357n7234m3863
$$ 6163170 6038120 5916481 5800495 5690790 5587996 5493987 5411084 5340727 5283493 5239630
59953E239630l0801j8678p029N320J8418L1147M3293N5990O9475Q2013R1887R9086
$$ 5239630 5208829 5190151 5183122 5188442 5206860 5238007 5281300 5337290 5406765 5488778 5580665 5679751
59941E679751J04203J07194J08089J07342J04245R6479Q2828O5145M6346K7564
$$ 5679751 5783954 5891148 5999237 6106579 6210824 6307303 6390131 6455276 6501622 6529186
59931F529186Q626r854k6686m1769n5997o9794q2594r3150r9653j00734r7344
$$ 6529186 6537812 6527958 6501272 6459503 6403506 6333712 6251118 6157968 6058315 5957581 5860237
59920E860237r2373q7225q0205o9626n6901m4597l2867k0152o338P134J9724L1910
$$ 5860237 5767864 5680639 5600434 5530808 5473907 5429310 5396443 5376291 5369953 5377087 5396811 5428721
59908E428721M3333N2985O1174O9048P6294Q1282Q3536Q4103Q3410Q0759P6116
$$ 5428721 5472054 5525039 5586213 5655261 5731555 5812837 5896373 5980476 6063886 6144645 6220761
59897F220761P0644O5232N9896N4647M9422M3363L5993K9068K5380K5659K8415
$$ 6220761 6291405 6356637 6416533 6471180 6520602 6563965 6599958 6629026 6654406 6680065 6708480
59886F708480L2770L9463M8833N9977P2481Q7211J04786J24802J46924J71171
$$ 6708480 6741250 6780713 6829546 6889523 6962004 7049215 7154001 7278803 7425727 7596898
59876G596898J96612K21329K44022K64182K80556K91260K95786K94905K87989
$$ 7596898 7793510 8014839 8258861 8523043 8803599 9094859 9390645 9685550 9973539
59867I973539K72332K45976K09452J64024J10203M9386j4575p6936j34335j84727
$$ 9973539 10245871 10491847 10701299 10865323 10975526 11024912 11010337 10933401 10799066 10614339
59857A0614339k26433k58533k81425k95863l01879k99341k88972k72403k51824
$$ 10614339 10387906 10129373 9847948 9552085 9250206 8950865 8661893 8389490 8137666
59848H137666k29676k07577j85246j61440j36111j10525q5301n9994l4942j1697
$$ 8137666 7907990 7700413 7515167 7353727 7217616 7107091 7021790 6961796 6926854 6915157
59838F915157R104K8675M7939O5826Q0651R1834R9248J02085R9506R1540P8394
$$ 6915157 6924261 6952936 7000875 7066701 7147352 7239186 7338434 7440519 7540025 7631565 7709959
59827G709959N9708L5310O013k6832o1744r6601j28900j57130j81048k00347k14282
$$ 7709959 7769667 7804977 7810990 7784158 7722414 7625813 7496913 7339783 7158735 6958388 6744106
59816F744106k22972k27598k28759k26026k19652k11114k01333j89957j77283
$$ 6744106 6521134 6293536 6064777 5838751 5619099 5407985 5206652 5016695 4839412
59807D839412j64955j53701j42082j28968j15602j03626r2475q0543o7978n6510
$$ 4839412 4674457 4520756 4378674 4249706 4134104 4030478 3938003 3857460 3789482 3732972
59797C732972m7315m0493l5856l2782k9953k6676k3852k2439k1767k0627j9139
$$ 3732972 3685657 3645164 3609308 3576526 3546573 3519897 3496045 3473606 3451839 3431212 3412073
59786C412073j8052j6932j4687j1387q017m921k027l27j415n429j0736j5895k0932
$$ 3412073 3394021 3377089 3362402 3351015 3342998 3338077 3336050 3335723 3334308 3328879 3318143 3302248 3281316
59773C281316k6449l2327l7617m1367m3481m4664m5252m4370m1246l7113l4221
$$ 3281316 3254867 3222540 3184923 3143556 3100075 3055411 3010159 2965789 2924543 2887430 2853209
59762B853209l2582k9656k4012j7384j1770o487MP006J2691J7206K2244K8103
$$ 2853209 2820627 2790971 2766959 2749575 2737805 2731318 2731322 2738328 2751019 2768225 2790469 2818572
59750B818572L3460L7769M1733M5543M8660N1281N4066N6272N6145N3437M9894
$$ 2818572 2852032 2889801 2931534 2977077 3025737 3077018 3131084 3187356 3243501 3296938 3346832
59739C346832M6769M3489L9218L4455L0481K8280K8293L0240L3144L6488M1323
$$ 3346832 3393601 3437090 3476308 3510763 3541244 3569524 3597817 3628057 3661201 3697689 3739012
59728C739012M9010N9018O9365P9238Q9623J01166J12951J23885J33904J43367
$$ 3739012 3788022 3847040 3916405 3995643 4085266 4186432 4299383 4423268 4557172 4700539
59718D700539J52657J62884J75522J90723K07106K23627K39922K53962K60941
$$ 4700539 4853196 5016080 5191602 5382325 5589431 5813058 6052980 6306942 6567883
59709F567883K56075K37627K06175J62263J06811M3396k1754q2438j34239j74057
$$ 6567883 6823958 7061585 7267760 7430023 7536834 7580230 7558476 7476038 7341799 7167742
59699G167742j99790k11389k11231k02457j87329j67481j44970j21975r9665p8278
$$ 7167742 6967952 6756563 6545332 6342875 6155546 5988065 5843095 5721120 5621455 5543177
59689E543177n8170l9819k2606m839J4199L3044M9820O4597P8992R3937J09245
$$ 5543177 5485007 5445188 5422582 5417743 5431942 5464986 5514806 5579403 5658395 5752332 5861577
59678E861577J25045J42095J60347J78696J96651K14947K33966K52989K71792
$$ 5861577 5986622 6128717 6289064 6467760 6664411 6879358 7113324 7366313 7638105
59669G638105K91753L14150L38362L62856L87083M11427M36075M61040M86404
$$ 7638105 7929858 8244008 8582370 8945226 9332309 9743736 10179811 10640851 11127255
59660A1127255N11163N32630N48270N57707N61827N60633N53344N40024N21875
$$ 11127255 11638418 12171048 12719318 13277025 13838852 14399485 14952829 15492853 16014728
59651A6014728N00610M78945M60876M49384M44054M42615M44456M50676M60772
$$ 16014728 16515338 16994283 17455159 17904543 18348597 18791212 19235668 19686344 20147116
59642B0147116M71450M78997M80827M74408M57042M27892L88519L40410K83597
$$ 20147116 20618566 21097563 21578390 22052798 22509840 22937732 23326251 23666661 23950258
59633B3950258K18934J50186Q2434J9391l6469q2423j16055j36702j44821j40370
$$ 23950258 24169192 24319378 24401812 24421203 24384734 24302311 24186256 24049554 23904733 23764363
59623B3764363j23304r5369n9635j7833L0579Q6204J47574K11731K76253L40177
$$ 23764363 23641059 23545690 23486055 23468222 23498801 23585005 23732579 23944310 24220563 24560740
59613B4560740M03332M65186N23750N75109O14325O37323O41621O24886N83440
$$ 24560740 24964072 25429258 25953008 26528117 27142442 27779765 28421386 29046272 29629712
59604B9629712N13417M13653K86833J37853k7534k01637l73655n31724o66886
$$ 29629712 30143129 30556782 30843615 30981468 30953934 30752297 30378642 29846918 29180032
59595B9180032p74615q53158r02127r23262r20885r00146q65310q20488p71191
$$ 29180032 28405417 27552259 26650132 25726870 24805985 23905839 23040529 22220041 21448850
59586B1448850p23761o83245o52636o33825o28084o35233o52664o75283o96330
$$ 21448850 20725089 20041844 19389208 18755383 18127299 17492066 16839402 16164119 15467789
59577A5467789p09249p10086o98608o76890o47162o11455n72459n33196m95392
$$ 15467789 14758540 14048454 13349846 12672956 12025794 11414339 10841880 10308684 9813292
59568I813292m58860m22856l87594l54172l23499k95608k69858k45631k22845
$$ 9813292 9354432 8931576 8543982 8189810 7866311 7570703 7300845 7055214 6832369
59559F832369k01874j83108j66757j52862j40980j30071j19296j09030j00239
$$ 6832369 6630495 6447387 6280630 6127768 5986788 5856717 5737421 5628391 5528152
59550E528152r2999q6704q1766p9531p9921q0787q0764q1247q3993q8011r0734
$$ 5528152 5435153 5348449 5266683 5187152 5107231 5026444 4945680 4864433 4780440 4692429 4601695
59539D601695r1361r1010r0137q8109q5194q2617q0186p5959o9174o1775n5963
$$ 4601695 4510334 4419324 4329187 4241078 4155884 4073267 3993081 3917122 3847948 3786173 3730210
59528C730210n1509m6558m0113l2725k5459j9213j4484j0976p613l553J031N421
$$ 3730210 3678701 3632143 3592030 3559305 3533846 3514633 3500149 3489173 3481560 3478007 3479038 3484459
59516C484459R227J2534J5689J9145K3035K6675K9051L0113L1043L2925L5648
$$ 3484459 3493686 3506220 3521909 3541054 3564089 3590764 3619815 3649928 3680971 3713896 3749544
59505C749544L8515M1410M4945M9614N5230O1207O7195P3497Q0727Q8939R7328
$$ 3749544 3788059 3829469 3874414 3924028 3979258 4040465 4107660 4181157 4261884 4350823 4448151
59494D448151J05258J13354J23050J34965J48194J61240J73285J84557J95649
$$ 4448151 4553409 4666763 4789813 4924778 5072972 5234212 5407497 5592054 5787703
59485E787703K06561K16317K23791K29048K33205K36587K37688K34798K28199
$$ 5787703 5994264 6210581 6434372 6663420 6896625 7133212 7370900 7605698 7833897
59476G833897K19768K10543J99679J85995J69843J53169J37955J24533J11273
$$ 7833897 8053665 8264208 8463887 8649882 8819725 8972894 9110849 9235382 9346655
59467I346655R6055P8380N9859M2878K9502K1650K0662K5721L3854M2711N2531
$$ 9346655 9442710 9521090 9580949 9623827 9653329 9674979 9695641 9721362 9755216 9797927 9850458
59456I850458O4164P6150Q5149Q8511Q4892P3317N3688K7811k263l6824p7383
$$ 9850458 9914622 9990772 10075921 10164432 10249324 10322641 10376329 10404140 10401877 10365053 10287670
59445A0287670j22882j68965k11398k48378k79267l03267l20228l30849l35014
$$ 10287670 10164788 9995823 9784425 9536047 9256780 8953513 8633285 8302436 7967422
59436G967422l31414l19899l02906k83505k63206k42393k21544k00829j79790
$$ 7967422 7636008 7316109 7013203 6729698 6466492 6224099 6002555 5801726 5621936
59427E621936j58638j38933j21752j06010q9833p3039n7032m2720k9570j6493
$$ 5621936 5463298 5324365 5202613 5096603 5006770 4933731 4876699 4833979 4804409 4787916
59417D787916k894J1117K4926L8028N0628O3301P6058Q8624J01611J16067J31280
$$ 4787916 4785022 4796139 4821065 4859093 4909721 4973022 5049080 5137704 5239315 5355382 5486662
59406E486662J44484J53803J60350J66114J70742J71857J67930J59163J45801
$$ 5486662 5631146 5784949 5945299 6111413 6282155 6454012 6621942 6781105 6926906
59397F926906J27252J03301P4951M3485R488k6549o3084r7602j27994j53706j75471
$$ 6926906 7054158 7157459 7232410 7275895 7285383 7258834 7195750 7098148 6970154 6816448 6640977
59386F640977j93758k07639k15614k17597k15496k11443k05885j97944j87333
$$ 6640977 6447219 6239580 6023966 5806369 5590873 5379430 5173545 4975601 4788268
59377D788268j75223j63206j51934j40995j29856j18574j07556r6964q6731p7083
$$ 4788268 4613045 4449839 4297905 4156910 4027054 3908480 3800924 3703960 3617229 3540146
59367C540146o8421o0514n2526m4297l6935l1250k6305k0500j3730p295j837L271
$$ 3540146 3471725 3411211 3358685 3314388 3277453 3246203 3219898 3199398 3185668 3178373 3176536 3179807
59355C179807Q470J3438J8236K3682K9848L5389L9320M2626M7106N3046N8807
$$ 3179807 3188277 3201715 3219951 3243633 3273481 3308870 3348190 3390816 3437922 3490968 3549775
59344C549775O2455O3197O1622N9282N8067N9423O3799P0645P8800Q7258R5902
$$ 3549775 3612230 3675427 3737049 3796331 3854398 3913821 3977620 4048265 4127065 4214323 4310225
59333D310225J05322J15424J24651J31415J36160J41216J48645J59005J72011
$$ 4310225 4415547 4530971 4655622 4787037 4923197 5064413 5213058 5372063 5544074
59324E544074J87379K04830K24206K45814K69941K95996L22917L50319L78220
$$ 5544074 5731453 5936283 6160489 6406303 6676244 6972240 7295157 7645476 8023696
59315H023696M05750M31355M54357M74945M92222N03666N07261N03057M91943
$$ 8023696 8429446 8860801 9315158 9790103 10282325 10785991 11293252 11796309 12288252
59306A2288252M74044M49370M19320L86467L53034L20163K88291K57637K28361
$$ 12288252 12762296 13211666 13630986 14017453 14370487 14690650 14978941 15236578 15464939
59297A5464939K00488J73587J46589J18238Q7653N4341J8283j9254n5731q9169
$$ 15464939 15665427 15839014 15985603 16103841 16191494 16245835 16264118 16244864 16189133 16099964
59287A6099964j19571j47475j71873j91109k05301k16107k24433k30346k35033
$$ 16099964 15980393 15832918 15661045 15469936 15264635 15048528 14824095 14593749 14358716
59278A4358716k40446k46700k52104k56320k61142k67210k72442k75018k75821
$$ 14358716 14118270 13871570 13619466 13363146 13102004 12834794 12562352 12287334 12011513
59269A2011513k76405k76545k75563k74255k73426k71769k67331k60205k52023
$$ 12011513 11735108 11458563 11183000 10908745 10635319 10363550 10096219 9836014 9583991
59260I583991k43456k34006k23543k12418k00597j88141j75932j64524j52844
$$ 9583991 9340535 9106529 8882986 8670568 8469971 8281830 8105898 7941374 7788530
59251G788530j39547j25191j11645r9717q8745p8177o8138n8553m9068l9827l1327
$$ 7788530 7648983 7523792 7412147 7312430 7223685 7145508 7077370 7018817 6969749 6929922 6898595
59240F898595k3591j6176q910j976M380R849J4453J9484K6960L7175M7678N5865
$$ 6898595 6875004 6858828 6849918 6847942 6852322 6862171 6876624 6896108 6923068 6960243 7007921 7063786
59228G063786O1652O6537P1018P4474P6821P8528P9350P8477P5760P1606O6113
$$ 7063786 7125438 7191975 7262993 7337467 7414288 7492816 7572166 7650643 7726403 7798009 7864122
59217G864122N9636N3528M8611M3301L5180K4533J4444O852N5r068k1548l5904
$$ 7864122 7923758 7977286 8025897 8069198 8104378 8128911 8143355 8150207 8150262 8141194 8119646 8083742
59205H083742n0463o5135q1060r8967j17957j35896j51116j63480j73510j80975
$$ 8083742 8033279 7968144 7887084 7788117 7670160 7534264 7383148 7219668 7046158 6865183
59195F865183j84918j84854j81278j75054j66772j56727j45172j32479j19117
$$ 6865183 6680265 6495411 6314133 6139079 5972307 5815580 5670408 5537929 5418812
59186E418812j05388r1417p7725o5436n5023m5052l3347j9416m688R733K4133
$$ 5418812 5313424 5222007 5144282 5078846 5023823 4978771 4945424 4926008 4921320 4931053 4955186
59175D955186L8876N3629O8482Q4271J01120J18186J35456J53893J72889J89681
$$ 4955186 4994062 5047691 5116173 5200444 5301564 5419750 5555206 5709099 5881988 6071669
59165F071669K02765K13892K24961K34955K42339K48873K58130K70853K84134
$$ 6071669 6274434 6488326 6713287 6948242 7190581 7439454 7697584 7968437 8252571
59156H252571K94528K99574K96871K84411K62233K31823J93824J48131R6144M1029
$$ 8252571 8547099 8846673 9143544 9427955 9690188 9922011 10115835 10263966 10360110 10401139
59146A0401139j4373o8190j18262j62104j98401k26808k46274k55434k54939k47698
$$ 10401139 10386766 10318576 10200314 10038210 9839809 9613001 9366727 9111293 8856354 8608656
59136H608656k36332k21810k04684j85962j66375j46285j26748j09189r3585p8478
$$ 8608656 8372324 8150514 7945830 7759868 7593493 7447208 7320460 7211271 7117686 7039208
59126G039208o3224m8962l6730k6049j5977o575J260O628R007Q704P036N068K125
$$ 7039208 6975984 6927022 6890292 6864243 6848266 6841691 6842951 6849579 6858586 6867290 6874326 6879394 6881519
59113F881519l295j1261k0344k9772l9903n0217n8740o4440o8711p3428p8560
$$ 6881519 6878224 6866963 6846619 6816847 6776944 6726727 6667987 6603547 6534836 6461408 6382848
59102F382848q2689q4872q4893q2600p8286p3277o8839o4513n8536n0185m1027
$$ 6382848 6300159 6215287 6130394 6047794 5969508 5896231 5827392 5762879 5704343 5654158 5613131
59091E613131l3302k7449k1823j4949p363p07M547R363J4330J8879K2799K7211
$$ 5613131 5579829 5552380 5530557 5515608 5508245 5507538 5512085 5521448 5535778 5554657 5577456 5604667
59079E604667L3149M0151M7055N3309N8595O2385O4932O7716P1428P4550P5424
$$ 5604667 5637816 5677967 5725022 5778331 5836926 5899311 5964243 6031959 6103387 6177937 6253361
59068F253361P4805P4663P5134P4479P1534O6529N9880N2016M4079L7055L0397
$$ 6253361 6328166 6402829 6477963 6552442 6623976 6690505 6750385 6802401 6846480 6883535 6913932
59057F913932K3119J5806R845N187R57k175k577n85J629L330N948J0024J3838
$$ 6913932 6937051 6952857 6962702 6967889 6968846 6966671 6964094 6963509 6965138 6968468 6974416 6984440 6998278
59044F998278J5919J6781J7078J5997J2633P285Q4j0298k5352m5079o8379r3975
$$ 6998278 7014197 7030978 7048056 7064053 7076686 7083971 7084055 7073757 7048405 7003326 6934947 6840972
59032F840972j20301j45654j69153j90523k08584k21449k28723k31985k32382
$$ 6840972 6720671 6575017 6405864 6215341 6006757 5785308 5556585 5324600 5092218
59023E092218k29306k22412k13191k03241j92362j79791j66303j53548j42043
$$ 5092218 4862912 4640500 4427309 4224068 4031706 3851915 3685612 3532064 3390021
59014C390021j31149j20588j10785j01932r3767q6136p9263p3465o8839o4895
$$ 3390021 3258872 3138284 3027499 2925567 2831800 2745664 2666401 2592936 2524097 2459202
59004B459202o0487n4718m8118m2277l8121l5237l2798l0387k7861k5321k3234
$$ 2459202 2398715 2343997 2295879 2253602 2215481 2180244 2147446 2117059 2089198 2063877 2040643
58993B040643k1775k0234j8081j6183j5617j5615j4479j2287j0708j0072q795
$$ 2040643 2018868 1998634 1980553 1964370 1948753 1933138 1918659 1906372 1895664 1885592 1876797
58982A876797o186l417r70K467P386J1926J4535J6127J7943J9114J8411J6862
$$ 1876797 1870611 1867194 1866224 1868691 1876077 1888003 1902538 1918665 1936608 1955722 1974133 1990995
58970A990995J6329J6588J6130J5077J4936J5773J5834J4192J1943J0457R746
$$ 1990995 2007324 2023912 2040042 2055119 2070055 2085828 2101662 2115854 2127797 2138254 2148000
58959B148000Q886O882L011k565q266j2130j3592j3522j2546j0420p204l972j700
$$ 2148000 2156886 2163768 2166779 2164214 2155948 2143818 2130226 2116704 2104158 2093738 2086534 2082562 2080862
58946B080862k02J262K715L432K959J571l53k929o444j0617j4590j7692j9862
$$ 2080862 2080660 2081922 2084637 2088069 2091028 2092599 2092246 2089317 2082873 2072256 2057666 2039974 2020112
58933B020112k1223k1818k1992k2449k3282k3347k1301j7095j1963p245l719j567
$$ 2020112 1998889 1977071 1955079 1932630 1909348 1886001 1864700 1847605 1835642 1828397 1824678 1823111
58921A823111j34J935N421R560J3062J5758J8443K1433K4339K6926K9259L1189
$$ 1823111 1822977 1824912 1830333 1839893 1852955 1868713 1887156 1908589 1932928 1959854 1989113 2020302
58909B020302L2637L4062L5700L6791L6733L6409L7013L8033L7969L6702L5486
$$ 2020302 2052939 2087001 2122701 2159492 2196225 2232634 2269647 2307680 2345649 2382351 2417837
58898B417837L4710L3596L2090L1337L1994L3687L6328M0315M5149M9555N3282
$$ 2417837 2452547 2486143 2518233 2549570 2581564 2615251 2651579 2691894 2737043 2786598 2839880
58887B839880N7197O1337O4586O6667O8740P1609P5048P9167Q4636R0984R6649
$$ 2839880 2897077 2958414 3023000 3089667 3158407 3230016 3305064 3384231 3468867 3559851 3656500
58876C656500J01332J06580J13337J20846J28702J37961J49139J60882J71842
$$ 3656500 3757832 3864412 3977749 4098595 4227297 4365258 4514397 4675279 4847121
58867D847121J82353J93286K04781K17185K31611K48471K66728K85603L05606
$$ 4847121 5029474 5222760 5427541 5644726 5876337 6124808 6391536 6677139 6982745
58858F982745L27104L49397L72164L96213M21842M47931M73499M98293N20974
$$ 6982745 7309849 7659246 8031410 8427623 8849465 9297396 9770895 10269188 10790162
58849A0790162N38689N49655N54112N51351N37960N10855M70192M17297L51542
$$ 10790162 11328851 11878506 12432618 12983969 13521929 14032784 14502976 14920273 15271815
58840A5271815K71864J80295Q1792j8621j16819k08799k91215l62416m21540m67391
$$ 15271815 15543679 15723974 15805766 15787145 15670326 15461527 15170312 14807896 14386356 13918965
58830A3918965m99620n19938n30444n31570n23460n08351m89501m68324m44539
$$ 13918965 13419345 12899407 12368963 11837393 11313933 10805582 10316081 9847757 9403218
58821I403218m18796l93120l68779l45420l22591l00779k80804k63115k47670
$$ 9403218 8984422 8591302 8222523 7877103 7554512 7253733 6972929 6709814 6462144
58812F462144k33771k20241k06517j93215j81003j69466j57752j45659j33456
$$ 6462144 6228373 6008132 5801615 5608400 5427397 5257931 5100179 4954520 4821064
58803D821064j21516j10759j02378r6227r0493q4017p7715p2658o7977o2168n5409
$$ 4821064 4699548 4588789 4486411 4390184 4299691 4215674 4137959 4065301 3997324 3935156 3879747
58792C879747m8863m2386l4765k5935j7373j0241m208J772Q243J4816K0641K5587
$$ 3879747 3830884 3788498 3753733 3727798 3710425 3700184 3695976 3697748 3705991 3720807 3741448 3767035
58780C767035L0994L8369M7232N5524O2381O9111P6925Q5436R4215J03966J14984
$$ 3767035 3798029 3836398 3883630 3939154 4001535 4070646 4147571 4233007 4327222 4431188 4546172
58769D546172J25984J35840J45241J55490J66894J79354J93009K07224K20669
$$ 4546172 4672156 4807996 4953237 5108727 5275621 5454975 5647984 5855208 6075877
58760F075877K33621K48410K66150K85053L03592L23222L45818L70310L94422
$$ 6075877 6309498 6557908 6824058 7109111 7412703 7735925 8081743 8452053 8846475
58751H846475M18093M42408M66256M86954N03454N16071N23385N22058N09813
$$ 8846475 9264568 9706976 10173232 10660186 11163640 11679711 12203096 12725154 13234967
58742A3234967M86442M51628M03804L41623K65503J77783Q2444j5740j12876k06507
$$ 13234967 13721409 14173037 14576841 14918464 15183967 15361750 15444194 15428454 15315578 15109071
58732A5109071k93894l70991m34391m83310n18542n40698n50808n51212n44066
$$ 15109071 14815177 14444186 14009795 13526485 13007943 12467245 11916437 11365225 10821159
58723A0821159n30148n10552m87994m64563m39730m12679l85100l59411l35635
$$ 10821159 10291011 9780459 9292465 8827902 8388172 7975493 7590393 7230982 6895347
58714F895347l12597k90846k71679k54369k37282k21029k07652j97247j88040
$$ 6895347 6582750 6291904 6020225 5765856 5528574 5307545 5099893 4902646 4714606
58705D714606j79177j70651j61164j49119j35625j23581j13753j04358r4511q5382
$$ 4714606 4535429 4364778 4203614 4054495 3918870 3795289 3681536 3577178 3482667 3397285
58695C397285p7743p0998o4804n9186n2942m4448l4397k5331j8300j2304p074
$$ 3397285 3319542 3248544 3183740 3124554 3071612 3027164 2992767 2967436 2949136 2936832 2929758
58684B929758l580j312K092P357J1986J3234J0919O418O39o047j3323k1097k9156
$$ 2929758 2926178 2924866 2926958 2934315 2946301 2959535 2970454 2976872 2977511 2971464 2958141 2937044 2907888
58671B907888l6381m1561m4943m7617m9623n0354n0551n1753n3813n5041n5107
$$ 2907888 2871507 2829946 2785003 2737386 2687763 2637409 2586858 2535105 2481292 2426251 2371144
58660B371144n5680n7766o0356o2188o3041o2699o0496n6584n2305m8768m6166
$$ 2371144 2315464 2257698 2197342 2135154 2072113 2009414 1948918 1892334 1840029 1791261 1745095
58649A745095m4616m4086m3371m0693l5872l0720k7065k5282k4572k3629k1368
$$ 1745095 1700479 1656393 1613022 1572329 1536457 1505737 1478672 1453390 1428818 1405189 1383821
58638A383821j8209j6073j6061j6940j7198j7228j7616j6900j3722r920q398q644
$$ 1383821 1365612 1349539 1333478 1316538 1299340 1282112 1264496 1247596 1233874 1223954 1215556 1206912
58626A206912p668m968k978k597j852L30K494L670M914O660P424O526N570N872
$$ 1206912 1199244 1194276 1191298 1188701 1186849 1187179 1189673 1193343 1198257 1204917 1212341 1218867 1224437 1230309
58612A230309O692P286Q436J0501J2019J1725J0286Q873P542O015M484K700k6
$$ 1230309 1237001 1244287 1252723 1263224 1275243 1286968 1297254 1306127 1313669 1319684 1324168 1326868 1326842
58599A326842l217n276n924o788q770j0672j1363j1483j1934j2374j2190j1460
$$ 1326842 1323625 1318349 1312425 1305637 1296867 1286195 1274832 1263349 1251415 1239041 1226851 1215391
58587A215391j0021p136k970J027M044O708R430J1576J3052J4960J7756K0409
$$ 1215391 1205370 1198234 1195264 1196291 1200335 1207043 1216473 1228049 1241101 1256061 1273817 1294226
58575A294226K2270K4257K7246L0719L3855L6601L9002M0943M3236M7234N2611
$$ 1294226 1316496 1340753 1367999 1398718 1432573 1469174 1508176 1549119 1592355 1639589 1692200
58564A692200N7252O0402O4160P0587P8765Q6328R2774R9730J08447J18287J27558
$$ 1692200 1749452 1809854 1874014 1944601 2023366 2109694 2202468 2302198 2410645 2528932 2656490
58553B656490J35091J41132J46851J52738J57571J59417J57356J51505J41854
$$ 2656490 2791581 2932713 3079564 3232302 3389873 3549290 3706646 3858151 4000005
58544D000005J28063J10011Q7512O0182K8804l786l4617o2671q7747j08288j22497
$$ 4000005 4128068 4238079 4325591 4385773 4414577 4410791 4376174 4313503 4225756 4117468 3994971
58533C994971j30884j35493j36971j34654j29136j22328j15059j06750r7399q7822
$$ 3994971 3864087 3728594 3591623 3456969 3327833 3205505 3090446 2983696 2886297 2798475
58523B798475p8198o8450n9632n2542m5600l6700k6911j9395j4925j1393p640
$$ 2798475 2720277 2651827 2592195 2539653 2494053 2457353 2430442 2411047 2396122 2384729 2377089
58512B377089m549k161J054N374R246J2198J5507J9261K1438K0663J7350J1686
$$ 2377089 2372540 2370379 2371433 2376807 2386053 2398251 2413758 2433019 2454457 2475120 2492470 2504156
58500B504156L122p643j8878l0576m4145n8866p1575q0413q6044q8723q7447q2879
$$ 2504156 2507278 2499635 2480757 2450181 2406036 2347170 2275595 2195182 2109138 2020415 1932968 1850089
58488A850089p7769p3283o7878o0920n4383m9751m6149m2758m0194l8216l5022
$$ 1850089 1772320 1699037 1631159 1570239 1515856 1466105 1419956 1377198 1337004 1298788 1263766
58477A263766l0253k5883k2856j9677j5795j3377j3827j5190j4960j3315j1861
$$ 1263766 1233513 1207630 1184774 1165097 1149302 1135925 1122098 1106908 1091948 1078633 1066772
58466A066772j1059j0370r309p394m737l013l775n635n700l886k769l046k699
$$ 1066772 1055713 1045343 1036034 1028640 1023903 1020890 1017115 1011480 1005780 1001894 999125 996079 993380
58453I93380j131l14q14n39J265K553K489L236N991Q755R955J0910J2802J4432
$$ 993380 992249 991935 991121 990582 991847 994400 996889 1000125 1006116 1014871 1024826 1035736 1048538 1062970
58439A062970J4858J5267J6404J7261J7831J9958K3818K6871K7936K8797L0207
$$ 1062970 1077828 1093095 1109499 1126760 1144591 1164549 1188367 1215238 1243174 1271971 1302178
58428A302178K9998K7066K3490K0632J6779J0839M668m55n910j2082j6575j8589
$$ 1302178 1332176 1359242 1382732 1403364 1420143 1430982 1435650 1435195 1429285 1417203 1400628 1382039
58416A382039k1152k6150l0991l3026l3470l3889l2759k8974k5150k3730k3001
$$ 1382039 1360887 1334737 1303746 1270720 1237250 1203361 1170602 1141628 1116478 1092748 1069747
58405A069747k0456j7077j4771j2648r440o678n925n585l848j999j476n48K487
$$ 1069747 1049291 1032214 1017443 1004795 995355 988677 982752 977167 973319 971320 969844 969296 971783
58392I71783N583O093N094N083N915O379P245R345J1134J1382J1652J3042J3531
$$ 971783 977366 983459 988553 993636 999551 1005930 1013175 1022520 1033654 1045036 1056688 1069730 1083261
58379A083261J1885J1007J3485J6883J7539J6222J5692J5303J2524P825L702M89
$$ 1083261 1095146 1106153 1119638 1136521 1154060 1170282 1185974 1201277 1213801 1221626 1225328 1225817
58367A225817l044o605r370j2175j5400j6789j4801j1860j0915j1003r607o874
$$ 1225817 1222773 1216168 1206798 1194623 1179223 1162434 1147633 1135773 1124858 1113855 1104248 1097374
58355A097374m104o74L810O961P016O279P434R256R848J1079J5172J9608K0284
$$ 1097374 1093270 1092596 1096406 1103367 1110383 1116662 1124096 1133352 1143200 1154279 1169451 1189059 1209343
58342A209343J7757J5510J3938J0747N952J878q20l359n932p890r494j0637r761
$$ 1209343 1227100 1242610 1256548 1267295 1273247 1275125 1274305 1270946 1265014 1257124 1247630 1236993 1227232
58329A227232o757m555m975n706m314k097p00J533N974R938J0621R553R067P870
$$ 1227232 1220475 1215920 1210945 1205239 1200925 1198828 1198128 1199661 1205635 1215573 1226194 1235747 1244814 1252684
58315A252684M531J792K555M828N373N103O209P466P365Q267J2070J5472J5110
$$ 1252684 1257215 1259007 1261562 1266390 1271763 1276866 1283075 1290541 1297906 1306173 1318243 1333715 1348825
58302A348825J3736J5326J7630J6128J2301J1149J3055J4734J5928J8524K1111
$$ 1348825 1362561 1377887 1395517 1411645 1423946 1435095 1448150 1462884 1478812 1497336 1518447
58291A518447K1006J9805K0729K2236K0536J6424J3531J1684Q297M412L075L374
$$ 1518447 1539453 1559258 1579987 1602223 1622759 1639183 1652714 1664398 1672695 1677107 1680182 1683556
58279A683556K293P26J681M228N210N069O271Q024Q385R165J2756J6702J7565
$$ 1683556 1685849 1686575 1688256 1692484 1697694 1702763 1709034 1717058 1725443 1734608 1747364 1764066 1781631
58266A781631J7404K0029K3731K4448K3389K4496K7126K8196K8799L1649L4798
$$ 1781631 1799035 1819064 1842795 1867243 1890632 1915128 1942254 1970450 1999249 2030898 2065696
58255B065696L5135L4977L7840M1032M0176L7537L7560L7835L3602K7668K6175
$$ 2065696 2100831 2135808 2173648 2214680 2254856 2292393 2329953 2367788 2401390 2429058 2455233
58244B455233K7488K5373K0789K0078K3418K5381K5574K8434L3466L5793L5611
$$ 2455233 2482721 2508094 2528883 2548961 2572379 2597760 2623334 2651768 2685234 2721027 2756638
58233B756638L7448M0993M2227M2452M6382N2511N5294N5715N9585O6584P1177
$$ 2756638 2794086 2835079 2877306 2919758 2966140 3018651 3073945 3129660 3189245 3255829 3327006
58222C327006P3201P7286Q3102Q6637Q9628R6868J05711J09457J09659J13444
$$ 3327006 3400207 3477493 3560595 3647232 3736860 3833728 3939439 4048896 4158555 4271999
58212D271999J20036J21981J18568J15731J13668J07296R8139R2757Q9951Q2787
$$ 4271999 4392035 4514016 4632584 4748315 4861983 4969279 5067418 5160175 5250126 5332913
58202E332913P3003O9858P4675Q0196Q5225R5807J11269J23566J31644J42693
$$ 5332913 5405916 5475774 5550449 5630645 5715870 5811677 5922946 6046512 6178156 6320849
58192F320849J58064J71740J83628K00351K21887K41230K58000K78524L02517
$$ 6320849 6478913 6650653 6834281 7034632 7256519 7497749 7755749 8034273 8336790
58183H336790L24142L45609L74462M08160M37591M64796N00065N42586N82452
$$ 8336790 8660932 9006541 9381003 9789163 10226754 10691550 11191615 11734201 12316653
58174A2316653O20931O68920P25450P78326Q26541Q80819R41145R95984J045243
$$ 12316653 12937584 13606504 14331954 15110280 15936821 16817640 17758785 18754769 19800012
58165A9800012J101519J166992J232481J300788J385749J485538J582568J672802
$$ 19800012 20901531 22068523 23301004 24601792 25987541 27473079 29055647 30728449
58157C0728449J769091J873352J974289K076162K199827K350634K515152K692844
$$ 30728449 32497540 34370892 36345181 38421343 40621170 42971804 45486956 48179800
58149D8179800K898133L128049L364453L613557L905871M253175M647827N109462
$$ 48179800 51077933 54205982 57570435 61183992 65089863 69343038 73990865 79100327
58141G9100327N685557O399671P251649Q276164R538373J1052885J2764883J4624358
$$ 79100327 84785884 91185555 98437204 106713368 116251741 127304626 140069509 154693867
58133A54693867J6617155J8732777K1017331K3676153K6947444L0720585L4314098
$$ 154693867 171311022 190043799 211061130 234737283 261684727 292405312 326719410
58126C26719410L6674173L6688625L3314286K5805149J4353728O22361j2713694
$$ 326719410 363393583 400082208 433396494 459201643 473555371 474177732 461464038
58119D61464038k3307850l0179032l3616062l4409180l3331262l1079965k8281650
$$ 461464038 438156188 407977156 374361094 339951914 306620652 275540687 247259037
58112B47259037k5377608k2583639j9994980j7666595j5598972j3745936j2080234
$$ 247259037 221881429 199297790 179302810 161636215 146037243 132291307 120211073
58105A20211073j0612007r338117q224621p248225o409430n695720n072458m519449
$$ 120211073 109599066 100260949 92036328 84788103 78378673 72682953 67610495 63091046
58097F3091046m041646l636549l282998k968081k694769k456976k235017k022146
$$ 63091046 59049400 55412851 52129853 49161772 46467003 44010027 41775010 39752864
58089C9752864j830600j665782j517159j379038j257865j153448j052993r49328
$$ 39752864 37922264 36256482 34739323 33360285 32102420 30948972 29895979 28946651
58081B8946651q47932p51778o55322n56911m62138l71549k78606j82615r1549
$$ 28946651 28098719 27346941 26691619 26134708 25672570 25301021 25022415 24839800 24748251
58072B4748251r913O5562J37614K06908K80020L69199M82678O22467P92212J000594
$$ 24748251 24738338 24803900 24941514 25148422 25428442 25797641 26280319 26902786 27694998 28695592
58062B8695592J255029J553593J882494K225416K584878K994429L497553M107656
$$ 28695592 29950621 31504214 33386708 35612124 38197002 41191431 44688984 48796640
58054D8796640M787292N449716N961199O161803N933967N263201M196870K742601
$$ 48796640 53583932 59033648 64994847 71156650 77090617 82353818 86550688 89293289
58046H9293289Q75421j307978l490369n264668o374914o813801o727629o294516
$$ 89293289 90168710 88860732 85370363 80105695 73730781 66916980 60189351 53894835
58038E3894835n681979n031099m422451l871068l371572k930713k552156k222230
$$ 53894835 48212856 43181757 38759306 34888238 31516666 28585953 26033797 23811567
58030B3811567j929388j678074j470979j296694j146216j023370r28394q48588
$$ 23811567 21882179 20204105 18733126 17436432 16290216 15266846 14338452 13489864
58022A3489864p75680p15953o73094o36370n95683n54042n15904m77082m35140
$$ 13489864 12714184 11998231 11325137 10688767 10093084 9539042 9023138 8546056 8110916
58013H110916l96647l65418l35963l06337k84747k75358k69917k61359k53618
$$ 8110916 7714269 7348851 7012888 6706551 6421804 6146446 5876529 5615170 5361552
58004E361552k49896k43396k28596k10922j96555j82727j66307j52066j43999
$$ 5361552 5111656 4868260 4639664 4428742 4232187 4049460 3883153 3731087 3587088
57995C587088j37405j27659j18504j14100j11005j05087r8716r4476q9499q2289
$$ 3587088 3449683 3322024 3203520 3089420 2978415 2873328 2774612 2680136 2590637 2508348
57985B508348p7335p6823p5445o9441o3079o0242n7423n1229m5364m3802m3937
$$ 2508348 2431013 2354190 2278745 2209304 2146225 2085983 2028560 1977331 1931967 1888165 1844228
57974A844228m2352m0748m0647l9043l4706l2074l3654l5192l3398l1599l2816
$$ 1844228 1801876 1761128 1720481 1681438 1646732 1614658 1581004 1545812 1512414 1480815 1447999
57963A447999l4183l3358l3352l5757l6218l1967k7153k5329k3570j9315j6060
$$ 1447999 1413816 1380458 1347106 1311349 1275131 1243164 1216011 1190682 1167112 1147797 1131737
57952A131737j6378j6069j1396n908l930l257m01K583K671K042L667N532M839
$$ 1131737 1115359 1099290 1087894 1081986 1078056 1074799 1074398 1076981 1079652 1081694 1085361 1090893 1095732
57939A095732L292L070K234r72m030n096p080j2231j7624k0522k2878k5960k6251
$$ 1095732 1099024 1102094 1104328 1103356 1099326 1094230 1087150 1074919 1057295 1036773 1013895 987935 961684
57926I61684k1729j6705j5173j4593j1479p875o824o652n263n069p925j0054p881
$$ 961684 939955 923250 908077 893484 882005 874130 867306 860654 855391 850322 842397 832343 824462
57913H24462m381l788m478k996p97r40j958j034L18m48j475jJ971J175r13r56
$$ 824462 820081 816293 811815 808819 808022 807082 805124 804090 804408 803960 802485 802484 804455 805630 804717 803761
57897H03761L77O99Q94K446K721j422p649j1034j0909j0231j0272j0342j0660
$$ 803761 804138 804837 805731 808177 810898 809476 801827 790793 779884 769653 759381 749039 738379
57884G38379j1411j0964q541o204n256l838j112J82j183j721Q14K847J131j190
$$ 738379 726968 716004 707463 701259 696003 692165 691053 691235 690052 688331 689145 691992 693123 691933
57870F91933l0K313J399j436j723M20J367O74P32J508J161L97J177K534K229J011
$$ 691933 691903 694216 695615 694179 692456 692876 694243 694917 695649 697157 698318 698715 699892 702426 704655 705666
57854G05666Q93J118Q7q97j81J48k684p047r366r577r757r615p983o678q042j0486
$$ 705666 706559 707677 707764 706867 706686 706834 704150 697103 687737 678160 668403 658788 650805 644127 636085 625599
57838F25599j1116j0730j1607j2497j0797p830o842p302o252l814k413j868k23
$$ 625599 614483 603753 592146 579649 568852 561022 554180 546878 540626 536812 534399 532531 532308
57825E32308J723J729Q41J943M372M930L508K946L823M033L273L353M260M084
$$ 532308 534031 535760 536601 538544 542916 547846 551354 554300 558123 562156 565429 568782 573042 577126
57811E77126K909K793L925M404L631K496O66k697o046o900n785n475o666p689
$$ 577126 580035 582828 586753 591157 594788 597284 597950 595253 589207 582307 576522 571047 564381 556692
57797E56692p882p846p001m242o43J610K501L522M575M527L990M516N825O735
$$ 556692 548810 540964 533963 529721 529078 530688 533189 536711 541286 545813 549803 554319 560144 566879
57783E66879P785R934J1918J1969J0973J0738J0470Q257M787K136K12k111l716
$$ 566879 574664 584598 596516 608485 619458 630196 640666 648923 653710 655846 656058 653947 650231
57770F50231k993j686l068o956j0331j2070j3325j4046j2962j0750r524r449q987
$$ 650231 647238 645552 642484 635528 625197 613127 599802 585756 572794 562044 552520 543071 534084
57757E34084q021p605p360o215m834m184l005j18K238J330j068r77J469K485R34
$$ 534084 526063 518458 511098 504883 500049 495865 492860 492742 494980 496310 495242 494265 495734 498219 499153
57742D99153n29o16j137l060m856n547n951o269n563m106l261k939j949p68q36
$$ 499153 498624 498008 496871 493811 488955 483408 477457 471188 465625 461519 458258 455319 453370 452602 451766
57727D51766j373k22K241L442K886K752L986N013M805M181L694K978K490L298
$$ 451766 450393 450171 452412 455854 458740 461492 465478 470491 475296 479477 483171 486149 488639 491937
57713D91937M894N628N260M908M961N352O950R917J1885J0933R260J0265J2993
$$ 491937 496831 502459 507719 512627 517588 522940 529890 539807 551692 562625 571885 582150 595143
57700E95143J3546J1316R303Q397O044J325k984m689m858n090n427n999p537r057
$$ 595143 608689 620005 629308 637705 643749 645074 642090 637401 632543 627453 622026 616027 608490 599433
57686E99433q148m839k439l200n592p053p138o717o067n039l701k142o00J67o7
$$ 599433 591285 586446 584007 580807 575215 568162 561024 554307 548240 543201 539500 537358 536758 536925 536858
57671E36858p3J228L017M056M751N656N493L403J758L412P213R593R877J0417
$$ 536858 536785 538013 541030 545086 549837 555493 560986 564389 566147 569559 576772 586365 596242 606659
57657F06659J2144J3708J4747J6176J7401J6936J5715J6105J7737J8140J7574
$$ 606659 618803 632511 647258 663434 680835 697771 713486 729591 747328 765468 783042
57646G83042J8970K2679K5482K5754K5710K7393L0049L2610L5370L8056L9608
$$ 783042 802012 824691 850173 875927 901637 929030 959079 991689 1027059 1065115 1104723
57635A104723M0916M4453M9986N4004N4665N4122N4590N5361N5275N5162N6162
$$ 1104723 1145639 1190092 1240078 1294082 1348747 1402869 1457459 1512820 1568095 1623257 1679419
57624A679419N8203O1530O7305P5349Q3741R1790J00849J11186J20905J29243
$$ 1679419 1737622 1799152 1866457 1941806 2025547 2117337 2218186 2329372 2450277 2579520
57614B579520J37929J47623J55600J58789J56868J50826J40778J27023J11378
$$ 2579520 2717449 2865072 3020672 3179461 3336329 3487155 3627933 3754956 3866334
57605C866334R5680Q0385O5729N2445L9929K5103M401k3978n9650r9851j38978
$$ 3866334 3962014 4042399 4108128 4160573 4200502 4225605 4230006 4206028 4146378 4046527 3907549
57594C907549j70470j90488j99029j97738j88500j74072j57573j40628j23698
$$ 3907549 3737079 3546591 3347562 3149824 2961324 2787252 2629679 2489051 2365353
57585B365353j08101r5537q5538p5838o5485n5420m6161l7537l0486k6065k2606
$$ 2365353 2257252 2161715 2076177 2000339 1934854 1879434 1833273 1795736 1765250 1739185 1716579
57574A716579j7027r392k913J018M520R315J4598J9726K5673L2503L8509M3229
$$ 1716579 1699552 1690160 1687247 1688265 1692785 1702100 1716698 1736424 1762097 1794600 1833109 1876338
57562A876338M8412N4761O0692O5632P1489P9292Q7233R3530R8522J02321J03231
$$ 1876338 1924750 1979511 2040203 2105835 2177324 2256616 2343849 2437379 2535901 2638222 2741453
57551B741453J00257R4642Q7222P6581O1367M2136J9630o020l2884n6914p5937
$$ 2741453 2841710 2936352 3023574 3100155 3161522 3203658 3223288 3217268 3184384 3127470 3051533
57540C051533r1433j04698j14041j17893j18143j17714j16863j14168j09479j03748
$$ 3051533 2960100 2855402 2741361 2623468 2505325 2387611 2270748 2156580 2047101 1943353
57530A943353r7404r0840q5059q0226p5047o8959o3300n8978n4877m9985m5185
$$ 1943353 1845949 1755109 1670050 1589824 1514777 1445818 1382518 1323540 1268663 1218678 1173493
57519A173493m1409l7992l4384l1568l0072k8477k5552k2097j9235j6766j4746
$$ 1173493 1132084 1094092 1059708 1028140 998068 969591 944039 921942 902707 885941 871195
57508H71195j4513j6244j7478j6089j3112j0730r146p416n670m466l180j064J213
$$ 871195 856682 840438 822960 806871 793759 783029 773883 766467 760797 756331 753151 752087 753300
57495G53300K721L725M589M677L925L932N680P659Q112P876Q914J1113J2676J3010
$$ 753300 756021 759746 764335 769012 772937 776869 782549 790208 798320 806196 815110 826223 838899 851909
57481H51909J3310J4527J6371J8177J9670K1037K2880K5751K9410L3126L6688
$$ 851909 865219 879746 896117 914294 933964 955001 977881 1003632 1033042 1066168 1102856
57470A102856M0091M2506M3254M3829M6857N2630N8723O3470O7605P1716P4718
$$ 1102856 1142947 1185453 1228707 1272536 1319393 1372023 1430746 1494216 1561821 1633537 1708255
57459A708255P6020P6885P8040P7877P4419O7377N7149M3764K8079J1982l942
$$ 1708255 1784275 1861160 1939200 2017077 2091496 2158873 2216022 2259786 2287865 2299847 2295905
57448B295905k0847l8320n3070o2775o9113p4719p9016p9591p6408p2074o8491
$$ 2295905 2275058 2236738 2183668 2120893 2051780 1977061 1898045 1818454 1742046 1669972 1601481
57437A601481o5378o1789n7432n2583m7753m3287l8850l3973k9240k5732k3170
$$ 1601481 1536103 1474314 1416882 1364299 1316546 1273259 1234409 1200436 1171196 1145464 1122294
57426A122294k0162j6553j3547j1159p799l278K10J434K191M421P288Q973R720
$$ 1122294 1102132 1085579 1072032 1060873 1053074 1049796 1050006 1051440 1053631 1058052 1065340 1074313 1084033
57413A084033J1163J3941J7624K1916K6453L0438L3770L7541M2348M7172N0886
$$ 1084033 1095196 1109137 1126761 1148677 1175130 1205568 1239338 1276879 1319227 1366399 1417285
57402A417285N3834N7096O1126O5575O9352P0652O8455O4033N9269N3547M4501
$$ 1417285 1471119 1528215 1589341 1654916 1724268 1794920 1863375 1927408 1986677 2040224 2084725
57391B084725L1772J7292J704j6160l5424n2191o4020p2502p9780q5234q7432
$$ 2084725 2116497 2133789 2135493 2119333 2083909 2031718 1967698 1895196 1815416 1730182 1642750
57380A642750q6761q4305q0354p5747p2160o9417o4914n7576m9981m4776m1445
$$ 1642750 1555989 1471684 1391330 1315583 1243423 1174006 1109092 1051516 1001535 956759 915314
57369I15314l8443l5849l3798l0909k6731k3384k2357k1942k0130j7772j6293
$$ 915314 876871 841022 807224 776315 749584 726200 703843 681901 661771 643999 627706
57358F27706j4728j1957r614r558j0147q438m795k226k035k967l867m611m879
$$ 627706 612978 601021 591407 581849 571702 563264 558469 556243 554208 551241 547374 542763 537884
57345E37884m292l363k616j582j09O23Q7o3J540L453L565K456K333L564M632M851
$$ 537884 533592 530229 527613 526031 525922 526545 526632 526569 528109 531562 535127 537583 539916 543480 548112 552963
57329E52963N055N849O893P648P787P362P239Q378J0144J0699R658Q703Q912R543
$$ 552963 558018 563867 570760 578408 586195 593557 600796 609174 619318 630017 639675 648378 657290 666833
57315F66833J0168J1557J3393J3747J2127J0627J0544J0532R656R367J0400J0749
$$ 666833 677001 688558 701951 715698 727825 738452 748996 759528 769184 778551 788951 799700
57303G99700R137P722Q603J0163R846Q485Q717J0741J2579J3219J2926J1778J0226
$$ 799700 808837 816559 825162 835325 845171 853656 862373 873114 885693 898912 911838 923616 933842
57290I33842R754J0948J2319J2790J3502J5276J6521J5874J4728J4872J5798J6536
$$ 933842 943596 954544 966863 979653 993155 1008431 1024952 1040826 1055554 1070426 1086224 1102760
57278A102760J7830J9938K0769J9022J6885J6823J7955J8453J9094K1077K2734
$$ 1102760 1120590 1140528 1161297 1180319 1197204 1214027 1231982 1250435 1269529 1290606 1313340
57267A313340K2081K0721K1375K3168K3188K1496K0748K1640K2322K1804K0851
$$ 1313340 1335421 1356142 1377517 1400685 1423873 1445369 1466117 1487757 1510079 1531883 1552734
57256A552734J9919J9007J8951K0399K2139K2704K2739K3610K4916K5564K6083
$$ 1552734 1572653 1591660 1610611 1631010 1653149 1675853 1698592 1722202 1747118 1772682 1798765
57245A798765K7505K9205L0054L0390L0868L0875L0125K9979L1159L2202L2272
$$ 1798765 1826270 1855475 1885529 1915919 1946787 1977662 2007787 2037766 2068925 2101127 2133399
57234B133399L3080L5587L7488L6868L5893L7575M1187M4063M5723M6828M6366
$$ 2133399 2166479 2202066 2239554 2276422 2312315 2349890 2391077 2435140 2480863 2527691 2574057
57223B574057M3716M1530M2789M6359M8993N0121N1435N3447N5777N9022O2916
$$ 2574057 2617773 2659303 2702092 2748451 2797444 2847565 2899000 2952447 3008224 3067246 3130162
57212C130162O4560O2111N8285N6546N5731N2386M6613M1379L7386L2911K7728
$$ 3130162 3194722 3256833 3315118 3371664 3427395 3479781 3526394 3567773 3605159 3638070 3665798
57201C665798K3396K0429J8439J8034J9467K0899K1015K1571K4271K7288K8384
$$ 3665798 3689194 3709623 3728062 3746096 3765563 3786462 3807477 3829048 3853319 3880607 3908991
57190C908991K9043L1716L5325L7661L9799M3524M6668M6068M3456M3326M6323
$$ 3908991 3938034 3969750 4005075 4042736 4082535 4126059 4172727 4218795 4262251 4305577 4351900
57179D351900M9686N2978N8271O5409P1931P7263Q2660Q7810R1568R5084R9810
$$ 4351900 4401586 4454564 4512835 4578244 4650175 4727438 4810098 4897908 4989476 5084560 5184370
57168E184370J03464J02443R7428R2302Q8372Q3941P8589P3472O8060O0858N2783
$$ 5184370 5287834 5390277 5487705 5580007 5668379 5752320 5830909 5904381 5972441 6033299 6086082
57157F086082M6015M0340L4392K9384K7817K9634L3173L8518M6382N5483O4578
$$ 6086082 6132097 6172437 6206829 6236213 6264030 6293664 6326837 6365355 6411737 6467220 6531798
57146F531798P4838Q6642R6863J03471J09608J18274J26334J29284J28825J29555
$$ 6531798 6606636 6693278 6790141 6893612 7003220 7121494 7247828 7377112 7505937 7635492
57136G635492J30951J29199J24893J22050J21056J18975J15633J13170J10934
$$ 7635492 7766443 7895642 8020535 8142585 8263641 8382616 8498249 8611419 8722353
57127H722353J06777J02173J00122R9475R7154R4216R3586R3644R0379Q4099P7747
$$ 8722353 8829130 8931303 9031425 9130900 9228054 9322270 9415856 9509500 9599879 9683978 9761725
57116I761725P0589O0206M8669L9695L1709K0876R044J057m068j1605k2103l1561
$$ 9761725 9832314 9892520 9941189 9980884 10012593 10033469 10042513 10043570 10039502 10027897 10005794 9974233
57104I974233l9261m7793n6467o2193o5702o9818p3196p3152p2505p5686q0383
$$ 9974233 9934972 9887179 9830712 9768519 9702817 9632999 9559803 9486651 9414146 9338460 9258077
57093I258077q1348q0222q2727q8460r2820r6997j06129j19042j29493j36217
$$ 9258077 9176729 9096507 9013780 8925320 8832500 8735503 8629374 8510332 8380839 8244622
57083H244622j42270j46315j44845j41271j42294j46522j47230j44999j46998
$$ 8244622 8102352 7956037 7811192 7669921 7527627 7381105 7233875 7088876 6941878
57074F941878j55312j66738j82181k04648k29683k49862k67583k91824l23930
$$ 6941878 6786566 6619828 6437647 6232999 6003316 5753454 5485871 5194047 4870117
57065D870117l58428l95303m38683m85942n31625n79651o38015p04559c4744q47190
$$ 4870117 4511689 4116386 3677703 3191761 2660136 2080485 1442470 737911 -34744 -881934
57055h81934r38718j045560j158623j280495j421822j582698j757253j952813
$$ -881934 -1820652 -2866212 -4024835 -5305330 -6727152 -8309850 -10067103 -12019916
57047a2019916k183418k447455k732808l040094l378436l744288m130399m550080
$$ -12019916 -14203334 -16650789 -19383597 -22423691 -25802127 -29546415 -33676814 -38226894
57039c8226894n024027n547872o102013o685655p307653p953968q604360r269403
$$ -38226894 -43250921 -48798793 -54900806 -61586461 -68894114 -76848082 -85452442 -94721845
57031i4721845r960946j0634513j1215910j1671202j1978626j2044868j1745692
$$ -94721845 -104682791 -115317304 -126533214 -138204416 -150183042 -162227910 -173973602
57024a73973602j1043891r937806q290034n935463l126839p14453M03879P4067
$$ -173973602 -185017493 -194955299 -203245333 -209180796 -212307635 -213022088 -212618209 -212544142
57016b12544142r84157j815493j852131r57908Q25984L347579O256154R070225
$$ -212544142 -213528299 -215343792 -217195923 -218153831 -217327847 -213980268 -207724114 -198653889
57008a98653889J1401958J3079370J4091084J4505240J4439687J4024635J3353161
$$ -198653889 -187251931 -174172561 -160081477 -145576237 -131136550 -117111915 -103758754
57001a03758754J2486088J1495927J0466871R453234Q472506P538456O670520
$$ -103758754 -91272666 -79776739 -69309868 -59856634 -51384128 -43845672 -37175152
56994c7175152N873340N138741M470490L883330L378546K943345K572063K265558
$$ -37175152 -31301812 -26163071 -21692581 -17809251 -14430705 -11487360 -8915297 -6649739
56986f649739K011734J789258a258346A62285J277030J146617J025459R20563
$$ -6649739 -4638005 -2848747 -1258346 162285 1439315 2585932 3611391 4531954
56978D531954Q32558P53365O80728O18865N64589N08049M47615L90444L38996
$$ 4531954 5364512 6117877 6798605 7417470 7982059 8490108 8937723 9328167 9667163
56969I667163K90220K46492K13317J86873J57200J23159R1766O3855L3507J026
$$ 9667163 9957383 10203875 10417192 10604065 10761265 10884424 10976190 11040045 11073552 11074578
56959A1074578k6438m7381o7050q6138j00084j09721j21076j34014j41998j43631
$$ 11074578 11048140 11000759 10933709 10847571 10747487 10637766 10516690 10382676 10240678 10097047
56949A0097047j43918j43739j38621j28811j20582j16600j14359j14566j21314
$$ 10097047 9953129 9809390 9670769 9541958 9421376 9304776 9190417 9075851 8954537
56940H954537j33079j43050j49656j57770j68380j76030j78198j78902j81379
$$ 8954537 8821458 8678408 8528752 8370982 8202602 8026572 7848374 7669472 7488093
56931G488093j85265j92509k07997k31953k58541k83600l07022l26316l35243
$$ 7488093 7302828 7110319 6902322 6670369 6411828 6128228 5821206 5494890 5159647
56922E159647l31177l17759k98620k74462k47688k23217k02185j80236j54380
$$ 5159647 4828470 4510711 4212091 3937629 3689941 3466724 3264539 3084303 2929923
56913B929923j26676r9205p0125l7028l20L8713Q0012J23450J68518K16657K71257
$$ 2929923 2803247 2704042 2633917 2596889 2596569 2635282 2715294 2838744 3007262 3223919 3495176
56902C495176L33754M01276M69017N33828N93412O38566O43854N71763L99138
$$ 3495176 3828930 4230206 4699223 5233051 5826463 6465029 7108883 7680646 8079784
56893H079784J46132j26916l57810n16393o02894o27456o02667n47643m83235
$$ 8079784 8225916 8099000 7741190 7224797 6621903 5994447 5391780 4844137 4360902
56884D360902m20614l61526l07942k63343k26329j92033j60053j33746j12468
$$ 4360902 3940288 3578762 3270820 3007477 2781148 2589115 2429062 2295316 2182848
56875B182848r2159p3111n9507n1224m3608l5608l1057l1397l4010l8277m6336
$$ 2182848 2090689 2017578 1958071 1906847 1863239 1827631 1796574 1765177 1731167 1692890 1646554
56864A646554n6946o4998o8337o9350o9276o6638o1870n7702n4252m9166m2856
$$ 1646554 1589608 1524610 1456273 1386923 1317647 1251009 1189139 1131437 1077185 1028019 985163
56853I85163l8170l4778k9685k3326j9232j7444j4276r009m908l072j234Q90J090
$$ 985163 946993 912215 882530 859204 839972 822528 808252 799243 794335 791263 790029 790919 792009
56840G92009J16J473N007O700N797O019Q579J0094R026Q277R610J0995J1168J1669
$$ 792009 792125 793598 798605 805305 811102 817121 825700 835794 844820 853097 862707 873702 884870 896539
56826H96539J2612J1552Q126M951K508j941q995j5645k0361k4718k8766l0016
$$ 896539 909151 920703 928829 933780 936288 934347 925352 909707 889346 864628 835862 805846
56814H05846k8346k6730k5659k2152j5691r866o255k067M146R719J3022J6487
$$ 805846 777500 750770 725111 702959 687268 677402 671147 669080 673226 682945 695967 712454
56802G12454K2049K8080L2984L7316M0291L8782L2066K3327J4463L905q416j8522
$$ 712454 734503 762583 795567 832883 873174 911956 944022 967349 981812 985717 977301 958779
56790I58779k3429k4629k4356k2294j8141j3393q428j630O728J3701J8629K4714
$$ 958779 935350 910721 886365 864071 845930 832537 824109 822479 829207 842908 861537 886251
56778H86251L3752M3337N1248N8413O5493P0865P3917P5756P4248O3245M0134
$$ 886251 920003 963340 1014588 1073001 1138494 1209359 1283276 1359032 1433280 1496525 1536659
56767A536659J0606j7082l9071n4994o4391o7463o6253o2036n4164m3498l3566
$$ 1536659 1547265 1530183 1491112 1436118 1371727 1304264 1238011 1175975 1121811 1078313 1044747
56756A044747k6087j8795j0010j729M407J0479J8662K7569L5153M2183M9640N5024
$$ 1044747 1018660 999865 989855 988126 992533 1003012 1021674 1049243 1084396 1126579 1176219 1231243
56744A231243N4188M5049K7963N107j8783l8037n0486n7906o1294n9438n3338
$$ 1231243 1285431 1330480 1358443 1363550 1344767 1306730 1256244 1198338 1137044 1077606 1024268
56733A024268m7402m3727l9248l1348k2440j6011j1817p984m463j195L729J0816
$$ 1024268 976866 933139 893891 862543 840103 824092 812275 804291 799828 798633 802362 813178
56721H13178J6954J9572J9938J9416J5848P130m524j5460k5030l3636l9274m0011
$$ 813178 830132 849704 869642 889058 904906 912036 907512 892052 867022 833386 794112 754101
56709G54101l7850l6213l5211l2779k8999k5775k3502k1115j8392j5816j3223
$$ 754101 716251 680038 644827 612048 583049 557274 533772 512657 494265 478449 465226
56698D65226j0679r266r097q405o536n546o799q263p651n929n126m827l658k290
$$ 465226 454547 445281 436184 427779 421243 415697 408898 400635 392984 387055 381929 377102 373444 371154
56684C71154k168k761k645j996j833k142k528l219l905l492k269k120l261l532
$$ 371154 368986 366225 363580 361584 359751 357609 355081 351862 347957 344465 342196 340076 336815 333283
56670C33283k297j892l352m164k672j208k014l269k327N1J845L263M766M530J480
$$ 333283 330986 329094 325742 321578 318906 317698 315684 312415 310088 310139 311984 315247 320013 324543 326023
56655C26023j654k048j165j793l115k603q54l35j029j203j080j926k828k178j185
$$ 326023 324369 322321 321156 319363 316248 313645 312791 312456 311427 310224 309144 307218 304390 302212 301027
56640C01027k175m417n171m020k715j692j92R81L70j008p92R00J856J550J607
$$ 301027 298852 294435 289264 285244 282529 280837 280645 281626 281996 280988 280196 281096 282952 284502 286109
56625B86109K664L586L620L025J907M93n2R35K161K289K135K784K978R32k336
$$ 286109 288773 292359 295979 299004 300911 301404 301352 302287 304448 306737 308872 311656 314634 315566 313230
56610C13230m118l618k119n27R18J405M24q91j227r59r72j054j151k281m271m689
$$ 313230 309112 305494 303375 302848 303766 305171 305595 304704 303477 302518 301546 300492 299341 297060 292789 288100
56594B88100k404L9J65o64o5J168J160R14K356M189L815K003J677L053L979M169
$$ 288100 285696 285735 285900 285236 285171 286339 287499 288413 290769 294958 298773 300776 302453 305506 309485 313654
56578C13654N105O305N598K982P15j98n05j62J420L042K865J528J013R46n49k887
$$ 313654 318759 325064 330662 333644 334359 334161 333656 333494 334914 337956 340821 342349 343362 344308 343759 340872
56562C40872l497k114j194j881k817l004k932k744k064j582k116k432p90J777
$$ 340872 337375 335261 334067 332186 329369 326365 323433 320689 318625 317043 314927 312495 311705 313482
56548C13482K697J819J052O06q63k624k127Q07L503M532N097N850N571L771J798
$$ 313482 316179 317998 319050 319656 318793 316169 314042 314849 318352 322884 327981 333831 339402 343173 344971
56533C44971O46O4K26J727L659M263L702L612L882K815O93P7J884L993M523L966
$$ 344971 345617 345681 345907 347634 351293 355556 359258 362870 366752 369567 370260 370337 372221 376214 380737 384703
56517C84703L401K926K659L107L921M088L745L972M737M945M387L806L369L113
$$ 384703 388104 391030 393689 396796 400717 404805 408550 412522 417259 422204 426591 430397 433766 436879
56503D36879M217P325J0390J0907R797R998J1775J2720J2151J1889J2527J2518
$$ 436879 441096 448421 458811 469718 479515 489513 501288 514008 526159 538048 550575 563093
56491E63093J1608J1664J3339J4991J5772J6701J7820J7422J5283J3700J4017
$$ 563093 574701 586365 599704 614695 630467 647168 664988 682410 697693 711393 725410
56480G25410J4597J3577J1366R241P519O115N049L771J702k38p13o14k197n491
$$ 725410 740007 753584 764950 774191 781710 787825 792874 796645 798347 798109 797396 796782 794585 789094
56466G89094q241r591j0856j2360j2668j1813j2062j4203j6000j5732j4732j4847
$$ 789094 780853 771262 760406 748046 735378 723565 711503 697300 681300 665568 650836 635989
56454F35989j5681j5832j4988j3579j2032j1160j1514j1795j0098p203o127p737
$$ 635989 620308 604476 589488 575909 563877 552717 541203 529408 519310 512107 505980 498243
56442D98243r445r117p685o609n467l700k482l046m712o103o768o668n506l621
$$ 498243 488798 479681 471996 465387 459920 456220 453738 450692 445980 439877 433109 426441 420935 417314
56428D17314k117j320n60J28j68j284j806j396j237j647j345K18J944L136M339
$$ 417314 415197 413877 413317 413445 413277 411993 410187 408791 407554 405907 404562 404780 406724 409860 414199
56413D14199N437N184L512K254K515L239L198K607J992J318Q70J160J525P82l84
$$ 414199 419636 424820 428332 430586 433101 436340 439538 442145 444137 445455 446325 447485 449010 449792 449408
56398D49408O9K389M671O054P469Q830Q449O283M833N514O771P184P749R433J0926
$$ 449408 449477 451866 456537 462591 470060 478890 487339 493622 498455 503969 510740 517924 525673 535106 546032
56383E46032J0776R765R354R477R438R363R332Q625P105N970O030O595O897P036
$$ 546032 556808 566573 575927 585404 594842 604205 613537 622162 629267 635237 641267 647862 654759 661795
56369F61795O871N718L882K703K438J872M97q94k173m143o260o621n056l869m525
$$ 661795 668666 674384 678266 680969 683407 685279 685776 684882 682709 678566 672306 665685 660629 656760 652235
56354F52235n933o909p948r466j0628j0956j0964j0448q491o062n843q302j0513
$$ 652235 646302 639393 631445 621979 611351 600395 589431 578983 570492 564430 558587 550285 539772
56341E39772j0104q089o617o248o616p433p654o123l898l498m952n467l916k521
$$ 539772 529668 521579 514962 508714 502098 494665 487011 480888 476990 473492 468540 463073 459157 456636
56327D56636k839l391k959k912m189m969l574j162N24J547K104J255p03j246Q10
$$ 456636 453797 450406 447447 444535 440346 435377 431803 430641 431165 432712 434816 436071 435368 434122 434932
56312D34932L283M119M185M610M295K491R50R18P03j014k209p68J750K704K439
$$ 434932 438215 442334 446519 451129 455424 457915 458865 459783 460486 459472 457263 456495 458245 460949 463388
56297D63388K643K771J499N9O58K854M443M875N024M702L164J168J60K03N59J224
$$ 463388 466031 468802 470301 470360 471018 473872 478315 483190 488214 492916 496080 497248 497408 497611 498170 499394
56281D99394K131K396K097L045N919Q657R684J0399J2146J3128J1354Q484P539
$$ 499394 501525 503921 506018 509063 514982 523639 533323 543722 555868 568996 580350 588834 596373
56268E96373Q440Q983Q765Q978R501R365R078R675J0367R897R126R552J0372R928
$$ 596373 604813 613796 622561 631539 641040 650405 659483 669158 679525 689422 698548 708100 718472 728400
56254G28400R010R758J1993J3598J3982J4203J4227J2976J1016J0439J1702J2836
$$ 728400 737410 747168 759161 772759 786741 800944 815171 828147 839163 849602 861304 874140
56242H74140J2126R879P368N410M068K796J090n00r03n01j048k856m032l535k909
$$ 874140 886266 896145 903513 908923 912991 915787 916877 916377 915474 914973 913925 911069 907037 903502 900593
56227I00593l526m303l869k786j760J0K520L336R92j952j945R34L957N709O636
$$ 900593 897067 892764 888895 886109 884349 884359 886879 890215 891207 889255 887310 888244 892201 897910 904546
56212I04546P126P534Q894J1321J3107J3290J3512J5271J7417J8597K0040K3204
$$ 904546 911672 919206 928100 939421 952528 965818 979330 994601 1012018 1030615 1050655 1073859
56200A073859K6773K8771K9882L1781L3992L5407L7208M1219M6711N1591N5446
$$ 1073859 1100632 1129403 1159285 1191066 1225058 1260465 1297673 1338892 1385603 1437194 1492640
56189A492640N8822O1147O2037O2958O5049O7027O7656O8056O8884O7811O2938
$$ 1492640 1551462 1612609 1674646 1737604 1802653 1869680 1937336 2005392 2074276 2142087 2205025
56178B205025N6244N0223M3686L4673K5060J7988J2866P303J993q54k221m673
$$ 2205025 2261269 2311492 2355178 2389851 2414911 2432899 2445765 2453068 2455061 2454207 2451986 2447313
56166B447313p497q272p956r419j1786j1467q426o425p044q225r029j1220j5445
$$ 2447313 2439816 2431544 2423588 2414169 2402383 2390916 2382490 2376065 2369021 2360796 2351767 2340547 2325102
56153B325102j9900k3632k7569l1740l4731l6388l7973l9497l9846l9550m0347
$$ 2325102 2305202 2281570 2254001 2222261 2187530 2151142 2113169 2073672 2033826 1994276 1953929
56142A953929m2202m3476m3720m3486m2253l9556l7121l6434l5501l1668k6513
$$ 1953929 1911727 1868251 1824531 1781045 1738792 1699236 1662115 1625681 1590180 1558512 1531999
56131A531999k3704k2944k0763j6825j4591j5469j6824j6462j5136j3837j2161
$$ 1531999 1508295 1485351 1464588 1447763 1433172 1417703 1400879 1384417 1369281 1355444 1343283
56120A343283j0162q634p164m754k393k044l202l472k164n86O75J768J969J183
$$ 1343283 1333121 1324487 1317323 1312569 1310176 1308132 1304930 1301458 1299294 1298708 1299383 1301151 1303120 1304303
56106A304303J687M872P891P571N938P228J0828J2385J1019J0006J0667J0905
$$ 1304303 1305990 1310862 1318753 1326324 1332262 1339490 1350318 1362703 1373722 1383728 1394395 1405300
56094A405300R951R463R623Q909P951R033J1630J2950J2830J3578J5237J5992
$$ 1405300 1415251 1424714 1434337 1443246 1451197 1460230 1471860 1484810 1497640 1511218 1526455 1542447
56082A542447J6842K0550K6017K9171K9640L0951L3789L5022L4171L4914L8766
$$ 1542447 1559289 1579839 1605856 1635027 1664667 1695618 1729407 1764429 1798600 1833514 1872280
56071A872280M2783M5159M7871N2252N6838O1224O7438P5911Q4563R3098J03818
$$ 1872280 1915063 1960222 2008093 2060345 2117183 2178407 2245845 2321756 2406319 2499417 2603235
56060B603235J17253J31417J46083J63054J81660J98971K15060K32483K49663
$$ 2603235 2720488 2851905 2997988 3161042 3342702 3541673 3756733 3989216 4238879
56051D238879K60403K61349K54610K41893K22028J96231J70193J48535J31380
$$ 4238879 4499282 4760631 5015241 5257134 5479162 5675393 5845586 5994121 6125501
56042F125501J17615J06355R3991P5436N0393K3828r37k4622m6938o5259q0031
$$ 6125501 6243116 6349471 6443462 6518898 6569291 6593119 6592182 6567560 6520622 6455363 6375332
56031F375332r5794j15004j36007j58144j82749k07525k26137k35533k38033k34879
$$ 6375332 6279538 6164534 6028527 5870383 5687634 5480109 5253972 5018439 4780406 4545527
56021D545527k24042k06257j86566j67650j47902j27945j12132j01035q9500p5129
$$ 4545527 4321485 4115228 3928662 3761012 3613110 3485165 3373033 3271998 3182498 3107369
56011C107369o2094n3375m5965l7101k8915k3292j8203j2517q643p151m702j24
$$ 3107369 3045275 2991900 2945935 2908834 2879919 2856627 2838424 2825907 2817264 2810113 2805411 2805287
55999B805287L403M949Q013J3393J6791J6697J7665K2350K7208K9652L2396L7074
$$ 2805287 2808690 2813639 2821652 2835045 2851836 2868533 2886198 2908548 2935756 2965408 2997804 3034878
55987C034878M0552M1513M3649M8500N2075N2401N3187N6261N7894N6631N7035
$$ 3034878 3075430 3116943 3160592 3209092 3261167 3313568 3366755 3423016 3480910 3537541 3594576
55976C594576O1503O6050O8430P2243P8621Q2404Q1570Q1985Q7502R3766R7132
$$ 3594576 3656079 3722129 3790559 3862802 3941423 4023827 4105397 4187382 4274884 4368650 4465782
55965D465782J00989J07702J13188J15555J20169J29820J38625J42339J45900
$$ 4465782 4566771 4674473 4787661 4903216 5023385 5153205 5291830 5434169 5580069
55956E580069J54059J63370J70290J78255J89632J99750K06180K14959K30352
$$ 5580069 5734128 5897498 6067788 6246043 6435675 6635425 6841605 7056564 7286916
55947G286916K47738K63642K82831L08045L33138L54502L78590M09805M41920
$$ 7286916 7534654 7798296 8081127 8389172 8722310 9076812 9455402 9865207 10307127
55938A0307127M70342N01422N40219N80776O18502O60306P11705P65831Q16311
$$ 10307127 10777469 11278891 11819110 12399886 13018388 13678694 14390399 15156230 15972541
55929A5972541Q68899R28648R87992J039980J091326J150476J215306J284415
$$ 15972541 16841440 17770088 18758080 19798060 20889386 22039862 23255168 24539583
55921B4539583J366214J463617J564333J659926J759129J868704J979015K084658
$$ 24539583 25905797 27369414 28933747 30593673 32352802 34221506 36200521 38285179
55913C8285179K201044K342663K503442K677079K876297L111251L370279L645226
$$ 38285179 40486223 42828886 45332328 48009407 50885704 53996955 57367234 61012460
55905F1012460L954391M317307M732233N206149N780603O497802P369627Q411953
$$ 61012460 64966851 69284158 74016391 79222540 85003143 91500945 98870572 107282525
55897A07282525R672338J1178234J2890749J4760458J6799773J9054480K1549714
$$ 107282525 116954863 128133097 141023846 155784304 172584077 191638557 213188271
55890B13188271K4321082K7423933L0786746L4062681L6687423L7975465L6989710
$$ 213188271 237509353 264933286 295720032 329782713 366470136 404445601 441435311
55883D41435311L2477713K3470397J0358940m682263j8642681k9235639l5698017
$$ 441435311 473913024 497383421 507742361 503060098 484417417 455181778 419483761
55876D19483761l8443446l8337777l6305760l3216739k9758264k6332675k3120162
$$ 419483761 381040315 342702538 306396778 273180039 243421775 217089100 193968938
55869A93968938k0211401j7646159j5399352j3423542j1703223j0234949q984948
$$ 193968938 173757537 156111378 140712026 127288484 115585261 105350312 96365364
55862I6365364p908309o986918o212085n551264m966940m451153m010945l635470
$$ 96365364 88457055 81470137 75258052 69706788 64739848 60288695 56277750 52642280
55854E2642280l304896l015913k771123k556346k353681k165822k004872j867535
$$ 52642280 49337384 46321471 43550348 40994002 38640321 36474499 34469627 32602092
55846C2602092j742131j629230j534641j451257j367299j284483j210509j141857
$$ 32602092 30859961 29230731 27696090 26244833 24877534 23593051 22382542 21240685
55838B1240685j070833j001364r41105q85467q25723p66011p16381o75283o34250
$$ 21240685 20169852 19168488 18227383 17341916 16516193 15750182 15033801 14358518 13724268
55829A3724268n94312n62609n37426n10847m82570m57911m35642m10266l83283
$$ 13724268 13129956 12567347 12029921 11519074 11036504 10578593 10142951 9732685 9349402
55820I349402l60744l42367l23496l04560k88731k73616k55013k35377k19382
$$ 9349402 8988658 8646291 8322795 8018235 7729504 7455888 7200875 6965498 6746116
55811F746116k04812j86950j68123j53635j42007j28339j13690j02035r1612p8462
$$ 6746116 6541304 6354354 6186231 6032596 5890589 5762250 5648560 5546525 5454913 5376451
55801E376451o5361n8184n6529n6786o1473p6137r9261j23792j46715j68836j87346
$$ 5376451 5311090 5252906 5196377 5139591 5078118 5001981 4902720 4778928 4632213 4463377 4276031
55790D276031j97284j99135j97252j92131j81534j67495j54676j43124j29709
$$ 4276031 4078747 3879612 3682360 3490229 3308695 3141200 2986524 2843400 2713691
55781B713691j15294j03419r3407q1845o9726o1215n6266n0930m4154l8110l2931
$$ 2713691 2598397 2494978 2401571 2319726 2250000 2188785 2132519 2081589 2037435 1999325 1966394
55770A966394k7234k2698k2055k3514k3061k1101k0987k2263k1426j8348j5870
$$ 1966394 1939160 1916462 1894407 1870893 1847832 1826731 1805744 1783481 1762055 1743707 1727837
55759A727837j3897r839m238k65J702L534M093R3q371j8300k8850m0538n0441
$$ 1727837 1713940 1704101 1699863 1699598 1701300 1704834 1708927 1709020 1700649 1682349 1653499 1612961 1562520
55746A562520n4222n2647n0452m8946m5173l8379l1590k6331k0976j5046j0514
$$ 1562520 1508298 1455651 1405199 1356253 1311080 1272701 1241111 1214780 1193804 1178758 1168244
55735A168244q051o212m714m647n342m956m190n496q824j1810j3847j5991j7521
$$ 1168244 1160193 1153981 1149267 1144620 1139278 1134322 1130132 1124636 1115812 1104002 1090155 1074164 1056643
55722A056643j6854j5382j5943j7733j7074j3186r014o411m513k803j724n16J560
$$ 1056643 1039789 1024407 1008464 990731 973657 960471 951457 945046 940533 937730 936006 935490 937050
55709I37050K181j640q378j3626j6557k0126k4977k8102k8187k7411k6989k5400
$$ 937050 939231 937591 929213 915587 899030 878904 853927 825825 797638 770227 743238 717838
55697G17838k2208j9530j8410j7497j6475j7027j9282k0891k0825k0651k0791
$$ 717838 695630 676100 657690 640193 623718 606691 587409 566518 545693 525042 504251
55686E04251j8970j3905p591k561N73J888J275k52r39q23j559l371m779n502o553
$$ 504251 485281 471376 463785 461224 461797 463685 464960 464708 463769 462946 461387 458016 453237 447735 441182
55671D41182p226n398j602N98n64k947m207m604m949m784m169m567o396p905p870
$$ 441182 433956 428558 426956 427554 426990 424043 419836 415232 410283 405499 401330 396763 390367 382462 374592
55656C74592p334p442p587o934n897n063m263l537l327l164j933Q2J240J006M69
$$ 374592 367258 359816 352229 345295 339398 334335 330072 326535 323208 320044 318111 318193 319433 320439 320908
55641C20908K40r0k38O69K010K096J054P51J369Q12j600l554l099j160N31J885
$$ 320908 321148 321058 320820 321489 323499 325595 326649 327400 328769 329581 327981 324427 321328 320168 320699 322584
55625C22584L380M495M688M485M348L697K064l3j982l758n162n820o235p425r102
$$ 322584 325964 330459 335147 339632 343980 347677 349741 349708 347726 343968 338806 332986 326751 319326 310224
55610C10224r731q840p760p614q095q531q743q467p331n691m321l220j967r00
$$ 310224 300493 291653 283893 276279 268184 259653 250910 242443 235112 229421 225100 221880 219913 219013
55596B19013n27k46O15J145K31j002o17Q63J291P03J163K651K425p18m470o359
$$ 219013 218486 218240 218855 220000 220231 219229 218612 219475 220766 221469 222632 225283 227708 226990 222520 216161
55580B16161o443n671m146k411k000l249m361m021l063k455j561K15J773J837
$$ 216161 209718 204047 199901 197490 195490 192241 187880 183859 180796 178341 176780 176995 178768 180605
55566A80605Q85K26J90J82l31j603l424m742m448k812j187l66k82q97j879j934
$$ 180605 181490 181716 181906 182088 181757 180154 176730 171988 167540 164728 163541 163175 162893 161996 160117 158183
55550A58183m21R39J45j743j934k02J070J006J105J711J123q66j883p63O12P91
$$ 158183 157762 158701 158846 157103 155169 154967 156037 157043 158148 159859 160982 160116 158233 157470 158082 158873
55534A58873R62J992K185J85k272k832j746o14K77J337K112K302K860M264N176
$$ 158873 159835 161827 164012 164197 161925 159093 157347 156733 157010 158347 160459 162761 165621 169885 175061
55519A75061M578L830M842P405R840J1145J1118R860Q588R536J3446J8399K2299
$$ 175061 179639 183469 188311 195716 205556 216701 227819 237679 246267 255803 269249 287648 309947
55506C09947K5041K7151K8264K8645L0174L3601L6325L5256L0706K5317K0138
$$ 309947 334988 362139 390403 419048 449222 482823 519148 554404 585110 610427 630565
55495F30565J4064O473j837r955j7291k2956k6269k7774k8516k8803k8629k8519
$$ 630565 644629 651102 649265 639310 622019 599063 572794 545020 516504 487701 459072 430553
55483D30553k8676k8116k6014k3234k1140j9634j7766j5638j4185j3418j2362
$$ 430553 401877 373761 347747 324513 303373 283739 265973 250335 236150 222732 210370
55472B10370j0443p938n334l314k868m272o268p188o658n443m194l206k851l360
$$ 210370 199927 191989 186655 183341 180473 176201 169933 162745 156087 150644 146450 143244 140393 137033
55458A37033m299m988n036m281k793j341r49j365j045P81K945L890L369J972J61
$$ 137033 132734 127746 122710 118429 115636 114295 113346 111981 110936 111717 114662 118552 121921 123893 124054
55443A24054j411j840j229j083k366m054m537l660k433j581j251j451j817j679
$$ 124054 122643 120803 119574 118491 116125 112071 107534 103874 101441 99860 98609 97158 95341 93662
55429I3662j003o32j102j998k858l583l755k841j616j798l574m965m507k986j714
$$ 93662 92659 92027 90925 88927 86069 82486 78731 75890 74274 72476 68902 63937 59430 56444 54730
55414E4730q15j84m60j748k860l158l548m375m105j708J142K136J336L64j61n47
$$ 54730 53915 53731 53271 51523 48663 45505 41957 37582 33477 31769 32911 35047 36383 36747 36586 36039
55398C6039m39P04K240L045K972K385J188l55r54M4J324J455R16Q23Q57K51m44
$$ 36039 35600 36304 38544 41589 44561 46946 48134 47779 46825 46869 48193 49648 50564 51387 52244 52495 52051
55381E2051l57p5n04r51k96R34J535J716K161K117O67r85j043k41p38k309k420
$$ 52051 51694 51619 51115 50164 49868 50802 52337 54053 56214 58331 58998 58013 56970 56729 55991 53682 51262
55364E1262k34K091K687K230K181K583K602J958J042L65K27L42P6m19J6J664K856
$$ 51262 51028 53119 55806 58036 60217 62800 65402 67360 68402 68767 68994 69336 69412 68993 69009 70673 73529
55347G3529K092L88k36L33O46M16P40K020L512M740N586N363L682J863J494J874
$$ 73529 75621 76009 75773 76106 76752 77168 77908 79928 83440 88180 93766 99129 102811 104674 106168 108042
55331A08042R45j491l632m568n033n277m532l064k466l300m288m387l875l045
$$ 108042 108987 107496 103864 99296 94263 88986 84454 81390 78924 75624 71336 66949 63074 60029
55317F0029j618L6Q27N45m0q17k203l270k370n7R22n81k520k815j952j162j28
$$ 60029 58411 58447 59274 59819 59779 58962 56759 53489 51119 51062 51984 51403 48883 46068 44116 42954 42826
55300D2826J790L613L799K253L4k068l457l403j931k03Q70J508J813J066p15j923
$$ 42826 44616 48229 52028 54281 54315 52247 48790 45387 43456 43253 44123 45631 47444 48510 47795 45872
55284D5872j503p38j290k455k152j59J519J447L61k24R8N82M04n56j603j845j130
$$ 45872 44369 43631 42341 39886 37734 37575 39094 40541 40902 40678 40776 41358 41762 41206 39603 37758 36628
55267C6628k13K11K60L56N01N83Q60J490J910J453L55n59j106j888l056l627k570
$$ 36628 36415 36626 36886 37242 37743 38326 39186 40676 42586 44039 44394 43835 42729 40841 37785 34158 31588
55250C1588k34J950L084L601M142M366L535J909N64j17p05j300j170l73l45j813
$$ 31588 31354 33304 36388 39989 44131 48497 52032 53941 54505 54388 53683 52383 51213 50840 50495 48682
55234D8682l226k716q21L29O7k01O45K009K667K125O97p73j284o73j04o10j384
$$ 48682 45456 42740 41919 42248 42315 42114 42759 44768 47435 49560 50257 49484 48200 47527 47423 46813 45429
55217D5429p89J090K424K152J199Q41J203J754K179K231J662P25O1j20p0K46R95
$$ 45429 44640 45730 48154 50306 51505 52346 53549 55303 57482 59713 61375 62100 62161 62041 61971 62217 63212
55200F3212J705J575N22r02k343l368k986r20R97M85k110m166m196l080j771m5
$$ 63212 64917 66492 67014 66112 63769 60401 57415 56495 57492 57977 55867 51701 47505 44425 42654 42609
55184D2609J878K633J742P04Q71J682K007J880J825J700J274Q64M58n51j852j832
$$ 42609 44487 47120 48862 49566 50437 52119 54126 56006 57831 59531 60805 61669 62127 61576 59724 57892
55168E7892J83K527L216K230O55j147l078m152l586k240j478j140k12J058J417
$$ 57892 58075 60602 63818 66048 66703 65556 62478 58326 54740 52500 51022 49882 49670 50728 52145
55153E2145P31K71Q15J725K143J972J529R98N21K38J53K43N99J106J446J632K028
$$ 52145 52876 53147 53962 55687 57830 59802 61331 62329 62850 63088 63241 63484 64083 65189 66635 68267 70295
55136G0295K314J452n99j960q99J707L250K500O07q62j523j651j292n09K82Q05
$$ 70295 72609 74061 73462 71502 70603 72310 75560 78060 78667 77805 76282 74631 73339 72830 73112 73917
55120G3917J215J552J437Q17L90O66R29O5j616k370j387k85j109l248l859j753
$$ 73917 75132 76684 78121 78938 79328 79994 80923 80988 79372 77002 75615 75330 74221 70973 67114 65361
55104F5361P75J008n95j488p97k5j71k89O08J870K242J359m78k741m272l647r05
$$ 65361 66136 67144 66549 65061 64264 64239 64068 63779 64387 66257 68499 69858 69380 66639 62367 58720 57815
55087E7815J971L145K659J461j48j917k543q60K222M251L942K267Q34l7j082k505
$$ 57815 59786 62931 65590 67051 66903 64986 62443 61583 63805 68056 71998 74265 75099 75062 73980 71475
55071G1475l296k373k39J128L67j613k680j825J54J930K635J903J45j171p22R94
$$ 71475 68179 65806 65567 66695 67062 65449 62769 60944 61098 63028 65663 67566 67711 66540 65818 66812
55055F6812K278K503K549K925L026K585K333K588K639K172J803J570M63j673l392
$$ 66812 69090 71593 74142 77067 80093 82678 85011 87599 90238 92410 94213 95783 96246 94573 91181
55040I1181l776l694l766k850k09K433K938J772R76J052R28L59J81M61L88l7l6
$$ 91181 87405 83711 79945 77095 76886 79319 82257 84029 85005 86057 86985 87344 87525 87986 88374 88337 88301
55023H8301K53o7o39J59K684N062N472M173K517J059m65j936k729k572j909j293
$$ 88301 88554 88487 87848 88007 90691 95753 101225 105398 107915 108974 108509 106573 103844 101272 99363 98070
55007I8070p91j85L83L94k54q11o47k68n03r20k71J428K682K715K386K321J830
$$ 98070 97279 97094 97477 97871 97617 96806 96159 95891 95388 94468 94197 95625 98307 101022 103408 105729 107559
54990A07559O24l5P10J655J399N70N14Q98N80j15p8L50K0n60J87J957K505R16
$$ 107559 108183 108148 108858 110513 111912 112482 112996 113894 114474 114359 114281 114631 114651 114091 114278 116235 118740 119656
54972A19656j152j950j602q66J95J504K351K450K491K835K693J465J5l00O48J731
$$ 119656 118504 116554 114952 114086 114281 115785 118136 120586 123077 125912 128605 130070 130085 129785 130433 132164
54956A32164J903J146K50r7r6n11j286j164N64K584L039K063J451J954K474K060
$$ 132164 134067 135213 135463 135366 135270 134759 133473 132309 132873 135457 138496 140559 142010 143964 146438 148498
54940A48498J095R6j106k345k644j713q64j439k984l947l612k615j834j535j446
$$ 148498 149593 149689 148583 146238 143594 141881 141017 139578 136594 132647 129035 126420 124586 123051 121605
54925A21605j231q51o46r38j573k097k185j605k48J307J761N14j193j558l95J017
$$ 121605 120374 119523 118877 117939 116366 114269 112084 110479 110231 111538 113299 113813 112620 111062 110667 111684
54909A11684K001K997M116M677M562M577M989M936L988L157L541M869O078O524
$$ 111684 113685 116682 120798 125475 130037 134614 139603 144539 148527 151684 155225 160094 166172 172696
54895A72696N957M276K147J205K534N296P530Q102P334O227N722O323P833R468
$$ 172696 178653 182929 185076 186281 188815 194111 201641 209743 217077 223304 229026 235349 243182 252650
54881B52650J0636J1354J1834J2154J2584J3617J5152J6040J4981J1658O828J616
$$ 252650 263286 274640 286474 298628 311212 324829 339981 356021 371002 382660 389488 391104
54869C91104l030o676r540j2037j4071j5174j5439j5544j5614j4912j3170j1475
$$ 391104 388074 381398 371858 359821 345750 330576 315137 299593 283979 269067 255897 244422
54857B44422j0888j0769r469o637l824k505k379k169j621j658k509k646n21L090
$$ 244422 233534 222765 213296 206659 202835 200330 197951 195782 194161 192503 189994 187348 186827 189917
54843A89917N692O077N639O233P881R400J0288J0749J0689J0135J0165J1761J3829
$$ 189917 195609 201686 207325 213558 221439 230839 241127 251876 262565 272700 282865 294626 308455
54830C08455J3961J1313P336L471l61m532q490j1524j3556j4480j3875j2192j1058
$$ 308455 322416 333729 341065 344536 344175 339643 331153 319629 306073 291593 277718 265526 254468
54817B54468j1382j2026j1401r579p785o481n150l566k028n41J116K425K205Q2
$$ 254468 243086 231060 219659 210080 202295 195814 190664 187098 185070 184529 185645 188070 190275 190357
54803A90357k720m394m236l104k336k339k475k349k635l952n284m799k400l10
$$ 190357 187637 183243 179007 175903 173567 171228 168753 166404 163769 159817 154533 149734 147334 147024
54789A47024l03j444j563k95P23M58j36K74J366J520j00k500m026m116l547l177
$$ 147024 146721 145277 143714 143419 144142 144600 144464 144738 146104 147624 147524 145024 140998 136882 133335 130158
54773A30158k992k670k459k852l601l847l269k437j873j378n69M41J259J773K170
$$ 130158 127166 124496 122037 119185 115584 111737 108468 106031 104158 102780 102211 102652 103911 105684 107854
54758A07854K553K812K708K078J028o3q14r57k51J158K175J418q44k341j341J162
$$ 107854 110407 113219 115927 118005 119033 118970 118156 117199 116948 118106 120281 121699 120855 118514 117173 118335
54742A18335K924L435L906M809N420N719O656Q118Q604P729P215Q273R666R805
$$ 118335 121259 124694 128600 133409 138829 144548 151204 159322 167926 175655 182870 191143 200809 210614
54728B10614R340J0064J2169J4316J5833J7232J8741J9779J9846J8978J7261J4682
$$ 210614 219954 230018 242187 256503 272336 289568 308309 328088 347934 366912 384173 398855
54716C98855J1390P426K600k718p078r302j0057j1061j2783j3901j3194j1096
$$ 398855 410245 417671 420271 417553 410475 401173 391116 380055 367272 353371 340177 329081
54704C29081r024p722o745n300l268j285J70J516L497N935P787Q631R398J1148
$$ 329081 320057 312335 305590 300290 297022 295737 295907 297423 300920 306855 314642 323273 332671 343819
54690C43819J3673J5835J6850J6730J5876J4771J3720J2493J0563Q035N837M623
$$ 343819 357492 373327 390177 406907 422783 437554 451274 463767 474330 482365 488202 492825
54678D92825L997L236K114N27j965n510r477j3247j6866k0192k2130k1805k0031
$$ 492825 496822 500058 502172 502699 500734 495224 485747 472500 455634 435442 413312 391507 371476
54665C71476j8415j7354j6040j4310j3058j2691j2376j1403j0377j0204j0594
$$ 371476 353061 335707 319667 305357 292299 279608 267232 255829 245452 235248 224654
54654B24654j0374r128p661o749o075m860l185j952j595j603j652k254l574m367
$$ 224654 214280 205152 197491 190742 184667 179807 176622 174670 173075 171472 169820 167566 163992 159625
54640A59625l325j198j02p13j506j079J25R93J407J842K318K616K859L069K832
$$ 159625 156300 155102 155000 154287 152781 151702 151827 152820 154227 156069 158387 161003 163862 166931 169763
54625A69763K031J319J230J534J981K851M086M741M168L004K304K449L547N760
$$ 169763 171794 173113 174343 175877 177858 180709 184795 189536 193704 196708 199012 201461 205008 210768
54611B10768Q338R512Q601P319P586Q854R125P937O682O395O715O897O457N041
$$ 210768 219106 228618 237219 244538 252124 260978 270103 278040 284722 291117 297832 304729 311186 316227
54597C16227K978J803K789N033O371O146N782O586Q275R899J0974J1558J2205
$$ 316227 319205 321008 323797 328830 335201 341347 347129 353715 361990 371889 382863 394421 406626
54584D06626J3951J7191K0547K2099K1846K1696K2753K3897K3383K0708J6312
$$ 406626 420577 437768 458315 480414 502260 523956 546709 570606 593989 614697 631009
54573F31009J0636M179k201p873j2896j7456k1306k3984k5230k5044k3749k1972
$$ 631009 641645 645824 643623 635750 622854 605398 584092 560108 534878 509834 486085 464113
54561D64113k0067j7714j4685j1868j0615j1011j1628j1055r098o419l824j951
$$ 464113 444046 426332 411647 399779 389164 378153 366525 355470 346372 339953 336129 334178
54549C34178r98o21n01q67j927l239m402n792p531q456p503n792n568p070q131
$$ 334178 333180 332559 332058 331191 329264 326025 321623 315831 308300 299844 292341 286549 280981 273911 265780
54534B65780p230n217l598k730k436k923m035m769m509l867l538l237k566j967
$$ 265780 258550 253333 249735 247005 244569 241646 237611 232842 228333 224466 220928 217691 215125 213158
54520B13158j922j969j377k17R07J566J344m8j895k618j647l32j9j65M60J441
$$ 213158 211236 209267 207890 207673 208580 210146 211490 211442 209547 206929 205282 204950 204931 204766 205226 206667
54504B06667J137p69k587k750j596n84m08l74M93K103L237K879J503N88R54K142
$$ 206667 207804 207035 204448 201698 200102 199518 199110 198736 199229 201332 204569 207448 208951 209539 210493 212635
54488B12635L474M880O310P147O821N568M167L313L574N257P779R702J0085R391
$$ 212635 216109 220989 227299 234446 241267 246835 251002 254315 257889 263146 270925 280627 290712 300103
54474C00103Q674Q399Q579R417J0950J2472J3046J2409J0886Q627N570J894j922
$$ 300103 308777 317176 325755 335172 346122 358594 371640 384049 394935 403562 409132 411026 409104
54461D09104n334p724q601q314q036q519r323r841j0367j1336j2027j1257r159
$$ 409104 403770 396046 387445 379131 371095 362576 353253 343412 333045 321709 309682 298425 289266
54448B89266p183o185n592m613l426k605k036j050N57K038K179L41k655m770m444
$$ 289266 282083 275898 270306 265693 262267 259662 257626 256576 257133 259171 261350 261691 259036 254266 249822
54433B49822k273n15o00j632j782o53O01J281K106L719N215N251M093L380L838
$$ 249822 247549 247034 246434 244802 243020 242367 242968 244249 246355 250074 255289 260540 264633 268013 271851
54418B71851M476M362L910L633K910J256n0P09L098M836M831M279M500N045M744
$$ 271851 276327 280689 284599 288232 291142 292398 292348 293057 296155 300991 305822 310101 314601 319646 324390
54403C24390L544K399J996K244K529K081O57q47j230p01q80k567m498n031m249
$$ 324390 327934 330333 332329 334573 337102 339183 339840 338993 337763 337062 336182 333615 329117 324086 319837
54388C19837l450l225l021k338j476j140j708k649k616p78J658K220O4k834m188
$$ 319837 316387 313162 310141 307803 306327 305187 303479 300830 298214 297436 299094 301314 301378 298544 294356
54373B94356m043l924m191l868k605j220l29J84K78m41j611k045j242k6P38J208
$$ 294356 290313 286389 282198 278330 275725 274505 274176 274360 274638 274197 272586 270541 269299 269273 270011 271219
54357B71219J789K207K165K275L321M838N421M550L270K744K878K989L249M439
$$ 271219 273008 275215 277380 279655 282976 287814 293235 297785 301055 303799 306677 309666 312915 317354
54343C17354O342P611P648P522Q146Q559P411N445M727N477N721M419K999K734
$$ 317354 323696 331307 338955 346477 354623 363182 370593 376038 380765 386242 391963 396382 399381 402115
54329D02115K470O39j910l013k395j839k523l987n662p487q782q278o066m103
$$ 402115 404585 405224 403314 400301 397906 396067 393544 389557 383895 376408 367626 359348 353282 349179
54315C49179l922m820n108m341l318k624k107j596j315j473j873j993j323J91
$$ 349179 345257 340437 335329 330988 327670 325046 322939 321343 320028 318555 316682 314689 313366 313557
54301C13557J861K657K155R02k35q40r28o54k42M9L90J423L413N447O127N180
$$ 313557 315418 318075 320230 321132 320897 320057 319129 318475 318233 318282 318672 320095 323508 328955 335082 340262
54285C40262L908L649M167M171L246K503K967M048M253L063J233n53k335m058
$$ 340262 344170 347819 351986 356157 359403 361906 364873 368921 373174 376237 377470 376917 374582 370524
54271C70524n152n466n883p248r091j0101r564p871n903m523m359n420o834p508
$$ 370524 365372 359906 354023 346775 337684 327583 318019 310148 304245 299722 295363 289943 283109 275601
54257B75601p157o424o078o379p070p657p727p212o287m935l014r68m0j089l387
$$ 275601 268444 262020 255942 249563 242493 234836 227109 219897 213610 208675 205661 204693 204653 203564 200177
54242B00177n023m681k810j071p43j629k538k818l051l918m820m601l408k713
$$ 200177 195154 190473 187663 186592 185849 184220 181682 178864 175813 171895 167075 162474 159066 156353
54228A56353l193l799l402k326j440p99j80j06j113k559l270l083k719k398j613
$$ 156353 153160 149361 145959 143633 142193 141394 141214 141108 139995 137436 134166 131083 128364 125966 124353
54213A24353j04J716L115L239J528j279l081k462n14M15n09k083k937k744j820
$$ 124353 124249 125965 129080 132319 133847 132568 129487 127025 126511 126926 126417 124334 121397 118653 116833
54198A16833o94n0j23j86M95J528K173K705L736M700M530L537K856K273O25j526
$$ 116833 116139 116089 115966 115780 116275 117803 119976 122681 126417 131117 135647 139184 142040 144313 144938 143412
54182A43412j932KJ983K057J110Q63J054L83r63j565r19J64R64J301J005R4p30
$$ 143412 141480 141482 143465 145522 146632 147495 148549 148932 147969 146404 145485 145649 146613 147914 148919 149013 148283
54165A48283q14n22o01q93o71K0L06l29j678l395n124o104n594l825j875n82m0
$$ 148283 147469 146947 146346 145453 144782 144802 145108 144779 143101 139706 134582 128478 122884 119059 117184 116602 116562
54148A16562n2l99p09o48k85J13M87P76N49n15j936k852l094l221l449l192j847
$$ 116562 116510 116111 115402 114754 114469 114582 115069 115845 116394 115879 113943 111091 107997 104776 101327 98135 96288
54131I6288K90K116K513J100j468l860m892m126j897O68J898P86j555k524r54
$$ 96288 96578 98694 101207 102307 100839 96979 92087 87961 86064 86732 88630 89416 87861 85337 84383
54116H4383J388K081J072J13k15j051k765l846l081j384k95J77J012K161K578
$$ 84383 85771 87852 88924 89037 88822 87771 85006 81160 78079 76695 76400 76577 77589 79750 82328
54101H2328J944J118Q07Q34R08J110J349J142L75l73o94q63j088r19n2Q45R70
$$ 82328 84272 85390 86197 87031 87939 89049 90398 91540 91915 91542 90848 89985 88897 87978 87926 88771 89741
54084H9741O26O83R74M47j000k016j620n98k06k97J91J307J869J279M54N04J221
$$ 89741 90367 91050 92024 92471 91471 89455 87835 87237 87031 86734 86925 88232 90101 91380 91834 92338 93559
54067I3559J536J051M28L61O81P02J34n49p53n27m11n50l02Q05K069K139O67j049
$$ 93559 95095 96146 96574 96935 97616 98318 98452 97903 97150 96623 96212 95662 95360 96165 98234 100373 101040 99991
54049I9991j421k97J008J232M42l22k65M82J326J872K037J842J506J526K158K782
$$ 99991 98570 98273 99281 100513 100955 100633 100368 100850 102176 104048 106085 107927 109433 110959 113117 115899
54033A15899K395R66k54j48Q70J363N80p54j253l38J114J504J88j715k560k049
$$ 115899 118294 119260 119006 118858 119728 121091 121671 120917 119664 119326 120440 121944 122132 120417 117857 115808
54017A15808j196n48M02J737K407J811Q98O16L65o73j556p92J064J912J083J4
$$ 115808 114612 114064 114466 116203 118610 120421 121319 121935 122300 121627 120071 119279 120343 122255 123338 123352
54001A23352j70J04L86J185K656L832M054L885L746K893Q88j044j409m55M04N89
$$ 123352 123182 123286 123672 124857 127513 131345 135399 139284 143030 145923 146811 145767 144358 143903 144307 144896
53985A44896O28Q38Q73M81r0m43k78M82J425J856J666J519J695J532O57J24J187
$$ 144896 145524 146362 147235 147716 147626 147183 146905 147387 148812 150668 152334 153853 155548 157080 157737 157861 159048
53968A59048L324M593M033K764K508L652N120N766N552N408N985O797O882O161
$$ 159048 162372 166965 170998 173762 176270 179922 185042 190808 196360 201768 207753 214550 221432 227593
53954B27593N548N651O128O524O956P474P449O289M289K286Q29J77M89J448K146
$$ 227593 233141 238792 244920 251444 258400 265874 273323 279612 283901 286187 287016 287193 287682 289130 291276
53939B91276J879P81o13j844k434k187j935k923m844n785m913l891m397n527n413
$$ 291276 293155 293936 293323 291479 289045 286858 284923 282000 277156 271371 266458 262567 258170 252643 247230
53924B47230m304l935m411m103k647j750k397l303l079k313k359l183l663l314
$$ 247230 242926 238991 234580 230477 227830 226080 223683 220380 217301 214988 212629 209446 205783 202469
53910B02469k679k375k472k560k119j144n08j083k438l232l003k518k164j242
$$ 202469 199790 197415 194943 192383 190264 189120 188612 187529 185091 181859 178856 176338 174174 172932
53896A72932N11J990K215J751J526J173m7j352j058R61K942L562L352L346L503
$$ 172932 173443 175433 177648 179399 180925 182098 182051 180699 179641 180602 183544 187106 190458 193804 197307
53881A97307L246K712K505K671K807L088M197O062P347O760M544K292J433K259
$$ 197307 200553 203265 205770 208441 211248 214336 218533 224595 231942 238702 243246 245538 246971 249230
53867B49230M098N829O277M912K632J304J898L255L414K046Q94J545L313L958
$$ 249230 253328 259157 265434 270346 272978 274282 276180 279435 282849 284895 285789 287334 290647 294605
53853B94605K329k30j295Q4K602M358M830M947N561O484P038O931O393N861N759
$$ 294605 296934 296704 295409 295493 298095 302453 307283 312230 317791 324275 331313 338244 344637 350498 356257
53838C56257O267P014P516P828Q330Q690P927N995M346M119M536M089K763J769
$$ 356257 362524 369538 377054 384882 393212 401902 409829 415824 420170 424289 428825 432914 435677 437446
53824D37446J455R16k14j052r53p05j471l272n045n804n449m882n400p281r080
$$ 437446 438901 439817 439603 438551 437598 436893 435422 432150 427105 421301 415852 410970 405570 398289 389209
53809C89209r170q092q019r526j0412q780n931m638n376o110n544m710m980o106
$$ 389209 380039 371947 363928 354402 343990 335210 329279 324641 319265 313155 307611 302901 297921 291815
53795B91815o923o889o108m813l581l251l808m013l098k095k369l429l640k861
$$ 291815 284892 278003 271895 267082 263501 260250 256442 252429 249331 247236 244867 241438 237798 234937
53781B34937k713l935n182n103m208l580l009j763l13K81J08rk61j442k965l052
$$ 234937 232224 228289 223107 218004 213796 210216 207207 205444 205131 205412 205520 205511 205250 203808 200843 197791
53765A97791j294O36J320J125Q13K29p25j303j135j049j449j234L33J782J302
$$ 197791 196497 197133 198453 199578 200391 200620 199895 198592 197457 196408 194959 193725 194058 195840 197142
53750A97142l94r80J03J045N43m46l50R35K094J935N61n17L16K876N042N295M679
$$ 197142 196748 195768 195871 196916 197459 197013 196663 197598 199692 201627 202188 201671 201987 204863 209905 215200 219879
53733B19879N099O506P272O881O398O402O335N959N734N464M486L512M318O922
$$ 219879 224978 231484 238756 245637 252035 258437 264772 270731 276465 281929 286415 289927 294245 301167
53719C01167Q981Q972Q149Q122Q226O934M551K749K227K358K493K240J090q05
$$ 301167 310148 319120 327269 335391 343617 350551 355102 357851 360078 362436 364929 367169 368259 367454
53705C67454k101j893j391k408m582n783n213m414m862o054o673o419n868n278
$$ 367454 365353 363460 362069 359661 355079 349296 344083 339669 334807 328753 322080 315661 309793 304515
53691C04515m471l491k651j963j079L7P64L81r81k252k578k360k693l773m605
$$ 304515 300044 296553 293902 291939 290860 290897 291661 292042 291061 288809 286231 283871 281178 277405 272800
53676B72800m417l622k875k000n86Q69J364P33k37r69j535j931j702p03L24M38
$$ 272800 268383 264761 261886 259886 259300 260169 261533 262266 262029 261060 259525 257594 255892 255189 255513 255951
53660B55951m57j459j525m34J025J749J265j2j324k191k525k424k051j599j207
$$ 255951 255494 254035 252510 252076 253101 254850 256115 256103 254779 252588 250063 247639 245588 243989 242782
53645B42782r88j004j077q21j41N27Q60J222J928K336J534j09j116o93O46K254
$$ 242782 241794 240790 239713 238892 238751 239278 240138 241360 243288 245624 247158 247049 245933 245240 245886 248140
53629B48140L879M801M000J961R75K372M499M783L063J427J242J882K307K404
$$ 248140 252019 256820 260820 262781 263756 266128 270627 275410 278473 279900 281142 283024 285331 287735
53615B87735K477K554K721L340M355M848L848J479r30j906j047P05K092K763L161
$$ 287735 290212 292766 295487 298827 303182 308030 311878 313357 312427 310521 309474 310179 312271 315034 318195
53600C18195L403K921J438l34j430j605j265r28r98j566k171k181j563o29Q81
$$ 318195 321598 324519 325957 325623 324193 322588 321323 320395 319397 317831 315660 313479 311916 311287 312168
53585C12168L382N914O494M502J613l97j404j852j564q36j090k767l834k375L56
$$ 312168 315550 321464 327958 332460 334073 333676 332272 330420 328856 328020 326930 324163 320329 317954 318310
53570C18310J548P76J14P49J760K225K301J875K44k172l452k350J96K296K878
$$ 318310 319858 320634 320748 321497 323257 325482 327783 329658 329902 327730 324278 321928 322124 324420 327298
53555C27298K109J093J255K932M553M434L120K552L178L736L801M359N512N830
$$ 327298 329407 330500 331755 334687 339240 343674 346794 349346 352524 356260 360061 364420 369932 375762
53541C75762M841M153M921N982N844M975M688M970M885M306L889M002M672N916
$$ 375762 380603 384756 389677 395659 401503 406478 411166 416136 421021 425327 429216 433218 437890 443806
53527D43806P242P612O784N872N791O034N767N116M459L496K168J484K242L636
$$ 443806 451048 458660 465444 471316 477107 483141 488908 494024 498483 501979 504147 505631 507873 511509
53513E11509M328M161L645K632Q76o80p09O48J991K453K243J713R57K83N7K17
$$ 511509 515837 519998 523643 526275 527151 526471 525762 526410 528401 530854 533097 534810 535767 536050 536107 536324
53497E36324N66J142J654J246j74j079q4J889K533J043j067j903q93J256L192
$$ 536324 536890 538032 539686 540932 540758 539679 539595 541484 544017 545060 543993 542090 541197 542453 545645
53482E45645L624K457J250J578L080M084L963L747M445N866P269Q113Q039P018
$$ 545645 549269 551726 552976 554554 557634 561718 565681 569428 573873 579739 587008 595121 603160 610178
53468F10178N864N822P320R586J1419J2017J1342J0370J0552J2276J4233J5217
$$ 610178 616042 621864 629184 638770 650189 662206 673548 683918 694470 706746 720979 736196
53456G36196J5898J7668K0204K1755K1659K1079K1222K2238K3980K6302K8298
$$ 736196 752094 769762 789966 811721 833380 854459 875681 897919 921899 948201 976499
53445I76499K8828K8318K8638L0611L3026L4730L6273L8556M1145M3072M4369
$$ 976499 1005327 1033645 1062283 1092894 1125920 1160650 1196923 1235479 1276624 1319696 1364065
53434A364065M5648M6795M7252M7039M6691M6615M7168M8653N0445N0920M9442
$$ 1364065 1409713 1456508 1503760 1550799 1597490 1644105 1691273 1739926 1790371 1841291 1890733
53423A890733M7801M8267N0559N2147N1684N0642N0907N2017N2011N0510M9418
$$ 1890733 1938534 1986801 2037360 2089507 2141191 2191833 2242740 2294757 2346768 2397278 2446696
53412B446696N0195N1555N1051M8369M5670M4371M3126L9989L5330L1130K8002
$$ 2446696 2496891 2548446 2599497 2647866 2693536 2737907 2781033 2821022 2856352 2887482 2915484
53401B915484K4888K1415J8639J7022J5621J4035J3455J4429J4980J2614P433
$$ 2915484 2940372 2961787 2980426 2997448 3013069 3027104 3040559 3054988 3069968 3082582 3090015
53390C090015J813k576o096r705j3527j6975j9550k1459k3845k7949l3428l8011
$$ 3090015 3091828 3089252 3083156 3073451 3059924 3042949 3023399 3001940 2978095 2950146 2916718 2878707
53378B878707l9815l9627l9874m1702m4130m5853m6637m6719m6143m5125m4276
$$ 2878707 2838892 2799265 2759391 2717689 2673559 2627706 2581069 2534350 2488207 2443082 2398806
53367B398806m3900m3651m3125m2278m1006l9053l6604l4292l2194k9383k5165
$$ 2398806 2354906 2311255 2268130 2225852 2184846 2145793 2109189 2074897 2042703 2013320 1988155
53356A988155k0353j6534j4249j2454r852o235k229J846O249J1019J5490J9142
$$ 1988155 1967802 1951268 1937019 1924565 1914713 1908478 1906249 1908095 1914344 1925363 1940853 1959995
53344A959995K2560K6917L2493L8332M3467M7716N1031N3030N3909N5147N8135
$$ 1959995 1982555 2009472 2041965 2080297 2123764 2171480 2222511 2275541 2329450 2384597 2442732
53333B442732O2459O6372O8989P1021P3430P6405P9884Q4035Q8540R2148R3840
$$ 2442732 2505191 2571563 2640552 2711573 2785003 2861408 2941292 3025327 3113867 3206015 3299855
53322C299855R4210R5138R8106J03015J08458J12759J14921J15062J14250J13845
$$ 3299855 3394065 3489203 3587309 3690324 3798782 3911541 4026462 4141524 4255774 4369619
53312D369619J14697J16484J17591J16084J11516J05749J01291R8646R5928R1275
$$ 4369619 4484316 4600800 4718391 4834475 4945991 5051740 5153031 5251677 5347605 5438880
53302E438880Q4922P8371P2237O5871N8759N1336M4160L7205L0345K3882J7952
$$ 5438880 5523802 5602173 5674410 5740281 5799040 5850376 5894536 5931741 5962086 5985968 6003920
53291F003920J1828M508m037j2838k1193k9397l8050m7188n6600o6573p7651q9649
$$ 6003920 6015748 6020256 6016219 6003381 5982188 5952791 5914741 5867553 5810953 5744380 5666729 5577080
53279E577080j01364j11391j18899j23807j26711j28744j30861j32846j33409
$$ 5577080 5475716 5364325 5245426 5121619 4994908 4866164 4735303 4602457 4469048
53270D469048j31722j28691j26208j25188j24763j23413j20560j16903j13442
$$ 4469048 4337326 4208635 4082427 3957239 3832476 3709063 3588503 3471600 3358158
53261C358158j10555j08020j05476j02603r9006r4437q9175q3720p8048p1751
$$ 3358158 3247603 3139583 3034107 2931504 2832498 2738061 2648886 2565166 2487118 2415367
53251B415367o5159n9509n5235n0893m4828l7517l0994k6209k2260j8237j4236
$$ 2415367 2350208 2290699 2235464 2184571 2139743 2102226 2071232 2045023 2022763 2004526 1990290
53240A990290j0236n635o03L508O104Q263J0760J2588J2922J3169J5228J8602
$$ 1990290 1980054 1974419 1973816 1977324 1983428 1991691 2002451 2015039 2027961 2041130 2056358 2074960
53228B074960K1277K2955K5239K8758L2216L4618L6581L8865M1258M3460M5696
$$ 2074960 2096237 2119192 2144431 2173189 2205405 2240023 2276604 2315469 2356727 2400187 2445883
53217B445883M7810M9178N0107N1890N4592N6272N5373N2693M9798M6798M3207
$$ 2445883 2493693 2542871 2592978 2644868 2699460 2755732 2811105 2863798 2913596 2960394 3003601
53206C003601L9998L8776L9125L8548L5455L0962K7272K5227K4040K2709K0913
$$ 3003601 3043599 3082375 3121500 3160048 3195503 3226465 3253737 3278964 3303004 3325713 3346626
53195C346626J8688J5884J2217P709K741k436p987j4037k0192k5934l1359l6960
$$ 3346626 3365314 3381198 3393415 3401124 3403865 3401429 3393442 3379405 3359213 3333279 3301920 3264960
53183C264960m2741m8114n2776n7005o1162o5358o9743p4239p7878p9234p7965
$$ 3264960 3222219 3174105 3121329 3064324 3003162 2937804 2868061 2793822 2715944 2636710 2558745
53172B558745p5354p3053p1727p1033p0311o9079o7474o6185o5401o4129o1637
$$ 2558745 2483391 2410338 2338611 2267578 2197267 2128188 2060714 1994529 1929128 1864999 1803362
53161A803362n9232n8971o0516o1162n9516n7211n5999n5117n3023n0079m7625
$$ 1803362 1744130 1685159 1624643 1563481 1503965 1446754 1390755 1335638 1282615 1232536 1184911
53150A184911m5607m2975l9621l6150l2613k9145k6902k6409k5825k3076j9169
$$ 1184911 1139304 1096329 1056708 1020558 987945 958800 931898 905489 879664 856588 837419
53139H37419j7097j7703j8955j9222j8788j7918j6013j3459j2039j2425j3045
$$ 837419 820322 802619 783664 764442 745654 727736 711723 698264 686225 673800 660755
53128F60755j2462j1174j0256r817r864j0908j2588j3220j2033j0473r979r908
$$ 660755 648293 637119 626863 617046 607182 596274 583686 570466 558433 547960 537981 528073
53116E28073r171q560r504j1441j2340j1486r972q679p447o346o222p449q981
$$ 528073 518902 510342 500838 489397 477057 465571 455599 446920 439473 433127 426905 419456 410475
53103D10475r223p544m897l127l342m833n891n786n233m803m057k784j862k004
$$ 410475 401252 393708 388811 385684 382342 377509 371618 365832 360599 355796 351739 348955 347093 345089
53089C45089k666l201m046n520o536n850l867j847j66J139J063j084l576l627
$$ 345089 342423 339222 335176 329656 323120 317270 313403 311556 311390 312529 313592 312508 308932 305305
53075C05305r23J984K952K203Q60m66j238q58K01N62j31p29n32k81n32o33j63
$$ 305305 304382 306366 309318 311521 312381 311915 310677 309819 310020 310582 310451 309722 309190 308909 308377 307744 307581
53058C07581J08j30M49K792N373N821M063K263K021L105M767O708Q494R327R067
$$ 307581 307689 307559 308008 310800 316173 321994 326057 328320 330341 333446 338213 344921 353415 362742 371809
53043C71809Q630Q831R315R005P381M926K564Q10n16j794l003l853m496n516o948
$$ 371809 380439 389270 398585 407590 414971 419897 422461 423271 422755 420961 417958 414105 409609 404093 397145
53028C97145p830p276n678m414m424n498o723p309p242p343q397r921j0321q788
$$ 397145 389315 382039 376361 371947 367523 362025 355302 347993 340751 333408 325011 315090 304769 295981
53014B95981o497n282n487n977n947n649n320m580l386k645l143m278m644l710
$$ 295981 289484 284202 278715 272738 266791 261142 255822 251242 247856 245211 242068 237790 233146 229436
53000B29436k304j473j359j420j220o85Q3P74P34m71k181k921k134j090j413k916
$$ 229436 227132 225659 224300 222880 221660 220975 221058 221832 222566 222095 219914 216993 214859 213769 212356 209440
52984B09440l880l374k292j772j710j458j074q68n13L12Q78J38j633l126l797
$$ 209440 205560 202186 199894 198122 196412 194954 193880 193012 192499 192811 193689 193827 192194 189068 185271
52969A85271m162m264l267j139N33M15p93j554j816k757m470n339m208k126j171
$$ 185271 181109 176845 173578 172439 172972 173387 172594 171040 169224 166467 161997 156658 152450 150324 149153
52954A49153j974l234l476k578j534j189j593k255k555k015n86J053J804J100
$$ 149153 147179 143945 140469 137891 136357 135168 133575 131320 128765 126750 126164 127217 129021 130121
52940A30121m10j393j042L18J845K990L584L439K407Q43l48m61L73J412K004J807
$$ 130121 129711 128318 127276 127594 129439 132429 136013 139452 141859 142702 142354 141893 142266 143678 145682 147489
52924A47489O24j339l071l243j600O06J997K484K746K861K306J242O32R35J598
$$ 147489 148113 146774 143703 140460 138860 139466 141463 143947 146693 149554 151860 153102 153734 154669 156267
52909A56267K177L072M489N603N482M310K941J767Q25N70J581L691O173Q505J0315
$$ 156267 158444 161516 166005 171608 177090 181400 184341 186108 186933 187503 189084 192775 198948 207453 217768
52894B17768J1014J0409R304Q347O866M131J428J015K798M024K943R25k53j277
$$ 217768 228782 239191 248495 256842 263708 267839 269267 270282 273080 277104 280047 280972 280719 279442
52880B79442l635o407p174n756m662n471o748o488n096m588n707p101p303o374
$$ 279442 275807 269400 262226 256470 251808 246337 239589 233101 228005 223417 217710 210609 203306 196932
52866A96932n439n157n145m748l961l326l066k754k060j412j493k319l244l685
$$ 196932 191493 186336 181191 176443 172482 169156 166090 163336 161276 159864 158371 156052 152808 149123
52852A49123l426k516j454j170k021l006k872j924j648k380k635j373K55N32l36
$$ 149123 145697 143181 141727 140557 138536 135530 132658 130734 129086 126706 124071 122698 122953 123485 123149
52837A23149p18j34R4j031k690l462l133k542k146j635p41J85O17M35o1m59m98
$$ 123149 122431 122297 122391 121360 118670 115208 112075 109533 107387 105752 105011 105196 105813 106248 106187 105728 105230
52820A05230k52j23l07k90O41K135K660J334n59r21M03J403Q09j80Q7J088J073
$$ 105230 104978 104855 104548 104258 104899 107034 109694 111028 110469 109548 109951 111354 112163 111983 112070 113158 114231
52803A14231k3m41N55J548J199J42k18L47J155J905K582K753K093J156O98N83
$$ 114231 114208 113767 114322 115870 117069 117211 116993 117340 118495 120400 122982 125735 127828 128984 129682 130265
52787A30265L78N48J834L703M701M424L956M220M963N753O882Q557R979J0043
$$ 130265 130643 131191 133025 136728 141429 145853 149809 154029 158992 164745 171627 180184 190163 200206
52773B00206Q680P031O300O644P058O445M874L551L290L476L089K064Q23q67l201
$$ 200206 208886 215917 222217 228861 235919 242364 247238 250789 254079 257555 260644 262708 263531 262664 259463
52758B59463m979m742l261l019m698o086n470m149m151n018m892l727l205l826
$$ 259463 254484 249742 246481 243462 238764 232678 227208 223059 218908 213890 208998 205271 202066 198240
52744A98240m233l608k897l067l615l550k905k575l208m646n994o192m979l343
$$ 198240 194007 190399 187502 184435 180820 177270 174365 171790 168582 163936 157942 151750 146771 143428
52730A43428k383j963j289m71l56r29j208r55j126k143l056l045k594k392k103
$$ 143428 141045 139082 137793 137322 136966 136037 134829 133874 132748 130605 127549 124504 121910 119518 117415
52715A17415j223q3Q87J973L129L129J226j100j649m18O36O00N50J195J510N88
$$ 117415 116192 116109 116996 118969 122098 125227 126453 125353 123704 123286 123922 124522 125072 126267 127777 128365
52699A28365n45k78J240K384K189J120q7j273k403l153l267k924k535k360k416
$$ 128365 127820 127542 128782 131166 133355 134475 134388 133115 130712 127559 124292 121368 118833 116473 114057
52684A14057k513k371j863j119l71J59J08q00k023k232q10R62J076p54k703k984
$$ 114057 111544 109173 107310 106191 105820 105979 106087 105287 103264 101032 100222 101184 102260 101506 98803 95819
52668I5819j593L72K085L142L212K528K057K249K091N68j403j890o86L99J90n13
$$ 95819 94226 94598 96683 99825 103037 105565 107622 109871 111962 112530 111127 109237 108551 108950 109140 108627
52652A08627p69r91j490j108J049L439L725K111J096J837K791K519J923K541L962
$$ 108627 107858 106867 105377 104269 105318 108757 112482 114593 115689 117526 120317 122836 124759 127300 131262
52637A31262M500L664K447J551P72J89O20K406M590N927O112N558M489L045J987
$$ 131262 135762 139426 141873 143424 144196 144385 145005 147411 152001 157928 164040 169598 174087 177132 179119
52622A79119K411M421O606P283O110M124K465J382M67o11j781k669k893k508k208
$$ 179119 181530 185951 192557 199840 205950 210074 212539 213921 214388 213777 211996 209327 206434 203926 201718
52607B01718k768m121n383n908n810n334m381l158k575l157m010l850k810k227
$$ 201718 198950 194829 189446 183538 177728 172394 168013 164855 162280 159123 155113 151263 148453 146226
52593A46226k710l486l762l723l682l245k027n93k2p38k192l353l330j986k74
$$ 146226 143516 140030 136268 132545 128863 125618 123591 122998 122976 122238 120046 116693 113363 111377 111103
52578A11103M91p1j121j809k141k322k091j279m79l21l72M37K302M033M223K674
$$ 111103 111594 111523 110402 108593 106452 104130 102039 100760 100281 99960 99588 100025 102327 106360 110583 113257
52562A13257O00m12K25J615K355J925R03m9p53j169j247j390k241l496l740k189
$$ 113257 113857 113445 113670 115285 117640 119565 120468 120419 119666 118497 117250 115860 113619 110123 106383 104194
52546A04194oR34J24j312k170k068j182J45J381K059K101J693R53L0q35j517j943
$$ 104194 104188 105122 105246 103934 101764 99696 98514 98659 100040 102099 104200 105893 106846 106876 106041 104524 102581
52529A02581j747o29O55P58k92p12N48K064K052J116J126K015J823r2j980k261
$$ 102581 100834 100205 100860 101618 101326 100614 101162 103226 105278 106394 107520 109535 111358 111266 109286 107025
52513A07025j356l71M28R81Q27N3k48M80J197Q82J80L88J454K202K040J338M50
$$ 107025 105669 105298 105726 106707 107534 107587 107339 107819 109016 109898 110078 110466 111920 114122 116162 117500 117950
52496A17950n51j350j514j126n89j4N52P02L23L62J748L582L653J251j541k143
$$ 117950 117399 116049 114535 113409 112820 112806 113358 114060 114383 114745 116493 120075 123728 124979 123438 121295
52480A21295m13J517K034J658J713K276K245J150q0l86Q1N03P06J020J175M73
$$ 121295 120882 122399 124433 126091 127804 130080 132325 133475 133395 133009 133090 133593 134299 135319 136494 136967
52464A36967q39j452p71J54J42m17l07N93J160O69k87p24l60K93N16n3j054j516
$$ 136967 136128 134676 133905 134059 134201 133784 133477 134070 135230 135899 135612 134888 134528 134821 135337 135284 134230 132714
52446A32714p72O76J579J299M11j79k69k08l3P51K239L394K894R07o02j0J856
$$ 132714 131942 132618 134197 135496 135907 135728 135459 135251 135218 135969 138208 141602 144496 145403 144801 144791 146647
52429A46647K634J431j86m69M06J249J776K476L092K709J354K99N03J552K437
$$ 146647 149281 150712 150526 150057 150463 151712 153488 155964 159056 161765 163119 163418 163921 165473 167910
52414A67910K668K348J741J121O51K33j79j93M67J019J46k169m108l930j943Q3
$$ 167910 170578 172926 174667 175788 176439 176672 176493 176300 176767 177786 177932 175763 171655 167725 165782 165865
$$ [...]
##END NTUPLES=NMR SPECTRUM
##END=
