##TITLE=coffee_type ROVE100D-Feb24
COFFEE_meoh_noesyp64 COFFEE_meoh {C:\Bruker\TOPSPIN} Administrator 2
##JCAMPDX= 6.0         $$ Bruker NMR JCAMP-DX V2.0
##DATA TYPE= NMR SPECTRUM
##DATA CLASS= NTUPLES
##ORIGIN= Bruker BioSpin GmbH
##OWNER= Administrator
$$ 1.72 TOPSPIN		Version 2.1
$$ 2012-05-18 15:46:19.276 -0700  Administrator@X
$$ Compression mode = diff/dup
##.OBSERVE FREQUENCY= 400.13188235
##.OBSERVE NUCLEUS= ^1H
##.ACQUISITION MODE= SIMULTANEOUS (DQD)
##.ACQUISITION SCHEME= undefined
##.AVERAGES= 64
##.DIGITISER RES= 22
##SPECTROMETER/DATA SYSTEM= spect
##.PULSE SEQUENCE= noesygpps1d.comp
##.SOLVENT NAME= COFFEE_meoh
##.SHIFT REFERENCE= INTERNAL, COFFEE_meoh, 1, 14.98061
##AUDIT TRAIL= $$ (NUMBER, WHEN, WHO, WHERE, PROCESS, VERSION, WHAT)
$$ ##TITLE= Audit trail, TOPSPIN		Version 2.1
$$ ##JCAMPDX= 5.01
$$ ##ORIGIN= Bruker BioSpin GmbH
$$ ##OWNER= Administrator
$$ $$ C:\Bruker\TOPSPIN/data/Administrator/nmr/12-COFFEE-2402/42/pdata/1/auditp.txt
$$ ##AUDIT TRAIL=  $$ (NUMBER, WHEN, WHO, WHERE, PROCESS, VERSION, WHAT)
(   1,<2012-02-24 19:30:28.578 -0500>,<Administrator>,<TOPSPIN>,<go>,<TOPSPIN 2.1>,
      <created by zg
	started at 2012-02-24 19:18:58.375 -0500,
	POWCHK enabled, PULCHK disabled,
       configuration hash MD5:
       B0 76 FB 9C 50 81 44 7D 18 B3 26 32 4E 60 AD 96
       data hash MD5: 64K
       EE 39 5F 8C 74 52 63 9A F7 6C 87 57 75 7B 50 CC>)
(   2,<2012-02-24 19:30:31.469 -0500>,<Administrator>,<TOPSPIN>,<proc1d>,<TOPSPIN 2.1>,
      <Start of raw data processing
       efp LB = 0.3 FT_mod = 6 PKNL = 1 PHC0 = 0 PHC1 = 0 SI = 128K 
       data hash MD5: 128K
       57 7C D7 FC CD 00 94 72 8D 40 85 C0 66 BD 64 75>)
(   3,<2012-02-24 19:30:32.734 -0500>,<Administrator>,<TOPSPIN>,<proc1d>,<TOPSPIN 2.1>,
      <pk PHC0 = 18.4845 PHC1 = 0 
       data hash MD5: 128K
       28 89 7D F9 FA 45 6B AC 40 23 7D 67 09 09 AF 5E>)
(   4,<2012-02-24 19:30:33.187 -0500>,<Administrator>,<TOPSPIN>,<proc1d>,<TOPSPIN 2.1>,
      <abs ABSG = 1 
       data hash MD5: 128K
       74 91 33 06 A8 4F 1F 5D A0 F7 34 D0 81 94 15 20>)
(   5,<2012-02-24 19:30:33.281 -0500>,<Administrator>,<TOPSPIN>,<proc1d>,<TOPSPIN 2.1>,
      <abs ABSG = 2 
       data hash MD5: 128K
       12 96 D9 67 74 40 10 90 2C 85 56 E2 68 9D 7B A7>)
(   6,<2012-02-24 19:30:33.328 -0500>,<Administrator>,<TOPSPIN>,<proc1d>,<TOPSPIN 2.1>,
      <abs ABSG = 3 
       data hash MD5: 128K
       F4 92 CF 86 A6 BD AE DD FA 27 90 A4 EB 2F 5F 84>)
(   7,<2012-02-24 19:30:33.391 -0500>,<Administrator>,<TOPSPIN>,<proc1d>,<TOPSPIN 2.1>,
      <abs ABSG = 4 
       data hash MD5: 128K
       7F E5 07 68 F7 12 8E 7B 94 A4 93 57 E5 76 AE 4F>)
(   8,<2012-02-24 19:30:33.453 -0500>,<Administrator>,<TOPSPIN>,<proc1d>,<TOPSPIN 2.1>,
      <abs ABSG = 5 
       data hash MD5: 128K
       8E 6A B5 DF AD 68 85 D2 C4 8C CC F1 99 32 D0 89>)
(   9,<2012-02-24 19:30:33.578 -0500>,<Administrator>,<TOPSPIN>,<audit>,<TOPSPIN 2.1>,
      <user comment:
       ICON-NMR User ID: Administrator
$$ [...]
150 150 150 150 150 150 150 150
##$TP07= 0
##$TPNAME0= <>
##$TPNAME1= <>
##$TPNAME2= <>
##$TPNAME3= <>
##$TPNAME4= <>
##$TPNAME5= <>
##$TPNAME6= <>
##$TPNAME7= <>
##$TPOAL= (0..7)
0.5 0.5 0.5 0.5 0.5 0.5 0.5 0.5
##$TPOFFS= (0..7)
0 0 0 0 0 0 0 0
##$TUNHIN= 0
##$TUNHOUT= 0
##$TUNXOUT= 0
##$USERA1= <user>
##$USERA2= <user>
##$USERA3= <user>
##$USERA4= <user>
##$USERA5= <user>
##$V9= 5
##$VALIST= <valist>
##$VCLIST= <CCCCCCCCCCCCCCC>
##$VD= 0
##$VDLIST= <DDDDDDDDDDDDDDD>
##$VPLIST= <PPPPPPPPPPPPPPP>
##$VTLIST= <TTTTTTTTTTTTTTT>
##$WBST= 1024
##$WBSW= 4
##$XGAIN= (0..3)
0 0 0 0
##$XL= 0
##$YL= 0
##$YMAX_a= 11745485
##$YMIN_a= -6562770
##$ZGOPTNS= <>
##$ZL1= 120
##$ZL2= 120
##$ZL3= 120
##$ZL4= 120
##$ABSF1= 14.98061
##$ABSF2= -5.57192
##$ABSG= 5
##$ABSL= 3
##$ALPHA= 0
##$AQORDER= 0
##$ASSFAC= 0
##$ASSFACI= 0
##$ASSFACX= 0
##$ASSWID= 0
##$AUNMP= <proc_prof1d_extract>
##$AXLEFT= 0
##$AXNAME= <>
##$AXNUC= <1H>
##$AXRIGHT= 0
##$AXTYPE= 0
##$AXUNIT= <>
##$AZFE= 0.1
##$AZFW= 0.1
##$BCFW= 0
##$BC_mod= 0
##$BYTORDP= 0
##$COROFFS= 0
##$CY= 15
##$DATMOD= 1
##$DC= 0
##$DFILT= <>
##$DTYPP= 0
##$F1P= 0
##$F2P= 0
##$FCOR= 0.5
##$FTSIZE= 131072
##$FT_mod= 6
##$GAMMA= 0
##$GB= 0
##$INTBC= 1
##$INTSCL= 1
##$ISEN= 128
##$LB= 0.3
##$LEV0= 0
##$LPBIN= 0
##$MAXI= 10000
##$MC2= 0
##$MEAN= 0
##$ME_mod= 0
##$MI= 0
##$NCOEF= 0
##$NC_proc= -3
##$NLEV= 6
##$NOISF1= 0
##$NOISF2= 0
##$NSP= 0
##$NTH_PI= 0
##$NZP= 0
##$OFFSET= 14.98061
##$PC= 1
##$PHC0= 18.4845
##$PHC1= 0
##$PH_mod= 1
##$PKNL= yes
##$PPARMOD= 0
##$PPDIAG= 0
##$PPIPTYP= 0
##$PPMPNUM= 2147483647
##$PPRESOL= 1
##$PSCAL= 4
##$PSIGN= 0
##$PYNMP= <proc.py>
##$REVERSE= no
##$SF= 400.13
##$SI= 131072
##$SIGF1= 0
##$SIGF2= 0
##$SINO= 400
##$SIOLD= 131072
##$SPECTYP= <>
##$SREGLST= <1H.CDCl3>
##$SSB= 0
##$STSI= 131072
##$STSR= 0
##$SW_p= 8223.68421052632
##$SYMM= 0
##$S_DEV= 0
##$TDeff= 65536
##$TDoff= 0
##$TI= <>
##$TILT= no
##$TM1= 0
##$TM2= 0
##$TOPLEV= 0
##$USERP1= <user>
##$USERP2= <user>
##$USERP3= <user>
##$USERP4= <user>
##$USERP5= <user>
##$WDW= 1
##$XDIM= 131072
##$YMAX_p= 474449070
##$YMIN_p= -269025298
##$CURPLOT= <Network HP LaserJet P1505>
##$CURPRIN= <$Network HP LaserJet P1505>
##$DFORMAT= <normdp>
##$LAYOUT= <+/1D_H.xwp>
##$LFORMAT= <normlp>
##$PFORMAT= <normpl>
##$SURQMSG= 1
$$ End of Bruker specific parameters
$$ ---------------------------------
##NTUPLES= NMR SPECTRUM
##VAR_NAME=  FREQUENCY,     SPECTRUM/REAL,   SPECTRUM/IMAG
##SYMBOL=    X,             R,               I
##VAR_TYPE=  INDEPENDENT,   DEPENDENT,       DEPENDENT
##VAR_FORM=  AFFN,          ASDF,            ASDF
##VAR_DIM=   131072,        131072,          131072
##UNITS=     HZ,            ARBITRARY UNITS, ARBITRARY UNITS
##FACTOR=    0.0627417313425165, 1,          1
##FIRST=     8223.62146879498, -1045,        -83360
##LAST=      0,             1412,            -83268
##MIN=       0,             -269025298,      0
##MAX=       8223.62146879498, 474449070,    0
$$ Real data points
##PAGE= N=1
##DATA TABLE= (X++(R..R)), XYDATA
$$ [...]
67207 159524 160488 160753 161371 163125 165644 168022 169828 171349 173125 175409 177825 179526 179950 179548 179379 179904
67191 179904 180562 180723 180479 180037 178979 177035 175329 175745 178799 182990 186677 189830 193283 196895 199384
67176 199384 199871 198795 197217 195751 194427 193225 192499 192884 194732 197525 200134 202027 203948 206801 210034
67161 210034 211950 211776 210622 209884 209494 208641 207789 208767 212528 217632 221533 222986 222783 222504 223198 225124
67145 225124 227982 231006 233212 234106 234195 234600 236067 238424 241011 243567 246483 249996 253234 254603 253584
67130 253584 251878 252008 254662 258068 260243 261111 261816 262745 263436 264175 266268 270186 274446 277176 278246 279047
67114 279047 280525 282363 284136 286276 289352 292842 295368 296204 296115 296453 297680 299149 300265 301324 303021
67099 303021 305599 308938 313015 317534 321367 323390 324132 325638 329135 333505 336677 337909 337972 337645 337179
67084 337179 337136 338633 342258 347228 351994 355438 357512 359169 361668 365445 369535 372587 374623 377186 381457
67069 381457 386769 391531 395179 398614 402763 407354 411281 413763 414997 415953 417864 421702 427656 434818
67055 434818 441513 446256 448663 449575 450458 452628 456668 462069 467482 471774 475058 478398 482396 486500 489890
67040 489890 492495 494726 496757 498847 502065 507678 515587 524079 531505 537707 543456 548988 553677 557053
67026 557053 559647 562689 567140 573056 579692 586099 591654 596291 600513 605154 610756 616991 622902 627853
67012 627853 631938 635399 638269 641021 644852 650438 656751 662219 667088 673467 682620 693097 702216 708881
66998 708881 714405 721000 730004 741126 752770 763157 771612 778789 785570 792129 798400 805019 813095
66985 813095 823042 833971 844342 853078 860281 867068 874630 883267 892421 901610 910970 920674 930342 939459
66971 939459 948183 957391 967964 980077 992829 1004528 1013992 1021958 1030685 1041657 1054194 1066797
66959 1066797 1079071 1091418 1103504 1114443 1124477 1135161 1147620 1161646 1176767 1193023 1210082
66948 1210082 1226641 1241602 1255233 1268431 1281495 1294475 1308136 1323460 1340348 1357850 1375637
66937 1375637 1394359 1414409 1435278 1456280 1477024 1496787 1514383 1529523 1543846 1559724 1578095
66926 1578095 1597965 1617959 1637751 1657910 1678879 1700497 1722373 1744431 1766915 1789866 1812764
66915 1812764 1834966 1856579 1878651 1902293 1927670 1953870 1979604 2004101 2027809 2052309 2079005
66904 2079005 2107520 2135895 2162847 2189382 2217499 2247788 2279181 2310786 2342818 2375504 2408170
66893 2408170 2440031 2471273 2502835 2535527 2569680 2605175 2641417 2677689 2713747 2749658 2785073
66882 2785073 2819554 2853909 2890034 2928629 2967946 3005795 3042120 3078434 3115386 3152330 3189148
66871 3189148 3226872 3266153 3306305 3346456 3386725 3427638 3469084 3510455 3551391 3591878 3631904
66860 3631904 3671502 3710890 3750234 3789358 3827846 3865452 3902524 3940142 3979375 4019799 4059019
66849 4059019 4094560 4126449 4157292 4189655 4223844 4258243 4290936 4320759 4347690 4372844 4397667
66838 4397667 4422633 4446953 4469696 4490649 4509907 4527415 4543435 4558837 4574145 4588538 4600343
66827 4600343 4608450 4612968 4614895 4615495 4615629 4615121 4612870 4607916 4600220 4590233 4578121 4563903 4548076 4531537
66813 4531537 4514895 4498180 4481117 4463332 4444248 4423095 4399249 4372637 4343846 4313734 4282783
66802 4282783 4250968 4218292 4185039 4151161 4115936 4078942 4040981 4003153 3965244 3926141 3885817
66791 3885817 3845628 3806400 3767496 3728289 3689148 3650080 3609623 3566461 3521557 3477504 3436018
66780 3436018 3396916 3358998 3320948 3281737 3241269 3200594 3160642 3120852 3079803 3037056 2993598
66769 2993598 2950633 2908719 2868034 2828611 2790045 2751566 2712622 2673194 2633716 2595041 2558186
66758 2558186 2523585 2490703 2458651 2426817 2394605 2361289 2326866 2292430 2258788 2225242 2190831
66747 2190831 2156369 2123873 2094063 2065762 2037946 2011012 1985420 1960239 1934014 1906582 1879189
66736 1879189 1852949 1827631 1801958 1774927 1747024 1720195 1696284 1675242 1655001 1633182 1608980
66725 1608980 1583579 1558992 1536398 1515420 1495014 1474943 1455887 1438107 1420813 1403301 1385894
66714 1385894 1369034 1352153 1334413 1316121 1298326 1281300 1264425 1247456 1230855 1214821 1198917
66703 1198917 1182796 1166611 1150776 1135956 1123067 1112335 1102483 1091839 1080226 1068751 1057779
66692 1057779 1046324 1033685 1020624 1008388 997286 986605 975312 962619 948568 934283 921045
66681 921045 908978 897256 885544 874435 864412 855228 846437 837726 828698 819167 809692 800866 792126
66668 792126 782379 771822 761888 753253 745278 737644 731006 725460 719953 714003 708545 704073 699241 692595
66654 692595 684594 676671 669213 661796 654605 648143 642010 635359 628354 621989 616663 611883 607050 601531
66640 601531 594370 585251 575674 567857 562267 557224 551110 544015 536940 530444 524694 520163 517418 516302
66626 516302 515809 514900 513262 511164 508626 505052 500026 494279 489261 485633 482785 480015 477418 475148 472559
66611 472559 468866 464223 459383 454652 449997 445844 442797 440431 437329 432773 427816 424075 421692 419070
66597 419070 414875 409809 405849 403748 402046 398998 394732 390684 387388 384057 380235 376543 373539 371045
66583 371045 369128 368556 369478 370543 370131 367868 364331 360119 356004 353168 352244 352456 352440 351510 349585 346626
66567 346626 342960 339526 336827 334115 330466 326147 322065 318399 314749 311241 308388 306113 303870 301573
66553 301573 299576 298011 296986 297004 298217 299518 299486 298091 296433 294905 292787 289819 287119 286056 286775
66538 286775 288106 288598 287614 285739 284047 282790 281217 278911 276492 274346 271598 267403 262538 258408 255053
66523 255053 251605 248336 246516 246137 245461 243290 240322 237721 235643 233884 232894 233147 234072 234514 234013 233199
66507 233199 233020 233843 235070 235603 234892 233445 232046 230766 229199 227312 225380 223467 221699 220629 220326
66492 220326 219523 216990 213658 211941 212677 213996 213774 212064 210429 209705 209276 208143 206116 203964 202525
66477 202525 201600 200090 197626 195482 194976 195513 195417 194353 193513 193436 193253 192422 191771 192183 193351 194333 194371 192861
66459 192861 189710 186215 184408 184836 185983 186339 185967 185593 185394 185384 185782 186206 185651 184097 182948 182955 182904 181534
66441 181534 179656 179007 179800 180724 180698 179377 176529 172332 168015 165005 163523 162745 161861 160146 156828 152176
66425 152176 148228 147035 148389 150438 152184 154072 156312 158133 158881 158684 157812 156429 155124 154570 154438
66410 154438 153634 151858 149914 148213 146116 143329 140933 140255 141350 143259 145227 146950 148049 148168 147519
66395 147519 146779 146273 145609 144240 142175 140116 138945 139109 140382 142027 143142 143112 142114 141176 141277 142197 142627
66378 142627 141658 139757 137993 136773 135816 134908 134055 133130 131959 130613 129109 127111 124533 122322 121890 123727
66362 123727 126975 130281 132602 133465 133156 132587 132180 130958 127625 122741 118805 117694 118851 120576 122256
66347 122256 124353 126762 128505 129122 129253 129399 129012 127464 125274 123402 121659 118939 115181 112106 111347
66332 111347 112533 113947 114653 115139 116077 117354 118500 119392 120211 121054 121725 121705 120452 118141 115927 114877
66316 114877 114753 114453 113497 112282 111020 109536 108277 108378 110224 112799 114980 116580 117634 117733 116872 116046
66300 116046 115939 115718 114166 111556 109298 108106 107482 106791 105787 104261 102246 100633 100631 102375 104830 107273
66284 107273 110133 114011 118361 121602 122423 120839 118050 115321 113035 110978 109292 108548 108735 108961 108533
66269 108533 107703 106872 105817 104387 103285 103240 103857 104140 103801 103258 102639 101666 100299 98814 97491 96822 97468
66252 97468 99170 100303 99565 97724 96641 96982 98102 99705 102068 104679 106261 106435 106012 105381 103955 101707
66236 101707 99854 99300 99364 98810 97334 95444 93634 92287 91785 92179 93254 95097 97890 100932 102876 103382
66220 103382 103577 104283 104760 103940 102060 100154 98628 97327 96551 96928 98368 99934 100723 100371 98870 96498
66204 96498 93883 91656 90015 88864 88236 88285 88965 89955 90821 91266 91416 91819 92802 93899 94399 94384 94600 95281
66186 95281 95872 95978 95729 95073 93790 92628 93199 95929 99044 100627 100895 101374 102487 103305 103355 103225 103242 102792
66168 102792 101377 99507 98040 97264 97032 97317 98143 99172 99754 99397 98183 96868 96481 97418 98872 99539
66152 99539 99130 98835 99864 101733 102656 101914 101213 102925 107118 111260 113035 112541 111228 109846 108542 108059
66136 108059 109077 110575 110593 108925 107448 107295 107303 106157 104600 104238 105347 107274 110117 114354 119223 123057
66120 123057 125146 126056 126211 125508 124405 124028 124740 125608 125763 125564 125990 127445 129507 131339 132130 131625 130519
66103 130519 129984 130593 131983 133489 134695 135496 136214 137596 140070 142929 144907 145669 146049 146692 147221 147037
66087 147037 146270 145425 144622 143694 142636 141496 140080 138288 136573 135674 135850 136628 137231 137156 136429 135437 134457
66070 134457 133391 132082 130822 130224 130543 131424 132387 133308 134367 135830 137990 140981 144417 147425 149266
66055 149266 149876 149763 149564 149708 150309 151327 152911 155476 159148 163257 166751 169107 170512 171210 171169 170480
66039 170480 169580 168840 168288 167948 168093 168948 170328 171712 172475 172149 170986 170354 171941 176142 181617 186735
66023 186735 190997 194730 198018 200575 202255 203003 202609 201342 200604 201922 205072 207992 209013 208481 207754
66008 207754 207274 206490 205382 205026 206245 208313 209574 209284 208418 208552 210151 212256 213751 214562 215323 216162
65992 216162 216430 215727 214601 213757 212997 211604 209655 208203 207955 208395 208567 208189 207481 206413 204890 203482
65976 203482 203092 203723 204244 203707 202374 201128 200296 199518 198560 197772 197765 198786 200299 201127 200386 198552 197201
65959 197201 197342 198367 199019 198922 198412 197253 194670 190938 187994 187828 190717 195402 200370 204429 206637 206777
65943 206777 205926 205702 206667 208006 208942 209724 210807 211732 211660 210730 210095 210626 212218 214345 216475 217765 217367
65926 217367 215739 214879 216298 219077 220950 221206 221417 223078 225567 227076 226853 225708 224705 224110 223635 223090
65910 223090 222603 222446 222719 223140 223217 222743 222035 221617 221736 222122 222002 220578 217976 215634 214977 215547 215246 212816
65892 212816 209258 206303 204416 203145 202531 202792 203135 202445 201202 201212 203090 205237 205938 205399 204917 204882 204522
65875 204522 203082 200380 196546 192067 188024 185552 184882 185145 185073 183791 181292 178546 176869 176785 177626 178469
65859 178469 179097 179699 179980 179189 176932 173621 170288 168145 167909 169000 169773 169123 167573 166191 164860 162599
65843 162599 159337 156186 153836 151852 150049 149430 150817 153189 154314 152891 149535 146039 144174 144760 146985
65828 146985 148727 148344 146322 144667 144696 145882 146758 146378 144822 142909 141630 141430 141834 142002 141519 140295
65812 140295 138077 134953 132301 132005 134182 136468 136283 133257 129000 125268 123092 122950 124635 127151 129618
65797 129618 132100 134856 137281 138692 139782 141809 144234 144714 142123 138371 136347 136840 138299 138934 138058
65782 138058 135846 132848 129820 127420 125938 125405 125618 125864 125197 123501 121688 120304 118599 115813 112905
65767 112905 111890 113572 116726 119408 120262 118850 115866 113182 112601 114115 116077 117254 117890 118581 119295
65752 119295 120139 122056 125649 129785 132352 132365 130684 128849 127818 127698 128045 128332 128482 128874 129544 129764 128961
65735 128961 127778 127396 127892 128058 126957 124799 122045 118536 114149 109684 106225 103956 102283 100937 100170
65720 100170 99943 99817 99804 100579 102389 104361 105423 105461 105094 104734 104513 104793 105917 107465 108526 108838 109015
65703 109015 109411 109428 108337 106292 104095 102323 101175 100840 101455 102807 104493 106288 107982 108938 108280 105634
65687 105634 101496 96850 92598 89191 86574 84479 82880 82007 81812 81755 81410 80982 80843 80847 80631 80383 80626
65670 80626 81265 81495 80852 79852 79311 79457 79968 80553 81126 81622 81951 82190 82626 83563 84974 86296 86659 85581
65652 85581 83432 81135 79523 79010 79498 80253 80286 79535 79486 81823 86352 90945 93742 94751 94996 94892 94133
65635 94133 92693 91147 90050 89527 89445 89654 90045 90671 91740 93199 94399 94474 93152 91091 89481 89279 90570
65618 90570 92460 93860 94616 95639 97677 100344 102781 104938 107475 110467 113073 114744 116086 117986 120331
65603 120331 122208 123103 123226 122699 121210 118758 116172 114386 113419 112523 111152 109370 107364 105043 102285
65588 102285 99316 96742 95326 95592 97202 98781 98879 97306 95187 93615 92723 92185 91866 91595 90992 90220
65572 90220 90417 92446 95412 97185 96344 93058 88398 83706 80494 79619 80039 79317 76114 71701 68474 67517
65556 67517 68285 70128 73048 76891 80656 83097 83743 83072 81915 80915 80391 80325 80362 80027 79152 78014 76921
65539 76921 75845 74800 74359 75202 77077 78901 80157 81447 83158 84364 83876 81840 79286 76542 73282
65524 73282 69869 67354 66024 65244 64995 66317 69704 74163 78418 82026 84757 86036 85868 85295 84872 83593
65508 83593 80502 76684 74307 74052 74734 75185 75253 74983 74157 72952 72071 71799 71630 71069 70215 69400 68887 69086
65490 69086 70359 72372 74216 75457 76559 77978 79361 79954 79478 78346 77273 76862 77204 77636 77016 74530
65474 74530 70467 66403 64498 65957 69742 73250 74789 75046 75647 76818 77367 76545 74855 73080 71564
65459 71564 70498 69935 69462 68861 69112 71463 75295 78310 79373 79727 80646 81413 80943 80093 80508 81840 82042
65442 82042 80257 77722 75729 74349 73492 73610 74646 75602 76046 76925 78873 80632 80379 78041 75072 72380
65426 72380 69818 67526 66265 65878 64729 61601 57548 54973 55111 57090 59291 60917 62155 63438 64915
65411 64915 66490 68110 69933 72023 73798 74154 72630 70333 69080 69487 70413 70541 69895 69326 68981 68073
65395 68073 66150 63869 62315 62041 62979 64770 66789 68275 69009 69785 71665 74650 77513 79094 79483 79719
65379 79719 80585 81932 82982 83015 81902 80279 79101 78748 78731 78577 78812 80359 82983 85203 86135 86550 87413
65362 87413 88170 87697 86489 86403 88027 89739 89975 89181 88613 88320 87687 87289 88539 91417 93921 94236 92540
65345 92540 90330 88878 88795 90146 92180 93514 93468 92967 93434 95020 96676 97843 99210 101555 104492 106815
65329 106815 107667 106945 104876 101897 98998 97581 98399 100711 102941 104297 105396 107113 109284 111141 112735
65314 112735 115090 118678 122584 125835 128936 133061 137897 141490 142678 142806 144278 147995 153086 158835
65300 158835 165688 174040 182965 190827 196825 201397 205336 209053 212650 216083 218931 220163 218495 213292
65286 213292 205332 196533 188513 181282 173703 165341 157269 150647 145072 139123 132321 125734 120616 117224
65272 117224 115108 113842 113042 112215 111083 109803 108545 107082 105060 102432 99499 96776 94930 94356 94546
65257 94546 94270 92768 90562 88824 88191 88329 88344 87390 85311 82979 81619 81506 81670 81202 80335 79790 79479
65240 79479 78572 76663 74322 72475 71634 71582 71575 71014 70236 70298 71611 73122 73397 72296 71006 70496 70416 69518
65222 69518 66894 62931 59348 58075 59783 63656 68566 73838 78642 81701 82533 82415 83078 84737 86209
65207 86209 86554 85669 83730 81231 79303 78713 78625 77552 75461 73599 72276 70414 67601 64953 63276 61886
65191 61886 60186 59037 59406 60706 61742 62546 64007 66283 68779 71237 73603 75172 75063 73538 71822
65176 71822 70641 69745 68773 67687 66418 64992 64017 64122 64833 64944 64245 63971 65143 67145 68435 68148 66609
65159 66609 64737 63367 62805 62659 62319 61864 62159 63712 65713 66701 66087 64670 63586 63074 62411 60886 58750
65142 58750 57214 57539 59936 63199 65441 65428 63387 60567 58165 56800 56774 58203 60553 62612 63521 63605
65126 63605 63673 63776 63380 62590 62283 62952 64261 65887 67930 70188 71979 73098 74038 74720 74050 71507 68263
65109 68263 65751 63964 62256 61063 61390 63064 64925 66554 68396 70337 71696 72713 74420 76766 78386
65094 78386 78771 79095 80120 80761 79858 78102 76920 76451 76115 76340 77924 80028 80609 79129 77323 76820 77258
65077 77258 77452 77400 78159 80205 82759 84616 85187 84851 84603 85203 86402 87151 86746 85547 84483 84166 84702
65060 84702 85878 87065 87262 85920 83768 82338 82435 83333 83555 82233 79660 76819 74608 73332 72669 72013
65044 72013 70982 69649 68419 67778 68122 69563 71755 73967 75464 75849 75213 74164 73691 74595 76765 79232
65028 79232 81229 83012 85308 88075 90332 91291 91157 90633 90153 89995 90799 93261 97243 101663 105442 108316
65012 108316 110643 112758 114788 116837 119001 121229 123483 126044 129330 133173 136481 137955 137356 136010
64998 136010 135915 138161 141979 145250 146124 144427 141571 139049 137135 135188 133000 131220 130277 129398 127246
64983 127246 123385 118724 114553 111513 109434 107747 105953 103928 101824 99510 96368 92148 87871 85080
64969 85080 83980 83071 81146 79016 78442 79693 81139 81353 80659 80154 79896 78895 76721 74237 72465 71289
64953 71289 69860 68022 66718 66853 68328 70440 72779 75218 77328 78465 78534 78209 78192 78506 78643 78169 77116
64936 77116 75972 75324 75308 75464 75286 74811 74435 74355 74556 75037 75519 75218 73807 72525 73307 76418 79788 81177
64918 81177 80314 78482 76795 75545 74622 73770 72847 72423 73643 76719 79946 81029 79272 75940 72866 71292
64902 71292 71575 73140 74861 76197 77687 79764 81668 82479 82695 83527 84993 86094 86703 87695 89001 89238
64886 89238 87909 86448 86162 86394 85834 84626 83883 83829 83677 82963 81810 80086 77416 73980 70510 67606
64870 67606 65839 66180 69211 73884 78119 80854 82586 83700 83454 81313 78372 76422 75945 75908 75359 74373
64854 74373 73305 71956 70006 67875 66598 66853 68368 70257 71718 72540 73236 74670 77158 79900 81647
64839 81647 82085 82050 82160 81833 80323 78277 77294 78011 79543 80977 82410 84095 85474 85937 85904 86187 86542
64822 86542 85822 83538 80436 77354 74407 71696 70215 71234 74840 79533 83363 85316 85626 85093 84343
64807 84343 83688 83243 82904 82259 80883 78734 76088 73167 70318 68473 68672 70721 72966 74059 74476 75557
64791 75557 77453 78971 79310 78861 78179 77324 76602 76860 78193 79156 78225 75630 72869 70824 69322 68209
64775 68209 67679 67507 67079 66447 66265 66375 65642 63876 62720 63515 65169 65585 64667 64296 65467 67172 68458
64758 68458 69816 71547 72204 70259 66675 64310 64863 67519 70474 72593 73517 73356 72846 72959 73788 74423
64742 74423 74317 74114 74636 75644 76251 76104 75447 74388 72907 71461 70741 70689 70427 69375 68012 67273 67621
64725 67621 68920 70813 72792 74190 74574 74197 73802 73973 74780 75884 76686 76538 75289 73712 72925 73165 73539
64708 73539 73297 72951 73612 75618 78503 82119 86762 91938 95900 97014 95149 91380 86991 83342 81936
64693 81936 83427 86680 89620 91017 90900 89601 87458 85338 84252 84133 83966 83425 83361 84262 85324 85855
64677 85855 86561 88322 90405 91183 90401 89447 89436 90175 91225 92716 94475 95242 93787 90568 87501 86055
64661 86055 86071 86520 86892 87499 88677 90216 91656 92758 93372 93123 91801 90047 89083 89402 90126 90021 88852
64644 88852 87354 86114 84989 83576 81777 79868 78334 77663 77993 78845 79487 79694 80006 81137 83181 85429
64628 85429 86918 87240 86786 86152 85370 84042 82244 80854 80639 81287 81703 81086 79469 77458 75865 75429 76394
64611 76394 78278 80213 81403 81264 79727 77930 78015 81263 86412 90610 92200 91908 91259 90753 90046 89208
64595 89208 89009 90093 92320 94756 96146 95731 93939 92080 91091 90848 90888 91297 92386 93821 94788 94990 94876
64578 94876 94821 94658 94277 94132 94654 95445 95567 94625 93074 91435 89775 88209 87392 87885 89307 90728 91737
64561 91737 92313 91799 89224 85190 82293 82627 85508 88680 91137 93433 95710 97162 97641 98086 98768 98600
64545 98600 97118 95755 95861 96538 95898 93787 91715 90498 89685 89234 90005 92115 94276 95515 96386 97680
64529 97680 98992 99611 100039 101239 102691 102549 100031 96713 94858 94976 95560 95056 93583 92588 93126 94829
64513 94829 96523 97496 97878 98040 98153 98394 99129 100599 102577 104409 105294 104684 102869 101096 100459 100485 99452
64496 99452 96516 92934 90635 90064 90083 89617 88666 87971 88472 90996 95567 100822 104852 106948 108046 109252
64480 109252 110467 110721 109373 106675 103606 101407 100882 101767 103062 104125 105056 105874 105986 104880 102817 100368
64464 100368 97823 95663 94995 96505 99129 100707 100119 98203 96585 96269 97266 98749 99355 98162 95746
64449 95746 93601 92276 90888 88985 87867 89015 91802 94069 94879 95446 96998 98927 99843 99710 99882 101191
64433 101191 102887 103610 102792 100940 99072 98172 98681 100067 101077 100817 99468 97773 96156 94800 94216 94900
64417 94900 96328 97093 96399 94890 93618 92821 92286 92340 93498 95336 96753 97551 98781 100944 102682 102142
64401 102142 99437 96830 96295 97539 98790 99034 98845 99172 100055 100885 101433 101971 102525 102734 102615 102843 103893
64384 103893 105358 106682 108272 111166 115560 120078 122740 122535 120245 118042 118022 120610 124312 127239 128722
64369 128722 129178 128974 128316 128107 129726 133524 138259 142509 146064 149484 152860 155649 157476 158647 160091
64354 160091 163034 168273 175335 182713 189391 195779 202724 210077 216870 222669 228045 233820 240373 247597
64340 247597 255001 261819 267380 271407 273790 274499 274070 273628 273591 272667 269126 263054 256381 250446 244528 237248
64324 237248 228640 220145 213002 207331 202502 197733 192374 186189 179582 173398 168384 164729 161887 158813
64310 158813 154713 149797 145122 141580 139246 137728 136694 135782 134558 133058 132053 132142 132797 132958 132577 132774
64294 132774 134171 135719 135740 133893 131596 130569 131271 132727 133580 133347 132919 133786 136600 140457 143791 145826
64278 145826 146897 147599 148201 148917 150061 151557 152778 153281 153423 153856 154805 156219 158177 160415 161878 161717
64262 161717 160752 160952 163165 166129 168107 168812 169238 170168 171479 172564 172947 172743 172950 174985 179431 185452
64246 185452 191736 197657 203168 208187 212872 218095 224577 231524 237011 239972 241109 241451 240710 237803 232686
64231 232686 226965 222399 219149 215895 211742 207561 205045 204583 204711 203778 201493 198501 195269 192259 190606
64216 190606 191343 193857 196190 197280 198095 199998 202653 204246 203438 200428 196226 191569 186744 182120 178414
64201 178414 176324 175863 176173 176204 175640 174970 174630 174322 173385 171647 169630 168019 167251 167610 169265 171920 174717
64184 174717 177002 179149 182033 185560 188378 189571 190055 191507 194250 197149 199456 201566 203801 205687
64170 205687 207059 208782 211511 214529 216689 217853 218533 218946 219523 221587 225993 231457 235763 238642 241983
64155 241983 247091 253258 259438 265773 272618 279270 284833 289653 294988 301625 309523 318360 327746 337120
64141 337120 346045 354419 362152 368982 374991 380799 386810 392490 396780 398949 398897 397086 394410 391540 388046
64126 388046 382726 375325 367336 360567 355409 351148 347468 344679 342603 340149 336295 331090 325518 320603
64112 320603 316694 313327 309547 304397 297248 288128 278047 268644 260874 254166 247570 241509 237335 235063
64098 235063 232790 228892 223756 218681 214203 210432 207964 207140 207018 206403 205467 205108 205092 204287 202680 201683
64082 201683 202131 203205 203781 203841 203973 204310 204487 204079 202681 200118 197023 194674 193868 194287 195149 196059 196987
64065 196987 197951 199058 200439 201956 203367 204851 206732 208485 208809 207280 205307 204757 205932 207546 208409
64050 208409 208461 208315 208432 208929 209702 210607 211670 213162 215210 217400 219036 219817 220104 220516 221491 223194 225634
64033 225634 228893 233328 239401 246929 254569 260543 264148 266297 268383 270887 273398 275663 277958 280377
64019 280377 282429 283760 284907 286723 289140 290905 290703 288332 284823 281586 279277 277127 273542 267859
64005 267859 261517 257007 255637 256722 258849 261098 262853 263495 263014 262349 262353 262800 263036 263093 263323 263348 262498 261316
63987 261316 261595 264543 269522 274910 279660 283786 287802 292057 296471 300768 305047 309817 315093 319858
63973 319858 323124 325300 327599 330205 332188 333386 335090 338244 342015 345042 347186 349048 350545 351262
63959 351262 351765 353199 355666 358281 360898 364454 369185 373730 376783 378730 380837 383598 386898 391212
63945 391212 397312 404791 412018 417950 423264 429325 436600 444531 452542 460647 469288 478948 489810 501499
63931 501499 513271 524656 535780 546928 558036 568955 580037 592116 605917 621670 639234
63920 639234 658359 678923 700985 724505 749059 774263 800656 829576 861744 896493 933046
63909 933046 971960 1014348 1060009 1107576 1156638 1208646 1265326 1327135 1393657 1464504 1539136
63898 1539136 1616662 1696810 1780735 1870158 1966000 2068400 2177556 2293752 2416930 2547220
63888 2547220 2685878 2834971 2996103 3170165 3358604 3564467 3791880 4044650 4325354
63879 4325354 4635724 4978009 5356063 5774769 6238133 6748084 7304892 7907648 8553414
63870 8553414 9236509 9949792 10686712 11441294 12205978 12969987 13719527 14438623 15109683
63861 15109683 15714651 16237289 16665375 16991282 17210704 17320608 17317978 17200529 16968782 16627386
63851 16627386 16184483 15650506 15038069 14362261 13639789 12887341 12120427 11352521 10593949
63842 10593949 9851929 9132896 8444663 7795178 7189351 6628499 6112920 5643258 5218620
63833 5218620 4835033 4487321 4171988 3887270 3630894 3399057 3187527 2992993 2813395
63824 2813395 2647674 2495302 2355600 2227337 2109069 1999594 1897845 1802639 1712966 1628325
63814 1628325 1548493 1473171 1402126 1335410 1273043 1214650 1159732 1108124 1059927 1015087 973265
63803 973265 933913 896316 859904 824813 791954 762261 736012 712883 692181 672824 653680
63792 653680 634502 616195 599754 585269 572409 561298 551997 543300 533166 520766 507428 495119
63780 495119 484520 475068 466361 458603 451660 444553 436465 427871 420061 413673 408251 403153 398242 393452
63766 393452 388304 382307 375414 367731 359245 350334 341993 334874 328508 322162 315977 310315 304531 297736
63752 297736 290591 284779 280465 275844 269931 264355 261264 260514 260239 259465 258747 258522 258161 256825 254303 250827
63736 250827 246763 242604 238700 234936 231190 228101 226741 227250 228238 227812 225135 221026 217270 215293 215218
63721 215218 216107 217028 217680 218002 217728 216689 215125 213270 211020 208505 206567 206079 206983 208569 210403 212235
63705 212235 213209 212171 209102 205533 203136 202231 201979 201651 201266 201124 201219 201395 201899 203326 205737 208141 209400
63688 209400 209632 210082 211458 213174 214638 216561 220138 225416 231338 237225 243341 249967 256699 262916 268397
63673 268397 273304 277954 282856 288737 296363 306333 318805 333163 348224 363120 377777 392310 406469
63660 406469 420208 434226 448925 463031 474224 481226 484464 484731 482247 477322 470905 463732 455562
63647 455562 445916 435234 424795 415700 408203 401719 395247 388187 380988 374588 369036 363286 356709 350148
63633 350148 344833 340803 337209 333821 331284 329900 329054 328111 327277 327220 328321 330611 333983 338044 342085
63618 342085 345844 350252 356851 366207 377146 387891 397805 407798 419085 431946 445712 459609 473249
63605 473249 486497 499124 510474 519281 524009 523851 519406 512025 502572 491346 479248 468119 459158
63592 459158 451430 442797 432389 421485 411855 403954 397158 391073 385889 381739 378580 376781 377023 379203
63578 379203 381903 383486 383646 383717 385549 390145 397006 404644 412083 420035 430167 442944 456809 469955
63564 469955 482387 495548 510488 527287 545917 566506 588731 611984 636210 661760 688470
63553 688470 716074 745640 779134 816971 857183 897638 937802 977405 1014824 1048287 1077752
63542 1077752 1103886 1125791 1141543 1150813 1155250 1156156 1153511 1147742 1140779 1134349 1128171 1120749 1111259
63529 1111259 1099878 1086931 1072517 1056629 1038979 1019198 997912 977276 959516 944919 931874
63518 931874 918937 906221 894598 884263 874709 865870 858476 853002 848817 845028 841959 841051 843063
63505 843063 847106 851877 857313 864437 873978 885794 899374 914175 929626 945550 962661 982036
63493 982036 1004082 1028511 1055174 1084116 1114754 1145920 1177111 1209074 1242647 1277346 1311425
63482 1311425 1342990 1370754 1394047 1412574 1426273 1435351 1440500 1443012 1444424 1445972 1448258 1451066 1453360
63469 1453360 1453857 1451911 1447340 1439055 1424762 1402945 1374629 1342175 1306826 1268663 1228478 1187897
63457 1187897 1147633 1107446 1068307 1032783 1002261 975279 949773 925626 903633 883200 862991
63446 862991 843256 825650 810848 797982 786544 777297 770783 766093 761669 756496 750200 742921 735663
63433 735663 729953 726455 724390 722834 722116 723397 727357 733848 742370 752086 761597 769684 776617 784125
63419 784125 793681 805145 817327 829458 841574 853638 864888 874190 880724 884200 884809 883042 879130
63406 879130 872496 862260 848723 833888 820007 807911 797273 787973 780278 773921 768138 762858 758953
63393 758953 756948 756261 756118 756442 757417 758965 761299 765317 771579 779268 787015 794568 802963 813140 824949
63378 824949 837501 850063 862733 876571 892842 911730 932169 953451 976523 1002890 1032487
63367 1032487 1063720 1095729 1129648 1167155 1208434 1252206 1297366 1343932 1392364 1442456 1493127
63356 1493127 1543258 1592523 1641127 1688612 1733035 1771586 1802081 1823829 1837313 1843368 1842749 1836298
63344 1836298 1825423 1812278 1799059 1786735 1774439 1760337 1743138 1722720 1699563 1673998 1646066
63333 1646066 1615875 1583990 1551536 1519881 1490148 1463024 1438935 1418137 1400537 1385718 1373386
63322 1373386 1363678 1356916 1353251 1352622 1354711 1358793 1363957 1369736 1376250 1383633 1391895 1401581 1413761 1428611
63308 1428611 1444624 1460274 1476282 1495113 1518135 1544344 1572198 1601630 1633436 1667484 1702696
63297 1702696 1738645 1776119 1815739 1856633 1896787 1934188 1967044 1993215 2010434 2017561 2015343 2005624
63285 2005624 1990106 1970166 1947308 1922900 1897486 1871066 1844112 1817379 1790418 1761205 1728060
63274 1728060 1691396 1652834 1613115 1571870 1529300 1486998 1446791 1409288 1373817 1339440 1305952
63263 1305952 1274170 1245199 1219144 1194838 1171285 1149060 1129527 1112746 1097026 1080732 1063878
63252 1063878 1047681 1033133 1020278 1008304 996002 982540 968108 953527 939121 924486 909491
63241 909491 894772 880780 866942 852389 837227 822503 809077 796988 785775 774985 764416
63230 764416 754241 744901 736684 729431 722668 715743 707835 698472 688463 679707 673397 668798 664475 660285
63216 660285 657108 654765 651562 646310 639793 633595 628310 623658 619559 615996 612315 607917 603576 600805
63202 600805 599662 598315 595408 591990 590209 590605 591586 591446 590213 589440 590531 593219 595464 595223 592716
63187 592716 590576 591163 594103 597118 598906 600226 602406 605949 610756 616532 622414 627171 630473 633392
63173 633392 637088 641639 646633 652147 658353 664716 670374 674972 678444 680555 681499 682508 684838 688322
63159 688322 691860 695177 699071 703815 708339 711416 713016 714139 715780 718290 721352 724351 727037 729807
63145 729807 733081 736574 739609 741908 743550 744529 745155 746611 749977 754683 759037 762441 766022 770706 776026
63130 776026 781507 787991 796413 806037 815132 823155 831268 840885 852446 865356 878253 889513 898451
63117 898451 906158 914649 925159 937640 951416 965469 978366 989041 997840 1005931 1013658 1020466 1026589
63104 1026589 1033466 1041746 1050013 1056482 1061154 1065000 1067568 1066929 1062193 1054816 1046946 1039376 1031579 1022869
63090 1022869 1012818 1001274 988866 977159 967327 958790 949977 940438 931375 923898 917642 911680 906168
63077 906168 902289 900712 900730 900950 900421 899041 897342 896108 895893 896551 897180 896792 895196 893203 891789 891090
63061 891090 890426 889365 888405 888248 888713 888894 888283 887174 885937 884578 883248 882519 882653 882939 882206 879811 875992
63044 875992 871636 867881 865411 863894 862619 861893 862889 865673 868448 869810 870786 873226 876755 879078 879309
63029 879309 879295 881241 885521 891496 898989 907843 916959 925030 931876 938254 944807 951817 959365 966869 973066
63014 973066 977492 981603 987316 994585 1001504 1006729 1010653 1013922 1015948 1015574 1012481 1007290 1000745 993419
63000 993419 985826 978100 969717 960105 949512 938780 928212 917210 905209 892581 880318 869165
62988 869165 859357 850968 843984 838071 832767 828056 824325 821494 818533 814280 808609 802467 796932 792519
62974 792519 789203 786633 784374 782373 781150 781043 781360 780940 779621 778445 778125 778060 777382 776351 775929 776313
62958 776313 776689 776320 775136 773267 770751 768022 766121 765992 767734 770750 774434 778601 783461 789366 796382
62943 796382 803975 811188 817269 822118 826263 830638 836336 844132 854037 865420 877571 889983 902243
62930 902243 914197 926298 939163 952474 964942 975849 986036 996572 1006884 1015301 1021377 1026466
62918 1026466 1031560 1035523 1036134 1032254 1024329 1013351 1000084 984896 967586 947578 924865 900502
62906 900502 875575 850158 824038 797867 772417 747116 720914 694686 671232 652254 636578
62895 636578 621995 607685 594035 581272 569421 558773 549210 539679 529408 519109 510035 502416
62883 502416 495877 490693 487144 484078 479693 473753 467748 462832 458918 455729 453196 450521 446408 440882
62869 440882 435621 431805 428714 425164 421242 417788 415060 412820 410929 408935 405823 401284 396838 394637
62855 394637 395342 397774 400321 401893 401941 400611 398925 398013 397949 397876 397275 396636 396827 398192 400329 402381 403577
62838 403577 403855 404048 405208 407663 410792 413688 416000 418187 420877 423897 426239 427399 428420 430814 434602
62823 434602 438429 441784 445865 451622 458125 463934 469346 475962 484382 493440 501770 509169 516351 524053
62809 524053 532467 540891 547756 551566 552038 550196 547503 545056 543160 541064 537420 531665 524844 518554
62795 518554 513364 508822 504642 501019 497935 495006 491971 488614 484371 479003 473613 469876 468059 466819
62781 466819 465359 464650 465837 468307 470270 470767 470223 469364 468439 467473 466608 466059 466125 467216 469495 472457 475230
62764 475230 477347 478995 480529 482010 483291 484299 485035 485338 484748 482734 479160 474578 469912 465736 461846
62749 461846 457565 452427 446577 440625 435142 430285 425952 422348 420138 419712 420331 420451 419093 416571 413659
62734 413659 410474 406751 402999 400508 399719 399125 396534 391450 385570 380864 377775 375713 374603 375042 377088
62719 377088 379760 381991 383517 384630 385630 386762 388137 389323 389555 388899 388757 390541 394064 397875 401040
62704 401040 403913 407168 410882 414864 419241 424122 429017 433244 436927 441004 445855 450218 452097 450906
62690 450906 448339 446780 447191 448926 451145 453479 455332 455688 454288 452352 451338 451200 450486 447959 443580
62675 443580 438060 432142 426442 421537 417861 415480 413904 412206 409745 406970 405049 404292 403472 401315 398282
62660 398282 396089 395732 396797 398567 400707 402683 403706 404028 405512 409802 416096 421669 424801 426592 429620
62645 429620 435366 443363 452321 461247 469492 476709 483444 491307 501770 514848 529474 544986 561661
62632 561661 579886 599686 621207 644829 670399 696987 723739 750361 776401 800867 823194
62621 823194 843995 864123 883463 901197 916695 929318 937897 941349 939592 933108 921912 905788
62609 905788 885236 861341 835030 807364 780121 754709 730556 705955 680752 656932 636115
62598 636115 617706 600200 583109 566634 550418 534061 518561 505893 496819 489864 482824 474904
62586 474904 467062 460588 455766 452015 448964 446921 446117 445880 445026 443020 440326 437624 435023 432098 428404
62571 428404 423894 419149 415202 412764 411500 410333 408575 406500 404715 403283 401680 399534 397231 395769
62557 395769 395912 397509 399749 402023 404299 406663 408954 410963 412491 413025 412042 410060 408695 409057 410588
62542 410588 412120 413454 415065 416826 418111 418925 419872 421161 422621 424586 427696 431791 436047 440299 445279
62527 445279 451379 458136 465033 471849 478001 482587 485464 487449 489145 490434 491413 492892 495463 498756
62513 498756 501992 504549 505784 505218 503297 501167 499246 496853 493609 490264 487547 485029 481779 477509
62499 477509 472499 467127 462034 458109 455696 454327 453592 453504 453596 452688 450348 447789 446386 445907 445021 443076
62483 443076 440609 438602 437887 438747 440340 441010 439890 437736 435652 433751 431846 430575 430625 431404 431786 431838
62467 431838 432536 433970 435182 435939 437418 440665 445259 449963 454100 457830 461543 465454 469643 474330 480028
62452 480028 487195 495600 504420 513316 523025 534368 547020 559896 572503 585340 599114 614202
62440 614202 630653 647947 664758 679725 692669 704491 715611 724983 731008 733224 732793 731276 729125
62427 729125 725550 719884 712652 704885 696793 687879 678228 668625 659225 649205 638271 627502 617934
62414 617934 609197 600468 592016 584809 579050 574085 569446 565105 561012 557153 553803 551057 548465 545746
62400 545746 543373 541796 540804 540390 541417 544226 547398 549247 550020 551216 553285 555631 558425 562378 566695
62385 566695 569362 570063 571028 574167 578833 583318 587187 590948 594461 596954 598181 598635 598902 599413 600512
62370 600512 602214 604164 606022 607550 608363 608318 608188 609035 610820 612726 615093 619652 627117 635781 643541
62355 643541 650295 657282 664928 672702 680555 689123 698695 709120 720628 733549 747132 759699 770349
62342 770349 779850 789674 800781 813505 827897 843601 859800 875807 891762 908549 926951 946882
62330 946882 967395 987502 1006999 1026403 1046162 1066241 1086426 1106518 1125944 1143691 1159179
62319 1159179 1173067 1186805 1201464 1217171 1233426 1249702 1266104 1283850 1304786 1329768 1357580
62308 1357580 1386034 1414324 1443959 1477370 1515985 1559838 1608559 1662248 1721432 1786531 1857550
62297 1857550 1933991 2014749 2098199 2182919 2268571 2355492 2442764 2526913 2603299 2668890 2723130
62286 2723130 2766193 2797482 2816400 2823615 2820450 2807269 2783365 2748446 2703540 2650403 2590781 2526438
62274 2526438 2459204 2390507 2321292 2252767 2186811 2124904 2066805 2011056 1957037 1905947 1859273
62263 1859273 1816816 1777126 1739736 1705848 1676353 1650155 1625500 1602461 1582939 1568170 1557306
62252 1557306 1548689 1541534 1535920 1532061 1530478 1532163 1537572 1545541 1554066 1562159 1570393 1579774 1590804 1603616
62238 1603616 1618151 1633763 1649259 1663888 1678023 1692491 1707439 1722313 1736867 1751650 1767278
62227 1767278 1783512 1799394 1814295 1828597 1843266 1859013 1876096 1894770 1915426 1938131 1962450
62216 1962450 1988082 2015486 2045447 2078133 2113009 2149729 2188611 2230111 2274397 2321854 2373528
62205 2373528 2430401 2492267 2557899 2626398 2697977 2773481 2853737 2939482 3031163 3128318 3229571
62194 3229571 3333671 3440001 3547556 3653907 3755941 3851149 3937289 4011191 4069434 4110735
62184 4110735 4136780 4150207 4152473 4143996 4125433 4098033 4063353 4023375 3980433 3936193 3890948 3844526
62172 3844526 3797691 3752187 3709817 3672075 3640198 3614578 3594175 3577318 3563281 3552570 3545672
62161 3545672 3542151 3541188 3542657 3547437 3556666 3570502 3587502 3605602 3623990 3643655 3665801 3690369
62149 3690369 3716626 3744549 3774725 3807220 3841502 3877331 3914835 3953842 3994013 4035714 4079911
62138 4079911 4127069 4176773 4228487 4282049 4337457 4394835 4454701 4517555 4583223 4651192 4721481
62127 4721481 4794262 4868600 4942611 5015314 5087657 5161225 5236181 5310551 5381081 5444836 5500614
62116 5500614 5549106 5591632 5629147 5662898 5695208 5728366 5763044 5799083 5837644 5881025 5930101
62105 5930101 5983383 6039132 6097093 6157429 6219048 6279658 6336484 6386378 6426386 6455252 6473704
62094 6473704 6482654 6481993 6471758 6453294 6428089 6396194 6356949 6310805 6259482 6204730 6147719 6089239
62082 6089239 6029728 5969473 5909424 5851235 5795821 5742523 5690469 5640072 5592324 5547420 5505263
62071 5505263 5466625 5432231 5400865 5369791 5337287 5303749 5270279 5237317 5204914 5173388 5143256
62060 5143256 5114961 5088773 5064427 5040995 5017779 4995130 4973490 4951789 4927999 4901560 4874206
62049 4874206 4847890 4822740 4797614 4771803 4745300 4717921 4689200 4659155 4628411 4597348 4565676
62038 4565676 4533138 4500362 4468689 4439291 4412752 4389263 4368589 4349724 4331434 4313872 4299160
62027 4299160 4289358 4283954 4280437 4277418 4276111 4278398 4284768 4294972 4309498 4329028 4353060 4380518 4411494
62014 4411494 4446971 4486601 4527918 4568146 4605816 4640027 4668843 4689418 4699851 4700759 4695118 4686591
62002 4686591 4677709 4668999 4659125 4645302 4623751 4590707 4543908 4483366 4410940 4329607 4242908 4153865
61990 4153865 4063416 3970275 3872982 3771881 3668813 3565581 3463449 3363494 3266403 3172190
61980 3172190 3081104 2994547 2914019 2839114 2767640 2698100 2631333 2569395 2513408 2462839 2416385
61969 2416385 2373173 2333147 2296383 2262095 2228729 2195355 2162474 2130845 2099935 2068376 2035668
61958 2035668 2002506 1969488 1936568 1904038 1873198 1845524 1821578 1800990 1783081 1767434 1754330
61947 1754330 1744816 1739852 1739226 1741722 1746440 1753576 1763781 1777124 1792654 1808574 1822803 1833868 1841369
61934 1841369 1845272 1844923 1839254 1827840 1811055 1789206 1762299 1730907 1696535 1660678 1623894 1586143
61922 1586143 1547755 1509783 1473595 1440151 1409447 1380655 1353208 1327716 1305509 1287266 1272492
61911 1272492 1260234 1249850 1241066 1233875 1228527 1225145 1223243 1222038 1221474 1222576 1226581 1233858 1243644 1254650
61897 1254650 1266111 1278582 1293608 1312189 1333743 1356939 1381335 1407690 1437001 1470031 1507576
61886 1507576 1550167 1597295 1647815 1701659 1760569 1826524 1899551 1977379 2057090 2137037 2217263
61875 2217263 2298253 2379479 2459564 2537814 2614719 2690407 2763290 2831141 2892987 2948981 2998920
61864 2998920 3042219 3079289 3111565 3139870 3163905 3183914 3202127 3222204 3247797 3281643 3325081
61853 3325081 3378161 3440915 3514531 3600297 3697350 3802839 3914766 4033429 4159482 4291805
61843 4291805 4428348 4568158 4711500 4858605 5009354 5163795 5322104 5484267 5650386
61834 5650386 5820744 5994496 6168132 6335378 6488229 6617827 6715360 6773347 6786381 6750842
61824 6750842 6665231 6531970 6358251 6153635 5926522 5683523 5431618 5179058 4933178 4697894
61814 4697894 4474024 4261777 4062576 3878793 3712281 3563340 3430945 3313761 3210803
61805 3210803 3121238 3044079 2978672 2925443 2885565 2859405 2845424 2841057 2844962 2858077 2882208 2917823
61793 2917823 2963820 3019252 3084151 3158068 3238645 3322685 3408208 3494455 3579958 3661542 3735351
61782 3735351 3798181 3847909 3883530 3904948 3912312 3905821 3886962 3859456 3827800 3794979 3762846 3734467
61770 3734467 3714143 3704433 3704475 3711830 3724599 3741066 3758774 3775126 3787913 3794335 3790675 3774123 3744098
61757 3744098 3700886 3644274 3574869 3495570 3409847 3319148 3223762 3125766 3029204 2937190 2850471
61746 2850471 2769057 2693811 2625824 2565394 2512239 2466193 2427318 2395884 2372323 2356619 2347713
61735 2347713 2344128 2345234 2351470 2363595 2382345 2408423 2441846 2481485 2526193 2576306 2633100 2697047
61723 2697047 2767853 2846305 2934657 3034559 3145600 3266563 3397390 3539451 3694656 3865092
61713 3865092 4053143 4261198 4491024 4743300 5017562 5312872 5629199 5967841 6329402
61704 6329402 6711000 7106057 7506695 7904863 8290294 8648367 8961208 9211024 9382644
61695 9382644 9464795 9451596 9344169 9150649 8884161 8560154 8194461 7802176 7396999 6990617
61685 6990617 6591934 6206716 5838414 5489744 5163255 4860246 4579740 4319368 4077366
61676 4077366 3853507 3648242 3461353 3291454 3136461 2994476 2864486 2746247 2639361
61667 2639361 2542563 2454189 2373354 2300256 2235141 2177219 2124847 2076462 2030850 1986564 1941785
61656 1941785 1895204 1846701 1796674 1744918 1690816 1634692 1578317 1523701 1471690 1422001 1374277
61645 1374277 1328764 1286127 1246879 1210854 1177180 1145000 1114334 1085835 1059591 1034713 1010466
61634 1010466 987213 965660 945593 926101 906875 888529 871629 855998 841112 826755 813067
61623 813067 800171 787813 775315 762104 748490 735646 724459 714675 705499 696756 688972 682631
61611 682631 677898 674756 672774 670992 668827 666926 666320 666794 667011 666387 665974 667137 670088 674100 678515
61596 678515 683109 688043 693921 701436 710492 720090 729598 739728 751693 765599 780254 794488 808126
61583 808126 821590 835029 848134 860490 871777 881568 889194 894152 896680 897652 897671 896450 893464 889149
61569 889149 885111 883065 883847 887465 893678 902283 912993 925239 937965 949595 958378 962969 962649 957222
61555 957222 947024 933033 916446 897855 877095 854128 829787 805357 781636 758897 737602
61544 737602 718527 701916 686979 672695 658900 646216 635124 625732 618340 613344 610267 607652
61532 607652 604600 601820 600384 600044 599851 600008 601771 605470 610088 615168 621644 630071 639344 648314 657675
61517 657675 668882 681883 695261 708288 721538 735517 749929 764396 778941 793557 808131
61506 808131 822928 838448 854646 870864 886589 901686 915966 929218 941668 953746 965366
61495 965366 976065 985813 994989 1003662 1011663 1019355 1027414 1035738 1043449 1050158 1056477 1063047 1069911 1077111
61481 1077111 1085061 1093735 1102067 1108660 1112773 1114403 1113902 1111909 1109285 1106737 1104561 1102696 1100737 1098159
61467 1098159 1095187 1093345 1094360 1098454 1104375 1111143 1119055 1128975 1141599 1157535 1177048 1199340 1223045
61454 1223045 1248025 1275948 1308605 1346350 1388625 1435230 1486488 1542811 1604741 1672813 1746817
61443 1746817 1825750 1908936 1996523 2088303 2182743 2277782 2371712 2462376 2546151 2618915 2677861
61432 2677861 2721661 2749492 2761067 2757468 2740740 2712443 2673400 2624920 2569461 2509841 2448492
61421 2448492 2387612 2329205 2274422 2223361 2175980 2132879 2094749 2061341 2031689 2005474 1983662
61410 1983662 1967310 1955947 1947693 1941191 1936906 1936159 1939238 1945143 1953004 1963014 1975889 1992064 2011578
61397 2011578 2034061 2058454 2083262 2107596 2131798 2156916 2183894 2213304 2245225 2279061 2313863
61386 2313863 2349027 2384285 2419032 2452457 2484515 2515843 2546318 2574549 2599373 2620887 2639304
61375 2639304 2653791 2663600 2669561 2673080 2674097 2671618 2666276 2660865 2657815 2657099 2657139 2656829 2656031 2654827 2653044
61360 2653044 2650164 2645001 2635754 2621180 2602047 2581035 2560857 2542426 2524857 2507061 2488928 2470926
61348 2470926 2453111 2435198 2417478 2400830 2385439 2370138 2353620 2336031 2318963 2304162 2292596
61337 2292596 2284344 2278709 2274708 2272313 2273400 2280889 2296633 2320280 2350124 2384719 2423721 2467715
61325 2467715 2517626 2574136 2637480 2707756 2785316 2870590 2963331 3062085 3164393 3267595 3369403
61314 3369403 3467675 3559660 3641916 3711372 3766345 3806068 3829508 3835504 3824296 3798173 3760105
61303 3760105 3712127 3655173 3589844 3516937 3437905 3355325 3272301 3190757 3110825 3032512 2957376
61292 2957376 2887674 2824322 2766679 2714073 2666595 2624530 2588073 2557704 2533865 2515972 2502502
61281 2502502 2492257 2484772 2479068 2472764 2463173 2449141 2431528 2412133 2392471 2373350 2355247 2338894
61269 2338894 2325347 2315340 2308776 2305156 2304349 2306531 2311500 2318518 2326813 2335681 2344106 2351008 2356147 2360220
61255 2360220 2363709 2366115 2366689 2365466 2363046 2359788 2355882 2352037 2349278 2347885 2347223 2346940 2347774 2350525 2354561
61240 2354561 2358097 2360113 2361426 2363607 2367305 2371826 2375778 2377447 2374845 2366261 2351212 2330843 2307436
61227 2307436 2283477 2260565 2238659 2216689 2194520 2173939 2156960 2143469 2131533 2119864 2108864
61216 2108864 2099243 2091030 2084460 2080557 2080036 2082590 2088024 2097183 2110961 2129286 2152093 2180290 2214420
61203 2214420 2253002 2293737 2336106 2381424 2430436 2482249 2535692 2590265 2645259 2699125 2750495
61192 2750495 2799178 2845652 2890076 2932057 2970677 3004318 3031068 3049763 3060246 3062351 3055330 3038822
61180 3038822 3013703 2981115 2940946 2892235 2835361 2773162 2709460 2646630 2584831 2523382 2462455
61169 2462455 2403484 2348344 2298330 2253589 2213142 2175577 2140130 2107098 2076989 2049415 2023236
61158 2023236 1997721 1973073 1949790 1928040 1907764 1888869 1871124 1854268 1838352 1823682 1810537
61147 1810537 1799460 1791557 1787503 1786106 1784827 1782124 1778461 1774772 1771010 1766865 1762967 1760400 1759466 1759570
61133 1759570 1760031 1760682 1762175 1765826 1772388 1780930 1790048 1800320 1813911 1831087 1848774 1863608 1874734
61120 1874734 1882257 1884786 1880811 1871517 1859940 1847707 1834453 1819986 1804969 1789536 1773009 1754978
61108 1754978 1735122 1712202 1685020 1654490 1623180 1592727 1563123 1534353 1506959 1480903 1455647
61097 1455647 1431589 1409844 1390430 1372294 1355294 1340432 1327907 1316845 1307433 1301507 1300286 1303057
61085 1303057 1308725 1317046 1327662 1339486 1351945 1365458 1379885 1393763 1405688 1415002 1420526 1420375
61073 1420375 1414161 1404049 1392522 1380184 1366530 1351607 1335958 1320202 1305586 1293691 1284592 1276478
61061 1276478 1267962 1259482 1251559 1243301 1234020 1224960 1217903 1213038 1209407 1206316 1202999 1198179 1191544 1184643
61047 1184643 1178788 1173086 1166351 1159969 1156728 1157157 1158922 1159784 1159623 1159625 1160974 1164394 1169650 1175181 1179023
61032 1179023 1179989 1177451 1170704 1159771 1146376 1132810 1119993 1107601 1095661 1084727 1074752 1065078
61020 1065078 1055573 1046675 1038382 1030188 1022086 1014745 1008734 1004259 1001491 1000330 1000011 999759 999780 1000949 1003729
61005 1003729 1007983 1013461 1019790 1026332 1032782 1039580 1047157 1055258 1063550 1072333 1081914 1091903 1101758 1111368
60991 1111368 1120469 1128486 1135837 1144295 1154815 1165958 1175906 1185345 1196698 1210911 1226435 1241199
60979 1241199 1254383 1266513 1278975 1293187 1309210 1325535 1341165 1357300 1375757 1396310 1416866
60968 1416866 1435888 1453493 1470692 1488792 1509154 1532308 1557668 1584947 1615100 1648772 1684870
60957 1684870 1722129 1761231 1803778 1849896 1898442 1948782 2000821 2054089 2108539 2165418 2225565
60946 2225565 2287758 2350610 2415157 2483438 2555519 2630351 2708792 2793237 2884943 2984193 3092330
60935 3092330 3210690 3337987 3471811 3612613 3763473 3926286 4101284 4290076 4495846
60926 4495846 4720324 4963630 5227173 5513378 5822253 6151357 6499390 6866741 7252860
60917 7252860 7657098 8082362 8534050 9015469 9528862 10080938 10681745 11336934 12046378
60908 12046378 12811551 13638849 14535435 15510298 16583069 17784997 19147890 20699440 22472391
60899 22472391 24507976 26844561 29514315 32559087 36035597 39993156 44464949 49496963
60891 49496963 55133840 61268123 67443234 72869580 76775664 78853075 79401426 79066995
60883 79066995 78471086 78054376 78115335 78778377 79810008 80533157 80084744 77890488 73962632
60874 73962632 68796380 63027736 57166890 51536308 46318674 41599254 37389615 33659674
60866 33659674 30368577 27473600 24927784 22685667 20711040 18973205 17439397 16077002
60858 16077002 14860200 13769111 12785383 11893782 11085387 10353709 9688965 9080148 8520717
60849 8520717 8007813 7537511 7105044 6708049 6344850 6010139 5696449 5399590 5119060
60840 5119060 4853719 4601085 4360973 4135898 3926885 3731730 3548156 3376186 3216618
60831 3216618 3069191 2932904 2806472 2688037 2575987 2470326 2372014 2281112 2196820 2118630
60821 2118630 2045709 1975822 1907063 1840320 1777828 1719415 1662532 1606128 1552055 1502015 1455242
60810 1455242 1410165 1366700 1325852 1288236 1253748 1221753 1190964 1160039 1128768 1098161 1069311
60799 1069311 1042894 1019445 998926 980098 961548 943478 927477 914525 904167 895405 887271 878821
60787 878821 869913 861895 856285 852954 850934 850547 852911 857347 861186 862485 861327 858205 852974 845988
60773 845988 838635 831950 825912 820518 816190 812725 809385 806569 805784 807241 809014 809380 808569 807555 806811
60758 806811 807233 810448 816686 823714 829382 834095 839321 844887 849520 853129 856656 860283 863672 867538
60744 867538 872963 879136 883651 885531 886475 888580 892086 895922 899316 902031 903809 904516 904512 904194 903331 901229
60728 901229 897402 891742 884289 875328 865736 856883 849813 844460 839749 834553 828573 822318 816468 811328
60714 811328 806703 802111 797280 792668 789167 786991 785226 783008 780721 779327 778808 778299 777774 778436 781022
60699 781022 784615 787701 789791 791550 793861 797229 801667 806759 812094 817772 824106 830902 837713 844831
60685 844831 853110 862517 871755 879677 886228 891575 895223 896543 895355 891424 884248 874038 862116 849614
60671 849614 836535 822801 809307 797004 785644 774392 762939 751112 738204 724011 709903
60660 709903 697461 686479 675743 665519 657622 652754 649206 644758 638834 632243 625719 619435 613480
60647 613480 608105 603456 599317 595130 590443 585482 581069 577802 575561 573936 572576 570879 568167 564797
60633 564797 562383 562112 563427 565192 567349 570314 573404 575366 576247 577381 579578 582503 585723 589048 591941
60618 591941 594110 596865 602300 610602 619457 626650 632103 636890 641660 646966 653895 662994 673106 682336
60604 682336 690013 697083 704893 714090 724396 734895 744809 754204 763687 773460 783311 793489 804610
60591 804610 816434 827877 838693 850013 862447 874754 885417 894624 903364 911231 916566 918627
60579 918627 918261 916401 913139 908566 903470 898591 893803 888507 882404 875610 868437 861502 855684 851423
60565 851423 848120 844653 840693 837217 835401 835156 835214 834806 834721 836242 839480 843430 847333 851089 854471 857134
60549 857134 859673 863617 869771 877451 885958 895873 907948 921538 935370 949538 965488 984037 1004527
60536 1004527 1026092 1048754 1072744 1097408 1121281 1142876 1160994 1174649 1183219 1186725 1185723 1180837
60524 1180837 1172448 1160865 1146763 1131340 1115828 1100858 1086456 1072660 1059807 1048133 1037470
60513 1037470 1027485 1017883 1008121 997422 985600 973678 963212 955016 948792 943823 939625 935988 932873
60500 932873 930550 929684 930957 934329 938705 942767 946538 951681 959471 968634 976164 980589 983623 988218
60486 988218 995819 1006030 1018021 1031209 1044978 1058719 1072218 1085593 1099181 1113911 1131181 1151678
60474 1151678 1174667 1199122 1225053 1253028 1283098 1315330 1350928 1391444 1436879 1485861 1537906
60463 1537906 1594386 1657100 1727082 1805241 1892974 1991401 2100740 2221032 2352811 2496413
60453 2496413 2651164 2815607 2987532 3162806 3334727 3495589 3638915 3759807 3853869 3917213
60443 3917213 3947960 3947187 3918218 3865345 3793152 3706324 3609482 3507132 3403677 3303048 3208045
60432 3208045 3120197 3040638 2971332 2915312 2875445 2852813 2846479 2855008 2878063 2916332 2970207 3039072
60420 3039072 3121508 3215036 3314976 3414219 3504999 3581156 3638882 3676248 3693155 3691821 3676610
60409 3676610 3652967 3626397 3601875 3583228 3572589 3570774 3578421 3596629 3626564 3669030 3724806 3795119
60397 3795119 3881481 3985340 4108396 4253266 4423310 4621473 4849414 5108194 5400132 5729831
60387 5729831 6102983 6523910 6994437 7515134 8086789 8709484 9379795 10089018 10823188
60378 10823188 11562492 12279022 12936061 13492349 13909618 14158536 14221274 14093102 13784030
60369 13784030 13318071 12728513 12051901 11324005 10577381 9838641 9126251 8451172 7819683
60360 7819683 7235184 6697994 6205489 5754162 5341809 4967551 4629997 4325912 4050838
60351 4050838 3800957 3574284 3369886 3186065 3019759 2867980 2729254 2603129 2488719
60342 2488719 2384415 2288624 2199935 2116880 2038542 1965236 1897568 1834865 1775672 1719767 1668181
60331 1668181 1620905 1576074 1532287 1490393 1451945 1416973 1384491 1354246 1326387 1299957 1273464
60320 1273464 1247071 1222806 1202059 1183797 1165867 1147556 1130235 1115536 1103194 1090983 1076974
60309 1076974 1061625 1047102 1034606 1023319 1012200 1001652 992551 984484 976110 966810 957005 947118
60297 947118 937228 927529 918207 908953 899367 889603 879915 869988 859726 850293 843093 837781 832478 826037
60283 826037 819075 812700 807442 803615 801430 800196 798512 795861 793265 791879 791811 792836 795203 798876 802759
60268 802759 805813 808566 812503 817949 823432 827354 829707 831848 834959 839274 844780 852040 861633 872878
60254 872878 883928 893574 902347 911260 920077 927634 933416 937750 940630 941596 940981 940291 940875 942800 945243
60239 945243 947407 948830 949406 949301 948476 946414 942910 938879 935508 932652 928992 923663 916705 907950 896958
60224 896958 884391 872025 860697 849466 837659 826687 818745 814487 812940 812960 813705 814211 813802 812956
60210 812956 813002 814898 818707 823988 830208 836931 843995 851330 858515 865071 871412 878727 887469 896704 905563
60195 905563 914594 924890 936545 948895 961873 976213 992464 1010450 1029482 1048653 1067457 1086779
60183 1086779 1108716 1134621 1163859 1195305 1229440 1267739 1310405 1356174 1404331 1455438 1509599
60172 1509599 1565216 1620201 1673673 1725762 1776385 1825081 1871797 1916914 1960094 1999527 2032867
60161 2032867 2059154 2079554 2095984 2109178 2118482 2123263 2123721 2120270 2113224 2103777 2094522 2087989 2084844
60148 2084844 2084129 2084988 2087478 2092129 2099628 2110923 2126887 2147774 2173463 2204005 2239311 2278501 2320446
60135 2320446 2365044 2413203 2465294 2520191 2576028 2631396 2685490 2737506 2786315 2830671 2869718
60124 2869718 2903267 2931353 2953277 2967410 2972522 2969167 2959266 2944501 2925722 2903911 2880884 2858701
60112 2858701 2838799 2822079 2809505 2802312 2801761 2808854 2824103 2847437 2878523 2917441 2965025 3022379
60100 3022379 3089835 3166441 3250529 3340703 3435711 3532873 3627122 3712564 3785156 3843278 3885864
60089 3885864 3911317 3918833 3909760 3886689 3851891 3807613 3757213 3704742 3653469 3605614 3563102 3527436
60077 3527436 3498931 3477188 3462541 3456152 3458667 3469862 3489968 3520438 3562968 3618348 3686648 3767819
60065 3767819 3861525 3966774 4082132 4206303 4338545 4478870 4627633 4784122 4945374 5107128
60055 5107128 5266248 5421523 5571669 5713320 5841776 5953383 6046427 6119916 6172370 6202103
60045 6202103 6208140 6190379 6149028 6084402 5997507 5890736 5767766 5632804 5489996 5343316
60035 5343316 5196380 5052030 4912395 4779702 4656809 4546568 4450747 4369846 4303840 4252731
60025 4252731 4216420 4194283 4184980 4186825 4198564 4219718 4249556 4285522 4323406 4359694 4393380 4424900
60013 4424900 4453734 4477797 4495008 4504674 4507299 4503685 4494474 4480220 4461715 4440146 4416646 4391648
60001 4391648 4365353 4339075 4315264 4295413 4278731 4264059 4252713 4248236 4253332 4268106 4291379 4322551
59989 4322551 4361733 4408894 4463428 4524110 4589108 4656274 4723456 4788224 4847480 4898016 4937613
59978 4937613 4965433 4981636 4987145 4983368 4971332 4951195 4923199 4888613 4848734 4803312 4751165 4692189
59966 4692189 4627424 4557239 4481121 4399634 4314910 4228292 4138872 4045577 3949852 3855145 3764308
59955 3764308 3678593 3598733 3525763 3460587 3403447 3354122 3312404 3278370 3252265 3234085 3223396
59944 3223396 3219928 3224236 3237247 3259154 3289356 3327346 3372887 3425245 3483162 3545732 3612368 3681626
59932 3681626 3751084 3818660 3882885 3941361 3990379 4027268 4052373 4067591 4073459 4068613 4051680 4022765
59920 4022765 3983441 3936079 3882890 3825006 3763009 3698951 3637052 3581275 3532679 3490236 3453739
59909 3453739 3424581 3403896 3391455 3386594 3388955 3397964 3412802 3433554 3461446 3497142 3539411 3586235
59897 3586235 3636768 3691311 3749373 3808465 3865106 3916802 3962841 4003435 4038453 4067314 4089959
59886 4089959 4107487 4121505 4132945 4141758 4147784 4151865 4156231 4163876 4177382 4198100 4226430 4262742
59874 4262742 4307892 4363122 4430053 4510734 4606836 4718264 4842931 4978257 5122452 5274012
59864 5274012 5430506 5588460 5743913 5892387 6028489 6146290 6240240 6305648 6338991 6338666
59854 6338666 6305470 6241886 6151160 6037459 5906241 5763134 5612338 5456874 5300329 5147246
59844 5147246 5001445 4864786 4737989 4621846 4517164 4424281 4343503 4275689 4221835 4182340
59834 4182340 4157060 4145585 4146881 4159132 4180832 4211883 4252696 4302029 4356386 4411691 4464855
59823 4464855 4513430 4554610 4585407 4603492 4607269 4595244 4565952 4518415 4452260 4367767 4266812
59812 4266812 4153809 4034572 3913392 3791564 3669141 3547328 3428345 3313502 3202694
59803 3202694 3095940 2994312 2898842 2809275 2724726 2645296 2572328 2507028 2449326 2398308 2353450
59792 2353450 2315079 2283654 2258936 2239973 2225589 2214570 2205606 2197684 2190755 2185573 2182634 2181593
59780 2181593 2181920 2183597 2186767 2191008 2195382 2198953 2200970 2201008 2199386 2197053 2194467 2190822 2184857 2176053 2164580
59765 2164580 2150665 2134787 2117972 2100965 2083428 2064892 2046188 2028879 2013539 1999741 1987510
59754 1987510 1977446 1969427 1962650 1957209 1954258 1954288 1956717 1961858 1971859 1988744 2012564 2042413 2078169
59741 2078169 2119930 2166234 2213918 2259599 2300829 2336442 2366634 2392593 2415650 2437029 2458125
59730 2458125 2479665 2499948 2515105 2522156 2521217 2514249 2503012 2489377 2476419 2467271 2463161 2463938 2470336
59717 2470336 2484495 2508416 2543027 2588493 2644148 2708322 2779713 2859291 2949759 3052857 3167987
59706 3167987 3293495 3428028 3570243 3718088 3868609 4017247 4156383 4275322 4363040 4411851
59696 4411851 4419371 4388371 4325571 4239998 4141100 4037056 3933793 3834856 3742152 3657182 3581700
59685 3581700 3517214 3464255 3422555 3391690 3371165 3360200 3358002 3364113 3378049 3399054 3427005 3463269
59673 3463269 3509622 3566173 3631326 3704067 3785411 3877057 3979385 4091594 4213556 4346787
59663 4346787 4493481 4654937 4831164 5021831 5227403 5449172 5688200 5944436 6216956
59654 6216956 6504797 6807346 7124034 7453758 7794294 8141873 8491433 8837574 9175360
59645 9175360 9500604 9810366 10104021 10383557 10652162 10912353 11165631 11413343 11656864
59636 11656864 11896579 12130984 12356884 12570147 12766349 12941239 13091191 13213498 13306457
59627 13306457 13369219 13401628 13404566 13380846 13335539 13274612 13203240 13126134 13049381 12980411 12925298
59616 12925298 12887029 12867369 12869513 12897653 12954547 13040965 13157340 13304543 13482871 13691483
59606 13691483 13929127 14194307 14483937 14792184 15110768 15429776 15737803 16021858 16267699
59597 16267699 16460684 16587092 16635958 16600661 16479317 16274351 15992203 15642992 15239335 14794935
59587 14794935 14324003 13841008 13359346 12889407 12437927 12008992 11605074 11227119 10874304
59578 10874304 10543901 10230962 9928056 9625992 9315657 8990051 8645982 8285124 7913658
59569 7913658 7540116 7172784 6818396 6481976 6166594 5873100 5600837 5348958 5116972
59560 5116972 4904332 4710121 4533196 4372257 4225882 4092836 3972215 3862938 3763338 3671727
59550 3671727 3587171 3509456 3438626 3374888 3318348 3268134 3222158 3178360 3135846 3094226 3052466
59539 3052466 3009233 2963933 2916533 2866849 2815017 2762225 2709825 2657955 2606142 2555064 2506489
59528 2506489 2461605 2420525 2383270 2349806 2319013 2289053 2259328 2231080 2205803 2184057 2166090
59517 2166090 2152397 2143032 2137215 2134188 2133870 2136392 2141714 2149996 2161604 2176380 2193428 2211716 2230357
59504 2230357 2248546 2266274 2285177 2307509 2333908 2362982 2393288 2424795 2458290 2494512 2534217
59493 2534217 2577958 2625296 2675286 2728237 2786039 2850241 2920692 2996478 3077164 3162627 3252884
59482 3252884 3348843 3452122 3563084 3679643 3798790 3918741 4039075 4159612 4279967 4399528
59472 4399528 4517023 4630336 4736905 4833526 4915691 4978838 5021574 5046903 5059185 5060497 5050843
59461 5050843 5030897 5003052 4970152 4934433 4897563 4860681 4824630 4791081 4763153 4743816 4733915
59450 4733915 4732972 4741934 4763882 4801638 4855508 4923645 5003634 5093124 5189540 5289783 5389815
59439 5389815 5484010 5565366 5627284 5665450 5677788 5662681 5618111 5543199 5440312 5314837 5172743
59428 5172743 5018871 4857562 4693644 4531705 4374838 4225031 4084423 3955138 3837999
59419 3837999 3732443 3637766 3553653 3479708 3415653 3362066 3319750 3288115 3265524 3251649 3248328
59408 3248328 3257372 3278463 3309794 3349823 3397707 3452955 3515445 3585097 3660816 3740495 3822543
59397 3822543 3906293 3990010 4069530 4140135 4199237 4246057 4279331 4296667 4295944 4276197 4237252 4179777
59385 4179777 4105999 4019497 3923773 3821310 3713935 3603526 3492198 3382087 3274971 3171886
59375 3171886 3073200 2979183 2890292 2806900 2729292 2658050 2593749 2535903 2482989 2434282 2391110
59364 2391110 2355492 2327788 2306380 2289449 2276301 2267021 2261542 2259389 2260087 2263744 2271277 2284029 2302992
59351 2302992 2328307 2359221 2394460 2433142 2475773 2523482 2575045 2625081 2666964 2698196 2722183
59340 2722183 2744806 2770534 2801762 2839568 2883885 2934340 2991967 3058449 3132187 3206663 3275050
59329 3275050 3336084 3393936 3453112 3515566 3582300 3654995 3734930 3821871 3915311 4016000 4125244
59318 4125244 4243112 4368209 4499291 4636659 4781709 4935226 5096653 5265481 5443050
59309 5443050 5632071 5834389 6050231 6279843 6524481 6784984 7060526 7349756 7652145
59300 7652145 7966895 8291246 8621037 8952082 9279657 9597523 9899544 10182266 10444460
59291 10444460 10684412 10899574 11089100 11254787 11398691 11521142 11621719 11700592 11757466 11789914
59281 11789914 11794004 11766433 11705418 11609914 11478846 11311269 11107089 10868055 10598703 10306187
59271 10306187 9998556 9682838 9364730 9049592 8742761 8448466 8168928 7905071 7657806
59262 7657806 7427870 7214626 7016313 6832109 6662970 6509486 6369817 6241159 6122733
59253 6122733 6015645 5919924 5833570 5754870 5683787 5620145 5562016 5507190 5455058 5405756 5358329
59242 5358329 5310896 5261939 5210372 5155169 5096107 5034180 4970149 4903439 4833758 4763002 4693838
59231 4693838 4626651 4559413 4490573 4420789 4351763 4284713 4220349 4159326 4102197 4049458 4001860
59220 4001860 3960271 3925129 3896265 3873128 3855048 3841827 3834492 3834834 3843629 3859881 3882234 3910220
59208 3910220 3943304 3979556 4016381 4051936 4084833 4113152 4135027 4149839 4157632 4157622 4148479 4130033
59196 4130033 4103785 4071831 4036079 3998314 3960272 3923658 3890376 3862263 3840335 3825080 3817363
59185 3817363 3816980 3819195 3814881 3796708 3764862 3725399 3684295 3645143 3611099 3585420 3569386 3561991
59173 3561991 3562327 3570601 3586575 3609091 3637866 3674132 3718656 3770388 3827763 3890351 3958822 4034215
59161 4034215 4117494 4208782 4306915 4410748 4520956 4639473 4767294 4904107 5050045 5206323
59151 5206323 5374002 5553501 5745404 5950099 6166124 6390120 6618770 6849486 7078850
59142 7078850 7301659 7511940 7703847 7871346 8008494 8110780 8175536 8200946 8185757 8130346
59132 8130346 8037243 7910689 7756557 7582211 7394617 7198254 6996062 6792261 6592493 6400921
59122 6400921 6218829 6046355 5883916 5731601 5589018 5456486 5334853 5223472 5119877
59113 5119877 5022364 4931622 4849159 4775421 4710077 4652665 4602008 4556174 4513935 4475505 4441435
59102 4441435 4411792 4386544 4365266 4346117 4326838 4307451 4290415 4277388 4267364 4258607 4250498 4242400
59090 4242400 4232519 4219455 4203539 4185265 4163737 4138127 4109373 4078712 4045423 4007731 3965363
59079 3965363 3919652 3871510 3820738 3767236 3711793 3655602 3599647 3544380 3489605 3435105 3381735
59068 3381735 3331217 3284500 3241133 3200738 3164211 3132905 3107491 3088126 3074767 3066699 3062718 3062439
59056 3062439 3066534 3075190 3087392 3102251 3119757 3139558 3160351 3181475 3203876 3228400 3254260 3280130
59044 3280130 3305587 3330275 3352788 3371715 3386982 3399129 3408408 3415999 3425039 3438704 3457681 3480785
59032 3480785 3507326 3537388 3570254 3604137 3637307 3668053 3693553 3710030 3714288 3704448 3679304 3637969
59020 3637969 3580493 3508490 3425053 3333878 3237760 3137610 3033462 2926564 2819676 2715193
59010 2715193 2614154 2517510 2426873 2343041 2264902 2190910 2120869 2055418 1994698 1938637 1887726
58999 1887726 1842369 1801910 1765165 1731403 1700248 1671451 1645505 1623531 1605641 1590248 1575938
58988 1575938 1563270 1553824 1548176 1545571 1544774 1544455 1543582 1542329 1541917 1543120 1545926 1550998 1559938 1573313
58974 1573313 1589997 1609396 1632637 1660423 1691560 1725106 1762012 1802552 1843689 1881362 1914199
58963 1914199 1942681 1965794 1981351 1989296 1992117 1991765 1988087 1980334 1968545 1953517 1937148 1922652
58951 1922652 1912790 1907809 1906404 1908231 1913835 1922507 1932228 1941761 1951146 1960156 1967926 1974067 1978439 1979720
58937 1979720 1975842 1966055 1951058 1931065 1905439 1874620 1840813 1806146 1771213 1735765 1699860 1664189
58925 1664189 1630172 1599674 1573576 1550776 1529721 1510599 1494744 1482273 1471978 1463493 1457815 1455557
58913 1455557 1456261 1459641 1465909 1474547 1484352 1495187 1508257 1524144 1541944 1560852 1581203 1603195
58901 1603195 1625765 1647583 1668199 1687519 1704985 1720009 1732564 1742732 1750294 1755401 1759327 1764102
58889 1764102 1771435 1781906 1794853 1809199 1824885 1843296 1865782 1892086 1920833 1951036 1982261
58878 1982261 2013880 2045399 2077248 2109947 2142564 2173254 2201592 2229352 2258859 2291370 2327169
58867 2327169 2366277 2408825 2455273 2506301 2562095 2622050 2685674 2753193 2824735 2899921 2979323
58856 2979323 3065247 3159524 3261186 3368006 3479664 3597699 3722990 3855604 3996985 4149893
58846 4149893 4315660 4493408 4682482 4883758 5098010 5324853 5564085 5816237 6080533
58837 6080533 6353609 6631372 6910970 7189736 7463113 7724758 7968256 8187853 8377998
58828 8377998 8533060 8647694 8717529 8740050 8715032 8643902 8529023 8374384 8186562 7973650
58818 7973650 7742810 7499470 7248460 6994423 6740806 6489682 6243097 6003529 5772628
58809 5772628 5550470 5336693 5131704 4936355 4751040 4575470 4408994 4251146 4102394
58800 4102394 3964068 3836746 3718933 3608269 3503802 3405946 3314319 3227071 3142645 3061143
58790 3061143 2983536 2910322 2841260 2775856 2714080 2657111 2606915 2564204 2527335 2494290 2465142
58779 2465142 2441143 2422005 2406093 2393195 2384996 2382333 2383803 2387779 2394339 2404544 2419240 2439222
58767 2439222 2465165 2496466 2531186 2568015 2607614 2651580 2700978 2756307 2817888 2885547 2958553
58756 2958553 3036306 3118654 3205544 3297198 3394650 3499076 3610529 3728319 3852792 3985692
58746 3985692 4128663 4282363 4447027 4622662 4808578 5004038 5209727 5427433 5657892
58737 5657892 5899778 6150754 6408309 6669453 6930716 7188584 7438744 7674811 7889007
58728 7889007 8074258 8224827 8335547 8402327 8423479 8398999 8328708 8213265 8057228 7868889
58718 7868889 7656146 7424111 7177181 6921116 6661652 6402476 6145802 5893735 5647964
58709 5647964 5409204 5178061 4955796 4743564 4541796 4350900 4171614 4004183 3848198
58700 3848198 3703679 3571185 3450290 3338976 3235172 3138124 3048131 2966072 2893311 2830642
58690 2830642 2776869 2729661 2688104 2653111 2625221 2603677 2588022 2578707 2575340 2575968 2579113 2585224
58678 2585224 2595301 2609289 2626355 2645227 2663394 2677231 2683789 2681620 2669807 2647892 2617267 2580825
58666 2580825 2540408 2496136 2448940 2401789 2357185 2314947 2273624 2232511 2191032 2147596 2100643
58655 2100643 2049984 1996099 1939247 1880334 1821441 1764097 1707787 1651256 1594634 1539414 1487080
58644 1487080 1438506 1393931 1352820 1314358 1278470 1245710 1216227 1189996 1167905 1150884 1137723
58633 1137723 1125643 1113560 1102965 1094977 1088491 1082064 1075615 1069072 1061291 1051781 1042082 1034022 1027700
58620 1027700 1022314 1017768 1014536 1013089 1014264 1018877 1026276 1034724 1043816 1054857 1068201 1082325 1096554
58607 1096554 1112705 1132632 1155919 1181196 1207793 1234524 1258588 1277538 1291162 1300128 1304165 1302890
58595 1302890 1296956 1287040 1273061 1255519 1235985 1215020 1191400 1164813 1137533 1111855 1087605 1063912
58583 1063912 1041776 1022924 1007430 994316 983405 975078 969312 966243 966244 968240 969673 969651 970466 974455
58569 974455 981149 989053 998214 1009036 1020506 1031943 1044888 1060912 1078924 1096951 1115291 1135568
58557 1135568 1157783 1180676 1204270 1229954 1258771 1291301 1328277 1369582 1413620 1459214 1507113
58546 1507113 1558422 1613229 1672192 1737371 1809386 1885581 1963231 2042761 2125486 2210131 2294286
58535 2294286 2377429 2459369 2537082 2606284 2665122 2713280 2748510 2767476 2769644 2757370 2732614
58524 2732614 2696445 2651447 2601510 2549017 2494712 2440380 2389209 2343341 2303095 2268637 2240396
58513 2240396 2217905 2200078 2186698 2178183 2174284 2174491 2178997 2187661 2198963 2211834 2227730 2249000
58501 2249000 2275984 2307295 2341630 2377074 2409682 2434985 2450039 2452134 2437269 2402943 2351680
58490 2351680 2289067 2218969 2143128 2064251 1986059 1910271 1836194 1763338 1692307 1623602 1557822
58479 1557822 1496648 1441405 1391163 1344320 1301331 1263529 1230173 1199215 1170333 1144693 1122359
58468 1122359 1102417 1084996 1070688 1058605 1047377 1037275 1028959 1021255 1012890 1005301 1000569 997515
58456 997515 992998 986377 979527 973261 967169 962457 961203 962804 964441 965191 966700 970001 974811 981703
58442 981703 991605 1003001 1012894 1020998 1030169 1042558 1057994 1075957 1096167 1117200 1137570 1158419
58430 1158419 1182518 1210666 1241524 1274398 1309339 1345049 1379749 1413441 1446127 1474678 1495309
58419 1495309 1508592 1518006 1523824 1522662 1513026 1496944 1475649 1448044 1414429 1377863 1340649 1302721
58407 1302721 1264186 1226191 1188907 1152123 1118090 1090033 1067470 1046857 1027188 1010740 997892
58396 997892 985988 974417 966102 962240 959990 957395 956410 958704 962279 964821 967139 970778 975118 979266
58382 979266 984282 991359 1000010 1009866 1022025 1036926 1053080 1069388 1086685 1105790 1126110 1147118
58370 1147118 1168951 1190795 1210972 1229183 1246126 1260535 1269500 1272271 1270765 1265891 1256666 1243605
58358 1243605 1229584 1216457 1204012 1192793 1184373 1178080 1171361 1164513 1161268 1163535 1169218 1176471 1186172
58345 1186172 1198681 1212060 1225432 1240627 1258594 1277358 1295156 1312364 1328763 1342032 1350452
58334 1350452 1354204 1353181 1346955 1337692 1329151 1321722 1312468 1301113 1291340 1284586 1277463 1267700 1258191 1252395
58320 1252395 1249720 1248241 1248313 1250555 1253423 1255447 1257174 1258966 1259855 1260233 1262391 1266733 1270923 1274263 1279133
58305 1279133 1286544 1294276 1301176 1309157 1319142 1329338 1339533 1352576 1369315 1386509 1402208 1418766
58293 1418766 1437914 1457341 1475149 1493509 1514867 1538402 1562901 1589228 1617227 1644200 1669093
58282 1669093 1694273 1720659 1745199 1765465 1782390 1796255 1804930 1808753 1812138 1817367 1821804 1824154
58270 1824154 1828103 1836393 1846661 1856929 1869883 1887607 1907378 1927118 1950067 1979189 2011396 2042026
58258 2042026 2071038 2100412 2129529 2157608 2186938 2219623 2254718 2291916 2333607 2379766 2425587
58247 2425587 2467937 2509432 2552492 2594648 2633572 2671210 2708674 2742690 2771746 2800196 2831589
58236 2831589 2863558 2894043 2926561 2964173 3004269 3044768 3089348 3140759 3195067 3248692 3305167
58225 3305167 3368570 3436273 3504851 3577267 3657268 3742460 3830123 3924252 4029393 4142710 4259417
58214 4259417 4380873 4510128 4644874 4782150 4924738 5075581 5231279 5388151 5548599
58205 5548599 5713819 5876418 6028502 6171155 6308160 6437253 6556656 6673675 6797196
58196 6797196 6927599 7063400 7211434 7380304 7569530 7775073 7999523 8246771 8513061
58187 8513061 8794078 9094885 9422153 9772780 10141037 10530200 10945680 11383736 11839446
58178 11839446 12319390 12833822 13382927 13963563 14582735 15250766 15967521 16728817 17539274
58169 17539274 18404670 19318993 20274215 21276196 22336603 23457734 24641500 25904531
58161 25904531 27266357 28730361 30293800 31967414 33765842 35688209 37729316 39900964
58153 39900964 42219917 44683686 47281913 50023869 52932674 56024757 59322878 62879502
58145 62879502 66759216 71009073 75676372 80843361 86612356 93073391 100327989 108533654
58137 108533654 117885422 128570463 140785242 154770780 170766411 188947036 209478149
58130 209478149 232619144 258702093 288029412 320798409 356795884 394535791 430346214
58123 430346214 458689390 474245239 474449070 460471221 436058744 405528996 372442166
58116 372442166 339288294 307634393 278314994 251646520 227657559 206225692 187122486
58109 187122486 170074764 154848338 141266115 129163918 118375632 108761952 100213792
58102 100213792 92620942 85866510 79854925 74517111 69782624 65570146 61810812 58460557
58094 58460557 55484059 52844173 50511816 48468397 46690348 45144657 43807336 42675174
58086 42675174 41751908 41033742 40518677 40222287 40172833 40396019 40917485 41776780 43021046
58077 43021046 44683010 46788749 49401233 52633274 56590968 61315755 66788753 72907128
58069 72907128 79306957 85158167 89275384 90652047 89020084 84926671 79304103 72986700
58061 72986700 66535446 60303080 54504486 49233639 44500198 40284987 36555137 33253007
58053 33253007 30314601 27701660 25394546 23362009 21562283 19966970 18559000 17310572
58045 17310572 16185447 15161293 14230344 13379639 12588590 11845025 11147611 10493893 9880899
58036 9880899 9315359 8807768 8356528 7950742 7586567 7267302 6988824 6738108 6505275
58027 6505275 6285057 6068095 5843771 5611644 5379075 5148519 4917923 4691751 4479317
58018 4479317 4282239 4094444 3914357 3746530 3591472 3444382 3304304 3174787 3055284
58009 3055284 2941241 2832668 2733435 2642068 2552384 2463442 2380212 2304330 2232655 2164804 2103345
57998 2103345 2046372 1988478 1929633 1875072 1826082 1778679 1731462 1686756 1643789 1598840 1552803
57987 1552803 1510843 1473902 1437912 1401905 1369407 1341038 1313062 1284251 1257445 1233481 1210111
57976 1210111 1187427 1167923 1150872 1133096 1115370 1101338 1090075 1076652 1060332 1045199 1032369
57965 1032369 1018698 1003736 990770 979966 967456 952382 938244 926264 913964 901281 891398
57954 891398 884399 876705 868016 862152 859705 856592 851543 848464 849494 852113 855091 860992 870457 879930
57940 879930 887526 895689 905879 916150 926149 939042 955848 972672 985841 995328 1001361 1002457 998710
57927 998710 992629 985103 974964 963447 954020 946590 937133 924387 911432 899335 885112 867949
57915 867949 851529 837728 823525 806824 790127 775772 762711 750777 742900 739884 737768 733680
57903 733680 729972 729550 731391 733768 737642 743531 748861 751572 752821 753387 751158 744963 737075 729161 719557
57888 719557 707360 695307 685452 675802 664536 653984 646896 642005 636801 631930 629490 629516 631205 635098
57874 635098 641140 647005 651161 655496 662556 672507 684807 699969 717263 733495 746664 758370 770365
57861 770365 781372 789476 794829 797661 796477 790570 781628 770689 756426 738618 719992 702161 683119
57848 683119 661597 640526 623009 607851 592394 576925 562946 549870 536986 526213 519258 514225
57836 514225 508489 502855 499493 497854 496152 494924 495454 496443 495981 495406 497464 501702 505295 507582 510384
57821 510384 514351 518225 521530 525325 530330 536269 542579 548108 551150 551443 550901 550605 548703 543356 535984
57806 535984 529259 523465 517375 511208 506022 501432 496553 492115 489243 487354 485675 485498 488307 492888
57792 492888 497041 501049 506666 513676 520456 527324 536260 547468 558770 568356 576037 581950 586166 589408
57778 589408 592306 594079 593507 590818 587230 583313 579131 575046 570778 564709 555846 545565 535934 527481
57764 527481 520123 514744 511810 509812 507321 505308 505194 505908 505447 504316 504697 506908 509172 510326 510290 508495
57748 508495 504397 499324 495443 492909 489834 484692 477043 466768 454821 444053 436800 431988 426798
57735 426798 420810 416221 414410 414771 416819 420846 426173 430932 434141 436378 438357 440484 443739 449149
57721 449149 456281 463882 471923 481282 491545 501072 509422 517853 527002 535657 542339 546882 550026 552519
57707 552519 554866 557221 559398 561498 564065 566992 569028 569234 567959 565342 560035 550950 539300 527269
57693 527269 515560 503954 493213 484226 475979 466716 456884 448768 443299 439265 435707 433140 432139
57680 432139 432427 433595 435264 436457 436291 435364 435094 435681 436012 435499 434712 434336 434760 436499 439734 443732 447926
57663 447926 453059 459794 466882 472516 477068 482464 489024 494963 499255 503121 508287 515282 523799 533279
57649 533279 542724 551133 558567 566030 574375 584188 596277 610971 627213 643715 660919 680482 703046
57636 703046 727843 754349 782833 813217 844564 875642 904918 930242 949865 963753 973041 978619
57624 978619 981398 983264 986366 991818 1000314 1013347 1032299 1056852 1085943 1119807 1159648 1206013
57612 1206013 1259336 1321387 1394032 1476950 1568797 1670490 1785127 1914680 2058931 2217512
57602 2217512 2389811 2570868 2748122 2903235 3017679 3079044 3085679 3046653 2975785 2884598
57592 2884598 2780429 2668817 2554344 2439098 2323247 2208156 2097166 1992852 1895455 1804516
57582 1804516 1720163 1642140 1569399 1501445 1438744 1381401 1329040 1282253 1242282 1208737 1179404
57571 1179404 1152913 1129767 1110092 1092349 1075358 1059927 1047390 1037996 1031670 1028841 1029341 1031771
57559 1031771 1035204 1040457 1048587 1059095 1070702 1083062 1096770 1112387 1130338 1151067 1174534 1200121
57547 1200121 1227753 1258495 1293440 1332526 1375009 1420583 1469327 1520627 1572475 1621975 1666830
57536 1666830 1706371 1740381 1766572 1780471 1779104 1763899 1738476 1704411 1661130 1609443 1552786
57525 1552786 1494614 1436342 1378088 1319748 1260984 1201946 1144424 1090799 1041447 994739 949816
57514 949816 907701 869290 834083 801561 772189 746278 723191 702386 684045 668035 653379
57503 653379 639202 625281 611580 598371 586705 577298 569176 561056 553751 549188 547179 545585 543830
57490 543830 543569 545418 547755 549682 552381 556254 559394 560631 561783 564860 568984 572107 574222 576940
57476 576940 581322 587897 597373 609276 620980 629958 636210 641051 644811 647623 651298 658129 668170
57463 668170 679447 690567 701665 713194 725246 737994 751763 766833 783768 803182 824485
57452 824485 845931 867024 889945 917334 949357 983978 1019222 1053942 1087225 1118563 1148120
57441 1148120 1175513 1198552 1214239 1220779 1218036 1206743 1188095 1163499 1133883 1099811 1062646 1024456
57429 1024456 986150 947039 907258 869169 835060 804684 776566 750557 727403 706751 687496
57418 687496 669605 653932 640622 629163 619629 612316 606499 601034 596062 592703 591047 589687 587386
57405 587386 584380 581983 581640 584191 589432 596468 604810 614737 626525 640229 656376 675604 697099
57392 697099 718940 740800 764756 792328 822343 853031 884530 917577 951266 984170 1016323
57381 1016323 1047754 1076008 1097563 1111114 1117184 1115246 1103809 1083187 1055691 1023045 985883 945820
57369 945820 905402 865421 824573 782564 741555 703680 668948 636531 606363 578276 551041
57358 551041 523743 497289 473398 452595 434017 416620 399818 383396 367485 352598 339388
57347 339388 328463 320163 314044 308691 302742 295984 288891 281482 273579 265956 260032 256247 253685 251479
57333 251479 249637 248284 247033 245570 244155 243159 242501 241764 240544 238694 236594 235070 234650 235058 235744 236434
57317 236434 236799 236260 234815 233351 232254 230424 226808 222288 218815 217078 216409 216565 217940 219967 220833
57302 220833 219290 215833 211942 208883 207068 205642 202982 198636 194420 192322 191663 189861 185796 180762
57288 180762 176210 172491 170109 170156 172566 175548 177789 179931 182906 186001 187821 188376 189101 191193 194742
57273 194742 199043 203209 206853 210529 215006 219945 224136 227437 231500 237849 245974 254087 261168 267505
57259 267505 273778 280550 288462 297995 308722 319295 328526 336595 345046 355436 367948 381610 395983
57246 395983 411925 430192 449922 469521 488775 508967 530915 553813 576153 596851 615227
57235 615227 630801 643706 654835 665206 675397 685648 696098 706921 718507 731340 745303
57224 745303 759509 773328 787122 801281 815218 828455 842135 858110 876717 896933 918687
57213 918687 943448 972171 1004026 1037575 1072030 1106972 1142062 1177548 1213909 1250419 1285218
57202 1285218 1317368 1347818 1377611 1406198 1432294 1455434 1475761 1493093 1507334 1519410 1530794
57191 1530794 1542279 1553943 1566328 1581133 1600592 1626110 1657294 1692348 1729744 1769363 1811573
57180 1811573 1855565 1899459 1941986 1983080 2022782 2060619 2096426 2130966 2165390 2200757 2238170
57169 2238170 2278612 2322541 2370369 2423258 2482344 2547177 2616142 2688598 2765295 2846459 2930879
57158 2930879 3017349 3105455 3194132 3280828 3363272 3441225 3515717 3587569 3657596 3727201 3797571
57147 3797571 3868888 3941251 4015724 4093597 4175158 4259910 4347214 4435908 4523992 4609671 4692358
57136 4692358 4772195 4849452 4925058 5000641 5076981 5153169 5228313 5303215 5379252 5456482 5534209
57125 5534209 5612754 5693147 5775554 5859579 5945726 6034806 6125691 6215300 6301319 6383793 6463643
57114 6463643 6540780 6614337 6683880 6749507 6811137 6868199 6919900 6965675 7005689 7040892 7072124
57103 7072124 7099094 7120832 7137343 7150324 7162010 7173662 7185373 7196936 7208523 7220780 7234592
57092 7234592 7250790 7269835 7291772 7316504 7344140 7374992 7409147 7445932 7483898 7521457 7557274
57081 7557274 7589620 7615448 7630690 7631594 7615323 7579192 7520190 7436002 7326281 7192551 7037187
57070 7037187 6862802 6671806 6465192 6241123 5994777 5719301 5406683 5048522 4637600
57061 4637600 4169648 3643209 3057298 2409233 1694447 907158 40047 -916597 -1974880
57052 -1974880 -3148758 -4454306 -5909841 -7533999 -9343023 -11351122 -13574663 -16036182
57044 -16036182 -18765168 -21797370 -25175005 -28946800 -33166745 -37893469 -43191010 -49127416
57036 -49127416 -55769813 -63180812 -71419307 -80540166 -90588376 -101592482 -113559893 -126465668
57028 -126465668 -140235193 -154744389 -169847096 -185382829 -201106498 -216572919 -231105163
57021 -231105163 -243929153 -254393934 -262114105 -266967947 -269025298 -268491132 -265661820 -260855245
57013 -260855245 -254332338 -246267996 -236786975 -226019676 -214130948 -201315226 -187777342
57006 -187777342 -173718868 -159341845 -144867290 -130547524 -116651832 -103430465 -91081946
56999 -91081946 -79738902 -69468097 -60277350 -52128734 -44955497 -38675198 -33196770 -28426478
56991 -28426478 -24274528 -20658427 -17502727 -14739868 -12312627 -10173619 -8281690 -6600435
56983 -6600435 -5099684 -3755137 -2545460 -1451842 -460777 435198 1240592 1959376 2595079
56974 2595079 3151982 3637885 4063948 4440884 4776855 5079122 5355016 5609878 5845760
56965 5845760 6063053 6261813 6440965 6598413 6733248 6846336 6937770 7005128 7045043 7055319
56955 7055319 7035528 6987867 6918442 6835653 6745685 6650206 6548453 6439598 6322638 6196494
56945 6196494 6061642 5919721 5770156 5608903 5431863 5237933 5027592 4800759 4558239
56936 4558239 4303887 4043299 3781377 3522832 3273789 3040499 2826795 2634503 2465962
56927 2465962 2324664 2213862 2135911 2092621 2085167 2113965 2179394 2282084 2422714 2604257
56917 2604257 2835076 3123335 3458514 3794891 4059156 4183758 4140610 3948749 3655169 3309433
56907 3309433 2949711 2601323 2279651 1992399 1741621 1526391 1344855 1194540 1071910
56898 1071910 972663 892728 828833 778277 738334 705616 675851 644994 611311 576154 542033
56887 542033 510078 479860 451060 424149 399599 377547 358292 341997 327792 314315 301529
56876 301529 291038 284189 280761 279937 281641 286311 293871 303181 311867 316647 314767 305620 290498 270894
56862 270894 247998 223709 200560 179982 161643 144899 129806 116309 103729 91802 81147
56851 81147 71963 63166 53570 43064 32188 21570 12316 5651 1378 -2220 -6267 -10263 -13848 -17890
56837 -17890 -22561 -25931 -26273 -24761 -24059 -24956 -26111 -26399 -25524 -22608 -16332 -6796 4328 15910 28225
56822 28225 41366 53980 64169 70877 74156 75030 75475 77600 82204 88592 96051 104843 115459 127677
56808 127677 141064 156027 173689 194701 218639 244718 272817 303581 337595 374620 413507
56797 413507 452198 487420 514933 531093 534659 527109 511604 492073 472570 456077 443482 434361
56785 434361 428736 427302 430141 436532 446387 460712 480253 504765 534065 568721 609155 655234
56773 655234 707204 765358 827188 885503 930832 956053 959083 942550 911905 872890 829435 783909
56761 783909 739242 699368 666748 640729 619531 602855 591417 585147 583496 586878 596106 610749
56749 610749 629589 652563 680878 714928 752775 790244 821544 840374 842185 826229 795403 754479
56737 754479 708677 662656 619380 579902 544745 514854 490550 470663 453911 440480 431144 425740
56725 425740 423780 425649 431630 440589 451369 464744 481829 500735 516712 525611 525542 515639 495822
56712 495822 468471 438212 408841 381429 355788 332215 311071 292015 274555 258577 243864
56701 243864 230039 217297 206208 196512 187227 178211 170342 163844 157831 152035 147463 144481 141548
56688 141548 137011 131254 126013 122271 119781 118011 116506 114801 112835 111256 110540 110080 108834 106689 104544
56673 104544 103053 101844 100098 97695 95571 94821 95458 96384 96752 96875 97363 98036 98479 99043 100084 100514 98663
56656 98663 94769 91231 89806 89741 89293 88004 86566 85276 83764 81979 80564 80202 81027 82620 84333 85687
56640 85687 86657 87564 88836 90965 94399 98993 103839 108139 111931 115322 117461 117406 115977 115564 117690 121578
56624 121578 125425 128325 130610 132978 135740 138491 140289 140569 139923 139495 139683 140060 140421 141039 141784 141914
56608 141914 141031 139628 138485 138099 138655 139750 140036 137993 133450 127824 122777 119002 116083 112770 107606
56593 107606 100216 92006 84799 78993 73905 69425 65841 62245 56962 50013 43610 39618 37852 37423
56579 37423 38289 40552 43504 46538 50111 54785 59999 64688 68547 71858 74599 76489 77575 78296 79305
56564 79305 81487 85376 90257 94633 98058 101709 106641 112283 117282 121168 124530 128071 132027 136027
56550 136027 139234 141174 142560 144467 146524 147027 145262 142576 140520 138983 136931 134118 131289 129506
56536 129506 129905 133115 138016 141991 143393 143121 142989 143539 144471 146220 149549 153996 158137 161392 164458
56521 164458 167951 171611 175061 178582 182876 188356 194714 200976 206122 209929 213079 216319 219853 223618
56507 223618 227637 231889 236332 241253 247072 253569 259898 265538 270715 275827 281247 287705 295823 305003
56493 305003 313841 322006 330595 340141 349538 357767 365559 374275 383866 392944 400315 405658 409219 411610
56479 411610 413559 415225 416106 415863 414593 412043 407505 400957 393470 386053 378923 372231 366318 360802 354690
56464 354690 348106 342574 338674 334729 328865 321254 313230 305372 297688 290578 284215 277884 271279 265529
56450 265529 261558 258337 254330 249893 246531 244251 241424 237134 232206 227888 224717 222600 221004 219176
56436 219176 216984 215252 214573 214360 213970 213932 214892 216088 216254 215498 214801 214101 212501 210339 209508 211447 215776
56419 215776 220992 225666 229028 231241 233124 235100 236772 237975 239526 242151 245529 249216 253437 257779
56405 257779 260284 259715 257960 258260 261394 265468 269245 273499 278780 283862 287362 289697 292501 296810 302347
56390 302347 308073 313190 317943 323406 330078 337009 342858 347395 351297 355041 358814 363030 367857 372533
56376 372533 376007 377969 378665 378353 377672 377642 378221 377759 375115 371543 369111 367992 366735 364499 361439 357565
56360 357565 352902 348383 344914 341811 337716 332693 327920 323752 319653 315633 312063 308380 303749 298766
56346 298766 294897 292529 291140 290832 291833 293020 293038 292516 292983 294007 293915 293210 294374 297881 301188 302516
56330 302516 303155 304907 307508 309874 311879 313454 313618 311945 309792 308731 308656 308370 307174 305056 302272
56315 302272 299399 297002 294930 292908 291931 293634 298022 303282 308238 313254 318194 321401 321847 320861 320570
56300 320570 321680 323596 325575 326884 327042 326846 328101 331408 335141 337416 338147 338403 338757 339198 339858 340907
56284 340907 342227 343750 345553 347288 348318 348758 349622 351594 354483 358039 362308 366921 371069 374473 377498
56269 377498 380250 382653 385371 389274 393850 397693 400874 405253 411912 419721 427089 433744 440138 446406
56255 446406 452676 459251 465820 471520 476350 481456 487520 493868 499644 504879 510059 515584 521779 528461
56241 528461 534624 539648 544385 549455 553060 552901 550155 548825 550645 553228 554173 554323 555602 558047 560790
56226 560790 563983 567869 571459 574022 576668 580826 586200 591696 597320 603736 610751 617530 623658 629037
56212 629037 633625 638101 643897 651702 660848 670725 681648 693619 705673 717415 730024 744775 761596
56199 761596 779846 799443 820528 843205 868228 896689 928363 961676 995737 1030943 1067024
56188 1067024 1102340 1135931 1168569 1201028 1233013 1264484 1295871 1325868 1351151 1369838 1383444
56177 1383444 1393998 1401070 1403305 1401267 1396790 1390627 1382400 1371983 1359624 1345522 1330352 1315224
56165 1315224 1300344 1284887 1268815 1253305 1238735 1223997 1208554 1193222 1178093 1161930 1144762
56154 1144762 1128744 1114993 1101803 1087591 1073394 1060623 1048502 1035798 1023247 1012167 1002373
56143 1002373 993405 985964 980066 973510 964558 954732 946747 940903 935571 929944 924197 918144 911813 906366
56129 906366 902616 899670 896601 894191 893306 892900 891423 889082 887162 886240 886333 887354 888342 888163 888207 892039
56113 892039 900723 910921 919475 927322 936573 946406 954790 962189 970538 980176 990412 1001424 1012994
56100 1012994 1023321 1031931 1041917 1056290 1073848 1091658 1109774 1130130 1152379 1174491 1196472 1220045
56088 1220045 1245467 1271828 1299734 1330703 1364543 1400092 1437726 1478484 1521632 1565794 1611391
56077 1611391 1659391 1708966 1759430 1813389 1875001 1945988 2026109 2116310 2218387 2332634 2459101
56066 2459101 2600331 2759917 2939000 3136639 3352009 3582794 3822139 4060175 4287989
56057 4287989 4498099 4683460 4840211 4971096 5083232 5182957 5274497 5360647 5440302 5506340
56047 5506340 5550086 5568059 5562482 5537333 5497198 5447519 5390786 5322466 5233989 5119268 4976190
56036 4976190 4804570 4607474 4393569 4173849 3956259 3746067 3549126 3370411 3210805
56027 3210805 3069318 2946852 2843754 2755931 2678503 2611803 2558833 2518231 2484799 2455554 2429986
56016 2429986 2405916 2380984 2357296 2338687 2323930 2308466 2292306 2280127 2273711 2270340 2268908 2271569
56004 2271569 2278606 2287188 2296138 2306990 2319944 2333744 2349817 2371319 2397683 2424960 2451698 2479517
55992 2479517 2508257 2536174 2564968 2598857 2638198 2679390 2721375 2766741 2816202 2867583 2920601
55981 2920601 2977241 3037195 3098311 3161488 3229525 3301396 3373443 3445924 3522229 3602054 3681794
55970 3681794 3761499 3844937 3933012 4023780 4118458 4220320 4328067 4437708 4550681 4672498
55960 4672498 4803821 4941076 5085559 5243106 5414527 5595385 5785726 5990846 6211572
55951 6211572 6443049 6684251 6939426 7209195 7489943 7783242 8095805 8428336 8774477
55942 8774477 9132692 9509140 9906882 10322663 10756803 11216146 11704868 12222366 12772115
55933 12772115 13362297 13995874 14670375 15388231 16155588 16970093 17822702 18713273 19651908
55924 19651908 20644658 21692540 22805446 24000579 25284731 26654138 28113683 29678564
55916 29678564 31354733 33137209 35031479 37056346 39220818 41518971 43953470 46544302
55908 46544302 49311069 52271010 55460666 58935240 62741434 66917769 71527367 76661744
55900 76661744 82409581 88859712 96144881 104445850 113945918 124827051 137319947 151703716
55892 151703716 168241565 187172528 208764467 233273189 260808278 291300558 324482937
55885 324482937 359422662 393602140 422566289 441173200 445957529 436755310 416339522
55878 416339522 388690591 357448757 325319719 294108420 264880051 238139824 214052076
55871 214052076 192598334 173624552 156879288 142098108 129053389 117530219 107310219
55864 107310219 98207061 90086298 82832839 76328523 70475235 65208510 60469754 56187599
55856 56187599 52298960 48764459 45549656 42612273 39920149 37461701 35225798 33187544
55848 33187544 31322960 29619506 28061319 26620054 25270724 24002719 22806995 21667309
55840 21667309 20573461 19529954 18542686 17608778 16726509 15902272 15139265 14430178 13768114
55831 13768114 13153771 12585190 12051600 11544592 11065223 10613582 10181526 9762448 9358499
55822 9358499 8971700 8597447 8233413 7885866 7560631 7256077 6970635 6708345 6470774
55813 6470774 6251956 6047729 5862157 5698593 5552248 5417763 5296425 5189192 5089372 4988667
55803 4988667 4884161 4773477 4649521 4506722 4347578 4177748 3999851 3816805 3635386
55794 3635386 3460974 3293570 3133430 2985288 2852401 2731838 2620344 2519642 2431374 2352201
55784 2352201 2278793 2212741 2155836 2105313 2058406 2016884 1982536 1952754 1925221 1902674 1888495
55773 1888495 1881517 1878860 1879246 1879448 1872285 1853101 1824715 1792321 1757691 1721972 1689129 1661745 1637309
55760 1637309 1612977 1590064 1569852 1549318 1525597 1500709 1477250 1453191 1425522 1395398 1365049
55749 1365049 1333050 1297535 1261110 1227899 1198299 1170759 1145978 1125272 1107569 1092014 1080850
55738 1080850 1075719 1073779 1071307 1068515 1067174 1066407 1064728 1063387 1063615 1063144 1059437 1053888 1049059 1044339 1038285
55723 1038285 1032630 1029788 1028619 1026749 1025060 1025924 1028908 1031949 1034827 1037648 1037595 1030881 1016622 995953
55709 995953 969380 938070 905497 874411 844182 814074 786529 763796 743948 723978 704368
55698 704368 686741 669605 650832 632163 616609 603026 587830 570831 554924 541002 527473
55687 527473 514194 502873 493965 486633 481187 478201 475860 471519 465299 459185 453415 446885 440213 435057
55673 435057 430975 425975 419668 413163 406638 399798 393782 389751 386410 381600 375399 369070 362273 354307
55659 354307 346704 341309 336802 330429 322290 314671 308037 301186 294668 290511 288714 287267 285499 284415
55645 284415 283882 282512 280304 278669 277859 276870 275661 274831 273387 269498 263442 257400 252468 248165 244586
55630 244586 242562 241774 240958 239844 238884 237475 234676 231336 229327 228974 229360 230786 234829 242145 251972
55615 251972 263251 274502 283482 289047 292710 296519 300298 302768 304085 304963 304629 302153 298600 295186
55601 295186 290510 282608 272805 264401 258162 252210 245827 240213 235674 231128 226491 222820 220028 216942
55587 216942 213616 211185 209581 207688 205453 203540 201356 197869 193971 191485 190339 189268 188587 189281 189865
55572 189865 187452 181971 176290 172021 168183 164103 160631 157992 155253 152418 150535 149393 147661 145634
55558 145634 145142 146248 146646 145049 142830 141720 141914 142855 143781 143283 140551 137310 136263 137453 138350 137576
55542 137576 136097 134780 133525 133126 135111 139050 142581 144891 147758 152477 158097 163374 168135 172067
55528 172067 174440 175851 178024 181162 183639 184973 186941 190907 196209 201922 208266 215578 223850 233802
55514 233802 246491 261485 277584 295587 317792 344155 371589 397993 424537 452975 483187
55503 483187 514497 546898 579348 608747 632065 647904 655051 651632 637242 614331 586218 554932
55491 554932 521729 487928 454152 420323 387287 356893 329691 304312 279932 257555 237988
55480 237988 220471 204313 190013 177664 166012 154314 143531 134608 127116 120539 115172 110789
55468 110789 106271 101718 98995 98706 98336 95056 89110 82948 78273 75274 73610 72598 71169 68797 65923
55453 65923 62837 59159 55015 51522 49383 48156 47458 47581 48368 48895 48964 49448 50544 51238 51199 51543 52923
55436 52923 54524 55738 57120 58814 59932 60586 62594 66738 70914 72483 71134 68223 64761 61406 59030
55421 59030 57819 56770 55159 53260 50808 46550 40604 35612 33943 35029 36925 39021 41502 43558
55407 43558 44242 44338 45457 47649 49334 49281 47588 45202 43332 42672 42346 40481 36633 32754 30946 31241
55391 31241 32319 33148 33020 31340 28691 27009 27501 29245 30757 31886 33216 34825 36735 39365 42372
55376 42372 44106 43397 40874 37687 34343 31773 31803 34938 38972 41369 41860 41346 39809 37172 35030 35261
55360 35261 37540 40024 41971 43997 46303 48319 49833 51076 51964 52426 53105 54737 57243 60231 63644
55345 63644 67153 69980 72235 75201 79113 81953 81864 79593 77024 74538 71524 68371 65970 63969 61426
55330 61426 58644 56614 55179 53386 51178 49276 47994 47575 48770 51332 52917 51558 48541 46690 46335
55315 46335 45365 43021 41061 40820 41334 41147 40188 39105 38167 37556 37588 38032 38142 37806 37777 38399 38945 38623 37632
55296 37632 36928 37375 39095 41171 42072 40857 37901 34290 30942 28482 27096 26089 24467 22482 21476
55281 21476 21619 21299 19765 18725 19721 21377 21272 19465 17996 17659 17661 18075 20125 23796 27199 28754 28473
55264 28473 26875 24377 22096 21616 23195 25237 26048 25317 23775 22262 21297 20776 20193 19809 21093 24870
55248 24870 29486 32152 31998 30604 29690 29508 29383 28616 26894 24847 23998 25155 27251 28855 30195 32259
55232 32259 34586 35808 36061 36834 38318 38855 37432 35081 33310 32528 32412 32527 32158 30751 28810 27423
55216 27423 26896 27029 28415 31742 35701 37523 36217 33688 32030 31171 30043 28654 27834 27780 27836 27318 25944
55199 25944 23853 21520 19370 17559 16522 17183 19672 22343 23414 23191 23248 23766 23469 22101 20875 20117
55183 20117 18605 16006 13995 13843 14559 14726 14723 15656 17239 18295 18631 18927 19119 18273 16032 13296 11360
55166 11360 10909 11793 13433 15480 18060 21081 23496 24050 22883 21607 21538 22644 24447 26953 30130 33241
55150 33241 35420 36457 36586 36004 35049 34460 35014 36990 39960 42771 44040 43387 42063 41612 42064 42374 42340
55133 42340 42695 43295 42775 40591 38044 36510 35836 35393 35659 37493 40393 42497 42145 38923 33685 28297
55117 28297 24913 24518 26036 27408 27576 27141 27131 27571 27442 25922 23352 20734 18430 16001 13422 11606
55101 11606 11171 11497 11844 12657 14625 17063 18544 18823 18740 18499 17614 16554 16747 18563 20651 21766 22010
55084 22010 21863 21342 20712 20816 21934 23267 24192 25109 26482 27947 29023 29856 30639 31072 31001 30952 31501 32694
55066 32694 34388 36438 38292 39245 39447 39828 40698 41284 41023 40487 40709 42367 45713 50284 54556 57129
55050 57129 58528 60600 63838 66794 68579 70317 73162 76361 78373 78786 78061 76424 74077 71553 68923
55035 68923 65585 61709 58773 57766 57986 58654 60264 62926 64774 63985 61593 60260 60703 61175 60288 58540
55019 58540 56899 55533 54291 53140 51740 49755 47991 48177 50972 54837 57427 57713 56407 54683 52922
55004 52922 50709 47914 45461 44662 45875 48320 51204 54216 56770 57851 57199 55793 54553 53466 52587
54989 52587 52762 54217 55422 54763 52751 51218 50904 51229 52046 53870 56382 58259 58895 59125 59975 61714
54973 61714 64275 67419 70224 71579 71551 71195 70726 69283 67158 66694 69540 73997 76792 77144 77407 79499
54957 79499 82335 83596 82834 81570 81034 81238 82133 84175 87159 89614 90204 89084 87246 85359 84181 85165
54941 85165 88972 93705 96381 96545 96963 100218 105912 111772 116179 118636 118982 117553 115544 114118 113444
54926 113444 113338 114152 115999 117690 117790 116617 116020 116992 118353 118052 115174 110565 105996 102943 101803 102020
54910 102020 102867 103914 104773 105009 104602 104082 103820 103634 103353 103172 103070 102598 101852 102023 104243 108380 113529
54893 113529 119037 124228 127863 129069 128578 128015 128222 129174 131177 134794 139601 144272 148259 152419 157635
54878 157635 163658 169794 175999 182751 190344 198786 208002 217712 227382 236734 246135 256180 266982 278040
54864 278040 288532 297418 303304 304660 300624 291681 279382 265306 250447 235618 221848 209814
54852 209814 199098 188697 178280 168415 159719 152526 147261 144081 141904 138925 134643 130561 128337
54839 128337 128092 129056 130866 133354 135981 138597 142119 147339 153633 160078 167384 177273 190036 203986
54825 203986 217505 230381 242813 254251 263897 271570 277283 280323 279417 273871 264344 252574 240446
54812 240446 229122 218721 208613 198077 186994 176279 167403 160993 156031 151079 146159 142507 140411
54799 140411 138627 136448 135101 136010 138648 141379 143785 146740 150387 153453 154801 154650 153995 153534 153386
54784 153386 153284 152850 151879 150243 147311 142023 134248 125673 118569 113802 110722 108568 106977 105219 102088
54769 102088 96988 90641 84477 79704 76842 75578 74988 74271 73369 72690 72487 72785 73518 74247 74075 72460
54753 72460 69893 67366 65527 64813 65826 68767 72821 76796 80125 82671 84116 84464 84776 86401 89522
54738 89522 93099 95999 97604 97811 97361 97803 100151 103873 107943 112344 117484 122793 127369 131742 137432
54723 137432 144815 152879 161199 170590 181502 193240 205271 217975 231562 245476 259533 274440
54711 274440 290336 305739 318897 329429 337750 343517 345675 343879 339186 333370 327871 323173 318849
54698 318849 314288 309542 305305 302233 300668 300829 302661 305529 308746 312400 316866 321437 324331 324354 321835
54683 321835 317624 312061 305457 298964 294135 291699 291024 290697 289694 288405 288604 291995 298676 307222 316012
54668 316012 324004 330529 335231 338148 339022 336545 329218 317153 302209 286183 269676 252949 237020
54655 237020 223312 212555 204215 196704 188395 179174 170898 165445 162422 159676 155863 151290 146364 140841
54641 140841 135113 130722 128754 128710 129649 131232 132905 133319 131772 129373 127656 126768 126182 126375 128282 131429
54625 131429 134116 135651 137184 139872 143163 145536 146569 147576 150130 154226 158202 160640 162075 164453
54611 164453 169008 175114 181070 185323 186950 186000 183940 183036 184486 187404 190025 191568 192472 193303 194225
54596 194225 195569 198259 203139 209789 216392 221403 225569 231578 241153 253113 265149 276844 289619
54583 289619 304138 319502 335166 351892 370087 388624 406067 421795 434988 443791 446725 444248
54571 444248 438022 429346 419054 407912 396036 382824 368621 355587 345504 337421 328965 319528
54559 319528 310571 303061 296331 289649 283352 277802 272453 266743 261114 256321 252077 247024 240106 231723
54545 231723 223427 216358 210114 203569 196732 190953 186941 183538 179411 175125 172358 171463 171128 170278 169014
54530 169014 167566 165644 163260 161167 159907 159204 158771 158991 160195 161806 162833 162892 162397 161926 161703 161455
54514 161455 160652 159242 158151 158552 160398 162181 162443 161123 159238 157848 157772 159707 163763 168946 173682
54499 173682 176969 178784 179518 179553 179477 180229 182495 185895 189000 190533 190795 191725 195020 200086 204422 206449
54483 206449 207490 210319 216043 223296 230440 237439 245011 252903 260041 266016 271491 277200 283358 290091
54469 290091 297630 305885 314433 322965 331042 337352 340207 339184 335408 329845 322289 312689 302490 293600
54455 293600 286598 280868 275832 271046 265699 259414 253219 248475 244938 241182 236858 233198 231082 229950
54441 229950 228983 228261 228191 228721 229524 230224 230185 229035 227619 227370 228354 229087 228785 228640 230096 232932 236026 239128
54423 239128 242768 246990 251239 255142 258597 261457 264022 267403 272412 278104 282294 283694 283100 282522 283486
54408 283486 286096 289294 291911 293698 295380 297801 301244 305370 309301 311841 312351 311537 310759 310536 310520 310946
54392 310946 312896 316641 320793 323912 326040 327827 328894 328091 324967 320208 314948 310254 306726 303823
54378 303823 299947 293993 286570 279177 272602 266872 262360 259946 259985 261650 263424 264111 263573 262677 262258 262081
54362 262081 261244 259527 257614 255926 254235 252750 252511 254186 257371 261468 266108 270182 272007 271557 271264
54347 271264 273163 276284 278358 279163 280424 282947 285773 288032 289943 291860 293776 295963 298744 301343
54333 301343 302281 301402 300402 300683 301419 300406 296452 290530 284757 280459 277195 273696 269588 265716 262791
54318 262791 260602 258867 257826 257339 256499 255090 254277 254639 254577 252376 249136 247725 249077 251400 253104 254611
54302 254611 256800 259301 261184 262234 262826 263268 263749 264373 265026 265772 267285 270147 273768 276864 278887 280082
54286 280082 280416 279653 278467 278131 278798 279153 278043 275392 271333 265651 258547 251102 244474 239239 235488
54271 235488 232750 229906 226229 222416 219426 216497 211850 205487 199505 195215 191773 188391 185898 184808
54257 184808 183546 180466 176571 174249 173811 173151 170800 167640 165235 163778 162340 160266 157587 154494 151158
54242 151158 148010 145690 144382 143363 141574 138696 135452 132776 131098 130470 130621 130441 128355 124221 120230
54227 120230 118688 119263 119756 119286 119001 119516 119598 118267 116648 116447 117600 118685 118976 118817 118302 116809 113929
54210 113929 110075 106032 102469 99917 98700 98586 98694 98104 96785 95877 96627 98871 101084 102253 102969 103995
54194 103995 104614 103715 102015 101553 102892 104393 104591 103793 102854 101926 101339 102249 105152 108513 110162 109601 108046
54177 108046 106693 105829 105239 104581 103482 101967 100602 99794 99194 98152 96417 94091 91378 88837 87435
54162 87435 87861 90008 93314 97195 100946 103839 105638 106505 106204 104036 99964 95183 91125 88286 86192
54147 86192 84016 81171 77975 75798 75742 77082 78017 78017 78239 79355 80301 79769 77725 74876 71912 70030 70696
54130 70696 73715 76588 77037 75288 72907 70440 67450 63939 60337 56812 53876 52861 54323 56686 57931
54115 57931 58048 58272 58560 57763 56046 55125 55893 57495 59112 60909 62674 63141 61663 59535 58597 59163 60066
54098 60066 60233 59546 58572 58056 58532 59951 61707 63177 64164 64855 65570 66582 67958 69468 70691 71151 70415
54081 70415 68544 66595 66060 67306 68963 69328 68022 65971 64339 64083 65796 69017 72008 73276 73219 73452
54065 73452 74565 75455 74998 73604 72724 73227 74481 74898 73416 70638 68431 68296 70379 73977 78294 82408
54049 82408 85287 86515 86487 85527 83521 80883 78895 78253 78102 77504 76929 77172 77611 77076 75845 75201 75274 74963
54031 74963 74013 73593 74536 76336 78319 80668 83755 87290 90433 92203 91874 89762 87565 87055 88434 90668
54015 90668 93001 95033 95955 95390 94864 96548 100188 102966 102925 100909 98582 96418 94745 94979 97997 102113
53999 102113 104341 103403 100491 97485 95563 95180 96199 97831 99100 99574 99413 99082 99341 101037 104207 107601
53983 107601 109615 109704 108587 107352 106679 106724 107342 108442 110185 112706 115779 119102 122878 127596 133373 139940
53967 139940 147097 154454 161023 166127 170649 176240 183234 190642 198134 206261 214239 219566 221201 221462
53953 221462 223114 225832 227413 227494 227854 229525 231811 234197 237064 239939 240948 239077 235647 232611 230328
53938 230328 227929 225005 221895 218881 216049 213580 211430 208996 205843 202473 199571 196697 192613 187020
53924 187020 181163 176443 173015 170145 167353 164584 161565 157778 153178 148478 144566 142025 141326 142830
53910 142830 146093 149549 151557 151721 150790 149490 148067 146803 146060 145564 144483 142731 141574 142319 144853
53895 144853 148019 151052 153971 156850 159547 162136 164951 168090 171416 174952 178695 182037 184249 185772
53881 185772 188240 192693 198411 204058 209361 214804 220172 224674 228584 233560 240654 248718 255654 260850
53867 260850 265516 270686 275746 279298 280915 281526 282255 283365 284406 285146 286054 287722 289888 291404 291467 290736
53851 290736 290858 292905 296609 301095 305932 311370 317897 325712 334291 342425 349050 354233 359003 364171
53837 364171 369784 375708 381953 388056 392951 396033 397780 398717 398438 396418 393173 389562 385424 380178 374594
53822 374594 370511 368456 366724 363311 357832 350976 343145 334573 326132 318839 312590 306134 298423 289620
53808 289620 280862 273403 267889 263892 260014 254821 247966 240384 233353 227447 222348 217564 213076 209212
53794 209212 206010 203047 200118 197789 196851 197254 198003 198164 197619 196640 195103 192546 188976 185330 182966 182635
53778 182635 183815 185009 184720 182382 178595 174742 172279 171976 173564 176063 178442 179874 179698 177839 175406
53763 175406 174167 174850 176299 176635 175000 172010 169151 168109 169845 173470 176565 177617 177821 179539 183314
53748 183314 187470 190457 192257 193311 193432 192538 191570 191823 193647 196280 198750 200728 202699 205370 208752
53733 208752 212102 215192 219103 224868 231629 237299 241096 244219 247822 251569 254752 257638 260931 264683
53719 264683 268536 272358 275971 278874 280930 282761 284843 286794 288128 289019 289562 288946 286307 282002 277253
53704 277253 272876 269123 266447 265460 266190 267903 269503 269796 268001 264666 261567 259848 258682 256588 253596
53689 253596 250993 249311 247825 246050 244397 243026 241166 238201 234655 231529 229163 227227 225459 223978
53675 223978 223183 223544 225123 227082 228100 227516 225730 223410 220907 218664 217467 217502 217570 216041 212672 208857
53659 208857 205950 203796 201176 197416 193243 190187 189315 190500 192669 194690 196075 196914 197288 197032 196255
53644 196255 195739 196375 198154 200099 201353 201885 201951 201464 200613 200697 203437 209115 215950 221602 224992 226608
53628 226608 227557 228723 230526 233009 236062 239554 243205 246437 248722 250169 251546 253637 256731 260623
53614 260623 264692 267992 269770 270040 269423 268497 267727 267998 270407 275168 281114 286590 290621 293155 294722
53599 294722 296043 297487 298639 298785 297984 297135 296759 296343 295315 294106 293777 294950 297470 300704 303740 305616
53583 305616 305889 304824 302886 300353 297623 295388 294130 293757 293858 293955 293477 292183 290779 290318 290752 290974
53567 290974 290531 290134 290012 289184 287456 286740 288801 292551 295380 296678 298204 301136 304648 307712 310486
53552 310486 313310 315848 318240 321890 327989 335898 343895 350970 357075 362191 366197 369532 373014 376721
53538 376721 379679 380982 381095 381822 384931 390752 398044 405152 411185 416162 420479 424646 429181 434145 438806
53523 438806 442304 444724 447024 449814 452671 454791 455847 456063 455876 455733 455859 456029 455894 455686 456157 457517
53507 457517 458776 458628 456835 454554 453350 454044 456321 459074 461103 461707 460940 459590 458938 460058 462839
53492 462839 465719 466869 465858 463946 462786 463176 465056 468004 471355 474325 476658 479053 482413 486644
53478 486644 490740 494226 498040 503560 511012 519345 527576 535708 544117 552713 561314 570610 582077 596718
53464 596718 614157 633016 651933 670306 688451 707157 726917 747637 769266 792441 818022
53453 818022 846101 876017 907299 939972 973973 1008936 1044623 1080874 1117182 1153219 1189930
53442 1189930 1229101 1271407 1316010 1362548 1412228 1465795 1521319 1575413 1626373 1675115 1723337
53431 1723337 1771840 1820534 1869101 1917551 1966767 2018304 2072990 2129902 2187399 2244865 2302716
53420 2302716 2361087 2419500 2477599 2535082 2590906 2643620 2692611 2738196 2780363 2818414 2852128
53409 2852128 2882466 2910827 2938134 2964711 2990335 3014301 3036148 3056431 3076108 3095132 3112362
53398 3112362 3126904 3138565 3146879 3150703 3149206 3142471 3130778 3114106 3092772 3067756 3039860 3009177
53386 3009177 2975737 2939918 2901783 2860859 2817174 2771822 2725764 2678771 2630327 2581018 2532066
53375 2532066 2483933 2436336 2389468 2344121 2300470 2257573 2214443 2171193 2128881 2088701 2051547
53364 2051547 2017998 1988262 1962216 1939784 1921403 1907981 1900244 1898021 1900297 1906224 1916086 1931021
53352 1931021 1951663 1977245 2006238 2037775 2072257 2110589 2153131 2199551 2249645 2303870 2362840
53341 2362840 2426369 2493258 2562048 2631848 2702680 2775399 2851194 2930660 3013352 3098720 3187457
53330 3187457 3281129 3380317 3484012 3591274 3702637 3819091 3940322 4064695 4190453 4316181
53320 4316181 4440726 4563729 4686071 4808983 4932757 5056635 5179265 5298572 5412064
53311 5412064 5518507 5618825 5714169 5803600 5884945 5957523 6022647 6081807 6135982 6186336 6233548
53300 6233548 6276110 6311062 6336881 6354158 6363241 6363192 6353589 6335093 6306929 6265573 6207635 6132888
53288 6132888 6043166 5939724 5823598 5697542 5565430 5429789 5291381 5150916 5009551 4867734
53278 4867734 4725145 4582190 4440365 4300696 4162753 4025672 3889458 3754835 3622340
53269 3622340 3492131 3364420 3239789 3119085 3003089 2892220 2786543 2686107 2591316 2503009
53259 2503009 2422126 2348990 2282672 2221588 2165272 2115206 2072994 2037960 2007741 1981128 1958989
53248 1958989 1942088 1929583 1920401 1914667 1912574 1913062 1915035 1919186 1927147 1939176 1953987 1970597 1989124
53235 1989124 2009811 2032528 2057443 2085286 2116563 2151006 2187946 2226880 2267767 2311133 2357675
53224 2357675 2407349 2459101 2511865 2565477 2620313 2676537 2734062 2792478 2850381 2905706 2957669
53213 2957669 3007706 3057350 3105776 3150699 3191201 3228212 3262429 3293465 3321236 3346617 3370180
53202 3370180 3391505 3410358 3427264 3441972 3452286 3455587 3451251 3440610 3424581 3402123 3371228 3331029
53190 3331029 3282554 3227561 3166959 3100662 3028828 2952610 2873385 2791747 2707838 2622406 2536896
53179 2536896 2452479 2369532 2288081 2208342 2130691 2055417 1982566 1911896 1843051 1775895 1710368
53168 1710368 1645807 1580810 1514205 1445979 1377048 1308532 1241624 1177706 1117980 1063007 1012855
53157 1012855 967307 925742 887492 852663 821818 794312 767993 741552 716317 694377 675607
53146 675607 658073 640941 625253 611706 599364 586952 574061 560535 545988 530678 515834
53135 515834 502375 490090 478642 468486 459999 452458 444793 436808 428900 421006 412704 404106 395786
53122 395786 387769 379338 370099 360794 352700 346285 340784 335187 329425 324241 319962 315967 311612 307017
53108 307017 302436 297416 291530 285603 281218 278881 277475 275638 272941 269618 265999 262549 259812 257853
53094 257853 256129 254174 252123 250417 249322 248757 248239 247205 245810 245151 245939 247151 246910 244676 241619
53079 241619 238775 235897 232441 228623 224972 221675 218846 216733 215147 213446 211585 210498 210857 212080
53065 212080 213046 213232 212645 211395 209981 209311 209673 210225 210319 210858 213455 218396 224221 229172 232339 233559
53049 233559 233050 231439 229635 228288 227360 226237 224249 221255 217791 214457 211166 207411 203316 199946 198264
53034 198264 198150 198590 198434 196870 193835 190247 187286 185172 183177 180981 179179 178014 176625 174421 172394
53019 172394 172020 173263 174671 175191 174903 174247 173607 173661 175042 177313 179092 179674 180031 181771 185476 190334
53003 190334 195123 199176 202558 205651 208825 212449 216871 221997 226941 230590 232674 233815 234310 233553 231111
52988 231111 227894 225538 224897 225537 226302 225843 223078 217965 211737 205765 200398 195420 191106 187812 184840
52973 184840 180999 176399 172491 169869 167123 162637 156766 151364 147564 144841 142163 139325 136898 135236
52959 135236 133802 131582 128140 124112 120495 117661 115428 113861 113283 113394 113110 111625 109035 105649 101467
52944 101467 97040 94090 94089 96286 98099 97734 95729 93801 93028 93592 95553 98909 103063 106929 109730 111342
52928 111342 111846 111133 109069 105830 101989 98433 96021 95004 94702 94115 92927 91701 91108 91365 92410 94036
52912 94036 95709 96872 97745 99212 101419 103097 103040 101753 100781 100659 100550 99750 98426 96735 94514 92435
52896 92435 92348 95424 100453 104774 106677 106301 104650 102578 100552 98645 96681 94859 94063 94960 96945 98682
52880 98682 99673 100545 101718 102662 102901 103081 104363 107098 110633 114166 117178 119095 119322 118020 116476 116165
52864 116165 117441 119441 121268 122893 124784 127003 129024 130344 130949 131250 131878 133414 135884 138484 140293
52849 140293 141473 143323 146798 151316 155457 158508 160812 162714 163880 163882 163017 162106 161671 161559 161382 161031
52833 161031 160697 160442 159917 158543 155936 152148 147604 142925 138728 135384 132813 130501 127737 123935 118974
52818 118974 113448 108393 104459 101338 98260 95041 92340 90857 90563 90764 90671 89952 89110 89309 91323 94417
52802 94417 96632 96434 93834 89881 85737 82527 81336 82527 85262 88309 91133 93703 95570 96045 95340
52787 95340 94765 95408 97080 98788 99835 100190 100230 100540 101750 104156 107402 110642 112956 113681 112749 110917
52771 110917 109405 108934 109156 109234 108846 108324 107934 107411 106382 104895 103346 101982 100685 99099 96863 93797
52755 93797 90153 86734 84556 84206 85482 87645 89954 91967 93548 94807 96129 98075 100903 103992 106103
52740 106103 106689 106859 108345 111239 113478 113215 111149 109692 110263 112479 115718 119934 124680 128830 132042
52725 132042 135255 138801 141256 141440 140602 141010 143020 145267 147330 150139 153479 155073 153160 148642 143766
52710 143766 139630 135937 132408 129347 127066 125455 124007 122092 119547 117092 115526 114439 112549 109577
52696 109577 106784 105197 104275 102989 101257 99576 98091 96995 97094 98837 101234 102623 102263 100525 98192
52681 98192 96332 96016 96923 96847 94075 89901 87291 87180 87698 87204 86315 86256 86721 86585 85730 84941 84535 84315
52663 84315 84608 86142 88680 90698 90942 89750 88339 87178 85761 83924 82616 82917 84773 87248 89755
52648 89755 92330 94791 96459 96930 96435 95084 92437 88362 83843 80336 78574 78382 79214 80351 80966 80670
52632 80670 79887 79309 79127 79148 79263 79379 79228 78763 78407 78462 78526 77988 76820 75549 74924 75877 79032 83543 87167
52613 87167 88318 87548 86295 84992 83525 82636 83257 84835 86011 86818 88567 91462 94079 95592 96772
52598 96772 98085 98412 96810 94333 92886 93025 93972 95132 96551 98272 100194 102331 104512 106206 107380
52583 107380 109133 112624 117507 122135 125255 127007 128366 130164 132556 134998 136721 137566 138173 139021 139526
52568 139526 138602 136045 132945 130675 129774 129777 129875 129655 129361 129499 130193 131053 131630 131755 131330 130023 127353 123002
52550 123002 117142 110587 104488 99575 95850 93276 92332 93118 94210 93611 91081 88519 87603 88085 89022 90610
52534 90610 93543 97201 99819 100496 100014 99535 99249 98540 96858 94232 91399 89638 89944 92062 94560 96036
52518 96036 96076 95072 93532 91894 90669 90335 90919 91860 92404 92243 91764 91553 91640 91358 90085 88081 86400
52501 86400 85942 86575 87281 87225 86652 86614 87749 89611 91433 93222 95631 98741 101489 102492 101234 98448
52485 98448 95641 94175 94378 95353 95942 95872 95645 95430 94779 93580 92546 92258 92188 91285 89408 87755 87915 90581
52467 90581 95019 99597 102955 104767 105313 104656 102876 100896 100086 100719 101719 102417 103589 105936 108403 109237
52451 109237 108376 107535 107913 108969 109742 110365 111562 113311 114727 115171 115016 115275 116630 118799 120833 122096
52435 122096 122812 123472 123838 123008 120535 117091 113769 111040 108722 106827 106017 106977 109472 112277 114166 114822
52419 114822 114661 114007 112831 111246 109698 108422 107142 105711 104661 104646 105450 106014 105477 103938 102342 101927
52403 101927 103560 107016 110806 113113 113111 111293 108679 106155 104494 104237 105108 105903 105542 104178 102966 102823
52387 102823 103720 105171 106999 109354 112092 114405 115230 114094 111638 109303 108387 109270 111444 114092 116520
52372 116520 118191 118733 118136 116834 115367 114049 113052 112605 112872 113722 114876 116089 116946 116830 115660 114479
52356 114479 114509 115615 116529 116732 117069 118039 118616 117776 116358 116140 117413 118680 118602 117154 114921 112441 110469
52339 110469 109838 110663 112415 114884 118197 121693 123865 123924 122702 121566 121124 121311 121955 122793 123538 124251 124955
52322 124955 124854 123093 120639 119988 122168 125284 127084 127776 128927 130646 131678 131784 132084 133017 133700 133668
52306 133668 133752 134596 135528 135703 135435 135547 136023 136187 135937 136009 136986 138549 139855 140482 140827 141528 142615 143559
52288 143559 144221 145265 147235 149570 151039 150931 149469 147389 145697 145414 146778 148817 150441 151703 153096
52273 153096 153896 152533 148908 145225 143880 145347 148593 152534 156262 158673 159248 159049 159836 162008 164162
52258 164162 165020 165103 166018 168392 171130 172858 173608 174652 176706 178928 180119 180516 181545 183831 186290 187618
52242 187618 188006 188783 190859 194278 198965 204898 211366 216944 220752 223337 225871 228836 231931 234921 237923
52227 237923 240892 243422 245239 246520 247622 248874 250733 253558 256891 259464 260478 260680 261633 264097 267599
52212 267599 271364 274979 278146 280566 282347 283996 285665 286748 286549 285100 283218 282002 282283 284044 286228
52197 286228 287642 288266 289247 291330 293916 296015 297603 299509 302353 306107 310391 314749 318910 323164 328127
52182 328127 333728 338804 342252 344240 345766 347354 348895 350447 352385 354780 357310 359876 362737 365969
52168 365969 369300 372529 375695 378726 381402 383763 386140 388627 390902 392729 394447 396786 400263 404702
52154 404702 409362 413691 418019 423221 429657 436841 444290 452002 459668 466204 470858 474318 477888 481909
52140 481909 485836 489447 492858 495590 497035 497939 500111 504067 508158 510810 512680 515583 519978 524606
52126 524606 528348 531313 533977 536212 537731 538959 540811 543529 546264 548039 549053 550620 553597 557160
52112 557160 559563 560089 559769 560058 561180 562196 562447 562362 562672 563290 563459 562843 561882 560848 559212 556622 554064
52095 554064 553107 553848 554510 553491 551102 548713 546733 544287 540757 536904 534221 533405 533640 533399 531895 529517
52079 529517 526752 523298 518993 515067 513101 512711 511656 508689 504967 502030 499835 497714 495836 494308
52065 494308 492080 488479 484981 483598 483953 483776 482105 480228 479412 479327 478969 477717 475223 471569 467785 465014
52049 465014 462921 460130 456395 453058 451085 449877 448374 446248 443766 441624 441086 443038 446635 450096
52035 450096 452963 456230 460194 463834 466567 468808 470359 470307 469329 469883 472789 475659 476466 476904 479981 485551
52019 485551 490654 493678 495977 499476 504578 510463 515824 519264 520488 521202 523575 527645 531511 534066
52005 534066 536108 538492 540776 542371 543856 546106 548879 551270 553266 555937 559994 564647 568278 570153
51991 570153 571201 572903 575603 578258 579752 579864 578908 577245 575521 574640 574830 575248 575195 575209 576189 577800 578589
51974 578589 577635 575372 572790 570383 568022 565515 563062 561093 559509 557394 554042 550158 547212 545455
51960 545455 543544 540368 536132 531249 525569 519635 515345 513813 513401 511442 507536 503652 501282 499969
51946 499969 498655 497061 495323 493302 490714 487456 483625 479641 476128 473216 470271 466844 463338 460055
51932 460055 456245 451108 445095 439045 432602 424892 416423 408752 402351 396319 390164 384305 378607 372098
51918 372098 364654 357498 351324 345309 338751 332445 327315 322537 316181 307291 296594 285524 275177
51905 275177 265971 257817 250685 244971 240845 237314 232767 226674 219969 213651 207853 202520 197896 193903
51891 193903 190007 186307 183735 182485 181237 178936 176534 175819 176985 178500 179155 179177 179305 179596 179442 178324
51875 178324 176475 174930 174670 175370 175352 173173 169045 164402 160531 158028 157036 157238 157787 157945 157744 157603 157571
51858 157571 157572 158120 159964 162826 165150 165366 163155 159454 155646 152889 151811 152431 154351 157000 159665 161583
51842 161583 162417 162584 162707 162711 161922 160269 158854 158816 159916 160892 161200 161658 163018 164585 164999 164022 162667 161576
51824 161576 160212 157912 154854 151560 148230 145215 143364 143052 143404 143463 143657 145070 147511 149473 150047 149841
51808 149841 149887 150491 151323 151778 151155 149378 147679 147595 149128 150755 151432 151482 151322 150655 149495 148708 148677 148469
51790 148469 147303 145943 145532 145884 146098 146276 147340 149517 152137 154616 156556 157217 156278 155121 155985 159502
51774 159502 164123 168242 171763 175102 177760 178956 179148 179958 182568 186678 190962 194167 195937 196946 198313
51759 198313 200658 203793 207399 211763 217439 224365 231708 238703 245211 251322 256844 261694 266536 272414
51745 272414 279583 287112 293731 298693 301796 303192 303422 302928 301157 296951 290468 283817 278701 274203 268409
51730 268409 261734 256698 254218 252117 248146 242817 238185 235170 233529 233339 234825 237193 239164 240426
51716 240426 241311 241369 239723 236924 235032 235362 237052 238236 237962 236691 235599 235670 236872 237999 237771 236150
51700 236150 234073 232022 229668 226979 224748 223612 223233 222874 222248 221501 220916 220954 221919 223049 222542 219297
51684 219297 214511 210878 210145 211820 214207 216098 217215 217456 216469 214254 211814 210602 211107 212338 212878
51669 212878 212212 210827 209442 208540 208349 208751 209288 209616 209822 209962 209674 208786 208051 208539 210354 212558 214285
51652 214285 215237 215193 213965 212000 210204 208795 207038 204404 201298 198296 195418 192751 191040 190893 191763
51637 191763 192431 192185 190949 188602 185014 180716 176835 174282 173338 173897 175486 177128 177889 177794 177773 178496 179678
51620 179678 180823 182199 184557 187959 191340 193443 193944 193518 192915 192387 191972 191844 191999 191999 191572 191227 191517
51603 191517 191744 190413 187343 184484 183868 185347 187105 187974 188355 189052 190167 191185 191398 190204 187778 185547
51587 185547 185189 186845 188998 190387 191194 191959 192248 191323 189635 188596 188955 190199 191613 193205 195319 197864
51571 197864 200318 202316 203968 205592 207152 207929 207021 204413 201418 199737 200084 201879 204100 206050 207428
51556 207428 208123 208089 207236 205491 203225 201448 201118 202245 203967 205424 206160 205883 204608 203152 202713 203485
51540 203485 204244 203771 202267 200912 200394 200403 200368 200115 199880 200090 201064 202616 203929 204170 203271 202014 201361 201722
51522 201722 202697 203421 203317 202547 201499 200023 197731 195028 193008 192020 191148 189622 187941 186820 185820 184156
51506 184156 182368 181865 182957 184582 186054 187793 189962 191626 192100 192331 194026 197729 202381 206573 209762
51491 209762 212432 215434 219093 222710 224983 224988 222744 219113 215508 213400 213298 214157 214443 213950 213912 215340
51475 215340 218064 221675 226316 231863 237129 240842 243102 245111 247660 250527 253245 255787 258379 261056
51461 261056 263525 265276 265863 265289 264073 262919 262345 262528 263185 263647 263423 262715 262075 261709 261701 262666 265251 268894
51443 268894 272047 273971 275301 276454 276591 274963 272311 269858 267624 264893 261896 259828 259259 259444 259227
51428 259227 257921 255440 252244 249118 246497 244208 242301 241547 242392 243817 244158 242771 240199 237098 233953
51413 233953 231380 229487 227161 223239 218359 214426 212186 210569 208612 206685 205390 204468 203456 202391
51399 202391 201196 199287 196541 193811 191689 189494 186355 182715 179854 178266 177371 176649 176333 177005 179001
51384 179001 181998 184795 185780 184253 181176 178175 175961 174255 173041 173151 175233 178506 180934 180845 178436
51369 178436 175596 174092 174005 174121 173594 172667 171826 171102 170461 170132 169998 169394 168201 167655 169053 171853 174091
51352 174091 174953 176069 179606 185417 190769 193019 192215 190774 190698 191584 191597 189956 187793 186614 186736 187567
51336 187567 188672 189894 190908 191552 192391 194121 196260 197300 196586 195478 195988 198500 201402 202945 202924 202355
51320 202355 202080 202191 202564 203171 203708 203540 202542 201634 201802 202702 202800 200988 197498 193175 188489 183711 179520
51303 179520 176709 175316 174443 172994 170349 166530 162179 158455 156459 156313 156847 156517 154758 152328 150351
51288 150351 149310 149111 149683 150833 151582 150555 147584 144378 142869 143183 143830 143597 142431 140694 138689 137087
51272 137087 136739 137517 138126 137680 136793 136488 136774 137132 137757 139122 140581 140726 139399 138246 138673 140008 140377
51255 140377 138913 136418 134165 132834 132606 133522 135325 137311 138773 139608 140259 141066 141785 141807 140884 139550
51239 139550 138727 138750 138941 138420 137279 136471 136376 136091 134699 132834 132160 133273 134857 135087 133341 130480 128215
51222 128215 128311 131429 136149 139821 140996 140474 139585 138485 137031 136268 137430 139793 141110 140349 138841 138475
51206 138475 139756 141772 143071 142410 139744 136766 135577 136585 138669 141294 144928 149002 151304 150579 148433
51191 148433 147308 147473 147376 146259 144804 143466 141671 138983 136137 134516 134942 136997 139337 140937 142207
51176 142207 144321 147225 149206 149041 147611 146597 146458 146791 147772 149825 152408 154598 156496 158653 160471
51161 160471 160766 159682 158395 156983 154426 150919 148269 147453 147517 147577 148112 149296 149812 148755 147370 147387 148749
51144 148749 150530 153011 156901 161176 163784 164470 165063 166710 168446 168935 168146 166658 164602 162216 160463
51129 160463 160107 160646 160964 160648 160059 159440 158648 157549 156136 154320 152065 149734 148032 147552 148420 150151
51113 150151 151844 152936 153892 155661 158126 159701 159005 156455 153481 150606 147435 144370 142927 143726 145181
51098 145181 145236 143906 143054 143815 145277 145975 145742 145465 145567 145536 145010 144672 145738 148703 152817 156774 159759
51081 159759 161822 163408 164762 165870 166735 167459 168114 168737 169410 170074 170342 169893 169080 168712 168953 168859 167451
51064 167451 165089 163409 163917 166871 171216 175187 177193 176867 175488 174857 175509 176330 176084 174860 173676 173191
51048 173191 173307 173694 174112 174359 174533 175296 177259 180077 182768 184974 187125 189139 189756 187820 183631 178457
51032 178457 173311 169028 166872 167705 170541 173068 173916 173458 172218 169823 166199 162651 160680 160477 161545
51017 161545 164059 168280 173070 176489 177909 178311 178403 177783 176330 175140 175339 176804 178761 180889 183153
51002 183153 185182 186633 187702 188634 189174 189154 189088 189356 189191 187492 184481 181661 180100 179569 179468 179762 180601
50985 180601 181664 182383 182578 182630 183199 184785 187226 189537 190665 190544 190098 190057 190261 190397 190925 192673 195641
50968 195641 198805 201270 203226 205541 208604 211840 214369 215962 217308 219329 222132 224574 225079 223312
50954 223312 221025 220828 223806 228607 232965 235748 237230 238061 238800 240233 243060 246984 250758 253469 255172
50939 255172 256057 255761 254169 252331 251763 252804 254206 254522 253721 253262 254454 256657 257469 255308 251611 249653
50923 249653 251041 254249 256846 258107 258827 259658 260746 262353 264593 266765 268043 268711 269865 271981 274703
50908 274703 277927 282104 287243 292448 296728 299849 302398 305555 310632 317989 326328 333773 339730 345091
50894 345091 350772 356998 363972 371974 380447 388121 394746 401780 410601 420812 431219 441894 454146
50881 454146 468614 484331 499914 515057 530585 547366 565365 583696 601452 618386 634679
50870 634679 650273 664878 678529 691531 703669 714028 721869 727169 729954 729776 726406 720627 713592
50857 713592 705570 695883 683929 669755 653779 636725 619909 604953 592710 582604 573311 564034
50845 564034 555094 547362 541346 536877 533599 531445 530422 530186 530261 530710 532018 534132 536197 537637 539169
50830 539169 542132 546945 552607 557614 560981 562562 562934 563072 563590 564084 563556 561747 559822 559425 561082 563669
50814 563669 565400 565249 563544 561422 559798 558801 558020 557099 555874 554049 551222 547614 544557 543653 545238
50799 545238 547973 550197 551378 552048 552770 553766 555358 558103 562340 567980 574744 582145 589353 595893 602656
50784 602656 611383 622690 635295 647733 660144 673686 688810 705054 722106 740094 758989 778691
50772 778691 799731 822959 848351 874809 901511 929072 959255 993673 1032445 1073724 1115002
50761 1115002 1155681 1198072 1245006 1296649 1350594 1404752 1458840 1513019 1566529 1618206 1667108
50750 1667108 1711934 1750786 1782333 1806622 1824238 1835421 1840510 1840519 1836548 1829297 1819729 1809474 1799720
50737 1799720 1790237 1780336 1770534 1762663 1758751 1760320 1768303 1782864 1803433 1829396 1860562 1896721 1937381
50724 1937381 1982431 2032560 2088467 2150108 2217129 2289263 2365505 2443394 2519832 2592264 2658646
50713 2658646 2717137 2766760 2807749 2840336 2863781 2877585 2883056 2882325 2876059 2863224 2842820 2814576
50701 2814576 2778062 2732493 2677774 2614848 2544930 2469268 2389658 2308253 2226745 2146565 2069623
50690 2069623 1997679 1930910 1868325 1809770 1756321 1708464 1665183 1625387 1589167 1557099 1529349
50679 1529349 1506040 1487432 1473098 1461965 1453936 1450451 1452523 1459084 1468261 1479460 1493221 1509848
50667 1509848 1529435 1552474 1578958 1607189 1634927 1661609 1688010 1713760 1736760 1755573 1770987
50656 1770987 1784539 1796711 1807567 1818189 1830024 1843054 1855795 1867160 1877453 1887387 1897083 1906522
50644 1906522 1916389 1927729 1941003 1956052 1972847 1991588 2011908 2032626 2052801 2072746 2093523
50633 2093523 2115565 2138269 2160883 2183200 2205167 2226321 2246090 2264635 2283134 2303263 2326413
50622 2326413 2353261 2383913 2418431 2457156 2500367 2547739 2598546 2652537 2710252 2772359 2839150
50611 2839150 2911131 2989799 3077139 3174386 3281804 3399815 3529707 3672670 3828199 3993772
50601 3993772 4166005 4341679 4517530 4689509 4852892 5003444 5138629 5257958 5362490
50592 5362490 5453897 5533500 5601813 5658914 5704981 5739930 5762458 5770226 5761808 5738355 5702810 5657678
50580 5657678 5604319 5544412 5481128 5418218 5358253 5302251 5250645 5204121 5163591 5129831 5103163
50569 5103163 5083120 5068209 5056095 5044132 5029963 5012034 4989868 4963765 4934065 4900595 4862784
50558 4862784 4820129 4772634 4721213 4667929 4615529 4566463 4522460 4485002 4455562 4434792 4421866
50547 4421866 4415304 4414266 4418390 4426493 4436250 4445246 4451467 4452429 4444790 4425692 4394092 4350015 4292946
50534 4292946 4221890 4137009 4040290 3934471 3822083 3705810 3588758 3473406 3360546 3249877
50524 3249877 3141660 3037303 2938479 2846136 2760346 2680616 2606276 2537050 2473571 2417175 2368943
50513 2368943 2328915 2296186 2269633 2248586 2232947 2222764 2217787 2217637 2222415 2232713 2248732 2269670
50501 2269670 2294320 2321920 2351964 2383703 2416652 2451545 2489973 2533024 2581030 2634640 2695157
50490 2695157 2763554 2840102 2925510 3021510 3129418 3248633 3377210 3513331 3655428 3801404
50480 3801404 3948833 4095851 4241045 4382558 4518117 4646176 4766676 4881005 4991829
50471 4991829 5102529 5215504 5330542 5445470 5558559 5669740 5779509 5887775 5994484
50462 5994484 6100736 6208490 6319372 6434267 6553721 6677883 6805806 6935275 7063791
50453 7063791 7189620 7311515 7427189 7532328 7621488 7689947 7734462 7752580 7742328 7703198
50443 7703198 7636781 7545681 7432178 7298689 7149105 6988575 6822035 6653846 6488869 6332703
50433 6332703 6190261 6064716 5958062 5871837 5806547 5760849 5731858 5716050 5709536 5707892 5706235
50422 5706235 5699322 5681363 5646341 5589469 5508787 5405388 5282103 5141918 4987394 4821305
50412 4821305 4647458 4470283 4293173 4117533 3944013 3774335 3611034 3455528 3307435
50403 3307435 3166024 3031518 2904724 2786291 2676705 2576126 2483795 2398522 2320333 2250548
50393 2250548 2189327 2134195 2082356 2033813 1990694 1953785 1921384 1891815 1865535 1844020 1827619
50382 1827619 1815356 1806115 1799129 1793720 1789490 1786814 1786601 1789512 1795718 1805407 1819025 1836902 1858882
50369 1858882 1884582 1913919 1947234 1984982 2027457 2074758 2126756 2182964 2242700 2305737 2372736
50358 2372736 2444698 2521842 2603193 2687274 2773021 2860097 2948741 3039428 3132475 3227895 3325806
50347 3325806 3426703 3530737 3636749 3742791 3847895 3952548 4056881 4159105 4256529 4347739
50337 4347739 4432895 4512017 4583739 4645749 4695765 4732017 4753455 4759745 4750640 4725196 4682057 4620759
50325 4620759 4542589 4450134 4346301 4233870 4115607 3994478 3873778 3757013 3647452 3547594
50315 3547594 3458971 3382221 3317201 3263280 3219835 3186269 3161329 3142762 3128073 3115282 3102307
50304 3102307 3085983 3062760 3030659 2989806 2940786 2883315 2817175 2743884 2666587 2588331 2510803
50293 2510803 2434492 2359371 2285361 2212673 2142006 2074278 2009970 1948904 1890737 1835640 1784353
50282 1784353 1737462 1694607 1654516 1616035 1579103 1544500 1512646 1483050 1455218 1429639 1407289
50271 1407289 1388198 1371167 1355101 1340052 1326640 1314942 1304568 1295462 1287687 1280430 1272221 1262676
50259 1262676 1253348 1246132 1241325 1237981 1235744 1235239 1236745 1239620 1243363 1248384 1255285 1264202 1275314 1289211
50245 1289211 1305991 1324614 1343961 1364161 1386106 1410024 1435373 1461817 1489256 1516852 1542972
50234 1542972 1566275 1586213 1602333 1613875 1620422 1622378 1620613 1616050 1609572 1601536 1591123 1576880
50222 1576880 1558339 1536482 1512311 1485869 1457266 1427888 1399526 1372673 1346669 1321335 1297428
50211 1297428 1275389 1254726 1235062 1217044 1201535 1188322 1176337 1165042 1155002 1146871 1140152 1133402
50199 1133402 1125691 1117689 1110983 1106327 1102803 1098908 1094057 1088618 1082707 1075817 1067936 1060333 1054622 1051217
50185 1051217 1049222 1047557 1045542 1042584 1038284 1033314 1029463 1028142 1029074 1030907 1032795 1034747 1036810 1038855
50171 1038855 1041271 1044794 1049039 1052003 1051995 1049800 1047901 1047478 1047145 1045215 1042369 1040988 1041998 1043486 1042995
50156 1042995 1040397 1037666 1036301 1036023 1036023 1036179 1036411 1035807 1033538 1030333 1027993 1027490 1028340 1029854 1031993 1034837
50140 1034837 1038110 1041721 1046041 1051117 1056278 1061081 1066186 1072724 1081218 1091531 1103367 1116032 1128050
50127 1128050 1137892 1145316 1151709 1159145 1169107 1181651 1195475 1209244 1223142 1238538 1255704 1272816
50115 1272816 1288104 1302258 1317485 1334646 1352683 1370636 1388695 1407085 1425362 1443412 1462091
50104 1462091 1482317 1504437 1528843 1556072 1585691 1616243 1647253 1680309 1717084 1757173 1799234
50093 1799234 1843724 1892893 1948090 2008412 2072401 2140013 2212521 2291471 2378363 2474581 2580683
50082 2580683 2695968 2819415 2951102 3092283 3243937 3405379 3574118 3746672 3919275
50073 3919275 4087983 4248546 4396717 4529148 4644423 4743529 4829333 4905121 4972854 5032291
50063 5032291 5081618 5118776 5141893 5148506 5134998 5097459 5033257 4941795 4824237 4683100 4522239
50052 4522239 4346919 4163460 3978372 3797062 3622838 3457151 3300906 3155320 3021229
50043 3021229 2898132 2784746 2680654 2586686 2503364 2429446 2362600 2301245 2245263 2194944 2149871
50032 2149871 2109168 2072388 2039517 2010074 1982847 1956962 1932884 1911751 1893814 1878194 1864234
50021 1864234 1852257 1842513 1834159 1826166 1818849 1813487 1810597 1809688 1810780 1814780 1821672 1829489 1836341 1842912
50007 1842912 1851607 1863392 1876789 1890218 1904120 1920116 1938962 1960199 1983250 2007915 2033999
49996 2033999 2061292 2089947 2120347 2152549 2186300 2221579 2258590 2297200 2336880 2377350 2418957
49985 2418957 2462446 2508752 2558911 2613463 2671789 2732710 2796107 2863444 2936297 3014878 3098456
49974 3098456 3186880 3281146 3382797 3493323 3614053 3746133 3890486 4047961 4219377 4405417
49964 4405417 4606906 4825385 5062651 5319004 5592191 5878322 6172933 6470284 6762623
49955 6762623 7042225 7304780 7549897 7778273 7989733 8184406 8364011 8530257 8682264
49946 8682264 8816473 8928431 9013481 9066006 9079657 9049182 8971886 8847639 8678580 8469319
49936 8469319 8226653 7958147 7670641 7369830 7060526 6746866 6432676 6122122 5819751
49927 5819751 5529284 5252401 4989199 4739931 4505914 4288632 4088283 3903515 3732441
49918 3732441 3573737 3426830 3291276 3166130 3050148 2942727 2844325 2755333 2674584 2599684
49908 2599684 2529126 2463347 2403096 2347523 2294840 2244372 2196547 2150926 2105750 2060062 2015142
49897 2015142 1973074 1934743 1899978 1868595 1840192 1813626 1787963 1763596 1741285 1720536 1700252
49886 1700252 1680812 1664030 1650964 1641052 1633691 1629111 1627081 1626057 1624666 1623209 1622834 1623982 1626536
49873 1626536 1630800 1637233 1645583 1655302 1666593 1680041 1695270 1710981 1726530 1742659 1760331 1779574
49861 1779574 1800059 1822360 1847929 1877784 1911833 1949820 1992515 2041187 2095800 2154454 2215391
49850 2215391 2279367 2349474 2428739 2518412 2618394 2728360 2848237 2978465 3120267 3274988
49840 3274988 3442525 3620729 3806523 3996899 4188271 4375715 4553827 4718283 4866190
49831 4866190 4995729 5106683 5201275 5283357 5356108 5420550 5475901 5520383 5551268 5564633 5555595
49820 5555595 5518993 5450279 5346674 5208374 5039097 4845567 4636019 4418365 4198898 3982287
49810 3982287 3772375 3572475 3384878 3210668 3050355 2904225 2771711 2651010 2540065
49801 2540065 2437779 2343898 2258158 2180150 2109710 2046725 1990582 1940380 1895516 1855469 1819165
49790 1819165 1785330 1753551 1724309 1697685 1672596 1647682 1622759 1599115 1578384 1561036 1545882
49779 1545882 1531115 1515945 1500932 1486754 1473295 1460282 1448044 1436837 1425935 1414380 1402422
49768 1402422 1391262 1381459 1372549 1364249 1356970 1350824 1345089 1339156 1333290 1327962 1323041 1318245 1313936 1310869
49754 1310869 1309195 1308071 1306221 1302938 1298788 1295266 1293355 1292471 1291302 1289584 1288331 1288306 1289119 1290078 1291061
49739 1291061 1292096 1292850 1293211 1293766 1295051 1296745 1298228 1299476 1300718 1301570 1301325 1299985 1298259 1296557 1294640
49724 1294640 1292283 1289666 1286928 1283808 1280013 1275658 1271135 1266745 1262633 1258962 1255918 1253515 1251446 1249223
49710 1249223 1246538 1243348 1239499 1234514 1228256 1221792 1216923 1214435 1213123 1210944 1206969 1201972 1197433 1194316
49696 1194316 1192570 1191271 1189269 1186162 1182686 1179834 1177622 1175076 1171576 1167871 1165488 1165245 1166504 1167919
49682 1167919 1168759 1169281 1169842 1170089 1169443 1168190 1167421 1167744 1168651 1169482 1170461 1172265 1174935 1177876 1180755 1183755
49666 1183755 1187080 1190797 1195164 1200392 1205914 1210568 1213972 1217223 1221643 1227075 1231980 1235233 1237253 1239248
49652 1239248 1241860 1244978 1248581 1253074 1258570 1264269 1269078 1272837 1276640 1281815 1288707 1296434 1303671 1309677
49638 1309677 1314727 1319582 1324514 1329033 1332866 1336963 1342891 1351075 1360200 1368803 1376950 1385730 1395277 1404093
49624 1404093 1410590 1414898 1418879 1424543 1432618 1442433 1452711 1462322 1470541 1477137 1482661 1488494 1496017 1505354
49610 1505354 1515146 1523956 1531745 1539695 1548791 1559086 1570273 1582297 1594985 1607526 1618949 1629102
49598 1629102 1638699 1648255 1657372 1665367 1672360 1679375 1687319 1696225 1705543 1714846 1724010 1733038 1742152 1751956
49584 1751956 1763019 1775185 1787685 1800130 1812986 1826699 1840620 1853345 1864119 1873515 1882692 1892414
49572 1892414 1902964 1914495 1926951 1939753 1952124 1963840 1975395 1987375 2000063 2013704 2028558
49561 2028558 2044284 2059767 2074141 2087715 2101322 2115103 2128786 2142909 2158540 2175597 2192673
49550 2192673 2209127 2226167 2245064 2265366 2286043 2307322 2329829 2352578 2373788 2393589 2413909
49539 2413909 2435342 2456040 2474537 2491984 2510404 2530223 2551010 2573490 2598820 2626273 2653443
49528 2653443 2679018 2704086 2730407 2758408 2787221 2815884 2844101 2872358 2901493 2931691 2961898
49517 2961898 2990839 3018627 3046751 3076354 3107135 3138138 3168826 3199036 3228442 3256701 3283986
49506 3283986 3311020 3338531 3366766 3395411 3424080 3452951 3482667 3513319 3543837 3572927 3600313
49495 3600313 3626497 3651593 3675340 3698127 3720826 3743267 3763934 3781807 3797673 3812988 3828243
49484 3828243 3843251 3858237 3873393 3887699 3899450 3908173 3915053 3921308 3926975 3931693 3935844 3940343 3945719
49471 3945719 3951877 3958406 3964735 3970394 3975723 3982050 3990466 4000412 4010076 4018321 4025765 4033746 4042752 4052207
49457 4052207 4061383 4069951 4077759 4084624 4090516 4095648 4100279 4104708 4109389 4114597 4119849 4124064 4126557 4127469
49443 4127469 4126945 4124394 4119207 4111877 4103594 4094645 4083934 4070427 4054518 4037489 4020009 4001859 3983081
49430 3983081 3964695 3947758 3931950 3915597 3897360 3877536 3857351 3837179 3816051 3793044 3768524
49419 3768524 3743518 3718329 3692438 3665619 3638407 3611421 3584789 3558401 3532172 3505949 3479653
49408 3479653 3453648 3428408 3403718 3378920 3354247 3331003 3309783 3289286 3267844 3245607 3224096
49397 3224096 3203945 3184409 3165176 3147292 3131675 3117732 3104242 3090855 3077875 3065134 3052103
49386 3052103 3038878 3026134 3014189 3002971 2992873 2984632 2978001 2971347 2963165 2953570 2943927 2935577 2929326
49373 2929326 2925513 2923530 2921503 2917500 2911484 2905563 2902005 2901275 2902242 2903860 2906195 2909877 2914896 2920220
49359 2920220 2924810 2929124 2935239 2944931 2957687 2971355 2984927 2999848 3017822 3037826 3056272 3070137
49347 3070137 3079283 3085698 3091403 3097571 3104957 3114206 3125636 3139134 3154394 3171037 3188532 3206296
49335 3206296 3224062 3242084 3260927 3281080 3302633 3325109 3347564 3369057 3389236 3408468 3427353
49324 3427353 3446175 3464852 3483284 3501520 3519658 3537841 3556419 3575907 3596549 3618001 3639567
49313 3639567 3660676 3681038 3700552 3719403 3738256 3758034 3779322 3802015 3825508 3849153 3872749
49302 3872749 3896800 3922006 3948192 3974101 3999007 4024316 4052480 4084058 4116933 4149022 4180746
49291 4180746 4213810 4248558 4284072 4320417 4358923 4399911 4441770 4483075 4524401 4566982 4610551
49280 4610551 4653762 4696210 4738729 4781842 4825117 4868249 4911755 4956113 5000833 5044822 5087348
49269 5087348 5128406 5168565 5208761 5249882 5292151 5335051 5377912 5420335 5461938 5502214 5541069
49258 5541069 5579182 5617303 5655264 5692087 5727053 5760176 5791592 5821007 5848093 5873078 5896539
49247 5896539 5918757 5939656 5959243 5977608 5994432 6009051 6021369 6032307 6042850 6052877 6061488
49236 6061488 6068420 6074488 6080417 6085828 6089809 6092006 6092638 6091774 6089311 6085615 6081500 6077382 6072971 6067981
49222 6067981 6062662 6057210 6051088 6043507 6034590 6025591 6017844 6011617 6006011 5999758 5992085 5982960 5972644 5961057
49208 5961057 5947608 5931640 5912911 5891585 5867880 5841903 5813745 5783576 5751626 5718061 5682763
49197 5682763 5645326 5605503 5563745 5520916 5477260 5432090 5384929 5336581 5288470 5241043 5193528
49186 5193528 5145263 5096462 5047421 4997640 4946416 4894052 4841959 4791430 4742372 4693264 4642661
49175 4642661 4591042 4540847 4493974 4449365 4404084 4356802 4308985 4262209 4215834 4168378 4119988
49164 4119988 4071899 4024239 3976250 3928523 3883171 3841405 3802325 3764447 3727144 3690237 3653628
49153 3653628 3617915 3584018 3551450 3518286 3483746 3449547 3417551 3387305 3357337 3327851 3300404
49142 3300404 3275408 3251650 3228042 3204302 3179991 3154520 3128430 3103396 3080517 3059503 3039622
49131 3039622 3020312 3000715 2979906 2958106 2936743 2916910 2898629 2881828 2866917 2853913 2842036
49120 2842036 2830708 2819984 2809657 2799053 2788312 2778511 2769699 2760290 2749595 2739675 2733047 2729504
49108 2729504 2727010 2724998 2724664 2726168 2727801 2728409 2728850 2730371 2733119 2737058 2742794 2750225 2757445 2762429 2765254
49093 2765254 2767550 2770249 2773122 2776254 2780567 2786630 2793926 2801693 2809818 2818522 2827679 2836970 2846467 2856753
49079 2856753 2868438 2881558 2895280 2908165 2919007 2927645 2934907 2941831 2949006 2956492 2964075 2971508 2978739
49066 2978739 2985985 2993536 3001514 3009951 3018955 3028536 3038296 3047594 3056086 3063894 3071312 3078614 3086127 3094084
49052 3094084 3102253 3110045 3117208 3124125 3131217 3138361 3145219 3151945 3159217 3167542 3176731 3186056 3194830 3202987
49038 3202987 3211150 3219925 3228989 3237249 3244227 3250858 3258358 3266521 3273823 3279159 3282674 3284784 3285275 3283973
49024 3283973 3281702 3279768 3278672 3277901 3276872 3275462 3273570 3270734 3266500 3260949 3254692 3248426 3242527 3236946
49010 3236946 3231409 3225787 3220289 3215272 3210918 3207002 3202831 3197523 3190822 3183825 3178332 3175013 3172544 3169077
48996 3169077 3164348 3159873 3157303 3157236 3159415 3163255 3168081 3173520 3179811 3187097 3194448 3200536 3205561 3211506
48982 3211506 3219911 3230224 3241132 3252630 3265651 3280249 3295642 3311990 3330740 3352715 3376914
48971 3376914 3401739 3426577 3451628 3477018 3503017 3530578 3560568 3592541 3625087 3657475 3690298
48960 3690298 3724428 3760109 3797353 3836631 3878549 3923122 3969761 4017885 4067256 4117960 4170467
48949 4170467 4225573 4283784 4344581 4406665 4469179 4532595 4598120 4666208 4735765 4804938 4872684
48938 4872684 4939503 5006491 5073800 5140367 5205320 5269315 5334051 5400491 5467854 5534412 5599032
48927 5599032 5661774 5723126 5782840 5839521 5891517 5938292 5980780 6020132 6056269 6088083 6115073
48916 6115073 6138329 6159697 6180270 6199795 6217205 6231436 6241958 6248867 6252493 6252945 6250195 6244494
48904 6244494 6236340 6226056 6213879 6200501 6186835 6172993 6158117 6141718 6124755 6108969 6095614
48893 6095614 6085129 6077333 6071319 6065902 6061123 6058774 6060479 6065670 6072588 6080848 6091533 6104849 6119434
48880 6119434 6134483 6151076 6170597 6193021 6217838 6245638 6277492 6313343 6352196 6393608 6437935
48869 6437935 6485258 6535144 6587508 6642851 6701484 6763214 6827898 6895616 6966090 7038558 7112539
48858 7112539 7188311 7266401 7346935 7429687 7514432 7601020 7689312 7779210 7870611 7963363 8057587
48847 8057587 8154141 8254284 8358474 8465645 8574099 8683246 8794305 8909056 9028013 9149934
48837 9149934 9273166 9397108 9522137 9648392 9775231 9901943 10028369 10154400 10279307
48828 10279307 10402031 10521927 10638725 10751894 10860601 10964244 11062562 11155057 11240766 11318820
48818 11318820 11388982 11451388 11505982 11552355 11589946 11618132 11636215 11643484 11639341 11623396 11595674
48807 11595674 11557012 11509096 11453670 11391430 11321894 11244534 11159841 11069076 10973291 10873014 10768615
48796 10768615 10660202 10547222 10429201 10307369 10184518 10062497 9940675 9817967 9695527
$$ [...]
##END NTUPLES=NMR SPECTRUM
##END=
