
##TITLE=ST0000_MeOD-4_7212735_VkaFngzLdu
##JCAMPDX= 6.0         $$ Bruker NMR JCAMP-DX V2.0
##DATA TYPE= NMR SPECTRUM
##DATA CLASS= NTUPLES
##ORIGIN= BRUKER
##OWNER= Administrator
$$ 1.72 TOPSPIN		Version 2.1
$$ 2013-03-20 04:05:32.037 -0500  Administrator@X
$$ Compression mode = diff/dup
##.OBSERVE FREQUENCY= 400.022470287248
##.OBSERVE NUCLEUS= ^1H
##.ACQUISITION MODE= SIMULTANEOUS (DQD)
##.ACQUISITION SCHEME= undefined
##.AVERAGES= 16
##.DIGITISER RES= 22
##SPECTROMETER/DATA SYSTEM= spect
##.PULSE SEQUENCE= zg30
##.SOLVENT NAME= MeOD
##.SHIFT REFERENCE= INTERNAL, MeOD, 1, 14.05482
##AUDIT TRAIL= $$ (NUMBER, WHEN, WHO, WHERE, PROCESS, VERSION, WHAT)
$$ ##TITLE= Audit trail, TOPSPIN		Version 2.1
$$ ##JCAMPDX= 5.01
$$ ##ORIGIN= Bruker BioSpin GmbH
$$ ##OWNER= Administrator
$$ $$ E:\/data/COFFEE/nmr/ST0000_MeOD-4_7212735_VkaFngzLdu/90/pdata/1/auditp.txt
$$ ##AUDIT TRAIL=  $$ (NUMBER, WHEN, WHO, WHERE, PROCESS, VERSION, WHAT)
(   1,<2013-03-20 04:05:27.959 -0500>,<Administrator>,<X>,<go>,<TOPSPIN 2.1>,
      <created by zg
	started at 2013-03-20 04:03:36.052 -0500,
	POWCHK enabled, PULCHK disabled,
       configuration hash MD5:
       86 BA 57 50 F2 9D 5C 9B 26 00 A9 28 5F 66 2E 89
       data hash MD5: 64K
       C1 0A DB E0 2E 65 33 3B FA EF 16 2A 16 C0 D6 C4>)
(   2,<2013-03-20 04:05:30.881 -0500>,<Administrator>,<X>,<proc1d>,<TOPSPIN 2.1>,
      <Start of raw data processing
       ef LB = 0.3 FT_mod = 6 PKNL = 1 SI = 32K 
       data hash MD5: 32K
       F5 A1 7C 9A 88 44 16 32 D0 E2 69 D4 65 68 32 66>)
(   3,<2013-03-20 04:05:31.240 -0500>,<Administrator>,<X>,<proc1d>,<TOPSPIN 2.1>,
      <apk 
       data hash MD5: 32K
       58 EE C8 DD 59 65 BF A4 7A 63 52 C0 FA A9 68 85>)
(   4,<2013-03-20 04:05:31.396 -0500>,<Administrator>,<X>,<proc1d>,<TOPSPIN 2.1>,
      <abs ABSG = 5 
       data hash MD5: 32K
       A7 14 EC 81 9A 5D 0F 6F CA 62 A2 25 88 21 E5 FA>)
$$ ##END=
$$ 
$$ $$ hash MD5
$$ $$ 2B 78 31 12 DD 24 6C 42 47 34 64 84 58 E9 73 DE
##$RELAX= 
##$RELAX= 
##$RELAX= 
##$RELAX= 
##$RELAX= 
##$RELAX= 
##$RELAX= 
##$RELAX= 
$$ Bruker specific parameters
$$ --------------------------
##$DU= <E:\>
##$EXPNO= 90
##$NAME= <ST0000_MeOD-4_7212735_VkaFngzLdu>
##$PROCNO= 1
##$TYPE= <nmr>
##$USER= <COFFEE>
##$ACQT0= -2.10084033613445
##$AMP= (0..31)
100 100 100 100 100 100 100 100 100 100 100 100 100 100 100 100 100 100
100 100 100 100 100 100 100 100 100 100 100 100 100 100
##$ANAVPT= -1
##$AQSEQ= 0
##$AQ_mod= 3
##$AUNM= <au_zg>
##$AUTOPOS= <16 >
##$BF1= 400.02
##$BF2= 400.02
##$BF3= 400.02
##$BF4= 400.02
##$BF5= 400.02
##$BF6= 400.02
##$BF7= 400.02
##$BF8= 400.02
##$BYTORDA= 0
##$CFDGTYP= 0
##$CFRGTYP= 9
##$CHEMSTR= <none>
##$CNST= (0..63)
1 1 145 1 1 1 1 1 1 1 1 1 1 1 1 1 1 1 1 1 1 1 1 1 1 1 1 1 1 1 1 1 1 1 1
1 1 1 1 1 1 1 1 1 1 1 1 1 1 1 1 1 1 1 1 1 1 1 1 1 1 1 1 1
##$CPDPRG= <>
##$CPDPRG1= <>
##$CPDPRG2= <>
##$CPDPRG3= <>
##$CPDPRG4= <mlev>
##$CPDPRG5= <mlev>
##$CPDPRG6= <mlev>
##$CPDPRG7= <mlev>
##$CPDPRG8= <mlev>
##$CPDPRGB= <>
$$ [...]
150 150 150 150 150 150 150 150
##$TP07= 0
##$TPNAME0= <>
##$TPNAME1= <>
##$TPNAME2= <>
##$TPNAME3= <>
##$TPNAME4= <>
##$TPNAME5= <>
##$TPNAME6= <>
##$TPNAME7= <>
##$TPOAL= (0..7)
0.5 0.5 0.5 0.5 0.5 0.5 0.5 0.5
##$TPOFFS= (0..7)
0 0 0 0 0 0 0 0
##$TUNHIN= 0
##$TUNHOUT= 0
##$TUNXOUT= 0
##$USERA1= <user>
##$USERA2= <user>
##$USERA3= <user>
##$USERA4= <user>
##$USERA5= <user>
##$V9= 5
##$VALIST= <valist>
##$VCLIST= <CCCCCCCCCCCCCCC>
##$VD= 0
##$VDLIST= <DDDDDDDDDDDDDDD>
##$VPLIST= <PPPPPPPPPPPPPPP>
##$VTLIST= <TTTTTTTTTTTTTTT>
##$WBST= 2048
##$WBSW= 25
##$XGAIN= (0..3)
0 0 0 0
##$XL= 0
##$YL= 0
##$YMAX_a= 1750296
##$YMIN_a= -1737941
##$ZGOPTNS= <>
##$ZL1= 120
##$ZL2= 120
##$ZL3= 120
##$ZL4= 120
##$ABSF1= 14.05482
##$ABSF2= -1.929033
##$ABSG= 5
##$ABSL= 3
##$ALPHA= 0
##$AQORDER= 0
##$ASSFAC= 0
##$ASSFACI= 0
##$ASSFACX= 0
##$ASSWID= 0
##$AUNMP= <proc_1d.lims>
##$AXLEFT= 0
##$AXNAME= <>
##$AXNUC= <1H>
##$AXRIGHT= 0
##$AXTYPE= 0
##$AXUNIT= <>
##$AZFE= 0.1
##$AZFW= 0.1
##$BCFW= 0
##$BC_mod= 0
##$BYTORDP= 0
##$COROFFS= 0
##$CY= 15
##$DATMOD= 1
##$DC= 0
##$DFILT= <>
##$DTYPP= 0
##$F1P= 0
##$F2P= 0
##$FCOR= 0.5
##$FTSIZE= 32768
##$FT_mod= 6
##$GAMMA= 0
##$GB= 0
##$INTBC= 1
##$INTSCL= 1
##$ISEN= 128
##$LB= 0.3
##$LEV0= 0
##$LPBIN= 0
##$MAXI= 10000
##$MC2= 0
##$MEAN= 0
##$ME_mod= 0
##$MI= 0
##$NCOEF= 0
##$NC_proc= -5
##$NLEV= 6
##$NOISF1= 0
##$NOISF2= 0
##$NSP= 0
##$NTH_PI= 0
##$NZP= 0
##$OFFSET= 14.05482
##$PC= 1
##$PHC0= -80.52344
##$PHC1= -12.77202
##$PH_mod= 1
##$PKNL= yes
##$PPARMOD= 0
##$PPDIAG= 0
##$PPIPTYP= 0
##$PPMPNUM= 2147483647
##$PPRESOL= 1
##$PSCAL= 4
##$PSIGN= 0
##$PYNMP= <proc.py>
##$REVERSE= no
##$SF= 400.020045010341
##$SI= 32768
##$SIGF1= 0
##$SIGF2= 0
##$SINO= 400
##$SIOLD= 32768
##$SPECTYP= <>
##$SREGLST= <1H.CDCl3>
##$SSB= 0
##$STSI= 32768
##$STSR= 0
##$SW_p= 6393.86189258313
##$SYMM= 0
##$S_DEV= 0
##$TDeff= 65536
##$TDoff= 0
##$TI= <PROTON CDCl3 E:\\ Administrator 10

>
##$TILT= no
##$TM1= 0
##$TM2= 0
##$TOPLEV= 0
##$USERP1= <user>
##$USERP2= <user>
##$USERP3= <user>
##$USERP4= <user>
##$USERP5= <user>
##$WDW= 1
##$XDIM= 32768
##$YMAX_p= 381162318
##$YMIN_p= -317167
##$CURPLOT= <PDFCreator>
##$CURPRIN= <$PDFCreator>
##$DFORMAT= <normdp>
##$LAYOUT= <+/1D_H.xwp>
##$LFORMAT= <normlp>
##$PFORMAT= <normpl>
##$SURQMSG= 1
$$ End of Bruker specific parameters
$$ ---------------------------------
##NTUPLES= NMR SPECTRUM
##VAR_NAME=  FREQUENCY,     SPECTRUM/REAL,   SPECTRUM/IMAG
##SYMBOL=    X,             R,               I
##VAR_TYPE=  INDEPENDENT,   DEPENDENT,       DEPENDENT
##VAR_FORM=  AFFN,          ASDF,            ASDF
##VAR_DIM=   32768,         32768,           32768
##UNITS=     HZ,            ARBITRARY UNITS, ARBITRARY UNITS
##FACTOR=    0.195125179827366, 1,           1
##FIRST=     6393.6667674033, -185005,       -67552
##LAST=      0,             -44560,          -122435
##MIN=       0,             -317167,         0
##MAX=       6393.6667674033, 381162318,     0
$$ Real data points
##PAGE= N=1
##DATA TABLE= (X++(R..R)), XYDATA
$$ [...]
19604c5449N017m1597m7323G6g622B6044l839b0315f503a292o5467p586l9457
$$ -35449 -30432 -72029 -119352 76 -7622 26044 22205 -20315 -6503 -1292 -66759 -74345 -113802
19591a13802d2911H7156a7784j0898h813p7122O500a1065n5053D562f827q413
$$ -113802 -42911 87156 -17784 -28682 -8813 -85935 -79435 -11065 -66118 4562 -6827 -15240
19579a5240A6210d0458m081l382l0183p0438a0642l8688Q885M347J3181B3257
$$ -15240 16210 -40458 -44539 -47921 -78104 -148542 -10642 -49330 -40445 -36098 -22917 23257
19566A9455R300a2344m2665L770j5368R111k487J0987H104J260c4533B1760f2888
$$ 19455 28755 -12344 -55009 -51239 -66607 -57496 -59983 -48996 8104 9364 -34533 21760 -62888
19552a23477j119j9684C4559b3008b756p3108o7261O0910m11L6003C7753i263
$$ -123477 -124596 -144280 34559 -23008 -2756 -75864 -143125 -82215 -82626 -46623 37753 -9263
19539A2544J9710a15535l778M1128L057j5326H28M048N7866k3577O006A8863J7295
$$ 12544 32254 -115535 -119313 -78185 -75128 -90454 828 4876 62742 39165 45171 18863 36158
19526C6158K3787r149c4013m1045O568B8423K8977N7289J3689l5228L6167d173
$$ 36158 59945 50796 -34013 -75058 -68490 28423 57400 114689 128378 93150 129317 -4173
19513b5311m6524B7240m809J6645F311O265L411a6493k8678j7022a51A6030a9462
$$ -25311 -71835 27240 22431 39076 6311 12576 15987 -16493 -45171 -62193 -151 16030 -19462
19499a06001m2238m4579h8340D2535O6921K591B5488c5807P208r16K705o9109
$$ -106001 -148239 -192818 -88340 42535 109456 112047 25488 -35807 -28599 -29515 -26810 -95919
19487i5919K1524c4786A834d0194r8860M8049M268K8623A4122c9407n9405C3505
$$ -95919 -74395 -34786 1834 -40194 -139054 -91005 -86737 -58114 14122 -39407 -98812 33505
19474I6278C2121e0547M184F8766K364p569j9606j3033J230N218A6112L91O9327
$$ 96278 32121 -50547 -46363 68766 71130 63561 43955 30922 32152 37370 16112 16503 85830
19461H5830k1903J13326o522o9319k5767J8570k8282k2764j9424P945N2122C4773
$$ 85830 63927 177253 170731 101412 75645 94215 65933 43169 23745 31690 83812 34773
19448D231b8414J1665k106m4701p0993L0723d3267A7627J03764m0613B8963b3842
$$ 4231 -28414 -16749 -18855 -63556 -134549 -103826 -43267 17627 121391 80778 28963 -23842
19435a99264N877f9784K7787D1215j3257g7876J2523L95R104M581C276f9813k174
$$ -199264 -193387 -69784 -41997 41215 27958 -77876 -65353 -64958 -55854 -51273 3276 -69813 -71987
19422g1987m2254C081O1941O6064K9405J7295D6461I077P1806k9085B2831a0974
$$ -71987 -114241 3081 65022 131086 160491 177786 46461 9077 80883 51798 22831 -10974
19409D6121K2261n874L7299k4617j9512J884B8067P2900m0279A2927e5122C9071
$$ 46121 68382 62508 99807 75190 55678 57562 28067 100967 60688 12927 -55122 39071
19396F1869K2189Q643C1962A4412E776M6111R4615m0535A7500Q079J2599K7000
$$ 61869 84058 92701 31962 14412 5776 51887 146502 105967 17500 25579 38178 65178
19384F5178K0574m48c8492p9380K1807J2872K0391l9153Q890A598N1334h5063
$$ 65178 85752 85304 -38492 -117872 -96065 -83193 -62802 -101955 -93065 1598 52932 -85063
19371i7076M2502I935d2026r134j469o1076J0020a7855A0845a7215A8944c0236
$$ -97076 -54574 9935 -42026 -51160 -52629 -113705 -103685 -17855 10845 -17215 18944 -30236
19358a19804l4391N4306A4747L5442b8581l544C4784q714a9701l2428D4721D872
$$ -119804 -154195 -99889 14747 50189 -28581 -32125 34784 26070 -19701 -52129 44721 4872
19345b3337A4806O4993J1137B1514c1974J1307B4935A2373c1136F4414q700d364
$$ -23337 14806 79799 90936 21514 -31974 -20667 24935 12373 -31136 64414 55714 -4364
19332a30195L6427n680n566k1191p6261K2403h4756b2279O948m1373K7634C7240
$$ -130195 -93768 -99448 -105014 -126205 -202466 -180063 -84756 -22279 -15331 -56704 -29070 37240
19319F3684j0383d127o27a340l2222n1850j9164M1908k8231O916N463n813b9412
$$ 63684 53301 -4127 -4754 -1340 -33562 -85412 -104576 -62668 -90899 -83983 -78520 -84333 -29412
19305A0817b1410j1087j6044p4742M1539J6747a3238A05304k8646h638q9794k7313
$$ 10817 -21410 -32497 -48541 -123283 -81744 -64997 -13238 105304 76658 -8638 -98432 -125745
19293a25745l5479J8744l1089j19368J32895a5771A0154K6820e1459a4351o8803
$$ -125745 -161224 -142480 -173569 -292937 -160042 -15771 10154 36974 -51459 -14351 -83154
19282h3154c6043I514a00060K8905j5996b9204E0166D231d4062k2503b8645J089
$$ -83154 -36043 9514 -100060 -71155 -87151 -29204 50166 4231 -44062 -66565 -28645 -27556
19270b7556n7805A409b9251J0139G5133k0485k4676b936A7869a04198L9200n0900
$$ -27556 -85361 1409 -29251 -19112 75133 54648 29972 -2936 17869 -104198 -64998 -115898
19258a15898k6j69E106e4025m6516d8031J0403q9223j5753O3927L61a1577j22
$$ -115898 -115924 -116093 5106 -54025 -100541 -48031 -37628 -126851 -142604 -78677 -78316 -11577 -11699
19245a1699E647b9696I607L0710k98A6235n965b8725o8452L1588b4798N845F1499
$$ -11699 5647 -29696 9607 40317 40019 16235 10270 -28725 -97177 -65589 -24798 -18953 61499
19231A3006m556b2496j6501j34362K7029O8657j9755K6053b1846C4772R2781j1395
$$ 13006 8450 -22496 -38997 -173359 -146330 -77673 -97428 -71375 -21846 34772 127553 116158
19219A16158h1360K3274j2819K3681B7351J2729J9283A0738c431G9571j5354a3487
$$ 116158 -81360 -58086 -70905 -47224 27351 40080 59363 10738 -3431 79571 64217 -13487
19206g5867l4148P971c0228k3263j21748f0415J1403J1352J218p914l0443a6804
$$ -75867 -110015 -102044 -30228 -53491 -175239 -60415 -49012 -37660 -36442 -44356 -74799 -16804
19193E2050P1068C4556A5c277l4340D4146R6021n9003m8B5460c9969p8485o664
$$ 52050 123118 34556 15 -3277 -37617 44146 140167 81164 81116 25460 -39969 -118454 -125118
19180a25118e5977a9573G4116P336O11f1631l5296L9463J4800k211B666K4533
$$ -125118 -55977 -19573 74116 81452 82063 -61631 -96927 -57464 -42664 -44875 2666 27199
19168B7199f5981o7479n1140J0881M9889L736Q47m0495g2175J4976N188n732n365
$$ 27199 -65981 -133460 -184600 -173719 -123830 -120094 -119247 -159742 -72175 -57199 -52011 -57743 -63108
19155f3108B5086M6587L0174q832b7080o4805b8250E9416n08r789Q0663m0428
$$ -63108 25086 71673 101847 93015 -27080 -91885 -28250 59416 58908 49119 129782 89354
19143H9354k6589j9832J1085P5500o3207A7572N5959q516B9106N4082k6313r539
$$ 89354 62765 42933 54018 129518 66311 17572 73531 65015 29106 83188 56875 47336
19131D7336O1437J6188J494n2407N4011k4175l7442A5638N617G69i2974o260p8876
$$ 47336 108773 124961 126455 74048 128059 103884 66442 15638 21255 769 -92974 -99234 -178110
19118a78110M8647O0995p19K9403m3692m8271m462b287D5319L58J4806J3150J4274
$$ -178110 -129463 -68468 -69187 -39784 -83476 -131747 -136209 -2287 45319 45677 60483 73633 87907
19105H7907L771N1143E7574I323b7543l7551J7606j1799N961b1415K263j7615
$$ 87907 91678 142821 57574 9323 -27543 -65094 -47488 -59287 -53326 -21415 -19152 -36767
19093c6767j5431B0502J0368c5456A3911K9217M5740R074J2381j8761j4320a538
$$ -36767 -52198 20502 30870 -35456 13911 43128 88868 97942 110323 91562 77242 -1538
19080C8509a1679B5363M5748r312m016c8051J7009r368D3180j5084J23712L0803
$$ 38509 -11679 25363 71111 61799 57783 -38051 -21042 -30410 43180 28096 151808 182611
19068A82611o4963H585f372C6337c2180j3629D6442Q5317A7572c9917J0390o0852
$$ 182611 117648 8585 -6372 36337 -32180 -45809 46442 131759 17572 -39917 -29527 -90379
19056i0379m755b3193D1464a5411C7815H85h1173C5516I399a16115o2764c1040
$$ -90379 -95134 -23193 41464 -15411 37815 885 -81173 35516 9399 -116115 -178879 -31040
19043a9618m3271C7919J48764o7458m889C7659j8173J13971K5346B5822g2466
$$ -19618 -62889 37919 186683 119225 114336 37659 19486 133457 158803 25822 -72466
19031c0609C5168f8804o4890j0469J6055o0283M2444e5126c286o83e32n3076o6900
$$ -30609 35168 -68804 -133694 -144163 -128108 -188391 -145947 -55126 -3286 -3969 -532 -53608 -120508
19018a20508K7974q528K4392m141Q250J2309J7592m1497p2024k3476Q1229C8832
$$ -120508 -92534 -101062 -76670 -80811 -72561 -60252 -42660 -84157 -156181 -179657 -98428 38832
19005C0039b8161l5803K9376D9600G973O266K4742K2494L1679j0240k9974f5516
$$ 30039 -28161 -63964 -34588 49600 7973 14239 38981 61475 93154 82914 52940 -65516
18992a25359p9564d7069A4291a1439F9168O1820E0670c36j0599D9056j798B969
$$ -125359 -204923 -47069 14291 -11439 69168 130988 50670 -336 -10935 49056 47258 2969
18979H2516K2498b2481n2768K8825C8171j7736i4635L1975O03o3659J4305L8919
$$ 82516 105014 -22481 -75249 -46424 38171 20435 -94635 -62660 -62057 -125716 -111411 -72492
18967g2492c0422A768d224k9650k7987l7246c9883I2482d6039o3577o80J1482
$$ -72492 -30422 1768 -4224 -33874 -61861 -99107 -39883 92482 -46039 -109616 -110296 -98814
18955i8814a008p6193j07486M9786N6734J4070j6986l8478l922J5014J8459h321
$$ -98814 -1008 -77201 -184687 -134901 -78167 -64097 -81083 -119561 -123483 -108469 -90010 -8321
18942b1623B377a03142K5242J6124K5828G994e2092D6577j2700L7911c9388R473
$$ -21623 2377 -103142 -77900 -61776 -35948 7994 -52092 46577 33877 71788 -39388 -29915
18930b9915D6016a3336p688E7576M586B6924A0937K9061K6704B2602b8979J0861
$$ -29915 46016 -13336 -21024 57576 62162 26924 10937 39998 66702 22602 -28979 -18118
18918a8118k0544h357n9525K4653j6609A5721d0213a9521N268E0750J6395b4912
$$ -18118 -38662 -8357 -67882 -43229 -59838 15721 -40213 -19521 -14253 50750 67145 -24912
18905b1450A9961J0928m78f9017B2934J6986c0025k7263E07O1806A8611h8707
$$ -21450 19961 30889 30411 -69017 22934 39920 -30025 -57288 507 62313 18611 -88707
18892a09693N449l5126j4050P0932J024J306C9954L8999l5015L8836C8824H537
$$ -109693 -104244 -139370 -153420 -82488 -81464 -80158 39954 78953 43938 82774 38824 8537
18879B8269f0257n1504m0831f6068J9845K408D0143f184I929d3982k2117A9405
$$ 28269 -60257 -111761 -152592 -66068 -46223 -43815 40143 -6184 9929 -43982 -66099 19405
18866f93r433m2066b541H286K2653c5317p126C1894K0581A1939g2729L3171k1589
$$ -693 -10126 -52192 -2541 8286 30939 -35317 -42443 31894 52475 11939 -72729 -39558 -61147
18853f1147J9532n6523M7058K1390m5756o0601L5966j0566J2732J8770A415a6125
$$ -61147 -41615 -98138 -51080 -29690 -75446 -136047 -100081 -110647 -97915 -79145 1415 -16125
18840c5933a4644n4733q7875j6247j5078R0625O207q4265N1021o5411M5638m605
$$ -35933 -14644 -69377 -157252 -173499 -188577 -97952 -91745 -176010 -124989 -190400 -144762 -149367
18828a49367l585O4653m9746o0025j8163P6325j9738p3905R8016f6296M455c150
$$ -149367 -152952 -88299 -138045 -198070 -216233 -139908 -159646 -233551 -135535 -66296 -61841 -3150
18815I02f9209o1151o5871J7998Q3504d2733a3285c796l2722F1055b8140J2407
$$ 902 -69209 -130360 -196231 -178233 -94729 -42733 -13285 -3796 -36518 61055 -28140 -15733
18803a5733I0656J7032C2819J9708P5400A0917c8061k5788L623k9076c9299n1362
$$ -15733 90656 107688 32819 52527 127927 10917 -38061 -63849 -60226 -89302 -39299 -90661
18791i0661M4001J6940B6566K904O0689N4448m9589b02B6697L087O8660m2261
$$ -90661 -46660 -29720 26566 29470 90159 144607 95018 -202 26697 29784 98444 56183
18779E6183a5636n5355n8012d1737n7459k8520j8062M2479k1044o7724P5728L3765
$$ 56183 -15636 -70991 -129003 -41737 -99196 -127716 -145778 -103299 -124343 -192067 -116339 -82574
18767h2574c9350J5572p7415l7288k5005p5128h8961G7293C1598K1345A8311E720
$$ -82574 -39350 -23778 -101193 -138481 -163486 -238614 -88961 77293 31598 52943 18311 5720
18754d373J93A19314Q4982m1780o0146D8110b869B5161R7933j3627m2646a7808
$$ -4373 -4180 119314 204296 162516 102370 48110 -2869 25161 123094 109467 66821 -17808
18741c02o780m6781e077A09833N9836C6884K8369m976c0421r1590c7267j8018
$$ -302 -7082 -53863 -5077 109833 169669 36884 65253 60277 -30421 -122011 -37267 -55285
18729e5285j01979O3897A1792a2788n5634m3846L8302j927K877j382l8602J4025
$$ -55285 -157264 -93367 11792 -12788 -68422 -112268 -73966 -75893 -73016 -74398 -113000 -98975
18717i8975K4681L1543J6423j62333K2810n499Q4442N75J9184C2793O566K25690
$$ -98975 -74294 -42751 -26328 -188661 -165851 -171350 -86908 -86333 -67149 32793 39359 265049
18705B65049r0402n6122m877L1902D6131c442E5566a6282A9489h7418K4198k048
$$ 265049 174647 118525 113648 145550 46131 -3442 55566 -16282 19489 -87418 -63220 -65268
18693f5268l1123K1975D434a9104m3313I401P6397l0033p278B660J4884c2071
$$ -65268 -96391 -74416 4434 -19104 -62417 9401 85798 55765 48487 2660 17544 -32071
18680h99l4310a6442H8510J2272j3005M650D6126A3007c8157a5759p6899M3661
$$ -899 -35209 -16442 88510 100782 87777 92427 46126 13007 -38157 -15759 -92658 -48997
18668d8997B1886N556h5085a2683A07417p318i289D0303N4065E783f1948A9836
$$ -48997 21886 27442 -85085 -12683 107417 100099 -9289 40303 94368 5783 -61948 19836
18655C2757j0610J7230R70J3325c5268C1092j4871g5895n0269m3633K9728p2486
$$ 32757 22147 39377 40347 53672 -35268 31092 16221 -75895 -126164 -169797 -140069 -212555
18643b12555O2106m1957k9758L9879m905K5963M4839b6139a567o2281K6995b560
$$ -212555 -150449 -192406 -222164 -182285 -187190 -161227 -116388 -26139 -1567 -63848 -36853 -2560
18630a0948C3411a9997m5247k9341c5436l1703l1771J4925a6628D7169N9649n0906
$$ -10948 33411 -19997 -65244 -94585 -35436 -67139 -98910 -83985 -16628 47169 106818 55912
18618E5912B2593f8945R729b522D347K6155O1094J5987D7416c6464M313i580B7564
$$ 55912 22593 -68945 -59216 -2522 4347 30502 91596 107583 47416 -36464 -32151 -9580 27564
18604D6650a1494p556k6486b0205j1121E6397a9054F9698Q7000o8684n792M3435
$$ 46650 -11494 -19050 -45536 -20205 -31326 56397 -19054 69698 156698 88014 82222 125657
18592A25657l657n0351a3212m4505l3730C2087c2368m5957c8041I4221B909c2009
$$ 125657 122000 71649 -13212 -57717 -91447 32087 -32368 -78325 -38041 94221 2909 -32009
18579i157n7867b2883k0314C864J6437a6516B3392k692N2553A9824a2447C6472
$$ -9157 -67024 -22883 -43197 3864 20301 -16516 23392 20700 73253 19824 -12447 36472
18566D1173J2065B1185b9298C139J0289c6845a7136E9049P1070o3410j904K6421
$$ 41173 53238 21185 -29298 3139 13428 -36845 -17136 59049 130119 66709 64805 91226
18554I1226j6817c0844O851e764E3967J9802j1099L31d7559J460A5612f8668K2120
$$ 91226 74409 -30844 -23993 -5764 53967 73769 62670 63001 -47559 -46099 15612 -68668 -46548
18541d6548C5514j7145K5624N880a9436A0391c5751J6290H6272K0823B9326j3733
$$ -46548 35514 18369 43993 49873 -19436 10391 -35751 -19461 86272 107095 29326 15593
18529A5593N3871k4693L6024k4477k5021a2498C272b6505i142G3548J605J8867
$$ 15593 69464 44771 80795 56318 31297 -12498 3272 -26505 -9142 73548 75153 94020
18517I4020l3223M3993k6408o231r325j5657O4671C9001h363m8768l187n8140
$$ 94020 60797 104790 78382 72151 62826 47169 111840 39001 -8363 -57131 -60318 -118458
18505a18458d3089h920A2385e3724k8174a9372o5765K6931k7296G8096M7062f139
$$ -118458 -43089 -8920 12385 -53724 -81898 -19372 -85137 -58206 -85502 78096 125158 -6139
18492a18842J5186e0579E36a9731L546G4466J0096C8424d7124o1288p2570i558
$$ -118842 -103656 -50579 536 -19731 -16185 74466 84562 38424 -47124 -108412 -180982 -9558
18479E923a02806M3884J0768o2768n4630d1347B9562b4620j42662N5431M2593
$$ 5923 -102806 -58922 -48154 -110922 -165552 -41347 29562 -24620 -167282 -111851 -69258
18468f9258c3320L270k9983K1290G9154P2603l8021B2498i4004L1415D396J239
$$ -69258 -33320 -30050 -60033 -38743 79154 151757 113736 22498 -94004 -62589 4396 5635
18456E635c7567l5287c037l261q307L714r3700p976K9443R476j4516L9689b0485
$$ 5635 -37567 -72854 -3037 -6298 -14605 -10891 -104591 -112567 -83124 -73648 -88164 -48475 -20485
18442D8401j8498h2633K632L013n1300f1293j7738l425M966c4986A9529d253j0440
$$ 48401 29903 -82633 -80001 -76988 -128288 -61293 -79031 -82456 -77490 -34986 19529 -4253 -14693
18429a4693H5838k5269G210p14J12816L7027F1761K720r303J1987M0947j1894
$$ -14693 85838 60569 7210 6496 119312 156339 61761 64481 55178 67165 108112 96218
18417I6218l5338A8083g5592p2952M4947a5575N288o8998m6138O1084K2387J0980
$$ 96218 60880 18083 -75592 -148544 -103597 -15575 -10287 -79285 -125423 -64339 -41952 -30972
18405c0972k7189m111R105r0440L7577c9868n3612j0346K6659o2983i538D3857
$$ -30972 -58161 -62272 -53167 -143607 -106030 -39868 -93480 -103826 -77167 -140150 -9538 43857
18392H8380l7411B0974J9636J0836j9800e2684k6123l0587M1764B7156j1805E771
$$ 88380 50969 20974 40610 51446 31646 -52684 -78807 -109394 -67630 27156 15351 5771
18379D1807J6746a1095G409d2832j8317o528r791m285k1971r3149O3076N383l3252
$$ 41807 58553 -11095 7409 -42832 -61149 -67677 -77468 -81753 -103724 -196873 -133797 -128414 -161666
18366a61666N4447k4151J0000e1329n6787b9190C128h3144J7731j3486a0805B9958
$$ -161666 -107219 -131370 -121370 -51329 -108116 -29190 3128 -83144 -65413 -78899 -10805 29958
18353g1363b8951A3647a4332j440b045I3465O5787p5397l1989k0275b0988o4208
$$ -71363 -28951 13647 -14332 -15772 -2045 93465 159252 83855 51866 31591 -20988 -85196
18341h5196b638l0017j5905j5682a7288j2550D1528L3708K8868m8754A122c1922
$$ -85196 -2638 -32655 -48560 -64242 -17288 -29838 41528 75236 104104 55350 1122 -31922
18328A6809J6241d0665e420E2198A6900b5078a136l9789J210B429d8635J0279
$$ 16809 33050 -40665 -5420 52198 16900 -25078 -1136 -40925 -39715 2429 -48635 -38356
18316c8356E9679m048h5754J3560b9471q337p7730L6026c1491p9301k5960M3047
$$ -38356 59679 55631 -85754 -72194 -29471 -37808 -115538 -79512 -31491 -110792 -136752 -93705
18304i3705M227B7688R5230k0777K6147l4173f019B2528O4017J4762K2854M5248
$$ -93705 -89478 27688 122918 102141 128288 94115 -6019 22528 86545 101307 124161 169409
18292A69409p6166D1736L8026R258C803J7257b4408D7187M7406A691L6449R647
$$ 169409 93243 41736 79762 89020 3803 21060 -24408 47187 94593 1691 38140 47787
18280D7787j5341L008a2827j36782M2512K8631J3432A1240N1922j4447G814J9359
$$ 47787 32446 35454 -12827 -149609 -107097 -78466 -65034 11240 63162 48715 7814 27173
18268B7173b7812O975H520Q1254m1794D072b9467a2680H0394J4866b5564j05421
$$ 27173 -27812 -20837 8520 89774 47980 4072 -29467 -12680 80394 95260 -25564 -130985
18256a30985r8672J10202J7528n7616L8140N4483k1747E3729L8894Q0455j803
$$ -130985 -229657 -119455 -101927 -159543 -121403 -66920 -88667 53729 92623 173078 171275
18245A71275D5464h4879Q401k6485M9984B6030L8686L0419B3406a08752o8951
$$ 171275 45464 -84879 -76478 -102963 -52979 26030 64716 95135 23406 -108752 -177703
18234a77703P2868d0657a4227C7159J03804K3964q1866E794g3250K9166l782n1554
$$ -177703 -104835 -40657 -14227 37159 140963 164927 83061 5794 -73250 -44084 -47866 -99420
18222i9420j2920d2166E343Q7239l5129j1456b9513q2228K9429J2373c3526l2245
$$ -99420 -112340 -42166 5343 92582 57453 45997 -29513 -111741 -82312 -69939 -33526 -65771
18210f5771k595L3428C7814a1008k2925j02703m4701b8685D9230b4905N989j1806
$$ -65771 -68366 -34938 37814 -11008 -33933 -136636 -181337 -28685 49230 -24905 -18916 -30722
18198c0722l6298L1550J6312n8006L0174K2061j8088A7184b3811B905K4382J2413
$$ -30722 -67020 -35470 -19158 -77164 -46990 -24929 -43017 17184 -23811 2905 27287 39700
18186C9700J7773K4706J23129o3123n1079O3140o1427j2921l2446a9887n9180
$$ 39700 57473 82179 205308 142185 91106 154246 92819 79898 47452 -19887 -79067
18175g9067Q21i228p5262n9062J4346L8912K2524E916d9920K4535j3231M514G5481
$$ -79067 -78246 -9228 -84490 -143552 -129206 -90294 -67770 5916 -49920 -25385 -38616 -34102 75481
18161B8066K2555a1062k3325j0210B3444f03k5168J612K71F1292N551c0196J3753
$$ 28066 50621 -11062 -34387 -44597 23444 -603 -25771 -24159 -23888 61292 66843 -30196 -16443
18148a6443I617O691M6568j9689l138b7451D0905Q7005o2818d5709K080c267m764
$$ -16443 9617 16308 62876 43187 40049 -27451 40905 127910 65092 -45709 -43629 -3267 -8031
18135h031o1477J8183a6625C277L5405F641J118M9542A0156O7541M392i8r1358
$$ -8031 -69508 -51325 -16625 3277 38682 6641 7759 57301 10156 77697 82089 -98 -91456
18122i1456F7226l3368c0703C6655H934D83M2626b0128p6155P114b5214I0241
$$ -91456 67226 33858 -30703 36655 8934 483 43109 -20128 -96283 -89169 -25214 90241
18109H3928l4693A1251e6332l2207P816Q389q4946O1183K0603j11356c4141A7657
$$ 83928 49235 11251 -56332 -88539 -80723 -72334 -157280 -96097 -75494 -186850 -34141 17657
18096c7683E868J0078D548O8314J4365J237K8502n8209E237a3231D8451a2802
$$ -37683 5868 15946 4548 72862 87227 88464 116966 58757 5237 -13231 48451 -12802
18083B1328L482b4262D129L0694N9816C988M7650K3543P2980l9712A710c8260
$$ 21328 24810 -24262 4129 34823 94639 3988 51638 75181 148161 108449 1710 -38260
18070f6478p131k7424a462F2439B2710o512L359d0530o6487e2985J788l7574l0151
$$ -66478 -73609 -101033 -1462 62439 22710 16198 19557 -40530 -107017 -52985 -51197 -88771 -118922
18057a18922b4498l8068o2095j0147M8115a7724E4752k6614e2662j19735M8503
$$ -118922 -24498 -62566 -124661 -134808 -86693 -17724 54752 28138 -52662 -172397 -123894
18046a23894a6187b955D150K2281c1155j01991I672J3293b5785A2129R8098J5024
$$ -123894 -16187 -2955 4150 26431 -31155 -133146 9672 22965 -25785 12129 110227 125251
18034A25251C7150d1358a0339A8015f122B4698L4136b1877o8311o8621M8294c1532
$$ 125251 37150 -41358 -10339 18015 -6122 24698 58834 -21877 -90188 -158809 -110515 -31532
18021e8697a4871k0659A7723J8153b7113m2153Q796k798o1050n0260O8167j7616
$$ -58697 -14871 -35530 17723 35876 -27113 -69266 -60470 -63268 -124318 -174578 -106411 -124027
18009a24027M3941J2960n3576n0394Q0229m683G324K2032a1133H3813A2278M2550
$$ -124027 -80086 -67126 -120702 -171096 -90867 -95550 7324 29356 -11133 83813 12278 54828
17997E4828Q3161l5785k7797K5590l8094B9676N1052L0787l6143A6191d0539E014
$$ 54828 137989 102204 74407 99997 61903 29676 80728 111515 75372 16191 -40539 5014
17984H220f1098o2969N16C8470P6157d1814J8306J0006B8640h6806c2733G2033
$$ 8220 -61098 -124067 -123551 38470 114627 -41814 -23508 -13502 28640 -86806 -32733 72033
17971E6740J1912C285c8308a7853G756L9139c9815J1186D5444J19800k8617N909
$$ 56740 68652 3285 -38308 -17853 7756 46895 -39815 -28629 45444 165244 136627 142536
17959A42536n232o4830B6667b1368l8905k2373C1388g6277n588m7899m9466L3901
$$ 142536 137304 72474 26667 -21368 -60273 -82646 31388 -76277 -81865 -129764 -179230 -145329
17947a45329l1400r7867M8504J04560M6925l0353J4583f396m116F1767O4466M9452
$$ -145329 -176729 -274596 -226092 -121532 -74607 -104960 -90377 -6396 -10512 61767 126233 175685
17935A75685p9301e3733J5022j7292l6006b2758A1500b6505j40332J8676N3695
$$ 175685 96384 -53733 -38711 -56003 -92009 -22758 11500 -26505 -166837 -148161 -94466
17924i4466n193H126L9800j8049j108a9482m9528m8464d8319a7653P992l6859
$$ -94466 -99659 8126 47926 29877 28769 -19482 -69010 -117474 -48319 -17653 -9661 -46520
17912d6520j7499r2222m6989i6270a0254n900j01779K7205j7238d3976a2363j4672
$$ -46520 -64019 -156241 -203230 -96270 -10254 -16154 -117933 -90728 -107966 -43976 -12363 -27035
17900b7035o2209d4265N350A1903L3009j7767N76J2124A6108d1680q622B7069
$$ -27035 -89244 -44265 -38915 11903 44912 27145 27721 39845 16108 -41680 -50302 27069
17887A9024d4901B1285f9019o3263K7237K6837a0103D7363r393N299d0513O083
$$ 19024 -44901 21285 -69019 -132282 -105045 -78208 -10103 47363 37970 43269 -40513 -34430
17875c4430A3292R302L4154B6241A1306c7960l8666A6733J21739j6580J2095D2806
$$ -34430 13292 22594 56748 26241 11306 -37960 -76626 16733 138472 121892 133987 42806
17862b3398p216G8635B3816c3819J569C2701e2133C4476j0788A0149M3559K4193
$$ -23398 -30614 78635 23816 -33819 -32250 32701 -52133 34476 23688 10149 53708 77901
17850G7901N7643j1355n4398k4903O8963p720J1995j3897l962b859E6292k4937
$$ 77901 135544 124189 69791 44888 113851 106131 118126 104229 100267 -2859 56292 31355
17838C1355b8775p080B1347J8848R1204N636m7745M9183P6983j0391m9941A5551
$$ 31355 -28775 -35855 21347 40195 131399 137035 89290 138473 215456 205065 155124 15551
17825g6475K4073b4244j13183c5353I7220k6365k3305c0339B383a730A9575M4229
$$ -76475 -52402 -24244 -137427 -35353 97220 70855 47550 -30339 2383 -1730 19575 63804
17813F3804C0482l471J2164J5733c4256a0557E0227Q5340o5292h3419l6849L1625
$$ 63804 30482 27011 39175 54908 -34256 -10557 50227 135567 70275 -83419 -120268 -88643
17801h8643R108a9640k8070o8351e3446F2600k0730h255j5331C0319d298H856
$$ -88643 -79535 -19640 -47710 -116061 -53446 62600 41870 -8255 -23586 30319 -4298 8856
17788I1360k4378B8511M7830O2754m8346m5320J0257M1082B4342C728L560J0518
$$ 91360 66982 28511 76341 139095 90749 45429 55686 96768 24342 3728 7288 17806
17776A7806P4471J289E930f5879k3950p0632k8365M6773K0691m8711n137m0826
$$ 17806 92277 93566 5930 -65879 -89829 -160461 -188826 -142053 -121362 -170073 -175210 -216036
17764b16036N0173J6106L6416j057d982D231K5334p672i731N3D7707D660i2019
$$ -216036 -165863 -149757 -113341 -114398 -4982 4231 29565 21893 -9731 -9678 47707 4660 -92019
17750f5668a6812o2380c4659p750Q168m17J5344C429d5261J5362j5577D2383A6517
$$ -65668 -16812 -79192 -34659 -42409 -34241 -34658 -19314 3429 -45261 -29899 -45476 42383 16517
17736C7116F025g0992q377E9808L1756C2271d7605o7171M3020c5426C9910a08372
$$ 37116 6025 -70992 -79369 59808 91564 32271 -47605 -114776 -71756 -35426 39910 -108372
17723a02690Q702a6182A7365i942B3858Q607L2779j8183j2264p330f0934J2087
$$ -102690 -93988 -16182 17365 -9942 23858 32465 65244 47061 34797 27467 -60934 -48847
17711d8847O968l323A1404N7059O8587F105d0290g475j7165B6801f6586J5254
$$ -48847 -41879 -45202 11404 68463 137050 6105 -40290 -7475 -24640 26801 -66586 -51332
17699e1332P265k6865K0119j147m777J1267e813m1221K605p6292r8622P1419f9858
$$ -51332 -44067 -70932 -50813 -51960 -56737 -45470 -5813 -47034 -44429 -120721 -219343 -147924 -69858
17685e406l6152k8221J2343j3441B3174N7148A8790N7966a5227k8273J5755o9049
$$ -5406 -41558 -69779 -57436 -70877 23174 80322 18790 76756 -15227 -43500 -27745 -96794
17673i6794J5250L1088d66F4257b3137j4669J8309C3576K9619K7189c0634m1889
$$ -96794 -81544 -50456 -466 64257 -23137 -37806 -19497 33576 63195 90384 -30634 -72523
17661g2523l2625N2355k1835K2083b0373Q429C7610K5783K324A6929h4570o786
$$ -72523 -105148 -52793 -74628 -52545 -20373 -11944 37610 63393 65717 16929 -84570 -91356
17649i1356b4280H491O9634k7491c2393i930q748A51065o1951B0036c2991G2882
$$ -91356 -24280 8491 78125 50634 -32393 -9930 -18678 151065 89114 20036 -32991 72882
17636f751j35090N3323d0791j9604B680J3329L6269b3020k5122c289j7435k219
$$ -6751 -141841 -88518 -40791 -60395 2680 16009 52278 -23020 -48142 -3289 -20724 -22943
17624b2943I511M321N7059L1743O494a3259k9227k754j8061M659d460l1876D8452
$$ -22943 9511 13832 70891 102634 109128 -13259 -42486 -45240 -63301 -58642 -4460 -36336 48452
17610G6242l0451m42J6428k2994K8000b444j08428l0891f5332J4744J5665d30
$$ 76242 45791 45349 61777 38783 66783 -2444 -110872 -141763 -65332 -50588 -34923 -430
17597D3293N996J1666o589k2823L8271d0982r0507e9979a6183m7297J7881j3094
$$ 43293 49289 60955 54366 31543 69814 -40982 -131489 -59979 -16183 -63480 -45599 -58693
17585e8693c346j8667m3413C529K0703f3329l7175J9247r875n5398R986f5593
$$ -58693 -3346 -22013 -65426 3529 24232 -63329 -100504 -81257 -91132 -146530 -136544 -65593
17572d8806N224o608b4976D203N2548P5137C8193I475n39a05604d1239H6789j977
$$ -48806 -43582 -50190 -24976 4203 56751 131888 38193 9475 8936 -105604 -41239 86789 84812
17559H4812a1239j3293E1564r871A0538a8482q664o0710c6705a340B5088d3220
$$ 84812 -11239 -24532 51564 41693 10538 -18482 -27146 -87856 -36705 -1340 25088 -43220
17546g1375a1288A32192k6219a0280k5825P239C9091L660I432B81a25595J5004
$$ -71375 -11288 132192 105973 -10280 -36105 -28866 39091 42751 9432 281 -125595 -110591
17534a10591d1715J5525j22639n3979h7921K1195k1912n4915N2405d3048o0879
$$ -110591 -41715 -26190 -148829 -202808 -87921 -66726 -88638 -143553 -91148 -43048 -103927
17523a03927J3112M2430K1988A9482N3487j4268K983N9352n0093k9002R513A9355
$$ -103927 -90815 -48385 -26397 19482 72969 58701 61684 121036 70943 41941 51454 19355
17510A639e0618l1415n7910L2633M5331b1356N318o969j06667m847b4233l0893
$$ 1639 -50618 -82033 -139943 -107310 -61979 -21356 -16038 -23007 -129674 -134521 -24233 -55126
17498e5126K3609m7211J1178p409K2691B3790M2262J1703B5549j2586e8779l0439
$$ -55126 -31517 -78728 -67550 -74959 -52268 23790 66052 77755 25549 12963 -58779 -89218
17486h9218M775L689K720l2233n7863m7810f9476K6561k0421l0949l3104M3237
$$ -89218 -84443 -80754 -78034 -110267 -168130 -215940 -69476 -42915 -63336 -94285 -127389 -84152
17474h4152a477F8826K0596l6208c0117C503L4220c701j0367B2642h1782R8J6750
$$ -84152 -1477 68826 89422 53214 -30117 3503 37723 -3701 -14068 22642 -81782 -81684 -64934
17461f4934k7849c3109D1245A6191J8601A0484a38031f7550b7924F6234O770b3190
$$ -64934 -92783 -33109 41245 16191 34792 10484 -138031 -67550 -27924 66234 73004 -23190
17448c8052n0751n6614L6957J721Q613k1373J3847D5270K2063J0968k7724k2764
$$ -38052 -88803 -145417 -108460 -106739 -98126 -119499 -105652 45270 67333 78301 50577 27813
17436B7813M7356l2556a9660j9279d732p0969A3453O8516l0797K0896A3431A557
$$ 27813 75169 42613 -19660 -38939 -4732 -75701 13453 81969 51172 72068 13431 1557
17423b5354p9849j1560c6255f275q9125M5401f504A2939a17053k2596o0384K3580
$$ -25354 -105203 -116763 -36255 -6275 -95400 -49999 -6504 12939 -117053 -139649 -200033 -176453
17411a76453j8928q123R760O3339O0799l2736N603D7070J64058J6984m0807j9600
$$ -176453 -195381 -203504 -193744 -130405 -69606 -102342 -96739 47070 211128 228112 187305 167705
17399A67705o0542d5045a7261q72j17269N7986R085l9408K7902A8733c313q1335
$$ 167705 107163 -45045 -17261 -18133 -135402 -77416 -68331 -107739 -79837 18733 -3313 -84648
17387h4648L2045a3686k751F15i733B5027P556a5360M186k1447d643B1535K4258
$$ -84648 -52603 -13686 -16437 615 -9733 25027 32583 -15360 -11174 -32621 -4643 21535 45793
17374D5793L0459A9603e6180k8900G345b5269r2283N6434J5741j9216m715j32293
$$ 45793 76252 19603 -56180 -85080 7345 -25269 -117552 -61118 -45377 -64593 -69308 -201601
17362b01601O2j0089i7659a1771e867H926i6023J1381l348L0858j7020a385q2310
$$ -201601 -201539 -211628 -97659 -11771 -5867 8926 -96023 -84642 -87990 -57132 -74152 -1385 -83695
17349h3695m1236h441k0787k5069R801k9147J7194A6244L1533J735k3815f4822
$$ -83695 -124931 -8441 -29228 -54297 -44496 -73643 -56449 16244 47777 49512 25697 -64822
17336e9447K5446l4397c2808G7772b1717k4635L696g119C6745L015Q12g2546K3590
$$ -59447 -34001 -68398 -32808 77772 -21717 -46352 -42656 -7119 36745 39760 40572 -72546 -48956
17323d8956R005j01466o4885N44J083M9755k6708k7552M3086O6584a9699q0891
$$ -48956 -39951 -141417 -206302 -205758 -204675 -154920 -181628 -209180 -166094 -99510 -19699 -100590
17311a00590j0458A4444a0267l4797J4246B0735K8410B0106c8259k4707l3765
$$ -100590 -111048 14444 -10267 -45064 -30818 20735 49145 20106 -38259 -62966 -96731
17300i6731j9205r9958R2268c8414j7370K6656A1992c7061D723M8497B2779m52
$$ -96731 -115936 -215894 -123626 -38414 -55784 -29128 11992 -37061 4723 53220 22779 22327
17288B2327Q17P3195l3365B1517M4324l2586f2128p7498k618M7198K7296E7269
$$ 22327 23144 96339 62974 21517 65841 33255 -62128 -139626 -142244 -95046 -67750 57269
17275A57608G88f4830o7224e0340B0144D386d8417E8069N710d7008q237K4176
$$ 157608 788 -64830 -132054 -50340 20144 4386 -48417 58069 63779 -47008 -55245 -31069
17263c1069F3573j5220c4814A9788M7903K9312B3096K2569M8648k2141J6312B454
$$ -31069 63573 48353 -34814 19788 67691 97003 23096 45665 94313 72172 88484 2454
17250c4169k5560a0462j0333Q065r1692M7696B2980d3755O694G5158J087j41e0314
$$ -34169 -59729 -10462 -20795 -12730 -104422 -56726 22980 -43755 -37061 75158 76245 76104 -50314
17236f6396b7494F955J5022R7202m7946a5332A4080d6549K2108D2186M8378K1145
$$ -66396 -27494 6955 21977 119179 71233 -15332 14080 -46549 -24441 42186 90564 111709
17224A11709a461q2995k5487N3041J5783p2058A494J19224j1904B4645D936N1306
$$ 111709 -1461 -84456 -109943 -56902 -41119 -113177 1494 120718 108814 24645 4936 56242
17212E6242B3766f5275D4514j9218b1959j1992o8831l1691n6523f3285k1084q3178
$$ 56242 23766 -65275 44514 25296 -21959 -33951 -102782 -134473 -190996 -63285 -84369 -167547
17200a67547k4992M5906j0198d4751h509F2572K2298k9530j5434J3545F204b6958
$$ -167547 -192539 -146633 -156831 -44751 -8509 62572 84870 55340 39906 53451 6204 -26958
17187f291A9680a997l1576M661o260o125K0556C6585a3486o8898n03f640B2902
$$ -6291 19680 -1997 -33573 -28912 -35172 -41297 -20741 36585 -13486 -82384 -82887 -6640 22902
17173B5938c8508j8180D5029f3727J3150b4592F1466G696a35l0102o331C9209
$$ 25938 -38508 -56688 45029 -63727 -50577 -24592 61466 7696 -135 -30237 -36568 39209
17160F4698A7802f5780d413G0056A6564a9009o9193r127c3883n4360J1286L2860
$$ 64698 17802 -65780 -4413 70056 16564 -19009 -88202 -97329 -33883 -88243 -76957 -44097
17148d4097n8237J2192c8098p822k9469b2339n0246b0459G670c2291a0021l7830
$$ -44097 -102334 -90142 -38098 -45920 -75389 -22339 -72585 -20459 7670 -32291 -10021 -47851
17136d7851C8738K7535g447B8604h725C4981b6692B7902J6045a6407k8516D9596
$$ -47851 38738 66273 -7447 28604 -8725 34981 -26692 27902 43947 -16407 -44923 49596
17123H3145O4059G2868l5122r413e3699A0512J9152a8224o3690l5268L0977K829
$$ 83145 147204 72868 37746 28333 -53699 10512 29664 -18224 -81914 -117182 -86205 -83376
17111h3376c3687C792a01405p1070h0452l9816K2575L5878b4286n5766l1706M1313
$$ -83376 -33687 3792 -101405 -172475 -80452 -120268 -97693 -61815 -24286 -80052 -111758 -70445
17099g0445N280b6951j3973r4248L232L1996b5917A3640L2489c420j32147l1269
$$ -70445 -65165 -26951 -40924 -135172 -131940 -99944 -25917 13640 46129 -3420 -135567 -166836
17087a66836K4659K6766j1949e3430E0828A3052l574L6851N130K5702H320h4766
$$ -166836 -142177 -115411 -127360 -53430 50828 13052 9478 46329 51459 77161 8320 -84766
17074a30295J9615n3008P8384M0774r7232l3732g7758k1732k2736e008H0271o184
$$ -130295 -110680 -163688 -85304 -44530 -141762 -175494 -77758 -99490 -122226 -5008 80271 74087
17062G4087k7158A760b1447A5576K439c9095K684o5661q3758e2772I7198c3897
$$ 74087 46929 1760 -21447 15576 18015 -39095 -36411 -102072 -185830 -52772 97198 -33897
17049i2735k6483e4440j6992h882d220n8186a9556o480k2592m0152a1870F9136
$$ -92735 -119218 -54440 -71432 -8882 -4220 -62406 -19556 -26036 -48628 -88780 -11870 69136
17036D0820h577j2377j8197q7949i934j2775D4589d2821l5566c1806E0393L7415
$$ 40820 -8577 -20954 -39151 -127100 -9934 -22709 44589 -42821 -78387 -31806 50393 87808
17024H7808C3218h1094K7075B9226L9588d0240A6780K7528R772M1970B8204J107
$$ 87808 33218 -81094 -54019 29226 68814 -40240 16780 44308 54080 96050 28204 29311
17012B9311b6409L013o8477M953A3282M9546J8816A6217d5043n1335J1529k902
$$ 29311 -26409 -23396 -91873 -86920 13282 62828 81644 16217 -45043 -96378 -84849 -87751
17000h7751j5513O047C0240K4823c400o2658C374K1869O407M640Q4799q310b9582
$$ -87751 -103264 -97217 30240 55063 -3400 -66058 3374 25243 31650 36290 121089 112779 -29582
16986b0646a0065p554c366r4288J2853F0297j5545h3082k5742m8962J1905M3926
$$ -20646 -10065 -17619 -3366 -97654 -84801 60297 44752 -83082 -108824 -157786 -145881 -101955
16974a01955B4032R1515E4708k4238f3135j213j06089K147K1275K7762n6186j04630
$$ -101955 24032 115547 54708 30470 -63135 -64348 -170437 -168290 -147015 -119253 -175439 -280069
16962b80069P1028h6144C9907J7222a43334K2052L7287K7980D362K8803K1623
$$ -280069 -209041 -86144 39907 57129 -143334 -121282 -83995 -56015 4362 33165 54788
16951E4788O0869j6750I053e5801B465c8434l0621k551M320L2947j6639C3411
$$ 54788 115657 98907 9053 -55801 2465 -38434 -69055 -71606 -67286 -34339 -50978 33411
16938b077Q00C3459M4570C4967a2163l1226F5263M7215n0388B7222e2586k8753
$$ -2077 -1277 33459 78029 34967 -12163 -43389 65263 112478 62090 27222 -52586 -81339
16926h1339r46L6112A6699N5465m486J2532N8611C3579H460f8908a1868G3819
$$ -81339 -82285 -46173 16699 72164 67678 80210 138821 33579 8460 -68908 -11868 73819
16913b009j5784e63B8933d9972a074A048i7562l2555M6057R197b6677F351P013
$$ -2009 -17793 -563 28933 -49972 -1074 1048 -97562 -130117 -84060 -74863 -26677 6351 13364
16900A3364c3182o6002l2935K6573j5821a6649P260q087j7120l0577E120J76862
$$ 13364 -33182 -99184 -132119 -105546 -121367 -16649 -9389 -17476 -34596 -65173 5120 181982
16888A81982q8843a430j3223k7520q2647p1095O4661d5273F7069a311n5141F3755
$$ 181982 93139 -1430 -14653 -42173 -124820 -195915 -131254 -45273 67069 -1311 -56452 63755
16875B5733b2070A8461O9361M911K611A1169Q031d6406m9489J0580J7989b6567
$$ 25733 -22070 18461 87822 92733 95344 11169 19200 -46406 -95895 -85315 -67326 -26567
16862h6769K5470K2740J2672C2042J1061a0967p340E0147c7623o3458a3898j1414
$$ -86769 -61299 -38559 -25887 32042 43103 -10967 -18307 50147 -37623 -101081 -13898 -25312
16850b5312m4777a756C3814l502M9549J9898H93e8936C8160J52673j3688a7236
$$ -25312 -70089 -1756 33814 30312 79861 99759 893 -58936 38160 190833 177145 -17236
16837e8029l8332J0368j6272c6779H4087O4096L45n8786i0912j15597a01056b4734
$$ -58029 -96361 -85993 -102265 -36779 84087 148183 148528 89742 -90912 -206509 -101056 -24734
16824d2723n0856o1006l6569L1707J4992K0589j9275e1898m0326n6311q730q149
$$ -42723 -93579 -154585 -191154 -159447 -144455 -123866 -143141 -51898 -92224 -148535 -157265 -165414
16812a65414L7394b9959n4316J0692k3005q8338L6645O1957j5998K0278H533a5785
$$ -165414 -128020 -29959 -84275 -73583 -96588 -184926 -148281 -86324 -102322 -82044 8533 -15785
16799b3290k5252B9091K018p100M3262c0148p7377k5773f6407e378B8116P4826
$$ -23290 -48542 29091 31109 24009 67271 -30148 -107525 -133298 -66407 -5378 28116 102942
16787A02942A9967f7383l3803q5971r912O4077N2653o5808o6603j4750J11498
$$ 102942 19967 -67383 -101186 -187157 -197069 -132992 -80339 -146147 -212750 -227500 -116002
16776a16002c4263j7623J0201a3348j9798j09102K1732b0867e182C7233j2006
$$ -116002 -34263 -51886 -41685 -13348 -33146 -142248 -120516 -20867 -5182 37233 25227
16765B5227N8701A0424h7864L6959k4548b7106j1662k6481a7886f693r7705M2760
$$ 25227 83928 10424 -87864 -50905 -75453 -27106 -38768 -65249 -17886 -6693 -104398 -61638
16753f1638l8838L1003i267n520b154l4906n0194L0541B1727a5302l416m7942
$$ -61638 -100476 -69473 -9267 -14787 -2154 -37060 -87254 -56713 21727 -15302 -18718 -66660
16741f6660F341k93K4099d4058q8544J7236o074K1664J856c3258E84c3116o2689
$$ -66660 6341 6048 30147 -44058 -132602 -115366 -121440 -99776 -97920 -33258 584 -33116 -95805
16728i5805l7367J8170A1572g3092k4182I4078D3750f1654R873k2629k0580K1182
$$ -95805 -133172 -115002 11572 -73092 -97274 94078 43750 -61654 -51781 -74410 -94990 -73808
16716g3808C5358M4694K1460D930h9343d2642G4058O1578j1000B8445d9894j6983
$$ -73808 35358 80052 101512 4930 -89343 -42642 74058 135636 124636 28445 -49894 -66877
16704f6877j0601d315C6004q936B561M6219Q9511J0244F4200M522j733b973o4861
$$ -66877 -77478 -4315 36004 27068 2561 48780 138291 148535 64200 68722 66989 -2973 -67834
16691f7834J4923b0597N739l903l6454j6676J0328L0520j0619k7127L3771I0408
$$ -67834 -52911 -20597 -14858 -18761 -55215 -71891 -61563 -31043 -41662 -68789 -35018 90408
16678A2586K8827d248r0660J2977E970d0324n602a2934A8703d8009b0072B8183
$$ 12586 41413 -4248 -94908 -81931 5970 -40324 -45926 -12934 18703 -48009 -20072 28183
16665B5695e981B2100a2857D5017j636d8904N014A3385K6627K7837e044l4918
$$ 25695 -5981 22100 -12857 45017 43381 -48904 -43890 13385 40012 67849 -5044 -39962
16653c9962e310j5008j01293l2418f2687P98p8760j06492M4249R6665N0892C4430
$$ -39962 -5310 -20318 -121611 -154029 -62687 -61889 -140649 -247141 -202892 -106227 -55335 34430
16640H7898A9700e3968R358q8573J1478a5590k344Q424r0696o4720l6513Q5994
$$ 87898 19700 -53968 -44610 -133183 -121705 -15590 -17934 -9510 -100206 -164926 -201439 -115445
16628a15445K5975A708J31659j5918j7439m5524R3001J27984o5449C9721K2732
$$ -115445 -89470 1708 133367 117449 100010 54486 147487 275471 210022 39721 62453
16617F2453k4369k587L3305L0618c0500o6744M4777K1846a2721k2792j4298a7497
$$ 62453 38084 35497 68802 99420 -30500 -97244 -52467 -30621 -12721 -35513 -49811 -17497
16604D8789M9531J8143j5267m181N1225B2760a29423K7709K4087m194J1680Q786
$$ 48789 98320 116463 101196 97015 148240 22760 -129423 -101714 -77627 -81821 -70141 -61355
16592f1355j2076r978K4038q888k8275P738J3616a5570E2601J0660e55r4282L2157
$$ -61355 -73431 -83409 -59371 -68259 -96534 -88796 -75180 -15570 52601 63261 -555 -94837 -62680
16579f2680k1633Q464J278b3538B5683e3984o8198K6791q999k6222N2304K0030
$$ -62680 -84313 -75849 -74571 -23538 25683 -53984 -122182 -95391 -104390 -130612 -78308 -58278
16567e8278i920k052A6365a05422q5847Q0532j1409J4165b8664G163J0082O1109
$$ -58278 -9920 -11972 16365 -105422 -191269 -110737 -122146 -107981 -28664 7163 17245 78354
16555G8354a6472j4205B8393b5048o7634k870m5015K1798d0901A553M4184N9762
$$ 78354 -16472 -30677 28393 -25048 -92682 -95552 -140567 -118769 -40901 1553 45737 105499
16543A05499E45i6573b7601l787A0547g922E2023N1j4329n954a0744r2234Q639
$$ 105499 545 -96573 -27601 -31388 10547 -7922 52023 52074 37745 31791 -10744 -102978 -94339
16530i4339A8437N6483l0575n27g9327l1961L2532c7884J4657n3873n6781k7635
$$ -94339 18437 74920 44345 43818 -79327 -111288 -78756 -37884 -23227 -77100 -133881 -161516
16518a61516N3672c5392A7268c4066l6830k6878p7361K8818k6143g1318D230a0455
$$ -161516 -107844 -35392 17268 -34066 -70896 -97774 -175135 -146317 -172460 -71318 4230 -10455
16505F4688J6269i439l2098J4139F1413Q0583O6390j5943j033G899h1675J8285
$$ 64688 80957 -9439 -41537 -27398 61413 141996 208386 192443 191410 7899 -81675 -63390
16493f3390j4533q1883b3878m4094r6551d5290b0993p9719c9591A8737d651r5579
$$ -63390 -77923 -159806 -23878 -67972 -164523 -45290 -20993 -100712 -39591 18737 -4651 -100230
16481a00230M2836B114a08008m828q6852Q4021d9233n8021k1486m090m2465g0977
$$ -100230 -57394 2114 -108008 -112836 -199688 -115667 -49233 -107254 -128740 -132830 -175295 -70977
16468A4860O0047B8255a01789P395E494N4661K8876k5671A264J03573P386j1634
$$ 14860 74907 28255 -101789 -94394 5494 60155 89031 63360 1264 104837 112223 100589
16456A00589k3095k68b9486l6020A4535P1718k762Q059l4456E377c8437k5850
$$ 100589 77494 77226 -29486 -65506 14535 86253 83491 91550 57094 5377 -38437 -64287
16444f4287J4759A7111L9022q786M29K5768B8485i3787k9106e6993A12355j7737
$$ -64287 -49528 17111 56133 47347 47776 73544 28485 -93787 -122893 -56993 112355 94618
16432I4618q166b3019j17095N3213b0103F2610L2486K0452n6798p336O048e1406
$$ 94618 86452 -23019 -140114 -86901 -20103 62610 95096 115548 58750 51414 57462 -51406
16419g9823j1455j5932c9002l2675m2861L1631l3092p915d9927F9629A2468b1653
$$ -79823 -91278 -107210 -39002 -71677 -114538 -82907 -115999 -123914 -49927 69629 12468 -21653
16406a1781j8413H0520A2439I95K4801J3953J7184d9461m35j5966a6048G629c72
$$ -11781 -30194 80520 12439 995 25796 39749 56933 -49461 -49896 -65862 -16048 7629 -372
16392C44f2814p5810n8429P3077j9553N7803n203q3602O9006d803G1415O9971
$$ 344 -62814 -138624 -197053 -123976 -143529 -85726 -90929 -174531 -105525 -4803 71415 141386
16380A41386n1109m3557J0318b3981a0783A7767d1871a6511I8639n918a8688k7582
$$ 141386 90277 46720 57038 -23981 -10783 17767 -41871 -16511 98639 92721 -18688 -46270
16368d6270A18a15305j06128q100J7778P0959f3828Q444B8270H536K2463P5866
$$ -46270 118 -115305 -221433 -229533 -211755 -140796 -63828 -55384 28270 8536 30999 106865
16356A06865K3672B6758g2663K3703R104k4180E8901B4189J0639J05306D8785
$$ 106865 130537 26758 -72663 -48960 -39856 -64036 58901 24189 34828 140134 48785
16344B5814k324a35448J1188N7831E9875B1854a5615B4045a9259B4022k678d6677
$$ 25814 23490 -135448 -124260 -66429 59875 21854 -15615 24045 -19259 24022 21344 -46677
16331g1343c3845B9902l425a05294J0412p832K0114d0072B486a5193E3830L0728
$$ -71343 -33845 29902 26477 -105294 -94882 -102714 -82600 -40072 2486 -15193 53830 84558
16319H4558g1084J101B5497A1015d430n1003j495j8867a046A6098L8528A5963
$$ 84558 -71084 -69983 25497 11015 -4430 -55433 -56928 -75795 -1046 16098 54626 15963
16306D4141J8517A4038a1620G271J5870I704f5789E485c8481B4871d5948q1612
$$ 44141 62658 14038 -11620 7271 23141 9704 -65789 5485 -38481 24871 -45948 -127560
16294a27560c3736F808B633a0441r1470J2588a0952j5640k4260k9878n707b7153
$$ -127560 -33736 6808 2633 -10441 -101911 -89323 -10952 -26592 -50852 -80730 -86437 -27153
16281c5862A5935N7601K9959O1732q0168d661B3195L5657K4126r877E913i2612
$$ -35862 15935 73536 103495 165227 85059 -4661 23195 58852 82978 73101 5913 -92612
16268a34277d6365a2648m0684F249L1819E66N6833c0416j07584d5550B6947b8561
$$ -134277 -46365 -12648 -53332 6249 38068 566 57399 -30416 -138000 -45550 26947 -28561
16255e4326a3276E0034R298d203m4827b917B5339e3280j06244N2139n307K8677
$$ -54326 -13276 50034 59332 -4203 -49030 -2917 25339 -53280 -159524 -107385 -112692 -84015
16243h4015c3638f15A26775d631l3380j3564K1131D5817b2489j4400J1890m9051
$$ -84015 -33638 -615 126775 -4631 -38011 -51575 -30444 45817 -22489 -36889 -24999 -74050
16231g4050B0846H564J1916K2880a8655B756Q444k668L0746N0107K0895j7543
$$ -74050 20846 8564 20480 43360 -18655 2756 11200 8532 39278 89385 110280 92737
16219I2737C0469C721L2707Q9076l2447D3074J2329j4186d0510k0045n1841r2351
$$ 92737 30469 3721 36428 125504 93057 43074 55403 41217 -40510 -60555 -112396 -204747
16207b04747L4923N2320N3507j5237j9487q735h420F3027J1053j2631H625g1813
$$ -204747 -169824 -117504 -63997 -79234 -98721 -107456 -8420 63027 74080 61449 8625 -71813
16194g5431b2114l7381b895p9362p430J4740j3416J9935K7857q3116l2239o8650
$$ -75431 -22114 -59495 -2895 -82257 -89687 -74947 -88363 -68428 -40571 -123687 -155926 -224576
16182b24576L5064G850P3668R801K238A0016j744J9244O2989O8447m3630J3159
$$ -224576 -189512 7850 81518 91319 93557 10016 8272 27516 90505 158952 115322 128481
16170A28481l9781J3222l0514j0729a4863p4032Q428a6120C2333R334J90d6753
$$ 128481 88700 101922 71408 60679 -14863 -88895 -80467 -16120 32333 41667 41857 -46753
16157d8293J5410l6478J3733G8312k1109H658L0116J4105k3289G420J4344i2B2012
$$ -48293 -32883 -69361 -55628 78312 57203 8658 38774 52879 29590 7420 21764 -92 22012
16143F5257O0324m2644b7073j16264J9733a9362r2616J0532j6400J9149G925J9312
$$ 65257 125581 82937 -27073 -143337 -123604 -19362 -111978 -101446 -117846 -98697 7925 27237
16131B7237M7204p816A3827E777b3222r5248l9187J3881d0399D3112J2574a5406
$$ 27237 74441 66625 13827 5777 -23222 -118470 -157657 -143776 -40399 43112 55686 -15406
16118b5816n2739b733j9366j7940Q148c207r2203k4156A1460b014p1606b4506
$$ -25816 -78555 -2733 -22099 -40039 -31891 -3207 -95410 -119566 11460 -2014 -73620 -24506
16105c5129C1816K6907M4455j2784B5418F776b0790j7687M510m0194J5518K7223
$$ -35129 31816 58723 103178 90394 25418 6776 -20790 -38477 -33967 -74161 -58643 -31420
16093c1420B44L5043M4800L0477c5549o3659M5714I0987l9977L763P211O9874
$$ -31420 244 35287 80087 110564 -35549 -99208 -53494 90987 51010 54773 61984 131858
16081A31858M1629D5538a1944E5817B6876h494j2507j0501c011C2632E776a0442
$$ 131858 173487 45538 -11944 55817 26876 -8494 -21001 -31502 -3011 32632 5776 -10442
16068e4554b5551A15591m0243G627a9762K681i86j3332l0253f700B3500C279f5007
$$ -54554 -25551 115591 75348 7627 -19762 -17081 -986 -14318 -44571 -6700 23500 3279 -65007
16054a2207n6089a5643B8526a1035F7318c7234C8340h203j93870P0727a388C7593
$$ -12207 -68296 -15643 28526 -11035 67318 -37234 38340 -8203 -202073 -131346 -1388 37593
16041B535c1609o4000L2899a0408D805a20324r6645j0758J11018M3845r549r972
$$ 2535 -31609 -95609 -62710 -10408 4805 -120324 -216969 -227727 -116709 -72864 -82413 -92385
16029i2385K1770J296A0511E90a27136n9633L1970j3374e3225J7449j4670B4455
$$ -92385 -70615 -69319 10511 590 -127136 -186769 -154799 -168173 -53225 -35776 -50446 24455
16016D2855f4127K3077o280B739m98b4574a205F5909P7052m1119a8777n613D5082
$$ 42855 -64127 -41050 -47330 2739 2241 -24574 -1205 65909 142961 101842 -18777 -24390 45082
16002B5395l409R885e5602k2168K9475n729o1580k5894J3271d4028H202g388o8077
$$ 25395 21986 31871 -55602 -77770 -48295 -54024 -115604 -141498 -128227 -44028 8202 -7388 -75465
15989g5465c6456d532o7474j2116a9474R663H6195J6256C6787a5880O195I7385
$$ -75465 -36456 -4532 -72006 -84122 -19474 -9811 86195 102451 36787 -15880 -9685 97385
15976F4248e2982J6771C849g3649c5043j8854n9956L2886b8177R50B7902M6028
$$ 64248 -52982 -36211 3849 -73649 -35043 -53897 -113853 -80967 -28177 -27227 27902 73930
15964G3930L4490D0345N417j4710L2567k6474c031r5885d2140l1603K5082r0446
$$ 73930 108420 40345 45762 31052 63619 37145 -3031 -98916 -42140 -73743 -48661 -139107
15952a39107J1519K9497d4109a1785j9870m2501k6926m2733a7891I1376C4997
$$ -139107 -127588 -98091 -44109 -11785 -31655 -74156 -101082 -143815 -17891 91376 34997
15940g0262j5411c6708B377e2952p9853d6829j2606j8144J7123b5737p629N054
$$ -70262 -85673 -36708 2377 -52952 -132805 -46829 -59435 -77579 -60456 -25737 -33366 -28312
15928b8312q216A1872f2843m6311M9450K7776B5547K7589J7026j7686a549r8257
$$ -28312 -36528 11872 -62843 -109154 -59704 -31928 25547 53136 70162 52476 -1549 -99806
15916i9806N666K3614b0170D3193d0310q811n1061b7962F7992c8041p8930J1272
$$ -99806 -94140 -70526 -20170 43193 -40310 -49121 -100182 -27962 67992 -38041 -116971 -105699
15904a05699c9295B6956L3300B8473f4579k5168b3747l6819n618a5216E0268R743
$$ -105699 -39295 26956 60256 28473 -64579 -89747 -23747 -60566 -66184 -15216 50268 60011
15892F0011M6560D3553j3735I342L1191A4824J5640b0111q8020K0362J0383n4204
$$ 60011 106571 43553 29818 9342 40533 14824 30464 -20111 -108131 -87769 -77386 -131590
15880a31590k4436N2840b7338H0444O9540m7954A0434A994e0139m7463l6129L1953
$$ -131590 -156026 -103186 -27338 80444 149984 102030 10434 1994 -50139 -97602 -133731 -101778
15868a01778L0114j1975o569l8542e7191B7784A0890J658a9009j0273D7569j3568
$$ -101778 -71664 -83639 -90208 -128750 -57191 27784 10890 12548 -19009 -29282 47569 34001
15856C4001A5868J08428L4936B3837a9105m870E4954M3951m5912j0936M7413C0372
$$ 34001 15868 124296 159232 23837 -19105 -23975 54954 98905 52993 42057 89470 30372
15843c5376E264f7782K8403n054A4420J4128b1708k0835H3152q213P915k8141
$$ -35376 5264 -67782 -39379 -44433 14420 28548 -21708 -42543 83152 74939 82854 54713
15831E4713I185M3997R037j2162N4191D6294c2626k5310D1489n263a9006e8n229
$$ 54713 9185 53182 62219 50057 104248 46294 -32626 -57936 41489 36226 -19006 -58 -5287
15818e287n7168a823l1650l3404j4129N393o6338L720N4826J9010K1273p4061
$$ -5287 -62455 -1823 -33473 -66877 -81006 -75613 -141951 -138231 -83405 -64395 -43122 -117183
15806a17183M5495b0359l968j0414Q346k8389K988B8361a10834L1213B3137a0216
$$ -117183 -71688 -20359 -24327 -34741 -26395 -54784 -51796 28361 -110834 -79621 23137 -10216
15793D0899c3052F661J7366J7017d5926l7628L6667p190n0059L8816N999l6149
$$ 40899 -33052 6661 24027 41044 -45926 -83554 -46887 -54077 -104136 -65320 -59321 -95470
15781i5470n0015N3382L5982l2913j6310j2446e5463K820m2719m7031l9877N6812
$$ -95470 -145485 -92103 -56121 -89034 -105344 -117790 -55463 -52643 -95362 -142393 -182270 -125458
15769a25458e8909L239f703D8293c1248p4910l8746J2520f1513I541a4939k2298
$$ -125458 -58909 -55670 -6703 48293 -31248 -106158 -144904 -132384 -61513 9541 -14939 -37237
15757c7237K815m2903K1931a0488k7931l3728A9120B844b6446a0993n1131A4698
$$ -37237 -34422 -77325 -55394 -10488 -38419 -72147 19120 2844 -26446 -10993 -62124 14698
15744B9547P3901L535A1429P285O076b777F0762B0614E767b4341i781D9178K3065
$$ 29547 103448 106983 11429 18714 24790 -2777 60762 20614 5767 -24341 -9781 49178 72243
15731G2243L0273O9311n7974J2407K4843n5165C4732M2361b9779Q418B7033J22475
$$ 72243 102516 171827 113853 126260 151103 95938 34732 77093 -29779 -21361 27033 149508
15719A49508G0892g8514l3736K7017J8868j12027P4317f978n3023K8745A1678
$$ 149508 70892 -78514 -112250 -85233 -66365 -178392 -104075 -6978 -60001 -31256 11678
15707D7595A2919Q4727D7085K9706R412C5927g6621K0331B9865J0086A490L8040
$$ 47595 12919 97646 47085 76791 86203 35927 -76621 -56290 29865 39951 1490 39530
15695C9530L4623B4072N9324J9571D4326B875b3210j7114l4522o28c956n6330
$$ 39530 74153 24072 83396 102967 44326 2875 -23210 -40324 -74846 -75474 -3956 -60286
15683f0286l6684k7739e7177B903g3734m8210L2590d4562j8758n6374l7149K0769
$$ -60286 -96970 -124709 -57177 2903 -73734 -121944 -89354 -44562 -63320 -119694 -156843 -136074
15671a36074L2001L741K5347O329o1911n3354O5348J824K0922J8029a9811G133
$$ -136074 -104073 -100332 -74985 -68656 -130567 -183921 -118573 -116749 -95827 -77798 -19811 7133
15658D8367f5064Q357C7850O5671m6494B658a4947M10C1919P0659n473k1745J4340
$$ 48367 -65064 -56707 37850 103521 57027 2658 -14947 -14537 31919 102578 97105 75360 89700
15645H9700M3375F1213r560K906B5954c9542j4001o8996j837a852E6521g2270
$$ 89700 133075 61213 51653 54559 25954 -39542 -53543 -122539 -124376 -1852 56521 -72270
15632a51093O5765B0910d4807m1277M989j7431M632c3281d26m3624k952n772k1374
$$ -151093 -85328 20910 -44807 -86084 -81095 -98526 -93894 -33281 -426 -44050 -47002 -52774 -74148
15619g4148C1488A2424b7661G168c5695n297J5616A1030f3203a9072B098i6153
$$ -74148 31488 12424 -27661 7168 -35695 -40992 -25376 11030 -63203 -19072 2098 -96153
15606f8888e010k7058k3749B8195f9857K0833a1659l750C7010M5633A3000i5753
$$ -68888 -5010 -32068 -55817 28195 -69857 -49024 -11659 -15409 37010 82643 13000 -95753
15593i0744b2036B1545M704b5351K88k9114H600M1632M1j3421O0044J10597o6861
$$ -90744 -22036 21545 26249 -25351 -25063 -54177 8600 50232 50273 36852 96896 207493 140632
15580A40632C4574K1858A2190h2435b2623o7398m2902l1218K0778K0689N181r7798
$$ 140632 34574 56432 12190 -82435 -22623 -90021 -132923 -164141 -143363 -122674 -117493 -215291
15568b15291L2572L0041d5094k3418n4972q3379O7698n155M7870K5935j0105j2181
$$ -215291 -182719 -152678 -45094 -68512 -123484 -206863 -139165 -144320 -96450 -70515 -80620 -92801
15556i2801l6136L3684C1373J8682K844N0467N4752H952K1595L655f1843F21J4271
$$ -92801 -128937 -95253 31373 50055 52899 103366 158118 8952 30547 34202 -61843 621 14892
15543A4892a2820K588j9106J1222o517l2875h238j4118B8617O2541M3629r064
$$ 14892 -12820 -10232 -29338 -18116 -24633 -57508 -8238 -22356 28617 91158 134787 125723
15531A25723B4469r596K0990F915K0757a2076B5941a7754j0251B0680L940P7077
$$ 125723 24469 14873 35863 6915 27672 -12076 25941 -17754 -28005 20680 24620 101697
15519A01697d3478k9853k9327a2662J205r4139o1226J5106J4739N6084K9979m2604
$$ 101697 -43478 -73331 -102658 -12662 -11457 -105596 -166822 -151716 -136977 -80893 -50914 -93518
15507i3518d2004p798j06451g0964l991a1108C2145l185f880L015l7476m2858
$$ -93518 -42004 -49802 -156253 -70964 -74955 -11108 32145 28960 -6880 -3865 -41341 -84199
15495h4199c3878D447c2117r5379j5932O0728p734C1870J12940l1816K4528A9545
$$ -84199 -33878 4447 -32117 -127496 -143428 -82700 -90434 31870 144810 112994 137522 19545
15482b9700l853a4864E5786K7205j1000M9906L6196m7420l9590J6577A892d4893
$$ -29700 -33553 -14864 55786 82991 71991 121897 158093 110673 71083 87660 1892 -44893
15469h8291J4918B215M698d1701A0815K3184c2683j1720O689B7572O5248j8763
$$ -88291 -73373 2215 6913 -41701 10815 33999 -32683 -44403 -37714 27572 92820 74057
15457G4057K9094m3161h1257C787J537d6705o216j5806k4167D7465O4549k5325
$$ 74057 103151 59990 -81257 3787 5324 -46705 -52921 -68727 -92894 47465 112014 86689
15445H6689C9802B291f0621A7370P2355L6072O70E9063k7979o669h5660N896n683
$$ 86689 39802 2291 -60621 17370 89725 125797 126467 59063 31084 24415 -85660 -79764 -85447
15432h5447c621D3033A9397L1150j1069e1849n9836N3329b8793J0489E1126e927
$$ -85447 -3621 43033 19397 50547 39478 -51849 -111685 -58356 -28793 -18304 51126 -5927
15419A9898a3724E0914M1233c4705o1898L2475m2441l682b9119D866c6542j03445
$$ 19898 -13724 50914 92147 -34705 -96603 -64128 -106569 -110251 -29119 4866 -36542 -139987
15407a39987N5406D445O4113g7169K0576I6838k9027j9225H07e2407m9161F9156
$$ -139987 -84581 4445 68558 -77169 -56593 96838 67811 48586 807 -52407 -101568 69156
15394E9857b3588r108B2098D438Q4474J1689l4777B1338m544K3819j1784M8657
$$ 59857 -23588 -32696 22098 4438 88912 100601 65824 21338 16794 40613 28829 77486
15382G7486K1083m300N629M0160F1109a06877k1718b4550l017M063H221b9219
$$ 77486 98569 94269 99898 140058 61109 -106877 -128595 -24550 -27567 -23504 8221 -29219
15369C2339M9285b6134J2625e537k9143l8831c4769G876M3817j5771j4290c6469
$$ 32339 81624 -26134 -13509 -5537 -34680 -73511 -34769 7876 51693 35922 21632 -36469
15356c9667a7925F8024j8612M468j7815f463A7375f0129e005F8325B4385K4905
$$ -39667 -17925 68024 49412 53880 36065 -6463 17375 -60129 -5005 68325 24385 49290
15344D9290A6242a08254M658j7225b4322H9073A3510K7889M8399N8015k468p1540
$$ 49290 16242 -108254 -103596 -120821 -24322 89073 13510 41399 89798 147813 145345 73805
15332G3805g0327e119B1737j0095O030d2821k8869a0764D9657A6187L1040a4566
$$ 73805 -70327 -5119 21737 11642 17672 -42821 -71690 -10764 49657 16187 47227 -14566
15319a8536I1739N0696k0731m6823A2787M488L3955A0554a8459q479m7999j11066
$$ -18536 91739 142435 121704 74881 12787 17275 51230 10554 -18459 -26938 -74937 -186003
15307a86003J5241K7636K9655e0801q514o2011L8117C0871f928A2178O3218L6080
$$ -186003 -170762 -143126 -113471 -50801 -59315 -121326 -83209 30871 -6928 12178 75396 111476
15295A11476C4770e7476o3888N5471m191K019b0702E3342a5486r211B1330K6366
$$ 111476 34770 -57476 -121364 -65893 -70084 -68065 -20702 53342 -15486 -24697 21330 47696
15283D7696j1335f6834J886a4765o2936i154H438a9186k365A5626o786L131i6320
$$ 47696 36361 -66834 -64948 -14765 -77701 -9154 8438 -19186 -21551 15626 8840 11971 -96320
15269a00109a9290p0154L0292m5041m6113K8622M8864D0305Q046c75k2580j04270
$$ -100109 -19290 -89444 -59152 -104193 -150306 -121684 -72820 40305 48351 -375 -22955 -127225
15257a27225K8855J5256J1707M342c3476j0675P33j6085b5793n8213l5554m2388
$$ -127225 -98370 -83114 -71407 -67065 -33476 -44151 -43418 -59503 -25793 -84006 -119560 -161948
15245a61948c4376a0029l0107a0352l994O993o7490F758e0018J5063A31830L3044
$$ -161948 -34376 -10029 -40136 -10352 -14346 -7353 -74843 6758 -50018 -34955 131830 164874
15233A64874m1994m1019M2274D5534r385d602o2872k0044K3605a8763H488N5006
$$ 164874 122880 81861 124135 45534 36149 -4602 -67474 -87518 -63913 -18763 8488 63494
15221F3494f696k4275B7772c648o1567j7496a6311o0412l9810n6856g4694c2602
$$ 63494 -6696 -30971 27772 -3648 -65215 -82711 -16311 -76723 -116533 -173389 -74694 -32602
15208c1659F7680J2468l644A9799h12B1268b8575a0432H2288d8987m2882l3312
$$ -31659 67680 80148 76504 19799 -812 21268 -28575 -10432 82288 -48987 -91869 -125181
15196a25181K819d5814h639k3949k348k6588j9906j1893D5208a5125j5099B1617
$$ -125181 -122362 -45814 -8639 -32588 -34936 -61524 -81430 -93323 45208 -15125 -30224 21617
15183F4756k6967L5198A2932a8370o8140J200c8330a0645k1672A04560l9930J2100
$$ 64756 37789 72987 12932 -18370 -86510 -85310 -38330 -10645 -32317 104560 64630 76730
15171G6730b937n1665J5345m5509c8496C0556b2976l3796l1449m175J5303L1730
$$ 76730 -2937 -54602 -39257 -84766 -38496 30556 -22976 -56772 -88221 -92396 -77093 -45363
15159d5363M503B6351J10715C0615A3827M2687A5771J0557G597K0323d266j1987
$$ -45363 -40860 26351 137066 30615 13827 56514 15771 26328 7597 27920 -4266 -16253
15147a6253k9593m9727j7349d2352m9137d3360K081k0232p3591J3530N0092F2323
$$ -16253 -45846 -95573 -112922 -42352 -91489 -43360 -41279 -61511 -135102 -121572 -71480 62323
15134G9003k3985k3211b3522k9877J4250I955J6301N3898P553B8279d6399a9224
$$ 79003 55018 31807 -23522 -53399 -39149 9955 26256 80154 87707 28279 -46399 -19224
15121E4093j9601i3675m4681L5725l2358k0846N0953d8187A5142q31b2954o5884
$$ 54093 34492 -93675 -138356 -102631 -134989 -155835 -104882 -48187 15142 14311 -22954 -88838
15109h8838D393K8454d7463a9208K853j5032j6040l5488b7327N491E028O6251
$$ -88838 4393 32847 -47463 -19208 -16355 -31387 -47427 -82915 -27327 -21836 5028 71279
15097G1279G275a58488b6479E4736a408D4455j0128c5308I4505f3724m2366M8474
$$ 71279 7275 -158488 -26479 54736 -1408 44455 34327 -35308 94505 -63724 -106090 -57616
15085e7616g734A5015a04320L7103m1788n1639l0678g8282c3028j7229c107C9842
$$ -57616 -7734 15015 -104320 -67217 -109005 -160644 -191322 -78282 -33028 -50257 -3107 39842
15072c7635i898k5110K214a4584A5374e7074b5407F2770c337o9657a4532m5548
$$ -37635 -9898 -35008 -32794 -14584 15374 -57074 -25407 62770 -3337 -72994 -14532 -60080
15060f0080A4933M6792M8204b4373G367Q453J3627b3621l599A4226N0974B454
$$ -60080 14933 61725 109929 -24373 7367 15820 29447 -23621 -27220 14226 65200 2454
15047d8629K237C7552B472O1993J6861J4870M7905F5392l0159c3220N103A8615
$$ -48629 -46392 37552 2472 64465 81326 96196 144101 65392 35233 -33220 -28117 18615
15034H6333k3512B7937A2205j87N3033J03637n2830b6897a689D3950N2250K7230
$$ 86333 62821 27937 12205 12018 65051 168688 115858 -26897 -1689 43950 96200 123430
15022A23430l8829C8979P3680J09544r5255A6615g2915L0222d566j8754g228l6505
$$ 123430 84601 38979 112659 222203 126948 16615 -72915 -42693 -4566 -23320 -7228 -43733
15010d3733E538N8453N8506O9641m373D8608d6212P831j7669J6608a6993q9804
$$ -43733 5538 63991 122497 192138 187765 48608 -46212 -38381 -56050 -39442 -16993 -106797
14998a06797p5548q132f1019E242d0088j8255B340a7753B2244N0061e642r2762
$$ -106797 -182345 -190477 -61019 5242 -40088 -58343 2340 -17753 22244 72305 -5642 -98404
14986i8404n2391N8187q9170j4616Q8215B6119L2027c7993a185q1329L6567A5286
$$ -98404 -150795 -92608 -181778 -196394 -108179 26119 58146 -37993 -1185 -82514 -45947 15286
14973D6769j0500L361g3040o7057J6776O0912m0443a728B2689l894K1985p340
$$ 46769 36269 39630 -73040 -140097 -123321 -62409 -102852 -1728 22689 18795 40780 33440
14961C3440d5526A6660R9036B2357f2898l3047F4185q974k4300c2450j11370K8827
$$ 33440 -45526 16660 115696 22357 -62898 -95945 64185 55211 30911 -32450 -143820 -114993
14949a14993R492L7557l5306j0450l8305M882e8137k4107k2845R381J1055L1715
$$ -114993 -105501 -67944 -103250 -113700 -152005 -147123 -58137 -82244 -105089 -95708 -84653 -52938
14937e2938I549a2754C5181d4261E561O2523d3198K938J1000q3440M9313m5649
$$ -52938 9549 -12754 35181 -44261 5561 68084 -43198 -40260 -29260 -112700 -63387 -109036
14925a09036n9768e8919j9372J5991a8502C4750b2589E670h2744b8480r4273N7185
$$ -109036 -168804 -58919 -78291 -62300 -18502 34750 -22589 5670 -82744 -28480 -122753 -65568
14913f5568l0968c9906B8537N8201Q599m2791A4211c3669j4881j6746d203m7975
$$ -65568 -96536 -39906 28537 86738 95337 52546 14211 -33669 -48550 -65296 -4203 -52178
14901e2178a335m6139k7065E2392D353e7471r444K3739E5569P4471m5166K2641
$$ -52178 -1335 -47474 -74539 52392 4353 -57471 -66915 -43176 55569 130040 84874 107515
14889A07515k6943B1761Q5043k2216J86K3800l5365A9267M4981h025j2706j4108
$$ 107515 80572 21761 106804 84588 84774 108574 73209 19267 64248 -8025 -20731 -34839
14877c4839k6132M538P695B5196a5129k0703o8160A859O079b5223B6555f2263
$$ -34839 -60971 -56433 -48738 25196 -15129 -35832 -103992 1859 7938 -25223 26555 -62263
14864D0340A0884m356P642o074a4234k6885G8744m96C247g5829b8706C02O613
$$ 40340 10884 6528 14170 8096 -14234 -41119 78744 78248 3247 -75829 -28706 302 6915
14851F915f2182K2340C2681M0954J113C3866J538N8374Q6669k9224k132m2194
$$ 6915 -62182 -39842 32681 73635 74748 33866 35404 93778 180447 151223 149091 106897
14839A06897c0198j1548l751q622B111a8412c975A3697O1861b5908n4806L929
$$ 106897 -30198 -41746 -45497 -54119 2111 -18412 -3975 13697 75558 -25908 -80714 -76785
14827g6785J2782j7747e235B1803K546j0249o536f3947o7644M6078c6705D6590
$$ -76785 -64003 -81750 -5235 21803 24349 14100 7564 -63947 -131591 -85513 -36705 46590
14814G6370K0730D2286A9606L2399b5578p823p6246L7498k4357E3520J04638J3600
$$ 76370 97100 42286 19606 52005 -25578 -33401 -109647 -72149 -96506 53520 158158 171758
14802A71758G9881L9022l1378B6823j2315e3811I7508l0947f7120j1208m262k2348
$$ 171758 79881 118903 87525 26823 14508 -53811 97508 66561 -67120 -78328 -82590 -104938
14790a04938o546L1645E2764L4931k1117A6468n490K0643J7184j3766d2293E4935
$$ -104938 -111484 -79839 52764 87695 66578 16468 10978 31621 48805 35039 -42293 54935
14777a5414A2605O6105j344a618p533G1043b765l3960k008l7188c5165G0960A341
$$ -15414 12605 78710 77366 -1618 -9151 71043 -2765 -36725 -38733 -75921 -35165 70960 1341
14763c1712n030J4664R088l3122I546a1109C5925a9967k0157n8531P199L6175
$$ -31712 -36742 -22078 -12990 -46112 9546 -11109 35925 -19967 -40124 -98655 -91456 -55281
14751e5281m5423J3386l1083c4080A613a01640j1037a4649A1268g3966K3169A3350
$$ -55281 -100704 -87318 -118401 -34080 1613 -101640 -112677 -14649 11268 -73966 -50797 13350
14738D657b9064j7840B5590E063a746j8156r562E7704J06583k6913B0279K424
$$ 4657 -29064 -46904 25590 5063 -1746 -19902 -29464 57704 164287 137374 20279 22703
14726B2703K288O6698L2585B66a5934b856q2593J0629c5137m7799k5175K7106
$$ 22703 24991 91689 124274 266 -15934 -2856 -85449 -74820 -35137 -82936 -108111 -81005
14714h1005N405L2969j1507p4752J0122M2999b8229m6538b8092j5644a600A61391
$$ -81005 -75600 -42631 -54138 -128890 -118768 -75769 -28229 -74767 -28092 -43736 -1600 161391
14701A69228o6393m8968J698J6568C5642M507b0152p4853c3795K499k5902P319
$$ 169228 102835 53867 55565 72133 35642 40149 -20152 -95005 -33795 -31296 -57198 -49879
14689d9879b1053m049D4814K5272a162k2416k0175m571l5039R953J2516f81B0970
$$ -49879 -21053 -25102 44814 70086 -1162 -23578 -43753 -48324 -83363 -73410 -60894 -681 20970
14675F430c001C8133J4461M881c6509O679k7607j7516n6212B2806c8784J5705
$$ 6430 -3001 38133 52594 57475 -36509 -29830 -57437 -74953 -131165 22806 -38784 -23079
14663b3079E1187J8216A7811N5598C4487P2930k2558d9726r380E0853N1546O9779
$$ -23079 51187 69403 17811 73409 34487 107417 84859 -49726 -59106 50853 102399 172178
14651A72178p4953B6665P429I397j222a1871j4860A8326b7429E8536c3587l6530
$$ 172178 97225 26665 34094 9397 8175 -11871 -26731 18326 -27429 58536 -33587 -70117
14639g0117K6988q760D0698M2650k5968A4712K4515a3269o814k1640k4754r994
$$ -70117 -43129 -51889 40698 83348 57380 14712 39227 -13269 -20083 -41723 -66477 -76471
14627g6471m4488N4286b6776p839e769G903Q8611m6750a9860C9098P7163C0910
$$ -76471 -120959 -66673 -26776 -34615 -5769 7903 96514 49764 -19860 39098 116261 30910
14614A24479k315g6396p5691K8701j3442l311j280d6027A7099o268b8560j6800
$$ 124479 122164 -76396 -152087 -123386 -136828 -140139 -141419 -46027 17099 10831 -28560 -45360
14602d5360C1391M6495C5523J44j3198n970K6397A2575M0736C441d3953o1455
$$ -45360 31391 77886 35523 35667 22469 16499 42896 12575 53311 3441 -43953 -105408
14590a05408n672j266M3397D9414N0987C7584G593J0094c332E8291B5668O2310
$$ -105408 -111080 -112346 -68949 49414 100401 37584 7593 17687 -3332 58291 25668 87978
14578H7978J4117k0768r47l165b5183o3233d2399I054g9950b4670n0213K7057
$$ 87978 102095 81327 80380 77215 -25183 -88416 -42399 9054 -79950 -24670 -74883 -47826
14566d7826F9078K1015l0799j5686k1522a6605D108J1778g0397j1154L3958r694
$$ -47826 69078 90093 59294 43608 22086 -16605 4108 15886 -70397 -81551 -47593 -57287
14554e7287J2538a3200I0974L3589l6132m716GJ60134n5120f3319A9154J6375
$$ -57287 -44749 -13200 90974 124563 88431 83715 7 160141 105021 -63319 19154 35529
14542C5529I720b2215A641L4041E198a3129F499K3366i8520L362a6402F985J3084
$$ 35529 9720 -22215 1641 35682 5198 -13129 6499 29865 -98520 -95158 -16402 6985 20069
14529B0069B407J7286e3126J9588J053E9866O8844m7780k5070N2231k6450c9682
$$ 20069 2407 19693 -53126 -33538 -32485 59866 128710 80930 55860 108091 81641 -39682
14516a28569c3149E8681A7025a03253N360i169I3125m6474K0483C0033b8549l733
$$ -128569 -33149 58681 17025 -103253 -97893 -9169 93125 46651 67134 30033 -28549 -32282
14504c2282h657H281c282o374k4953l5598j7104a3783G3159J9380l0791P8225
$$ -32282 -8657 8281 -3282 -9656 -34609 -70207 -87311 -13783 73159 92539 61748 139973
14492A39973O2823M0552M677m5002o8418n8548A0342f456o4016k1989B396L8253
$$ 139973 202796 243348 248025 203023 134605 76057 10342 -6456 -70472 -92461 2396 40649
14480D0649L1715c2393j05023J6359a3119A31968l331C5178p539a5483n220n0030
$$ 40649 72364 -32393 -137416 -121057 -13119 131968 128637 35178 27639 -15483 -20703 -70733
14468g0733K0061g314C2763L6103M9281l4929K1398D4277B1167P383K4513k5830
$$ -70733 -50672 -7314 32763 68866 118147 83218 104616 44277 21167 28550 53063 27233
14456B7233E037M1969N9180m7799k0926e419E1486j2027n554a1015k6461C6594
$$ 27233 5037 47006 106186 58387 37461 -5419 51486 39459 33905 -11015 -37476 36594
14443C4225a7557l2686m2676J3504j1781d2914B996J7050g5141c3769r21C3202
$$ 34225 -17557 -50243 -92919 -79415 -91196 -42914 2996 20046 -75141 -33769 -34690 33202
14430D3058O0236B5930r629d4352m9874a1012j08864m0586e9971B8758c9494n5538
$$ 43058 103294 25930 16301 -44352 -94226 -11012 -119876 -160462 -59971 28758 -39494 -95032
14418i5032J8428C478J00581B5140i373E7847m682A6131i4786r4647J0477n769
$$ -95032 -76604 3478 104059 25140 -9373 57847 53165 16131 -94786 -189433 -178956 -184725
14406a84725P7697L4470e692j6274d119a881C0962M8152j3003k1670j3689J0486
$$ -184725 -107028 -72558 -5692 -21966 -4119 -1881 30962 79114 66111 44441 30752 41238
14394D1238L3232M229l237O0515N6123J6190C3526g5884b916E6851j6558c0873
$$ 41238 74470 78699 75462 135977 192100 208290 33526 -75884 -2916 56851 40293 -30873
14381d1361a5404B576i52C0877R643H977a7529h92A8880f91I2078l5008K5984
$$ -41361 -15404 2576 -952 30877 40520 8977 -17529 -892 18880 -691 92078 57070 83054
14368H3054O0236n8853B1165G326O1678N2295n1241J381A8850D832J24582M4691
$$ 83054 143290 84437 21165 7326 69004 121299 70058 71439 18850 4832 129414 174105
14356A74105l0915k5034K8880l8334l8183n460L5909l9219A4326a3395k5566C6020
$$ 174105 143190 118156 147036 108702 70519 65059 100968 61749 14326 -13395 -38961 36020
14343A1401a9024H6179C4717h063j02441e3928g082B2400a096j19265j2177k798
$$ 11401 -19024 86179 34717 -8063 -110504 -53928 -7082 22400 -1096 -120361 -132538 -135336
14331a35336b8920l211l0111k3845K2292P030j0640K337g084A527c9419j5750
$$ -135336 -28920 -32131 -62242 -86087 -63795 -56765 -67405 -65068 -7084 1527 -39419 -55169
14319e5169B5864Q8480J1028K006C5721n467M3272N398b1205m5742J9547j7533
$$ -55169 25864 114344 125372 127378 35721 30254 73526 78924 -21205 -66947 -47400 -64933
14307f4933J3975I4368M0057B4066c6762C5582R8342k1545a519o297n7639j7182
$$ -64933 -50958 94368 134425 24066 -36762 35582 133924 112379 -1519 -7816 -65455 -82637
14295h2637a9092l2841n6410m5816g4229G6741L9654E3718N63A3243b7923H708
$$ -82637 -19092 -51933 -108343 -154159 -74229 76741 116395 53718 54281 13243 -27923 8708
14282e718E4797a4109n6577K5056B7296F030e6015k5086J9827l5625n0248J0817
$$ -5718 54797 -14109 -70686 -45630 27296 6030 -56015 -81101 -61274 -96899 -147147 -136330
14270a36330j3071Q534m4909O7977c9006D4967M2516b4556k8940b2271E4404J02711
$$ -136330 -149401 -140867 -185776 -117799 -39006 44967 87483 -24556 -53496 -22271 54404 157115
14258A57115l3261D9102A5296a9266B7725n527a311m7037L682j8091p4932K9186
$$ 157115 123854 49102 15296 -19266 27725 22198 -1311 -48348 -44666 -62757 -137689 -108503
14246a08503n395D1510j2904K6039j4945L3066l2875J05373G0621d701D3137P5624
$$ -108503 -113898 41510 28606 54645 39700 72766 39891 145264 70621 -4701 43137 118761
14234A18761k8770k624M1335k6634r785G485a3326J459A13496K8218o8825j5877
$$ 118761 89991 87367 128702 102068 92283 7485 -13326 -11867 113496 141714 72889 57012
14222E7012j7993J22368K1401q4612r327K4007K2697o2787M784J5720D2277c9050
$$ 57012 39019 161387 182788 98176 88849 112856 135553 72766 77550 93270 42277 -39050
14209b4268E9688k7803G216j982J2126D117d8759K0433A8574M9016M799j7057
$$ -24268 59688 31885 7216 5234 17360 4117 -48759 -28326 18574 67590 72389 55332
14197E5332L2838C6367O3749m7295b138j7869B0036N7812J0721g555i49p5183
$$ 55332 88170 36367 100116 52821 -2138 -20007 20036 77848 88569 -7555 -949 -76132
14185g6132k1715O994d2137B8801L4478b7549k1625k9615j755J3632K7020F4812
$$ -76132 -97847 -90853 -42137 28801 63279 -27549 -49174 -78789 -80544 -66912 -39892 64812
14172I8843k87L1314K9879l2249C4007B069b8327m3797P475n3777M2269a7931
$$ 98843 98556 129870 159749 127500 34007 2069 -28327 -72124 -64649 -118426 -76157 -17931
14159e4840B5160o359b4620b456F5716P0875n4905A8651A785c8671B6144K8529
$$ -54840 25160 18801 -24620 -2456 65716 136591 81686 18651 1785 -38671 26144 54673
14147E4673q088j8044L1411M5940m7446d3777M733A5800N4564f0475J911f522
$$ 54673 46585 28541 59952 105892 58446 -43777 -39044 15800 70364 -60475 -58564 -6522
14134G2913J7028k2586O578K7040m6814O2731m5054k9779J949e7833j5769B4587
$$ 72913 89941 67355 73933 100973 54159 116890 71836 42057 44006 -57833 -73602 24587
14121e9729k3600L2084r266c372j6734p072k4828b4920R327l4468l6179d0443
$$ -59729 -83329 -51245 -60511 -3372 -20106 -27178 -52006 -24920 -15593 -50061 -86240 -40443
14108D4198j2431L619J0717K8236J1594l8687C205c4628j08163L0507A5491O4370
$$ 44198 31767 35386 46103 74339 85933 47246 3205 -34628 -142791 -112284 15491 79861
14096G9861J279A467L2127A1457e0529E1860K2815o396i274A5280Q9209N5898
$$ 79861 81140 1467 33594 11457 -50529 51860 74675 68279 -9274 15280 104489 160387
14084A60387l4846j8785b7141j4743J2329B8584J7173j5282k378b6848k0269K2844
$$ 160387 125541 106756 -27141 -41884 -29555 28584 45757 30475 28097 -26848 -47117 -24273
14072b4273F5561M2491C0746A0768O055O1707j2086A5205a7308j2982H7169C0131
$$ -24273 65561 108052 30746 10768 16823 78530 66444 15205 -17308 -30290 87169 30131
14059E723P6844O5490m590j9478E7918N4846C0036b2847A422b1169j8688I4576
$$ 5723 82567 148057 143467 123989 57918 112764 30036 -22847 1422 -21169 -39857 94576
14046A0546D484J0370a4113j03458b8193n8651m5921O226c5740d859E2361a1296
$$ 10546 4484 14854 -14113 -117571 -28193 -86844 -132765 -126539 -35740 -4859 52361 -11296
14033a73887P4860J055m644L0912J7006I8078D2833d950k305A2259k418Q5854
$$ -173887 -99027 -97972 -102616 -71704 -54698 98078 42833 -4950 -7255 12259 9841 95695
14021I5695J08359K0120k2869j8493F2496j0029N2927K876D3397d8519B8718j004
$$ 95695 204054 224174 201305 182812 62496 52467 105394 108270 43397 -48519 28718 27714
14009B7714m664J57337l6072B8545J5116R108A6834J8898a2814A20627j8041J0835
$$ 27714 23050 180387 144315 28545 43661 52769 16834 35732 -12814 120627 102586 113421
13997A13421E3496d5179O818l3471b3773A27185P7730I4857h7134K028G3242A4601
$$ 113421 53496 -45179 -38361 -71832 -23773 127185 204915 94857 -87134 -85106 73242 14601
13984e9786c087o163a114E4683N3060n1867b4486q1696Q876j2468O539N0302K5049
$$ -59786 -3087 -9250 -1114 54683 107743 55876 -24486 -106182 -97306 -109774 -103235 -52933 -27884
13971b7884C0615K6942B224f2908n1794c2514h573C3634J15411p3527g1178K3089
$$ -27884 30615 57557 2224 -62908 -114702 -32514 -8573 33634 149045 75518 -71178 -48089
13959d8089b0450p693J2773B455M7875K6982J2393b8910d499A00759N7155L3425
$$ -48089 -20450 -28143 -15370 2455 50330 77312 89705 -28910 -4499 100759 157914 191339
13947A91339K3903m2164A6395c8494p7336e3007E7144N8648k523d1210k6999C4230
$$ 191339 215242 173078 16395 -38494 -115830 -53007 57144 115792 113269 -41210 -68209 34230
13934A26090N0513G6774C3542N6288q131M9115L6752j8122J2940m2200A6980g8868
$$ 126090 176603 76774 33542 89830 81699 130814 167566 149444 162384 120184 16980 -78868
13921B9714f7189r4448O0018H034J9252L7408a89q5605K5760a3590c572A02595
$$ 29714 -67189 -161637 -101619 8034 27286 64694 -189 -85794 -60034 -13590 -3572 102595
13908A48248F4429B7509j368f672A9826E054J9349P7357k0131J2513j9588J6023
$$ 148248 64429 27509 26141 -6672 19826 5054 24403 101760 81629 94142 74554 90577
13896I0577N6915l6025O526q220a9625M096A07257L8151j0574M8520q973o7637
$$ 90577 147492 111467 117993 109773 -19625 -15529 107257 145408 134834 183354 174381 106744
13884A06744k5229p562L6265o244a1356G5856k2789K6650L6041m2073E654P1109
$$ 106744 81515 73953 110218 103974 -11356 75856 53067 79717 115758 73685 5654 76763
13872G6763L1392l464K1032k6279j0018C9945b8398h119G6915k9231L824j8208
$$ 76763 108155 104691 125723 99444 89426 39945 -28398 -8119 76915 47684 51508 33300
13860C3300j338b011B5748R6023J3473j8800O1481L4449l1243G8203J5381k4715
$$ 33300 31962 -2011 25748 121771 135244 116444 177925 212374 181131 78203 93584 68869
13848F8869M1035B8240J7043c1705p148k0067k0951J4608B8734a1104B3360J7281
$$ 68869 109904 28240 45283 -31705 -38853 -58920 -79871 -65263 28734 -11104 23360 40641
13836D0641L9497k5494O4090m1319M4090q497j1L0559l0741D8995m750q047c4254
$$ 40641 80138 54644 118734 77415 121505 113008 112997 143556 112815 48995 44245 36198 -34254
13822f6028e994G2436d151F60d0408p376C4256P4738C5381O304R4665J00726K7602
$$ -66028 -5994 72436 -4151 660 -40408 -47784 34256 108994 35381 41685 136350 237076 264678
13809B64678k0223n0210n4701N2505N9087L4325o9003m545p1351C5397K2486k390
$$ 264678 244455 194245 139544 192049 251136 285461 216458 211913 140562 35397 57883 55493
13797E5493O8403L2201E9076k1684Q9494J66296l2823j24205O7101l0510L2814
$$ 55493 123896 156097 59076 37392 126886 293182 260359 136154 203255 172745 205559
13786B05559N866q3465a0554A08130J70072R1038L6807q448M2762j13753r3387
$$ 205559 211425 127960 -10554 108130 278202 369240 406047 397599 440361 326608 233221
13775B33221P5037r9694j4271q024M7104N4404k902M9060J40206l9445q1449J1868
$$ 233221 308258 208564 194293 186269 233373 287777 284875 333935 474141 434696 353247 365115
13763C65115K1173O7018o2346m4242J9161J8258P5192J0327P3128N9485p1399
$$ 365115 386288 453306 390960 346718 365879 384137 459329 469656 542784 602269 530870
13752E30870O9120N6846P20j1902R1981J29627r155P8905Q6631N8981M9886Q4802
$$ 530870 599990 656836 657556 645654 737635 867262 858107 937012 1023643 1082624 1132510 1217312
13740A217312R1831J20024N1523J31344J19140R6343m3013Q8074J40603J33058
$$ 1217312 1309143 1429167 1480690 1612034 1731174 1827517 1784504 1872578 2013181 2146239
13730B146239K9947K6118J41244K28322Q9234J49562K50372K26058K27001L51343
$$ 2146239 2176186 2202304 2343548 2571870 2661104 2810666 3061038 3287096 3514097 3865440
13720C865440M42447M55520N03751N88465O69711R47854R93105J084396J379892
$$ 3865440 4307887 4763407 5267158 5855623 6525334 7473188 8466293 9550689 10930581
13711A0930581J826394K228324K833226L655679M805703O273835Q161450J0314982
$$ 10930581 12756975 14985299 17818525 21474204 26279907 32553742 40715192 51030174
13703E1030174J2681413J5770378J9459269K3817943K8092624L2855859L8093689
$$ 51030174 63711587 79481965 98941234 122759177 150851801 183707660 221801349
13696B21801349M1836542M0911561L5510029K7204218J3898619m401909k1054208
$$ 221801349 263637891 304549452 340059481 367263699 381162318 376760409 355706201
13689C55706201l1795610l8912903m2621800m1295118l6633024l1259196k6630344
$$ 355706201 323910591 284997688 242375888 201080770 164447746 133188550 106558206
13682A06558206k2074765j7789607j4261892j1433483r223284p181086n409716
$$ 106558206 84483441 66693834 52431942 40998459 31775175 24594089 19184373
13675A9184373l902397l012490k258116j647172j207469r69059q07336p05025
$$ 19184373 15281976 12269486 10011370 8364198 7156729 6187670 5380334 4675309
13667D675309m52069m41300k62314k40255l20220k36633j58412j76026k95474
$$ 4675309 4223240 3781940 3519626 3279371 2959151 2722518 2564106 2388080 2092606
13658B092606j39764j64323q2688n1838j06767q4234k4101q3881r8872n7964n4753
$$ 2092606 1952842 1788519 1705831 1653993 1547226 1462992 1438891 1355010 1256138 1198174 1143421
13647A143421p2736j31331J4181O3679n0289r8197n3144k7213j5497m3409k9205
$$ 1143421 1070685 939354 953535 1017214 966925 868728 815584 788371 772874 729465 700260
13636G00260k8190J6050J6087j67819k8595K5198n3471l6862r994l0535J5920
$$ 700260 672070 688120 704207 536388 507793 532991 479520 442658 432664 402129 418049
13625D18049N6470M8117o5555j20322K0756N905q17k0888P8244k1862j94244K5481
$$ 418049 474519 522636 457081 336759 357515 363420 362603 341715 419959 398097 203853 229334
13613B29334O8872o6923j9170O345M8732J01936L8600n1583j18849o9075J5376
$$ 229334 298206 231283 212113 218458 267190 369126 407726 356143 237294 168219 183595
13602A83595N2718L325K4069j3068j5621l0271k4744K9184P4062j4m036m4967
$$ 183595 236313 239638 263707 250639 235018 204747 180003 209187 283249 283235 279199 234232
13590B34232q7968F9677J5176O5755P7928K0354o2051K1247n7862m3502k9635
$$ 234232 146264 69677 84853 150608 228536 248890 186839 208086 150224 106722 77087
13579G7087M2841L567E2064c7010M587A4378p69c2404I7574m40J09173J7756I6480
$$ 77087 119928 123495 52064 -37010 -32423 14378 13609 -32404 97574 97134 206307 224063 96480
13565A22961K1748J7804c2930e842D1905K4254B1897j0933J1009J08712J06557
$$ 122961 144709 162513 -32930 -5842 41905 66159 21897 10964 21973 130685 237242
13554B37242k7352l8733p9985l0704j2351N070P7603Q171F4710R4140K1882o2822
$$ 237242 209890 171157 91172 60468 48117 53187 130790 138961 64710 158850 180732 117910
13542A17910D5452L8805K2207J2936A3541d9166J4459R190R946A1450Q5091L6046
$$ 117910 45452 84257 106464 119400 13541 -49166 -34707 -25517 -15571 11450 96541 132587
13530A32587p920l3024M232L0838O1484p6855C1251a28A49461k5943C7775A210
$$ 132587 124667 91643 95875 126713 188197 111342 31251 -128 149461 123518 37775 1210
13517I0374q913n8P4092K4290k8435C7788N2036j0687o464B8445A1239l186M3763
$$ 90374 81461 81403 155495 179785 151350 37788 89824 79137 72673 28445 11239 8053 51816
13504E1816I124b1234B0700C77L8967L447A3172d897F2339r717M2393K2532k9742
$$ 51816 9124 -21234 20700 377 39344 42791 13172 -4897 62339 52622 95015 117547 87805
13491H7805m586l7755M6021j2870J8915k6431B6212e4965b3272k02j2388E555
$$ 87805 83219 45464 91485 78615 97530 71099 26212 -54965 -23272 -23474 -35862 5555
13478D2268A6583K605c496l7232B9476L8331J610J640l462b4853F4198O6690m5410
$$ 42268 16583 19188 -3496 -40728 29476 67807 69417 71057 67595 -24853 64198 130888 85478
13465H5478J4611J1536B0121c1033D4997L1483B4382a51185K8914d7542n4095
$$ 85478 100089 111625 20121 -31033 44997 76480 24382 -151185 -122271 -47542 -101637
13454a01637a5736C0641a884n7516J5226E2545j0014M9844J1732l3113f4311Q217
$$ -101637 -15736 30641 -1884 -59400 -44174 52545 42531 92375 104107 70994 -64311 -56094
13442e6094B1832K1791M8924R063B8058H700E99K0344M0606N8958B0439f8869
$$ -56094 21832 43623 92547 101610 28058 8700 599 20943 61549 120507 20439 -68869
13429f9510B2647J05956F2911K1677j6432R236m409L8256K8698j8655E9584A7693
$$ -69510 22647 128603 62911 84588 68156 77392 72983 111239 139937 121282 59584 17693
13416G03J1859M7331J28617R862J3010k4345G5356a9935b932B5081k05M1855k9874
$$ 703 12562 59893 188510 198372 211382 187037 75356 -19935 -2932 25081 24876 66731 36857
13403C6857L0654L9400l2740B0528e8161b6223C3186a9150l4028J7273D957O8124
$$ 36857 67511 106911 74171 20528 -58161 -26223 33186 -19150 -53178 -35905 4957 73081
13391G3081C0872N3229C1724i632k9201k5918b7282l1118p7428N536K3893k4844
$$ 73081 30872 84101 31724 -9632 -38833 -64751 -27282 -58400 -135828 -130292 -106399 -131243
13379a31243O2365J6799K5316l0741C0653L4097A4185d1135J0848p2073d871A2890
$$ -131243 -68878 -52079 -26763 -57504 30653 64750 14185 -41135 -30287 -102360 -4871 12890
13366A9493a4181B6706L4199A055J1602N7555M1809J1553E7847k5975L8461J0080
$$ 19493 -14181 26706 60905 1055 12657 70212 112021 123574 57847 31872 70333 80413
13354H0413a649m3450E1031c4861q80a7394m7733a8358k5445B6924L9465A9812
$$ 80413 -1649 -45099 51031 -34861 -35741 -17394 -65127 -18358 -43803 26924 66389 19812
13341e4915K0724K557F3546J0066k9264j0566R9471k672k9085k0148o128B4739
$$ -54915 -34191 -31634 63546 73612 44348 33782 133253 130581 101496 81348 75220 24739
13328D1715M4960q170q934j1884B4012b5840A01048J8931D5208B0041g9006b8604
$$ 41715 86675 78505 69571 57687 24012 -25840 101048 119979 45208 20041 -79006 -28604
13315A6400f0345I050J4257L2192A2606e8696l4227L7051F6732i2643l6203l7685
$$ 16400 -60345 9050 23307 55499 12606 -58696 -92923 -55872 66732 -92643 -128846 -166531
13303a66531N9701A4703M6018a4032p1320G5471l0568M5972j1012A3866i5577
$$ -166531 -106830 14703 60721 -14032 -85352 75471 44903 90875 79863 13866 -95577
13291G42J3a59180j26d249o2936l9201k955N1786E7208Q4152M7433P809B6395
$$ 742 755 -159180 -159306 -4249 -67185 -106386 -109341 -57555 57208 141360 188793 196602 26395
13277a67936a7572A00912k2795j138C7740a8664M600G4242L5455J8067M6577p9427
$$ -167936 -17572 100912 78117 76979 37740 -18664 -14064 74242 109697 127764 174341 94914
13265I4914l2796m580B8055f9003L1936B9953a6828L364l1547o5616b6761D2340
$$ 94914 62118 57538 28055 -69003 -37067 29953 -16828 -13464 -45011 -110627 -26761 42340
13252H2854j7554B4486d4201k7634b7880B0545O276e121g82o7542j881b2667C921
$$ 82854 65300 24486 -44201 -71835 -27880 20545 26821 -5121 -782 -68324 -70205 -22667 3921
13238I1345J0723N0123E3355c0792r398j8446a3968C5784O9591C7228a8614j032
$$ 91345 102068 152191 53355 -30792 -40190 -58636 -13968 35784 105375 37228 -18614 -19646
13226a9646m6799D3031a6473m160j4746j5098A9344P4513q624K526J14686j5322
$$ -19646 -66445 43031 -16473 -20633 -35379 -50477 19344 93857 85233 87759 202445 187123
13214A87123n1322H075b4905f761k7014C2644K4926q651j3269F426Q9796J08774
$$ 187123 135801 8075 -24905 -6761 -33775 32644 57570 48919 35650 6426 96222 204996
13202B04996L8284o4606B1618K9488j4770c5718A9759K8933r923a7783B0780b9564
$$ 204996 243280 178674 21618 51106 36336 -35718 19759 48692 38769 -17783 20780 -29564
13189e3477E326K2085h6496L2751K475J2972G3479j9543a4761F8519K7948K9246
$$ -53477 5326 27411 -86496 -53745 -51270 -38298 73479 53936 -14761 68519 96467 125713
13177A25713E2881d1290o4206c3599A21346j3329j1765l7844c3409H307b7260
$$ 125713 52881 -41290 -105496 -33599 121346 108017 96252 58408 -33409 8307 -27260
13165b1130b664q042l2371O21m996C5738a5207l6191a5577m8875K3038a2760E7086
$$ -21130 -2664 -10706 -43077 -42456 -47452 35738 -15207 -51398 -15577 -64452 -41414 -12760 57086
13151F3365l447K7469N1028j8299L9329k6366n6667A3180K7677N1428J583H723
$$ 63365 59918 87387 138415 120116 159445 133079 76412 13180 40857 92285 93868 8723
13138b7629A18832M1072N0532J2916Q533o6624M3099Q9823l1270J43276Q995K3437
$$ -27629 118832 159904 210436 223352 231885 165261 208360 298183 266913 410189 419184 442621
13126D42621J03933L0197Q355j61185m8537J42864N494m9939q3144J0505j08152
$$ 442621 546554 576751 585106 423921 375384 518248 523742 473803 390659 401164 293012
13115B93012J6734j9828l9343m1812N1089n7850G1962Q3554k8657k7506Q9597
$$ 293012 309746 289918 250575 208763 259852 202002 71962 155516 126859 99353 188950
13104A88950L6380r7450j6616E991M2069J9271B6040e5035A2845o205N3389M359
$$ 188950 225330 127880 111264 5991 48060 67331 26040 -55035 12845 6640 60029 64388
13092F4388m593k0526K3684N4703n8457a5222C9897O9767l3111e8575l9583M0168
$$ 64388 59795 39269 62953 117656 59199 -15222 39897 109664 76553 -58575 -98158 -57990
13080e7990C7151L2349B0347c9454A7972J03470L260E0838P0049p802p952M6028
$$ -57990 37151 69500 20347 -39454 17972 121442 124702 50838 120887 113085 105133 151161
13068A51161N3532P835p2015M9159G4117C6525M4740P4724G5130L5364Q8257J5656
$$ 151161 204693 212528 140513 189672 74117 36525 81265 155989 75130 110494 198751 214407
13056B14407m4841m7970m4328L28K3318L3938m7241K5465A9636a33352p6711J03910
$$ 214407 169566 121596 77268 77596 100914 134852 87611 113076 19636 -133352 -210063 -106153
13044a06153r718F8647J1276e4369K2285A5151L5633k0217a8200m438a30l4931
$$ -106153 -115871 68647 79923 -54369 -32084 15151 50784 30567 -18200 -22638 -130 -35061
13032c5061C0925O1085j6282O471M3403P46e5823o6624C6626P2230a6921F710
$$ -35061 30925 92010 75728 82199 125602 126348 -55823 -122447 36626 108856 -16921 6710
13019d6918B7634J29254o5479k2867m353A8590q856P7393l7361J8401M7588m5199
$$ -46918 27634 156888 91409 68542 64189 18590 9734 87127 49766 68167 115755 70556
13007G0556K7403O3933l9170a3406E977c9172n5599a3779D1123P7176Q809J4263
$$ 70556 97959 161892 122722 -13406 5977 -39172 -94771 -13779 41123 118299 127108 141371
12995A41371L9811E4691d0789d790E1485K0836O6148K5395j8781K594E2059n535
$$ 141371 181182 54691 -40789 -4790 51485 72321 138469 163864 145083 147677 52059 46524
12983D6524j8012e7317O259B40N900f471C8752N2550M3572K7109F7671J9171B3233
$$ 46524 28512 -57317 -51058 240 6140 -6471 38752 91302 134874 161983 67671 86842 23233
12969c1131B5317L7248P878m268c6716Q088A6767N8227c1391A0435J7155d8008
$$ -31131 25317 62565 70443 66175 -36716 -28628 16767 74994 -31391 10435 27590 -48008
12956A499P8987L7681J509l8088C9663D42N4646Q9800l5134D3836j3568j300a2283
$$ 1499 80486 118167 119676 81588 39663 442 55088 144888 109754 43836 30268 28968 -12283
12942B1717k306f9095L1721O346b183B7563O205f9201C6533J9533p784O0253J8159
$$ 21717 19411 -69095 -37374 -31028 -2183 27563 33768 -69201 36533 56066 48282 108535 126694
12929A26694m0877J4417C4228b7992i436l7511c913A2522M0163B1928e4672F1544
$$ 126694 85817 100234 34228 -27992 -9436 -46947 -3913 12522 52685 21928 -54672 61544
12916F0489O9241M154c6215A4915O4220a067j6184A25360E0845j1438P5726j9260
$$ 60489 129730 133884 -36215 14915 79135 -1067 -17251 125360 50845 39407 115133 95873
12904I5873j0845k4011a10591d4375C7860N3042P1199n7347k3805J05417n563
$$ 95873 85028 61017 -110591 -44375 37860 90902 162101 104754 80949 186366 180803
12893A80803l9797j0554m9550p111k277J1501M7420n4825d902C9132l719J6258
$$ 180803 141006 130452 80902 73791 71514 83015 130435 75610 -4902 39132 35413 51671
12881E1671m865L3027k8513c2301j00087c1160D7082G254K6499g524m4823a7758
$$ 51671 46806 79833 51320 -32301 -132388 -31160 47082 7254 33753 -7524 -52347 -17758
12868a8024B115N1328M6350K5220O8081n4898o8450j3138K6273M4158Q297k7996
$$ -18024 2115 53443 99793 125013 193094 138196 69746 56608 82881 127039 135336 107340
12856A07340k633j3390R2108a3928A251J08431k2692l9617P4894l2849J290C6421
$$ 107340 104707 91317 183425 -13928 1251 109682 86990 47373 122267 89418 90708 36421
12843G7475J6197J3042G547i4149j8954N3029A6847a0675j6822B4823D164b7042
$$ 77475 93672 106714 7547 -94149 -113103 -60074 16847 -10675 -27497 24823 4164 -27042
12830E5795K2635B2038d4664m1140k9374c4848a7185j13188J8532c7052J8225
$$ 55795 78430 22038 -44664 -85804 -115178 -34848 -17185 -130373 -111841 -37052 -18827
12819a8827l4382J5533E2229N3572l0160C3605a63D4775K7338l4388n057Q5003
$$ -18827 -53209 -37676 52229 105801 75641 33605 -163 44775 72113 37725 32668 117671
12807A17671R2891j4250p8225m0914l4208L7403k3095q550M72d842D8962P6673
$$ 117671 210562 196312 118087 77173 42965 80368 57273 48723 49195 -4842 48962 125635
12795A25635P3120n0171j1967m5175A2278L1962Q0105J1769E6499M7031L9798
$$ 125635 198755 148584 136617 91442 12278 44240 124345 136114 56499 103530 143328
12784A43328m8069D1793M5822N550M9090r020l2504m5956L9497p111d6259b1238
$$ 143328 95259 41793 87615 93165 142255 133235 100731 54775 94272 87161 -46259 -21238
12771C2682M7987A7486b7497J599E5079J9782k4644K4798J41148m9104G5741c1981
$$ 32682 80669 17486 -27497 -25898 55079 74861 50217 75015 216163 167059 75741 -31981
12758d7917D9556K6623L4511l4597j6317Q7569M0241j9897K445Q2992R292k4942
$$ -47917 49556 76179 110690 76093 59776 147345 187586 167689 170134 253126 262418 237476
12746B37476n8005G7004A8547M3472J4599N7112C6937a0783C1436F293M479d4502
$$ 237476 179471 77004 18547 62019 76618 133730 36937 -10783 31436 6293 10772 -44502
12733G747e0724l2920f602B9515f171A05885l725l2638d1387n2468d0451l597
$$ 7747 -50724 -83644 -6602 29515 -6171 105885 102160 69522 -41387 -93855 -40451 -44048
12721d4048A6659P0545O8978E8561J2090m547c5678n4749K8953j2332E7982O7390
$$ -44048 16659 87204 156182 58561 70651 66104 -35678 -90427 -61474 -73806 57982 125372
12709A25372E1363b9039p011C8798a7201A7950G699J2642J9728J917a3539G5123
$$ 125372 51363 -29039 -36050 38798 -17201 17950 7699 20341 40069 41986 -13539 75123
12696H9079A5518d2358f11p293H6673J30615N968p4929F0362j0589J00608L9341
$$ 89079 15518 -42358 -611 -7904 86673 217288 223256 148327 60362 49773 150381 189722
12684A89722o4913E6356a39I000J3137K2668a454k5794j3215p2065a6158B7690
$$ 189722 124809 56356 -139 9000 22137 44805 -1454 -27248 -40463 -112528 -16158 27690
12671A05371J224a1468l1503b1027E3140K006k3145a31205L4480l8590f6539K7392
$$ 105371 106595 -11468 -42971 -21027 53140 55146 32001 -131205 -96725 -135315 -66539 -39147
12659c9147J7820C9175R431P760j3269f5090n4169L5020A5228c677F135M6299
$$ -39147 -21327 39175 48606 56366 43097 -65090 -119259 -84239 15228 -3677 6135 52434
12647E2434N6624N4728k9528k2033A8529c49F175d733k4298n6304K076K7692a3384
$$ 52434 109058 163786 134258 112225 18529 -349 6175 -4733 -29031 -85335 -83259 -55567 -13384
12633I88Q4004L4075M9772m3465l7017k7303C0524C004K3362L9005K9491K3991
$$ 988 84992 119067 168839 125374 88357 61054 30524 3004 26366 65371 94862 118853
12621A18853B6473R652j5142K1654L3279j468j9784M0716B2616f0914K8567B5080
$$ 118853 26473 36125 20983 42637 75916 74448 54664 95380 22616 -60914 -32347 25080
12608C8933j7733a3341n0227a7251C9505a8496A19698l1290A8224D809g465k6704
$$ 38933 21200 -13341 -63568 -17251 39505 -18496 119698 88408 18224 4809 -7465 -34169
12596c4169m8080L0272B5260G73O9064M8268C7124i348B4780l12c7321k3569l2786
$$ -34169 -82249 -51977 25260 773 69837 118105 37124 -9348 24780 24468 -37321 -60890 -93676
12583i3676f998A6700b7147j3794l6328J4881a8710q1783b813G5857j4303J2281
$$ -93676 -6998 16700 -27147 -40941 -77269 -62388 -18710 -100493 -2813 75857 61554 73835
12571G3835C2445c6246C7402b70G9064P4231P5465l5467J6267L430p3724P9811
$$ 73835 32445 -36246 37402 -270 79064 153295 228760 193293 209560 212990 139266 219077
12559B19077Q31n6894G1088j4213j2535N213M5769j4784R208k8560P674M4840
$$ 219077 219908 163014 71088 56875 44340 49553 95322 80538 89746 61186 68860 113700
12547A13700k7735B5752K466a2797H432a4895A6748b489H3699C1790M8684q804
$$ 113700 85965 25752 28218 -12797 8432 -14895 16748 -2489 83699 31790 80474 71670
12535G1670A1080b8174k7956K2620Q557n000A823Q354K0990K0352P604B4875g1434
$$ 71670 11080 -28174 -56130 -33510 -24953 -29953 1823 10177 31167 51519 59123 24875 -71434
12521A9289N6337A4463c4865p3970M7665k7744A4102a3688j8267D030P922L140
$$ 19289 75626 14463 -34865 -108835 -61170 -88914 14102 -13688 -31955 4030 11952 15092
12509A5092M7216k8642O485A0042b1831G700e4m6464m618i343F510f4252n2898
$$ 15092 62308 33666 40151 10042 -21831 7700 -54 -46518 -51136 -9343 6510 -64252 -117150
12496a17150C448N8181J001j2861l132L3732N4235F2113L8776B6697L7558B6079
$$ -117150 3448 61629 62630 49769 46637 80369 134604 62113 100889 26697 64255 26079
12483E031g9666A6763d835p11F9716L0286C6533A5165d8497d859A01362l7678
$$ 5031 -79666 16763 -4835 -5546 69716 100002 36533 15165 -48497 -4859 101362 63684
12471F3684k7966j6850P0698l6192R8082n9847C6389R1806k5702l2676M0705k0414
$$ 63684 35718 18868 89566 53374 151456 91609 36389 128195 102493 69817 110522 90108
12459I0108j2208B7611G464B79N0964a4365B7813N0703K9386L2136E5897n573
$$ 90108 77900 27611 7464 279 51243 -14365 27813 78516 107902 140038 55897 50324
12447E0324c7271c474A03654j4395L6939C0567i373l3903J8610G1943Q5369L2168
$$ 50324 -37271 -3474 103654 89259 126198 30567 -9373 -43276 -24666 71943 157312 189480
12435A89480l4893j3802k5465k4992k0720L6401B0036b5863k6241K3431k7505
$$ 189480 154587 140785 115320 90328 69608 106009 20036 -25863 -52104 -28673 -56178
12424e6178m5609c1613F4001m593F835P9824k7752L8566l7714i1267c1173D8811
$$ -56178 -101787 -31613 64001 59408 6835 86659 58907 97473 59759 -91267 -31173 48811
12411D0105I537R5236R3870M3373G8836l8333l49q001m175n112P9906l2254a5750
$$ 40105 9537 104773 198643 242016 78836 40503 40154 32153 27978 22866 102772 70518 -15750
12397d1708n6556j873b1180e612B9386b0233D7892l925N662J3416M9974n2365
$$ -41708 -98264 -100137 -21180 -5612 29386 -20233 47892 43967 49629 63045 113019 60654
12385F0654L0243a5974p0889a7974P917p730n2733B7277N2861k5678K969f442
$$ 60654 90897 -15974 -86863 -17974 -10057 -17787 -70520 27277 80138 54460 57429 -6442
12372i5955N461C2880M5152P758P3854O5971l7885G0276F157e3779c729C2638
$$ -95955 -90494 32880 78032 85790 159644 225615 187730 70276 6157 -53779 -3729 32638
12359H5936B7974b7703o433A3333M7061e7296C3309a4192k1136k4068r938C1257
$$ 85936 27974 -27703 -34136 13333 60394 -57296 33309 -14192 -35328 -59396 -69334 31257
12346H3245R807Q332J0738j8106j8996M8805d6861j01536m2912e7959I8168L6227
$$ 83245 93052 101384 112122 94016 75020 123825 -46861 -148397 -191309 -57959 98168 134395
12334A34395k327C0287a7260K451n0001m4422d7444g682p0933N611J5769E5081
$$ 134395 132068 30287 -17260 -14809 -64810 -109232 -47444 -7682 -78615 -73004 -57235 55081
12321F0555d1953b0581C8804J2672B5479c8950N001F4544F434M3393a0654Q27
$$ 60555 -41953 -20581 38804 51476 25479 -38950 -33949 64544 6434 49827 -10654 -9827
12309i827C5318b326l9380I870N5422K6634I364K0828d9148B0055L8966j7193
$$ -9827 35318 -2326 -41706 9870 65292 91926 9364 30192 -49148 20055 59021 41828
12297D1828J2975j3546g665l9950l2356a5910j1020F975c3760A7002N5627c513
$$ 41828 54803 41257 -7665 -47615 -79971 -15910 -26930 6975 -33760 17002 72629 -3513
12284a8624h471m0398m256n9708b8838D0592K4704j4128a1105m4525K5457o054
$$ -18624 -8471 -48869 -53125 -112833 -28838 40592 65296 51168 -11105 -55630 -30173 -36227
12272c6227C3185Q2665O156k8071K2279P959O293k2244A1640i0201q742C1772
$$ -36227 33185 115850 122006 93935 116214 124173 130466 108222 11640 -90201 -98943 31772
12259C4896J4257J4421j3913b8245A0578b3432h906l4959R015E6261K0049Q989
$$ 34896 49153 63574 49661 -28245 10578 -23432 -8906 -43865 -34850 56261 76310 85299
12247H5299m2208j2881L086J8241o783i443D1300j104e0046a9834B6600L5739
$$ 85299 43091 30210 33296 51537 44754 -9443 41300 40196 -50046 -19834 26600 62339
12235F2339O607k7339J03354D1654d0586k1186b9543B0821M0371a4100H6707K580
$$ 62339 68946 41607 144961 41654 -40586 -61772 -29543 20821 61192 -14100 86707 89287
12223H9287k5535j1862p304Q0686j7304D8174M177M4374j0325M522l1525N6280
$$ 89287 63752 51890 44586 125272 107968 48174 52351 96725 86400 90922 59397 115677
12211A15677q430R7512m4011G0843O6897N183k1229j0636K6572k0531D4963g2414
$$ 115677 107247 204759 160748 70843 137740 142923 121694 111058 137630 117099 44963 -72414
12198h901D2139L7990C7521M3523m061P7l7815A8825f9280i063E2836P9731L8406
$$ -8901 42139 80129 37521 81044 76983 77060 39245 18825 -69280 -9063 52836 132567 170973
12185A70973q0904d9437B6156P8038k8025K6635B0576N0935O7777k0607i38n384
$$ 170973 90069 -49437 26156 104194 76169 102804 20576 71511 139288 118681 -938 -6322
12173f322D3505N4444D8028K5824j5300L3447K3070o257J0544B2331d4967A5051
$$ -6322 43505 97949 48028 73852 58552 91999 115069 108812 119356 22331 -44967 15051
12160H2874A4758g141F0548K1994C8167A421a18558j2648j4363c3337A7085g410
$$ 82874 14758 -7141 60548 82542 38167 1421 -118558 -131206 -145569 -33337 17085 -7410
12147A6580L3989k4199k80R1896j5366B7286q272L5486P0681K8479F8801l2624
$$ 16580 50569 26370 26090 117986 102620 27286 19014 54500 125181 153660 68801 36177
12135C6177K2496j1674j580O844j7746J3818J68965k1332l7826m0954m7807c5835
$$ 36177 58673 46999 45419 52263 34517 48335 217300 195968 158142 117188 69381 -35835
12122d7283G2538P4576D3598a1028m8801l4278a7494F6593r690J2104B3047h145
$$ -47283 72538 147114 43598 -11028 -59829 -94107 -17494 66593 56903 69007 23047 -8145
12109D7344j9346a2667k0837m603E7226M904h451q4468k7675j9973O9354C7501
$$ 47344 27998 -12667 -33504 -38107 57226 62130 -8451 -92919 -120594 -140567 -71213 37501
12096A8423N356a9861A12645E2411a4324q4110a1731D6721K2795k2186a1982N156
$$ 18423 23779 -19861 112645 52411 -14324 -98434 -11731 46721 69516 47330 -11982 -6826
12084f826k2143I1122o357K2488C3426M9520d8993G643f523m1310J2215C1301
$$ -6826 -28969 91122 84765 107253 33426 82946 -48993 7643 -6523 -47833 -35618 31301
12071E3587L0511I988L6377P7986A2101g6957l4593m076J1126b5868C2565N3361
$$ 53587 84098 9988 46365 124351 12101 -76957 -111550 -115626 -104500 -25868 32565 85926
12059H5926C0727g252C7599Q7358L2716n2372l8234A4565J2863c275k2074G667
$$ 85926 30727 -7252 37599 124957 157673 105301 67067 14565 27428 -3275 -25349 7667
12046d9781j8854j232m696m1759j401K7049J9474K4028n0038E1879J08977l9407
$$ -49781 -68635 -69867 -74563 -116322 -117723 -90674 -71200 -47172 -97210 51879 160856 121449
12034A21449E6815N408p507L181R7918k5029n7037K4432E674f0858K4799l3413
$$ 121449 56815 62223 54716 57897 155815 130786 73749 98181 5674 -60858 -36059 -69472
12022f9472r911J8413m4132L9106B2648b4425M525g541n1893B9237M5620j2574
$$ -69472 -79383 -60970 -105102 -65996 22648 -24425 -19900 -7541 -59434 29237 74857 62283
12010F2283L2762k3752d5673k5679b1126O027A00968R011R18O51Q5715n5461F6976
$$ 62283 95045 71293 -45673 -71352 -21126 -15099 100968 109979 110897 111548 197263 141802 66976
11996E2343B974J38797L2825l2023E3306B5975K3265e5357n2657o266c0626h797
$$ 52343 2974 141771 174596 142573 53306 25975 49240 -55357 -108014 -114280 -30626 -8797
11983H0359L1351l7534l2081Q313N18M0114m662L7390D535K108J0648b6967C8797
$$ 80359 111710 74176 42095 50408 50926 91040 86378 123768 4535 6643 17291 -26967 38797
11969G443a2539D827b6366G7633N0364m8901k4449L0981j9492J1547j343O2546
$$ 7443 -12539 4827 -26366 77633 127997 79096 54647 85628 66136 77683 76340 138886
11957A38886F3021A4442g462l830D0705h591E2173K848A9160a9530A3800Q7099
$$ 138886 63021 14442 -7462 -11292 40705 -8591 52173 55021 19160 -19530 13800 100899
11945A00899L1333K5460l5799g4683l1807b3930i103l2585o8118m7876P8811J1361
$$ 100899 132232 157692 121893 -74683 -106490 -23930 -9103 -41688 -109806 -157682 -78871 -67510
11933f7510n248A3533L6237c4660b405m461D4387C267f951C8976L8309B5692K1665
$$ -67510 -72758 13533 49770 -34660 -2405 -6866 44387 3267 -6951 38976 77285 25692 47357
11920D7357K2678B6078P1029l0507K6282N4298k7927J9685D4151K2476A9321h82
$$ 47357 70035 26078 97107 66600 92882 147180 119253 138938 44151 66627 19321 -882
11907B9136c789k2051f780F8826j1382O961M7751D3804J6211O4964n6526b434
$$ 29136 -3789 -25840 -6780 68826 57444 64405 112156 43804 60015 124979 68453 -2434
11894A4392a10649M5872E757b8254q6818l0316J4631J2576c2079E7792P5217E7659
$$ 14392 -110649 -64777 5757 -28254 -115072 -145388 -130757 -118181 -32079 57792 133009 57659
11881D3273J0730B6510Q5312k5447A9164R5861N1431o5143N9970p5299g373j14984
$$ 43273 54003 26510 111822 86375 19164 115025 166456 101313 161283 85984 -7373 -122357
11869a22357a1633I8297a7886K071m9567o4108e1941A2515L2950O5465J1696L4592
$$ -122357 -11633 98297 -17886 -15815 -65382 -129490 -51941 12515 45465 110930 122626 157218
11857A57218K9314m6517C3947a569E7899A523d181E8286M3289j093D0791j8342
$$ 157218 186532 140015 33947 -1569 57899 1523 -4181 58286 101575 100482 40791 22449
11845B2449m710b9803A671J16880L8645G1640l0439j1084R8769k5031l193k5422
$$ 22449 17739 -29803 1671 118551 157196 71640 41201 30117 128886 103855 100662 75240
11833G5240l1676B532N0829k2815O4350j6906O10D685d6144m9559B514R6155f528
$$ 75240 43564 2532 53361 30546 94896 77990 78600 4685 -46144 -95703 2514 98669 -6528
11819e9395k1971J6579b2307E985e4391K6930I7357r641N5368l8994c3183q4625
$$ -59395 -81366 -64787 -22307 5985 -54391 -27461 97357 87716 143084 104090 -33183 -117808
11807a17808m1590P2122c2207k414B1949K3337j1923J6934J903B3084b0721o8443
$$ -117808 -159398 -87276 -32207 -34621 21949 45286 33363 50297 52200 23084 -20721 -89164
11795h9164M2880F359M06R5996M6447m5108C6766j3703L3805B6832H258c7198
$$ -89164 -46284 6359 6765 102761 149208 104100 36766 23063 56868 26832 8258 -37198
11782g9888b7645B8914a3868m2411j02186N4684H9609M9734k3125k8420A4484
$$ -79888 -27645 28914 -13868 -56279 -158465 -103781 89609 139343 116218 87798 14484
11770A3940k394B577O4780k263N6749Q58k9677B9085g0239b7485D7655M7320A1910
$$ 13940 11546 2577 67357 65094 121843 122701 93024 29085 -70239 -27485 47655 94975 11910
11756g155D5827k14p624p302L8681B1713K9635h728F9170b1904j4533F65d5750
$$ -7155 45827 45613 37989 30687 69368 21713 51348 -8728 69170 -21904 -36437 665 -45750
11742F661K0175J9343H28b0132H9690l1221L4106B5962a31984N5598b5697E3055
$$ 6661 26836 46179 828 -20132 89690 58469 92575 25962 -131984 -76386 -25697 53055
11729A53438j9475B4049d0868D5298Q248M0427J912Q539N999n2002H244g0123
$$ 153438 133963 24049 -40868 45298 53546 93973 95885 104424 110423 58421 8244 -70123
11716e5866a9797E0928A4012M7285J5467d6209n2006c8967E678O1187J3578l8735
$$ -55866 -19797 50928 14012 61297 76764 -46209 -98215 -38967 5678 66865 80443 41708
11704D1708P0092D0577A6502P2158A1855O631M4204N1433J5955B2481K1479P752
$$ 41708 111800 40577 16502 88660 11855 18486 62690 114123 130078 22481 43960 51712
11692E1712B2858n127h6262p4637O0732J1366i172E3918n067L6557J9931B0156
$$ 51712 22858 17731 -86262 -160899 -100167 -88801 -9172 53918 48851 85408 105339 20156
11679e6132j19897d3371A0385f069B9260M3573k1428g012A5199N1934P9094l8163
$$ -56132 -176029 -43371 10385 -6069 29260 72833 51405 -7012 15199 67133 146227 108064
11667A08064m7068K359k3527b5038n8777m871c7491j1605a11l5047o670k3625
$$ 108064 60996 63355 39828 -25038 -83815 -88686 -37491 -49096 -111 -35158 -41828 -65453
11655f5453B3427P235d1276J8048A5455C783d2218B5360J8335a9196H5618C6732
$$ -65453 23427 30662 -41276 -23228 15455 3783 -42218 25360 43695 -19196 85618 36732
11642e7728A5899a3064m1966K6193J239k6098k3468k4109c0713b956m3025I592
$$ -57728 15899 -13064 -55030 -28837 -27598 -53696 -77164 -101273 -30713 -2956 -45981 9592
11629b4071D5022A3335K8433Q9709K2287l089m1617n1436j234O7998E8597a3571
$$ -24071 45022 13335 41768 131477 153764 150675 109058 57622 56388 124386 58597 -13571
11616e1362A2335N0510B6300b3284A3054a47j8056F3196J7114f995j5969D3158
$$ -51362 12335 62845 26300 -23284 13054 -147 -18203 63196 80310 -6995 -22964 43158
11603E2827J6680j4188K5026C9262A4206N1891O1677E6345d0791a7703P745l3583
$$ 52827 69507 55319 80345 39262 14206 66097 127774 56345 -40791 -17703 -9958 -43541
11591d3541J2259l1132p868B6842J12420O037o4497O2928L3315J8205E8844b4776
$$ -43541 -31282 -62414 -70282 26842 139262 145299 80802 143730 177045 195250 58844 -24776
11578d7065o2385L8187j9344L902k6983j30621M3040a4405J236j11546j5783m3710
$$ -47065 -109450 -71263 -90607 -86705 -113688 -244309 -201269 -14405 -13169 -124715 -140498 -184208
11566a84208g3873k005R511D1669L1698A1849N3856Q8348m7833C3286q261M7786
$$ -184208 -73873 -75878 -66367 41669 73367 11849 65705 154053 106220 33286 25025 72811
11554G2811Q3905l780K7093k6436F1250B6705g2959a4524o598E3923A9351L0838
$$ 72811 156716 152936 180029 153593 61250 26705 -72959 -14524 -21122 53923 19351 50189
11542E0189L1688K5615K5676J2444k7603k1679K1315l9812e0154k1573B015Q8321
$$ 50189 81877 107492 133168 145612 118009 96330 117645 77833 -50154 -71727 2015 90336
11530I0336P5288k3711k4567l1502R2209m4623l5496K1500M4944n1847d9083j07014
$$ 90336 165624 141913 117346 85844 178053 133430 97934 119434 164378 112531 -49083 -156097
11518a56097g6174B5831e9432m6092B188a0362A26669D6778B495g9801o7538f3649
$$ -156097 -76174 25831 -59432 -105524 2188 -10362 126669 46778 2495 -79801 -147339 -63649
11505c2125o87J0421A4796J6001K9059O9368j9389K405k9597J5888l7669K2342
$$ -32125 -32812 -22391 14796 30797 59856 129224 109835 112240 82643 98531 60862 83204
11493H3204N0448m8039l2035O191R8474l7259k0082I586M1559K1668e9858J7088
$$ 83204 133652 85613 53578 59769 158243 120984 100902 9586 51145 72813 -59858 -42770
11481d2770a6261c977l7456d171C2665A3370g606r5530r329J6478A7994q806g2397
$$ -42770 -16261 -3977 -41433 -4171 32665 13370 -7606 -103136 -112465 -95987 17994 9188 -72397
11467a20394l2487J3207e7980I205K5381I292b621G165L5743A6632e4284n1001
$$ -120394 -152881 -139674 -57980 9205 34586 9292 -2621 7165 42908 16632 -54284 -105285
11455a05285L8377C2359G932g4402k9369K9023j8050M1119A0162J2015M9806N2051
$$ -105285 -66908 32359 7932 -74402 -103771 -74748 -92798 -51679 10162 22177 71983 124034
11443A24034D3624C871K9001c6078A1350K1402A5052d244m5003n111J4746A8678
$$ 124034 43624 3871 32872 -36078 11350 32752 15052 -4244 -49247 -54358 -39612 18678
11430A7350c6136B4309N1273k0312p814n076d4516B157b1881c771k348G4604l6886
$$ 17350 -36136 24309 75582 55270 47456 42380 -44516 2157 -21881 -3771 -6119 74604 37718
11417C7718M731P5111j2058l8135B6692c6760j07191H397c9725o4112b0450E6855
$$ 37718 42449 117560 105502 67367 26692 -36760 -143951 8397 -39725 -103837 -20450 56855
11404E4135e1812b3710m3510A7182L5867b151q4904j1059K5322a0746p525E4686
$$ 54135 -51812 -23710 -67220 17182 53049 -2151 -87055 -98114 -72792 -10746 -18271 54686
11391A18077k5757K1272l2776K1369C5297h3403M23g674A30203Q8667l7399p7259
$$ 118077 92320 113592 80816 102185 35297 -83403 -82980 -7674 130203 218870 181471 104212
11379A04212i395K460i05q345E4374N3528m5586A7320R8750E4931k2367J5931
$$ 104212 -9395 -6935 -905 -9250 54374 107902 62316 17320 116070 54931 32564 48495
11367D8495N4382l4293j0257k0237A1639a9446H183J7353J05158k0462m2004A6455
$$ 48495 102877 68584 58327 38090 11639 -19446 8183 25536 130694 110232 68228 16455
11354I6212J5244J3252k8383N844d7412A4854O8610M369j1577j9160K9517a9384
$$ 96212 111456 124708 96325 102169 -47412 14854 83464 87833 76256 57096 86613 -19384
11341c4035I122J06813J0370j5755m9494h684k258A8805P9644K6696A3700P6906
$$ -34035 9122 115935 126305 110550 61056 -8684 -10942 18805 98449 125145 13700 90606
11329I0606k1733C0822Q7855l6043C4578c6389O764h87j6129H4400M7753J26923
$$ 90606 68873 30822 118677 82634 34578 -36389 -29625 -887 -17016 84400 132153 259076
11317B59076o4292b236j03785o740k838k8482J1132Q191a1234M526j6849m7586
$$ 259076 194784 -2236 -106021 -112761 -115599 -144081 -132949 -124758 -11234 -6708 -23557 -71143
11305g1143p351i127A17563p718n0493j8126h104n7279l4218b8370J0986j6114
$$ -71143 -78494 -9127 117563 109845 59352 41226 -8104 -65383 -99601 -28370 -17384 -33498
11293c3498a3031E4086Q23a0129A0545M1932K160a3101r347C5748M3547L2091
$$ -33498 -13031 54086 54909 -10129 10545 52477 54637 -13101 -22448 35748 79295 111386
11281A11386M6027G7234j2014J1847K2755B0847L954Q6685n948L3918m3730M201
$$ 111386 157413 77234 65220 77067 99822 20847 24801 111486 105538 139456 95726 99927
11269I9927l8392j488K1353K2619J2629m0713C3853a13145l3478f2678l1062Q629
$$ 99927 61535 60047 81400 104019 116648 75935 33853 -113145 -146623 -62678 -93740 -85111
11257h5111j6212p0922N6509K2759q2407O277P9395k8146k5184O1764I483b8690
$$ -85111 -101323 -172245 -115736 -92977 -175384 -169107 -89712 -117858 -143042 -81278 9483 -28690
11244i7795K3431k0200k2566j390J4020k612c9847O520E6529b9283L047B6779
$$ -97795 -74364 -94564 -117130 -118520 -104500 -107112 -39847 -33327 56529 -29283 -26236 26779
11231E1576j4468N1397l5426F712K5955j0416L8071d838C7298J24536k0260D8198
$$ 51576 37108 88505 53079 6712 32667 22251 60322 -4838 37298 161834 141574 48198
11218C829a3840F7514O0042m4137C1341P8001K1158n4100a3876l800M768A3920
$$ 3829 -13840 67514 127556 83419 31341 109342 130500 76400 -13876 -17676 -12908 13920
11205a2093n3209J6380C4782e528C2810a8070k1447k0947H806d4270C375J22875
$$ -12093 -65302 -48922 34782 -5528 32810 -18070 -39517 -60464 8806 -44270 3375 126250
11193A26250a6928n8370J6731l1112b7807k2885k178J7874A03083D1955e254p409
$$ 126250 -16928 -75298 -58567 -89679 -27807 -50692 -52870 -34996 103083 41955 -5254 -12663
11181a2663k4781m743j34493j826n059M7718n4041N8592J954K2236K2308L3127
$$ -12663 -37444 -42187 -176680 -178506 -183565 -135847 -189888 -131296 -129342 -107106 -84798 -51671
11169e1671a2424L970A02947d464k9604k5275J2895C3636c5907j2819j9202B0094
$$ -51671 -12424 -8454 102947 -4464 -34068 -59343 -46448 33636 -35907 -48726 -67928 20094
11156i286o0894a1810A7237K568N4647d507D5584J3113K3453A8945M9033B8341
$$ -9286 -70180 -11810 17237 19805 74452 -4507 45584 58697 82150 18945 67978 28341
11143D1538J5415r446b1652D0909J9140i7904a0122B7383A1643f4749K9342a0068
$$ 41538 56953 47507 -21652 40909 60049 -97904 -10122 27383 11643 -64749 -35407 -10068
11130e789A1623J8655J06536l3460m7038J0287A7322b2472g079k6068B9703c8004
$$ -5789 11623 30278 136814 103354 56316 66603 17322 -22472 -7079 -33147 29703 -38004
11117B7546K0718L5258C4558q003P5227J9945n8926d0403j6568j1474o8111e0090
$$ 27546 48264 83522 34558 26555 101782 121727 62801 -40403 -56971 -68445 -136556 -50090
11104A02288j1540M5725N2929L0708n0232N416o5303C2930c5425J6640E3841h317
$$ 102288 90748 136473 189402 220110 169878 175294 109991 32930 -35425 -18785 53841 -8317
11091d1538D2227B531L9194J5354b6377j29698N1688e2151Q175m42M818g654k0255
$$ -41538 42227 2531 41725 57079 -26377 -156075 -104387 -52151 -43976 -44418 -39600 -7654 -27909
11078b7909N777M150L351n9162j7765K9568q2808R770j7181q16O1700K0050A1287
$$ -27909 -22132 -17982 -14631 -73793 -91558 -61990 -144798 -135028 -152209 -153025 -91325 -71275 11287
11064I5258j6432I887a12333d8973B9435g9555J4719e325F161J8642M4499b4239
$$ 95258 78826 9887 -112333 -48973 29435 -79555 -64836 -5325 6161 24803 69302 -24239
11051h0202b1587F2155N085k0657c9149j3438J7261k377o290R37b1406D382g1351
$$ -80202 -21587 62155 67240 46583 -39149 -52587 -35326 -37703 -43993 -43056 -21406 4382 -71351
11037b8199A6934l465B345M4704j6690e105A2349e4846o8416L4559L2804a1150
$$ -28199 16934 13469 2345 47049 30359 -5105 12349 -54846 -123262 -88703 -55899 -11150
11024H411K9567a0193l7815k8537C878c2653C1515c9460l7806B5491O7089L8798
$$ 8411 37978 -10193 -48008 -76545 3878 -32653 31515 -39460 -77266 25491 92580 131378
11012A31378M5262J6325O218J49920J60777L2917N0797m94k07682j79463l8314
$$ 131378 176640 192965 199183 349103 509880 542797 593594 593100 385418 205955 167641
11001A67641O873J2394F5810O0933k227J5346n3812B9945M2552L9898R3088F4606
$$ 167641 174514 186908 65810 126743 124516 139862 86050 29945 72497 112395 205483 64606
10988d0590J1006j4864j3790l244r4579l6762L6296f4649F372b2455m122B0167
$$ -40590 -29584 -44448 -58238 -61482 -156061 -192823 -156527 -64649 6372 -22455 -26577 20167
10975D8888H887J2526l649h2531o5446L6312d0260k6097K2028P519f768l0742
$$ 48888 8887 21413 17764 -82531 -147977 -111665 -40260 -66357 -44329 -36810 -6768 -37510
10963c7510l6371L1577J0472a371F1840J8584K9275R112l1970l1405f5876p2823
$$ -37510 -73881 -42304 -31832 -1371 61840 80424 109699 118811 86841 55436 -65876 -138699
10951a38699M6649d629D8144M3116R1593p3896R473J30676J55099Q4101n7996
$$ -138699 -92050 -4629 48144 91260 182853 108957 118430 249106 404205 488306 430310
10940D30310k2276O1522m3766J26697J10819N3480J45065J17193R425l986j10720
$$ 430310 408034 469556 425790 552487 663306 716786 861851 979044 988469 984483 873763
10929H73763j30308Q1117J91596J56326K25899K3605j93663k25800j51586q0964
$$ 873763 743455 824572 1016168 1172494 1398393 1421998 1228335 1002535 850949 769985
10919G69985Q0748r3224M5748O4050J86r1424j30683j38918q8652P1541K275P7757
$$ 769985 850733 757509 803257 867307 867493 776069 645386 506468 417816 489357 491632 569389
10907E69389L382p1038o7333j69408j25432C9047j7901E32d8813I329c4122k0154
$$ 569389 572771 501733 434400 264992 139560 39047 21146 532 -48813 9329 -34122 -54276
10895e4276L698e447j6274H415L5619N8674k4872C8720b5305n9122b8782B422
$$ -54276 -50578 -5447 -21721 8415 44034 102708 77836 38720 -25305 -84427 -28782 2422
10882e9620b1813J0276j05782j1169r962O646L4631c0989H1174k1053a04742N794
$$ -59620 -21813 -11537 -117319 -128488 -138450 -131804 -97173 -30989 81174 60121 -104742 -98948
10870i8948m5525k6195Q2178c8918a1586j9542o7801c5414j6481n5992M8121D4004
$$ -98948 -144473 -170668 -88490 -38918 -11586 -31128 -98929 -35414 -51895 -107887 -59766 44004
10857A48606C0249a7795l9274o2913q1617g8378a8151o1579A9968a9742j23070
$$ 148606 30249 -17795 -57069 -119982 -201599 -78378 -18151 -79730 19968 -19742 -142812
10846a42812o3356L8468e2043E8823b77085K7195L4016O603K826P9366n40J563
$$ -142812 -206168 -167700 -52043 58823 -277085 -249890 -215874 -209271 -206445 -127079 -127619 -126056
10834a26056L3686p4953K1958e4220D4056J04549j223H659b6165A0372M693d3641
$$ -126056 -92370 -167323 -145365 -54220 44056 148605 147382 8659 -26165 10372 15065 -43641
10821c5242g415G105b5017D6715e8110p0875J5063M9655B0372F360a12534N0l5780
$$ -35242 -7415 7105 -25017 46715 -58110 -128985 -113922 -64267 20372 6360 -112534 -112484 -148264
10808a48264b7749E4234j5746b1040j2556D5249J7522A7197Q515g2837b5506l8036
$$ -148264 -27749 54234 38488 -21040 -33596 45249 62771 17197 25712 -72837 -25506 -63542
10796f3542E167f2126q1245l5465K3185d6318K2546D2050J6870J3990l0940O9796
$$ -63542 5167 -62126 -143371 -178836 -155651 -46318 -23772 42050 58920 72910 41970 111766
10784A11766D32h2681p4056O4446a7744K149A6764b5061o0024j3426l5062L064
$$ 111766 432 -82681 -156737 -92291 -17744 -15595 16764 -25061 -85085 -98511 -133573 -130509
10772a30509N3093a1369B5454A0989a6658j5490n5225l261c6993J503R770A5746
$$ -130509 -77416 -11369 25454 10989 -16658 -32148 -87373 -90634 -36993 -35490 -25720 15746
10759b2363j9624p7753f541E7660o145E715P765g2271l2315j1747a8200I8699
$$ -22363 -41987 -119740 -6541 57660 51515 5715 13480 -72271 -104586 -116333 -18200 98699
10746D2469l11d291q5673m7570a6604o3289K016L2806L592G7690l4152d3890j305
$$ 42469 42158 -4291 -89964 -137534 -16604 -79893 -77877 -45071 -41479 77690 43538 -43890 -45195
10733d5195R421j00610e323A01474P8599l7289B9895K5080L1125k4655b6453m912
$$ -45195 -35774 -136384 -5323 101474 180073 142784 29895 54975 86100 61445 -26453 -31365
10721c1365I651N9004d9149p596p3884m8987M8301M8450c210l6816j06737M1590
$$ -31365 9651 68655 -49149 -56745 -130629 -179616 -131315 -82865 -3210 -40026 -146763 -105173
10709a05173d1691A1398l809L085K7951K332J7859K4810B4884K576b8200A9549
$$ -105173 -41691 11398 7589 10674 38625 40957 58816 83626 24884 27460 -28200 19549
10696F5188R1444J4432J5492n9306D3063h336j06183K3749K9584g203E0396N51
$$ 65188 156632 171064 186556 127250 43063 -8336 -114519 -90770 -61186 -7203 50396 50947
10684E0947J997M0757M7637F7572Q0307O1133p6587B3090c9257J7710F0524N5629
$$ 50947 52944 93701 141338 67572 147879 209012 132425 23090 -39257 -21547 60524 116153
10672A16153J7555k0666L5951J8668n0503n7137R5115k4878j7873P151j1803K4553
$$ 116153 133708 113042 148993 167661 117158 60021 155136 130258 112385 119536 107733 132286
10660A32286R2410l4268J28560M1639j3863j1173L7441P976p295j9663K8337m2222
$$ 132286 224696 190428 318988 360627 346764 335591 373032 381008 373713 354050 382387 340165
10648C40165j0448M6809L3658O0657J0018o4966L9096R5809K4466j0646O827L3472
$$ 340165 329717 376526 410184 470841 480859 415893 454989 550798 575264 564618 571445 604917
10636F04917k0165O671P6599m9296m3787J09047R9160J19002J16058j0131K9546
$$ 604917 584752 591423 668022 618726 574939 683986 783146 902148 1018206 1008075 1037621
10625A037621J92799L16350K39492L10261K79957K23802J20085J4283N5141M0534
$$ 1037621 1230420 1546770 1786262 2096523 2376480 2600282 2720367 2734650 2789791 2830325
10615B830325J55519K81747L92168L32834K75690K07090J95424J75587K81030
$$ 2830325 2985844 3267591 3659759 3992593 4268283 4475373 4670797 4846384 5127414
10606E127414L68682O77607O50961P32987Q49374Q91751J235217J494747K007258
$$ 5127414 5496096 6173703 6824664 7557651 8407025 9298776 10533993 12028740 14035998
10597A4035998K911840L898031N587715P886888J1139115J5486534K0446048K4189337
$$ 14035998 16947838 20845869 26433584 34320472 45459587 60946121 81392169 105581506
10589A05581506K2629264J2252407j101352o685917j567706R305999K2744171
$$ 105581506 128210770 140463177 139361825 132675908 131108202 140414201 163158372
10582A63158372L5249990M0194912K8025185O19384k0579947k1162403o574197
$$ 163158372 198408362 238603274 266628459 267247843 246667896 225505493 218931296
10575B18931296J4587403L5998776N0443760M4482603J0150892l2466004n1736491
$$ 218931296 233518699 269517475 319961235 364443838 374594730 342128726 290392235
10568B90392235m4686221k5097120l073166J5486875K3046733J1005227j6503319
$$ 290392235 245706014 220608894 217535728 233022603 256069336 267074563 250571244
10561B50571244l7337647l9232589k9032880j5416596k853789N458472N102187
$$ 250571244 213233597 174001008 144968128 129551532 126697743 132156215 137258402
10554A37258402n569312j8753249k4374574k2392380j7663448j2832945r006577
$$ 137258402 131689090 112935841 88561267 66168887 48505439 35672494 26665917
10547B6665917o287082m549542l096083k245464j625549j141485r40680q25286
$$ 26665917 20378835 15829293 12733210 10487746 8862197 7720712 6780032 5954746
10539E954746o82900n04014m27572j94366l45544k81703j98923j41937j56393
$$ 5954746 5271846 4767832 4340260 4145894 3800350 3518647 3319724 3177787 3021394
10530C021394k15967k14825j15307n3701j0899j82380j59964j07764q6027n1857
$$ 3021394 2805427 2590602 2475295 2421594 2410695 2228315 2068351 1960587 1874560 1822703
10520A822703p6854j69440o5899K1525n7079k2580j01011j02303o4770r391p0986
$$ 1822703 1745849 1576409 1510510 1532035 1474956 1452376 1351365 1249062 1184292 1174901 1103915
10509A103915j8319l874j8637r3709n9365l4118J6213P4024j61061m1694P6736
$$ 1103915 1085596 1081722 1063085 969376 910011 875893 892106 966130 805069 763375 840111
10498H40111o4871j7395m9914O7989j46771L1237o9904L8663n6943j41M1383p4745
$$ 840111 775240 757845 707931 775920 629149 660386 590482 629145 572202 572061 613444 538699
10486E38699M8068p4404Q8521j6222k0411o8612p3838N3923O6487R5964J5219
$$ 538699 586767 512363 600884 584662 564251 495639 421801 475724 542211 638175 653394
10475F53394n7613p2971l6653L3739N6848k7047r2066R1117l1211l4425l9143
$$ 653394 595781 522810 486157 519896 576744 549697 457631 548748 517537 483112 443969
10464D43969O814M3014J263l3823o7569k0950O995J1496Q5662L1783p6450m9760
$$ 443969 450783 493797 495060 461237 393668 372718 379713 391209 476871 508654 432204 382444
10452C82444k0257p2637r985j10356K3407L1710q0401k3013N647M4193N8797K130
$$ 382444 362187 289550 279565 169209 192616 224326 143925 120912 126559 170752 229549 231679
10440B31679K8263q084k4830J06385N6657l7154j1075J2869m3956l8864k5643
$$ 231679 259942 251858 227028 333413 390070 352916 341841 354710 310754 271890 246247
10429B46247M5075R6286q1958j19842Q7341Q1109r0263m2868J1317J3375J8065
$$ 246247 291322 387608 305650 185808 273149 354258 263995 221127 232444 245819 263884
10418B63884M1063r783K3660p1660N061O740m0167n8864M8068N0733m5393J4550
$$ 263884 304947 295164 318824 247164 252225 258965 218798 159934 208002 258735 213342 227892
10406B27892o1895P6421k8861j0081m3081J7615L5229j669m6242m4006P0712J4267
$$ 227892 165997 242418 213557 203476 160395 178010 213239 211570 165328 121322 192034 206301
10394B06301l9057j6907Q6780k8751O0035M5718k0163N1695N4267J8896o4410
$$ 206301 167244 150337 237117 208366 268401 314119 293956 345651 399918 418814 354404
10383C54404j9529L4470p1729j28631o5719l7675J40306M4102J1332n5410k7446
$$ 354404 334875 369345 297616 168985 103266 65591 205897 249999 261331 205921 178475
10372A78475l6182D9931Q7413k9520L5919m2465r92M396Q0220n9123K5707M073
$$ 178475 142293 49931 137344 107824 143743 101278 100286 104682 184902 125779 151486 155559
10360A55559m1193k2140L1788m5655K6083m6308K7480J1362K7336k2694B8516
$$ 155559 114366 92226 124014 78359 104442 58134 85614 96976 124312 101618 28516
10348a0750G0013O4836K6283o5839m2026m510K5494K2810l1916B7926N4112N1980
$$ -10750 70013 134849 161132 95293 53267 48757 74251 97061 65145 27926 82038 134018
10336A34018m7535J2470L3630N2323n1165j9112k6578j0533L9475L9438l3839
$$ 134018 86483 98953 132583 184906 133741 114629 88051 77518 116993 156431 122592
10325A22592J56K6895l0850A4642f7693C499N8418J0128M1385m6076O3115J731
$$ 122592 122748 149643 118793 14642 -67693 3499 61917 72045 113430 67354 130469 132200
10313A32200o0945B1473M0723K2667R347j1439n062K4863J13294L7453q746n0630
$$ 132200 71255 21473 62196 84863 94210 82771 77709 102572 215866 253319 244573 193943
10301A93943I1854P1985N177L7447o7998K388l9895n169L5048j1761O6139J22122
$$ 193943 91854 163839 169016 206463 138465 140853 100958 95789 130837 119076 185215 307337
10289C07337J30937J16238Q5067O9879m0606m1268j72346j80161n7058k879I3239
$$ 307337 438274 554512 639579 709458 668852 627584 455238 275077 218019 215140 93239
10277F6084N6382C3508M9425O4797k0819q025M9568J8600n6372m102P0647L787
$$ 66084 122466 33508 82933 147730 126911 118886 168454 187054 130682 126580 197227 201014
10265B01014k5907M4865m3029n6346f157k1759J2045A20152M6006o6529m7851
$$ 201014 175107 219972 176943 120597 -6157 -27916 -15871 120152 166158 99629 51778
10254E1778k0007L4757K1466Q5323M8326N1407o5118j9346K9391K739j2475o3356
$$ 51778 31771 66528 87994 173317 221643 273050 207932 188586 217977 220716 208241 144885
10242A44885r339n8836A8485K7156R8058j8552n6711R2757L5489k7759J23189
$$ 144885 135546 76710 18485 45641 143699 125147 68436 161193 196682 168923 292112
10231B92112K7653p6046O8113N5698J64729Q5567J56266n2967j19397l3063J27395
$$ 292112 319765 243719 311832 367530 532259 617826 774092 721125 601728 568665 696060
10220F96060J37462N1396J11593Q2335q0532p4296o249K3582L182J80265K51800
$$ 696060 833522 884918 996511 1078846 998314 924018 917769 941351 944533 1124798 1376598
10209A376598N7145N1571r8098j97657j24125j83168j08228J11814J16810O0066
$$ 1376598 1433743 1485314 1387216 1189559 1065434 882266 774038 885852 1002662 1062728
10199A062728Q0447j17634k21330j07362l0358o4215j70P266p727m6443k5039
$$ 1062728 1143175 1025541 804211 696849 666491 602276 602106 609372 601645 555202 530163
10188E30163m7843r1820j3373o8399n4969q2129G1118M1348p539E1366Q4596j30
$$ 530163 482320 390500 377127 308728 253759 171630 71118 112466 104927 51366 135962 135832
10176A35832M451m8159a0020p692B570e9501b975q467B6699R9410J10683k577
$$ 135832 140283 92124 -10020 -17712 2570 -59501 -2975 -11442 26699 126109 236792 234215
10164B34215r8431D5612J17540K3714q8868m8329E671p89K574L6767c2714A7991
$$ 234215 135784 45612 163152 186866 97998 49669 5671 4882 7456 44223 -32714 17991
10151F1030J8944k2064J290K7599q761L2716o159P6230N5171J3704o3670F5057
$$ 61030 79974 57910 59200 86799 78038 110754 104595 180825 235996 249700 186030 65057
10138A73083O205o6345D3776N0084J5309K2569J03252l6626p8953l9495b8291
$$ 173083 179288 112943 43776 93860 109169 131738 234990 198364 119411 79916 -28291
10126i8404B0824L7250Q508K0647j6268J11552l9568Q419o432D8939a6267C6642
$$ -98404 20824 58074 66582 87229 70961 182513 142945 151364 144932 48939 -16267 36642
10113A14528L1711M3327L8163A13350B4894K4781F289K3649K4736E477M3142J2997
$$ 114528 146239 189566 227729 113350 24894 49675 6289 29938 54674 5477 48619 61616
10101F1616J5990j2654k9264J4350e2598A6135L8515a26086d7744A6651L4868
$$ 61616 77606 64952 35688 50038 -52598 16135 54650 -126086 -47744 16651 51519
10090E1519R653P109j6597j7346O6630N1454j9384j1685L106n7112K8081l3710
$$ 51519 61172 68281 51684 34338 100968 152422 133038 121353 124459 67347 95428 61718
10078F1718g1809e621A4235J1282N7219M8266K7844E6432A5684a9007m6011a2155
$$ 61718 -71809 -5621 14235 25517 82736 131002 158846 56432 15684 -19007 -65018 -12155
10065A13923m5566N4442j9223j1950K0653G509L197Q0841f314l7724I598R4108
$$ 113923 68357 122799 103576 91626 112279 7509 10706 91547 -6314 -44038 9598 103706
10053A03706m6398N8320E6889M3909j1590j6954M4582O9516o4054o0553E929J8681
$$ 103706 57308 115628 56889 100798 89208 72254 116836 186352 122298 61745 5929 24610
10041B4610N9494N2941k5920D7754K4063P1681m7718m7061d6751C9618M8047j0109
$$ 24610 84104 137045 111125 47754 71817 143498 95780 48719 -46751 39618 87665 77556
10029G7556O2490n0052j3549J37777q6346E1036B0778M2060e5050E236O2249K0115
$$ 77556 140046 89994 76445 214222 127876 51036 20778 62838 -55050 5236 67485 87600
10017H7600L5287m6482j1642j1950K0862j1447j161d0577k1257a0621E2166B4260
$$ 87600 122887 76405 64763 52813 73675 62228 61067 -40577 -61834 -10621 52166 24260
10004a0889p7415a3482C0489m840N4821Q5094m236n5107j6335P5852l0246M055
$$ -10889 -88304 -13482 30489 25649 80470 165564 161328 106221 89886 165738 135492 139547
9992A39547B8003o4d6106j7992A8885P0621L1988m9265b0981C3942M3629l8548
$$ 139547 28003 27939 -46106 -64098 18885 89506 121494 72229 -20981 33942 77571 39023
9980C9023J4520M8236k6497c8658I7777J14502H8596l1840K2987A3081d8776r450
$$ 39023 53543 101779 75282 -38658 97777 212279 88596 56756 79743 13081 -48776 -58226
9968e8226C5666c130F091P6883L3993N7020j261n1700E8697p655L4990K2471R3171
$$ -58226 35666 -3130 6091 82974 116967 173987 172726 121026 58697 51042 86032 108503 201674
9955B01674J2988D0893a1849a179r4653K6931L1242j61l0683b6676f942k4997
$$ 201674 214662 40893 -11849 -1179 -95832 -68901 -37659 -37820 -68503 -26676 -6942 -31939
9943c1939B2009J1650l428M1218J09741N8784l9437r3720Q574P6022l2025K816
$$ -31939 22009 33659 30231 71449 181190 239974 200537 106817 115391 191413 159388 162204
9931A62204m9488l3655l2106J6829a2966r9711M1831L443K5380j7114l692q999
$$ 162204 112716 79061 46955 63784 -12966 -112677 -70846 -67403 -42023 -59137 -62829 -71828
9919g1828C2247J636c2423a1923C7650K0968K0226L0641L3209n9280B9852e468
$$ -71828 32247 33883 -32423 -11923 37650 58618 78844 109485 142694 83414 29852 -5468
9906d5531H3677P6090o5460k4214K3970C6810j023M1554L852C5967L3093L1942
$$ -45531 83677 159767 94307 70093 94063 36810 35787 77341 81193 35967 69060 101002
9894A01002L1851n9533J0784J8366J689l1597l0594A5265O2788K7686C0392a4492
$$ 101002 132853 73320 84104 102470 104159 72562 41968 15265 78053 105739 30392 -14492
9881c8667a7501E1033L2510q576e313E2844j3302O5355P965k3544l2955d9152
$$ -38667 -17501 51033 83543 74967 -5313 52844 39542 104897 112862 89318 56363 -49152
9868A2156h42F3078k5594A6685b965I6N7520i829k0808C3425A5455J03914Q6294
$$ 12156 -842 63078 37484 16685 -2965 96 57616 -9829 -30637 33425 15455 119369 205663
9855B05663J9543o7788k2234F7008A1369b7876G8901N9571B9088L3741N2619N4763
$$ 205663 225206 157418 135184 67008 11369 -27876 78901 138472 29088 62829 115448 170211
9843A70211n1743R679J4361E8251c0119A0612N9420L4399L3995k0387E6038n735
$$ 170211 118468 128147 142508 58251 -30119 10612 70032 104431 138426 118039 56038 50303
9831E0303J2479O0793K2109k5570j4464k8734L9248K5640o108m2433L9616F0270
$$ 50303 62782 123575 145684 120114 105650 76916 116164 141804 135696 93263 132879 60270
9818I95b8316O62F642J3294J9744d341o3130b8376n4469k8730J6240K5058C744
$$ 995 -28316 -27654 6642 19936 39680 -4341 -67471 -28376 -82845 -111575 -95335 -70277 3744
9804D2440K6094b1151E2317l214M3371j6794b6536A4904A620J15456J4540p55
$$ 42440 68534 -21151 52317 49103 92474 75680 -26536 14904 1620 117076 131616 130861
9792A30861E8263K8552C6832K0405B4480a2541C0995K8707N817l1050L4201F306
$$ 130861 58263 86815 36832 57237 24480 -12541 30995 59702 65519 34469 68670 6306
9779a07274M3583b5600B0808D69f0414n057b7942O991A0322a9251m3833b6658
$$ -107274 -63691 -25600 20808 469 -60414 -65471 -27942 -20951 10322 -19251 -63084 -26658
9766D1428J9393p453o819k2708J99824n835G8306k1483L74K4484a6212B3637L6661
$$ 41428 60821 53368 46549 23841 223665 217830 78306 56823 57197 81681 -16212 23637 60298
9753F0298L2578j5518O01J07000k3322n951n9050A7071d9629J2701E3014j6266
$$ 60298 92876 77358 77959 184959 161637 155686 96636 17071 -49629 -36928 53014 36748
9741C6748b9817A2460b5669o5263M074K5476L0087a2894n5697g955B5409a6695
$$ 36748 -29817 12460 -25669 -90932 -86858 -61382 -31295 -12894 -68591 -7955 25409 -16695
9728A202a9203n7769j0102M324B7467L0355p527L007J3861E649a2499F6132M0765
$$ 1202 -19203 -76972 -87074 -82750 27467 57822 50295 53302 67163 5649 -12499 66132 106897
9715A06897A6320K7280J24493n3238j3338r892k4274a8551o6087L1397o0186K2041
$$ 106897 16320 43600 168093 114855 101517 91625 67351 -18551 -84638 -53241 -113427 -91386
9703i1386b6731m0173J7613k0394K3664B172a9915c970E2159a6550C2558f639
$$ -91386 -26731 -66904 -49291 -69685 -46021 2172 -19915 -3970 52159 -16550 32558 -6639
9690i2914j9948K6941Q010b1124B8594J650J7764R6277n4504L3415D064g8706
$$ -92914 -112862 -85921 -77911 -21124 28594 30244 48008 144285 89781 123196 4064 -78706
9677c8534K067B4314b5647l2759a8185D5068a4168n8715Q401r2060J926f813D6989
$$ -38534 -36467 24314 -25647 -58406 -18185 45068 -14168 -72883 -64482 -156542 -154616 -6813 46989
9663C9202L1182j1278A8415B850d1101A03099L1086C9588J6248j133O9581j3617
$$ 39202 70384 59106 18415 2850 -41101 103099 134185 39588 55836 54703 124284 110667
9651A10667K281K8027l7584K6394o427M3558p9850C5530Q7658P5729o1338I6g3974
$$ 110667 112948 140975 103391 129785 123358 166916 87066 35530 123188 198917 137579 96 -73974
9637f5697A03518K5963A21J7819L7598M129E248b1373m0892k3993d1755f901o7267
$$ -65697 103518 129481 121 17940 55538 59667 5248 -21373 -62265 -86258 -41755 -6901 -74168
9624g4168p1908K2346N3514L2149l4936K9515m3717b6600D8449j9926E802M766
$$ -74168 -146076 -123730 -70216 -38067 -73003 -43488 -87205 -26600 48449 28523 5802 10568
9612A0568J12392B9939K0872J5637H541i0397K0556p2070L6202e354p582m6161
$$ 10568 122960 29939 50811 66448 8541 -90397 -69841 -141911 -105709 -5354 -12936 -59097
9600e9097h510B9502K7259Q178a5481j7276Q084m2107R578a4502C802K0276c7902
$$ -59097 -8510 29502 56761 64939 -15481 -32757 -24673 -66780 -57202 -14502 3802 24078 -37902
9586h2295L3251a4349A2323b4568A0792L1240J6901b7631J0465g260D8767l755
$$ -82295 -49044 -14349 12323 -24568 10792 42032 58933 -27631 -17166 -7260 48767 45012
9574D5012J33341j2354o1749j3864M2680j7532m2246a5651k4329a2331k9025B0242
$$ 45012 178353 165999 104250 90386 133066 115534 73288 -15651 -39980 -12331 -41356 20242
9561a8403B2943N315J7517e9D466O3125C1114K3013B5997b0234A11268E3689n16
$$ -18403 22943 28258 45775 -59 4466 67591 31114 54127 25997 -20234 111268 53689 53173
9548E3173A0724M8690K0684B7596M2253K6559K0189M2155l7972n6879L7353L162
$$ 53173 10724 59414 80098 27596 69849 96408 116597 158752 120780 63901 101254 104416
9536A04416K265A0221i7756K6204l9722K1267c634k3799Q448E8603K5095J4244
$$ 104416 106681 10221 -97756 -71552 -111274 -90007 -3634 -27433 -18985 58603 83698 97942
9524I7942P366C9692K5972K4097K3035P519O2823k9295n5510k7164e3521r2305
$$ 97942 105308 39692 65664 89761 112796 120315 183138 153843 98333 71169 -53521 -145826
9512a45826O5149D8587b7675j03438L4839e618A1974N946J1340J6323R232d1408
$$ -145826 -80677 48587 -27675 -131113 -96274 -5618 11974 17920 29260 45583 54815 -41408
9499a58024l5216g8688n0651O4237a9510d238o4438j4699R359B8801L5565j037
$$ -158024 -193240 -78688 -129339 -65102 -19510 -4238 -68676 -83375 -74016 28801 64366 63329
9487F3329m788J8710j3902j5607p58j2984L5004G39d8070k8009f502F3836O8558
$$ 63329 58541 77251 63349 47742 46984 34000 69004 739 -48070 -76079 -6502 63836 132394
9474A32394K9479E6196e5407o0937J9360d3170i156j458j3678d573o5975n8895
$$ 132394 161873 56196 -55407 -116344 -96984 -43170 -9156 -10614 -24292 -4573 -70548 -129443
9462a29443N4800d91F655L1622R946J597B3620a4657B4281d0362O128a1810n6363
$$ -129443 -74643 -491 6655 38277 48223 49820 23620 -14657 24281 -40362 -34234 -11810 -68173
9449f8173j00389N3639A8230M0937B6516K6254L1273a842j3658n5796f119C6008
$$ -68173 -168562 -114923 18230 59167 26516 52770 84043 -1842 -15500 -71296 -6119 36008
9436A41592m1514j4212r429j869M3363D8114P729c6441o5997k2572k0302f6118
$$ 141592 100078 85866 76437 74568 117931 48114 55843 -36441 -102438 -125010 -145312 -66118
9423F4617A8505K7890J9500R376A8440N5882C443P7519K205D334O6656K8009M6303
$$ 64617 18505 46395 65895 75271 18440 74322 3443 80962 83167 4334 70990 98999 145302
9410A45302J698p2851J3256K6892O185Q728m5482A0149L6896M4766l5526c5460
$$ 145302 147000 74149 87405 114297 120482 129210 83728 10149 47045 91811 56285 -35460
9397d3870A0623N8942A9678f045E0406A4182b1627r4210k4693L2077l8649g3180
$$ -43870 10623 69565 19678 -6045 50406 14182 -21627 -115837 -140530 -108453 -147102 -73180
9384A9868P6956m953m5060j484J422M1249J6510M4183O2831o3042I348I04f7218
$$ 19868 96824 91871 46811 45327 46749 87998 104508 148691 211522 148480 9348 904 -67218
9370e859m6381j7967Q096l2204M5282A1394c5083l237o3808M0474B9916h796G0447
$$ -5859 -52240 -70207 -62111 -94315 -49033 11394 -35083 -38320 -102128 -61654 29916 -8796 70447
9356A15326m0524k0550K7227a9708e692k0153D2354N1162b178G1791B2062c7178
$$ 115326 74802 54252 81479 -19708 -5692 -25845 42354 93516 -2178 71791 22062 -37178
9343A05170j2852Q905j7803j5560M190k2165c9736m0218j3044o415d5700C2111
$$ 105170 92318 101223 83420 67860 72050 49885 -39736 -79954 -92998 -99413 -45700 32111
9330A7532B351M7030c1327p9388m126m546a9565n9150E5993M8218a0915K470q0617
$$ 17532 2351 49381 -31327 -110715 -114841 -119387 -19565 -78715 55993 104211 -10915 -8445 -89062
9317h9062J8094j5288g216E1769J36063M5619I2806l5991j3286e6584a051l7179
$$ -89062 -70968 -86256 -7216 51769 187832 233451 92806 56815 43529 -56584 -1051 -38230
9305c8230a7587B5516d2197A4265O2046P694D1224K9096c5699j2017C0377b8961
$$ -38230 -17587 25516 -42197 14265 76311 84005 41224 70320 -35699 -47716 30377 -28961
9292h1028B7555P6372l9814j6491K4735B5112f619k9248J1705B3403L4185K1650
$$ -81028 27555 103927 64113 47622 72357 25112 -6619 -35867 -24162 23403 57588 79238
9280G9238j7966h477o5614I496J12755D1508A7796M7330A9114a0174m713l7157
$$ 79238 61272 -8477 -74091 9496 122251 41508 17796 65126 19114 -10174 -14887 -52044
9268e2044C6168d4267n4113m3884J0332e784C6030J3881c6307l9558B453N3285
$$ -52044 36168 -44267 -98380 -142264 -131932 -5784 36030 49911 -36307 -75865 2453 55738
9256E5738j9109n591d0971c50C3795j3225J9598L5096N506N399A8338b2263F7351
$$ 55738 36629 31038 -40971 -350 33795 20570 40168 75264 80770 86169 18338 -22263 67351
9242A41342j5942M379C2301a3067F9138K4012l7909N890d51p2199b3160H5711
$$ 141342 125400 129779 32301 -13067 69138 93150 55241 61131 -451 -72650 -23160 85711
9229E9062a891A4100J9019Q9116J2657j4969j5309K1324L5227q848E1272A2868
$$ 59062 -1891 14100 33119 122235 134892 119923 104614 125938 161165 152317 51272 12868
9216E2927B0276i5215K4957k0944j5747P53b2138I59J4944C937f4506j0689H3875
$$ 52927 20276 -95215 -70258 -91202 -106949 -106196 -22138 959 15903 3937 -64506 -75195 83875
9202b6484j1864I9474o491j7482b2448n157D3916i09B7384P5068O8276E4281P941
$$ -26484 -38348 99474 92983 75501 -22448 -27605 43916 -909 27384 102452 170728 54281 62222
9189F2222H356e5894A30220l0582l4679n598J3521B9904d2589j23817m397L5358
$$ 62222 8356 -55894 130220 99638 64959 59361 72882 29904 -42589 -166406 -170803 -135445
9177a35445a0244A5345K12J08839L7316C0128f6833n3252M5619j1428A1400n168
$$ -135445 -10244 15345 15557 124396 161712 30128 -66833 -120085 -74466 -85894 11400 6232
9165F232d819F7817P0448J3348E5768J3115i7518m0702p773N9938k5446k1690
$$ 6232 -4819 67817 138265 151613 55768 68883 -97518 -138220 -145993 -86055 -111501 -133191
9153a33191N2555b8208H683N9490A0117a19079B0595L1116h944D5164R0263E8085
$$ -133191 -80636 -28208 8683 68173 10117 -119079 20595 51711 -8944 45164 135427 58085
9140B3560J01045E6408c7007i271G9974l409l4326d8649k250B5344C0d4248a1212
$$ 23560 124605 56408 -37007 -9271 79974 76565 42239 -48649 -50899 25344 30 -44248 -11212
9126c465q1569j2192n609J2820B2502c1116n3811m8340L2711R793d4534a3927
$$ -3465 -85034 -97226 -102835 -90015 22502 -31116 -84927 -133267 -100556 -90763 -44534 -13927
9113c8821l5495b6889J2803E0102J3195b5137B5106J11595F2379k4179j0724f3459
$$ -38821 -74316 -26889 -14086 50102 63297 -25137 25106 136701 62379 38200 27476 -63459
9100f0911a060D1689e0395k120J6897J5530P991p895l2257J0630d886a99m4509
$$ -60911 -1060 41689 -50395 -52515 -35618 -20088 -12097 -19992 -52249 -41619 -4886 -199 -44708
9087d4708l1052m8472c2934a4623k4762B7309M961J83314j9355r3252C4128h981
$$ -44708 -75760 -124232 -32934 -14623 -39385 27309 32270 215584 196229 102977 34128 -8981
9074A8694K4464j1503N1573N5413a6232l6619a7736j0837n797J898A331L9109
$$ 18694 43158 31655 83228 138641 -16232 -52851 -17736 -28573 -34370 -32472 1331 40440
9062D0440B0076r68K5639J34855n5449L2781K828l6285l798l5268a0607p1580
$$ 40440 20076 19108 44747 179602 124153 156934 159762 123477 119679 84411 -10607 -82187
9050h2187l3510a8516C1833H633b0483A1529P9878l202B2404Q8903D5689m681
$$ -82187 -115697 -18516 31833 8633 -20483 11529 91407 88205 22404 111307 45689 41008
9038D1008M2365B6261A2421P0506I825g5020B0427J8491L1135j5952m623k1341
$$ 41008 83373 26261 12421 82927 9825 -75020 20427 38918 70053 54101 49478 28137
9026B8137M5825N1375L4112Q689L5076r068E1266B0040R5558n2752L2877P731
$$ 28137 73962 125337 159449 168138 203214 194146 51266 20040 115598 62846 95723 103454
9014A03454k4184c0358l1889K2348D7406J18862m91k0762C2532J4858j8524j3810
$$ 103454 79270 -30358 -62247 -39899 47406 166268 165777 145015 32532 47390 28866 15056
9002A5056J8836b4748j1485a7313C1943J21490M6675p5720D8312a2144D3243o219
$$ 15056 33892 -24748 -36233 -17313 31943 153433 200108 124388 48312 -12144 43243 37024
8990C7024c3133j7937l4084n6742J200M9247b6469B0593L3190A6980c6544E350
$$ 37024 -33133 -51070 -85154 -141896 -140696 -91449 -26469 20593 53783 16980 -36544 5350
8977B1704D753K7845L7868a4887E4359A5223M891N9415O478k4010r087N6639k0918
$$ 21704 4753 32598 70466 -14887 54359 15223 20114 79529 86007 61997 52910 109549 88631
8964H8631A4797N5749P0879J659O640n7740a8619j13383l235d3863a009k5899
$$ 88631 14797 70546 141425 143084 149724 91984 -18619 -132002 -135237 -43863 -1009 -26908
8952b6908j57872M9447m149O6137g44m9362b4460e005p0252C6572R0758E4665
$$ -26908 -184780 -135333 -139482 -73345 -744 -50106 -24460 -5005 -75257 36572 127330 54665
8939a1251q5510k1431O828d2588a9980B143c7891n0782b8363k9432b2614n6997
$$ -11251 -96761 -118192 -111364 -42588 -19980 2143 -37891 -88673 -28363 -57795 -22614 -79611
8927g9611b0468C3585b5320C5594j718O5624L5708A3801d8312A0250e89m160A23522
$$ -79611 -20468 33585 -25320 35594 33876 99500 135208 13801 -48312 10250 -589 -4749 123522
8913B8218d5287o5016Q056d5080C4218e3050B9923K2634A1236a384j4079j11214
$$ 28218 -45287 -110303 -102247 -45080 34218 -53050 29923 52557 11236 -1384 -15463 -126677
8901a26677l881J0886J4628n5186f6174J0673K1086G7746L497P2227k5322l5697
$$ -126677 -130558 -119672 -105044 -160230 -66174 -55501 -34415 77746 81243 153470 128148 92451
8889I2451D3347F611k800a03731r3538f6454D1492A6799K9231j8964H386J42543
$$ 92451 43347 6611 3811 -103731 -197269 -66454 41492 16799 46030 27066 8386 150929
8877A50929k4030m9992L026M902M4737m077B8426c9612A0760M5693A5767N8804
$$ 150929 126899 76907 79933 84835 129572 125495 28426 -39612 10760 56453 15767 74571
8865G4571O2498m2845B642c1303C4131J8885j9180j5377f4228a0965B0685O6130
$$ 74571 137069 94224 2642 -31303 34131 53016 33836 18459 -64228 -10965 20685 86815
8853H6815j1927k829j7891D669a2792m9034q241k376p762q2883f7987b6603l2467
$$ 86815 74888 72059 54168 4669 -12792 -61826 -70067 -72443 -80205 -163088 -67987 -26603 -59070
8840e9070r2701O4055D6131J802A6090l86a14865M2988K774A0492M6509k2214
$$ -59070 -151771 -87716 46131 47933 16090 15704 -114865 -71877 -69103 10492 57001 34787
8828C4787R261j2445A5028Q3201A7489c7256I4046d513k165A05528D6490K0281
$$ 34787 44048 31603 15028 98229 17489 -37256 94046 -4513 -6678 105528 46490 66771
8816F6771N495M4607L5525p1025k5856L5133A8605b0230F72a5931j4174K454D0914
$$ 66771 72266 116873 152398 81373 55517 90650 18605 -20230 672 -15931 -30105 -27651 40914
8802D9178m669H753a8477F6279J1284b9785n3760o092b7753C3891K9411K9633
$$ 49178 44509 8753 -18477 66279 77563 -29785 -83545 -89637 -27753 33891 63302 92935
8790I2935Q1001m8268n7389b7322E8154P0737j5243B9140h1890J8217K5220A4642
$$ 92935 173936 125668 68279 -27322 58154 128891 113648 29140 -81890 -63673 -38453 14642
8777h2098o805f143B3898J462m905h8837m289a4678G4182O1402l8762D5463P5356
$$ -82098 -88903 -6143 23898 25360 20455 -88837 -93126 -14678 74182 135584 96822 45463 120819
8764A20819K6446l1179k7789B0792J5721O6352l4925f5857l1824K5934C9206d0886
$$ 120819 147265 116086 88297 20792 36513 102865 67940 -65857 -97681 -71747 39206 -40886
8751e5141l855n0009J8369a1246C7976M6236D209a27758e2129A8801K9027A5107
$$ -55141 -58996 -109005 -90636 -11246 37976 84212 4209 -127758 -52129 18801 47828 15107
8738C5650A2848J9215c5122j1508j4921n9994K7917K2661K732E845a4623A03405
$$ 35650 12848 32063 -35122 -46630 -61551 -121545 -93628 -70967 -68235 5845 -14623 103405
8725A11598n5653F193k160L0881c743B7275f111F5573J7602J9424j9052l7673
$$ 111598 55945 6193 4033 34914 -3743 27275 -6111 65573 83175 102599 83547 45874
8713D5874J47802p60k4536C8290K1312K8684j3335B2950K9430b6870k0899j1507
$$ 45874 193676 192916 168380 38290 59602 88286 74951 22950 52380 -26870 -47769 -59276
8701e9276a5648O177k4276E4894R8019l6807m8441L4115m7688H245Q825d68H836
$$ -59276 -15648 -9471 -33747 54894 152913 116106 67665 101780 54092 8245 17070 -468 8836
8687G7032A3714M7256B2437l772H482J32747P849M7987N1133o1889H6750k2630
$$ 77032 13714 60970 22437 18665 8482 141229 149078 197065 248198 186309 86750 64120
8675F4120e0595o0200K9063K2176o9502l659N3276b4213D5641D350L7489f2765
$$ 64120 -50595 -110795 -81732 -59556 -129058 -132717 -79441 -24213 45641 4350 41839 -62765
8662c9404I802L1676G273L729R1296K7437l1759J5604D8249p820J2728N4805M4655
$$ -39404 9802 41478 7273 11002 102298 129735 97976 113580 48249 40429 53157 107962 152617
8649A52617p3977P5260n0998j1580D3322K0677j330b2924k3557H9952B2729a5771
$$ 152617 78640 153900 102902 91322 43322 63999 62669 -22924 -46481 89952 22729 -15771
8636a7932D1503j4723O1054Q5141n1026P984l8088l2054a8770o0648C8003c0304
$$ -17932 41503 26780 87834 172975 121949 129933 91845 59791 -18770 -79418 38003 -30304
8623h0954l1751p3376N6608M6539m443A0782K3700c39j02437a108o1983n3230
$$ -80954 -112705 -186081 -129473 -82934 -87377 10782 34482 -339 -102776 -1108 -63091 -116321
8611a16321K2576a7104n0130m7280k3082R282l3288g4475a6216D9431P27k731
$$ -116321 -93745 -17104 -67234 -114514 -137596 -128314 -161602 -74475 -16216 49431 50158 47427
8599D7427l46a8705q0758L5866A2858b9722p039a4128E2323L6959J5759J6445
$$ 47427 47081 -18705 -99463 -63597 12858 -29722 -36761 -14128 52323 89282 105041 121486
8587A21486m7579J8733l4041o054a9074r095Q300l8079o033k454j333K4001A05715
$$ 121486 73907 92640 58599 52545 -19074 -28169 -19869 -57948 -63981 -66435 -67768 -43767 105715
8573C3512c6549F0453B9951M709J6288J2863j8845a5459G4687k0089k2205d1242
$$ 33512 -36549 60453 29951 34660 50948 63811 44966 -15459 74687 54598 32393 -41242
8560a7890n8690q791L4857a465j3336C9645j1050B982b0673G9169j4944l464K6376
$$ -17890 -76580 -85371 -50514 -1465 -14801 39645 28595 2982 -20673 79169 64225 60761 87137
8547H7137A8561E605a68964p016N5436K5061J2181J2685k3792J6224k3367J1908
$$ 87137 18561 5605 -168964 -175980 -120544 -95483 -83302 -70617 -94409 -78185 -101552 -89644
8535h9644k4187l5284L4926d5215q1180o4803N1999O7356K119L2732a740A6439
$$ -89644 -113831 -149115 -114189 -45215 -126395 -191198 -139199 -71843 -69724 -36992 -1740 16439
8522a6544j254l8986b5569k3041A1753b0683B9268K8359K6183c5956q174k1530
$$ -16544 -17798 -56784 -25569 -48610 11753 -20683 29268 57627 83810 -35956 -44130 -65660
8510f5660l1391C0108K1354m426J9408L1208m448j1223l551g482k8704A5239a6628
$$ -65660 -97051 30108 51462 47036 66444 97652 93204 81981 78430 -7482 -36186 15239 -16628
8496F362N3251Q2969j2666m4711L7618n6089c837B6756f934B0837m366b6131e80
$$ 6362 59613 142582 129916 85205 122823 66734 -3837 26756 -6934 20837 16471 -26131 -580
8482F558a4683o9098l6756c1113j595I116K6182H287l329K6645N7249J0558L8907
$$ 6558 -14683 -83781 -120537 -31113 -32708 9116 35298 8287 4958 31603 88852 99410 138317
8469A38317n6409k5129A4555O6230k7753A9931P2825l6201J9512A9268K0594g767
$$ 138317 81908 56779 14555 80785 53032 19931 92756 56555 76067 19268 39862 -7767
8456A2844e8406a5309B2512b3576k6384l001A1729M974O9721r25J7914l7665A484
$$ 12844 -58406 -15309 22512 -23576 -49960 -52961 11729 16703 86424 85499 103413 65748 1484
8442a11561o6503K9668d7157D7471J4616c56m2094C4058c403l7952F3188j7777
$$ -111561 -178064 -148396 -47157 47471 62087 -356 -42450 34058 -3403 -41355 63188 45411
8430D5411A8701J9130H816J8007a214j16453p2665M8541N6464L9826e230m9131
$$ 45411 18701 37831 8816 26823 -1214 -117667 -190332 -141791 -85327 -45501 -5230 -54361
8418e4361A2233O1221C929i376r1979c2734A9111d1680F3871L0797c2424r7091
$$ -54361 12233 73454 3929 -9376 -101355 -32734 19111 -41680 63871 94668 -32424 -129515
8406a29515l454M3515m0074e1605D1429A5913L1927d2533l4272J1637l2750p9942
$$ -129515 -132969 -89454 -129528 -51605 41429 15913 47840 -42533 -76805 -65168 -97918 -177860
8394a77860J9560K6103c1799a2981j0415B1369b1947k7539o2746j6527K2694M3442
$$ -177860 -158300 -132197 -31799 -12981 -23396 21369 -21947 -49486 -112232 -128759 -106065 -62623
8382f2623a7434Q020G9793k3098C315e5022C2548O5013A5118J5976L4254N348
$$ -62623 -17434 -9414 79793 56695 3315 -55022 32548 97561 15118 31094 65348 70696
8370G0696l2702e4467q0195p125j15411J11426e3680O850C2555Q6625K9326n8287
$$ 70696 37994 -54467 -134662 -141787 -257198 -145772 -53680 -46830 32555 119180 148506 90219
8358I0219m2011d139m0388a9939D0852a1451H4985P719a6310H249O1909A2848
$$ 90219 48208 -4139 -44527 -19939 40852 -11451 84985 92704 -16310 8249 70158 12848
8345f9577l280p6437j1212K7584d0089C9966R006b334B9012N7250b8021l1320
$$ -69577 -72857 -149294 -160506 -132922 -40089 39966 48972 -2334 29012 86262 -28021 -59341
8333e9341k1804R943b3582g30l2139A7133O9989C1086f5649c2332o1375o6812
$$ -59341 -81145 -71202 -23582 -730 -32869 17133 87122 31086 -65649 -32332 -93707 -160519
8321a60519O0113J0772c6933B5849J1457H873P028N8648O6714d958j37414L7545
$$ -160519 -100406 -89634 -36933 25849 37306 8873 15901 74549 141263 -4958 -142372 -104827
8309a04827J3092j29488Q5715N4966a8445r4978m736J671e4787D8004J6900K9201
$$ -104827 -91735 -221223 -135508 -80542 -18445 -113423 -118159 -116488 -54787 48004 64904 94105
8297I4105C9739g5787J0635K3815D117L1867O8817m7584c8280m7805C9400L7278
$$ 94105 39739 -75787 -65152 -41337 4117 35984 104801 57217 -38280 -86085 39400 76678
8285G6678k3213A2527m71J4244g9076m6728J4304c0028B2174d084G4691M5751
$$ 76678 53465 12527 12056 26300 -79076 -125804 -111500 -30028 22174 -4084 74691 120442
8273A20442j355Q1092o9012H17e8876J787H0986P586B5072i8127n0284B726Q587
$$ 120442 119087 200179 131167 817 -58876 -57089 80986 88572 25072 -98127 -148411 2726 11313
8260A1313a4824j7463p96p094a6675D0853m401l319h4007J8272b8464R447h1m6890
$$ 11313 -14824 -32287 -33083 -40177 -16675 40853 36452 33133 -84007 -65735 -28464 -19017 -81 -46971
8246d6971q332j3535C1867N1721J9447e83B7861r171c5113j2280b0279j1338B3658
$$ -46971 -55303 -68838 31867 83588 103035 -583 27861 18690 -35113 -47393 -20279 -31617 23658
8232A20441k149B1662k171g539l8068j6077a406q352k8094F1728O869A7502J794
$$ 120441 118292 21662 19491 -7539 -45607 -61684 -1406 -9758 -37852 61728 68597 17502 19296
8219A9296L5241r314P950j7003J2567M6578j5498D743e7409C1190K1672L8957
$$ 19296 54537 45223 53173 36170 48737 95315 79817 4743 -57409 31190 52862 91819
8207I1819B2295k148i16A3415g7224n8789h979A4918P2806L6734E7576B7991a05506
$$ 91819 22295 20147 -916 13415 -77224 -136013 -8979 14918 87724 124458 57576 27991 -105506
8193c6097j0211p3528N6837m532D435O7903d1816j8006k2639k472L7735d885A2396
$$ -36097 -46308 -119836 -62999 -67531 4435 72338 -41816 -59822 -82461 -84933 -47198 -4885 12396
8179I4009N8476m5800K2635R350F3896A0631j576b6732B1988N8999j0062J0434
$$ 94009 152485 106685 129320 138670 63896 10631 9055 -26732 21988 80987 70925 81359
8167H1359N9481K3222E2615a01772M9436o5166d3983J5329n7217I283R6909O183
$$ 81359 140840 164062 52615 -101772 -52336 -117502 -43983 -28654 -85871 9283 106192 112375
8155A12375j4876j8088c9186R549j4693l7009l5646Q222M5905F202M5956L5813
$$ 112375 97499 79411 -39186 -29637 -44330 -81339 -116985 -108763 -62858 6202 52158 87971
8143H7971k2463D526b964A4763L0075e469C1456l318d5513o4126j495d2106C5904
$$ 87971 65508 4526 -2964 14763 44838 -5469 31456 28138 -45513 -109639 -111134 -42106 35904
8129B9850e6280n3051k4996p6908P7859A1107J8936J1288K156m637L8220O761
$$ 29850 -56280 -109331 -134327 -211235 -133376 11107 30043 41331 43487 38850 77070 83831
8117H3831l8329h3712K7036E3793i378A189a6917k7396J078A0178L5909a0598
$$ 83831 45502 -83712 -56676 53793 -9378 1189 -16917 -44313 -43235 10178 46087 -10598
8104B181Q733g9546H32b3183o7l5725K2791B0521C26L0249A1063N421O898b5271
$$ 2181 10914 -79546 832 -23183 -23250 -58975 -36184 20521 326 30575 11063 16484 23382 -25271
8089i0145R969G015d496m946q127G1620B2812M8347j2670L0029g704j01053m7184
$$ -90145 -80176 7015 -4496 -9442 -17569 71620 22812 71159 58489 88518 -7704 -108757 -155941
8076a55941l0197A6813p432b8743k5426n3337g533C526K2805G310e7030n9969
$$ -155941 -186138 16813 9381 -28743 -54169 -107506 -7533 3526 26331 7310 -57030 -116999
8064a16999C477c091G46M6252K4173k5233k430P0114N034D1380A4701i1695p4179
$$ -116999 3477 -3091 746 46998 71171 45938 43508 113622 118656 41380 14701 -91695 -165874
8051a65874e3904a7273E5711M4532B1993c0149j15815K1359m1362N2202L3722
$$ -165874 -53904 -17273 55711 100243 21993 -30149 -145964 -124605 -165967 -113765 -80043
8040h0043f171o8990J3863D7968L3741K8595k993j5029e2000k3792L6890J5068
$$ -80043 -6171 -75161 -61298 47968 81709 110304 107311 92282 -52000 -75792 -38902 -23834
8028b3834p822A5202a40q1238Q392n4182L7729E0506b676l3346k7231f789C4584
$$ -23834 -31656 15202 -140 -81378 -72986 -127168 -89439 50506 -2676 -36022 -63253 -6789 34584
8014a5118L038l1083i183D9409O7862k266B5824h2571m108E6288o686K5757L7202
$$ -15118 -12080 -43163 -9183 49409 117271 115005 25824 -82571 -86679 56288 49602 75359 112561
8001A12561p866K7434E2474n453j4643f904o3438K4322C4396e6736q8675e0235
$$ 112561 104695 132129 52474 47021 32378 -6904 -70342 -46020 34396 -56736 -145411 -50235
7988B4264N2012n589h5476k0500c9058o0186j0528M2013E8250n192A1173M9273
$$ 24264 76276 70687 -85476 -105976 -39058 -99244 -109772 -67759 58250 53058 11173 60446
7976F0446K2348N2291B5931f4783o8857M4307L1520C0397O6250k3545J5795m2670
$$ 60446 82794 135085 25931 -64783 -133640 -89333 -57813 30397 96647 73102 88897 46227
7964D6227g2160L3371E3971J2037C848r7i68k0638o7811a2154F8218e1872B2553
$$ 46227 -72160 -38789 53971 66008 3848 3751 -968 -21606 -89417 -12154 68218 -51872 22553
7950C7628J1842N0266N605B277f5453H7569M518D5699E292Q2416j6432k9271Q9221
$$ 37628 49470 99736 105341 2277 -65453 87569 92087 45699 5292 87708 71276 42005 131226
7937A31226N9650F9234C2516d9578f847q906q9177C3026M0163b2233q3565L2358
$$ 131226 190876 69234 32516 -49578 -6847 -15753 -104930 33026 73189 -22233 -105798 -73440
7925g3440N356F6038q974d7353l6403a3677l1772D9924f2743k9003b1761C3358
$$ -73440 -68084 66038 57064 -47353 -83756 -13677 -45449 49924 -62743 -91746 -21761 33358
7912A5873J3537i317B848b4031D6018B2439e7794j7016K6463J2032n9648G088
$$ 15873 29410 -9317 2848 -24031 46018 22439 -57794 -74810 -48347 -36315 -95963 7088
7899A02219k7700i9359L9999C4316M7083G971d4054g049o702B3867b0191l1497
$$ 102219 74519 -99359 -59360 34316 81399 7971 -44054 -7049 -13751 23867 -20191 -51688
7887e1688J2991A09629j6494D1983a8166j1696j08204e6321H2501j5837a6937
$$ -51688 -38697 109629 93135 41983 -18166 -29862 -138066 -56321 82501 66664 -16937
7875C3885K1654A219K9564A4862N0370J7745C5107I22e9319k5008c1163h557B7593
$$ 33885 55539 1219 30783 14862 65232 82977 35107 922 -59319 -84327 -31163 -8557 27593
7861e3489r349n7146c7543G8566N42l3320c3675B109a8378n1216J8592g852j2248
$$ -53489 -62838 -119984 -37543 78566 79108 45788 -33675 2109 -18378 -69594 -51002 -7852 -20100
7848b0100j27306j4372O4943d4399e69G5845j6618b1580A1998J34310K5926F5170
$$ -20100 -147406 -161778 -96835 -44399 -569 75845 59227 -21580 11998 146308 172234 65170
7835e8513j0252k735G450Q29g2380O512n6273N5824M869A2988A014a4234I617
$$ -58513 -68765 -71500 7450 8279 -72380 -65868 -122141 -66317 -61448 12988 1014 -14234 9617
7821A9308a3924m3929K0023K51h228A0622N7229I914K5968b4546r8591L5890c4603
$$ 19308 -13924 -57853 -37830 -37579 -8228 10622 67851 9914 35882 -24546 -123137 -87247 -34603
7807C7164R7228k332j3168B5191j2184h3595J9760I2860l5384a03203J8985L3447
$$ 37164 134392 132060 118892 25191 13007 -83595 -63835 92860 57476 -103203 -84218 -50771
$$ [...]
##END NTUPLES=NMR SPECTRUM
##END=
