##TITLE=ST0000_MeOD-4_7212735_VkaFngzLdu
##JCAMPDX= 6.0         $$ Bruker NMR JCAMP-DX V2.0
##DATA TYPE= NMR SPECTRUM
##DATA CLASS= NTUPLES
##ORIGIN= BRUKER
##OWNER= Administrator
$$ 1.72 TOPSPIN		Version 2.1
$$ 2013-10-12 01:02:19.175 -0700  Administrator@X
$$ Compression mode = diff/dup
##.OBSERVE FREQUENCY= 400.02188249412
##.OBSERVE NUCLEUS= ^1H
##.ACQUISITION MODE= SIMULTANEOUS (DQD)
##.ACQUISITION SCHEME= undefined
##.AVERAGES= 8
##.DIGITISER RES= 22
##SPECTROMETER/DATA SYSTEM= spect
##.PULSE SEQUENCE= zg30
##.SOLVENT NAME= COFFEE_meoh
##.SHIFT REFERENCE= INTERNAL, COFFEE_meoh, 1, 14.98509
##AUDIT TRAIL= $$ (NUMBER, WHEN, WHO, WHERE, PROCESS, VERSION, WHAT)
$$ ##TITLE= Audit trail, TOPSPIN		Version 2.1
$$ ##JCAMPDX= 5.01
$$ ##ORIGIN= Bruker BioSpin GmbH
$$ ##OWNER= Administrator
$$ $$ E:\/data/COFFEE/nmr/ST0000_MeOD-4_7212735_VkaFngzLdu/10/pdata/1/auditp.txt
$$ ##AUDIT TRAIL=  $$ (NUMBER, WHEN, WHO, WHERE, PROCESS, VERSION, WHAT)
(   1,<2013-10-12 01:02:12.237 -0700>,<Administrator>,<X>,<go>,<TOPSPIN 2.1>,
      <created by zg
	started at 2013-10-12 01:01:06.815 -0700,
	POWCHK enabled, PULCHK disabled,
       configuration hash MD5:
       C8 4E 4E 5D D3 5C D8 9E 9F 52 82 E0 59 8A DE 15
       data hash MD5: 64K
       DE C4 2E A9 FE 84 F8 90 D3 30 6F BB ED D7 26 02>)
(   2,<2013-10-12 01:02:15.268 -0700>,<Administrator>,<X>,<proc1d>,<TOPSPIN 2.1>,
      <Start of raw data processing
       efp LB = 0 FT_mod = 6 PKNL = 1 PHC0 = 0 PHC1 = 0 SI = 32K 
       data hash MD5: 32K
       34 5C BD DB A7 98 EE ED C5 FB 4E 45 8C E6 AB B4>)
(   3,<2013-10-12 01:02:15.643 -0700>,<Administrator>,<X>,<proc1d>,<TOPSPIN 2.1>,
      <pk PHC0 = 87.35229 PHC1 = 0 
       data hash MD5: 32K
       84 C1 07 AA 24 7E 16 E0 9B 90 9A 69 98 38 D1 E2>)
(   4,<2013-10-12 01:02:15.753 -0700>,<Administrator>,<X>,<proc1d>,<TOPSPIN 2.1>,
      <abs ABSG = 1 
       data hash MD5: 32K
       79 1A 26 BA 3E 3C EC F4 40 1D 7D DC 2F CE F4 F7>)
(   5,<2013-10-12 01:02:15.831 -0700>,<Administrator>,<X>,<proc1d>,<TOPSPIN 2.1>,
      <abs ABSG = 2 
       data hash MD5: 32K
       B1 F2 CE 16 41 79 5C 6B CE 00 8B 40 F7 44 3A 6B>)
(   6,<2013-10-12 01:02:15.893 -0700>,<Administrator>,<X>,<proc1d>,<TOPSPIN 2.1>,
      <abs ABSG = 3 
       data hash MD5: 32K
       D4 26 58 75 D3 40 E1 AD 38 74 CF E1 C6 40 4A 39>)
(   7,<2013-10-12 01:02:15.940 -0700>,<Administrator>,<X>,<proc1d>,<TOPSPIN 2.1>,
      <abs ABSG = 4 
       data hash MD5: 32K
       1C 2D FA 9C D5 B8 A0 10 D4 53 82 7F DC AE DC 50>)
(   8,<2013-10-12 01:02:15.987 -0700>,<Administrator>,<X>,<proc1d>,<TOPSPIN 2.1>,
      <abs ABSG = 5 
       data hash MD5: 32K
       BF 7E 8F E4 41 9E D4 3A 90 70 F1 EA 0A 7B E1 DA>)
$$ ##END=
$$ 
$$ $$ hash MD5
$$ $$ 3F 7B B6 91 F3 91 8B FD 96 1A C9 74 54 5F CF 35
##$RELAX= 
##$RELAX= 
##$RELAX= 
##$RELAX= 
##$RELAX= 
##$RELAX= 
##$RELAX= 
$$ Bruker specific parameters
$$ --------------------------
##$DU= <E:\>
##$EXPNO= 10
##$NAME= <ST0000_MeOD-4_7212735_VkaFngzLdu>
##$PROCNO= 1
$$ [...]
150 150 150 150 150 150 150 150
##$TP07= 0
##$TPNAME0= <>
##$TPNAME1= <>
##$TPNAME2= <>
##$TPNAME3= <>
##$TPNAME4= <>
##$TPNAME5= <>
##$TPNAME6= <>
##$TPNAME7= <>
##$TPOAL= (0..7)
0.5 0.5 0.5 0.5 0.5 0.5 0.5 0.5
##$TPOFFS= (0..7)
0 0 0 0 0 0 0 0
##$TUNHIN= 0
##$TUNHOUT= 0
##$TUNXOUT= 0
##$USERA1= <user>
##$USERA2= <user>
##$USERA3= <user>
##$USERA4= <user>
##$USERA5= <user>
##$V9= 5
##$VALIST= <valist>
##$VCLIST= <CCCCCCCCCCCCCCC>
##$VD= 0
##$VDLIST= <DDDDDDDDDDDDDDD>
##$VPLIST= <PPPPPPPPPPPPPPP>
##$VTLIST= <TTTTTTTTTTTTTTT>
##$WBST= 1024
##$WBSW= 4
##$XGAIN= (0..3)
0 0 0 0
##$XL= 0
##$YL= 0
##$YMAX_a= 1784
##$YMIN_a= -1642
##$ZGOPTNS= <>
##$ZL1= 120
##$ZL2= 120
##$ZL3= 120
##$ZL4= 120
##$ABSF1= 14.98509
##$ABSF2= -5.573092
##$ABSG= 5
##$ABSL= 3
##$ALPHA= 0
##$AQORDER= 0
##$ASSFAC= 0
##$ASSFACI= 0
##$ASSFACX= 0
##$ASSWID= 0
##$AUNMP= <proc_prof1d_extract_pilot.lims>
##$AXLEFT= 0
##$AXNAME= <>
##$AXNUC= <1H>
##$AXRIGHT= 0
##$AXTYPE= 0
##$AXUNIT= <>
##$AZFE= 0.1
##$AZFW= 0.1
##$BCFW= 0
##$BC_mod= 0
##$BYTORDP= 0
##$COROFFS= 0
##$CY= 15
##$DATMOD= 1
##$DC= 0
##$DFILT= <>
##$DTYPP= 0
##$F1P= 0
##$F2P= 0
##$FCOR= 0.5
##$FTSIZE= 32768
##$FT_mod= 6
##$GAMMA= 0
##$GB= 0
##$INTBC= 1
##$INTSCL= 1
##$ISEN= 128
##$LB= 0
##$LEV0= 0
##$LPBIN= 0
##$MAXI= 10000
##$MC2= 0
##$MEAN= 0
##$ME_mod= 0
##$MI= 0
##$NCOEF= 0
##$NC_proc= -15
##$NLEV= 6
##$NOISF1= 0
##$NOISF2= 0
##$NSP= 0
##$NTH_PI= 0
##$NZP= 0
##$OFFSET= 14.98509
##$PC= 1
##$PHC0= 87.35229
##$PHC1= 0
##$PH_mod= 1
##$PKNL= yes
##$PPARMOD= 0
##$PPDIAG= 0
##$PPIPTYP= 0
##$PPMPNUM= 2147483647
##$PPRESOL= 1
##$PSCAL= 4
##$PSIGN= 0
##$PYNMP= <proc.py>
##$REVERSE= no
##$SF= 400.02
##$SI= 32768
##$SIGF1= 0
##$SIGF2= 0
##$SINO= 400
##$SIOLD= 32768
##$SPECTYP= <>
##$SREGLST= <1H.CDCl3>
##$SSB= 0
##$STSI= 32768
##$STSR= 0
##$SW_p= 8223.68421052631
##$SYMM= 0
##$S_DEV= 0
##$TDeff= 65536
##$TDoff= 0
##$TI= <>
##$TILT= no
##$TM1= 0
##$TM2= 0
##$TOPLEV= 0
##$USERP1= <user>
##$USERP2= <user>
##$USERP3= <user>
##$USERP4= <user>
##$USERP5= <user>
##$WDW= 1
##$XDIM= 32768
##$YMAX_p= 412550919
##$YMIN_p= -92810434
##$CURPLOT= <Network HP LaserJet P1505>
##$CURPRIN= <$Network HP LaserJet P1505>
##$DFORMAT= <normdp>
##$LAYOUT= <+/1D_H.xwp>
##$LFORMAT= <normlp>
##$PFORMAT= <normpl>
##$SURQMSG= 1
$$ End of Bruker specific parameters
$$ ---------------------------------
##NTUPLES= NMR SPECTRUM
##VAR_NAME=  FREQUENCY,     SPECTRUM/REAL,   SPECTRUM/IMAG
##SYMBOL=    X,             R,               I
##VAR_TYPE=  INDEPENDENT,   DEPENDENT,       DEPENDENT
##VAR_FORM=  AFFN,          ASDF,            ASDF
##VAR_DIM=   32768,         32768,           32768
##UNITS=     HZ,            ARBITRARY UNITS, ARBITRARY UNITS
##FACTOR=    0.250966925370066, 1,           1
##FIRST=     8223.43324360094, 14713418,     18393912
##LAST=      0,             9743235,         15761112
##MIN=       0,             -92810434,       0
##MAX=       8223.43324360094, 412550919,    0
$$ Real data points
##PAGE= N=1
##DATA TABLE= (X++(R..R)), XYDATA
$$ [...]
$$ plain form
20725 3145105 5707397 -8077206 -46064334 -14063759 -37854395 5884556 14255163 -34953611
20716 -13036952 7808109 -65493108 -8497640 14743058 -15754705 6161882 42045468
20709 42045468 -1985462 -52091907 -26639435 -36318692 24607615 17612995 -9202015 -9842276
20701 -9842276 18756655 -9002357 -8626368 -12005113 5381874 197006 20981582 20693452
20693 20693452 22881035 15238172 -668753 30263120 -21337176 -3708050 -25364757 25038476
20684 1343133 -12651444 -5222971 11969070 25845039 41161443 30931673 281158 -18893781
20675 -2613124 31696005 -766605 -3187958 7791014 33658587 11854496 7209039 44904735
20667 44904735 5365542 23936875 14534872 -7652679 2499229 20246535 -11558485 -13215124
$$ packed form
20725C145105K562292h077206l7987128a4063759k3790636E884556Q370607c4953611
20716a3036952G808109f5493108h497640A4743058a5754705F161882L5883586
20709D2045468a985462n0106445K5452472r679257B4607615o994620i202015o40261
20701i842276A8756655i002357L75989l378745E381874A97006K0784576k88130
20693B0693452K187583p642863f68753C0263120b1337176c708050k1656707B5038476
20684A343133a2651444e222971A1969070J3875969J5316404j0229770B81158a8893781
20675b613124C1696005g66605k421353G791014K5867573A1854496m645457L7695696
20667D4904735E365542J8571333r402003g652679B499229J7747306a1558485j656639
$$ plain form
20659 -13215124 -9590931 6205322 -32755788 -31164377 -28252342 -16392856 -9811220 2551110
20650 37291440 31990500 -30715036 -22343980 -1567736 -10610985 2533786 21600511 26898450
20642 26898450 2820156 -13369433 6960562 5907647 5525873 17826011 -20951786 -26246442
20634 -26246442 -3388177 4204422 2802810 -12865577 -21202947 11951475 6091933 -8916530
20625 15327506 14698080 9850401 7253629 28356881 12854827 -13139970 -6704412 -20636681
20617 -20636681 -33457680 -26396419 -2248232 -12418042 -4536959 16092468 17371812 8929321
20609 8929321 40067792 22562701 -11915929 -22857188 -21943345 -2470216 -16668501 27135771
20600 -29108294 13027667 28064961 30199043 -33914293 694893 7209462 4416754 9410610
$$ packed form
20659a3215124L624193F205322c2755788J591411K912035J1859486O581636B551110
20650C7291440n300940c0715036Q371056a567736r043249B533786J9066725N297939
20642B6898450B820156a3369433F960562j052915l81774J2300138b0951786n294656
20634b6246442c388177D204422j401612a2865577q337370A1951475n859542h916530
20625A5327506o29426m847679k596772K1103252A2854827a3139970O435558j3932269
20617b0636681j2820999P061261b248232j0169810d536959A6092468J279344q442491
20609H929321L1138471j7505091a1915929j0941259R13843b470216j4198285B7135771
20600b9108294A3027667J5037294K134082c3914293F94893O514569k792708M993856
$$ plain form
20592 9410610 -11627837 -9371652 1724117 41908477 -1666408 -24464843 10291141 -24745021
20583 47287269 4174174 18599615 19126017 -2545449 3439630 -14180619 34018742 -12437296
20574 37827760 -11923254 22436110 13109230 -20057908 -5047354 30646320 -35272596
20566 -6811585 23893105 9056381 42567720 -5282124 -6944847 -9897052 -1563612 33562798
20557 13025179 20981340 -1329617 -7739327 -45542434 21523294 -6334816 25067803 13606921
20549 13606921 -2308124 24020172 -17906185 9562810 28540036 39736301 -47158078
20541 13843056 1411366 -4080485 35881410 -16687177 -8460553 -507138 106097 1830700
20533 1830700 2802563 30565066 -7766740 11496839 -610935 27251603 6912716 4629836
$$ packed form
20592I410610a1627837K256185A724117M0184360a666408k2798435A0291141b4745021
20583D7287269D174174J4425441N26402b545449C439630a4180619C4018742a2437296
20574C7827760a1923254B2436110r326880b0057908e047354C0646320c5272596
20566f811585B3893105I056381L3511339e282124j662723k952205a563612C3562798
20557A3025179P956161a329617o409710l7803107B1523294f334816B5067803j1460882
20549A3606921b308124B4020172a7906185I562810J8977226J1196265d7158078
20541A3843056A411366d080485C5881410a6687177Q226624e07138A06097J724603
20533A830700R71863K7762503g766740A1496839f10935B7251603F912716k282880
$$ plain form
20525 4629836 -15453370 -12369009 -4184636 1320817 4025122 -26635341 -13293069 -26005520
20517 -26005520 1188325 28309058 9601591 -8430051 -14881942 -2645848 -2321122 8812291
20508 23663831 -36247731 31482003 -11597145 -7063573 -6996394 13467886 -15013074 34173372
20499 -2955316 -12177061 -8431271 21564923 16258259 11331079 4962626 7768552 9505727
20491 9505727 -15953373 18570807 -17727678 -10982669 -15078068 3045032 24466168 -17194777
20482 6354736 33175267 6020308 13784372 19287351 -15581801 -19789795 -12915008 13510169
20473 2521766 -21492624 23618491 11343846 -20060709 7475260 28513066 -11579598
20465 12764018 11360666 12711350 -18034959 11369962 5157403 16008859 23977770 11586047
$$ packed form
20525D629836a5453370L084361d184636A320817K704305b6635341a3293069j2712451
20517b6005520A188325K7120733I601591h430051o451891b645848L24726H812291
20508B3663831c6247731C1482003a1597145M533572O7179A3467886a5013074C4173372
20499b955316r221745L745790B1564923n306664m927180D962626K805926J737175
20491I505727a5953373A8570807a7727678O745009m095399C045032K1421136a7194777
20482F354736K6820531F020308P764064N502979a5581801m207994O874787A3510169
20473B521766b1492624B3618491A1343846b0060709G475260K1037806a1579598
20465A2764018j403352J350684a8034959A1369962E157403J0851456P968911A1586047
$$ plain form
20456 417065 -1689786 5405209 -1358372 7998505 -45110065 -36424224 24386916 -6228582
20447 -11681222 23511879 14496269 -18676471 4357939 4661143 -43922380 12737435 -9374713
20438 15421598 -642543 7229508 -14787254 -24014796 -20036914 -16360990 6413813 5560191
20430 5560191 23551774 -4664839 -6668808 35232670 37802132 -22606043 -11338319 52189206
20421 6547933 -39766804 32458116 12715856 13485650 -7048465 -7719123 2636904 -50056835
20412 42707832 5157342 9826801 5208220 -35822735 32659221 12835089 7007959 8528161
20404 8528161 1519079 -20660901 -1176732 -2325755 -40793620 -24845416 -15159634 -28241976
20396 -28241976 28452454 31181377 -37502873 19761673 -15290205 1678913 -37297631
$$ packed form
20456D17065a689786E405209a358372G998505d5110065Q685841B4386916f228582
20447a1681222B3511879r015610a8676471D357939L03204d3922380A2737435i374713
20438A5421598f42543G229508a4787254r227542L977882L675924F413813q53622
20430E560191J7991583d664839k003969C5232670K569462b2606043J1267724E2189206
20421F547933c9766804C2458116A2715856P69794g048465o70658B636904e0056835
20412D2707832E157342M669459m618581c5822735C2659221A2835089n827130J520202
20404H528161A519079b0660901a176732j149023l8467865J5948204R685782j3082342
20396b8241976B8452454K728923c7502873A9761673a5290205A678913c7297631
$$ plain form
20388 11594688 -20509720 19536251 -3065522 -19749059 15647010 12900115 11502304
20381 11502304 -26127173 589297 -29332972 -18406702 -11299374 -13726942 -3016028 -15869232
20373 -15869232 13100112 4059216 -7512692 28310307 20363903 7271554 12699215 6717084
20365 6717084 -15017886 11986086 -4686314 43519177 -1591997 7307088 14978157 22679670
20357 22679670 24209318 -26848469 20995629 26318806 -26024628 17498514 -1610634
20349 7921540 2230915 16398249 11422140 -31361618 -14805817 -14041531 31332130 14194916
20340 -4403113 -46606786 1630107 10265767 5197780 -28824812 14842612 -3446720 21411421
20331 -17040661 8562302 75337235 4197795 -1620906 23263985 -18249466 -12699979 11021267
$$ packed form
20388A1594688b0509720A9536251c065522j6683537A5647010k746895j397811
20381A1502304b6127173E89297b9332972J0926270P107328k427568c016028j2853204
20373a5869232A3100112D059216g512692B8310307p946404G271554N427661n982131
20365F717084a5017886A1986086d686314D3519177a591997G307088P671069P701513
20357B2679670J529648b6848469B0995629N323177b6024628A7498514a610634
20349G921540B230915J4167334m976109c1361618a4805817P64286C1332130A4194916
20340d403113m2203673A630107Q635660n067987b8824812A4842612c446720B1411421
20331a7040661H562302O6774933D197795a620906B3263985a8249466N549487A1021267
$$ plain form
20322 30170799 36031346 -1638816 -11033295 44380006 -39775260 42493036 15546495
20314 -7968312 -1916930 -16755951 6869750 -28795440 9543828 -34827243 -29528810 -9905717
20305 31581211 -34108820 -27937643 5900005 20122581 18142736 -58940862 -2890809 -28090478
20297 -28090478 -1639356 -22921807 -1941296 -5066160 -12311832 -1316130 -6211321 -6936291
20289 -6936291 6932449 6623072 -7792115 -7750735 11915217 -18504279 57410777 -5460743
20280 12476891 4298128 -16992149 357844 6863747 -15855072 26923372 24607664 37877887
20272 37877887 8149695 -6218125 -28040072 -39369912 -13466727 -19537754 -5377206 8076016
20263 10435728 20695845 -34190479 -35059390 7996378 14755034 17613602 9855670 -2279599
$$ packed form
20322C0170799N860547a638816r394479D4380006c9775260D2493036A5546495
20314g968312a916930j4839021F869750b8795440I543828c4827243N298433i905717
20305C1581211c4108820O171177E900005J4222576j979845e8940862b890809k5199669
20297b8090478a639356k1282451a941296l124864p245672a316130m895191p24970
20289f936291F932449l09377g792115M1380A1915217a8504279E7410777e460743
20280A2476891D298128a6992149C57844O505903a5855072B6923372k315708J3270223
20272C7877887H149695f218125k1821947j1329840a3466727o071027e377206H076016
20263A0435728J0260117c4190479q68911G996378O758656K858568p757932b279599
$$ plain form
20254 22662215 -3613801 22300561 52254 20301086 -6060109 -28221535 20628214 -6045637
20245 -19256141 23831649 -15829654 -12507289 -24298544 -12566737 15146628 7093667
20237 -40511274 6711941 -21486945 9137911 -7687063 12080434 10016736 -40612983 6710203
20228 14674413 -10536163 37789104 -25506029 1023751 -34054989 -9745151 11428208
20220 -24483066 -11810088 7574469 -38853089 -520794 7940092 3739882 -16119419 -12075759
20212 -12075759 14202637 78189704 -27111841 -22952 5087884 8682091 32222140 -23749816
20203 32382213 2383107 -8622484 2872267 -13797695 7994511 3897057 19886891 2459431
20194 -46317536 -17131574 3763246 38684937 8986751 42782910 8782844 10149001 -20305446
$$ packed form
20254B2662215c613801B2300561E2254K0248832f060109k2161426B0628214f045637
20245a9256141B3831649a5829654L322365j1791255J1731807A5146628G093667
20237d0511274F711941b1486945I137911g687063A2080434k063698d0612983F710203
20228A4674413a0536163C7789104b5506029A023751c4054989i745151A1428208
20220b4483066a1810088G574469c8853089e20794G940092C739882a6119419M043660
20212a2075759A4202637O3987067b7111841b2952E087884L594207K3540049b3749816
20203C2382213B383107h622484B872267a3797695G994511C897057J5989834B459431
20194d6317536a7131574C763246L4921691H986751L3796159H782844J366157b0305446
$$ plain form
20185 -9917532 23229350 -16169364 -13672947 21464635 19792084 4625242 5848164 17598249
20177 17598249 -3277199 -13767089 -2821922 4280771 -10032251 -26661911 8698383 11797239
20169 11797239 -7456748 2024878 -47274007 3066665 -24260182 -15690 -1229980 14926826
20160 38981917 57529918 -12653492 32365248 -6513083 33002592 -2227431 31841866
20152 -33854635 -2960111 -32355462 -14007523 371080 -24358428 11831662 -46469999
20144 -16643648 -47463593 1464848 -4655875 -13776446 3706705 7689985 -20937664 18353222
20135 16116469 41596177 -1603776 -54215622 -8154063 -23665644 -13148423 12952095
20127 -14846123 28088234 -29626764 12058757 -20884401 -35838805 -24021116 -11872487
$$ packed form
20185i917532B3229350a6169364K496417B1464635j672551D625242J222922J1750085
20177A7598249c277199j0489890b821922D280771a0032251j6629660H698383L098856
20169A1797239g456748B024878d7274007C066665b4260182a5690j214290A4926826
20160C8981917J8548001a2653492C2365248f513083C3002592b227431C1841866
20152c3854635b960111k9395351a4007523C71080b4358428A1831662d6469999
20144a6643648l0819945A464848d655875r120571C706705L983280b0937664A8353222
20135A6116469K5479708a603776n2611846h154063j5511581J0517221A2952095
20127a4846123B8088234b9626764A2058757b0884401j4954404J1817689a1872487
$$ plain form
20119 -11101993 1468073 70389065 25119208 -39095429 -13195524 -9060799 -15208266
20112 -15208266 9811953 -13556989 15521857 25838072 -15022126 17512687 -8264788
20104 14582285 42217932 25253166 -35433042 8491197 -29448965 -37136135 40073151
20096 22919524 -33850360 -2094865 1376892 -23788582 5899754 -2061188 -33213119 13847273
20087 -4714348 -53413379 3319177 6814191 -24667634 10502783 3962033 -3478988 -8165846
20079 -8165846 42083224 -2129781 -11970639 -20828636 -33507368 33569339 -18012166 3633718
20070 -1644301 -23490731 -10667431 4581819 25191312 -14555201 9916557 5056401 -6661117
20061 5133144 -4514812 19178713 14152686 -616728 -34614137 40611372 -11294487 -17141008
$$ packed form
20119a1101993A468073O8920992B5119208c9095429a3195524M134725o147467
20112a5208266I811953a3556989A5521857J0316215a5022126A7512687h264788
20104A4582285K7635647j6964766c5433042H491197b9448965p687170D0073151
20096B2919524c3850360b094865A376892b3788582E899754b061188l1151931A3847273
20087d714348m8699031C319177L495014b4667634A0502783C962033c478988m686858
20079h165846D2083224b129781r840858q857997j2678732C3569339a8012166C633718
20070a644301k1846430a0667431D581819K0609493a4555201I916557m860156f661117
20061E133144d514812A9178713n026027f16728l3997409D0611372a1294487n846521
$$ plain form
20053 -17141008 -19788932 35269473 -28804532 -38911689 206397 -22653279 -11905731
20046 -11905731 2472622 25661724 -8978989 780486 -12139076 -40065215 4361837 32166908
20038 32166908 26091741 2685821 -11701450 4815144 10937942 28642629 13828696 14996182
20030 14996182 4940576 12131984 -10515020 32106870 -31283415 -9907063 -18508666 -17445328
20022 -17445328 773298 -11728016 28800592 -5790409 -22732520 -1412003 3873199 -18527873
20013 26072858 -1608678 -29331896 49946147 -24290846 30724317 16683796 15897968
20006 15897968 -1975491 25661277 16799662 -28474650 -14175308 -9195156 1054246 -32206281
19997 37635654 -18936129 14367994 6100658 1761898 27482912 -29224 5121622 -17058429
$$ packed form
20053a7141008k647924C5269473b8804532j0107157B06397b2653279J0747548
20046a1905731B472622K3189102h978989G80486a2139076k7926139D361837K7805071
20038C2166908o075167B685821a1701450D815144O122798J7704687A3828696J167486
20030A4996182D940576P191408a0515020C2106870c1283415i907063q601603J063338
20022a7445328G73298a1728016B8800592e790409j6942111a412003C873199a8527873
20013B6072858a608678k7723218D9946147b4290846C0724317j4040521p85828
20006A5897968a975491B5661277q861615b8474650a4175308M980152A054246c2206281
19997C7635654a8936129A4367994F100658A761898K5721014b9224E121622a7058429
$$ plain form
19988 -19950341 -35953386 -17220035 9473544 27502881 -29956350 6437414 -1988455
19980 19159901 34962581 28479742 32074143 22251595 -364853 18634602 -25485129 -13255694
19972 -13255694 3058934 -3219121 6081694 12195823 -37892297 -17552733 35155766 10889668
19963 44918865 30829164 23123430 -2719498 -16215895 -36824434 7517042 8840576 -2224173
19954 2912583 38529658 30926809 13761017 3687324 -40207314 -9220468 -44545886 -21031598
19945 -23876946 -705452 -15093562 37715548 -13636378 -18666143 11329043 2928451 -27972564
19936 30286087 -21457340 17437975 -6772744 27857448 -30906573 26906791 -12313815
19928 -8378014 18593356 23117686 35884457 -1360762 1132482 -4351060 15913191 -4123202
$$ packed form
19988a9950341j6003045a7220035I473544J8029337b9956350F437414a988455
19980A9159901J5802680o482839L594401r822548c64853A8634602b5485129J2229435
19972a3255694C058934c219121F081694O114129c7892297a7552733C5155766A0889668
19963D4918865j4089701p705734b719498j3496397k0608539G517042J323534b224173
19954B912583L5617075p602849A3761017C687324d0207314i220468l5325418b1031598
19945b3876946g05452j4388110C7715548a3636378n029765A1329043B928451b7972564
19936C0286087b1457340A7437975f772744B7857448c0906573B6906791a2313815
19928h378014A8593356M524330J2766771a360762A132482d351060A5913191d123202
$$ plain form
19919 11505412 -14785999 -22593482 46068115 -3305017 1339236 -19622766 -15180016 13168675
19910 -2845422 18676370 -6585520 -757804 5123748 -1632033 -15243163 -30209210 -5836375
19901 14422852 24826556 -37852756 11089015 11483747 -8670180 -16603883 6330541 23498868
19893 23498868 -51338317 -854962 -6588668 10441274 5658265 -31802657 -3288542 -8869784
19885 -8869784 10656921 -15100894 -12272747 -35160524 -15513701 -5424894 -24406569
19878 -24406569 40180775 19279356 18213869 27826795 8001770 -24742789 18995017
19870 -26709646 -57493062 5352626 -8712416 -6164110 19606087 -19543611 1792943 -23574580
19861 -4531917 -8867400 4980162 -9113324 -18881347 10587474 -2464150 24404272 -9509117
$$ packed form
19919A1505412a4785999p807483D6068115c305017A339236a9622766M442750A3168675
19910b845422A8676370f585520g57804E123748a632033j3611130j4966047e836375
19901A4422852J0403704c7852756A1089015L94732h670180p933703F330541J7168327
19893B3498868e1338317h54962n733706A0441274m783009c1802657c288542n581242
19885h869784A0656921a5100894K828147k2887777a5513701e424894j8981675
19878b4406569D0180775A9279356j065487R612926H001770b4742789A8995017
19870b6709646l0783416E352626h712416K548306A9606087a9543611A792943b3574580
19861d531917m335483D980162i113324r768023A0587474b464150B4404272i509117
$$ plain form
19852 -21524769 10302646 -14606787 -13383148 -3539078 3920850 -44711681 10338114
19844 21567736 40239291 2715569 -12279740 8915948 -3205831 -19771975 -11667985 -10544539
19836 -10544539 -26785972 24363520 13065734 -20359166 -48818345 -24984576 -33831328
19829 -33831328 -9051930 -3260955 25117205 -25421904 38232436 -6640330 -44899379
19822 -44899379 -44897218 -14025881 -17446152 37570892 -22480434 -1282054 20229774 7011516
19813 15654314 -12704941 -19149002 28846527 -14983284 25211788 964040 25228069
19806 25228069 12039820 -9324987 -10940593 -24228881 11899237 1590760 -21758249
19798 15741991 -1332566 42273209 33294747 18451463 9472616 13479726 -12100774 -3741963
$$ packed form
19852b1524769A0302646a4606787J223639c539078C920850d4711681A0338114
19844B1567736J8671555B715569a2279740H915948c205831j6566144Q103990J123446
19836a0544539j6241433B4363520j1297786b0359166k8459179K3833769q846752
19829c3831328i051930c260955B5117205b5421904C8232436f640330l8259049
19822d4899379K161a4025881l420271C7570892b2480434a282054B0229774G011516
19813A5654314a2704941o444061B8846527a4983284B5211788I64040K4264029
19806B5228069A2039820i324987j615606j3288288A1899237A590760b1758249
19798A5741991a332566D2273209q978462j4843284q978847M007110a2100774c741963
$$ plain form
19789 -17336961 3369186 -7610312 2412950 54063534 11721498 29161967 -37234478
19781 65661452 9390671 -5937727 344445 5078125 2785027 42478731 -4033174 -14576779
19773 -14576779 2456008 24714203 -15149117 -33598604 -20749776 -32802520 -14983903
19765 13201598 6111341 8709942 17572336 30126199 -28623500 -48260930 -19528200
19757 860457 7866739 -38789235 32874641 23772546 11056392 24767423 32780524 28761000
19749 28761000 25121905 18324941 -8969882 2824438 25677643 1071513 -16618523 -35461410
19741 -35461410 20840034 -5450104 27400918 -22659846 5533460 -25313999 -15900365
19734 -15900365 12795868 -7256657 -28988352 730636 -11210574 -9776332 -18494384 6885430
$$ packed form
19789a7336961C369186g610312B412950N1650584A1721498J7440469c7234478
19781F5661452I390671e937727C44445M733680k293098L9693704d033174j0543605
19773a4576779B456008K2258195a5149117j8449487J2848828j2052744a4983903
19765A3201598F111341K598601Q862394J2553863b8623500j9637430a9528200
19757H60457P006282c8789235C2874641r102095A1056392J3711031Q013101m019524
19749B8761000l639095o796964h969882B824438K2853205A071513a6618523j8842887
19741c5461410B0840034e450104B7400918b2659846E533460b5313999R413634
19734a5900365A2795868g256657k1731695G30636a1210574J434242q718052F885430
$$ plain form
19725 31959229 5898487 17820888 -16566063 -15471641 31814081 -27979882 -22211279
19718 -22211279 2029034 6521533 -15136776 -2334254 -29249641 27903665 -30362019
19710 9026772 9819900 -4035282 -526608 -3908235 -19933219 37704405 -26903718 3812337
19701 10592328 14516281 -8572481 7944374 -19640848 -24591604 -37235573 -2191804 28912916
19692 -44372756 3310037 22017067 13124682 33511742 36875055 53109688 3123795 12866852
19684 12866852 -4706157 -6856016 -32828364 26696225 -30127077 -7571012 7735655 11365513
19676 11365513 21230752 -19540521 4774092 12233451 1280223 29607487 9851416 -2569621
19667 17263193 -2740867 -20829472 -21554632 -26881023 -15516588 -12309328 -54794566 -886620
$$ packed form
19725C1959229E898487J1922401a6566063J094422C1814081b7979882N768603
19718b2211279B029034M492499a5136776b334254k6915387B7903665c0362019
19710I026772P93128d035282e26608l381627j6024984C7704405b6903718C812337
19701A0592328L923953h572481G944374a9640848m950756j2643969b191804B8912916
19692d4372756C310037J8707030q892385K0387060L363313J6234633C123795R743057
19684A2866852d706157k149859k5972348B6696225c0127077g571012G735655L629858
19676A1365513R865239a9540521D774092P459359A280223K8327264I851416b569621
19667A7263193b740867j8088605p25160n326391J1364435L207260m2485238h86620
$$ plain form
19658 6120261 -17474596 6126993 12187659 -1751933 15238194 33450281 15540942 19840226
19650 19840226 6719791 -29934186 752918 -7492051 12143077 17129346 -4237989 -5861098
19642 -5861098 71287533 25694483 -21560049 5989776 -21625397 -10442194 10180588
19634 -32380584 -20909824 2129950 -14549697 -41303331 -35441049 16879399 12070247
19627 12070247 -17100358 -38138019 2997211 23804204 -15949586 -19423378 -12259115
19620 -12259115 3548885 4651334 26992076 36619499 -30760360 16132816 6124403 -18381836
19611 -5418129 45585740 21689807 -27408876 4821465 -18008388 44696540 -1031673
19603 24543624 44717407 -859572 -4857255 -373173 -5575969 -28310925 9160875 -19678819
$$ packed form
19658F120261a7474596F126993O060666a751933A5238194J8212087A5540942M299284
19650A9840226F719791b9934186G52918g492051A2143077M986269d237989j623109
19642e861098G1287533B5694483b1560049E989776b1625397a0442194A0180588
19634c2380584J1470760B129950a4549697k6753634N862282A6879399m809152
19627A2070247a7100358k1037661B997211K0806993a5949586l473792P164263
19620a2259115C548885J102449K2340742R627423c0760360A6132816F124403a8381836
19611e418129D5585740B1689807b7408876D821465a8008388D4696540a031673
19603B4543624K0173783h59572l997683c73173n202796k2734956I160875a9678819
$$ plain form
19594 22976278 -28905138 23764356 11915298 20474537 -14936325 -44406147 -32340371
19587 -32340371 -490416 -4115215 -46595796 13143866 27388457 -12550754 -2116029 -23702814
19579 -23702814 -12293950 -53092097 20013121 -27940384 -55322021 -43226200 20562604
19571 -11379293 -14970755 6971072 -19045964 29191872 2387444 2731554 -20596318 36663421
19562 -48566949 -5114381 -34509975 15321940 44487157 -50865713 -4005739 2558938
19554 -14896323 -7135233 -2829823 57283063 -15311421 -14190849 -9885954 7714672 -19198608
19545 40646174 -700181 -5219603 -13860086 9176073 2524357 -33486237 6215071 21873058
19537 21873058 33189050 12173154 45386862 -30724278 20215949 3353765 35805687
$$ packed form
19594B2976278b8905138B3764356j1849058Q559239a4936325k9469822J2065776
19587c2340371d90416l624799m2480581A3143866J4244591a2550754b116029k1586785
19579b3702814J1408864m0798147B0013121b7940384k7381637J2095821B0562604
19571a1379293l591462F971072a9045964B9191872B387444L44110b0596318C6663421
19562d8566949e114381k9395594A5321940K9165217e0865713d005739B558938
19554a4896323g135233b829823E7283063a5311421J120572M304895G714672a9198608
19545D0646174g00181m519422q640483I176073B524357c3486237F215071J5657987
19537B1873058J1315992A2173154L3213708c0724278B0215949C353765L2451922
$$ plain form
19530 35805687 -5622202 19589941 1461685 21290951 1297874 33183058 -45680193
19522 20822889 -59433858 -2035467 22338417 -4076322 4142344 14938766 -6354821 24637949
19513 -18533851 14197238 -3194555 12463210 -11186579 32827197 16176754 8140271
19506 8140271 -8486559 -5590593 -1053528 -19221334 -10409239 21006215 4065284 -6558068
19497 4744338 -23637286 5630953 32258182 -7495035 8095315 29279539 24176982 -5276049
19488 7921001 -6536377 23565833 425672 -7155386 11650185 -9934524 -5538191 -25558857
19480 -25558857 -61251364 43655727 21389363 -7425617 -18688376 -21476772 9362471
19472 1514271 7673967 1477055 -17552358 33218350 -14842540 36555546 40629529 -35079415
$$ packed form
19530C5805687e622202A9589941A461685J9829266A297874L1885184d5680193
19522B0822889e9433858b035467B2338417d076322D142344J0796422f354821B4637949
19513a8533851A4197238c194555A2463210a1186579C2827197A6176754q036483
19506H140271h486559K895966a053528j8167806Q812095B1006215D065284f558068
19497D744338b3637286E630953K6627229g495035H095315K1184224n102557e276049
19488G921001f536377B3565833D25672g155386A1650185i934524M396333k0020666
19480b5558857l5692507D3655727B1389363g425617j1262759k788396I362471
19472A514271O159696A477055a7552358C3218350a4842540C6555546M073983c5079415
$$ plain form
19463 32410158 -31029494 10855751 -53057044 -20547831 1834066 -1096828 30335140
19455 -1461863 25432383 -30605719 -18924376 11449365 -17505004 -19010735 -10894614
19448 -10894614 -15234865 23107415 -20464691 -24304344 -8783146 -47486051 19795488
19440 -9532777 10069949 18381080 13600414 -14333751 -22143354 -91080 43417370 12340429
19431 7022831 -12411164 11480955 -9033793 -23769441 14814781 14641962 -19419687 -35229029
19423 -35229029 13549003 16902501 1862530 -9760259 -13777992 9662576 -10952575 29443015
19414 -6391292 -20553219 -8792520 24731080 -3005749 10092375 -28174953 32551204
19406 16420937 -22565306 -7330870 4943599 2755170 -1606894 13983173 25458210 23420724
$$ packed form
19463C2410158c1029494A0855751e3057044b0547831A834066a096828C0335140
19455a461863B5432383c0605719J1681343A1449365a7505004j505731Q116121
19448a0894614m340251B3107415b0464691l839653h783146l8702905A9795488
19440i532777A0069949Q311131m780666a4333751p809603i1080D3417370A2340429
19431G022831a2411164A1480955i033793j4735648A4814781j72819a9419687j5809342
19423c5229029A3549003L353498A862530i760259m017733I662576a0952575B9443015
19414f391292j4161927h792520B4731080c005749A0092375b8174953C2551204
19406A6420937b2565306g330870D943599k188429a606894A3983173J1475037k037486
$$ plain form
19398 23420724 -3542577 -7966894 7572821 21261303 19902187 8194598 -21380757 21285257
19389 15098403 1507002 12427600 9250441 47533 7069918 3108521 11479507 3766094
19380 -4312960 1624652 7828912 685419 -6475192 22337998 -26067889 4502822 -33282468
19371 -33109006 4016177 -8557725 -34627633 -22321761 12549500 -33519222 2588105
19363 12329537 41027960 16552799 3026905 17141843 -19238743 19057684 -22625046
19355 -38490723 -3832603 -33778378 2632526 -21623323 6050469 -20791236 -35326543
19348 -35326543 -9608012 -17692490 13365693 18461490 -4432148 -20203963 6236127 19028140
19340 19028140 -25769857 -24395682 3917562 -10407081 9321961 8196072 -631974 -32823903
$$ packed form
19398B3420724c542577m424317G572821J3688482j359116H194598b1380757B1285257
19389A5098403A507002J0920598l177159D7533P022385C108521Q370986C766094
19380d312960A624652O204260F85419f475192B2337998b6067889D502822c3282468
19371c3109006D016177h557725k6069908J2305872A2549500c3519222B588105
19363A2329537K8698423A6552799C026905J4114938a9238743A9057684b2625046
19355c8490723c832603k9945775B632526b1623323F050469b0791236j4535307
19348c5326543i608012q084478A3365693N095797d432148j5771815F236127J2792013
19340A9028140b5769857J374175C917562a0407081I321961j125889f31974l2191929
$$ plain form
19332 -32823903 14122325 3382239 -26760883 -24265860 -21187814 -29347364 -23029912 36408982
19323 16583146 7134446 10063565 24499218 52956620 4213676 -1836117 27993732 16808618
19315 16808618 12457864 1323961 21048603 -33771793 -28663682 -56590956 18426607
19307 10807210 -25029078 -8715091 15568791 -9295330 -20486805 -57152031 9239773
19299 18419301 -11575964 -12285981 -7559095 11686232 -30505223 -5653539 -15870235 -15002909
19291 -15002909 -8031037 26066874 -14524813 -3009844 -11263485 -7504515 -8748795 19660076
19282 16230226 -35698595 19133386 -46706775 437063 13720298 2820035 11518862 -4469871
19273 4126643 56402183 -17552765 -20475598 14848821 1541406 11147229 44228996 -36390742
$$ packed form
19332c2823903A4122325C382239b6760883K495023L078046q159550O317452C6408982
19323A6583146G134446K929119J4435653K8457402D213676a836117B7993732j1185114
19315A6808618m350754A323961J9724642c3771793N108111k7927274A8426607
19307A0807210b5029078h715091A5568791i295330j1191475l6665226I239773
19299A8419301a1575964p10017M726886A1686232c0505223e653539j0216696Q67326
19291a5002909O971872B6066874a4524813c009844q253641L758970j244280A9660076
19282A6230226c5698595A9133386d6706775D37063J3283235B820035Q698827d469871
19273D126643N2275540a7552765k922833A4848821A541406R605823L3081767c6390742
$$ plain form
19264 -41304868 1056242 -29273744 3790434 -14943506 5199162 14297996 -8605978 -4586633
19256 -4586633 1691175 15403426 -2922346 -2480878 10252213 -9771157 -19535364 22711490
19247 -3561845 -29916590 -26257426 -9011418 3665180 19611202 11155490 -38576850 -23414464
19239 -23414464 -23620570 -28204222 -42119561 -3477342 -29788446 -11093290 25094626 -3987937
19230 20576439 12897528 -19120135 14061078 -4056730 -17176214 -2120225 -2959487 2369912
19221 6750558 32319587 23905227 -9239954 -24355994 -10754025 -12045150 -1393384 19915025
19212 -48129845 13384459 -16237071 -47736461 12314387 -666080 -13517094 -44975464
19205 -44975464 -23810078 -22359185 22064744 -23460871 -2687940 38121823 -9806982
$$ packed form
19264d1304868A056242b9273744C790434a4943506E199162R098834h605978M019345
19256d586633A691175J3712251b922346M41468A0252213i771157r764207B2711490
19247c561845k6354745L659164i011418C665180J5946022q455712c8576850J5162386
19239b3414464k06106m583652j3915339c477342k6311104a1093290B5094626c987937
19230B0576439p678911a9120135A4061078d056730j3119484b120225q39262B369912
19221F750558K5569029q414360i239954j5116040a0754025j291125a393384A9915025
19212d8129845A3384459a6237071l1499390A2314387f66080j2851014l1458370
19205d4975464K1165386J450893B2064744b3460871b687940C8121823i806982
$$ plain form
19197 42070746 10897950 1516002 -36098569 -34958556 39261096 31651318 -4268007 32285625
19188 26314798 -12772703 7639211 -25838620 -20427097 19146645 18433348 7189500 -3809422
19179 10597693 24372306 -15644844 6155731 2513753 23999225 -1074760 -9149275 23162381
19170 -8836564 8988704 -31380077 1704655 6622325 2917981 -20175576 -23138643 -15598579
19162 -15598579 20635053 7926950 -27884120 -26679688 -22424875 46369121 -31751303
19154 -5641392 -32419618 -2665790 -8252374 -13773814 29833145 -23512888 3461984 2958798
19146 2958798 -9982714 -33115774 -17168731 -21747673 13554350 -39486498 34593421
19138 10872098 30864620 -6351016 -16196636 17029495 33293857 6486827 24199606
$$ packed form
19197D2070746A0897950A516002c6098569J140013C9261096p609778d268007C2285625
19188B6314798a2772703G639211b5838620N411523A9146645p13297G189500c809422
19179A0597693J3774613a5644844F155731B513753K1485472a074760q074515B3162381
19170h836564H988704c1380077A704655M917670B917981b0175576k963067P540064
19162a5598579B0635053G926950b7884120J204432M254813D6369121c1751303
19154e641392k6778226b665790n586584n521440B9833145b3512888C461984n03186
19146B958798i982714k3133060J5947043m578942A3554350c9486498C4593421
19138A0872098J9992522f351016r845620A7029495J6264362F486827J7712779
$$ plain form
19131 24199606 7713536 -2200768 -556016 16076066 24544385 -31862080 -19325699 -34072929
19123 -34072929 526731 17149113 10027280 -21063125 -12712597 15891693 -600169 8932315
19114 22259207 23714544 30728926 17375728 23244013 -34112574 8112246 -9802038 485889
19105 31944467 46141883 -11101737 -30517852 -10687934 -29320750 15749656 -21110765
19097 3099580 7113295 -5944035 -19237277 -554562 -5024290 6032648 34865655 -17110670
19088 -20432946 2417652 5955971 -79001 27813465 4557911 20968484 -37668176 28284617
19079 18430639 395477 -13302811 -25444248 -16421364 -31799938 12724754 -4194986 15198268
19070 -26955830 14693481 18916887 -6534927 14288398 -4686206 11182416 -2706035 -24123211
$$ packed form
19131B4199606G713536b200768e56016A6076066Q468319c1862080J2536381j4747230
19123c4072929E26731J6622382p121833b1063125Q350528A5891693f00169H932315
19114B2259207J455337P014382j3353198N868285c4112574H112246i802038D85889
19105C1944467J4197416a1101737j9416115a0687934j8632816A5749656b1110765
19097C099580M013715e944035j3293242e54562m469728F032648K8833007a7110670
19088b0432946B417652L538319g9001B7813465D557911J6410573c7668176B8284617
19079A8430639C95477a3302811j2141437R022884j5378574A2724754d194986A5198268
19070b6955830A4693481M223406f534927A4288398d686206A1182416b706035k1417176
$$ plain form
19062 -24123211 3426551 -49643833 -4050873 2233145 -13759124 -6896381 -8295366 13429061
19053 -35734637 -6105927 -8769926 26143896 21020187 14339150 1158071 35162938 6186613
19044 -38378939 -16111521 -11250401 -8476080 4077534 2481945 4894448 -29374406 13536330
19035 824746 -21758953 -56586828 8290009 38822484 1309981 -6011656 -5728655 -12867456
19027 -12867456 -26985655 -23834849 806269 24264617 45945429 4408209 -49456296 27083022
19018 -4755278 -8104540 23604738 12116297 -36141480 14482349 -12919016 41710091
19010 -12138404 -3925322 14600606 -22412645 -17622522 -11334396 -3844419 -2491490 12456532
19001 -31260913 -14171584 11348683 11694631 5956703 -184800 -19853439 -4790220 -1962823
$$ packed form
19062b4123211C426551d9643833d050873B233145a3759124O862743j398985A3429061
19053c5734637f105927k663999B6143896n123709o681037A158071L4004867F186613
19044c8378939a6111521M861120K774321D077534j595589K412503b9374406A3536330
19035H24746b1758953l4827875H290009L0532475A309981f011656K83001p138801
19027a2867456j4118199L150806H06269K3458348K1680812D408209d9456296B7083022
19018d755278l349262B3604738j1488441c6141480A4482349a2919016D1710091
19010a2138404c925322A4600606b2412645M790123O288126c844419J352929A2456532
19001c1260913a4171584A1348683L45948n737928a84800j9668639d790220a962823
$$ plain form
18992 -16873219 -3488151 -43012715 30152741 25220205 -2114057 19150706 31762840
18985 31762840 21672579 31540438 -19522296 -471986 40560694 -19672374 54368985
18977 -6459912 4658233 3264369 -12362748 -16399561 3226017 7776356 -16040780 28040938
18968 -8408816 11310470 9710771 -797567 -24525889 -34357806 -3152958 -2464746 35919109
18959 -6942153 11050295 -22610592 15561895 5638878 7751201 12113296 -13700652 -2731451
18950 -2383700 -39497230 -27286616 -22785673 18373808 -1942932 -610714 2153992 -5698041
18941 -1484397 -20455368 35754711 -4322835 20536809 -25953767 -19626864 12970697
18933 -8648508 52351944 4371054 -10461852 -6725956 12499822 28605190 -13973 -42374639
$$ packed form
18992a6873219c488151l9524564C0152741m932536b114057A9150706J2612134
18985C1762840j0090261R867859a9522296d71986D0560694a9672374E4368985
18977f459912D658233j393864a2362748m036813C226017M550339a6040780B8040938
18968h408816A1310470j599699g97567k3728322r831917c152958O88212C5919109
18959f942153A1050295b2610592A5561895E638878K112323M362095a3700652b731451
18950b383700l7113530J2210614M500943A8373808a942932f10714B153992e698041
18941a484397j8970971C5754711d322835B0536809b5953767O326903A2970697
18933h648508E2351944D371054a0461852L735896A2499822J6105368a3973m2360666
$$ plain form
18925 -42374639 -7650686 9691355 11066235 -4686490 -27034647 -27655699 -23463293 2368346
18916 10890909 17368304 3572662 50548846 6673808 36996861 3965768 -36463395 -40521334
18908 -40521334 -20636089 -14014415 -32696362 45729948 25901881 30501523 -11068794
18900 30306264 -27399463 -3473161 -7380591 19008836 4193082 -9581440 -5680142 -19137516
18892 -19137516 -26367538 29276745 -52341334 22600118 -51274596 18795615 -9000913
18884 12090811 25341536 -1425590 21330915 17513937 -9487483 35933390 -46526846
18876 -20876111 39724432 -28878109 -4141938 -21558799 8543568 -29836629 -36798385
18869 -36798385 31544860 30550242 -33315405 -25863170 4587339 -33158552 -9779321 11004730
$$ packed form
18925d2374639g650686I691355J374880d686490k2348157o21052M192406B368346
18916A0890909O477395C572662M6976184F673808L0323053C965768c6463395m057939
18908d0521334J9885245O621674j8681947D5729948j9828067M599642a1068794
18900C0306264b7399463c473161l907430A9008836D193082i581440L901298j3457374
18892a9137516p230022B9276745e2341334B2600118e1274596A8795615i000913
18884A2090811J3250725a425590B1330915l816978i487483C5933390d6526846
18876b0876111C9724432b8878109d141938j7416861H543568b9836629o961756
18869c6798385C1544860r94618c3315405P452235D587339c3158552i779321A1004730
$$ plain form
18860 -9831083 8574793 710818 658788 13601935 53031758 -14912907 29923320 23683068
18852 23683068 23874020 -33846453 -7986486 -17909493 -237619 -19987023 -35838996 27149914
18843 7728593 44978959 11991282 -20963781 7618218 12076466 -11761618 -37973925
18836 -37973925 -11787381 -13047604 -24821254 2119613 4244782 27738379 1548571 -22812557
18827 27474380 -2117686 1354732 -2904143 5164862 -7019874 -44226125 10881512 23789347
18819 23789347 -51065831 2490472 -26196760 -4226676 -14843284 27472569 -10708236
18811 7815696 17904851 -5378168 16554628 -9068936 -22283697 8688550 -2282724 1751960
18802 -2752112 -7312230 31066759 -15286558 -30957189 -10519839 17719612 -2083774
$$ packed form
18860i831083H574793G10818n2030J2943147L9429823a4912907B9923320o240252
18852B3683068J90952c3846453g986486r923007b37619j9749404j5851973B7149914
18843G728593L7250366A1991282b0963781G618218M458248a1761618k6212307
18836c7973925a1787381j260223j1773650B119613K125169K3493597A548571b2812557
18827B7474380b117686A354732b904143E164862g019874l7206251A0881512J2907835
18819B3789347e1065831B490472b6196760d226676j0616608B7472569a0708236
18811G815696J0089155e378168A6554628i068936j3214761H688550b282724A751960
18802b752112m560118C1066759a5286558j5670631a0519839A7719612b083774
$$ plain form
18794 -12304452 16801944 -12256535 25665928 17119077 -15999046 33006252 -9360133
18786 -24717064 10376815 16981305 -15175166 -11559173 -6052266 31976611 6069595 40126518
18778 40126518 -18060186 2442662 16616887 49292957 -8130940 23193130 12788531
18771 12788531 9961367 -48671272 21169664 -7433204 5406503 -8875245 -8152231 7836800
18762 -12402704 5961422 12311558 6134981 -328656 21195714 -5883775 -29906794 -5977578
18753 17515184 -18479158 7355558 -3041003 -10271418 432043 -7132814 13201822 -624471
18744 3669811 15808001 3724834 -19784210 -7487250 44025198 11449528 -25824006
18736 51204747 8522195 -39007543 28027808 -1872832 36828230 11564727 10445315
$$ packed form
18794a2304452A6801944a2256535B5665928q546851a5999046C3006252i360133
18786b4717064A0376815O604490a5175166L615993N506907C1976611F069595L4056923
18778D0126518a8060186B442662J4174225L2676070h130940B3193130j0404599
18771A2788531k827164d8671272B1169664g433204E406503h875245P23014G836800
18762a2402704E961422O350136F134981c28656B1195714e883775k4023019e977578
18753A7515184a8479158G355558c041003p230415D32043g132814A3201822f24471
18744C669811J2138190C724834a9784210g487250D4025198A1449528b5824006
18736E1204747H522195c9007543B8027808a872832C6828230A1564727j119412
$$ plain form
18729 10445315 8389923 -10150418 16963206 -3802768 7236559 13548984 22157676 -44617103
18720 -64963916 1891403 12919667 8171408 7933162 -8743477 -43538451 -18835233 932851
18711 -40048028 19991110 -18767405 -12284333 18293290 10382360 -4062757 12606142
18703 52609768 3491887 -2142392 21703664 -27384026 -34489260 -22965363 -6625279 -10001994
18695 -10001994 74153947 1673994 -20616317 -47448221 2577419 -31219394 4033228
18687 3476859 -17185597 -10577824 -2771788 -7642348 1494266 23500377 32961719 -30130207
18678 -7728138 6508638 -16409383 -5762705 36044996 39266526 39980833 -35681989 -42747951
18670 -42747951 -10442483 -66152040 1156217 9037314 -1662889 35750845 -10657800
$$ packed form
18729A0445315k055392a0150418A6963206c802768G236559O312425Q608692d4617103
18720f4963916A891403J1028264m748259k38246h743477l4794974a8835233I32851
18711d0048028A9991110a8767405O483072A8293290p910930d062757A2606142
18703E2609768C491887b142392B1703664b7384026p105234J1523897f625279l376715
18695a0001994G4153947A673994b0616317k6831904B577419c1219394D033228
18687C476859a7185597O607773b771788m870560A494266K2006111R461342c0130207
18678g728138F508638a6409383e762705C6044996L221530P14307c5681989p065962
18670d2747951a0442483n5709557A156217P881097a662889C5750845a0657800
$$ plain form
18662 -27503064 18189780 -8127668 -13126523 -32927551 -19164027 -25061457 5205236 17631500
18654 17631500 42815705 5312174 66498385 -28625935 -8906232 -4348616 -17622492
18647 -17622492 -9446282 7199055 -20955017 -18491062 11286467 -6385151 -5969325 11570706
18638 -10700972 1831949 20989489 -2459602 -4808438 33733976 -1438161 -24419955 -33140995
18630 -33140995 -48895643 -3504316 14304933 -2552101 12087172 30364897 -15876882
18622 17260824 -33521116 -40571699 -26752227 -25264803 -16600329 3067307 -7623802 -1672121
18613 28841158 12868267 -15229114 -3690786 6645762 42656249 -15144078 -20466051
18606 -20466051 5128416 -12498751 42294610 -19388834 33865085 35643707 42379443
$$ packed form
18662b7503064A8189780h127668m998855j9801028J3763524n897430E205236J2426264
18654A7631500K5184205E312174O1186211b8625935h906232d348616j3273876
18647a7622492Q176210G199055b0955017K463955A1286467f385151M15826A1570706
18638a0700972A831949J9157540b459602k348836C3733976a438161k2981794q721040
18630c3140995j5754648c504316A4304933b552101A2087172J8277725a5876882
18622A7260824c3521116p050583J3819472J487424Q664474C067307g623802a672121
18613B8841158A2868267a5229114c690786F645762L6010487a5144078n321973
18606b0466051E128416a2498751D2294610a9388834C3865085J778622O735736
$$ plain form
18599 42379443 13936806 30126192 -27390658 3027508 43851434 28562096 -15559574
18591 -19189219 47689067 -23315558 -67690578 -7068822 13064651 1082088 -21635004
18583 -5289511 3356003 -24554024 13615273 -35817933 30094391 -1831505 -33730115
18576 -33730115 31710097 40283345 -5098190 -8068292 -30584559 -28726078 -16796676 20574646
18567 9278769 7239148 37575939 24390202 -42548703 14357904 -13370415 2995264
18559 24124026 -1640452 45418111 -42289831 -7159043 -2033428 18700302 19642483 5186582
18550 -22362768 -17635746 -36588994 -6104744 -5460572 1014956 23954752 12334831 -5108063
18541 -178563 9528572 -17741063 7641429 6494451 18936751 39869234 37068466 16258468
$$ packed form
18599D2379443A3936806J6189386b7390658C027508M0823926j5289338a5559574
18591a9189219D7689067b3315558m4375020g068822A3064651A082088b1635004
18583e289511C356003b4554024A3615273c5817933C0094391a831505l1898610
18576c3730115C1710097Q573248e098190k970102k2516267J858481J1929402B0574646
18567I278769k039621L0336791j3185737d2548703A4357904a3370415B995264
18559B4124026a640452D5418111d2289831g159043b033428A8700302R42181E186582
18550b2362768M727022j8953248f104744O44172A014956K2939796j1619921e108063
18541a78563I528572a7741063G641429j146978J2442300K0932483k800768A6258468
$$ plain form
18532 -23733999 26469861 17472643 -28502519 840703 -1607083 1619314 -12527526 14761337
18523 8062178 13800156 -57637432 10892387 8680545 19878858 30085952 8346971 45050052
18515 45050052 11884511 -62233342 -10665631 14742971 -12839363 -7529202 -16843994
18508 -16843994 1894202 -39229541 -17813786 30750942 -35033058 8499338 29805079
18501 29805079 -70369161 -9559789 -27472710 19550206 -30973818 -11613207 8273116
18493 17529805 25006701 -28580876 46200283 -19207571 4613313 13466177 -7347133 47586245
18484 25233165 10889943 19928898 5963588 -10451806 565623 -14539089 -1806592 10790932
18475 -514408 8036775 -34612 -20923292 18065524 -1429683 -39284234 4960587 17764607
$$ packed form
18532b3733999B6469861q997218b8502519H40703a607083A619314a2527526A4761337
18523H062178N737978e7637432A0892387k211842J1198313J0207094H346971L6703081
18515D5050052A1884511f2233342a0665631A4742971a2839363N310161r314792
18508a6843994A894202c9229541a7813786C0750942c5033058H499338K1305741
18501B9805079g0369161i559789j7912921A9550206c0973818a1613207H273116
18493A7529805P476896b8580876D6200283a9207571D613313Q852864g347133D7586245
18484B5233165A0889943R038955E963588a0451806E65623a4539089a806592A0790932
18475e14408H036775c4612k0888680A8065524a429683l7854551D960587J2804020
$$ plain form
18467 17764607 19690441 33734964 -6008726 -12435533 373939 9306207 3121364 13234277
18459 13234277 -45025414 -6180415 23256869 32763990 -25213810 5514599 22778957
18452 22778957 13691248 15569429 15181340 9004663 24687093 40613433 7589477 -13948186
18443 16029518 57037610 21717298 -47133793 -354451 -8847347 88626 -37028435 -9255049
18434 16218645 -1880574 2364741 8213132 9056878 19682696 20237901 -54302665 -19724349
18425 22451956 16726523 2248374 -2388964 40974231 -8968659 -6878714 -15841753 18992927
18416 -51854754 2321105 38635548 -27926364 38552570 -20484178 -34944429 27696368
18408 26080295 -16422261 2300041 43789027 2657184 2675985 -9411562 7200337 13004759
$$ packed form
18467A7764607J925834J4044523f008726o426807C73939Q932268C121364J0112913
18459A3234277d5025414f180415B3256869R507121b5213810E514599J7264358
18452B2778957r087709J878181l88089o176677J5682430J5926340G589477a3948186
18443A6029518M1008092B1717298d7133793c54451q492896H8626c7028435i255049
18434A6218645a880574B364741N848391Q43746J0625818N55205e4302665a9724349
18425B2451956n725433B248374b388964D0974231h968659K089945q963039A8992927
18416e1854754B321105L6314443b7926364C8552570b0484178j4460251B7696368
18408B6080295a6422261B300041M1488986B657184J8801i411562G200337N804422
$$ plain form
18400 13004759 -720480 -1555766 6466913 38694962 -5336821 11951889 -23260126 -6813678
18391 32834 -3125091 -11639556 11988862 -4125820 -22534090 -400807 5477688 13269414
18383 13269414 26011094 -10637311 -21550856 -4841044 32547228 -10677716 -3015673
18375 -28508740 -11342668 40235376 -10093813 3310347 8217933 -34497829 -54407092
18368 -54407092 -2078575 -25383175 500021 -26132144 33047101 -17601304 17779386
18360 19146861 16051651 -1892622 2407332 21576538 -6146248 4637428 21426658 20038121
18352 20038121 9923760 35485389 5485934 2945785 41388372 16075309 -2867026 -23861962
18344 -23861962 47463111 8975388 -31560788 -19405004 13929894 20055925 3382713
$$ packed form
18400A3004759g20480q35286F466913L2228049e336821A1951889b3260126f813678
18391C2834c125091q514465A1988862d125820j8408270d00807E477688P791726
18383A3269414J2741680a0637311j0913545d841044C2547228a0677716c015673
18375b8508740a1342668D0235376a0093813C310347M907586c4497829j9909263
18368e4407092b078575k3304600E00021b6132144C3047101a7601304A7779386
18360A9146861l095210a892622B407332J9169206f146248D637428J6789230j388537
18352B0038121I923760K5561629E485934k540149L8442587A6075309b867026k0994936
18344b3861962D7463111H975388c1560788J2155784A3929894O126031C382713
$$ plain form
18336 -10961533 -5783430 23896749 29343583 35676161 5396132 -4908484 -19957453 1068821
18327 -29715286 11647563 -21414808 -5111070 34977540 -13854358 25837779 23919978
18320 23919978 11346587 25583856 1674945 -10905399 -6341739 2253296 2090198 31476752
18312 31476752 -15820962 4376345 -52752042 -15377518 24404182 29043846 8929415
18304 -36050197 7147028 28422419 25238828 30880951 20333426 -44251394 -8452349 -18895590
18296 -18895590 13390976 -2652585 8681157 4818074 -17109029 -11141973 1661826 -37209003
18287 21741360 -14737677 18016095 -42555895 1736729 -26770915 6620083 8164796
18280 8164796 17174377 -9750984 -9917204 46112600 5616267 -18654806 -14208248 -17422886
$$ packed form
18336a0961533N178103B3896749N446834O332578E396132d908484j5048969A068821
18327b9715286A1647563b1414808e111070C4977540a3854358B5837779j917801
18320B3919978A1346587J4237269A674945a0905399M563660B253296j63098K9386554
18312C1476752a5820962D376345e2752042a5377518B4404182M639664H929415
18304c6050197G147028K1275391l183591N642123j0547525d4251394h452349j0443241
18296a8895590A3390976b652585H681157l863083a7109029N967056A661826c7209003
18287B1741360a4737677A8016095d2555895A736729b6770915F620083J544713
18280H164796R009581i750984j66220D6112600E616267a8654806M446558l214638
$$ plain form
18272 -17422886 -15076791 18680357 35985557 6378717 -6629302 2313551 18820323 -6626148
18263 -7449285 -6872605 -20437653 5098624 16459876 -25885908 23279607 10454416 16486257
18255 16486257 374276 -6586081 -21267420 -23626734 15484127 7476664 405590 8324613
18247 8324613 17228248 -35687511 16549023 -4872346 3848538 22775461 894534 -8430800
18238 -8789146 -18353097 -20689366 -64843347 -38837016 17463331 18371737 22148844 28072826
18230 28072826 -23822365 10425746 14496815 -6746073 34788730 23339205 29856797
18223 29856797 -59296901 -30553574 -9637786 2073656 2038316 -17414709 22570786 605232
18214 -31897966 11636866 -30807454 17046891 -50595926 20986059 -11093009 6163295
$$ packed form
18272a7422886K346095A8680357J7305200F378717f629302B313551J6506772f626148
18263g449285N76680j3565048E098624J1361252b5885908B3279607A0454416O031841
18255A6486257C74276f586081j4681339k359314A5484127G476664D05590P919023
18247H324613Q903635c5687511A6549023d872346C848538J8926923H94534h430800
18238h789146r563951k336269m4153981K6006331A7463331R08406L777107N923982
18230B8072826b3822365A0425746M071069f746073C4788730j1449525O517592
18223B9856797e9296901K8743327i637786B073656l5340a7414709B2570786F05232
18214c1897966A1636866c0807454A7046891e0595926B0986059a1093009F163295
$$ plain form
18206 -7728116 -6815615 -2631392 9202367 2384346 10912996 -2929832 13045679 20292202
18198 20292202 -21375637 -22468404 27880229 14793181 1249903 16007512 28804368
18191 28804368 6730188 8983794 10487099 50374586 -3651339 3072676 28455408 2597005
18182 3572231 510529 14029558 -33328783 -8272240 9793992 -2916849 3656490 -25822309
18173 -24962985 24479090 -10364400 -3043355 39095519 16352729 23935604 46845580
18166 46845580 7387893 4846376 23857174 16337358 -1937682 17654197 5925553 7900235
18158 7900235 -27315353 -7841450 5394006 -5444737 -1793803 -14487450 -35212687 -2883896
18149 -16900390 2627280 9447719 -17113720 -28475442 4769264 -13673028 11960365
$$ packed form
18206g728116R12501b631392I202367B384346Q528650b929832A3045679P246523
18198B0292202b1375637j092767B7880229j3087048A249903J4757609J2796856
18191B8804368F730188K253606J503305L9887487c651339C072676K5382732B597005
18182C572231E10529J3519029c3328783h272240I793992b916849C656490b5822309
18173b4962985B4479090a0364400c043355C9095519A6352729P582875K2909976
18166D6845580G387893k541517J9010798p519816a937682A7654197E925553J974682
18158G900235b7315353g841450E394006e444737a793803j2693647k0725237b883896
18149a6900390B627280O820439a7113720j1361722D769264a3673028A1960365
$$ plain form
18141 242884 39827199 11812467 5117455 -12564374 552148 16616540 -12920110 28262096
18132 3352625 -19949302 5929097 -2052065 -3670579 -28125624 -20652557 -9988907 27074284
18123 30910649 -2725501 61778736 2372417 -16651402 -14884006 4229005 -17051960 24603497
18114 -2762335 -14189087 -64273798 1025634 -6468179 -8927085 -2546081 19519071 -12474950
18105 -10749061 -7720138 -2385853 26511113 14027822 1631534 3119613 10218406 -44579068
18096 11964054 -8496791 50506898 -31414389 -6148589 -49739360 15408181 -14743338
18088 401612 -23184668 -22097315 -29280273 -10887942 -4850826 -36385660 19469557 -27529013
18079 10077173 18693723 4649234 -29940827 20303586 -7075248 -37659146 -1666743 -6412108
$$ packed form
18141B42884L9584315A1812467E117455a2564374E52148J6064392a2920110B8262096
18132C352625a9949302E929097b052065j618514k4455045P473067i988907B7074284
18123C0910649b725501F1778736B372417a6651402J767396D229005a7051960B4603497
18114b762335j1426752n0084711A025634f468179k458906b546081A9519071a2474950
18105a0749061L028923b385853B6511113j2483291A631534J488079P098793d4579068
18096A1964054h496791E0506898c1414389f148589m3590771A5408181a4743338
18088D01612b3184668J087353p182958a0887942d850826l1534834A9469557b7529013
18079A0077173Q616550D649234b9940827B0303586g075248l0583898a666743m745365
$$ plain form
18071 -6412108 -29663618 2878330 29267600 -40281001 -19049 19249735 -16532547 -29705358
18063 -29705358 46421863 -29938647 39425145 -31754572 37774199 -7191919 -9999372
18056 -9999372 19600562 25956027 1381461 2790198 -40443122 -33272177 7220730 -9834089
18047 25638690 -24328224 4212052 25350533 4309743 -16342351 11847691 -5002923
18039 22806888 -17602707 -2263470 -10040571 12268185 27549515 36594471 -14530937
18031 -9605952 -2035129 14547376 -5391458 -5591845 17835725 -1132415 11679202 -39584751
18022 1659145 -11693868 -6053485 -712184 -38205234 -22773869 289604 36006408 -13770346
18013 17183242 -15962318 18887500 -32085116 -16293943 -16029128 -22473209 -7487500 -23553320
$$ packed form
18071f412108k3251510B878330K6389270d0281001a9049A9249735a6532547j3172811
18063b9705358D6421863b9938647C9425145c1754572C7774199g191919k807453
18056i999372A9600562O355465A381461J408737d0443122P170945G220730i834089
18047B5638690b4328224D212052K1138481D309743a6342351A1847691e002923
18039B2806888a7602707b263470p777101A2268185J5281330R044956a4530937
18031i605952b035129A4547376e391458k00387A7835725a132415A1679202c9584751
18022A659145a1693868N640383g12184l7493050J5431365B89604L5716804a3770346
18013A7183242a5962318A8887500c2085116J5791173K64815o444081g487500j6065820
$$ plain form
18005 -23553320 13169150 29191586 4583156 -54763641 13562817 -31330765 -24677177
17998 -24677177 -182460 13312670 -4471119 -26591954 -34031580 20327446 -15988649 -15222537
17990 -15222537 11304654 -33010397 -21744830 6934296 23287206 21184142 18504590
17983 18504590 35808443 -366957 -2600876 -10471277 -21523579 6512321 -14693332 -12594055
17975 -12594055 19310913 -2258096 -34942965 -3710819 42091785 -603374 18285861 37059319
17967 37059319 24914218 -28178137 11240500 -30249087 108290 -33728519 -23257715
17960 -23257715 -13741947 -31124914 24355974 35667436 34571261 766053 16320856 -20619031
17951 5256844 10886990 13314753 14506463 737220 7495667 5538600 12638508 -19547017
$$ packed form
18005b3553320A3169150J6022436D583156e4763641A3562817c1330765O653588
17998b4677177a82460A3312670d471119k2120835p439626B0327446a5988649P66112
17990a5222537A1304654c3010397J1265567F934296J6352910k103064k679552
17983A8504590J7303853c66957k233919p870401j1052302F512321a4693332K099277
17975a2594055A9310913b258096l2684869c710819D2091785f03374A8285861J8773458
17967C7059319j2145101b8178137A1240500c0249087A08290c3728519J0470804
17960b3257715R515768j7382967B4355974J1311462j096175G66053J5554803b0619031
17951E256844N630146K427763J191710G37220O758447j957067P099908a9547017
$$ plain form
17942 -29805836 16044085 -6736585 51719950 -27552090 -10093773 10062252 28411194
17935 28411194 16265420 -21858471 13118010 -32402091 22184977 20323968 19830531
17928 19830531 60206751 32194086 -14825030 -16961840 -10025460 -33738885 18900173
17920 151341 -44578325 30541915 47417151 14780357 26529155 -2333994 7003530 -26019980
17911 8843714 -5816442 16320105 38641721 -7904284 -35871394 -5460135 36405457 -4045827
17902 -4667482 -7095891 -36436497 -3459408 14967469 32907737 33012995 -20244531 -8970126
17893 -2674515 -20467794 -25256474 -893674 -24767299 35940316 23209189 48701 7474452
17885 7474452 5990597 -15345056 13759098 -43249640 11390231 20770195 -5097570 -3476677
$$ packed form
17942b9805836A6044085f736585E1719950b7552090a0093773A0062252J8348942
17935B8411194j2145774b1858471A3118010c2402091B2184977j861009m93437
17928A9830531M0376220k8012665a4825030k136810O936380k3713425A8900173
17920A51341d4578325C0541915J6875236A4780357J1748798b333994G003530b6019980
17911H843714e816442A6320105K2321616g904284k7967110e460135C6405457d045827
17902d667482k428409k9340606c459408A4967469J7940268J05258b0244531h970126
17893b674515j7793279m788680h93674k3873625C5940316j2731127D8701P425751
17885G474452j483855a5345056A3759098d3249640A1390231R379964e097570J620893
$$ plain form
17877 -3476677 -38557380 -23710451 -12093782 5571414 8006627 -17655915 -19985764 -3625468
17868 21175141 -11519514 -28556988 -29886359 8946768 3218998 36423307 41710605 22831543
17860 22831543 -5225251 -23926063 -26656751 22429622 -9206319 15379938 15089213 -6084827
17851 4712134 11641129 -857393 -6653940 26639626 -21801502 30246588 36098973 59568776
17843 59568776 26615187 5767737 13208954 44872085 -3841773 47592033 14110454
17835 -5101520 -11129342 -1837915 995466 -9088816 15207519 29952097 8804241 3257352
17826 -24662232 -46740697 -30144703 11027552 30186280 -15762023 -11202531 -5687762
17819 -5687762 -12097310 17353025 21235481 -18718751 -1704348 -10797031 9390275 21634236
$$ packed form
17877c476677l5080703J4846929J1616669E571414K435213a7655915k329849c625468
17868B1175141a1519514j7037474j329371H946768C218998L3204309N287298j8879062
17860B2831543e225251j8700812k730688B2429622i206319A5379938k90725f084827
17851D712134O928995h57393n796547B6639626b1801502C0246588N852385K3469803
17843E9568776B6615187E767737P441217L1663131c841773D7592033A4110454
17835e101520o027822a837915I95466i088816A5207519J4744578H804241C257352
17826b4662232k2078465J6595994A1027552J9158728a5762023M559492N514769
17819e687762o409548A7353025L882456a8718751a704348r092683I390275J2243961
$$ plain form
17811 21634236 4807818 39760267 -19353833 -22406506 9526858 33398819 14116596
17803 -10922214 -13158035 27392473 14253236 35799856 3362947 -20118989 -17414515
17796 -17414515 1913714 30703069 -7694048 -24488933 -9292014 7597587 44643191 -567197
17787 -15361465 -33652071 5811954 -48298649 -17570203 6245986 -8388740 23236206
17779 33945682 -5137653 -21861052 40023318 -58932454 3416952 -3918693 24641547
17771 23597385 -13006350 -13031232 -23288840 -48330486 406284 -20464479 -32885781 -33333596
17763 -33333596 -22332543 -5665271 26335925 -10249515 -35462324 -58266288 -16359481
17755 21232883 -3073596 -12579872 -3243800 15301020 16704934 28660990 -26718417 -17967408
$$ packed form
17811B1634236D807818L4952449a9353833l052673I526858K3871961A4116596
17803a0922214k235821B7392473j3139237K1546620C362947b0118989K704474
17796a7414515A913714K8789355g694048j6794885i292014G597587L7045604e67197
17787a5361465j8290606E811954d8298649a7570203F245986h388740B3236206
17779C3945682e137653j6723399D0023318e8932454C416952c918693B4641547
17771B3597385a3006350k4882j0257608k5041646D06284b0464479j2421302m47815
17763c3333596J1001053e665271B6335925a0249515k5212809k2803964a6359481
17755B1232883c073596r506276c243800A5301020J403914J1956056b6718417Q751009
$$ plain form
17747 -17967408 -18320732 1890821 -25149788 -135870 13711118 -4283052 -36629884 -6397777
17738 8403166 22547097 -13093093 -31339591 -16490898 -16034611 -62273829 23439933
17730 -34379623 30099766 23181023 30554965 21174708 -25877315 74382576 10267163
17722 -4659760 -10385924 17779700 -5312689 -4254841 -45500876 -10742226 -713340 -5817293
17714 -5817293 -14084806 -3423039 -9542194 6016936 -40700692 25454507 -29824569 -10383834
17705 -13387623 17680369 31146149 -190474 51002107 -32080880 -11290205 36928614
17697 10250567 -7182071 -46864042 44474566 -21022356 -4750410 -47689503 29755650
17689 -2976714 -13335232 -23418365 -18391006 38968897 10141735 49654278 63618206
$$ packed form
17747a7967408l53324A890821b5149788a35870A3711118d283052l2346832f397777
17738H403166J4143931a3093093j8246498J4848693M56287m6239218B3439933
17730c4379623C0099766o918743P373942r380257b5877315G4382576A0267163
17722d659760n726164A7779700e312689J057848m1246035a0742226g13340n103953
17714e817293q267513c423039o119155F016936d0700692B5454507b9824569a0383834
17705a3387623A7680369J3465780a90474E1002107c2080880a1290205C6928614
17697A0250567g182071l9681971D4474566b1022356d750410m2939093B9755650
17689b976714j0358518j0083133N027359C8968897A0141735L9512543J3963928
$$ plain form
17682 63618206 -20196149 -5736163 15736848 -20221042 -21929729 7333239 -53573582
17674 -7832544 -5443194 36692656 -795400 -12217896 -5341835 4569441 -7116838 -19913272
17666 -19913272 30903449 -12908058 -10158674 16962368 -1049374 -13291911 -766450 -2285449
17658 -2285449 -56568322 -33530942 17434381 1898011 -5976360 -28268265 -8309238 15169182
17649 -12988560 -27798931 -4680441 41030160 -452537 -5988172 -6899003 -22932201 36203470
17640 17927068 -22929059 -34276916 15035088 7030872 45758810 -7189726 14510464
17632 -40250122 -14889220 -31413436 16349120 -3678575 26732318 18393288 17391824
17625 17391824 43029390 149947 -8218166 2588003 15564479 -24385683 21214230 20036573
$$ packed form
17682F3618206b0196149e736163A5736848b0221042j708687G333239e3573582
17674g832544K389350C6692656g95400j1422496e341835D569441g116838j2796434
17666a9913272C0903449a2908058K749384A6962368a049374j2242537g66450j518999
17658b285449n4282873K3037380A7434381A898011e976360k2291905h309238A5169182
17649a2988560j4810371d680441D1030160d52537n535635r10831j6033198C6203470
17640A7927068b2929059j1347857A5035088G030872L8727938g189726A4510464
17632d0250122a4889220j6524216A6349120c678575B6732318q339030j001464
17625A7391824K5637566A49947h218166B588003J2976476b4385683B1214230j177657
$$ plain form
17617 20036573 9007236 -11334108 15495698 18491524 -1451344 42816242 7135048 -25142275
17608 7026303 6559909 201510 -2059263 18917909 -3763453 -4027529 -671990 -36803185
17600 -36803185 -5796419 8189240 -31238101 10809221 24763582 -6313857 9061553 -6624059
17591 -2946491 -2086018 16084128 1621736 1124115 29181602 4893950 -18878035 17098019
17582 42788655 1324274 21022704 13891171 -3809079 -9802842 16550081 -22736446 -34090038
17574 -34090038 -38057287 -1668645 -25145744 49610241 13667000 5378627 -38489062
17566 7601864 -22667023 32715245 -12664753 -15775790 -18134418 19080532 11160990 3536644
17557 8462268 -6333533 8629732 26530173 9080634 33467795 -21812126 7838734 -14717289
$$ packed form
17617B0036573I007236a1334108A5495698K995826a451344D2816242G135048b5142275
17608G026303m66394B01510b059263A8917909c763453k64076f71990l6131195
17600c6803185e796419H189240c1238101A0809221J3954361f313857I061553f624059
17591b946491Q60473A6084128A621736m97621K8057487D893950a8878035A7098019
17582D2788655A324274J9698430p131533c809079n993763A6550081b2736446j1353592
17574c4090038l967249a668645k3477099D9610241A3667000E378627c8489062
17566G601864b2667023C2715245a2664753l111037k358628A9080532p919542C536644
17557H462268f333533H629732J7900441I080634K4387161b1812126G838734a4717289
$$ plain form
17548 23217609 -15163934 -43339379 10103629 -28244000 -42489098 -9385165 -6356585
17541 -6356585 -47142435 26288979 -3476630 -9754233 48206414 -16643690 -17981197 55633086
17532 -9804298 29516057 -6928285 -49680669 23909452 33847775 245511 14613432 -4610602
17523 -47571518 19046475 966943 5360699 -62570477 -959808 -17800177 23496409 23379262
17515 23379262 3017103 -37170404 -4574803 -27192485 21613225 -12284886 -12767531 1440401
17506 -33649428 3618446 19546849 1159274 9945764 -16711862 2206042 14155184 -7948598
17497 27972566 -6587532 35035105 6756129 15517087 -29194356 -26049619 -7407599 22823024
17488 23309521 -32318077 17457627 6574153 21882913 -28026131 1843318 161982 37916471
$$ packed form
17548B3217609a5163934k8175445A0103629b8244000j4245098i385165L028580
17541f356585m0785850B6288979c476630o277603D8206414a6643690j337507E5633086
17532i804298B9516057f928285m2752384B3909452R938323B45511J4367921d610602
17523d7571518A9046475I66943M393756f2570477i59808j6840369B3496409j17147
17515B3379262C017103c7170404d574803k2617682B1613225a2284886m82645A440401
17506c3649428C618446J5928403A159274Q786490a6711862B206042J1949142g948598
17497B7972566f587532C5035105F756129Q760958b9194356L144737g407599B2823024
17488B3309521c2318077A7457627F574153J5308760b8026131A843318A61982L7754489
$$ plain form
17480 37916471 -50416396 37384152 -1807098 23123156 27972405 -15495896 -48221879
17473 -48221879 -6007849 -37896916 -33441421 4677650 -2706987 46228035 -9096739 12711891
17464 -40194767 977674 -3120108 -1115023 -14887157 -8501695 -2284985 -840893 17032794
17455 -20583902 -42637242 -4080937 23226020 -6607031 17111158 5773198 -2797250 43168050
17446 -14164976 654571 -2021712 -4788933 20186188 18584871 17872642 -25107811 -13840021
17438 -13840021 9827832 20616338 4605122 7125649 -2486210 18645793 -32019343 14923505
17429 -51691591 -27041487 -32420080 7618753 -26682 -2823389 -30058721 16482813 -34052697
17420 6051244 28561179 4197745 -3195328 21877168 -123232 -8026077 14671085 24510937
$$ packed form
17480C7916471e0416396C7384152a807098B3123156M849249a5495896l2725983
17473d8221879f007849l1889067M455495D677650b706987D6228035i096739A2711891
17464d0194767I77674c120108a115023j3772134O385462b284985h40893A7032794
17455b0583902k2053340d080937B3226020f607031A7111158E773198b797250D3168050
17446a4164976F54571b021712k767221B0186188j601317p12229b5107811J1267790
17438a3840021I827832J0788506D605122K520527b486210A8645793c2019343A4923505
17429e1691591K4650104n378593G618753b6682k796707k7235332A6482813c4052697
17420F051244K2509935D197745c195328B1877168a23232p902845A4671085R839852
$$ plain form
17412 24510937 35250672 19163208 24939812 10077164 -15897854 18122458 -14337202
17404 -33083944 -27556421 -1761939 -18025852 -7375033 -19020034 -28371754 -1538264 25573139
17395 10974356 -33131031 18101073 -12946929 -11684904 38236683 20020025 6464535
17387 19552858 -7040145 -6389666 25886905 29871308 -19241321 5136656 -20115089 -18015659
17379 -18015659 -10814657 11129009 -21482408 -9351639 24991042 23660137 10811746
17371 -34314301 -9417187 -45759437 51309988 24359260 17866079 -11896702 5616633
17363 -10388415 -21191674 37422026 427877 -14595006 28122224 10183242 7281397
17356 7281397 -3861325 3632245 -9313465 -12126504 24990789 -33155283 9368942 5923416
$$ packed form
17412B4510937J0739735j6087464N776604A0077164a5897854A8122458a4337202
17404c3083944N527523a761939j6263913g375033j1645001r351720a538264B5573139
17395A0974356c3131031A8101073a2946929J262025C8236683j8216658F464535
17387A9552858g040145O50479B5886905L984403a9241321E136656b0115089K099430
17379a8015659P201002A1129009b1482408i351639B4991042j330905A0811746
17371c4314301i417187l6342250E1309988B4359260o493181a1896702E616633
17363a0388415j0803259C7422026D27877a4595006B8122224A0183242k901845
17356G281397c861325C632245i313465k813039B4990789c3155283I368942l445526
$$ plain form
17348 5923416 -26388760 224688 18532447 -31071839 31327705 14738691 18088256 9614048
17340 9614048 -14970904 19718092 16425154 -1722444 17149559 -7742772 11664690 -40961716
17331 593086 5253884 -3840149 13042927 -661085 296101 -12629030 -35999008 4794462
17322 -25162271 7577845 48649107 -16610200 -11797943 -49584408 19731314 -34196123
17314 18744762 4388120 -16127484 -3302672 12762432 -13528494 -9357683 31652498
17306 -23891806 25487477 23560785 -23046707 816431 -3809844 -23947532 -8550386 22889626
17297 23705357 5744065 6881208 21640069 -15968011 17311041 24233283 14405578 -20211605
17288 18182383 27715485 -22843847 60591310 14094107 -25172499 8633397 -6364982
$$ packed form
17348E923416b6388760B24688J8307759c1071839C1327705A4738691L349565q474208
17340I614048a4970904A9718092l292938a722444A7149559g742772A1664690d0961716
17331E93086M660798c840149A3042927f61085B96101a2629030k3369978D794462
17322b5162271G577845M1071262a6610200M812257l7786465A9731314c4196123
17314A8744762D388120a6127484c302672A2762432a3528494M170811C1652498
17306b3891806B5487477j926692b3046707H16431c809844k0137688h550386B2889626
17297B3705357E744065J137143J4758861a5968011A7311041O922242r827705b0211605
17288A8182383R533102b2843847F0591310A4094107b5172499H633397f364982
$$ plain form
17280 -14623859 -18493378 -5401764 25833625 18386584 -8247748 90149237 15874976 -9171310
17271 781843 16337745 -27403568 27438659 -41492658 20111677 -12127577 -22161724
17264 -22161724 14604316 7260194 -32724252 -12295649 -2792439 -6393803 11136534
17256 40947630 -5885759 -61195281 -11291376 -23982563 5060582 19383559 6922263
17248 5632780 -16711750 9844554 5297805 6078686 15585988 19037060 3618796 8009134
17240 8009134 -2939889 -5316591 14342588 -5529735 -8625618 -24742364 10403600 -27818908
17231 578671 15189939 -14300185 3293915 -4618819 12284012 12538217 -4951276 29362174
17222 26822811 24861256 -14192224 -29783226 2515545 -4941264 -28065861 -23551106 -9662728
$$ packed form
17280a4623859l869519e401764B5833625p447041h247748I0149237A5874976i171310
17271G81843J5555902b7403568B7438659d1492658B0111677a2127577j0034147
17264b2161724A4604316G260194c2724252a2295649b792439l601364A1136534
17256D0947630e885759n5309522a1291376j2691187E060582J4322977F922263
17248E632780a6711750I844554m546749P80881R507302L451072C618796M390338
17240H009134b939889k376702A4342588e529735l095883j6116746A0403600b7818908
17231E78671J4611268a4300185C293915d618819A2284012K54205d951276B9362174
17222B6822811j961555a4192224j5591002B515545d941264k3124597M514755i662728
$$ plain form
17213 -27831800 -1173049 -4606335 -5821887 -15139035 10151692 -30722111 40832904 18646350
17204 17237485 15149858 -3958356 7574496 -6281338 9647864 12542381 17892327 -9436033
17195 7351970 -5126548 40136380 20374005 -55447280 8649537 -1311710 -12825127 23471787
17186 27688714 2753890 16267638 15387896 17634838 5408978 26797099 5556290 41683689
17178 41683689 10151275 18325787 46748215 -260120 509552 13454115 19748197 27630767
17170 27630767 10370439 -22781404 -6878088 -16070832 21684163 -34061331 8842429
17162 -6649847 13389258 32994677 28961727 19411804 -1827316 -21715170 -9129624 -30906101
17154 -30906101 -33468834 -31225954 16611359 14825929 -593531 -1215361 -8162909 -28486414
$$ packed form
17213b7831800a173049l433286j215552r317148A0151692c0722111D0832904A8646350
17204A7237485k087627c958356G574496f281338I647864K894517N349946i436033
17195G351970e126548D0136380j9762375e5447280H649537a311710j1513417B3471787
17186B7688714B753890J3513748q79742K246942E408978K1388121E556290L6127399
17178D1683689A0151275Q174512K8422428b60120E09552J2944563O294082P882570
17170B7630767A0370439b2781404f878088r192744B1684163c4061331H842429
17162f649847A3389258J9605419m032950r549923a827316j9887854i129624k1776477
17154c0906101k562733K242880A6611359j785430e93531o21830o947548k0323505
$$ plain form
17146 -28486414 11993304 -8181601 12632049 28770276 -8620769 -888624 13860484 -5256563
17137 29700126 4294012 17805161 -4547642 -19631555 5471688 718936 -3665707 -2880217
17129 -2880217 23025056 -17552138 11408609 17391201 -23056776 -7758255 -7522690 -20452415
17121 -20452415 -1673961 -5362189 -28990097 -16747424 13077663 -10101835 -4577886
17113 -15922873 3911254 11722814 -1894029 2119656 -2217541 -8167712 -43670691 -47697222
17105 -47697222 -12430169 11156070 26254629 4789236 -16950725 -25683681 3803636
17097 19483043 30945761 42873391 -11020630 -29504242 25546659 4044632 -13027507
17089 -32713406 8806814 9514585 31178266 33891121 10574932 11148855 -11200067 -18609939
$$ packed form
17146b8486414A1993304h181601A2632049J6138227h620769h88624A3860484e256563
17137B9700126D294012J3511149d547642j5083913E471688G18936c665707P85490
17129b880217B3025056a7552138A1408609N982592b3056776g758255K35565j2929725
17121b0452415a673961l688228k3627908J2242673A3077663a0101835d577886
17113a5922873C911254P811560a894029B119656b217541n950171l5502979m026531
17105d7697222a2430169A1156070J5098559D789236a6950725q732956C803636
17097A9483043J1462718J1927630a1020630j8483612B5546659D044632a3027507
17089c2713406H806814P07771K1663681K712855A0574932N73923a1200067p409872
$$ plain form
17081 -18609939 18611593 14054030 26406316 9099973 13742104 147701 -8848449 -31209142
17073 -31209142 -18061008 -17591057 14141586 22889765 47223658 32144274 -3740245 -22313993
17065 -22313993 1442358 37365433 -22295875 294448 6495190 12697858 -18447704 -9132536
17056 -8007000 -34783535 625491 -4398583 16923263 28310489 11634917 12847052 -11860518
17047 -14231734 -3701927 19455246 -5965594 9193750 3154164 9030262 18765405 9741319
17039 9741319 5156368 1168474 26750965 -20388800 6180219 10866874 21126195 3715779
17030 -8859998 -28238699 14951569 1508602 -23591324 7303748 -10759058 -22792266
17023 -22792266 10711516 -19789299 -22938097 21204722 23691239 -4851326 17228899
$$ packed form
17081a8609939A8611593m557563J2352286I099973M642131A47701h848449k2360693
17073c1209142J3148134M69951A4141586Q748179K4333893j5079384c740245j8573748
17065b2313993A442358L5923075b2295875B94448O200742O202668a8447704i132536
17056h007000k6776535F25491d398583A6923263J1387226A1634917J212135a1860518
17047a4231734c701927A9455246e965594I193750C154164N876098R735143r024086
17039I741319m584951A168474K5582491b0388800F180219M686655J0259321C715779
17030h859998j9378701A4951569A508602b3591324G303748a0759058j2033208
17023b2792266A0711516a9789299l148798B1204722K486517d851326A7228899
$$ plain form
17015 -17490145 -1998805 -19429310 -8340708 -13511747 52211 -14837982 -7827389 -28487023
17007 -28487023 24434977 1450445 -20072980 -16573811 -1027827 -32617054 12650125
16999 44877472 -14115889 -32788204 19041238 278170 13316204 -21697010 -42667230
16992 -42667230 19447720 -37451957 2573972 55917193 10462469 -7722598 23469312
16984 35346525 -18349154 -22031348 -6795797 -8889751 -20814526 -26931556 12341623 -41314498
16975 -5799386 -22832466 10768634 26554343 -89263 5492451 18948948 -12720334 37373151
16966 -5615682 18222985 16652845 -13581876 30829032 -31151259 24965426 -15993888
16958 1348571 29141061 -5916213 2846691 -7082834 -6401673 -22025616 6689869 2903047
$$ packed form
17015a7490145a998805j7430505h340708n171039E2211a4837982P010593k0659634
17007b8487023B4434977A450445b0072980L499169a027827l1589227A2650125
16999D4877472a4115889j8672315A9041238B78170J3038034b1697010k0970220
16992d2667230A9447720c7451957B573972N3343221A0462469g722598B3469312
16984C5346525a8349154l682194f795797k093954j1924775o117030A2341623d1314498
16975e799386j7033080A0768634J5785709h9263E492451J3456497a2720334C7373151
16966e615682A8222985j570140a3581876C0829032c1151259B4965426a5993888
16958A348571K7792490e916213B846691g082834O81161j5623943F689869B903047
$$ plain form
16949 9813980 -28324310 -2285387 -31228779 -35396704 4351203 8843774 -3194142 -2731910
16941 -2731910 11969834 -2588679 14612618 -42021044 -3845362 -23007909 46694110
16933 906761 41602266 -26081349 -36489428 -7431856 12996154 24221381 -12989404
16925 -9467313 35770 21265398 27608569 31197479 -15610594 -10649478 -1774874 8315626
16916 33322358 -13962207 -7379344 -38028331 -6988275 39161939 35443351 29557571 38245083
16908 38245083 -11071412 7641933 -31309736 -636388 22919424 -28077613 4764674 6580507
16900 6580507 -8239388 6681630 -23528745 -6348840 -23467203 3267180 -17047180 -13194886
16892 -13194886 -3336711 -404793 3222825 4706610 -22134955 -20447554 11032881 -45126717
$$ packed form
16949I813980b8324310b285387k8943392m167925D351203M492571c194142M62232
16941b731910A1969834b588679A4612618d2021044c845362j9162547D6694110
16933I06761M0695505b6081349j0408079g431856A2996154J1225227a2989404
16925i467313C5770K1229628O343171L588910a5610594M961116a774874H315626
16916C3322358a3962207O582863l0648987f988275C9161939l718588n885780Q687512
16908C8245083a1071412G641933c1309736f36388B2919424b8077613D764674J815833
16900F580507h239388F681630b3528745f348840j7118363C267180a7047180L852294
16892a3194886c336711d04793C222825J483785b2134955J687401A1032881d5126717
$$ plain form
16883 14784920 35802775 18331457 -16287528 -31802821 -13263640 26369149 15813617
16876 15813617 -6308698 5263307 -2354772 27331457 -938182 -22410098 -9109562 21398799
16867 -12288560 -6246091 -20284345 -40431798 23496991 -1777726 -45019025 -13355251
16859 40387805 23015441 -17936271 20361153 -9150537 35978345 -2160150 -3809219
16852 -3809219 18704951 -14187926 64061717 4125478 -16057254 7588592 -36290382
16844 -48493683 6739962 25642602 10955908 -766639 14865921 -20216895 -1453955 32010486
16835 16401285 -34224139 -3639073 -9777976 21093026 -21865608 -42614230 2009743
16827 11356700 15583330 22732650 -7548484 -7876497 9028923 16287992 30947658 21713187
$$ packed form
16883A4784920K1017855j7471318a6287528j5515293a3263640B6369149j0555532
16876A5813617f308698E263307b354772B7331457i38182k1471916i109562B1398799
16867a2288560O042469j4038254k0147453B3496991a777726m3241299a3355251
16859D0387805j7372364a7936271B0361153i150537C5978345b160150j649069
16852c809219A8704951a4187926F4061717D125478a6057254G588592c6290382
16844d8493683F739962J8902640A0955908g66639A4865921b0216895a453955C2010486
16835A6401285c4224139c639073o138903B1093026b1865608k0748622B009743
16827A1356700M226630P149320g548484l28013I028923P259069J4659666r234471
$$ plain form
16819 21713187 9513286 9655021 -11594835 -8775137 -1373224 17130285 -4858272 -32924445
16811 -32924445 2039203 1389659 26271573 16458746 7429638 27481442 19157831 719791
16802 -8194038 23036183 8416567 -1427714 -1762482 32988688 -4591241 -6144038 11314203
16793 31397181 1308747 28521719 -14528038 20399161 33003108 1185435 4033498
16786 4033498 -9138328 -19832693 9905421 12510717 3860317 30956643 -12002433 -30039882
16778 -30039882 22396049 7916399 2998978 -3229826 -1866487 34944726 24161471 -6515807
16769 -20425678 -12516995 -34182291 -19986566 9034781 -27137886 25140944 10019228
16761 27307830 -1976122 6368364 -38355920 19836765 20825371 6860564 2694507 18263530
$$ packed form
16819B1713187I513286J41735a1594835K819698a373224A7130285d858272k8066173
16811c2924445B039203o49544K4881914r812827G429638K0051804q323611G19791
16802h194038B3036183H416567a427714l34768C2988688d591241j552797A1314203
16793C1397181A308747K7212972a4528038B0399161J2603947A185435K848063
16786D033498i138328j0694365I905421K605296C860317K7096326a2002433j8037449
16778c0039882B2396049G916399B998978c229826J363339C4944726j0783255f515807
16769b0425678P908683k1665296J4195725I034781b7137886B5140944A0019228
16761B7307830a976122F368364c8355920A9836765R88606F860564B694507J5569023
$$ plain form
16753 18263530 -21558180 23896820 28456576 -7424845 7845450 38035683 -7874917 6964296
16744 -17501599 -7553353 -4691027 45955503 -34705383 -12314506 4639149 27212290
16737 27212290 -25994753 -17827450 14346827 -46947872 18839710 3199119 32397555
16730 32397555 -14496365 -19805466 -2416252 -15966201 -17714728 -14227632 16063270 -9790774
16721 1532481 35161442 11685752 -10991975 42568690 -9493489 5156275 -5022934 22520516
16712 9323782 -6675530 -2687279 31401028 12708516 1599340 10394281 -13088649 10085040
16703 -20978960 -16115844 -307557 23536669 5732416 -33792548 30281173 575626 6778945
16695 6778945 29398960 13884193 -8786819 27247147 -4767378 -11132064 26174311 25588970
$$ packed form
16753A8263530b1558180B3896820M559756g424845G845450L0190233g874917F964296
16744a7501599g553353K862326D5955503c4705383a2314506D639149K2573141
16737B7212290b5994753Q167303A4346827d6947872A8839710C199119K9198436
16730C2397555a4496365n309101b416252j3549949j748527L487096A6063270i790774
16721A532481L3628961A1685752a0991975D2568690i493489E156275e022934B2520516
16712I323782f675530b687279C1401028A2708516A599340Q794941a3088649A0085040
16703b0978960M863116c07557B3536669E732416c3792548C0281173E75626O203319
16695F778945K2620015A3884193h786819B7247147d767378o364686B6174311n85341
$$ plain form
16687 25588970 11074330 22769131 -6938309 32082845 -21339257 -23486190 -27908717
16680 -27908717 29497060 -41564146 28120188 16336316 7055744 48761230 -4251335
16672 -27200561 39360376 -4520834 32589314 28576007 15044245 2814677 21540329
16665 21540329 60991368 9008146 -36632445 67945023 3762323 14210969 14030154 -2010293
16656 -5642141 -41245869 -26990848 30229341 39155110 56015070 15287562 22648830
16649 22648830 48127299 1504171 76799609 59292714 32275571 38590927 96443844
16642 96443844 112936211 145327488 152742512 229000735 297858488 341595110 373654045
16635 373654045 412550919 409832375 339506815 293799299 262305884 168352534 113764962
$$ packed form
16687B5588970A1074330J1694801f938309C2082845b1339257k146933m422527
16680b7908717B9497060d1564146B8120188j1783872G055744M1705486d251335
16672b7200561C9360376d520834C2589314m013307j3531762B814677J8725652
16665B1540329L9451039I008146c6632445F7945023C762323J0448646j80815b010293
16656e642141l5603728J4255021C0229341Q925769J6859960A5287562P361268
16649B2648830K5478469A504171P5295438j7506895k7017143O315356N7852917
16642I6443844J6492367L2391277P415024P6258223O8857753M3736622L2058935
16635C73654045L8896874k718544p0325560m5707516l1493415r3953350n4587572
$$ plain form
16628 113764962 72788522 94913150 48409696 -16089793 -3511297 10218808 12975570
16621 12975570 -1483329 -3976186 23576297 -47716645 -23645924 -43498781 2406009
16613 -28632735 -13508723 -14674686 9248215 -40931857 -37860268 -54206534 -28603951
16606 -28603951 -12733465 36378387 -13153077 -40381911 33092981 -9827856 -38963403
16599 -38963403 -34665780 -20871424 -3530088 -27013310 -16209426 -22735961 -35124623
16592 -35124623 -4866728 -1474878 -5632819 -17778347 23090145 -25151419 -9099934 5993581
16583 33984880 -15477991 38875579 -16645746 -16406864 20863651 -39631148 23395794
16575 45291712 -20385847 -31825381 -14569314 18761593 -23615785 19747083 898944
$$ packed form
16628A13764962m0976440K2124628m6503454a6089793c511297A0218808K756762
16621A2975570a483329k492857B3576297d7716645b3645924j9852857B406009
16613b8632735a3508723j165963I248215d0931857L071589j6346266K5602583
16606b8603951a2733465C6378387a3153077k7228834C3092981i827856k9135547
16599c8963403M297623J3794356c530088k3483222J0803884o526535j2388662
16592c5124623d866728a474878m157941j2145528B3090145b5151419i099934E993581
16583C3984880a5477991C8875579a6645746K38882B0863651c9631148B3395794
16575D5291712b0385847j1439534a4569314A8761593b3615785A9747083H98944
$$ plain form
16567 -17684182 38570640 -24324928 -20722660 -4453191 -5832373 -12463745 -13586828 -10928645
16559 -10928645 -19651043 -49118345 7536213 -2380417 -25062812 32855953 23617534 15205481
16551 15205481 -16908408 -6237904 -4543691 -5779368 377571 -20466661 13309080 -1695510
16542 -41869883 -1014439 2277175 -5953039 -14255826 -111703 -7666483 -28483930 -11663331
16533 -5382603 37466977 23983421 -14114265 9970551 -29046107 -17368500 -4166714
16525 -305275 -23941019 25424275 10762700 11764082 -19181864 1303860 -14039023 16065521
16516 42087619 -7988519 -13422593 15439562 -12278467 30718923 -29049640 -9418669
16508 9918569 -22764945 -6959513 -23144289 -5762646 -8064737 -25306417 15564711 -8671326
$$ packed form
16567a7684182C8570640b4324928L602268d453191j379182o631372j123083K658183
16559a0928645q722398k9467302G536213b380417k2682395C2855953r238419q412053
16551A5205481a6908408f237904J694213j235677C77571b0466661A3309080a695510
16542d1869883a014439B277175e953039q302787a11703p554780k0817447a1663331
16533e382603C7466977j3483556a4114265I970551b9046107J1677607d166714
16525c05275k3635744B5424275A0762700J001382a9181864A303860a4039023A6065521
16516D2087619g988519n434074A5439562a2278467C0718923b9049640i418669
16508I918569b2764945f959513j6184776e762646k302091j7241680A5564711h671326
$$ plain form
16499 34150553 13082737 19319594 5868598 29178343 22020220 1362207 43322342 -34292276
16490 -17089696 4336745 -22967982 -27318361 -2159421 -40453512 3585609 -335882 19446876
16481 -31078698 -11638093 -40758003 6208561 8554593 32927673 -13212207 -35226052
16474 -35226052 -30294826 -32179434 -34420925 -12660475 10369498 -7972003 13847784 -17029701
16465 20760954 56866729 6834504 -33689134 -31184283 -464626 11237953 -13291767 -2423825
16456 26544880 -21241084 -24071788 -4573358 1212148 2979317 12625125 -11317577 14795426
16447 -29691130 -11787500 20417179 10134361 -37145479 -7897894 -8934411 4264057
16439 42571911 -16738699 7905054 6627833 -2616386 -35221430 31603852 18288618
$$ packed form
16499C4150553A3082737O236857E868598K3309745p158123A362207M1960135c4292276
16490a7089696D336745b2967982m350379b159421l8294091C585609c35882A9446876
16481c1078698a1638093k9119910F208561K346032K4373080a3212207k2013845
16474c5226052M931226j884608k241491a2660475A0369498g972003A3847784a7029701
16465B0760954L6105775F834504c3689134K504851d64626A1237953a3291767b423825
16456B6544880b1241084k830704d573358A212148J767169R645808a1317577A4795426
16447b9691130a1787500B0417179A0134361c7145479g897894j036517D264057
16439D2571911a6738699G905054j277221b616386l2605044C1603852j3315234
$$ plain form
16432 18288618 22434634 32269258 -37776116 21688382 -13251614 -5894 -19384632 -20304949
16424 -20304949 -1580683 -22475325 42969151 29083707 -21605106 26062102 -7048324
16416 -25136098 -22054381 46458940 12465138 -21599195 2874918 46278276 -639511 -75234325
16408 -75234325 -17871627 -5729386 9368852 15068546 -888705 11846220 7245391 28438110
16400 28438110 -4397692 8568740 1926397 -22134804 9958130 -2872678 28868021 -3911308
16391 9609451 6465492 -32029497 -9506954 31134902 -27411751 -419830 -19920944 -9794060
16382 -16248749 17915759 -12730067 -16851650 28292955 25704281 17626430 1732140 31824436
16374 31824436 -727763 8458810 -26879673 24734553 1207584 23229866 -5036200 -24703353
$$ packed form
16432A8288618M146016R834624c7776116B1688382a3251614e894j9378738r20317
16424b0304949a580683k0894642D2969151j3885444b1605106B6062102g048324
16416b5136098L081717D6458940A2465138b1599195B874918M3403358f39511p4594814
16408g5234325a7871627e729386I368852N699694h88705A1846220m600829K1192719
16400B8438110d397692H568740A926397b2134804I958130b872678B8868021c911308
16391I609451l143959c2029497i506954C1134902b7411751d19830j9501114i794060
16382a6248749A7915759a2730067m121583B8292955k588674q077851A732140L0092296
16374C1824436g27763H458810b6879673B4734553A207584K2022282e036200j9667153
$$ plain form
16366 -24703353 -3212716 -13009037 -29600727 7295504 -4875430 37900976 -2139255 15282135
16357 -56029784 -1768667 -31184985 -18562367 -24175689 -13004244 8918059 -11151094
16349 11381929 -36673331 26095142 10631744 -52720320 25872349 35057067 -39196756
16341 -40493247 6678211 -4151636 17330118 34699381 -8428093 29435738 16027203
16334 16027203 15793162 1559275 16888017 -9839915 13182806 31344000 5986515 -14283109
16325 -15444940 1572850 9717042 -48327154 -11134999 -37683253 31812993 1153319
16317 1170485 -5038954 -12739888 752768 -27908122 1561224 9513279 -57774000 12077748
16308 -1647192 -14444698 -27053238 -35729969 25944010 21514561 -21553190 -38117705
$$ packed form
16366b4703353c212716r796321j6591690G295504d875430C7900976b139255A5282135
16357e6029784a768667k9416318J2622618n613322J1171445H918059a1151094
16349A1381929c6673331B6095142A0631744e2720320B5872349R184718c9196756
16341d0493247F678211d151636A7330118J7369263h428093B9435738j3408535
16334A6027203k34041A559275J5328742i839915A3182806J8161194E986515a4283109
16325a5444940A572850Q144192d8327154a1134999k6548254C1812993A153319
16317A170485e038954p700934G52768b7908122A561224P952055e7774000A2077748
16308a647192j2797506j2608540q676731B5944010m429449b1553190j6564515
$$ plain form
16301 -38117705 -5866278 -13655232 -27703746 15637458 -47901508 29893283 26352121
16294 26352121 -25794042 20332213 6124572 14814182 4146583 4512937 2592646 18819889
16286 18819889 -11736166 8032670 24632478 -13547396 52358642 -32938976 -15500268
16278 -20216069 20598165 -13269787 22064331 -22998836 34908121 43901949 15013629
16270 32480858 -6338211 -14670314 17333360 12319784 -2188312 -15677785 26601717 -15157262
16261 8556584 -22068773 -3584347 15182946 -9214138 -4172154 -42417854 -23602737 -4109551
16252 43670458 -3344568 -7142893 -4021999 -32252742 15229870 -34211385 -24192311
16245 -24192311 5406521 41057193 -1887820 22876545 -41296436 -10133301 -10974786 -12618191
$$ packed form
16301c8117705e866278p788954j4048514A5637458d7901508B9893283l541162
16294B6352121b5794042B0332213F124572Q689610D146583L66354j920291J6227243
16286A8819889a1736166H032670J6599808a3547396E2358642c2938976a5500268
16278b0216069B0598165a3269787B2064331b2998836C4908121Q993828A5013629
16270C2480858f338211q332103A7333360n013576b188312j3489473B6601717a5157262
16261H556584b2068773c584347A5182946i214138d172154l8245700J8815117d109551
16252D3670458c344568l798325L120894k8230743A5229870c4211385J0019074
16245b4192311E406521L5650672a887820B2876545d1296436a0133301q41485j643405
$$ plain form
16237 -12618191 -18998261 -750305 37581961 15940010 13349593 11322815 7503778 -19677990
16228 -19247389 -9201003 16089932 4247042 -19855802 18869252 15919999 -3646897 -14994067
16220 -14994067 4526560 -31640897 4449988 -15126425 7139015 21782355 -20536065
16212 -6847679 20585377 14435895 -19095265 -8659318 1802514 -7391418 11974343 14301792
16204 14301792 9709011 17599850 -11117111 31220944 22691915 1228730 19590092 -5466941
16195 20042243 30319947 40929269 -35628369 26633837 15954337 -192622 31388719
16187 13174759 56024430 -25551400 -37051815 22652216 -11301810 -30535958 33040859
16179 -35699719 33783331 -3562349 21017638 -10172877 54643862 19828992 49146697
$$ packed form
16237a2618191o380070g50305C7581961A5940010k590417k026778l819037a9677990
16228a9247389i201003A6089932D247042a9855802A8869252k949253c646897j1347170
16220a4994067D526560c1640897D449988a5126425G139015J4643340b0536065
16212f847679B0585377o149482a9095265h659318A802514g391418A1974343K327449
16204A4301792m592781P890839a1117111C1220944q529029A228730J8361362e466941
16195B0042243J0277704J0609322c5628369B6633837j0679500a92622C1388719
16187A3174759M2849671b5551400j1500415B2652216a1301810j9234148C3040859
16179c5699719C3783331c562349B1017638a0172877E4643862A9828992K9317705
$$ plain form
16172 49146697 49615583 23386751 -22742413 9411875 17525441 27298704 -16791294 30324228
16163 -27419695 -1506 3085546 42570083 -15575125 5914987 -32451583 21239991 -30365559
16154 -16087595 18716915 55070927 22168930 33111528 -5373611 -13414890 9123382
16146 20152872 38429561 -40705248 -22927599 1842735 4920793 -6508476 -7690012 -41917365
16138 -41917365 5071772 -27616755 -45842948 -5057593 752845 16843662 2995131 -15401799
16129 4479240 38378647 -62152315 5423137 -16460526 -27505204 14502929 -6466712
16121 -16875049 -15122980 -9221055 18991088 -21546395 41065098 -3842235 23814694
16113 12554955 30467540 -19735059 -22590689 -21857978 -40365769 19303508 -21994609
$$ packed form
16172D9146697M68886B3386751b2742413I411875Q113566R773263a6791294C0324228
16163b7419695a506C085546L9484537a5575125E914987c2451583B1239991c0365559
16154a6087595A8716915L6354012B2168930J0942598e373611q041279I123382
16146B0152872J8276689d0705248J7777649A842735L078058f508476j181536l4227353
16138d1917365E071772b7616755j8226193e057593G52845J6090817B995131a5401799
16129D479240L3899407f2152315E423137a6460526j1044678A4502929f466712
16121a6875049J752069N901925A8991088b1546395D1065098c842235B3814694
16113A2554955J7912585a9735059k855630P32711j8507791A9303508b1994609
$$ plain form
16105 27650078 18418622 1580160 -19824562 -17783066 -38415717 6379752 -11292829 -24770202
16097 -24770202 -6097403 -35323503 -20639665 -10389412 9747786 13047261 8526152 -42003762
16088 30119015 24808015 25812478 3567258 12758946 -32565482 -3373391 -8088094 4952771
16079 -16958099 -15009258 -2623075 -24084316 -668839 5818076 -2475361 8205569 -22654047
16070 -8414890 5216506 12965944 -10226603 -37232249 -28546810 -27305819 29360267 35068875
16062 35068875 29040471 14164739 -6753343 50344195 16698635 17919787 16933546 -35044479
16053 16132533 34791808 5181304 5445286 -14626312 21205669 22027855 -17410673 34679151
16044 -429874 9054478 5834655 -68128772 -24644905 22535934 29523856 9392494 -13399672
$$ packed form
16105B7650078r231456A580160a9824562K041496k0632651F379752a1292829j3477373
16097b4770202f097403k9226100J4683838J0250253I747786L299475m521109d2003762
16088C0119015n311000J004463C567258R191688c2565482c373391m714703D952771
16079a6958099J948841b623075k1461241f68839E818076b475361H205569b2654047
16070h414890E216506P749438a0226603k7005646Q685439J240991B9360267N708608
16062C5068875o028404A4164739f753343E0344195A6698635J221152r86241c5044479
16053A6132533J8659275E181304K63982a4626312B1205669Q22186a7410673C4679151
16044d29874I054478l219823f8128772b4644905B2535934O987922I392494a3399672
$$ plain form
16035 25718178 -3536405 25907441 -14472235 30509476 -35891211 -3842139 -40706427
16028 -40706427 -23022643 -1259821 13035410 -20337648 16608303 15267755 27200733
16021 27200733 24186000 -8208459 28055920 -16418328 -15385768 47885761 42952953 888793
16012 -5383473 -11500371 -29940674 -1054942 -27983816 -11702273 40243201 -9189509 13928873
16003 -21893177 7083275 11886458 -30892707 27997189 2567148 -21930441 -4836564 3401787
15994 2398949 -16495077 18498405 -29285139 -10194386 -31288846 26654307 -7165734
15986 -22552468 -3247471 37341719 -39096730 -16608887 -13154757 9770401 -16226790
15978 -1731422 40432748 14930079 -15587270 13154512 5764076 -16301538 12718900
$$ packed form
16035B5718178c536405B5907441a4472235C0509476c5891211c842139l6864288
16028d0706427J7683784a259821A3035410b0337648A6608303j340548J1932978
16021B7200733l014733h208459B8055920a6418328J032560D7885761m932808H88793
16012e383473o116898j8440303a054942k6928874a1702273D0243201i189509A3928873
16003b1893177G083275M803183c0892707B7997189B567148b1930441d836564C401787
15994B398949a6495077A8498405b9285139a0194386k1094460B6654307g165734
15986b2552468c247471C7341719c9096730a6608887L454130I770401a6226790
15978a731422D0432748A4930079a5587270A3154512E764076a6301538A2718900
$$ plain form
15970 -19249562 45770750 1607471 -32973485 12006301 -20899900 15138392 13279772
15963 13279772 -13319727 14682736 2890235 -26919305 10016528 -20495345 25624490
15955 2707798 8605029 -3225388 -4202605 -8575984 22166389 15256183 30725038 11326463
15946 -24495373 -4120114 4959864 742799 -38567058 10856600 -36070207 7267222 6108263
15938 6108263 -1807035 -16171053 -27860832 -38372173 -14822758 -9991116 -18380951 16243046
15929 1938706 -22590231 -9898303 40035565 -27498039 -1390947 22481308 23049675 17530173
15921 17530173 -1368298 9557827 7833725 10024942 8974952 -45552624 -3553658 -27592836
15913 -27592836 -11899041 -2495957 6956083 49158673 -42330945 -2222031 9051861 17813214
$$ packed form
15970a9249562D5770750A607471c2973485A2006301b0899900A5138392j858620
15963A3279772a3319727A4682736B890235b6919305A0016528b0495345B5624490
15955B707798N897231c225388r77217m373379B2166389o910206J5468855A1326463
15946b4495373d120114D959864G42799c8567058A0856600c6070207G267222j158959
15938F108263a807035j4364018j1689779j0511341a4822758M831642q389835A6243046
15929A938706b2590231i898303D0035565b7498039a390947B2481308N68367n519502
15921A7530173a368298I557827j724102K191217j049990d5552624c553658k4039178
15913b7592836a1899041b495957F956083M2202590d2330945b222031I051861Q761353
$$ plain form
15905 17813214 -25071705 -4180818 17912751 18333110 -35740066 28709396 10130409
15897 6437188 23175086 -1620005 -780567 41363367 13620846 -9684868 7568488 28298497
15889 28298497 8640423 13427648 -2119651 -25365862 -16577748 2244234 -1824509 10198407
15880 1414978 37291878 -32173321 6796681 1360212 25152469 -2393623 1034993 41914445
15872 41914445 -12526000 -6303662 13845670 37630922 497359 -7148216 -2477134 -16271039
15864 -16271039 -962409 21844087 -44676577 -22767572 -3056406 16535772 52723821
15857 52723821 23026509 9825152 4019788 -3899793 5191353 -4984117 -3815985 3545818
15848 -20088522 -5257706 1800626 -12054752 26947845 -2355496 -40210334 -23801864
$$ packed form
15905A7813214b5071705d180818A7912751M20359c5740066B8709396A0130409
15897F437188J6737898a620005g80567D1363367A3620846i684868G568488K0730009
15889B8298497H640423M787225b119651k3246211Q788114B244234a824509A0198407
15880A414978L5876900c2173321F796681A360212K3792257b393623A034993M0879452
15872D1914445a2526000O222338A3845670K3785252D97359g148216b477134j3793905
15864a6271039i62409B1844087d4676577K1909005c056406A6535772L6188049
15857E2723821B3026509I825152D019788c899793E191353d984117J168132C545818
15848b0088522e257706A800626a2054752B6947845b355496l7854838J6408470
$$ plain form
15841 -23801864 14491653 4285675 17043685 17305178 2572611 26337808 2109568 -713223
15832 14407916 22786453 8808439 -24948129 4187339 -15974121 -9829196 -20872752 15917818
15823 -18501789 15293170 2901330 -22421959 -29022496 1810573 30565559 -32410621
15815 62929275 10718834 -3548728 20749526 -9756152 -27441 19017349 -19303465 27974256
15806 4731029 19338542 22369760 -34654412 25504475 -30161494 33207080 -25897710
15798 -6931079 39474854 30700234 52414355 3610361 11088387 -8235990 3465121 28427995
15790 28427995 31342422 -14291909 12032757 -19215983 13322569 -103328 17058749
15782 20603497 -37534754 24219386 -44675560 796573 12425754 -12504580 9123505
$$ packed form
15841b3801864A4491653D285675J2758010K61493B572611K3765197B109568g13223
15832A4407916Q378537H808439b4948129D187339a5974121O144925j1043556A5917818
15823a8501789A5293170B901330b2421959o600537A810573K8754986c2410621
15815F2929275A0718834c548728B0749526i756152b7441A9017349a9303465B7974256
15806D731029J4607513L031218c4654412B5504475c0161494C3207080b5897710
15798f931079C9474854q774620K1714121C610361P478026h235990C465121K4962874
15790B8427995K914427a4291909A2032757a9215983A3322569a03328A7058749
15782B0603497c7534754B4219386d4675560G96573J1629181a2504580I123505
$$ plain form
15774 -2778810 -9062694 -37144561 -2548432 -25396872 -1401561 -30803912 -3887293 -46195180
15766 -46195180 1934191 6665574 547269 -17923453 16473921 -5257943 -13751818 29682712
15757 -40828701 -15740217 -20622032 10471994 -41889751 -11149630 -47587636 -17870730
15749 -32738636 18595983 -17276667 -19651763 -27563026 15301907 -12493337 -20714655
15742 -20714655 18884455 -7123126 -1683048 24519857 -18168477 48159718 2658843
15734 4104912 -3617071 2390934 6577730 11953539 3033736 -24896285 -1189672 -43604753
15726 -43604753 -17916834 20360911 34990558 16150622 16493780 2811392 27828151
15719 27828151 -36767635 10655392 10667538 -444994 -13866878 -9613027 37888904 -5014794
$$ packed form
15774b778810o283884k8081867b548432k2848440a401561k9402351c887293m2307887
15766d6195180A934191M731383E47269a7923453A6473921e257943q493875B9682712
15757d0828701a5740217m881815A0471994d1889751a1149630l6438006a7870730
15749c2738636A8595983a7276667k375096p911263A5301907a2493337q221318
15742b0714655A8884455g123126a683048B4519857a8168477D8159718B658843
15734D104912c617071B390934M186796N375809C033736b4896285a189672m2415081
15726d3604753a7916834B0360911J4629647A6150622L43158B811392K5016759
15719B7828151c6767635A0655392J2146d44994j3421884M253851C7888904e014794
$$ plain form
15710 -42760 -17913905 -5340011 -46354939 22528977 32454046 -520777 -6004512 41952133
15701 6307283 -17767202 14838973 1413367 10894372 -684782 -22470769 -3485138 -5562283
15693 -5562283 15520946 -11849701 38961013 36136171 15859459 1005142 6894953 -2018023
15684 12059269 -25552683 22476193 26854914 2828101 25190996 -7256528 -4761941 -51354450
15676 -51354450 42592633 -7438284 -35611303 8791206 -66726053 4270065 -822123 -76602101
15668 -76602101 -29577133 30894559 45304885 -890710 -4100557 -23701014 44121687
15660 -14177340 6541173 20838996 -4581693 -9340398 -15924070 -8803868 -1664555 -3852562
15652 -3852562 -2532284 3491666 -12233893 30120027 -22209269 28019199 -33338427
$$ packed form
15710d2760j7871145e340011m1014928B2528977R925069e20777n483735D1952133
15701F307283a7767202A4838973A413367R481005f84782k1785987c485138k077145
15693e562283A5520946a1849701C8961013k824842A5859459A005142N889811b018023
15684A2059269b5552683B2476193M378721B828101K2362895g256528K494587m6592509
15676e1354450D2592633g438284k8173019H791206f6726053D270065h22123p5779978
15668g6602101b9577133C0894559J4410326h90710l209847j9600457D4121687
15660a4177340F541173J4297823d581693m758705o583672P120202a664555k188007
15652c852562J320278C491666a2233893C0120027b2209269B8019199c3338427
$$ plain form
15644 24304041 -57863918 -4756800 -8885048 28222686 5339086 15115103 12848846 -17381120
15635 -13291702 14382889 5605033 -9884478 4282529 16182234 -8368350 8634106 29512260
15627 29512260 1602653 212112 -9220738 18804453 50949455 2884950 16560786 6133440
15618 15324515 -11763327 2900497 -6883484 1900022 -33693069 -34302870 56183071 24436439
15609 -7996459 -8351237 -2095275 16301868 -7600453 -2304046 -5746035 6176899 8339818
15601 8339818 -2055522 -13684720 -11268573 -16591320 -35397691 -26623706 3170802 4547608
15593 4547608 10747901 -28521350 -23885787 28087348 6201914 14284484 1112453 -13711523
15584 6665401 10422350 -11927364 10343683 11933046 33628794 40784775 -35868048 48966623
$$ packed form
15644B4304041e7863918d756800m128248B8222686E339086R776017k266257a7381120
15635a3291702A4382889E605033i884478D282529J1899705h368350H634106K0878154
15627B9512260A602653B12112i220738A8804453L2145002B884950J3675836F133440
15618A5324515a1763327B900497f883484A900022c3693069o09801E6183071B4436439
15609g996459l54778b095275A6301868g600453b304046l441989F176899K162919
15601H339818b055522j1629198K416147n322747j8806371Q773985C170802J376806
15593D547608O200293b8521350M635563B8087348F201914Q082570A112453a3711523
15584F665401L756949a1927364A0343683J589363K1695748P155981c5868048D8966623
$$ plain form
15575 -23122437 -12935150 -50421360 10914052 7228622 -17913881 17975539 30060211
15568 30060211 8201241 -32987978 -5321392 -11834001 22817833 18152544 2211669 16338374
15560 16338374 53742691 12693178 -9464762 3288619 -9129482 18444085 21902535 -38944517
15551 5864418 -24285046 11104431 15402003 41943899 -1744329 13455193 7035786 -14681991
15542 -9225437 47920465 -2831890 36279393 29556596 1200623 10751973 31473641 -8207781
15533 -25808126 20774607 -7003333 9408720 -4984022 -15128739 -15246229 18591555 30106812
15525 30106812 -2170157 -10277745 -16692448 -45398889 7768462 1961024 13914043 25356706
15517 25356706 -16826867 -1074239 -32203574 -1750333 61049385 14847383 -26243452
$$ packed form
15575b3122437J0187287l7486210A0914052l685430a7913881A7975539J2084672
15568C0060211H201241c2987978e321392o512609B2817833m665289B211669J4126705
15560A6338374L7404317A2693178i464762C288619i129482A8444085L458450c8944517
15551E864418b4285046A1104431M297572K6541896a744329A3455193o419407a4681991
15542i225437D7920465b831890C6279393o722797A200623R551350K0721668h207781
15533b5808126B0774607g003333I408720d984022j0144717j17490A8591555J1515257
15525C0106812b170157q107588o414703k8706441G768462A961024J1953019J1442663
15517B5356706a6826867a074239l1129335a750333F1049385A4847383b6243452
$$ plain form
15509 -34220802 -10808357 606726 7632381 12897555 -1219705 -21456826 3777822 45498
15500 35048040 -12135221 9336245 10861394 3955805 -26443696 -22676851 -26979499 11952175
15491 6168582 -12029657 4345817 -45904776 172830 -10610899 -21107803 29775615 -47996026
15482 -13448028 4567449 530023 7466509 -4505892 2540486 1346394 29241014 4398504
15473 25454611 30239882 -9546634 25507826 12354335 -14347034 1321795 41642663
15466 41642663 1479025 16399979 3008414 18145817 -6507991 -7099061 10249605 51886236
15458 51886236 -14658721 9524335 19423123 14485450 13313200 -13413271 -25294299 -21126532
15450 -21126532 30488434 21736682 -14203524 25307339 8636454 -33511710 -25401007
$$ packed form
15509c4220802a0808357F06726P025655N265174a219705k0237121C777822D5498
15500C5048040a2135221I336245J525149C955805b6443696L766845m302648A1952175
15491F168582a2029657D345817d5904776A72830a0610899j0496904B9775615d7996026
15482a3448028D567449E30023O936486d505892B540486j194092K7894620D398504
15473B5454611M785271i546634B5507826A2354335a4347034A321795M0320868
15466D1642663A479025J4920954C008414J5137403f507991n91070A0249605M1636631
15458E1886236a4658721I524335R898788m937673j172250a3413271j1881028M167767
15450b1126532C0488434q751752a4203524B5307339H636454c3511710Q110703
$$ plain form
15443 -25401007 -12596783 32357957 28739655 -8945309 -9480629 -627880 -3160870 20875253
15434 2493802 -16056692 -43427507 30261952 38113870 -1856755 -18960384 -17432301 -10164423
15426 -10164423 -48987097 -6601158 -52710387 24233821 -10168065 13825178 -27844647
15418 4226955 -21397923 -5929098 -1456067 -11265703 -6689128 17120391 -5066638 -32937535
15410 -32937535 2046809 -16286047 26520180 12234717 9709720 -28309736 -23452431
15403 -23452431 -16808536 -17964589 27027608 -20146574 12381388 10174251 -9460195 -12775024
15395 -12775024 -25518747 -9018414 -18148833 -15221405 1237932 -16382713 -18524972 -10584695
15387 -10584695 28515170 -10847401 -18687723 -10388827 -6747674 -36796231 7364142 21220911
$$ packed form
15443b5401007a2596783C2357957l618302h945309n35320f27880k532990B0875253
15434B493802a6056692k7370815C0261952P851918a856755j7103629J528083P267878
15426a0164423l8822674f601158m6109229B4233821a0168065A3825178b7844647
15418D226955b1397923e929098a456067r809636M576575A7120391e066638k7870897
15410c2937535B046809a6286047B6520180A2234717k524997b8309736M857305
15403b3452431O643895j156053B7027608b0146574A2381388k207137i460195l314829
15395a2775024j2743723i018414r130419K927428A237932a6382713k142259P940277
15387a0584695B8515170a0847401p840322Q298896L641153l0048557G364142J3856769
$$ plain form
15379 21220911 50442971 40919862 9402320 21103976 61102668 5373792 -15682666
15371 30588812 17393807 7469374 10379414 -58309541 -28907546 -32218592 -11570312
15363 1036871 14079757 -18156436 26352597 -48234571 4985197 -6621572 58814644
15355 -6479970 26315545 -1550430 -3293726 9140379 -9994128 21434506 21822901 -3373828
15346 -5104468 -8602994 -21840301 10624231 21540802 -8542262 -10153450 10102701 -36806640
15337 -3877550 23198036 -9965186 14176209 20682582 -16388309 31558524 -19183887
15329 -7941702 -9558687 5159712 -27610601 -11985407 -34395066 -25542682 20359554 10818
15320 -339642 -12823036 -10485450 27231474 -3163009 -4452022 2692970 32187223 -12828643
$$ packed form
15379B1220911K9222060r523109I402320J1701656L9998692E373792a5682666
15371C0588812j3195005G469374K910040e8309541b8907546l311046a1570312
15363A036871J3042886a8156436B6352597d8234571D985197f621572E8814644
15355f479970B6315545a550430j743296I140379i994128B1434506L88395c373828
15346e104468l498526j3237307A0624231J0916571h542262j611188A0102701c6806640
15337c877550B3198036i965186A4176209O506373a6388309C1558524a9183887
15329g941702j616985E159712b7610601a1985407k2409659Q852384B0359554A0818
15320c39642j2483394K337586B7231474c163009j289013B692970K9494253a2828643
$$ plain form
15311 15296431 22674715 6644420 -36707465 -35538733 6026611 -4832008 -38501273 -13547095
15302 -18344991 -891370 -20607963 11693890 6400058 -11863898 -31200529 5172839 -25900660
15293 -40468562 3325007 -27508913 8591873 10804659 23215829 42789608 15702229
15285 2332040 -19548580 18832848 -7374596 48188532 15889675 19146006 20051897 -43458470
15276 10140820 45329415 -8367904 -55004260 17101952 10464283 25208257 1322507
15268 -3702108 8362815 4844271 31461180 9178775 13290494 42230116 6444054 -38001746
15259 7755975 18311824 -4150345 -7750035 -2076913 8539935 -15628798 -41521917 -3286977
15250 -5063514 7713220 -21221980 -18040541 -7967844 18630655 -11518529 15972243 -9606283
$$ packed form
15311A5296431P378284F644420c6707465J168732F026611d832008l3669265a3547095
15302a8344991h91370j9716593A1693890n293832a1863898j9336631E172839b5900660
15293d0468562C325007b7508913H591873K212786J2411170J9573779A5702229
15285B332040a9548580A8832848g374596D8188532A5889675L256331R05891d3458470
15276A0140820L5188595h367904m6636356A7101952o637669J4743974A322507
15268c702108H362815l518544K6616909I178775M111719K8939622F444054c8001746
15259G755975J0555849d150345l599690b076913H539935a5628798k5893119c286977
15250e063514G713220b1221980L181439g967844A8630655a1518529A5972243i606283
$$ plain form
15241 -8354687 -783547 -4506641 20323460 -20605724 605081 23736047 38698583 2379946
15232 -54309 13806800 -25664237 -36656416 19618595 -26329557 -9047330 25050956 5855738
15223 -16454160 899751 33341961 -22093156 -8566824 -31199917 34779741 16263492
15215 -9654719 -518167 35188449 -38121855 8902840 19582232 2702974 -29937023 -22889529
15207 -22889529 10036141 -40239777 5940335 29497527 -23663795 -8253448 17523225
15199 -25098038 12410445 -11215854 9392667 -460821 10586061 -13335515 -2020316 22474140
15190 -26166557 -20189134 7868934 -11425612 -10976248 20902401 -31157250 -13005170 5321354
15181 8217531 18630149 -6785037 -33806177 20510271 -10034220 15628214 31922591
$$ packed form
15241h354687g83547l723094B0323460b0605724F05081K3130966J4962536B379946
15232e4309A3806800b5664237j0992179A9618595b6329557i047330B5050956E855738
15223a6454160H99751L2442210b2093156h566824k2633093C4779741A6263492
15215i654719e18167C5188449c8121855H902840J0679392B702974b9937023P047494
15207b2889529A0036141d0239777E940335K3557192b3663795h253448A7523225
15199b5098038A2410445a1215854I392667d60821A0586061a3335515b020316B2474140
15190b6166557N977423G868934a1425612M49364B0902401c1157250a3005170E321354
15181H217531J0412618f785037k7021140B0510271a0034220A5628214J6294377
$$ plain form
15174 31922591 -1241255 25160344 11806159 -6689076 1094545 -24058089 17654100
15166 -2785153 15316114 -28453273 7823751 -28636913 -4840071 -29063666 3864835 -21762583
15157 13202403 -77110601 -16739609 5983721 9278862 -14669193 -18091258 12163088
15149 20115300 6294195 16141003 10657328 -25654952 17348421 -27326219 -13925407
15142 -13925407 -21608034 -3108850 2606103 22554266 5634089 -5023761 9387558 -3283636
15133 171222 -3369683 -21517160 29777129 -11702776 25475301 26386504 31864573 12253746
15124 23138713 -4799096 12183197 -14845250 8552452 19596991 -29975638 -172113 10431283
15115 62149034 -1257717 -11263500 -5365645 -5415082 44037668 11512838 12913853 -13449552
$$ packed form
15174C1922591a241255B5160344A1806159f689076A094545b4058089A7654100
15166b785153A5316114b8453273G823751b8636913d840071k4223595C864835b1762583
15157A3202403g7110601a6739609E983721L295141a4669193l422065A2163088
15149B0115300F294195R846808n483675b5654952A7348421b7326219J3400812
15142a3925407p682627c108850B606103J9948163E634089e023761I387558c283636
15133A71222c369683j8147477B9777129a1702776B5475301R11203N478069A2253746
15124B3138713d799096A2183197a4845250H552452J1044539b9975638a72113A0431283
15115F2149034a257717j0005783e365645m9437D4037668A1512838J401015a3449552
$$ plain form
15106 -2278785 -15464943 8772071 19863015 22835959 -5787755 -21431070 -20747060 19261337
15097 4829722 19504999 -22185228 -13227797 2354894 -2687798 -26012536 27015416 9300906
15088 17358390 4403410 18255314 24513589 -706410 -22730550 1549315 -39903858 5960242
15079 21913455 18001337 20083269 -21932662 15675260 2489228 -20202396 34282221
15071 36116322 -7387580 -15577646 -5659315 8093708 -25740269 9015330 12116210 -33185425
15062 -18242655 18103377 -1217108 11247145 -26299302 -20537940 16500941 -48024761
15054 -6574822 17589879 46333297 -2520188 -24495207 7436749 33583002 -10715927
15046 -27218666 37674780 -1555392 4262921 -24255155 5788928 2621657 -34475389 -37993240
$$ packed form
15106b278785j3186158H772071J1090944K972944e787755j5643315O84010A9261337
15097D829722J4675277b2185228Q957431B354894b687798k3324738B7015416I300906
15088A7358390D403410J3851904O258275g06410k2024140A549315c9903858E960242
15079B1913455l912118K081932b1932662A5675260B489228b0202396C4282221
15071C6116322g387580q190066e659315H093708b5740269I015330L100880c3185425
15062a8242655A8103377a217108A1247145b6299302N761362A6500941d8024761
15054f574822A7589879K8743418b520188k1975019G436749K6146253a0715927
15046b7218666C7674780a555392D262921b4255155E788928B621657c4475389l517851
$$ plain form
15038 -37993240 13362647 15384064 -10723399 5470343 -783665 -281872 2264681 44025806
15030 44025806 13645449 49499743 -17890129 -5425325 -2813461 -41728665 13918506
15022 -15714306 -2029368 11208141 25928778 19568387 35691968 -4824836 -11429699 2125898
15013 -37007810 7279925 -47149084 32092353 -31027859 44382188 -8069630 -3457708
15005 -18286526 11556931 11110433 37685186 -6194037 25713514 8075833 -9454601 -533178
14996 19859340 11132871 -2231894 -11732455 9567336 21350590 9000339 8718176 4656962
14988 4656962 -53485774 -16326999 -31626870 14353865 -15126985 7601280 9595060
14981 9595060 15795020 14998043 4326803 9957749 -11915573 -49170700 44663340 8000809
$$ packed form
15038c7993240A3362647K021417a0723399E470343g83665b81872B264681M1761125
15030D4025806A3645449L5854294a7890129e425325K611864l8915204A3918506
15022a5714306b029368A1208141J4720637o360391J6123581d824836o604863B125898
15013c7007810G279925d7149084C2092353c1027859D4382188h069630c457708
15005a8286526A1556931m46498K6574753f194037B5713514H075833i454601e33178
14996A9859340q726469b231894r500561I567336J1783254I000339k82163m061214
14988D656962e3485774a6326999j5299871A4353865a5126985G601280J993780
14981I595060O199960p96977D326803N630946a1915573l7255127D4663340H000809
$$ plain form
14972 -45931497 -26480232 14161917 25360333 35962562 -38273655 -31604546 26575455
14964 47794443 -35591652 -16541641 38875861 -15353684 5067213 7260995 51684282
14957 51684282 13891625 -3356611 -262771 4602366 -47119826 29492177 -17778455 17000417
14948 -28140502 -24140099 -28752067 18448433 -5134349 -9368850 27387424 20001152 -14135762
14939 22808342 12912545 6173846 2548993 17221823 -44000543 -12023399 -9123830 29148191
14930 12776011 -29613497 11949093 33376319 -2210655 -6821810 -2787900 54206219
14922 -20557354 -2937453 31367698 -5360551 4625254 14928020 13186243 -1690670 -36208615
14914 -36208615 23963398 14916584 -8412264 -13951134 1572672 23230262 -31468820 -45486699
$$ packed form
14972d5931497J9451265A4161917J1198416J0602229c8273655O669109B6575455
14964D7794443c5591652a6541641C8875861a5353684E067213K193782M4423287
14957E1684282A3891625c356611b62771D602366d7119826B9492177a7778455A7000417
14948b8140502M000403m611968A8448433e134349m234501B7387424p386272a4135762
14939B2808342r895797F173846B548993J4672830d4000543a2023399K899569B9148191
14930A2776011b9613497A1949093K1427226b210655m611155b787900E4206219
14922b0557354b937453C1367698e360551D625254J0302766j741777a690670l4517945
14914c6208615B3963398r046814h412264n538870A572672K1657590c1468820j4017879
$$ plain form
14906 -45486699 -36979034 9224986 13749340 -35327185 5312834 11948973 7592167 -8662639
14897 3944151 7652291 8626846 5184997 -27771197 4222215 5734970 -10184067 39777921
14888 -27762155 17531686 -10826803 1529969 -20226537 -21333063 19019482 37299799
14881 37299799 12358491 -24777380 -32910646 -20338632 -2291465 -48652608 12818996
14873 -37737038 11194429 254833 4683179 15783904 -7928378 -12691093 -4343190 33613683
14864 11433502 13784247 5557521 -13227619 -18668605 23719313 -28559546 47773657
14856 15488857 -14851862 -5596356 22068371 -32683000 25689612 -18649830 -20015111
14849 -20015111 19008010 23400915 -2975605 12163362 3974243 1951892 3719241 -5639567
$$ packed form
14906d5486699Q507665I224986M524354c5327185E312834O636139m356806h662639
14897C944151L708140R74555l441849b7771197D222215J512755a0184067C9777921
14888b7762155A7531686a0826803A529969b0226537j106526A9019482J8280317
14881C7299799A2358491b4777380q133266J2572014b291465m6361143A2818996
14873c7737038A1194429B54833M428346J1100725g928378m762715d343190C3613683
14864A1433502K350745E557521a3227619n440986B3719313b8559546D7773657
14856A5488857a4851862e596356B2068371c2683000B5689612a8649830j365281
14849b0015111A9008010M392905b975605A2163362C974243A951892J767349e639567
$$ plain form
14840 -4210209 3448001 -10985365 -1084744 -29965842 -1250718 -1276665 -22700108 -25733194
14832 -25733194 7724210 -29734046 808168 -2725490 51067585 -28079808 36523885 8613888
14823 -9653293 -19365510 -9920776 -32010037 14229645 -4904135 -382013 39197330 -32379875
14814 16411134 12235146 18634641 -31144346 8838902 14401052 -29102135 31229219 5278114
14805 -22752201 -21525534 -13136316 -23341553 -4693194 -65047545 -21057987 -6150440 15033772
14796 -5114826 20775916 42538528 -46985519 8702158 33482001 -11464596 17688048
14788 -21724450 -35015283 -24004144 -22750099 -8729546 52090771 -15265889 -42259815
14781 -42259815 -22372544 14978688 -22080485 3911802 -11395700 8904530 27954950
$$ packed form
14840d210209C448001a0985365a084744k8881098a250718k5947k1423443l033086
14832b5733194G724210b9734046H08168b725490E1067585b8079808C6523885H613888
14823i653293r712217R444734k2089261A4229645d904135c82013C9197330c2379875
14814A6411134m175988O399495c1144346H838902N562150b9102135C1229219E278114
14805b2752201J226667Q389218j0205237d693194o0354351b1057987f150440A5033772
14796e114826B0775916K1762612d6985519H702158K4779843a1464596A7688048
14788b1724450j3290833J1011139J254045h729546E2090771a5265889k6993926
14781d2259815J9887271A4978688b2080485C911802a1395700H904530J9050420
$$ plain form
14774 27954950 -14110154 -17005455 21980818 -659288 -2357227 22570032 5543101 12848847
14766 12848847 -2138229 6143517 12548118 14174313 -12217263 -5052416 -31628426 -15966045
14758 -15966045 -7250159 -3796290 1274167 20428222 -19087952 13140059 -27436773
14750 22645270 -40015686 -15591100 5355991 6217101 46162627 -14461423 -32485032
14743 -32485032 9379274 -8024729 -2699101 5975532 16019625 12050578 2213416 5441770
14735 5441770 10327735 11711155 -7451007 3209310 63331589 4592151 36391110 -6228977
14726 -18118329 11130427 30277174 10595706 7253241 8145017 -23032193 15210747
14718 11560340 -15168104 24370990 57434202 -10037724 1134868 8947203 -50951552
$$ packed form
14774B7954950a4110154k895301B1980818f59288j697939B2570032E543101P305746
14766A2848847b138229F143517O404601J626195a2217263e052416k6576010J5662381
14758a5966045g250159L453869A274167J9154055a9087952A3140059b7436773
14750B2645270d0015686a5591100E355991Q61110L9945526a4461423j8023609
14743c2485032I379274h024729b699101E975532J0044093l969047B213416L228354
14735E441770M885965J383420g451007C209310O0122279D592151L1798959f228977
14726a8118329A1130427J9146747A0595706l342465Q91776b3032193A5210747
14718A1560340a5168104B4370990L3063212a0037724A134868P812335e0951552
$$ plain form
14710 -17943192 3558200 21294782 -6844856 6304949 -19884835 18006743 -15903556
14702 -55157834 -7741329 6807040 -32046877 -146228 -33736679 18080317 -8366401 27271285
14693 -13604629 8572034 -24634639 -23023572 49126846 23645033 -22992845 27083385
14685 19724674 53728882 -13945370 -18890793 5150439 -2236537 -26195903 -3101787 -22410333
14677 -22410333 3786562 -10857741 -6268962 -40958891 -6633546 3260335 -30716740 -18005346
14669 -18005346 -7434723 2600935 17438954 -18953919 68676581 -4212454 -17175634
14662 -17175634 6018708 -12066440 2957213 28610312 -6822608 2007326 -7449770 8858576
14653 11058554 2453175 -34386186 -31922049 3313315 5157172 -4829489 -27976091 27144714
$$ packed form
14710a7943192C558200J7736582f844856F304949a9884835A8006743a5903556
14702e5157834g741329F807040c2046877a46228l3590451A8080317h366401B7271285
14693a3604629H572034b4634639J611067D9126846B3645033b2992845B7083385
14685A9724674L4004208a3945370m945423E150439b236537k3959366c101787j9308546
14677b2410333C786562a0857741M588779l4689929f633546C260335c0716740J2711394
14669a8005346g434723B600935J4838019a8953919F8676581d212454j2963180
14662a7175634F018708a2066440B957213K5653099f822608B007326g449770H858576
14653A1058554B453175c4386186K464137C313315J843857d829489k3146602B7144714
$$ plain form
14644 11540786 85252168 -28222166 -12270871 -25530152 4024841 -45138463 -7631632
14636 4720148 14042187 -33652318 19470923 34919618 21716174 12591448 4209209 35861731
14628 35861731 6475496 15231514 34934652 29698394 -16650240 7631365 25775191 15065191
14620 15065191 24908251 -9783324 15116599 6704208 4262235 -7814580 38221963 10211036
14611 -4053167 13310503 12278264 22300743 -17302202 5133073 -4118167 65030133 -37800275
14602 2373268 -5120556 32919456 18662437 7913937 9437721 -5449456 -8309936 -14945481
14594 -14945481 -10698811 -9719313 23830676 -10744467 -12464632 15407761 -11132286 -17158818
14586 -17158818 -22209110 17424317 20721066 9866089 -23447157 -7756893 -11169983 -2370948
$$ packed form
14644A1540786P3711382b8222166a2270871j3259281D024841d5138463g631632
14636D720148R322039c3652318A9470923J5448695j3203444r124726D209209L1652522
14628C5861731F475496Q756018J9703138n236258a6650240G631365J8143826j0710000
14620A5065191R843060i783324A5116599F704208k441973g814580C8221963A0211036
14611d053167A3310503j032239J0022479a7302202E133073d118167F5030133c7800275
14602B373268e120556C2919456j4257019G913937J523784e449456k860480o635545
14594a4945481M246670R79498B3830676a0744467j720165A5407761a1132286o026532
14586a7158818n050292A7424317L296749I866089b3447157g756893l413090b370948
$$ plain form
14577 -6050182 7325488 -9656631 26940534 33859320 -11905682 -4826754 17789936 9478050
14569 9478050 34452052 18414669 27394896 -21609754 18943766 1008178 -9555632 -13211892
14561 -13211892 -28968847 -22258934 -12568994 12244604 10114625 32500950 5058818 -29341760
14552 -36251613 12058017 21025619 25565549 -3054473 7947818 -16714353 6797843 -22585772
14543 24431668 19827119 -3043648 26850377 22740949 -38333424 -17818897 2517715 -15337743
14534 -20181578 -20116792 -4772863 3858452 -25598817 -2719457 -21929160 -19278895 -6956464
14525 59781433 25127176 -3097867 17934605 -13190235 1187861 -8619251 3529821 -9824718
14516 39865383 17196896 -11831111 25165948 8340558 4075804 25936724 -38007202
$$ packed form
14577f050182G325488i656631B6940534O918786a1905682d826754A7789936q311886
14569I478050K4974002j6037383Q980227b1609754A8943766A008178i555632l656260
14561a3211892j5756955O709913R689940A2244604k129979K2386325E058818b9341760
14552c6251613A2058017Q967602M539930c054473G947818a6714353F797843b2585772
14543B4431668m604549c043648B6850377m109428c8333424a7818897B517715a5337743
14534b0181578O4786d772863C858452b5598817b719457j9209703K650265f956464
14525E9781433B5127176c097867A7934605a3190235A187861h619251C529821i824718
14516C9865383A7196896a1831111B5165948H340558D075804K1860920c8007202
$$ plain form
14508 19489836 16173579 26635078 18934271 33242495 -7957474 -23358618 15768718
14500 6076688 26446199 25581578 4265568 -21050997 5690730 3496668 7194397 -9288142
14491 30879264 -3914213 -625847 7639096 -5408976 -3782361 -4599477 18916688 4879726
14482 -5004398 -49594558 22941559 8167663 13957692 38407406 13547367 -54002716
14474 -35792238 7284740 20233958 3382773 -35447491 11741827 2075269 32289500
14467 32289500 -12677294 -2911348 14864614 6257167 13350806 -70513855 15464293
14459 33042684 -5556279 -17407361 -18423117 1864183 -32454668 23608693 -30238064
14451 -30055293 -5363404 -9457069 -25705583 24034334 49977056 22511857 -8030441
$$ packed form
14508A9489836l316257J0461499p700807J4308224g957474j5401144A5768718
14500F076688K0369511q64621D265568b1050997E690730k194062L697729i288142
14491C0879264c914213f25847G639096e408976J626615q17116A8916688D879726
14482e004398m4590160B2941559H167663N790029K4449714A3547367e4002716
14474c5792238G284740J2949218C382773c5447491A1741827B075269L0214231
14467C2289500a2677294b911348A4864614F257167P093639g0513855A5464293
14459C3042684e556279j1851082j015756A864183c2454668B3608693c0238064
14451c0055293e363404m093665j6248514B4034334K5942722B2511857h030441
$$ plain form
14443 16322647 3301826 17208267 -20989473 8598902 -23917307 -2932517 -9577273 35787335
14434 -33725776 -6450488 32458613 4268072 9474137 -29003655 8568829 6803189 -2269236
14425 31963321 14376986 7121736 -8417511 6804786 18002772 4415198 -1179942 -33778579
14417 -33778579 -6335573 -40081170 27200654 10744503 -27455228 15897827 37102334
14410 37102334 29565577 -10449285 18996801 -9202544 -9939565 -7471548 23098161 -6121987
14401 -22535909 26316525 4465065 -12549158 -43397235 -36490905 26710569 2207542
14393 4001759 33323967 1720360 8444233 3116122 6245264 -17157477 21621192 -16672850
14384 -2665598 -18628595 -36746226 9560387 7419926 10956499 40267409 11743087 -11713755
$$ packed form
14443A6322647C301826J3906441b0989473H598902b3917307b932517o644756C5787335
14434c3725776f450488C2458613D268072N206065b9003655H568829j765640b269236
14425C1963321A4376986G121736h417511F804786J1197986D415198a179942l2598637
14417c3778579f335573l3745597B7200654A0744503b7455228A5897827K1204507
14410C7102334p536757a0449285A8996801i202544p37021K468017B3098161f121987
14401b2535909B6316525D465065a2549158l0848077O906330B6710569B207542
14393D001759K9322208A720360O723873C116122L129142a7157477B1621192a6672850
14384b665598j5962997j8117631I560387k140461L536573K9310910A1743087a1713755
$$ plain form
14375 12793415 32760001 -29994501 12260700 14680956 673085 5040413 34599942 -7797782
14366 -31057766 23499305 26725196 -8066506 -1067648 15159318 22495296 5006351 -17323759
14357 -15439919 28537579 17829482 -6559682 11802776 -11988486 1105369 1151484 -3570825
14348 30120429 -14420013 -36312702 26974845 2321740 -30241839 -23136040 -31781497
14341 -31781497 31372247 21753610 33340431 33440015 5747066 -29642199 -14469263 30124667
14332 14333690 2427221 14574779 -3575724 18974993 4489816 -32724226 -10596898
14324 13592254 17370231 55019749 -56101523 -2652141 37764757 -38535176 -33103146
14317 -33103146 -10382160 -3340218 13018501 -6790146 -46028095 -15169550 -1035104
$$ packed form
14375A2793415J9966586b9994501A2260700K420256F73085M367328K9559529g797782
14366c1057766B3499305L225891h066506a067648A5159318P335978E006351a7323759
14357a5439919B8537579j0708097f559682A1802776a1988486A105369M6115c570825
14348C0120429a4420013k1892689B6974845B321740c0241839P105799q645457
14341c1781497C1372247r618637J1586821R9584E747066b9642199a4469263C0124667
14332A4333690B427221J2147558c575724A8974993D489816c2724226a0596898
14324A3592254L777977L7649518e6101523b652141C7764757c8535176N432030
14317c3103146a0382160c340218A3018501f790146l9237949a5169550a035104
$$ plain form
14309 -16665963 -42809031 -43630166 -18858317 -7620655 35952613 7541943 19299689 26936158
14301 26936158 -3066218 27637850 5516897 -14283617 7379707 42663599 -32105749
14293 29665403 28414034 25220945 -8708932 50905740 -17913866 16982963 10780355 -12751581
14284 20692196 -2712230 37822576 3299749 16723752 28103290 13681443 12982200 -3283774
14275 41213147 -4581883 21238059 -18106649 45936783 41825526 59781214 10775004
14267 -16096997 -4634702 -10504322 -20684017 -3494409 -11805098 15872888 24378339 16192139
14259 16192139 34932615 -1252401 10382483 48253088 7380335 -5847212 3774972 -11761012
14250 -23920873 733231 12662631 -12092556 15073929 3683779 -28559830 10652779
$$ packed form
14309a6665963k6143068q21135a8858317g620655C5952613G541943J1757746P636469
14301B6936158c066218B7637850E516897a4283617G379707L5283892c2105749
14293B9665403j251369l193089h708932E0905740a7913866A6982963o202608a2751581
14284B0692196b712230C7822576C299749J3424003J1379538A3681443o99243c283774
14275D1213147d581883B1238059a8106649D5936783m111257J7955688A0775004
14267a6096997d634702n869620j0179695c494409q310689A5872888Q505451q186200
14259A6192139J8740476a252401A0382483L7870605G380335e847212C774972a1761012
14250b3920873G33231J1929400a2092556A5073929C683779b8559830A0652779
$$ plain form
14242 37293967 2422095 -12967127 14357403 -13494600 43591999 14181969 32259808
14235 32259808 61087533 11763804 30683301 18530722 60063464 47765257 43300168
14228 43300168 -149850 65452678 61368181 79834810 98547782 119865018 165680380
14221 165680380 140411135 137340385 154303768 177988049 173411576 199892252 276898423
14214 276898423 303364948 293913788 270238187 215636744 308008669 322310262 344770704
14207 344770704 390381895 304309787 301960749 213426377 176271749 208799757 225188181
14200 225188181 189865917 186929399 164467108 112356839 95043048 102441194 105733540
14193 105733540 76948816 88725251 -1670025 4524818 6476128 -27989532 -5370371
$$ packed form
14242C7293967B422095a2967127A4357403a3494600D3591999A4181969J8077839
14235C2259808K8827725A1763804J8919497j2152579M1532742j2298207m465089
14228D3300168a49850F5452678m084497J8466629J8712972K1317236M5815362
14221A65680380k5269245l070750J6963383K3684281m576473K6480676P7006171
14214B76898423K6466525r451160k3675601n4601443R2371925J4301593K2460442
14207C44770704M5611191q6072108k349038q8534372l7154628L2528008J6388424
14200B25188181l5322264k936518k2462291n2110269j7313791P398146L292346
14193A05733540k8784724J1776435a670025D524818J951310b7989532e370371
$$ plain form
14185 -17939688 -12019656 -636844 -56212027 22312439 16329891 -10038898 48035188 -28343430
14176 -46762031 -40647342 -893634 26497959 5688225 -15210403 -8825805 -5536124 -17352343
14168 -17352343 -32267633 -47756867 6964141 5829211 -16999670 -21571298 -22260007 -44968778
14160 -44968778 12712376 17893443 -5389176 -9782263 37452308 7746993 -3158953 -2539362
14152 -2539362 -11678552 -5837508 -9293363 -16389277 34008715 4046707 -21508116 1940297
14143 -18245767 -1138810 9305324 8823592 -8888551 -12546000 9020464 -7778538 -34585337
14135 -34585337 -3768694 20205238 18549397 -20905587 31673818 -1558554 -23523981
14128 -23523981 -10965181 -7399155 -11958996 37720006 5795791 21729581 1960849 -8266356
$$ packed form
14185a7939688N920032f36844n5575183B2312439n982548a0038898D8035188b8343430
14176d6762031O114689h93634B6497959E688225a5210403O384598L289681j1816219
14168a7352343j4915290j5489234F964141j134930a6999670m571628o88709k2708771
14160d4968778A2712376N181067e389176m393087C7452308G746993c158953O19591
14152b539362r139190e837508l455855p095914C4008715D046707b1508116A940297
14143a8245767a138810I305324m81732h888551l657449I020464g778538k6806799
14135c4585337c768694B0205238j655841b0905587C1673818a558554k1965427
14128b3523981a0965181L566026m559841C7720006E795791J5933790A960849h266356
$$ plain form
14119 7948617 -4015728 -23437549 -17305103 -24044008 21260807 -32265131 -7498455 -14320923
14111 -14320923 9961109 -2576095 19476523 -2774384 -12247270 4804148 14685885 -32436369
14102 -14287608 -778071 -27519921 -19426203 -11026533 -8723231 1131556 -41139595 -17002200
14093 18705818 26626431 41804487 -189367 8680678 -29860581 19958987 9915111 17947767
14085 17947767 -10252171 -4529696 19970703 7714844 19751780 2813446 14454711
14078 14454711 16376058 25552352 15247793 1091683 9498112 38007973 19096832 2006318
14069 -17996964 -31353892 49025389 -7935644 -43555566 -8862495 -43230064 -17371698
14061 24562288 8393594 -3364417 16178502 20898234 -6707445 5047252 -51720267 22984488
$$ packed form
14119G948617d015728j9421821O132446o738905B1260807c2265131g498455o822468
14111a4320923I961109b576095A9476523b774384r472886D804148R881737c2436369
14102a4287608g78071k6741850Q093718Q399670K303302A131556d1139595a7002200
14093A8705818P920613J5178056a89367H680678b9860581A9958987I915111Q032656
14085A7947767a0252171d529696A9970703G714844J2036936B813446J1641265
14078A4454711J921347R176294j0304559A091683Q406429K8509861j8911141B006318
14069a7996964j3356928D9025389g935644l5619922h862495l4367569a7371698
14061B4562288H393594c364417A6178502M719732f707445E047252e1720267B2984488
$$ plain form
14052 -40379504 -23536902 -45036107 8136872 5823335 21067894 23048152 9832231 -12293092
14043 7195068 32553778 17032441 -13509611 16270342 -12627558 1637151 -1973042
14035 -44673909 -14372314 22942021 -12980219 -9978208 14431454 2243981 23531634
14028 23531634 -2808902 51985432 -21451824 29969925 7348414 1568970 30231133
14021 30231133 -5646747 26763209 15148464 -9796072 -12380264 18720586 2306457 -22666118
14012 -13517623 10929847 -34541664 -4065011 52958600 -33387501 -20541939 -50024565
14005 -50024565 -22453030 8003778 -114568 -31754106 21161949 -4369012 19892374 25877065
13997 25877065 -3455436 -30380541 -42522456 19541360 15780031 -40595928 -46075683
$$ packed form
14052d0379504J6842602k1499205H136872k313537J5244559J980258I832231a2293092
14043G195068K5358710j5521337a3509611A6270342a2627558A637151a973042
14035d4673909a4372314B2942021a2980219L002011A4431454B243981K1287653
14028B3531634b808902E1985432b1451824B9969925G348414A568970K8662163
14021C0231133e646747B6763209j1614745i796072k584192A8720586B306457b2666118
14012a3517623A0929847c4541664d065011E2958600c3387501J2845562k9482626
14005e0024565b2453030H003778a14568l1639538B1161949d369012A9892374N984691
13997B5877065c455436k6925105j2141915A9541360l761329d0595928n479755
$$ plain form
13990 -46075683 43178710 -22650739 -14365168 -19833928 -21999612 4721837 -32975083 -20291307
13982 -20291307 -28647546 14137690 -15371851 17424643 -10112150 -9915444 1147251 -8293140
13973 41599905 22571038 -14435401 -6102975 -28925595 23352741 -2702038 -1481405
13966 -1481405 26993104 8744865 -16539322 -3917969 4730630 26639225 14005678 -32401698
13957 30745036 4154551 12585455 11516118 -9311723 -25372554 36192027 17229899 -22129304
13948 -10145791 -4783507 2271694 -18631363 12505951 16660825 -36324303 12503709
13940 -36532031 -8475709 10304786 -8796221 -39005953 -24692698 -37675835 11915767
13932 4919575 30596699 24665177 -33056789 -24715080 28119925 -45294747 946774 -53534922
$$ packed form
13990d6075683D3178710b2650739Q285571n468760k165684D721837c2975083J2683776
13982b0291307q356239A4137690a5371851A7424643a0112150J96706A147251h293140
13973D1599905j9028867a4435401f102975k2822620B3352741b702038J220633
13966a481405B6993104H744865a6539322c917969D730630K1908595j2633547c2401698
13957C0745036D154551Q430904j069337i311723j6060831C6192027A7229899b2129304
13948a0145791d783507B271694a8631363A2505951M154874c6324303A2503709
13940c6532031h475709A0304786h796221l0209732J4313255j2983137A1915767
13932D919575K5677124n931522c3056789Q341709B8119925d5294747I46774e3534922
$$ plain form
13923 14322973 -48054436 -17195886 3835445 -22373445 10051323 27146153 -16905554
13915 -8921841 3331046 -29781859 -47455946 57452177 18377346 -34185062 -20978884
13908 -20978884 8321510 13922810 18779290 8785738 1058239 4830960 -53223961 17285994
13899 39808161 5430690 -22571895 3500623 22458283 36166415 38496922 -19679272
13891 -10189032 -2151180 -23165196 -13487258 -9922123 15466701 -17485657 10803680
13883 410561 -18155304 -7962055 3767664 -7389460 -10932756 -2788349 3944379 -57221560
13874 21386298 -14152796 -49194375 -7525398 -2329551 -40379406 21597550 -3299943
13866 -8481979 -34057221 -28484114 -13388207 31651285 1004657 2619446 -14207427 31567333
$$ packed form
13923A4322973d8054436a7195886C835445b2373445A0051323J7094830a6905554
13915h921841C331046b9781859j7674087E7452177A8377346c4185062J3206178
13908b0978884H321510N601300M856480H785738A058239L772721e3223961A7285994
13899C9808161E430690b2571895C500623J8957660J3708132K330507a9679272
13891a0189032b151180k1014016R677938L565135A5466701a7485657A0803680
13883D10561a8155304g962055C767664g389460l543296b788349C944379e7221560
13874B1386298a4152796l5041579g525398b329551l8049855B1597550c299943
13866h481979k5575242N573107a3388207C1651285A004657J614789a4207427C1567333
$$ plain form
13857 13387300 30262318 -23037784 28293277 16068837 -14748633 4599126 -8616726
13849 24613636 7196719 2490871 -21397117 -18351874 -21462775 17322115 -16814456 41568551
13840 -23784531 -31003409 18149155 47748520 -23684809 -9427101 -9270958 -14699887 -3263729
13831 -11185840 -6860251 -3827411 13330147 -41030324 7651529 33821261 -40823097
13823 2177479 -5081689 7063386 24992220 -17475202 -14756048 -31621403 -7389866 -2789675
13814 5677725 -21968548 47520583 25203508 -13696782 -5672001 44045300 -7793147
13806 -18305800 14402919 7005607 38756676 5562570 7304052 2117818 9356131 -23411305
13797 -8330056 -10320953 -23129949 -28232757 39760283 -22617463 -16560444 -5631840 25677884
$$ packed form
13857A3387300J6875018b3037784B8293277j2224440a4748633D599126h616726
13849B4613636G196719B490871b1397117L045243l110901A7322115a6814456D1568551
13840b3784531p218878A8149155K9599365b3684809i427101J56143n428929c263729
13831a1185840M325589L032840A3330147d1030324G651529K6169732d0823097
13823B177479e081689G063386J7928834a7475202K719154j6865355g389866b789675
13814E677725b1968548D7520583k2317075a3696782e672001D4045300g793147
13806a8305800A4402919G005607L1751069E562570J741482B117818P238313b3411305
13797h330056j990897j2808996n102808C9760283b2617463O057019e631840B5677884
$$ plain form
13788 5387480 -787026 38482955 46477156 -19096981 -8541610 502275 2200188 -5691975
13779 -38006882 -2783393 13574325 17653267 2127412 20067836 -13412025 -4860186 22688699
13770 -41458724 -3198553 -8838075 28138075 773520 -16409473 -1019588 -44540740 2361966
13761 18915278 12636465 24505904 40436317 8262666 -9507308 -22722784 -29192728 16488315
13752 -5283102 -8451587 -1929939 -20991429 8454268 30088319 22331063 29676071 40454183
13744 40454183 1904082 8959142 -3543975 -44823398 -10783559 5740934 6193138 11229624
13736 11229624 8741891 -14215723 36153655 25442073 26421684 920589 -12399578 6667374
13727 -11817948 1276456 -16775378 14595796 30781156 5091950 1404907 21676053
$$ packed form
13788E387480g87026C8482955P994201a9096981h541610E02275J697913e691975
13779c8006882b783393A3574325M078942B127412J7940424a3412025d860186B2688699
13770d1458724c198553n639522B8138075G73520a6409473a019588m3521152B361966
13761A8915278o278813J1869439J5930413H262666i507308j3215476o469944A6488315
13752e283102l168485a929939j9061490H454268K1634051p757256P345008J0778112
13744D0454183A904082P055060c543975m1279423a0783559E740934M52204N036486
13736A1229624k487733a4215723C6153655j0711582R79611I20589a2399578F667374
13727a1817948A276456a6775378A4595796J6185360E091950A404907K0271146
$$ plain form
13720 21676053 -11185750 7365330 24971791 10122302 -9172219 -14787701 -36669688
13713 -36669688 -9392531 2720653 -21829316 27283132 -22202620 57616 -21918401 33665076
13704 -49192936 22763035 -5565611 7903038 21265121 -69273 -21805290 28459284 -7539240
13695 388607 21913682 -22289001 -48388548 -28358158 2575558 11158770 26105400 8377178
13686 13111143 9512989 -52338319 -27376238 1159637 -18378370 -553198 -5648711 -5964487
13678 -5964487 23822601 -18159382 -2159788 -55500204 -24666244 -37929000 -15065602
13670 -29100068 -24276985 4487411 -16761072 -27091007 3977251 -13017730 -46029476
13663 -46029476 2916085 -17710163 24737492 16758414 14618499 -30676049 -20162928
$$ packed form
13720B1676053a1185750G365330J7606461A0122302i172219n615482k1881987
13713c6669688i392531B720653b1829316B7283132b2202620E7616b1918401C3665076
13704d9192936B2763035e565611G903038J3362083f9273k1736017B8459284g539240
13695C88607K1525075b2289001k6099547K0030390B575558Q583212J4946630H377178
13686A3111143l598154e2338319K4962081A159637a8378370e53198n095513l15776
13678e964487B3822601a8159382b159788n3340416b4666244j3262756a5065602
13670b9100068M823083D487411a6761072j0329935C977251a3017730l3011746
13663d6029476B916085a7710163B4737492p979078k139915c0676049J0513121
$$ plain form
13656 -20162928 19281366 -22104129 -9184697 -22891980 2469644 13215247 -8314020
13648 22897896 -7531033 28896832 2344047 -3738562 3526110 -1321032 -45486233 3329308
13639 -10954903 -21267565 14404837 -34468322 -19777538 18414726 -12634167 -4703714
13631 17933241 -21217095 2443328 22657490 -17940895 21903288 4140180 34189881
13624 34189881 23908100 -9507113 14890943 52854627 859472 -15513704 11949479
13616 25173900 44441809 41692370 -43826536 1457020 19801664 36666383 18983144
13609 18983144 -27474277 645069 -5236683 -32252466 -32733566 30890444 -6902450 -23356855
13601 -23356855 -12744017 5982419 24685336 21331102 13097335 18410714 8059231 -5125702
$$ packed form
13656b0162928A9281366b2104129i184697j3707283B469644J0745603h314020
13648B2897896g531033B8896832B344047c738562C526110a321032m4165201C329308
13639a0954903j0312662A4404837c4468322J4690784A8414726a2634167d703714
13631A7933241b1217095B443328K0214162a7940895B1903288D140180L0049701
13624C4189881j0281781i507113A4890943L7963684H59472a5513704A1949479
13616B5173900J9267909k749439d3826536A457020J8344644J6864719j7683239
13609A8983144b7474277F45069e236683k7015783m81100C0890444f902450j6454405
13601b3356855J0612838E982419J8702917l354234q233767N313379H059231e125702
$$ plain form
13592 39518133 -8693046 -28891196 -46552128 17196594 -2708850 32926666 3050140
13584 32855984 19466529 -25149389 -14288143 -6943357 -26096570 7207009 -23153402
13576 527616 27627398 -23383984 -7942754 -5225940 11950441 -16995420 29800987 -7995293
13567 4264005 5827265 -2428249 3429066 -4498184 2327533 38082202 -8426310 -6413352
13559 -6413352 -37298848 -23556385 29772491 -11227401 -14047632 -41921936 13036301
13551 4587436 -13233889 16263884 -7019037 -39052670 -35002755 -14451213 -2745104 18894710
13542 -5763558 20856330 -37896088 -16598372 642511 -6280914 -14264430 20115677 4912635
13533 -4881450 -63373558 -32014108 -57787347 -28454190 6592794 -6039186 -38988110
$$ packed form
13592C9518133h693046k0198150j7660932A7196594b708850C2926666C050140
13584C2855984j3389455b5149389J0861246f943357j9153213G207009b3153402
13576E27616K7099782b3383984g942754K716814A1950441a6995420B9800987g995293
13567D264005J563260b428249C429066d498184B327533L5754669h426310K012958
13559f413352l0885496J3742463B9772491a1227401k820231k7874304A3036301
13551D587436a3233889A6263884g019037l2033633M049915a4451213b745104A8894710
13542e763558B0856330c7896088a6598372F42511f280914p983516B0115677D912635
13533d881450n8492108L1359450k5773239b8454190F592794f039186l2948924
$$ plain form
13526 -38988110 -35915792 -14802957 1086467 38195658 -18541117 -13564807 -11905853 13025044
13517 2126850 -7198697 14905701 -3381961 30537176 24574119 -6333625 -15029698 -3749139
13508 -24318841 34220511 25223635 12015460 8734805 -15893238 -34457710 6301379
13500 21987467 24163618 -10011582 8273308 22495939 -836665 -15773441 -4384171 -3313270
13492 -3313270 -30704555 -34701104 -27305841 20946266 13458572 22298613 4159299 -9104137
13483 -18207959 17853982 -11271718 -6830579 8253286 -8472909 54072154 -3998405 -26125256
13475 -26125256 -8753020 1494102 -22131576 17700038 33741576 27799396 -22088167
13467 8919724 17284340 3719601 640536 -36551649 -39097432 -47055653 62869501 -36306261
$$ packed form
13526c8988110L072318a4802957A086467L7109191a8541117M976310J658954A3025044
13517B126850g198697A4905701c381961C0537176n963057f333625q696073c749139
13508b4318841C4220511q996876A2015460l280655a5893238j8564472F301379
13500B1987467K176151a0011582H273308J4222631h36665j4936776d384171J070901
13492c313270k7391285l996549P395263B0946266p487694Q840041D159299i104137
13483a8207959A7853982a1271718M441139H253286h472909E4072154c998405k2126851
13475b6125256h753020A494102b2131576A7700038J6041538n942180b2088167
13467H919724Q364616C719601F40536c6551649k545783p958221F2869501c6306261
$$ plain form
13458 -2291472 -22398911 15812858 27203788 16495691 18937435 38473655 33517115
13451 33517115 5900352 10217717 -21257992 48710129 -4389797 28315351 36138858 -9901294
13442 -6472529 -23432833 -4326922 -23931680 14767893 14521872 34078241 -58925996 -26525490
13433 22496940 -3295888 -17238806 -45575317 -41983327 35150912 16387797 -1035356
13425 -18368126 28949341 4585725 17730946 -6432506 86336766 -8494364 -2318921 29599545
13416 -47477339 35581191 9672787 29905294 -259582 -3730651 -31228248 -16327376 806422
13407 39129462 -14385189 -26433098 636837 -6276169 -9047257 -15285508 16344766 635300
13398 -38614077 -7696560 -8444286 13722024 -8112249 4924325 2152841 16239787 13487065
$$ packed form
13458b291472k0107439A5812858J1390930j0708097K441744J9536220m956540
13451C3517115E900352M317365b1257992D8710129d389797B8315351P823507i901294
13442f472529j6960304d326922j9604758A4767893k46021J9556369e8925996b6525490
13433B2496940c295888j3942918k8336511L591990C5150912A6387797a035356
13425a8368126B8949341D585725J3145221f432506H6336766h494364b318921B9599545
13416d7477339C5581191I672787K0232507b59582l471069k7497597J4900872H06422
13407C9129462a4385189j2047909F36837f276169k771088o238251A6344766F35300
13398c8614077g696560p47726A3722024h112249D924325B152841J4086946k752722
$$ plain form
13390 13487065 -23932788 -30217984 -33570325 3000595 -16862684 25204661 14190528
13383 14190528 35383428 -28713919 1576263 -28162694 -28997278 -7941975 13692943 -16105356
13374 -2462428 6033576 21443242 17343096 -17576673 -12582803 4009540 -34719837 -15824516
13365 -43009474 -20563713 -44949083 -37005503 11889730 -11903377 32733541 18787559
13358 18787559 -5988234 9829951 -15100434 -2009613 9634979 -21378460 29743856 -18818385
13349 24457956 48466136 -5902555 9814136 3460312 -38118012 -18940225 -1043425 -43530296
13341 -43530296 2310979 41511018 -6150261 -17760899 -12571048 -21024926 36522410 -37119198
13332 22596155 12579048 2306503 10554017 9268404 -17063981 8283907 17260908 -4321752
$$ packed form
13390A3487065b3932788o285196l352341C000595a6862684B5204661j1014133
13383A4190528K1192900b8713919A576263b8162694q34584g941975A3692943a6105356
13374b462428F033576J5409666m100146a7576673M993870D009540c4719837a5824516
13365d3009474b0563713k4385370P943580A1889730a1903377C2733541j3945982
13358A8787559e988234I829951a5100434b009613I634979b1378460B9743856a8818385
13349B4457956K4008180e902555I814136C460312c8118012a8940225a043425m2486871
13341d3530296B310979L9200039f150261j1610638N189851q453878C6522410c7119198
13332B2596155j0017107B306503Q247514j285613a7063981H283907Q977001d321752
$$ plain form
13323 -12543502 -3182845 33480599 18693357 -2718455 5892833 18403996 -1778175 3542546
13314 -3339857 -2044786 2987110 -7122282 -10452311 -10612298 11997152 -12915412 -18056825
13306 -18056825 22907557 21031968 -46814926 -18048692 10490135 26311039 1296489
13298 -10830601 15600367 -24305290 16474059 -25025704 -28358200 23771196 2519230
13290 -39243978 -16462853 30261420 -1213817 9031342 -6827850 -25796037 -12567099
13282 -22345238 -38101366 -23692915 -13805688 53936261 41307517 7409566 -5504795
13274 32711300 -37862870 16799742 7955580 15915117 1515741 -10965008 10887844
13266 -11619312 -7850213 10025627 -22414869 -21954929 7796234 -21507809 16918505 2372853
$$ packed form
13323a2543502c182845C3480599j4787242b718455E892833J2511163a778175C542546
13314c339857J295071B987110g122282l330029j59987A1997152a2915412n141413
13306a8056825B2907557j875589d6814926a8048692A0490135J5820904A296489
13298a0830601A5600367b4305290A6474059b5025704l332496B3771196B519230
13290c9243978a6462853C0261420a213817I031342f827850j8968187a2567099
13282b2345238j5756128J4408451R887227E3936261j2628744G409566e504795
13274C2711300c7862870A6799742G955580P959537A515741a0965008A0887844
13266a1619312L769099A0025627b2414869M59940G796234b1507809A6918505B372853
$$ plain form
13257 -29175903 -12512093 -8651752 -18624049 -16177819 6830595 9241390 14529979 -6684138
13248 -2586927 13361585 -12743138 -16175164 1683723 -15989316 13879084 32738073
13241 32738073 21668738 3267846 22052546 -15554417 -26287885 -3212622 2276146
13233 -28582288 20416498 -50632372 -45093648 14663377 7778122 22637189 1461568
13225 9748597 10916768 9596476 18810558 -43073141 -1724790 25350081 5772784 -10615833
13216 -10139838 11295510 -12228520 -2779806 23414396 41397983 289620 -2398920 30673626
13207 8895633 -4904206 -4993694 -6425347 35286980 12335599 -5644946 -4831324 -5229609
13199 -5229609 -36257729 -1202599 -13960078 -72797 -2322245 3837749 -32537568 -47603052
$$ packed form
13257b9175903a2512093L860341r972297K446230F830595K410795N288589f684138
13248b586927A3361585a2743138l432026A683723a5989316A3879084J8858989
13241C2738073j1069335C267846J8784700a5554417j0733468c212622B276146
13233b8582288B0416498e0632372N538724A4663377o885255J4859067A461568
13225I748597J168171j320292R214082d3073141a724790B5350081E772784a0615833
13216a0139838A1295510a2228520b779806B3414396J7983587B89620b398920C0673626
13207H895633d904206q9488j431653C5286980A2335599e644946Q13622l98285
13199e229609l1028120a202599j2757479g2797k249448C837749c2537568j5065484
$$ plain form
13191 -47603052 -14516352 -19005048 10761177 -16110278 -2181056 6083375 11774604 -12301835
13182 -22218470 -22945323 7839291 13971273 -9731817 -3337001 23160324 -15897843 13900826
13173 -21937158 -20340541 48850527 -2793139 -27346529 -5113851 19420560 55661 26531299
13165 26531299 -26300395 -38135850 -804595 11928832 31005519 -2665896 18178724
13157 12315643 12436287 21738274 -3553194 -25017476 -30005380 18845933 3430158 -9779671
13148 25913194 5397423 -4984470 -4225910 -4221163 17090658 16131995 -8341688 5119205 15767931
13139 15767931 -6197808 30125295 -20642509 50880115 -36710507 541182 46859598
13132 46859598 -3412333 5397773 2047887 34780372 -2736406 19630806 16741259 2834812
$$ packed form
13191d7603052a4516352m488696A0761177a6110278b181056F083375N691229a2301835
13182b2218470p26853G839291O131982i731817c337001B3160324a5897843A3900826
13173b1937158J596617D8850527b793139k4553390e113851A9420560E5661K6475638
13165B6531299b6300395j1835455h04595A1928832J9076687b665896A8178724
13157A2315643J20644R301987c553194k1464282m987904A8845933C430158i779671
13148B5913194E397423d984470P58560M747A7090658r58663h341688E119205J0648726
13139A5767931f197808C0125295b0642509E0880115c6710507E41182M6318416
13132D6859598c412333E397773B047887L2732485b736406A9630806k889547B834812
$$ plain form
13123 33179648 -8132068 2772323 16049288 -8201919 -14298010 -23796634 -33651217 2088476
13114 -23782859 -5532545 -1767395 -13668764 -12518329 2691796 11851886 46622496 11629313
13105 5391204 -4195955 24573684 20032527 12599745 17570662 -15449405 -39646658 -61283753
13097 -61283753 29362438 21133784 -31216299 -21896009 -8202156 960531 -18824028 17582281
13088 21025775 1187283 2316532 -39993623 31815331 -37241752 3571130 44545274
13081 44545274 200885 15633262 10698891 -13046417 12111737 19911501 10381568 -18140600
13072 -17445029 42434482 24073330 22472875 13486207 -1385371 -13627418 1052323 -11709440
13063 48412573 -25411721 22645918 26776402 3945189 -11232443 -20226894 25759486
$$ packed form
13123C3179648h132068B772323J3276965h201919o096091r498624r854583B088476
13114b3782859e532545a767395j1901369J150435B691796R160090L4770610A1629313
13105E391204d195955B4573684m541157p432782M970917a5449405k4197253k1637095
13097f1283753B9362438q228654c1216299R320290h202156I60531a8824028A7582281
13088B1025775A187283J129249c9993623C1815331c7241752C571130M0974144
13081D4545274B00885J5432377m934371a3046417A2111737P799764r529933a8140600
13072a7445029D2434482j8361152j600455q986668a385371j2242047A052323a1709440
13063D8412573b5411721B2645918M130484C945189a1232443q994451B5759486
$$ plain form
13055 -25790701 -3357889 8079672 -41884298 28522748 -11203838 -9481519 10616333
13047 -6330534 22963048 5950354 -37055850 8184329 -21538142 -6153172 -9227429 -20882850
13039 -20882850 -21893899 5645983 -274727 31365395 -17535924 -22932892 1163504 716757
13031 716757 -16121324 -9702663 27756027 10732580 -17574402 -503040 -24442613 29944277
13022 -30406973 1641016 19763407 3818584 -21519950 28747148 -42686979 -47097828
13015 -47097828 13276468 -30963693 -29902127 -30002132 -4993422 -30967231 6428412 -16929339
13006 15358375 878017 7346309 1938974 23887983 -2951765 -13215300 -32136368 -36022916
12998 -36022916 -8123306 10856875 17616234 -29601094 14158415 1337822 7769064 1982871
$$ packed form
13055b5790701c357889H079672d1884298B8522748a1203838J722319A0616333
13047f330534B2963048E950354c7055850H184329b1538142f153172l074257j1655421
13039b0882850j011049E645983b74727C1365395a7535924n396968A163504m46747
13031G16757a6121324O418661B7756027A0732580a7574402e03040k3939573B9944277
13022c0406973A641016J8122391C818584b1519950B8747148d2686979m410849
13015d7097828A3276468c0963693J061566j00005d993422k5973809F428412a6929339
13006A5358375H78017O468292A938974K1949009b951765j0263535j8921068l886548
12998c6022916h123306A0856875O759359b9601094A4158415A337822O431242A982871
$$ plain form
12989 2386353 29474375 -21465433 -17926562 44206296 -13889720 4162468 -13568355
12981 -49635972 778998 -21548702 -46052695 1039674 -7026318 -20558260 11270439 -1360612
12972 27975107 1505313 -40472994 29454567 -8896277 -3434172 6779445 8718362 33466495
12964 33466495 6898018 11889355 8191895 -8401774 15557017 21572387 -19757015 -24649285
12956 -24649285 -2575082 10760881 30120770 -32764599 28545174 11052407 -23191560
12948 9485323 -35224638 -11971543 5813978 60031517 -27159130 -9973849 20566642
12940 12672275 -15456411 14634386 -34859 14946364 -14385045 -29671484 6422674 30103929
12932 30103929 12635867 -4039392 -26070566 -7278102 8267492 -50068808 15676819
$$ packed form
12989B386353K7088022b1465433L538871D4206296a3889720D162468a3568355
12981d9635972G78998b1548702k4503993A039674g026318j3531942A1270439a360612
12972B7975107A505313d0472994B9454567h896277c434172F779445J938917K4748133
12964C3466495F898018M991337l697460h401774A5557017O015370a9757015m892270
12956b4649285b575082A0760881J9359889c2764599B8545174A1052407b3191560
12948I485323c5224638a1971543E813978N4217539b7159130i973849B0566642
12940A2672275a5456411A4634386c4859A4946364a4385045j5286439F422674K3681255
12932C0103929A2635867d039392k2031174g278102H267492e0068808A5676819
$$ plain form
12924 8243807 -8829656 -14790193 -21750187 37755588 -21666171 -13050035 12834656 21125700
12916 21125700 -19828611 1555909 19026499 -912718 13888084 -31359094 28515792
12908 -29918503 -25535133 -25899417 4310449 10118726 -16622608 48403379 27634648 -40863635
12899 18041429 -17190901 -13229228 -9798686 -24393716 -17873779 29879653 -24398562
12891 28746192 23485833 -5483163 -15437434 936855 28182630 -34931544 12534899 -27103861
12882 9654649 25430782 -8080583 23104032 -6076962 -10694961 834097 4508771 -4739751
12873 8202735 7157877 -25148557 -6283699 46794945 33839768 29681393 -32600696 5978739
12864 -6449821 35106147 10848995 6078303 -19513750 12315244 17659923 3277745 -5140326
$$ packed form
12924H243807h829656n960537o959994C7755588b1666171Q616136A2834656Q291044
12916B1125700a9828611A555909J7470590i12718A3888084c1359094B8515792
12908b9918503M383370l64284D310449N808277a6622608D8403379k0768731d0863635
12899A8041429a7190901L961673L430542j4595030O519937B9879653b4398562
12891B8746192n260359e483163r954271I36855K7245775c4931544A2534899b7103861
12882I654649J5776133h080583B3104032f076962m617999H34097L674674d739751
12873H202735j044858b5148557f283699D6794945j2955177m158375c2600696E978739
12864f449821C5106147A0848995m770692a9513750A2315244N344679C277745e140326
$$ plain form
12855 -255678 -17535457 -16998471 -43852856 10837672 8604378 -10556997 -21250581 -3054490
12846 -6386254 -3528604 -27881079 3214472 20767029 17700613 5573653 -245875 -20451270
12838 -20451270 30730933 -20194268 589418 4620872 39236410 45121761 30944570 23771263
12830 23771263 9391159 -6485542 5381696 12455047 -6188725 -25694863 18538774 -18693442
12821 27622079 -28264417 39891923 679586 -13411972 23577529 8504132 -5222010 34696939
12812 -28076979 -20063494 -10560823 1957949 -9110146 15726901 -3436579 -6767636 -2754928
12803 -6865215 666590 -3737972 9535035 22311149 14472696 27538503 -32082393 3901756
12794 -4432716 -6908953 9303758 21421807 23276759 2408497 -9374960 35721120 -809666
$$ packed form
12855b55678j7279779N36986k6854385A0837672k233294a0556997j0693584c054490
12846f386254K857650k4352475C214472J7552557l066416E573653b45875k0205395
12838b0451270C0730933b0194268E89418M031454L4615538N885351j4177191p173307
12830B3771263I391159f485542E381696P073351f188725j9506138A8538774a8693442
12821B7622079b8264417C9891923F79586a3411972B3577529H504132e222010C4696939
12812b8076979Q013485R502671A957949i110146A5726901c436579l331057b754928
12803f865215F66590c737972I535035J2776114p838453J3065807c2082393C901756
12794d432716k476237I303758J2118049J854952B408497i374960C5721120h09666
$$ plain form
12785 40260896 -11734398 5804644 -27385482 -28517445 -21976305 -123358 8347648 27763173
12777 27763173 16289229 16991219 -24722819 18877327 21630233 -38761657 -28508900
12770 -28508900 -10172169 -31375308 11837964 24584873 -9610740 18431282 -40957203
12762 6004222 5700775 -4665050 -50956363 -14268831 -2939179 3334097 9038131 45464382
12754 45464382 -22642505 31528580 -12221364 4046315 -557135 -35242174 46979859
12746 37748442 -32486118 2335120 11621030 -18774985 -1076210 14571654 18283654 -5319674
12737 -10320951 2427879 -2626750 7801465 26099962 24494692 11222493 11598979 -21977173
12728 -3378004 -24886849 13462338 -19940629 3864369 -49307053 33948204 -14936976
$$ packed form
12785D0260896a1734398E804644b7385482j131963O541140a23358H347648J9415525
12777B7763173j1473944P01990b4722819A8877327K752906c8761657J0252757
12770b8508900a0172169k1203139A1837964J2746909i610740A8431282d0957203
12762F004222l03447d665050m6291313a4268831b939179C334097N704034L6426251
12754D5464382b2642505C1528580a2221364D046315e57135l4685039D6979859
12746C7748442c2486118B335120R285910a8774985a076210A4571654L712000e319674
12737a0320951B427879b626750G801465J8298497j605270A1222493L76486b1977173
12728c378004k1508845A3462338a9940629C864369d9307053C3948204a4936976
$$ plain form
12720 5594593 -49427588 -27373600 13903900 6491091 -25348290 37619819 -24760054
12712 27168126 -9042373 -654348 39983382 8790797 39445353 -23492512 -17608894 -14703440
12704 -14703440 -13037744 19668230 -11791630 -2371458 17556102 -32107192 -18270722
12697 -18270722 -31081435 6515011 -34689382 19383525 -19857483 32754008 -11688719
12689 -10273874 -31540581 16069357 -18645918 42536622 7206395 460465 12552020
12682 12552020 21285238 4139315 6407617 -9478561 -15529304 -16784392 -15758110 -2424490
12673 -11819004 -29569408 -4909339 -32832816 -13823941 4639757 -16261973 -12414993
12666 -12414993 -25195947 33162606 4611856 -3744560 9747564 13550076 -5094096 -5105697
$$ packed form
12720E594593d9427588K2053988A3903900F491091b5348290C7619819b4760054
12712B7168126i042373f54348C9983382H790797L0654556b3492512N883618K905454
12704a4703440J665696A9668230a1791630b371458A7556102c2107192J3836470
12697a8270722j2810713F515011c4689382A9383525a9857483C2754008a1688719
12689a0273874k1266707A6069357a8645918D2536622G206395D60465J2091555
12682A2552020Q733218D139315K268302i478561o050743j255088J026282b424490
12673a1819004j7750404d909339k7923477a3823941D639757a6261973L846980
12666a2414993j2780954C3162606D611856c744560I747564L802512e094096j1601
$$ plain form
12658 -5105697 19985169 -22124226 -4736901 -14882547 19612068 33558417 7845282
12650 -8121422 25748088 -8023502 -7133967 19596952 12684272 56483797 -47525215 -19636324
12641 27815178 8427717 -42494947 -9772299 10293131 -17373795 17477449 26668991
12634 26668991 -11937578 28722819 -34351488 -7125244 18962652 14427189 -12103851
12626 -35821529 -34328362 11154809 25118810 12182122 -27937270 14870085 -6907578
12618 10149862 -7628582 -1657782 -8874036 -19097252 -24515732 53142090 34252363 -15965646
12609 36134584 29321169 -5958852 15784693 6800814 27900478 48180719 17374870
12601 14332111 4565938 -1710328 -23642479 -13691128 49563497 364929 22363748 20281897
$$ packed form
12658e105697A9985169b2124226d736901j0145646A9612068J3946349G845282
12650h121422B5748088h023502Q89535A9596952o912680M3799525d7525215a9636324
12641B7815178H427717d2494947i772299A0293131a7373795A7477449R191542
12634B6668991a1937578B8722819c4351488g125244A8962652m535463a2103851
12626c5821529J493167A1154809J3964001A2182122b7937270A4870085f907578
12618A0149862g628582a657782p216254j0223216n418480E3142090j8889727a5965646
12609C6134584o813415e958852A5784693F800814K1099664K0280241A7374870
12601A4332111D565938a710328k1932151R951351D9563497C64929K1998819k081851
$$ plain form
12593 20281897 -22808463 28351869 -615289 33450750 -24311359 10392265 14044034
12586 14044034 -39490975 -6637384 6940229 -63407527 -45331751 -4472409 -21742172
12579 -21742172 -8638222 -8693557 -8900345 11153544 -14684710 4274803 -25896972 6784442
12570 -7318263 -6689244 7566480 -5110986 21652910 6229200 -7882592 22797051 5812206
12561 -27404860 23210357 2280200 -20327563 13645320 15694440 43579299 17037598
12553 5053802 17973870 -35323708 11251135 13579509 34581087 22271702 -39406254
12545 -1455229 -10350866 -10669077 -13303025 57542595 46815355 -30818844 -6412944 -5709787
12537 -5709787 -16183597 17063339 -12246965 -40664707 3424970 5453081 -28823319
$$ packed form
12593B0281897b2808463B8351869f15289C3450750b4311359A0392265L651769
12586A4044034c9490975f637384F940229f3407527J8075776d472409j7269763
12579b1742172h638222n5335k06788A1153544a4684710D274803b5896972F784442
12570g318263O29019G566480e110986B1652910F229200g882592B2797051E812206
12561b7404860B3210357B280200b0327563A3645320K049120K7884859A7037598
12553E053802J2920068c5323708A1251135K328374K1001578j2309385c9406254
12545a455229q895637l18211k633948E7542595j0727240c0818844f412944P03157
12537e709787j0473810A7063339a2246965k8417742C424970K028111b8823319
$$ [...]
##END NTUPLES=NMR SPECTRUM
##END=
