##TITLE=ST0000_MeOD-4_7212735_VkaFngzLdu
##JCAMPDX= 6.0         $$ Bruker NMR JCAMP-DX V2.0
##DATA TYPE= NMR SPECTRUM
##DATA CLASS= NTUPLES
##ORIGIN= BRUKER
##OWNER= Administrator
$$ 1.72 TOPSPIN		Version 2.1
$$ 2013-10-12 01:03:40.268 -0700  Administrator@X
$$ Compression mode = diff/dup
##.OBSERVE FREQUENCY= 400.02188249412
##.OBSERVE NUCLEUS= ^1H
##.ACQUISITION MODE= SIMULTANEOUS (DQD)
##.ACQUISITION SCHEME= undefined
##.AVERAGES= 4
##.DIGITISER RES= 22
##SPECTROMETER/DATA SYSTEM= spect
##.PULSE SEQUENCE= zgpsd0
##.SOLVENT NAME= COFFEE_meoh
##.SHIFT REFERENCE= INTERNAL, COFFEE_meoh, 1, 14.98509
##AUDIT TRAIL= $$ (NUMBER, WHEN, WHO, WHERE, PROCESS, VERSION, WHAT)
$$ ##TITLE= Audit trail, TOPSPIN		Version 2.1
$$ ##JCAMPDX= 5.01
$$ ##ORIGIN= Bruker BioSpin GmbH
$$ ##OWNER= Administrator
$$ $$ E:\/data/COFFEE/nmr/ST0000_MeOD-4_7212735_VkaFngzLdu/11/pdata/1/auditp.txt
$$ ##AUDIT TRAIL=  $$ (NUMBER, WHEN, WHO, WHERE, PROCESS, VERSION, WHAT)
(   1,<2013-10-12 01:03:33.737 -0700>,<Administrator>,<X>,<go>,<TOPSPIN 2.1>,
      <created by zg
	started at 2013-10-12 01:02:23.784 -0700,
	POWCHK enabled, PULCHK disabled,
       configuration hash MD5:
       C8 4E 4E 5D D3 5C D8 9E 9F 52 82 E0 59 8A DE 15
       data hash MD5: 64K
       63 7F 43 06 82 1C 8C 86 55 CC 6D FD 8B 9F 59 93>)
(   2,<2013-10-12 01:03:36.534 -0700>,<Administrator>,<X>,<proc1d>,<TOPSPIN 2.1>,
      <Start of raw data processing
       efp LB = 0 FT_mod = 6 PKNL = 1 PHC0 = 0 PHC1 = 0 SI = 32K 
       data hash MD5: 32K
       49 49 86 DE 74 70 6B 23 D3 54 24 BE 61 45 30 1A>)
(   3,<2013-10-12 01:03:36.815 -0700>,<Administrator>,<X>,<proc1d>,<TOPSPIN 2.1>,
      <pk PHC0 = -41.24817 PHC1 = 0 
       data hash MD5: 32K
       18 91 79 85 C6 D4 F8 FE 17 D7 A7 74 4D 3E 4B 05>)
(   4,<2013-10-12 01:03:36.893 -0700>,<Administrator>,<X>,<proc1d>,<TOPSPIN 2.1>,
      <abs ABSG = 1 
       data hash MD5: 32K
       B9 0F 44 7F 4F CE A7 E4 D1 8D 53 70 90 38 8D B3>)
(   5,<2013-10-12 01:03:36.972 -0700>,<Administrator>,<X>,<proc1d>,<TOPSPIN 2.1>,
      <abs ABSG = 2 
       data hash MD5: 32K
       99 09 AB C6 D3 E6 25 EF F8 9A 43 60 23 8E 60 28>)
(   6,<2013-10-12 01:03:37.050 -0700>,<Administrator>,<X>,<proc1d>,<TOPSPIN 2.1>,
      <abs ABSG = 3 
       data hash MD5: 32K
       DB 60 B3 CB 5F 5A 12 42 B7 AB 9B D0 71 08 F0 DF>)
(   7,<2013-10-12 01:03:37.097 -0700>,<Administrator>,<X>,<proc1d>,<TOPSPIN 2.1>,
      <abs ABSG = 4 
       data hash MD5: 32K
       FE 68 22 3D 9E 82 A3 4D 9E 0D E1 CA B1 6B DA E8>)
(   8,<2013-10-12 01:03:37.143 -0700>,<Administrator>,<X>,<proc1d>,<TOPSPIN 2.1>,
      <abs ABSG = 5 
       data hash MD5: 32K
       36 AE 81 82 E7 A6 00 32 AE FF DB A3 A6 FE DF 1F>)
$$ ##END=
$$ 
$$ $$ hash MD5
$$ $$ 2E F1 05 E8 1D 7B 6F A7 AA 5C 4E D0 15 17 D3 9A
##$RELAX= 
##$RELAX= 
##$RELAX= 
##$RELAX= 
##$RELAX= 
##$RELAX= 
##$RELAX= 
##$RELAX= 
$$ Bruker specific parameters
$$ --------------------------
##$DU= <E:\>
##$EXPNO= 11
##$NAME= <ST0000_MeOD-4_7212735_VkaFngzLdu>
$$ [...]
150 150 150 150 150 150 150 150
##$TP07= 0
##$TPNAME0= <>
##$TPNAME1= <>
##$TPNAME2= <>
##$TPNAME3= <>
##$TPNAME4= <>
##$TPNAME5= <>
##$TPNAME6= <>
##$TPNAME7= <>
##$TPOAL= (0..7)
0.5 0.5 0.5 0.5 0.5 0.5 0.5 0.5
##$TPOFFS= (0..7)
0 0 0 0 0 0 0 0
##$TUNHIN= 0
##$TUNHOUT= 0
##$TUNXOUT= 0
##$USERA1= <user>
##$USERA2= <user>
##$USERA3= <user>
##$USERA4= <user>
##$USERA5= <user>
##$V9= 5
##$VALIST= <valist>
##$VCLIST= <CCCCCCCCCCCCCCC>
##$VD= 0
##$VDLIST= <DDDDDDDDDDDDDDD>
##$VPLIST= <PPPPPPPPPPPPPPP>
##$VTLIST= <TTTTTTTTTTTTTTT>
##$WBST= 1024
##$WBSW= 4
##$XGAIN= (0..3)
0 0 0 0
##$XL= 0
##$YL= 0
##$YMAX_a= 377
##$YMIN_a= -552
##$ZGOPTNS= <>
##$ZL1= 120
##$ZL2= 120
##$ZL3= 120
##$ZL4= 120
##$ABSF1= 14.98509
##$ABSF2= -5.573092
##$ABSG= 5
##$ABSL= 3
##$ALPHA= 0
##$AQORDER= 0
##$ASSFAC= 0
##$ASSFACI= 0
##$ASSFACX= 0
##$ASSWID= 0
##$AUNMP= <proc_prof1d_extract_pilot.lims>
##$AXLEFT= 0
##$AXNAME= <>
##$AXNUC= <1H>
##$AXRIGHT= 0
##$AXTYPE= 0
##$AXUNIT= <>
##$AZFE= 0.1
##$AZFW= 0.1
##$BCFW= 0
##$BC_mod= 0
##$BYTORDP= 0
##$COROFFS= 0
##$CY= 15
##$DATMOD= 1
##$DC= 0
##$DFILT= <>
##$DTYPP= 0
##$F1P= 0
##$F2P= 0
##$FCOR= 0.5
##$FTSIZE= 32768
##$FT_mod= 6
##$GAMMA= 0
##$GB= 0
##$INTBC= 1
##$INTSCL= 1
##$ISEN= 128
##$LB= 0
##$LEV0= 0
##$LPBIN= 0
##$MAXI= 10000
##$MC2= 0
##$MEAN= 0
##$ME_mod= 0
##$MI= 0
##$NCOEF= 0
##$NC_proc= -19
##$NLEV= 6
##$NOISF1= 0
##$NOISF2= 0
##$NSP= 0
##$NTH_PI= 0
##$NZP= 0
##$OFFSET= 14.98509
##$PC= 1
##$PHC0= -41.24817
##$PHC1= 0
##$PH_mod= 1
##$PKNL= yes
##$PPARMOD= 0
##$PPDIAG= 0
##$PPIPTYP= 0
##$PPMPNUM= 2147483647
##$PPRESOL= 1
##$PSCAL= 4
##$PSIGN= 0
##$PYNMP= <proc.py>
##$REVERSE= no
##$SF= 400.02
##$SI= 32768
##$SIGF1= 0
##$SIGF2= 0
##$SINO= 400
##$SIOLD= 32768
##$SPECTYP= <>
##$SREGLST= <1H.CDCl3>
##$SSB= 0
##$STSI= 32768
##$STSR= 0
##$SW_p= 8223.68421052631
##$SYMM= 0
##$S_DEV= 0
##$TDeff= 65536
##$TDoff= 0
##$TI= <>
##$TILT= no
##$TM1= 0
##$TM2= 0
##$TOPLEV= 0
##$USERP1= <user>
##$USERP2= <user>
##$USERP3= <user>
##$USERP4= <user>
##$USERP5= <user>
##$WDW= 1
##$XDIM= 32768
##$YMAX_p= 375558468
##$YMIN_p= -87517021
##$CURPLOT= <Network HP LaserJet P1505>
##$CURPRIN= <$Network HP LaserJet P1505>
##$DFORMAT= <normdp>
##$LAYOUT= <+/1D_H.xwp>
##$LFORMAT= <normlp>
##$PFORMAT= <normpl>
##$SURQMSG= 1
$$ End of Bruker specific parameters
$$ ---------------------------------
##NTUPLES= NMR SPECTRUM
##VAR_NAME=  FREQUENCY,     SPECTRUM/REAL,   SPECTRUM/IMAG
##SYMBOL=    X,             R,               I
##VAR_TYPE=  INDEPENDENT,   DEPENDENT,       DEPENDENT
##VAR_FORM=  AFFN,          ASDF,            ASDF
##VAR_DIM=   32768,         32768,           32768
##UNITS=     HZ,            ARBITRARY UNITS, ARBITRARY UNITS
##FACTOR=    0.250966925370066, 1,           1
##FIRST=     8223.43324360094, -14668300,    -13831911
##LAST=      0,             -12257497,       -1325589
##MIN=       0,             -87517021,       0
##MAX=       8223.43324360094, 375558468,    0
$$ Real data points
##PAGE= N=1
##DATA TABLE= (X++(R..R)), XYDATA
$$ [...]
18313g442397o44032P37216a99689n1199556A3365010a1140472D034277b8102740
18304B2806853k458505a214906D0763077H430619M279598C939637a2692781B8192763
18295e765558C2482854l624905A3857144B254030a976090A6824225p913269L1406119
18287D0317075e074963m343789a958892p744241B442833a1489887A1218570m237306
18279F981264M607556Q105255a0195489h50537F3095532c7090407f730121A4458604
18270b2987073p331071C3959862j5731603c223730p021656A0433869K0307661
18263C0741530a0816975I667540Q964772A161264J2854943b7563425B5486957
18255H173530a7268146a564572B0978232h439252J902785j5378222h307140j6522765
$$ plain form
18313 -7442397 -8086429 -7349213 -199689 -51399245 13365010 -11140472 4034277 -28102740
18304 22806853 20348348 -1214906 40763077 8430619 12710217 3939637 -12692781 28192763
18295 -5765558 32482854 28857949 13857144 2254030 -1976090 16824225 8910956 40317075
18287 40317075 -5074963 -9418752 -1958892 -9703133 2442833 -11489887 11218570 6981264
18279 6981264 11588820 19694075 -10195489 -850537 63095532 -37090407 -6730121 14458604
18270 -22987073 -30318144 33959862 18228259 -3223730 -10245386 10433869 30741530
18263 30741530 -10816975 9667540 18632312 1161264 14016207 -27563425 25486957
18255 8173530 -17268146 -1564572 20978232 -8439252 -6536467 -21914689 -8307140 -24829905
18247b4829905c141326A3438268A516277L5337590d7532926h666217D403082J5134833
18239A9537915B211707G14478h095401l1913262h341963j8278451A748633K3950815
18231B5699448b0637330B4825598b5929079f389993a900612j9313414F601343
18223B7048177a610818j0235007K683270E100683A870546L4544647H37445J6697301
18215A7534746N338432d1604372A8669145L877820d2174228K0286018D782906
18207E1267779B4531853h912202A0867123l946746d724411K13389A6006924a6158943
18198C7829028b0288676Q023450H971837c7763302D3148695G490533a0968098
18190A3537393a2211116B9347437a0029795r981481C246661a0140650D5401652
$$ plain form
18247 -24829905 -3141326 13438268 1516277 36853867 -47532926 -8666217 4403082 19537915
18239 19537915 2211707 714478 -8095401 -40008663 -8341963 -26620414 1748633 25699448
18231 25699448 -20637330 24825598 -25929079 -6389993 -1900612 -21214026 6601343
18223 27048177 -1610818 -11845825 -9162555 5100683 1870546 36415193 837445 17534746
18215 17534746 22873178 -41604372 18669145 22546965 -42174228 -21888210 4782906
18207 51267779 24531853 -8912202 10867123 6920377 -4724411 -4511022 16006924 -16158943
18198 37829028 -20288676 -12265226 8971837 -37763302 43148695 7490533 -10968098
18190 13537393 -12211116 29347437 -10029795 -20011276 3246661 -10140650 45401652
18182B668203c0088392B7691430a3687246B1902275b84923H791002o62200d1090041
18173F241001b0025171A0236598A505175J7121361O807626a7196782L931337k3023054
18165c6288499a834852A8531054h35197A2153767m487613d909271j3075835e029006
18156e349131H867254b4470910A731808K9563215j2187306a1585938C0339768
18148a0826896j1191837A206348J8056997a5602061M109986A7786590c692837
18140C781051L054749j359506P310101d997396O30801B819683a9190126D2139320
18131A9028699a3989939M495010p171824n972280E323541b2595624b587944A5781640
18122c3472136B530107L1276674a4032754H672851a7653378B221990K3541088
$$ plain form
18182 2668203 -30088392 27691430 -13687246 21902275 -284923 8791002 8128802 -41090041
18173 6241001 -20025171 10236598 1505175 18626536 25434162 -17196782 -13265445 -36288499
18165 -36288499 -1834852 18531054 -835197 12153767 7666154 -4909271 -17985106 -5029006
18156 -5349131 8867254 -24470910 1731808 31295023 19107717 -11585938 30339768
18148 -10826896 -22018733 1206348 19263345 -15602061 -11492075 17786590 -3692837
18140 3781051 6835800 5476294 12786395 -4997396 -4366595 2819683 -19190126 42139320
18131 19028699 -13989939 -9494929 -16666753 -22639033 5323541 -22595624 -2587944 15781640
18122 -33472136 2530107 33806781 -14032754 8672851 -17653378 2221990 25763078
18115B5763078g302586b201308B1788346a4161969B4328637b9557083A769809
18107a259104C0065930d1434468B3368012a776932A1354042N282986O406610l622033
18099A9421605a7480450q11417I596178K0601898B587128O458934Q180331N18789
18091A7745182e6370266K8074512a3389992J99393C5177078b5899538K167740
18084b3731798e938314m2558190J8352386q775798l921631h2977I203565f6912034
18075G376430K6847256B224079C66248g406511B0011287r444665J9219951i919564
18066A1744554B077008N382524R598135J8947230b4342473O637489k5707463A5801611
18057A5543249c1128884A0268488d012558p668846j6763248K138190a1235641
$$ plain form
18115 25763078 -7302586 -2201308 21788346 -14161969 24328637 -29557083 1769809
18107 -1259104 30065930 -41434468 23368012 -1776932 11354042 16637028 23043638 19421605
18099 19421605 -17480450 -18291867 9596178 30198076 2587128 9046062 17226393 17745182
18091 17745182 -56370266 -28295754 -13389992 -13190599 35177078 -25899538 -23731798
18084 -23731798 -5938314 -48496504 -30144118 -38919916 -42841547 -82977 9203565 -66912034
18075 7376430 34223686 2224079 366248 -7406511 20011287 10566622 29786573 -9919564
18066 11744554 2077008 7459532 17057667 36004897 -24342473 -17704984 -43412447 15801611
18057 15543249 -31128884 10268488 -4012558 -11681404 -28444652 -26306462 -11235641
18049a0322323j3454977B3431403P362391a1782494j325060A9410530b4574177
18041c7370001a1643765E322933a9175564l2789952b369843k535306j6274081
18034b1179230B6236666A1731255a56118l1788203D273716Q501611l960613e86154
18025c1554512c679368A3842721A276825b6245018B958318f972163j8667290l501527
18017b9140980g358626F599329a3230787o269108R370672k3114892E127111J4956806
18009B0083917c2258885C382490P135801a0106454k282659A8997553P541758c764496
18000c4212868G894646N5922709B958649h269966H171766Q27323f036878B3917021
17991c5217273a5817075g031534C753030b473734I346729J5023901a9711672p947448
$$ plain form
18049 -10322323 -23777300 23431403 30793794 -11782494 -13107554 19410530 -24574177
18041 -37370001 -11643765 5322933 -19175564 -51965516 -2369843 -4905149 -21179230
18034 -21179230 26236666 11731255 -156118 -31944321 4273716 12775327 8814714 -586154
18025 -31554512 -3679368 13842721 1276825 -26245018 2958318 -6972163 -25639453 -29140980
18017 -29140980 -7358626 6599329 -13230787 -19499895 -10129223 -33244115 5127111 20083917
18009 20083917 -32258885 3382490 10518291 -10106454 -12389113 18997553 26539311 -3764496
18000 -34212868 7894646 63817355 2958649 -8269966 8171766 8999089 -6036878 23917021
17991 -35217273 -15817075 -7031534 3753030 -2473734 9346729 24370630 -19711672 -27659120
17983b7659120a830257F993151J9731081A0314330a466728j8519445P660996A0499380
17974C6904632c4325346a313144B131348Q923773J6582764a7188280F157993b5761453
17965a2044030p812836H614368b105102C3301838M447384F635949e3469678K4525284
17957b8944394B0713520P006265D725014J4981125C706522J4922579A986710b6512117
17948F853760d1729868K0517520f627495j141419j1757251h669754A4039488J4922270
17940B8961758H71567K050842R181824a1736251j1593064J0054672D476580K2431070
17932B6907650a632473B2034109E954624N107601c0728870A84388c2539565L345591
17924b9193974E095146K783690r63324b1294537C3457644c2925837B3503397b2132586
$$ plain form
17983 -27659120 -1830257 6993151 26724232 10314330 -1466728 -19986173 -12325177 10499380
17974 36904632 -34325346 -1313144 2131348 11055121 27637885 -17188280 6157993 -25761453
17965 -12044030 -19856866 8614368 -2105102 33301838 37749222 6635949 -53469678 -28944394
17957 -28944394 20713520 27719785 4725014 19706139 3706522 18629101 1986710 -26512117
17948 6853760 -41729868 -21212348 -6627495 -7768914 -19526165 -8669754 14039488 28961758
17940 28961758 871567 2922409 12104233 -11736251 -23329315 -13274643 4476580 26907650
17932 26907650 -1632473 22034109 5954624 11062225 -30728870 184388 -32539565 -29193974
17924 -29193974 5095146 7878836 6915512 -21294537 33457644 -32925837 23503397 -22132586
17915b2634024C4089812a47209A0175556l250678h902344n761667D157373a2049730
17906A8434747c605191n4021844b001951F334370K6123163A2404715J496402k944215
17898A0956902O463364a8717320j0488654I422387h573818a29533j3102619j6345502
17890b9577654G613574e8053310F071826g798781E013564b1409038h817603j132570
17882i950173B820231b5048406l864548B751210L865784e538145B7070511c2146390
17873H418645b7253728f018918A3327286m426390a8760554C1012686g428111C1358543
17864b3341922n04509A3348497P125094E336845c628356p450770m931775q967548
17856b4978449A3041110D722439a9540430H583885J1217633a4000922A6231960
$$ plain form
17915 -22634024 34089812 -147209 10175556 6924878 -8902344 -14664011 4157373 -12049730
17906 18434747 -3605191 -57627035 -2001951 6334370 32457533 12404715 13901117 10956902
17898 10956902 17420266 -18717320 -29205974 9422387 -8573818 -129533 -13232152 -29577654
17890 -29577654 7613574 -58053310 6071826 -7798781 5013564 -21409038 -8817603 -9950173
17882 -9950173 2820231 -25048406 -28912954 2751210 6616994 -5538145 27070511 -32146390
17873 8418645 -27253728 -6018918 13327286 8900896 -18760554 31012686 -7428111 31358543
17864 -23341922 -23846431 13348497 20473591 5336845 -3628356 -11079126 -16010901 -24978449
17856 -24978449 13041110 4722439 -19540430 8583885 19801518 -14000922 16231960
17848B6638098l961091F389891d357299B837361L00538K3211802j1495357k224299
17840A2630045J0036156J2996172A4046102d569767C140722f006975l921572H710052
17831A423036Q669145q50347e465377A0981951l801526K9788233H817633c1524507
17822C8138954A6101072a0981461A91573a6564381n103663f733914b023102K84217
17814a738885l7675785k56726I802238J7644146K054818r232981F521390c1860163
17805G749575a7279325Q142482A1977411c1128732J1215005R239243a26417D460315
17796B4955309e405860A2215361c5768243J0522385n934705I703132d235176l259711
17788g494887o452427l0788083A4347037M2827333b652887k682675A1319953c8587863
$$ plain form
17848 26638098 22677007 6389891 -4357299 2837361 3137899 26349701 14854344 12630045
17840 12630045 22666201 35662373 14046102 -4569767 3140722 -6006975 -9928547 8710052
17831 1423036 10092181 9241834 -5465377 10981951 7180425 36968658 8817633 -31524507
17822 38138954 16101072 -10981461 191573 -16564381 -21668044 -6733914 -2023102 -1738885
17814 -1738885 -39414670 -39671396 9802238 27446384 29501202 20268221 6521390 -31860163
17805 7749575 -17279325 -9136843 11977411 -31128732 -19913727 -10674484 -126417 4460315
17796 24955309 -5405860 12215361 -35768243 -25245858 -31180563 9703132 -4235176 -7494887
17788 -7494887 -13947314 -44735397 14347037 57174370 -2652887 -5335562 11319953 -38587863
17779a5602898o781891Q105535K456847C3412920d1226693J1861423l069130A5621162
17770A6792339E378149K8416076A348054b279082F597075J52498f009140k7259431
17762c3268571a2807520H123430l976439b5292977E516303c9200944Q368385J4947851
17754a5884708C9971316j0229958i86849p304416A8109443a5276391N510318E482318
17745b3007724j8031469h734345N05154l4029718C8715872b9434561E949334K2293602
17737B8242936a939205k341569A7442225H429720B648414O607546J4701271C120928
17728B8670151O021513c1911400a5047909c350075E4034791c2931086a5686174
17720A3642713c8151585D031317L2684800j1157033a4411736a587366A9014431
$$ plain form
17779 -15602898 -22384789 -14279254 -11822407 33412920 -41226693 -29365270 -32434400 15621162
17770 16792339 5378149 33794225 1348054 -2279082 6597075 6749573 -6009140 -33268571
17762 -33268571 -12807520 8123430 4146991 -25292977 5516303 -39200944 -30832559 -15884708
17754 -15884708 39971316 29741358 -986849 -8291265 18109443 -15276391 -9766073 5482318
17745 -23007724 -41039193 -8734345 -8229191 -42258909 38715872 -29434561 5949334 28242936
17737 28242936 -1939205 -4280774 17442225 8429720 2648414 9255960 23957231 3120928
17728 28670151 34691664 -31911400 -15047909 -3350075 54034791 -32931086 -15686174
17720 13642713 -38151585 4031317 36716117 25559084 -14411736 -1587366 19014431
17712f075221j3487357d19879A4051981J4064404f603221m86969j3669529A5624793
17703A3163705a3848267n067367A3074552a1033354o064401E479417b3234134
17695B1878763a9616935A6895108d0114420A0846645J979703b2510318A5754807
17687E013503a3813801N269570A0249230J5671362O682348a2979826k8606493
17680d1586319C196313c7152070C7292482A5635922o922205K4713422d3399441
17672b2945797E103806i580007d164427A6789020b6595523D529855K0515447A633338
17663A694404b479692B0474922I377277a4321455l0700933b1495222R415347k1652095
17655c3731970A0652031d726686J470797J481890k6609727C5872283j2687139
$$ plain form
17712 -6075221 -19562578 -419879 14051981 28116385 -6603221 -7090190 -20759719 15624793
17703 13163705 -13848267 -18915634 13074552 -11033354 -17097755 5479417 -23234134
17695 21878763 -19616935 16895108 -40114420 10846645 12826348 -22510318 15754807
17687 5013503 -13813801 -8544231 10249230 25920592 32602940 -12979826 -41586319
17680 -41586319 3196313 -37152070 37292482 15635922 8713717 33427139 -43399441
17672 -22945797 5103806 -9580007 -4164427 16789020 -26595523 4529855 25045302 1633338
17663 1694404 -2479692 20474922 9377277 -14321455 -45022388 -21495222 -12079875 -33731970
17655 -33731970 10652031 -4726686 -3255889 -1773999 -28383726 35872283 23185144
17648B3185144j78925a7283249I680951B519254a3360220d328747B1013544f12570
17639b2876602j586467C3248507D54761J5463401C266675a2312375A0611459J6445573
17631B7057032a3897075j1247194B2482594J2845082j5303638i014270A5069818
17623G95073c1308408N783024b885034B3114592B417777i045293A7819908D421042
17614b6675274k0658194A5221187L0034010a9885751m14019I757465N781888J96849
17606A5736202a5851890C1889552a5142457M827819B9552752r132987a3632007
17598b3029979b177469l5188528B9426122c0089166H552464Q635111e971361A5126528
17589G499930e37584j9908902B9632043e854975B3454987f255508B4895374c3427086
$$ plain form
17648 23185144 23006219 -17283249 9680951 2519254 -13360220 -4328747 21013544 -612570
17639 -22876602 -24463069 33248507 454761 15918162 3266675 -12312375 10611459 27057032
17631 27057032 -13897075 -25144269 22482594 35327676 20024038 -9014270 15069818
17623 795073 -31308408 -25525384 -2885034 23114592 2417777 -9045293 17819908 4421042
17614 -26675274 -47333468 15221187 45255197 -19885751 -20299770 9757465 15539353 15736202
17606 15736202 -15851890 31889552 -15142457 -10314638 29552752 20419765 -13632007
17598 -23029979 -2177469 -37365997 29426122 -30089166 8552464 17187575 -5971361 15126528
17589 7499930 -537584 -20446486 29632043 -5854975 23454987 -6255508 24895374 -33427086
17580D0130253d418116r796178c632770A3296524J7792847I651324K2446047d7466635
17571a4417797L431966A7525759L659274I136911h704149B4301912e6438153e130264
17562A9711848K218987d5670427Q438637a1205761A8466837r002061b8856966
17554d235880C9285134J6371129B6698486b7609911c456020j7735093A3599629
17546a3702977j5806322C8808869e235080B3191371o310160B511744a4194458
17538A7747643i411508a116291j119125A1411170b9346402k7208930b7041563
17530a9931005k2259035D0943068j7554492c8044089A9214161P558780c854555
17522D3415614d1306311i695621A4759154a2682321g91356B3618766J1054678
$$ plain form
17580 40130253 -4418116 -14214294 -3632770 13296524 31089371 9651324 32097371 -47466635
17571 -14417797 -10985831 17525759 21185033 9136911 -8704149 24301912 -56438153 -5130264
17562 19711848 21930835 -45670427 -37231790 -11205761 18466837 9464776 -28856966
17554 -4235880 39285134 55656263 26698486 -27609911 -3456020 -21191113 13599629
17546 -13702977 -29509299 38808869 -5235080 23191371 16881211 2511744 -14194458
17538 17747643 -9411508 -1116291 -2235416 11411170 -29346402 -56555332 -27041563
17530 -19931005 -42190040 40943068 23388576 -38044089 19214161 26772941 -3854555
17522 43415614 -41306311 -9695621 14759154 -12682321 -791356 23618766 34673444
17515C4673444c1319333B0644328c5057395F722005d1293965f239367A828440
17507A2766180i542300B663659L9962213d3315588B1980154a0800890C2193652
17499d3463779a9353709g609649k0758147e804632B080798r94601a9088546M015426
17491a5073120B6705054a4133641D5525295b6672361C698565R55908R692452a8972366
17482d246264C4028897d0595071C2204368e504760j2623523j060546L972090A787134
17473B3318784e969811a369566B4546374G932445c7646037a5905268J917593A9052209
17464A0685272B603971O653068a4593101a309695C532099K3359330A2564329c9467893
17455B858360J6596672F392935K8139229q834409b1813070g710389A6812265g017097
$$ plain form
17515 34673444 -31319333 20644328 -35057395 6722005 -41293965 -6239367 1828440
17507 12766180 -9542300 2663659 42625872 -43315588 21980154 -10800890 32193652
17499 -43463779 -19353709 -7609649 -28367796 -5804632 2080798 1086197 -19088546 -15073120
17491 -15073120 26705054 -14133641 45525295 -26672361 3698565 4654473 14346925 -18972366
17482 -4246264 34028897 -40595071 32204368 -5504760 -18128283 -19188829 -15216739 1787134
17473 23318784 -5969811 -1369566 24546374 7932445 -37646037 -15905268 -13987675 19052209
17464 10685272 2603971 9257039 -14593101 -1309695 3532099 26891429 12564329 -39467893
17455 2858360 19455032 6392935 34532164 25697755 -21813070 -7710389 16812265 -7017097
17446B1506975R131843A4482211c9754237A4073782a0940061k6276711B382467
17438A2246137g726013b166934k6625866g585213c684180A4266671O402914e511350
17429B5004255a7681555A5258644a4983035A4439533n985620K562407a238045
17421A9769267F417941a7293340c605590A8604292C393227M854533h482713l875641
17413a2358354j7180733A6852632g294629c586814B085656J918968c819159l9879700
17405d3698859a8689724j9482426F522021c2131243E540335b980241G3469a2911620
17396a1452935j3904921h128125A3922876a8181112O52786o733177B2447858G373323
17387A2313735m175136L61860e433098k4295110J0569023B6015779e3291075B364977
$$ plain form
17446 21506975 30638818 14482211 -39754237 14073782 -10940061 -37216772 2382467
17438 12246137 -7726013 -2166934 -28792800 -7585213 -3684180 14266671 20669585 -5511350
17429 25004255 -17681555 15258644 -14983035 14439533 8453913 11016320 -1238045
17421 19769267 6417941 -17293340 -3605590 18604292 3393227 8247760 -8482713 -12358354
17413 -12358354 -29539087 16852632 -7294629 -3586814 2085656 4004624 -3819159 -43698859
17405 -43698859 -18689724 -38172150 6522021 -32131243 5540335 -2980241 73469 -12911620
17396 -11452935 -25357856 -8128125 13922876 -18181112 -17528326 -24261503 22447858 7373323
17387 12313735 8138599 8500459 -5433098 -29728208 -19159185 26015779 -53291075 2364977
17378A6025859P293588a2846892N549892H986925J0403572F224887O242471c1259515
17369E0598511A8676356L478716b4648240C7602463A0455044i98324q275984j357975
17361a0632283k7223035j2480456K448545B0706879R374047H873376d8268817
17353A4479686k696662g813878b39032l319401p556712j1009812K135203f319981
17344B2502162P134458a2652770I659595h145238C6340574a367126p323588J739020
17336f951694M77842C3731588b7677635D140890a4513228g81835A6336592a72983
17327b2304510C0987014i60657C849053K2980521j1526531b0561694o610266B6165519
17318g378037m286037j175206e450546q525662K74410q798641E4073595q289759
$$ plain form
17378 16025859 23319447 -12846892 -7297000 8986925 19390497 6224887 12467358 -31259515
17369 50598511 18676356 22155072 -24648240 37602463 10455044 -998324 -9274308 -10632283
17361 -10632283 -37855318 -50335774 -47887229 20706879 30080926 8873376 -48268817
17353 14479686 11783024 -7813878 -239032 -3558433 -11115145 -22124957 -19989754 -6319981
17344 22502162 29636620 -12652770 9659595 -8145238 36340574 -1367126 -8690714 -6951694
17336 -6951694 -6473852 33731588 -27677635 4140890 -14513228 -781835 16336592 -172983
17327 -22304510 30987014 -960657 3849053 26829574 15303043 -20561694 -27171960 26165519
17318 -7378037 -11664074 -12839280 -5450546 -13976208 -13701798 -22500439 54073595 45783836
17310D5783836i523288A6061996M221568n140347K0687252a7970838f081720D0653431
17301E008545K8346131a3705685K549685F417407L9286131j5073204d923127G65365
17292D2094329k0114123b567137m873593j9244168e398753B8470052b653790o564849
17284i218639j5438328E238126Q87630a2744871k8757611B6003756H435857h036508
17275e2819430G865154K7421851j1941243b9506361A4474808a4168646C2060136
17267b2587734a317143k2119346a796945B4928915h666807k7167j0775846A7240382
17258F465238K5862177o669967c654993p869069C1938325a2324329l1734670B7323484
17249b6109581L604182j8400641g349733n693554m8731153A986225K0312638i506528
$$ plain form
17310 45783836 -9523288 16061996 20283564 15143217 35830469 -17970838 -6081720 40653431
17301 5008545 33354676 -13705685 -11156000 6417407 45703538 30630334 -4923127 765365
17292 42094329 21980206 -2567137 -7440730 -26684898 -5398753 28470052 -2653790 -9218639
17284 -9218639 -24656967 5238126 6125756 -12744871 -41502482 26003756 8435857 -8036508
17275 -52819430 7865154 35287005 23345762 -29506361 14474808 -14168646 32060136
17267 -22587734 -1317143 -23436489 -1796945 24928915 -8666807 -8693974 -19469820 17240382
17258 6465238 32327415 25657448 -3654993 -11524062 31938325 -12324329 -44058999 27323484
17249 -26109581 -22505399 -40906040 -7349733 -13043287 -61774440 1986225 22298863 -9506528
17240e850198A1476574Q052573i345637k5136350J7048092E699861a5841535e433023
17231b2719724d870301A7534254O072004b3268603O151920B9412665b7355352
17223a4405820q884732a368665k3787266a923727A6887904g153728k162731A0536039
17214A2158370D340965O790052a3327172j2132584d736353C389946M541281f9030581
17205G249449J9607061a2778771C599170O494428a9561224B4032788p468979K078966
17197A8642775d8012044C6856880q329739q472270b4028263B0767066K5316135
17190D6083201a0435970J135827j7864158C9596903a7633592A458910L0272287
17183C1731197b7515766A361445J4827214N157024H019637L020564N092511F489779
$$ plain form
17240 -5850198 11476574 19529147 -9345637 -34481987 -17433895 5699861 -15841535 -5433023
17231 -22719724 -4870301 17534254 23606258 -23268603 -17116683 29412665 -27355352
17223 -14405820 -23290552 -1368665 -25155931 -1923727 16887904 -7153728 -9316459 10536039
17214 12158370 4340965 11131017 -13327172 -25459756 -4736353 3389946 7931227 -69030581
17205 7249449 26856510 -12778771 3599170 10093598 -19561224 24032788 16563809 18642775
17197 18642775 -48012044 36856880 28527141 20054871 -24028263 20767066 46083201
17190 46083201 -10435970 -9300143 -27164301 39596903 -17633592 1458910 31731197
17183 31731197 -27515766 1361445 16188659 21345683 8019637 11040201 16132712 6489779
17174c453990F0687372j4149339A3659912C890005K9589114G160499A883451c594666
17165H234121L131417a889493C4869470a5224692H650390b45787A5683713F538627
17156E356411g0646323g548687j0383237B3088322B02675K1746338a081756r491848
17148a0573604k0769358B9416349b7275326i357007k9248132a7975181j1597797
17141b9572978J938063A023808a4112054F873384P154214K855612b900731D3236753
17132A1427703K937416A091721b5539915H382739P761088K01344G143662K3718704
17124C0862366b367950n494386A8750909N21086j983003F468493J968933b5122470
17115I090686a202278B0348462i05635r409414A9575445f205471B9167840d589373
$$ plain form
17174 -3453990 60687372 46538033 13659912 3890005 33479119 7160499 1883451 -3594666
17165 8234121 11365538 -1889493 34869470 -15224692 8650390 -245787 15683713 6538627
17156 5356411 -70646323 -7548687 -17931924 23088322 202675 21949013 -1081756 -10573604
17148 -10573604 -31342962 29416349 -27275326 -9357007 -38605139 -17975181 -29572978
17141 -29572978 -27634915 1023808 -14112054 6873384 14027598 16883210 -2900731 43236753
17132 11427703 14365119 1091721 -25539915 8382739 16143827 16345171 7143662 30862366
17124 30862366 -2367950 -7862336 18750909 19271995 17288992 6468493 8437426 -25122470
17115 9090686 -1202278 20348462 -905635 -10315049 19575445 -6205471 29167840 -4589373
17106b3929963L39303J115495A9346070G903539N958544A167300J0730103b2546658
17097g443502j2088530f758459A5817908A64784K4260041c315779N98927D6213
17088A2347622a8775943A1195224J3326220d340462A2015675d4652148e454544
17080A5734468N95009a8521467B0247390J5202789N152748b600990B534757M6817144
17072D9351901c365005k7074543B8432425G797699J5310936K504745Q273102g380893
17063a570391m2431772F312509c9733465A1174615a4036283B1209012q557399
17056A2651613e154969B803934d395389k3682241H669684M97291m85596a3447104
17047a4904950A3127971N021610c6903172A4148444a1740155L733191j268675
$$ plain form
17106 -23929963 -23590660 -22475165 19346070 7903539 13862083 1167300 11897403 -22546658
17097 -7443502 -19532032 -6758459 15817908 164784 24424825 -3315779 -2716852 46213
17088 12347622 -18775943 11195224 24521444 -4340462 12015675 -44652148 -5454544
17080 15734468 16329477 -18521467 20247390 35450179 40602927 -2600990 2534757 49351901
17072 49351901 -3365005 -30439548 28432425 7797699 23108635 25613380 33886482 -7380893
17063 -1570391 -44002163 6312509 -39733465 11174615 -14036283 21209012 12651613
17056 12651613 -5154969 2803934 -4395389 -28077630 8669684 9166975 8681379 -13447104
17047 -14904950 13127971 18149581 -36903172 14148444 -11740155 -8006964 -9275639
17040i275639A8106241e7182D200817J4593363h120407j8266516B6702920j0217142
17032A6485778a6398383A2226972e759125D979754J9149796c830351k3417517
17025b7247868g254346B5297642b5172306K547417d518344k8105924d56205D193464
17016F698868a5762097d559571K74028n740103m492950B995767f843260j3137853
17008a9981113k48817A5089391D017873b278740l9399469a3328206e638860B0104026
16999B1564648l983482o903007m974356M9174214a0068206I365437M71938K6163205
16991C6000580c0173079D529401h00093A1626475a4677849B4776062a2082387
16983A3538406e039268I659144Q76129b442655j5179730H631849c7539965A5204385
$$ plain form
17040 -9275639 18106241 -57182 4200817 18794180 -8120407 -26386923 26702920 16485778
17032 16485778 -16398383 12226972 -5759125 4979754 24129550 -3830351 -27247868
17025 -27247868 -7254346 25297642 -25172306 -22624889 -4518344 -32624268 -456205 4193464
17016 6698868 -15762097 -4559571 -4285543 -10025646 -14518596 2995767 -6843260 -19981113
17008 -19981113 -20229930 15089391 4017873 -2278740 -41678209 -13328206 -5638860 20104026
16999 21564648 17581166 10678159 5703803 54878017 -10068206 9365437 9837375 36000580
16991 36000580 -30173079 4529401 -800093 11626475 -14677849 24776062 -12082387
16983 13538406 -5039268 9659144 10535273 -2442655 -17622385 8631849 -37539965 15204385
16974B716702J9823841A710801K445587J4400721a1715901A32583d384349j1543271
16966a5927620C0332272j0293672b0152297e78530B1356642b8964757B549680
16958B130834e5800940B3477798B781908c7315375R395713C1444012j2177851
16951A9266161f1013891A4216294a6829187j6698726F72566J5774088a2626576
16943F877713A144090R802811K714992c5565707A7201106G672710b065722D4166407
16934b246159C372173L1761290b291873A8654770L338617a8134544p546012F685986
16925e467272q873170p156613G819714M565848k223036n036641N446757B940669
16916D110063J7528131c6119320F331260a6004452E1307105a3192015B6758651
$$ plain form
16974 2716702 22540543 1710801 4156388 18557109 -11715901 132583 -4384349 -15927620
16966 -15927620 30332272 20038600 -20152297 -578530 21356642 -28964757 2549680
16958 2130834 -55800940 23477798 2781908 -37315375 -27919662 31444012 19266161
16951 19266161 -61013891 14216294 -16829187 -33527913 672566 16446654 -12626576
16943 6877713 1144090 10946901 13661893 -35565707 17201106 7672710 -2065722 44166407
16934 -2246159 3372173 35133463 -2291873 18654770 21993387 -18134544 -25680556 6685986
16925 -5467272 -14340442 -21497055 7819714 12385562 10162526 5125885 10572642 2940669
16916 4110063 21638194 -36119320 6331260 -16004452 51307105 -13192015 26758651
16908b1554512m67585A7932563b56823A0515431f812833A0554071n95226C373672
16899A5055227J4058012L577009c7091406C5908733A6396874h404444C555286
16891B3552442q428827A740977J7308833H411563B99797K1401472B721514a8000669
16882A6129265D426550L0629495b3230036a0173065o979103d08605m692725j6343883
16874b1445213D0768555b4162248B4459448i502266A3627067a0652772B6926725
16866a4222321A1343803g644981c180850A9427038P239965H968927a6581709E255987
16857A1401217c63651E404854J7766127R685287a0498554B2849757A621590c5458284
16848b280561B331300a564871k3317149a2041018A3635663J1620060e50943j4385777
$$ plain form
16908 -21554512 -22022097 17932563 -256823 10515431 -6812833 10554071 9958845 3373672
16899 15055227 29113239 32690248 -37091406 35908733 16396874 -8404444 3555286
16891 23552442 15123615 1740977 19049810 8411563 299797 21701269 2721514 -18000669
16882 16129265 4426550 35056045 -23230036 -10173065 -17152168 -408605 -5101330 -21445213
16874 -21445213 40768555 -24162248 24459448 -9502266 13627067 -10652772 26926725
16866 -14222321 11343803 -7644981 -3180850 19427038 26667003 8968927 -16581709 5255987
16857 11401217 -363651 5404854 23170981 32856268 -10498554 22849757 1621590 -35458284
16848 -2280561 2331300 -1564871 -24882020 -12041018 13635663 25255723 -550943 -14936720
16840a4936720b027401l6645507B218097c2644101B2510893b524509A891602b1648385
16831f113936J726534A3583264b1439019R794480I367751J5544546A0107713J38710
16823A0246423L4258218b313008A0601577P165949L3612194h93345j274272G2690
16814C2548102A3088464a1366466k2982510R394726A1826875k433505j967859
16807G425511k172018g686792b639728j4137548L536710B4444673G372080d5976293
16798b7156516o876343A658657I7044J4786118b0087309D094872b644296B8470720
16789b660831j7433124A3545531J375444f507696k3132268C6807177A614369d152758
16780b2286376N445303A9681789K231515b2883184B0554297J920923a4397727
$$ plain form
16840 -14936720 -2027401 -38672908 2218097 -32644101 22510893 -2524509 1891602 -21648385
16831 -6113936 -4387402 13583264 -21439019 -11644539 9367751 24912297 10107713 10246423
16823 10246423 44504641 -2313008 10601577 17767526 51379720 -893345 -2167617 72690
16814 32548102 13088464 -11366466 -34348976 -24954250 11826875 9393370 7425511
16807 7425511 5253493 -7686792 -2639728 -16777276 -13240566 24444673 7372080 -45976293
16798 -27156516 -34032859 1658657 97044 14883162 -20087309 4094872 -2644296 28470720
16789 -2660831 -20093955 13545531 14920975 -6507696 -29639964 36807177 1614369 -4152758
16780 -22286376 -16841073 19681789 21913304 -22883184 20554297 22475220 -14397727
16772d2190174a1814097A4810499B143625a5582446N171849B2006571K7993304
16765D9999875A8785740g718073k0383425e817642D796849J2265812c3286881
16757a0683799A1504873a4093583F1997075b6809272H302942d3936975C618730
16749a9816164f841747C8702323d27731m299351j8129819F945029f70758A0800430
16740a3914891A2143166K856889d030880C798663c513629k4863605J2811905B284061
16731c1675829J5714198M941904B9756489l49440a746840k6007943N073328A07294
16722G480834Q021479D301094b453959l2249170B036483d482379p575320B6810057
16713C137333c8805698B525293J1607439R071134J2529660A4097442J513796b0104120
$$ plain form
16772 -42190174 -11814097 14810499 2143625 -15582446 -10410597 22006571 49999875
16765 49999875 18785740 -7718073 -28101498 -5817642 4796849 17062661 -33286881
16757 -10683799 11504873 -14093583 61997075 -26809272 8302942 -43936975 3618730
16749 -19816164 -6841747 38702323 -427731 -4727082 -22856901 6945029 -670758 10800430
16740 -13914891 12143166 15000055 -4030880 3798663 -3513629 -28377234 -15565329 2284061
16731 -31675829 -15961631 -11019727 29756489 29407049 -1746840 -27754783 -22681455 107294
16722 7480834 15502313 4301094 -2453959 -34703129 2036483 -4482379 -12057699 26810057
16713 3137333 -38805698 2525293 14132732 23203866 35733526 14097442 15611238 -20104120
16704A0745997b571230n1221873A9934473n719910c1111527B8030733d1751893
16696a1367332e348036C9658877A6676798g869835r68139H200400O002416A597705
16687b6590320f133264J653981B3606586F066186a6538600j0764775L113923k4995501
16679d9184953J7839947C071946b1638347c27777A7489963b6290442A5757025
16671a6106554m578998B0187753a731325r055440B1373142A070951a6111011j7178409
16663c3289420i18590A5195995P208062C36230J2351118b915708p877024R91581
16655i801151A0792984k245620J2294795h619353J23806A7990756a9740886j1518966
16647c1259852B5664361a0123360G73324N709668i798114G6632059o417095K0646813
$$ plain form
16704 10745997 -2571230 -53793103 19934473 14214563 -31111527 28030733 -41751893
16696 -11367332 -5348036 39658877 16676798 -7869835 -8837974 8200400 14202816 1597705
16687 -26590320 -6133264 -4479283 23606586 6066186 -16538600 -27303375 -24189452 -49184953
16679 -49184953 -31345006 3071946 -21638347 -327777 17489963 -26290442 15757025
16671 -16106554 -20685552 20187753 -1731325 -10786765 21373142 1070951 -16111011 -33289420
16663 -33289420 -918590 15195995 22404057 336230 12687348 -2915708 -10792732 -9801151
16655 -9801151 10792984 8547364 20842159 -8619353 -8495547 17990756 -19740886 -31259852
16647 -31259852 25664361 -10123360 773324 6482992 -9798114 76632059 70214964 90861777
16639I0861777J0475265J5952214R7550178L6694087K5859041N2350762J6312146
16632C46055470l2743550k4640198o9282561k2978335n8461767m6140645J7269318
16625A09077732k8670881J9815323C8427879O500354g332943A0684360M9722955
16618F0407315j4538607i315047C5782810j3498590B897753K8053104j0483922
16611B0466935J224625J395649K6725227A8831228L519852j326277K4750451C588414
16602C6981023b8818487C7745169N850383f188558A2103842K7214397A3718023
16594B6448184e985183a7648A210696a5850678A6669015n697838c813592E2207727
16585C0945132d797055H477803a0839492A997154J8702353b362562m8914878P604265
$$ plain form
16639 90861777 101337042 117289256 214839434 251533521 277392562 329743324 346055470
16632 346055470 313311920 288671722 219389161 196410826 137949059 91808414 109077732
16625 109077732 80406851 100222174 38427879 44928233 -7332943 10684360 60407315
16618 60407315 45868708 -9315047 35782810 22284220 2897753 30950857 20466935
16611 20466935 21691560 23087209 49812436 18831228 22351080 21024803 45775254 3588414
16602 36981023 -28818487 37745169 43595552 -6188558 12103842 39318239 13718023
16594 26448184 -5985183 -17648 1210696 -15850678 16669015 10971177 -3813592 52207727
16585 30945132 -4797055 8477803 -10839492 1997154 20699507 -2362562 -51277440 -43673175
16577d3673175B1123565J8289713A7096750c6939385a6127397C0861189j2539835
16570A8321354a3060805C480242L46439L2000608b9649599B8694365j4008846
16563A4685519J1890013F840948J400142k202121J8294578N604277b4269935C0167406
16554E5536312A5270702o540854g537822l4135161A9470665m399710J2426071
16547B7497026k529547a1536989C847773a2987218B6857949a8478550g811994
16539a8024601A4790410b9297161B4840535n904010m953329C844019K8619011
16532C2463030j4259418K6689933h905824k876408m677341j2686427C4087899
16524b2569496G285258J284008a3372907A5029462h5463j0937463q099461B7609327
$$ plain form
16577 -43673175 21123565 39413278 17096750 -36939385 -16127397 30861189 18321354
16570 18321354 -13060805 3480242 3826681 35827289 -29649599 28694365 14685519
16563 14685519 26575532 6840948 8241090 6038969 24333547 29937824 -24269935 30167406
16554 55536312 15270702 8729848 -7537822 -41672983 19470665 15070955 27497026
16547 27497026 24967479 -11536989 3847773 -12987218 26857949 -18478550 -7811994
16539 -18024601 14790410 -29297161 24840535 18936525 13983196 3844019 32463030
16532 32463030 18203612 44893545 -8905824 -11782232 -16459573 -29146000 34087899
16524 -22569496 7285258 8569266 -13372907 15029462 -85463 -11022926 -19122387 27609327
16515a5997504j2886236i037544H413081a2542277F282077b3474060A0334030
16507A6781295J1681023d204391l427633L8875A0301465a041979C1061388j1439584
16499A9621804f771862I422785C848206M8580809k5547861c2455727i528721a822915
16490c0532H305130c1310127i458374j0510222H661137K6189277d187876F65506
16481g649542l648259A6852816p908003c4539761B6588494c438269H665942a1507958
16472c791911j5721374B6756450i480354A067658c1441494B8436999B499203J1418589
16464A3917792b5265460C7024837A4053811b3158239O322225C067815M5456285
16457D8524100b2111863B3490481b483131A4306425D211908h736158A2447731
$$ plain form
16515 -15997504 -28883740 -9037544 8413081 -12542277 6282077 -23474060 10334030
16507 16781295 28462318 -4204391 -7632024 -7593149 10301465 -1041979 31061388 19621804
16499 19621804 -6771862 9422785 3848206 52429015 26881154 -32455727 -9528721 -1822915
16490 -30532 8305130 -31310127 -9458374 -19968596 8661137 34850414 -4187876 665506
16481 -7649542 -11297801 16852816 8944813 -34539761 26588494 -3438269 8665942 -11507958
16472 -3791911 -19513285 26756450 -9480354 1067658 -31441494 28436999 2499203 13917792
16464 13917792 -25265460 37024837 14053811 -23158239 -16836014 3067815 48524100
16457 48524100 -22111863 23490481 -2483131 14306425 4211908 -8736158 12447731
16449C4996794a9236949C5505531i515306A7963393d875192n431383C0885923
16441I78337K4384301Q476637J3369154F645257g876419G820312a7384370B444204
16432B6419149a5247250k8130048E718545a2073150D4111312b1247061c224823
16424b274057p111879j3843316B9467197P044828A4908139J8054220b642021G388827
16415a167823H145910g964448H94848K3757117c1599858D2273090a0369651j162073
16407a1531724D302553q91549L6291763j5542631C430827c033872k0000782C9873049
16398b4696495A2387823A010175L7730795f714464B0237404a9734534k4371671
16391d4106205B6095242c7004689i507041D445424P607507J3873112a1352121
$$ plain form
16449 34996794 -19236949 35505531 -9515306 17963393 -4875192 -10306575 30885923
16441 978337 25362638 33839275 47208429 6645257 -7876419 7820312 -17384370 2444204
16432 26419149 -15247250 -43377298 5718545 -12073150 44111312 -21247061 -3224823
16424 -2274057 -9385936 -23229252 29467197 36512025 14908139 32962359 -2642021 7388827
16415 -1167823 8145910 -7964448 894848 24651965 -31599858 42273090 -10369651 -11531724
16407 -11531724 4302553 3411004 39702767 24160136 3430827 -3033872 -23034654 39873049
16398 -24696495 12387823 1010175 38740970 -6714464 20237404 -19734534 -44106205
16391 -44106205 26095242 -37004689 -9507041 4445424 12052931 25926043 -11352121
16383A6470989f774675k37534m8133062A7938606d951225H670084c687328j8689875
16375b2377203A5134320a0564779C3469663g667707p63703K754382I285049b302537
16366B6841712a2117674n653996A0698046K4919314F35437L8842263a1475063
16358a3417381j3282276a1194415M02685G725228a3446240C403332K5645279a0585734
16349c1218688H665659L0012592A5758965c6503671A8398133c9805169A270743
16341H993488J901131b0180873a970588B12965J0590944b4633004a0020122l797981
16333a3818103l5988039A9338610b3680571D9474841k2373829o054265N026790
16326B6073537a2719262N141866G799955L653755b5125893B1583050N559353A1889900
$$ plain form
16383 16470989 -6774675 -7012209 -55145271 17938606 -4951225 8670084 -3687328 -22377203
16375 -22377203 15134320 -10564779 33469663 -7667707 -8431410 -5677028 9285049 -2302537
16366 26841712 -12117674 -17771670 10698046 35617360 635437 39477700 -11475063
16358 -13417381 -26699657 -11194415 -10791730 7725228 -13446240 3403332 29048611 -10585734
16349 -31218688 8665659 38678251 15758965 -36503671 18398133 -39805169 1270743
16341 8993488 10894619 -20180873 -1970588 212965 10803909 -24633004 -10020122 -13818103
16333 -13818103 -49806142 19338610 -23680571 49474841 27101012 21046747 26073537
16326 26073537 -12719262 -7577396 7799955 11453710 -25125893 21583050 27142403 11889900
16317G3629127A0858906J7503661f949427l252246B4985205j2043104K1747905
16310C4690006c809749G96700L9236947F813754J9833372j0814561a0890849G649063
16301C0113380E187738c0588453f215438B864118a2405836C5819494a4653890
16293C252648N3485356I151593a5413080B1386783j0429054L234594b9196013
16285F468221K0575415J0465459B340999a3915665K662115k3064412K992588N620200
16277b5705174D380850a2643967f269304m051788m375206G353471J7870260a4416122
16268A3966549l280277P500459l65439K924658g335372L512695j322280B0266457
16259A6014259e728255A3301962b452172j1731694p05496C9457863j7881578d303811
$$ plain form
16317 73629127 10858906 28362567 -6949427 -10201673 24985205 12942101 34690006
16310 34690006 -3809749 796700 40033647 6813754 26647126 15832565 -10890849 7649063
16301 30113380 5187738 -30588453 -6215438 2864118 -12405836 35819494 -14653890
16293 3252648 56738004 9151593 -15413080 21386783 10957729 14192323 -29196013
16285 6468221 27043636 37509095 2340999 -13915665 -11253550 -34317962 -31325374 -25705174
16277 -25705174 4380850 -12643967 -6269304 -10321092 -14696298 7353471 25223731 -14416122
16268 13966549 10686272 18186731 17821292 20745950 -7335372 -3822677 -5144957 20266457
16259 16014259 -5728255 13301962 -2452172 -14183866 -14889362 39457863 21576285 -4303811
16250i596194A9396516H089144a8469953Q54051E257292K8879527A6673915J0479402
16242B7153317j0736290F791617K604971K4224179E913520b1590024b313535k080536
16234d394071a519068C3226694A5198964b5211589B3579305C015400a7124515
16226A0806463c4665191k0146308H322351a9784066K58882A076408h059219D8790099
16217a1076588B1937394a2230732B5085835J8621428E693215K5480167j0981688
16210B0191694C049281L2374989h45001j0336943l880893q676107A79441L3622409
16202C3801850b0819436F1897282A5057777A857147h987376a416408j7510665
16195a8927073A92207O5390N526998a969829E869794L770470J4318104j1098956
$$ plain form
16250 -9596194 19396516 8089144 -18469953 -17615902 5257292 34136819 16673915 27153317
16242 27153317 16417027 6791617 9396588 33620767 5913520 -21590024 -2313535 -4394071
16234 -4394071 -1519068 33226694 15198964 -25211589 23579305 3015400 -17124515
16226 10806463 -34665191 -54811499 8322351 -19784066 -19525184 1076408 -8059219 48790099
16217 -11076588 21937394 -12230732 25085835 43707263 5693215 31173382 20191694
16210 20191694 3049281 35424270 -845001 -11181944 -15062837 -23738944 179441 33801850
16202 33801850 -20819436 61897282 15057777 1857147 -8987376 -1416408 -18927073
16195 -18927073 192207 257597 5784595 -1969829 5869794 9640264 23958368 12859412
16187A2859412J0294340p45645a4464838B3529235a3952079B6168238C991842
16179d1415300A5290318B871375J2445121l705920H46071e71387C774720f982408
16170E518041K7256171a1771679K881502E771382c960593A2394655R673356b8745452
16161E160922K304576B179202a1577698A0739457C744631J3000154o769665B83548
16152a4473274G773284M826144i110400D3048988e428532m70761G689757b2433260
16143f016082I665192K776762l161244Q207984c4721814E1627469c4190101B0137971
16134A4108627J9940148i039597H4070Q141g400193n384193N522468C495145j480685
16125B014460i149509B9100534a1954654d219798j6596646A3397997d1551673
$$ plain form
16187 12859412 23153752 22408107 -14464838 23529235 -13952079 26168238 3991842
16179 -41415300 15290318 2871375 15316496 11610576 846071 -571387 3774720 -6982408
16170 5518041 32774212 -11771679 -8890177 5771382 -3960593 12394655 22068011 -28745452
16161 5160922 7465498 2179202 -11577698 10739457 3744631 16744785 9975120 283548
16152 -14473274 7773284 12599428 -9110400 43048988 -5428532 -5899293 7689757 -22433260
16143 -6016082 9665192 12441954 9280710 17488694 -34721814 51627469 -34190101 20137971
16134 14108627 34048775 -9039597 84070 92211 -7400193 -12784386 -7261918 3495145 2014460
16125 2014460 -9149509 29100534 -11954654 -4219798 -20816444 13397997 -41551673
16117i323907A6681114J874335c842412k5308566B2858376e864376j9861013r136547
16109c4861936A7070321e811903B2141078a4841732d889392j2745604l3533433
16102e1168429a5090548N244075k021790C226574Q48444b4687226A5207338e401234
16093D581898M6506480c3162915h84235j812959H509520J9894134C015704c3593264
16084b3361222J1340804A8300655f67730A3979801m69490A174742J5506641R664096
16076B6345479j999931b7851952J162978a0836978C5107138c282125E4942071
16068C3250948d1798666F3830706e137688A0256394K7143700a9898610j3306513
16061c3205123E007063L1808179j2885596a3167301A014674J2051648L2809784
$$ plain form
16117 -9323907 16681114 18555449 -3842412 -29150978 22858376 -5864376 -25725389 -34861936
16109 -34861936 17070321 -5811903 22141078 -14841732 -4889392 -17634996 -51168429
16102 -51168429 -15090548 -9846473 -11868263 3226574 4075018 -24687226 15207338 -5401234
16093 4581898 51088378 -33162915 -884235 -2697194 8509520 28403654 3015704 -33593264
16084 -23361222 -12020418 18300655 -667730 13979801 13510311 1174742 16681383 26345479
16076 26345479 24345548 -27851952 -26688974 -10836978 35107138 -3282125 54942071
16068 33250948 -41798666 63830706 -5137688 10256394 37400094 -19898610 -33205123
16061 -33205123 5007063 36815242 23929646 -13167301 1014674 13066322 45876106
16054D5876106b0307326C21209a203483A8423778D370020e912197k9663226d643023
16045A1979747m876749b418768j6589022C6593513I783979L621726n949552h519213
16036B0476498D2171K3370669d7862549B3447798D512415K13373b4705660d548340
16027g070324A9226998k806885o424862c1554398L878530D932843M3958942e376315
16018B3592502G996307h399546A6802442j699705j000405J4846357g39764j6111391
16010a6851155l992766k524383B810266K3538465q250625a1512003H399980L6534976
16002D4934956j0749049c8654108C41501c496504A574523K6731382E79810a2545709
15993I741431a053161C1654826b4139344k93149D1106137A9244759b3118463A8607872
$$ plain form
16054 45876106 -20307326 321209 -1203483 18423778 4370020 -5912197 -35575423 -4643023
16045 11979747 7102998 -2418768 -19007790 36593513 9783979 13405705 7456153 -8519213
16036 20476498 42171 23412840 -47862549 23447798 4512415 4725788 -24705660 -4548340
16027 -7070324 19226998 16420113 9995251 -31554398 -27675868 4932843 48891785 -5376315
16018 23592502 7996307 -8399546 16802442 15102737 14102332 28948689 -739764 -16851155
16010 -16851155 -20843921 -23368304 2810266 26348731 18098106 -11512003 8399980 44934956
16002 44934956 34185907 -38654108 341501 -3496504 1574523 28305905 579810 -12545709
15993 9741431 -1053161 31654826 -24139344 -24432493 41106137 19244759 -23118463 18607872
15984A1203062J0659008r056061c483100A4108554J1552079r609606l42854L4514257
15976E0222430f258345c077923B566609O079285c4983715B9628600R788648a4864155
15967E456817i549713j8968155F4698455d5812248B1230543a6615676e650730
15959B4076765J3292347m469625b7038251E280452h012862j3843052B0068139
15951A0218348a5883367D966787a7197017k1171334a4591625A6813358p233536
15944I579822b7011034J1128467B4549454A1160793J4125258j0159598o801677
15937H324776K8245012b3736064A9578682a7241913B0131914g834539D204458
15929G865130a611413C3181602I123439h41894j5676861e76272G093390A032425
$$ plain form
15984 11203062 21862070 12806009 -3483100 14108554 25660633 16051027 15708173 50222430
15976 50222430 -6258345 -3077923 2566609 8645894 -34983715 29628600 39417248 -14864155
15967 5456817 -9549713 -28517868 64698455 -45812248 21230543 -16615676 -5650730
15959 24076765 37369112 32899487 -27038251 5280452 -8012862 -21855914 20068139
15951 10218348 -15883367 4966787 -17197017 -38368351 -14591625 16813358 9579822
15944 9579822 -27011034 -15882567 24549454 11160793 25286051 15126453 8324776
15937 8324776 36569788 -23736064 19578682 -17241913 20131914 -7834539 4204458
15929 7865130 -1611413 33181602 9123439 -841894 -16518755 -576272 7093390 1032425
15920B7302945b1133928B3090249c243632q27949I523717i360848D0665331e5812045
15911A1285851C317953c3393653a2394566A8347233d014858l0236985E777201
15903b251683B9562367j1784754k011186n978367e966791Q47756l5897734a6816985
15894B7783465e322692C427870a8748617A7863060h107519E997910a2779992I133675
15885C0207006a7661038B2300974F688823K4331567e7893950B6461183K4386612
15878E0847795l268755d275906E2840516a4055473f259864A8388148M570739a2602614
15869C7224116a0654363q200728i311283I532046L2674489h764192A6652441i84468
15860b5019802A2864699a0038022A9329057Q170152h428436l6951761D4382867
$$ plain form
15920 27302945 -21133928 23090249 -3243632 -4071581 9523717 -9360848 40665331 -55812045
15911 11285851 3317953 -33393653 -12394566 18347233 -4014858 -34251843 5777201
15903 -2251683 29562367 17777613 15766427 9788060 -5966791 -5119035 -41016769 -16816985
15894 27783465 -5322692 3427870 -18748617 17863060 -8107519 5997910 -12779992 9133675
15885 30207006 -17661038 22300974 6688823 31020390 -57893950 26461183 50847795
15878 50847795 47579040 -4275906 52840516 -14055473 -6259864 18388148 22958887 -12602614
15869 37224116 -10654363 -18855091 -9311283 9532046 42206535 -8764192 16652441 -984468
15860 -25019802 12864699 -10038022 19329057 27499209 -8428436 -45380197 44382867
15852C3779146a663431d34605m391975j8071949G170097K4717816G847425K2616580
15844C0464005a4164157F636973N72591b2194321l553422B5096792K787605a2265515
15835A5316664L1394073A4218429C538668c3162633A5521038f601094E848770
15827D8194979c760321A4326843J9657461c2286773f53655k16825l4335574J6886710
15819a8319344o390601A1712669D037124K88052J023517K4146349j1865721n121250
15811A2508071Q683360a5988559k734687o584345A2885912a8478588h335797i47793
15802a3719103J657483m529510L561927e804931I816800m221255a4223j6408825
15794a6423048k2274d152652j2879500D259592a5623735D179722c9692400J2137624
$$ plain form
15852 33779146 -1663431 -434605 -4826580 -22898529 7170097 31887913 7847425 30464005
15844 30464005 -14164157 6636973 7209564 -22194321 -25747743 25096792 27884397 -12265515
15835 15316664 46710737 14218429 3538668 -33162633 15521038 -6601094 5848770
15827 48194979 -3760321 14326843 33984304 -32286773 -653655 -870480 -35206054 -18319344
15819 -18319344 -24709945 11712669 4037124 4325176 5348693 29495042 17629321 12508071
15811 12508071 21191431 -15988559 -18723246 -25307591 12885912 -18478588 -8335797 -947793
15802 -13719103 -12061620 -16591130 -13029203 -5804931 9816800 5595545 -14223 -16423048
15794 -16423048 -16445322 -4152652 -17032152 4259592 -15623735 4179722 -39692400 -27554776
15786b7554776n173725g541099b908317j1708314A0230733K443426a5412298A1469892
15777G821045j935286K153792l068026i518625A2037218N00314l118890h359084
15768A3167240B213708K6818461a1335455j4925529B1224107b3150839a0006700
15760a4312362j9424137a0843089D5795218j5861653a0327549m595811f405502
15752g578292H879554J1426615K0987615C169499K2443464b9390314A4580896
15744A0529193N009626L0494934k1656389r409028a4302841I40237O047662r81462
15736F006437K8894203I379367l420526d35414k4885793B6799481E654293c1089093
15727A8702686b592002B6633980G391881J7917293a634478C0357969b74365m0241073
$$ plain form
15786 -27554776 -32728501 -7541099 -2908317 -14616631 10230733 12674159 -15412298 11469892
15777 7821045 5885759 8039551 4971525 -9518625 12037218 12537532 9418642 -8359084
15768 13167240 2213708 29032169 -11335455 -26260984 21224107 -23150839 -10006700
15760 -14312362 -33736499 -10843089 45795218 29933565 -10327549 -14923360 -6405502
15752 -7578292 8879554 20306169 41293784 3169499 25612963 -29390314 14580896
15744 10529193 15538819 46033753 24377364 14968336 -14302841 940237 6987899 6006437
15736 6006437 34900640 9379367 5958841 -435414 -25321207 26799481 5654293 -31089093
15727 18702686 -2592002 26633980 7391881 25309174 -1634478 30357969 -274365 -40515438
15719d0515438C9162820n649345b5429293A3649260L179869h07221E377279J1470940
15711A6848219H322416b257987k1247441i094914k832109p793454A5367090b6514332
15702D3151501D406851J6159779b1160293i788205c476070j3977167B9368352
15694D672392k174113d1450696G534320J4779911G253168N311692n955723a1577397
15685d485819B7040906q312105d41442A7762097I27111J0575972P786473a4299291
15676f147859j1028019d579837A678280e053777j7506887C3578576m039236N178770
15668C4718110f684112p491299D0223683a6296693A5681109a5465637e70194q64610
15660a434804B824858a6755454C369537a1091701G507716c698152H583599a7605858
$$ plain form
15719 -40515438 39162820 33513475 -25429293 13649260 16829129 -807221 5377279 16848219
15711 16848219 8322416 -2257987 -23505428 -9094914 -11927023 -19720477 15367090 -26514332
15702 43151501 4406851 20566630 -21160293 -9788205 -3476070 -17453237 29368352
15694 4672392 2498279 -41450696 7534320 22314231 7253168 12564860 6609137 -11577397
15685 -4485819 27040906 18728801 -441442 17762097 927111 11503083 19289556 -14299291
15676 -6147859 -17175878 -4579837 1678280 -5053777 -22560664 33578576 29539340 34718110
15668 34718110 -6684112 -14175411 40223683 -16296693 15681109 -15465637 -570194 -1434804
15660 -1434804 2824858 -16755454 3369537 -11091701 7507716 -3698152 8583599 -17605858
15651G867401k706563J5038046G031734j805279O561761J3028056b8825319b801467
15642c1356507A7667319B856075a4031849j365940L637497d991801J302131A9615774
15633A1791167K2927639a2205624C9496307j4239298J0356925j2497247g563799
15625C1248543k756140h54995m072834C1362810a0190856j0667985B9965506A3103149
15616g223641J922618j1775170A2041775a470659j7844077C519830N897196R583831
15608A9000857k386693J2019611N826625A800820L5337156H809150J7605982K5689147
15600E2104279A944616K8493806d6045666E698305J4724694a7374708A1822734
15592c3901001D7922682I587535h425030o49980j3952150a0158543d657365D369684
$$ plain form
15651 7867401 5160838 20198884 7031734 5226455 11788216 24816272 -28825319 -2801467
15642 -31356507 17667319 2856075 -14031849 -15397789 -11760292 -4991801 -3689670 19615774
15633 11791167 34718806 -12205624 39496307 25257009 35613934 23116687 -7563799
15625 31248543 28492403 -854995 -4927829 31362810 -10190856 -20858841 29965506 13103149
15616 -7223641 -5301023 -17076193 12041775 -1470659 -19314736 3519830 9417026 19000857
15608 19000857 16614164 28633775 34460400 1800820 37137976 8809150 26415132 52104279
15600 52104279 1944616 30438422 -46045666 5698305 20422999 -17374708 11822734
15592 -33901001 47922682 9587535 -8425030 -9075010 -23027160 -10158543 -4657365 4369684
15583B1770775D725251a1133345F666338C005463N9786810k8572969h79834B2390633
15574c9708108A2169486j335322R72127m780189a3103418j4146316D4964110b282005
15565b4077029j8769046A1456531b8370581h558172a593998H106173g380622j4284043
15557b1664665k2154961B0326901G713648b9288667H543479J3127963g200371
15549B1247912J6475113G302033J3269274I091298C25269K2477288a1754926B9658950
15540C4375521e3362780a4027564j146140K620273f060003B6581201A2485136
15532B3786350e326134A2972161o171152a7594036M581297L938388c544459a208668
15523b101828j421243l3851291B0917361g166088l313957K057679D2740289a7521383
$$ plain form
15583 21770775 4725251 -11133345 6666338 3005463 62792273 34219304 -879834 22390633
15574 -39708108 12169486 10834164 11806291 7026102 -13103418 -27249734 44964110 -2282005
15565 -24077029 -42846075 11456531 -28370581 -8558172 -1593998 8106173 -7380622 -21664665
15557 -21664665 -43819626 20326901 7713648 -29288667 8543479 21671442 -7200371
15549 21247912 37723025 7302033 20571307 9091298 325269 22802557 -11754926 29658950
15540 34375521 -53362780 -14027564 -15173704 -12553431 -6060003 26581201 12485136
15532 23786350 -5326134 12972161 6801009 -17594036 -13012739 -9074351 -3544459 -1208668
15523 -2101828 -3523071 -37374362 20917361 -7166088 -10480045 -8422366 42740289 -17521383
15514D355182N878290L1288248b7914076m809012C0029329c0636415A2880484
15506g550376b202824I258752I89289a1568101q670116C365252P863393B752975
15497a0124960d408200A0057265B067729a0317160o12819D511079P694859B089908
15488A3147169Q289253e878089C5815460r142983j786575B361584b8044451h027794
15479C2869883G225199J9132521a1772879l5879121B8347250j3803597e8856898
15471B9140176A2243963D028714K8356628a9415290h851414B7802568j045009
15464B6757559D679518L422822D035353L8153352f351596j0395773D7821025H51261
15455a4998702b152885D941668d5476178a4454544K888123k2873913a1350126
$$ plain form
15514 4355182 10233472 41521720 -27914076 -32723088 30029329 -30636415 12880484
15506 -7550376 -2202824 9258752 989289 -11568101 -20238217 3365252 11228645 2752975
15497 -10124960 -4408200 10057265 2067729 -10317160 -10929979 4511079 12205938 2089908
15488 13147169 21436422 -5878089 35815460 26672477 24885902 2361584 -28044451 -8027794
15479 32869883 7225199 26357720 -11772879 -47652000 28347250 14543653 -58856898
15471 29140176 12243963 4028714 32385342 -19415290 -8851414 27802568 26757559
15464 26757559 4679518 8102340 4035353 42188705 -6351596 -16747369 47821025 851261
15455 -14998702 -2152885 4941668 -45476178 -14454544 -11566421 -34440334 -11350126
15447A0307482c3064258a5582908P164259d92941A7295835Q061331d228955J352144
15439b876811A6559923a0732372k7559821C3721924G790019J031234h304781j9574542
15431b7879323A0493689a7802633j4197092J2046929L912180k763039B4200133
15423e862413A2237822R627660K743449d112574j4203759b075800i91445k3467972
15415b4459417C0594703b5277933A4413088M943453j893166F785911J5378898
15408B2164809E95663J3169824a5037455A4184085R857498a7954519C6605612
15400B5083728g523404A9572489d316340F944718a892908F947556J263420J0940894
15392A9151870B053562L0820360p232980J4975332G683789M03377a0880480o0437
$$ plain form
15447 10307482 -33064258 -15582908 -8418649 -492941 17295835 25357166 -4228955 -2876811
15439 -2876811 16559923 -10732372 -38292193 33721924 7790019 8821253 -8304781 -27879323
15431 -27879323 10493689 -17802633 -31999725 -19952796 -16040616 -18803655 24200133
15423 -5862413 12237822 21865482 24608931 -4112574 -18316333 -2075800 -991445 -24459417
15415 -24459417 30594703 -25277933 14413088 19356541 17463375 6785911 22164809
15408 22164809 595663 13765487 -15037455 14184085 24041583 -17954519 36605612
15400 25083728 -7523404 19572489 -4316340 6944718 -1892908 6947556 8210976 19151870
15392 19151870 2053562 32873922 25640942 40616274 7683789 8087166 -10880480 -10940917
15384a0940917F0160540d2477261e971772l958820b959811A8125361a4137302
15376A2819824b5133634C6792759n910123L417395F910703c9039147E7470515
15368C5965300j690515a3625103q454631k6907530g256122j3159859O649669j63309
15360a3929621B2320453M671531a7792094B0647718R787402b0927722f25598C3829686
15351D149575R463569a1253761k4234439A7937715b361106n9298296b5647548
15343H416355B526450M279403J4102878d710039E4074138b3869164D7238461A2436779
15334A9314994g521142q788008E893743B583730a1820305A7907424h92855l5259684
15326c6152539A4903661b2615903A4858076d4803247A60984c5318075C041968
$$ plain form
15384 -10940917 60160540 -42477261 -5971772 -9930592 -2959811 18125361 -14137302
15376 12819824 -25133634 36792759 30882636 34300031 6910703 -39039147 57470515
15368 35965300 34274785 -13625103 -22079734 -48987264 -7256122 -20415981 -13766312 -13929621
15360 -13929621 22320453 26991984 -17792094 20647718 30435120 -20927722 -625598 33829686
15351 4149575 13613144 -11253761 -35488200 17937715 -2361106 -61659402 -25647548
15343 8416355 2526450 6805853 20908731 -4710039 54074138 -23869164 47238461 12436779
15334 19314994 -7521142 -16309150 5893743 2583730 -11820305 17907424 -892855 -36152539
15326 -36152539 14903661 -22615903 14858076 -44803247 160984 -35318075 3041968
15318D5496023a3889627A6133751N548940B374001K171303a737161B0874856m467194
15310A6407662p941828K1994244A4424106J3564199g89557r594725A7971902q884562
15302I087340M65226c837242E657868L2449439J7315020C962531j9066a7995926
15293b4252077k3862820A6943507n787107K754831i851688C27067J0229639J4845200
15285B5401906N291196N336364b570875l0633846l1058326a0466827H584386h796321
15276A5225803a1196140F428693C057748c274992k476354D1595710a295140O43790
15268f51350k0941122k2760315i083197d210524G891857a0046580B248685K6276531
15260B8525216b662875r694715G929479L4022748h004584E5466809a5223744L218558
$$ plain form
15318 45496023 -13889627 16133751 21682691 2374001 4545304 -1737161 20874856 16407662
15310 16407662 8465834 30460078 14424106 27988305 -789557 -10384282 17971902 9087340
15302 9087340 9552566 -3837242 5657868 38107307 55422327 3962531 3943465 -17995926
15293 -24252077 -48114897 16943507 11156400 13911231 -9851688 327067 10556706 25401906
15285 25401906 30693102 36029466 -2570875 -33204721 -64263047 -10466827 8584386 -8796321
15276 15225803 -11196140 6428693 3057748 -3274992 -5751346 41595710 -1295140 -651350
15268 -651350 -21592472 -44352787 -9083197 -4210524 7891857 -10046580 2248685 28525216
15260 28525216 -2662875 -12357590 7929479 41952227 -8004584 55466809 -15223744 -12005186
15252a2005186B4513520k327459a628441G986769i854356A1119491L6998960A7407882
15243E980444g985678L990093D9248876d9917400d464663k6231755B0657473p179139
15235A3478334J0454106f287047B2701882a5715176D5372225c6307130R905767
15228b6401363A9649379o52528j087157n963085J0681287K538539r301650o384017
15220I480768K5594645a3547945j5933841A6083905J6139766J1132697h506543
15212E281339J0084018k905078b2206281j1147803H972953O578498J1653017K0359383
15204D7563851a612389q334760l6159383F999124f559111B7007875H234772e352775
15195h495812c419563j3761297B6075664j662007b114960B989133K9173531B270267
$$ plain form
15252 -12005186 24513520 22186061 -1628441 7986769 -9854356 11119491 48118451 17407882
15243 5980444 -7985678 -3995585 49248876 -49917400 -4464663 -30696418 20657473 13478334
15235 13478334 23932440 -6287047 22701882 -15715176 45372225 -36307130 -26401363
15228 -26401363 19649379 18996851 17909694 11946609 22627896 25166435 15864785 9480768
15220 9480768 35075413 -13547945 -29481786 16083905 32223671 43356368 -8506543
15212 5281339 15365357 12460279 -22206281 -33354084 8972953 15551451 27204468 47563851
15204 47563851 -1612389 -9947149 -46106532 6999124 -6559111 27007875 8234772 -5352775
15195 -8495812 -3419563 -17180860 26075664 24413657 -2114960 2989133 32162664 2270267
15186D2757153b6362084K126530E333861p73064K7817900A1983886a4139296b825557
15177D101373K2116269g946775l3341064A5529947k836354a928870m243850D4791527
15168a450220H882594L4155649A8341174R482629I52971K8079373b214698D866062
15159A3437705d2599979A1109157f040178J020654k6084405a5311886d779483
15151F959755J4647849d2492949i659215H979887b9092441d72613G751393b5972873
15142H548124L3409559c0933589B4040516J7330353f060525B1606619C973803
15134C5471447A3234878K2315745a283901j2138439A4284694D2725a1737657k1787125
15126c3524782A0538910k515258K3564960A0122396Q763901h758298C6505871
$$ plain form
15186 42757153 -26362084 -24235554 5333861 4560797 32378697 11983886 -14139296 -2825557
15177 4101373 26217642 -7946775 -41287839 15529947 12693593 -1928870 -6172720 44791527
15168 -1450220 8882594 43038243 18341174 27823803 952971 29032344 -2214698 4866062
15159 13437705 -42599979 11109157 -6040178 -5019524 -31103929 -15311886 -4779483
15151 6959755 21607604 -42492949 -9659215 8979887 -29092441 -472613 7751393 -25972873
15142 8548124 41957683 -30933589 24040516 41370869 -6060525 21606619 3973803
15134 35471447 13234878 35550623 -1283901 -13422340 14284694 42725 -11737657 -33524782
15126 -33524782 10538910 8023652 31588612 10122396 18886297 -8758298 36505871
15118A4737685a2327001E4157467D029490N398644B992417a531049E7288757B4299864
15109F77018b5595571j908625o34018H985774l001254K3486682f839962k0049783
15101b6889745A1149086m626571J097801M2702066B1416469J8390326d528220
15093d728838A7457964J0497246J5170809D109854b651762G896808k206613b5230901
15084b3671212D7485844E270119a0603537C9359814G049982J237499O070622K177852
15076A6535955M746348A480470a1378494E307098J5022865J8842885B081406J6315129
15068A8396535c3128326C0446331d1445121C8614223f272777A6958937p842570
15061I116367J1151680n125639R711170a7737805k2212314A897005M0072937c057757
$$ plain form
15118 14737685 -12327001 54157467 4029490 9428134 2992417 -1531049 57288757 24299864
15109 677018 -25595571 -27504196 -28138214 8985774 5984520 29471202 -6839962 -26889745
15101 -26889745 11149086 6522515 7620316 50322382 21416469 39806795 -4528220
15093 -4728838 17457964 27955210 43126019 4109854 -2651762 7896808 5690195 -25230901
15084 -23671212 47485844 5270119 -10603537 39359814 7049982 8287481 14358103 16535955
15076 16535955 21282303 1480470 -11378494 5307098 20329963 39172848 2081406 18396535
15068 18396535 -33128326 30446331 -41445121 38614223 -6272777 16958937 9116367
15061 9116367 20268047 15142408 24853578 -17737805 -39950119 1897005 41969942 -3057757
15052A7921819n971484c2467187a5494786B2820260c3305397A0465980K3289590
15045C3755570B035560e555173l1693967A8958332K3134598e25334o784123A0597904
15036C0717561A1275125N806660g257678a040467B7317098Q933641d803380a016877
15027G507354i352767A8511292G259353a9534540h341604A8599437C950585B50167
15018b3490222A2605752k675602b224375j6945453k2747185a5189211g231974
15010D793034d7416486B1856721a9374534r328917A4474454a4948675E189254
15002d913080a679356r849208B993462b3848078c470345A5058447f359287k7132962
14994c3492249A4610841i009236B3815445J1114520a630204j3154210B7928726
$$ plain form
15052 17921819 11950335 -32467187 -15494786 22820260 -33305397 10465980 33755570
15045 33755570 2035560 -5555173 -37249140 18958332 42092930 -525334 -7309457 10597904
15036 30717561 11275125 17081785 -7257678 -1040467 27317098 36250739 -4803380 -1016877
15027 7507354 -9352767 18511292 7259353 -19534540 -8341604 18599437 3950585 250167
15018 -23490222 12605752 9930150 -2224375 -19169828 -41917013 -15189211 -7231974
15010 4793034 -47416486 21856721 -19374534 -28703451 14474454 -14948675 5189254
15002 -4913080 -1679356 -11528564 2993462 -23848078 -3470345 15058447 -6359287 -33492249
14994 -33492249 14610841 -9009236 23815445 34929965 -1630204 -14784414 27928726
14986B1983783f344715j3952555H050943J634714c2084708B5321717C809241b432248
14977D221216b4984100k77387B7978370D210590M9746191A7044962a582463G764225
14968B1261725q100102L200762C401406a155812c90980B1106556c0881562B8378542
14959h886465C967507O920582P872928N463648j0870381g20123A8970008h56028
14950a285271A8610919a2339642A503926J0599496M113526b22168n843330B3344542
14941D174866J64567b242949H605550K2428756A0357724k117077b614545F250518
14932a022090D052405c606924D6356487g651489B3880261e565885A1283150K262319
14924A3545469f436296j808728A3170398a8849435d621456k1126098A3567724
$$ plain form
14986 21983783 -6344715 -20297270 8050943 9685657 -32084708 25321717 3809241 -2432248
14977 4221216 -24984100 -25261487 27978370 4210590 53956781 17044962 -1582463 7764225
14968 21261725 13161623 16362385 3401406 -1155812 -390980 21106556 -30881562 28378542
14959 -8886465 3967507 10888089 18761017 24224665 13354284 -720123 18970008 -856028
14950 -1285271 18610919 -12339642 1503926 12103422 16216948 -222168 -6065498 23344542
14941 4174866 4339433 -2242949 8605550 31034306 10357724 8240647 -2614545 6250518
14932 -1022090 4052405 -3606924 46356487 -7651489 23880261 -5565885 11283150 13545469
14924 13545469 -6436296 -8245024 13170398 -18849435 -4621456 -25747554 13567724
14916C0850682F303848J1361639o127246c0383204a294525A5957365a4109324
14908A7404293N992071r170691a029811j2724677c233546C8957861a1505270l0963643
14900d2468913g815432E7806625b3183139B7627110n117808k972275J2102954
14893C1639981n775378B460348c738172l976640E199413i24668I463537L747627
14885A3211164j066978J2226371E315897J6027221j223506a2678739C189872a2733961
14876B3511268a3910637C8601795a057899A9136748J1835877a5119059j5872117
14869c0991176J5080490A1237697R457820O371637a7706300A2532297J0927084
14862B3459381A0771992J5488766M445891a6113914q066183e214929p661664A4153769
$$ plain form
14916 30850682 6303848 17665487 11538241 -30383204 -1294525 15957365 -14109324
14908 17404293 23396364 14225673 -1029811 -13754488 -3233546 38957861 -11505270 -42468913
14900 -42468913 -7815432 57806625 -23183139 27627110 22509302 19537027 31639981
14893 31639981 25864603 2460348 -3738172 -7714812 5199413 -924668 9463537 13211164
14885 13211164 12144186 24370557 5315897 21343118 20119612 -12678739 3189872 -12733961
14876 23511268 -13910637 38601795 -1057899 19136748 30972625 -15119059 -30991176
14869 -30991176 -15910686 11237697 20695517 27067154 -17706300 12532297 23459381
14862 23459381 10771992 26260758 30706649 -16113914 -24180097 -5214929 -12876593 14153769
14853B4154047B79889c6333855D0680964b7298172i299418A1827623m135099M3641896
14845E1334420a1394084A2753289a243886B5542405G754926P393019J2055404
14838B7203349e021906a603447C683079a9863382A0692965N854765a8603290M953776
14830a3649514f329404D376079i837710D7004588H120163a2360471A8608317C003001
14821b9820848I555536f037041k011503m749392A5728002J5361817a7727047C996636
14812D6582461H119135L1309483A9074611A953411J6155998D434690K5468501
14805B9903191a77307C0125924A646813i30676C0857844e907972l2567750e775144
14796a0907406m784804P566492D4255026A7757589g107074j9176837C3642658
$$ plain form
14853 24154047 279889 -36333855 40680964 -27298172 -9299418 11827623 7692524 51334420
14845 51334420 -11394084 12753289 -1243886 25542405 7754926 15147945 27203349
14838 27203349 -5021906 -1603447 3683079 -19863382 10692965 16547730 -18603290 -13649514
14830 -13649514 -6329404 4376079 -9837710 47004588 8120163 -12360471 18608317 3003001
14821 -29820848 9555536 -6037041 -8048544 -12797936 15728002 31089819 -17727047 3996636
14812 46582461 8119135 39428618 19074611 1953411 18109409 4434690 29903191
14805 29903191 -177307 30125924 1646813 -930676 30857844 -5907972 -38475722 -5775144
14796 -10907406 -15692210 -8125718 44255026 17757589 -7107074 -26283911 33642658
14788a1246225d775343H276810L1374515G28966J1862693K642074f443670A7986939
14779c5490816e684869k5877756d79636E441429J5543099a0204515C0157859J5119189
14771D5277048b508782j127460B6294561A110742J1799932d1276841A1923031
14763C34279L1839581e387020B4755357J1970623a2180725C265116L606832J6621721
14755B3493669J071591I619579M170453a2713018j9350153O858132a1107711E7327648
14746e826510K044672D2906961h423445L521656C7694836B508575L0371144h165258
14737A625761J5027280i024267m0194493A3464296d045927A4159866b236088D0654106
14728C3676138H693123h913656m102403l83724N899124k5923764a2332091A9740469
$$ plain form
14788 -11246225 -4775343 8276810 39651325 728966 12591659 15233733 -6443670 17986939
14779 -35490816 -5684869 -31562625 -479636 5441429 20984528 -10204515 30157859 45277048
14771 45277048 -2508782 -3636242 26294561 1110742 12910674 -41276841 11923031
14763 334279 32173860 -5387020 24755357 36725980 -12180725 3265116 6871948 23493669
14755 23493669 24565260 9619579 13790032 -12713018 -32063171 -25205039 -11107711 57327648
14746 -5826510 -3781838 42906961 -8423445 -4901789 37694836 2508575 32879719 -8165258
14737 1625761 16653041 -9024267 -49218760 13464296 -4045927 14159866 -2236088 40654106
14728 33676138 8693123 -8913656 -13016059 -13399783 -7500659 -33424423 -12332091 19740469
14719a0958090c235960B736877f784487A0307086D204468h317467G89942J8928746
14711A9718688O06393J6636032c4329377A8520125D07577L766538O407742d631894
14702b2843831d222584n174927r651056I963251J0539887H903911Q211412a9534359
14693B1817321b1832000A1410030g533516j830599j3048838a556725q727896B9707908
14684A925149N795064K0974690m126100i123047D513803e596497H100234a8567124
14675c2575022a2447188L838825c864292g4990A9615369a6250904A0881738K4788559
14667C5670297j2658872p60387K132172q966817J137675i717437B9922708a7296704
14658a722485A1065061M252410b2465627j1557495B9288657a2621463k6252282
$$ plain form
14719 -10958090 -3235960 2736877 -6784487 10307086 4204468 -8317467 789942 19718688
14711 19718688 20325081 36961113 -34329377 18520125 407577 4174115 10581857 -4631894
14702 -22843831 -4222584 -9397511 -19048567 9963251 20503138 8903911 17115323 -19534359
14693 21817321 -21832000 11410030 -7533516 -9364115 -22412953 -1556725 -10284621 29707908
14684 1925149 7720213 28694903 24568803 -9123047 4513803 -5596497 8100234 -18567124
14675 -32575022 -12447188 -8608363 -3864292 -74990 19615369 -16250904 10881738 35670297
14667 35670297 23011425 22251038 24383210 15416393 16554068 -9717437 29922708 -17296704
14658 -1722485 11065061 15317471 -22465627 -34023122 29288657 -12621463 -38873745
14651c8873745b755935A9730105b5806673b507772j9052599A1240024K4901641
14644C6141665H844182i489671M726722p528477A9413863H425666k043442k190765
14636D191459J4474635e786484p06327b503157k136465j8629553A9213426p324361
14628A1889065b44397l627350j4047058O900624A5305209F044800J5839461R385370
14620C1269631a4452843j6230729I249220g947845A136134K9058060A2076369
14612b1164258p681894A867137b5819616A4498296m107883b0795998Q585160q784616
14604b0995454H903366J7570562i236287A0000611K4405298e9851738e481412
14596C6202109b152838j6535147n892863m810230a2728486j4175601A3726992
$$ plain form
14651 -38873745 -2755935 19730105 -25806673 -2507772 -21560371 11240024 36141665
14644 36141665 8844182 -9489671 -4762949 -12291426 19413863 8425666 6382224 4191459
14636 4191459 18666094 -5786484 -6492811 -2503157 -4639622 -23269175 19213426 11889065
14628 11889065 -244397 -3871747 -17918805 -11018181 15305209 6044800 21884261 31269631
14620 31269631 -14452843 -30683572 9249220 -7947845 1136134 30194194 12076369
14612 -21164258 -28846152 1867137 -25819616 14498296 10390413 -20795998 -12210838 -20995454
14604 -20995454 8903366 26473928 -9236287 10000611 34405909 -59851738 -5481412
14596 36202109 -2152838 -18687985 -24580848 -29391078 -12728486 -26904087 13726992
14588c3774758B1158786I657938K3648595A6175838K5699256o672900I433858
14580a2186059A765797e735021j826414A1634463b5229029J1206720D438787K8698433
14572C3137220c3231241A9088701E402677b7233816d685450k4183971D1424553
14564D0406901d2844483D109184L276371M861393b2345736B2966260Q551001a6280166
14555F555090J2478340J6804901f124617j3266026E7657096a7298629A5749721
14547g672600g48803E8782245A4381311a3003607O338558A1568199m05509a0574817
14538B0770162J7543046A3459747g243404A9958599b2750421f43176l605037l3786684
14530c8034897f763643J895801j6465322N767993B0130517G775355p93O425142
$$ plain form
14588 -33774758 21158786 9657938 33306533 16175838 41875094 35202194 9433858
14580 -12186059 1765797 -5735021 -7561435 11634463 -25229029 -14022309 4438787 33137220
14572 33137220 -33231241 19088701 5402677 -27233816 -4685450 -28869421 41424553
14564 40406901 -42844483 4109184 7385555 12246948 -22345736 22966260 31517261 -16280166
14555 6555090 19033430 35838331 -6124617 -19390643 57657096 -17298629 15749721
14547 -7672600 -748803 58782245 14381311 -13003607 -6665049 11568199 11162690 -10574817
14538 20770162 38313208 13459747 -7243404 19958599 -22750421 -643176 -4248213 -38034897
14530 -38034897 -6763643 -4867842 -21333164 -15565171 20130517 7775355 7774562 14199704
14522A4199704a8223531A3406909J5941777n716598J442929f028307G037229J5728463
14514B2765692j814343H882087b9972265D835948a4442723A2805951n869334d0113950
14505H257587a5182642K348520N941276A259592K134012a5742901k4498337B762590
14496G415389K6862896A5582649a7724980B5122851a3876979A6439471J6298549
14489C2738020r184937h306900K746332D5443006c717665E8644696B1200123L9287238
14481F0487361k4376388q88599P806985b0069805C5599289j0596766J3200129
14474C8202652A8847185a2183407E5543931k382436k3769752C071665J3004256
14467A6075921j386111D716591M8512667k1866362c271117l502747j447467A8964022
$$ plain form
14522 14199704 -18223531 13406909 29348686 23632088 25075017 -6028307 7037229 22765692
14514 22765692 20951349 8882087 -29972265 4835948 -14442723 12805951 6936617 -40113950
14505 8257587 -15182642 -12834122 -6892846 1259592 3393604 -15742901 -40241238 2762590
14496 7415389 34278285 15582649 -17724980 25122851 -13876979 16439471 32738020
14489 32738020 23553083 -8306900 -5560568 45443006 -3717665 58644696 21200123 60487361
14481 60487361 36110973 35222374 43029359 -20069805 35599289 25002523 38202652
14474 38202652 18847185 -12183407 55543931 53161495 29391743 3071665 16075921
14467 16075921 14689810 4716591 53229258 31362896 -3271117 -6773864 -8221331 18964022
14458e2318145a2441939l2150902C8783907r915997m120466j841411A0643460
14450b494252n450266B402070b5740012H170201b2493530D54331J5426885a3494198
14441g060392C7534699J9168021b9094343a522407A3537576d7884598A847823
14433E587752b3805639A30406K4427714f607231B8843304b5646144D159865a6548376
14424a0185929k306021C2268936j3324943a3916284A909620a6830755D482137
14416G158414n14865a576548B3492010k562034a3302874A069931c3559904C2904342
14407A615771b8255002M327140C5148251f5886A6249459b3061950F537704a9554920
14398c953755C7304888b1685523j8872718J4200282i021009B2758873a7004626
$$ plain form
14458 -52318145 -12441939 -44592841 38783907 28867910 24747444 22906033 10643460
14450 -2494252 -7944518 2402070 -25740012 8170201 -22493530 454331 15881216 -13494198
14441 -7060392 37534699 56702720 -29094343 -1522407 13537576 -47884598 1847823
14433 5587752 -23805639 130406 24558120 -6607231 28843304 -25646144 4159865 -16548376
14424 -10185929 -12491950 32268936 18943993 -13916284 1909620 -16830755 4482137
14416 7158414 6643549 -1576548 23492010 20929976 -13302874 1069931 -33559904 32904342
14407 1615771 -28255002 -23927862 35148251 -65886 16249459 -23061950 6537704 -19554920
14398 -3953755 37304888 -21685523 -40558241 -26357959 -9021009 22758873 -17004626
14390E301452J9168266l066100c8528490d979630k9360111A9784613N122756A1693746
14381C1557935A1985249E266783n75571L4021195j7983473b3005192A147441i814922
14372e860563b822814o069887o127071j0816372A3173004F484896O509332J1890640
14364B4884868a0347255B0911974I143130e766215F602207e796032p495912m725684
14356a8017628g229375A5402244g585102J446381L39193A7007740f082361B884436
14347A0060465K874264Q092028e873934l040601J266726F248812f041736A2557130
14338B4492653b014217B2544899b8206754A4608714K1055492C738682J4471236
14331A8209918J782067K8031597c1633525I816391A81947d5315013h877786I288877
$$ plain form
14390 5301452 24469718 21403618 -38528490 -4979630 -34339741 19784613 24907369 11693746
14381 31557935 11985249 5266783 4691212 38712407 20728934 -23005192 1147441 -9814922
14372 -5860563 -2822814 -8892701 -15019772 -25836144 13173004 6484896 12994228 24884868
14364 24884868 -10347255 20911974 9143130 -5766215 6602207 -5796032 -13291944 -18017628
14356 -18017628 -7229375 15402244 -7585102 -6138721 -5799528 17007740 -6082361 2884436
14347 10060465 12934729 21026757 -5873934 -8914535 -7647809 6248812 -6041736 12557130
14338 24492653 -2014217 22544899 -28206754 14608714 35664206 3738682 18209918
14331 18209918 19991985 48023582 -31633525 9816391 181947 -45315013 -8877786 9288877
14322h345068K44599B4899272a3017570k3553238a131511m901480l4696088a0945527
14313B4500440F558753c1734812J3996603B2123850b0416199R486933A8964308
14305h437010M072632j7312562i145168a531723B4868485M979756e4145507a2370466
14296b032540B9696396b4877247E822950i428942I475210f760736j6611674m169698
14288b7542108A4269714a5496558B3196541f142020A6106226c785945D198707
14280c6230558E865202L063060A502073O893638a34836r777434r903279A1385934
14271c606169j9151681E446026L292816i114654r693772O453186q59790O558829
14263f656201C727125c4519389E809058b6743982A5555397D333508Q836038a140345
$$ plain form
14322 -8345068 -8100469 24899272 -13017570 -36570808 -1131511 -6032991 -40729079 -10945527
14313 24500440 6558753 -31734812 -17738209 22123850 -20416199 -10929266 18964308
14305 -8437010 -4364378 -21676940 -9145168 -1531723 24868485 29848241 -54145507 -12370466
14296 -2032540 29696396 -24877247 5822950 -9428942 9475210 -6760736 -23372410 -27542108
14288 -27542108 14269714 -15496558 23196541 -6142020 16106226 -3785945 4198707
14280 -36230558 5865202 8928262 1502073 8395711 -134836 -9912270 -19815549 11385934
14271 -3606169 -22757850 5446026 8738842 -9114654 -18808426 -12355240 -13215030 -6656201
14263 -6656201 3727125 -34519389 5809058 -26743982 15555397 4333508 13169546 -1140345
14254E833085L6263474f449044B9040869C797239K0804879A1866961B770914d3867277
14245a8192807f442858D854816A576127b1302815m116083J0103471A9748773c7406113
14236b802190B3281978b087666k0081436D181744J764612J8932594d043216j4877473
14228a8920689C02516b7659081A1560331D442149K1036050N6237604C1724127
14220A33550813l0704850R565728J26970m8441257L5217607k9252120M8375498
14213A18438389J4837101n578886R608554j8598093l957570O1795082N2007333
14206B28551910J2498157K9535617m3464711o138222P8335513J7868810M4069857
14199C61256931J4301537k7064490o0933268n65233k1882813J4569483N7050022
$$ plain form
14254 5833085 42096559 -6449044 29040869 3797239 24602118 11866961 2770914 -43867277
14245 -18192807 -6442858 4854816 1576127 -21302815 -25418898 -15315427 19748773 -37406113
14236 -2802190 23281978 -2087666 -22169102 4181744 5946356 24878950 -4043216 -18920689
14228 -18920689 302516 -27659081 11560331 4442149 25478199 81715803 31724127
14220 133550813 102845963 112411691 112538661 64097404 99315011 70062891 118438389
14213 118438389 133275490 127696604 137305158 118707065 114749495 176544577 228551910
14206 228551910 241050067 270585684 227120973 220982751 299318264 317187074 361256931
14199 361256931 375558468 348493978 287560710 286995477 265112664 279682147 336732169
14192C36732169l6627084m5737824q5003702m5842949l8863457O330641m408803
14185H6578991C4520925j030427K9590623k4093978E230556K0496566G410650
14177B5882438K0536658k137897k986881g853634C4595737j5303472J1812879
14170C1105144G969078K4752659K318772J284988j712723Q514850a3194137E4546753
14161B6454452I116552J9317026L6928473j7425887A2501500d579085D400154
14153b70932A5565351b0303869C3368437j1253622J719974J5255234f770877C0411867
14144A613007K0346018A0559083b7516921D7362354a0955217l971490H55484L2562866
14136C3418350a0253806A4491249J8794653i169984A9828150a9083586A005086
$$ plain form
14192 336732169 300105085 254367261 169363559 123520610 84657153 90987794 86578991
14185 86578991 34520925 33490498 63081121 38987143 5230556 25727122 7410650
14177 25882438 46419096 44281199 41294318 -7853634 34595737 19292265 31105144
14170 31105144 7969078 32721737 35040509 36325497 34612774 43127624 -13194137 54546753
14161 26454452 9116552 28433578 65362051 47936164 12501500 -4579085 4400154
14153 -270932 15565351 -20303869 33368437 22114815 23834789 39090023 -6770877 30411867
14144 1613007 21959025 10559083 -27516921 47362354 -10955217 -14926707 855484 33418350
14136 33418350 -10253806 14491249 33285902 -9169984 19828150 -19083586 1005086
14128a1208216j0610588A0473433a3902172k954894B5516463p494948p86927a8204922
14119f889592G6856R537234b1621191C9517430H686755L1868623b0612345P950668
14111a2661677C0991365c168918A7595872M487899d3378176a0781495I649088
14103D8617983A8339467J5279099D713853c3420317J6272504C6696653I561562
14095B154117M0659206K34865c659359B830883L1284676J0283111F654879Q607547
14087A5262426b4331064A0250971K2622237A2828984b8633226A831910F04058
14079B4290427A750887J3606840K9708216A9493628c4571011h061706A590669
14071A909328b1887785B6273090j2984339Q701966R23663b0955323B9852687A630572
$$ plain form
14128 -11208216 -21818804 10473433 -13902172 -16857066 25516463 18021515 17234588 -18204922
14119 -6889592 76856 9614090 -21621191 39517430 8686755 40555378 -20612345 -12661677
14111 -12661677 30991365 -3168918 17595872 22083771 -43378176 -10781495 9649088
14103 48617983 18339467 33618566 4713853 -33420317 -17147813 36696653 9561562
14095 2154117 42813323 43048188 -3659359 2830883 34115559 44398670 6654879 15262426
14087 15262426 -24331064 10250971 32873208 12828984 -28633226 1831910 604058
14079 24290427 1750887 15357727 45065943 19493628 -34571011 -8061706 1590669
14071 1909328 -21887785 26273090 13288751 21990717 22914380 -20955323 29852687 1630572
14062i711497C8991793K3629322B9840988a7344629k3109759A0942918a4663054
14054g826867B649018K1861637j0667272O295799i145115C2667255a4519324R26050
14046a3593274B5335726p823892C112334M61791K8328024C490077a4630512j321998
14038a5952510B0978936J6552208A3986167d741788K251513l79161I406556K1745791
14030C1152347i864537B768860f8926929a4316426A6214012j589125J2340006
14023B6964893b0552291A1330450a9762865j2796383C5823245J9625372A946739
14015d218557A213788L8747730c4802394E2110793A308539K2145478j228949c670468
14006a7280007j785619D4649212e38472j1405160c896287j138301B1585900e509100
$$ plain form
14062 -9711497 38991793 62621115 29840988 -17344629 -40454388 10942918 -14663054
14054 -7826867 2649018 24510655 13843383 20139182 -9145115 32667255 -14519324 -13593274
14046 -13593274 25335726 17511834 3112334 3574125 31902149 3490077 -14630512 -15952510
14038 -15952510 20978936 37531144 13986167 -4741788 -2490275 -2869436 9406556 31152347
14030 31152347 -9864537 2768860 -68926929 -14316426 16214012 14624887 26964893
14023 26964893 -20552291 11330450 -19762865 -32559248 35823245 55448617 1946739
14015 -4218557 1213788 39961518 -34802394 52110793 1308539 23454017 22225068 -3670468
14006 -17280007 -19065626 44649212 -538472 -11943632 -3896287 -5034588 21585900 -5509100
13997I41862d391600C7626272A0612895a362276B7572072A2681321h099973B850061
13988c3874241A5103810I62841a7545800F5696886I052166K3364830O599203A5544327
13979B0046834b8624893E64371L0680930B231425J0988366D395741K0105349b0006022
13970B886368J1842714K0895387a1905294o522339c739613k8054691d047739G516854
13961b3259994Q887102A0940352a4085665d420226E246110b098015D212835a507161
13952G298932a5767611G15520K8279687a553520k3431901f893o505870H076662
13943I610967L7498859a9768852C8791379b2471296B0971066a7418102A4785381
13935D3650103A2012341J8923701K70014J1836151A4302358K028967M771169K729743
$$ plain form
13997 941862 -4391600 37626272 10612895 -1362276 27572072 12681321 -8099973 2850061
13988 -33874241 15103810 962841 -17545800 65696886 9052166 32416996 39016199 15544327
13979 20046834 -28624893 564371 31245301 2231425 13219791 4395741 24501090 -20006022
13970 2886368 14729082 35624469 -11905294 -18427633 -3739613 -31794304 -4047739 7516854
13961 -23259994 -14372892 10940352 -14085665 -4420226 5246110 -2098015 4212835 -1507161
13952 7298932 -15767611 715520 28995207 -1553520 -24985421 -6893 -6512763 8076662
13943 9610967 47109826 -19768852 38791379 -22471296 20971066 -17418102 14785381
13935 43650103 12012341 30936042 31206056 43042207 14302358 16331325 21102494 23832237
13927B3832237l978934I790383P9425353C4473507j35833r749426G281975b5697783
13918E4232531j7750662j4778490J246059F824174K347213k879278K9717289a4666255
13909A8206551n866047h143403j8064397h942434c097683a183836C1529676J5776931
13901D7306607b0174704F180388J0594108a5675779D831887J2640430B554441
13893B3556858q017209o263145c9241407B49887b606397B5550889r935284L189755
13885A8805360A21753J3275273a6862047A9089424a3464062B7232468a4016764
13877b3185868f427021G538571e778815A9767349E763877R292966a3635929C0054527
13868B8342470h944664B1033927K0130315a3456417E4645991g511143j621407
$$ plain form
13927 23832237 19853303 9790383 89215736 34473507 34337674 24588248 7281975 -25697783
13918 54232531 36481869 21703379 22949438 6824174 9171387 6292109 36009398 -14666255
13909 18206551 12340504 -8143403 -26207800 -8942434 -3097683 -1183836 31529676 47306607
13901 47306607 -20174704 6180388 16774496 -15675779 4831887 17472317 2554441
13893 23556858 15539649 9276504 -39241407 249887 -2606397 25550889 15615605 18805360
13885 18805360 121753 13397026 -16862047 19089424 -13464062 27232468 -14016764
13877 -23185868 -6427021 7538571 -5778815 19767349 5763877 15056843 -13635929 30054527
13868 28342470 -8944664 21033927 41164242 -13456417 54645991 -7511143 -9132550
13861i132550A617324K0078715K3381484G7260i097702C92276a6698501f409374
13852B4587085a3231025B8204688l595754q094756b7533946J3235088A5323912
13844B1231255J9483472A958630a5636830e73098m3831162N256594e029087C714152
13835B242155h236075A0385198a0125332p987356a251461K31018j5677815D374492
13826a8775689j1521509D2956430f401227C4760328E487217K8560455q311534
13819B5736138k893761o776172c85900B0061628A650901d4405820a9287687C8430387
13810B1085392L40626P433124j1274848D987457L960928A756822d123284B1074818
13801a0369879H282658R953561a0790372N184693l567101k1290081B9522627b2840538
$$ plain form
13861 -9132550 1617324 21696039 45077523 77260 -9097702 392276 -16698501 -6409374
13852 24587085 -13231025 28204688 24608934 16514178 -27533946 -14298858 15323912
13844 21231255 40714727 1958630 -15636830 -573098 -44404260 -39147666 -5029087 3714152
13835 2242155 -8236075 10385198 -10125332 -18112688 -1251461 -1020443 -16698258 4374492
13826 -18775689 -30297198 42956430 -6401227 34760328 5487217 34047672 25736138
13819 25736138 22842377 16066205 -385900 20061628 1650901 -44405820 -19287687 38430387
13810 21085392 21426018 28859142 17584294 4987457 8948385 1756822 -4123284 21074818
13801 -10369879 8282658 18236219 -10790372 -5605679 -9172780 -30462861 29522627 -22840538
13792A635794L8671111A0387214g771664B4869415g775540N5410k1456332A4757366
13783a5324726k0797232C821437P897271k124390M9755620c37487l6964581i9971
13774B3130331A1380846c6805790A1571393O992927o676109a0733837B2170472
13766h890209C4949260A5882547b915891A1190525f359433B868630J606730K3436245
13758B7911605B969500K9018973a1123817B7143571D595116K3910805c07362k6300333
13750b6607695G585499b4849946A0218509K0017839j0990459i906723A5219666
13742F702520M0542a2440435G222125R729640o232040d475783k5390498A4449293
13733B148643i660885Q91647l815898B6349115l34115c92171A5138658b722621
$$ plain form
13792 1635794 40306905 10387214 -7771664 24869415 -7775540 -7720130 -29176462 14757366
13783 -15324726 -36121958 3821437 11718708 9594318 59349938 -337487 -37302068 -99971
13774 23130331 11380846 -36805790 11571393 18564320 11888211 -10733837 22170472
13766 -8890209 34949260 15882547 -2915891 11190525 -6359433 2868630 4475360 27911605
13758 27911605 2969500 31988473 -11123817 27143571 4595116 28505921 -307362 -26607695
13750 -26607695 7585499 -24849946 10218509 30236348 19245889 -9906723 15219666
13742 6702520 6743062 -12440435 7222125 16951765 10719725 -4475783 -29866281 14449293
13733 2148643 -9660885 -8769238 -12585136 26349115 26015000 -392171 15138658 -2722621
13724b8824713J1464135d513946l415828G500503b416780B3612923A1183460M6808132
13716E7991592K748050b2921456R634798A9225761c286224j2597175B8994567
13708A9513253K710638B788154b8926860A064872M1182072e8175487a8066009
13700c0289617A639419J2634413b4260962q132204E151553i803913B9025365j4343691
13692A4681674b464187j20102p108314A8804529a3371419j782833D587745O777644
13684A1365389L711611a5513030B0703922a3535558A875010b5982940B3251616
13676D1258104j7188486A0163888a6839810k0420877A7052489m294821c0293114
13668F716593O494994a4117940N621054E714640J6994362b120857k1421448e354204
$$ plain form
13724 -28824713 -17360578 -4513946 -7929774 7500503 -2416780 23612923 11183460 57991592
13716 57991592 60739642 -22921456 -13286658 19225761 -3286224 -15883399 28994567
13708 19513253 22223891 2788154 -28926860 1064872 42246944 -58175487 -18066009
13700 -30289617 1639419 14273832 -24260962 -32393166 5151553 -9803913 29025365 14681674
13692 14681674 -2464187 -2584289 -9692603 18804529 -13371419 -15154252 4587745 11365389
13684 11365389 15077000 -15513030 20703922 -13535558 1875010 -25982940 23251616
13676 41258104 24069618 10163888 -16839810 -37260687 17052489 12757668 -30293114
13668 6716593 13211587 -14117940 -8496886 5714640 22709002 -2120857 -23542305 -5354204
13659a357426B7500231K3711242a611364p078949A3525125J3126394D182919M574400
13651H757319D067900K5569206b2002450A7110738B966484f6864902C42936K5863026
13643B6205962c6271503D1741337a2335911N559912k8769189A7573573C081001
13635G911434N10216M778910b3054700A3880055n898517N297359a6818584j2338159
13627b9156743A5072514a5610958B877420K5907964j3896993K633840b6155047
13619C819492J0840910b204621I294266P393875a7784496A7482131b603477j5478335
13611a8081812G731404A929196a7435613c176147A4283780A975354c4933560R706584
13603b5226976A3808027J1576805a0358656j6184752d048270D486465P398218
$$ plain form
13659 -1357426 27500231 51211473 -1611364 -8690313 13525125 26651519 4182919 8757319
13651 8757319 4067900 29637106 -22002450 17110738 2966484 -66864902 342936 26205962
13643 26205962 -36271503 41741337 -12335911 -6775999 -35545188 17573573 3081001
13635 7911434 8421650 13200560 -23054700 13880055 7981538 13278897 -16818584 -29156743
13627 -29156743 15072514 -15610958 2877420 28785384 14888391 17522231 -26155047
13619 3819492 14660402 -2204621 9294266 16688141 -17784496 17482131 -2603477 -18081812
13611 -18081812 7731404 1929196 -17435613 -3176147 14283780 1975354 -34933560 -25226976
13603 -25226976 13808027 25384832 -10358656 -26543408 -4048270 4486465 11884683
13596A1884683b5885345A2105305J8473341A1932169B736154g617916L442378
13589d175538E2965J6067631I60693J4176845L433324a2240464d317556H482350
13580b3325255B1018759C162229J5723612C969620J6943772C212443d624077j7090391
13572b1714468B7641408E119307f111860B4112875b4651682K250076A6964648
13564D0100966b5467008I571168C393730M9035065a0435762D2525656j0677241
13557C1848415R806255a5005745j8010894B8837856A2084205g790385B2658441
13549a0282903j8529729B5605062a9473741B9152966c8522229g769909j015580
13542h785489A8201957c364921j4023676l272898k3255830A5865860a0309343
$$ plain form
13596 11884683 -25885345 12105305 30578646 11932169 2736154 -7617916 -4175538
13589 -4175538 52965 16120596 960693 15137538 18570862 -12240464 -4317556 8482350
13580 -23325255 21018759 3162229 18885841 3969620 20913392 3212443 -4624077 -21714468
13572 -21714468 27641408 5119307 -6111860 24112875 -24651682 -22401606 16964648
13564 40100966 -25467008 9571168 3393730 52428795 -10435762 42525656 31848415
13557 31848415 41654670 -15005745 -33016639 28837856 12084205 -7790385 22658441
13549 -10282903 -28812632 25605062 -19473741 29152966 -38522229 -7769909 -8785489
13542 -8785489 18201957 -3364921 -17388597 -20661495 -43917325 15865860 -10309343
13534F226019a2775207A3548737C369096a7088326B7793992j2150689o59064d3154346
13525D2381277c7346953a5092472B799249P871453g39021k0532284B6323290N561097
13517C1884387a5489077L517381j9161567C1654852a6040025q835913E489183
13509B583264j239750a3492386K216262E941901J17817g891160B6095691g933909
13500a0052455a49888r282296D1052562A2606194b3631735g720701A7802042f896754
13491c743100C1818874B658735d1181470B5056177a5397451I127757c1410362
13483b7600981A3785115c1394612J4883629A8507792c064284g67867k8303757
13476b9071624b514618B6421825q634793a8394983D915756b8879135C6614473
$$ plain form
13534 6226019 -12775207 13548737 3369096 -17088326 27793992 15643303 14984239 -43154346
13525 42381277 -37346953 -15092472 2799249 10670702 -739021 -21271305 26323290 31884387
13517 31884387 -15489077 -11971696 -31133263 31654852 -16040025 -24875938 5489183
13509 2583264 1343514 -13492386 -11276124 5941901 6059718 -7891160 26095691 -7933909
13500 -10052455 -149888 -9432184 41052562 12606194 -23631735 -7720701 17802042 -6896754
13491 -3743100 31818874 2658735 -41181470 25056177 -15397451 9127757 -31410362
13483 -27600981 13785115 -31394612 -16510983 18507792 -3064284 -767867 -29071624
13476 -29071624 -2514618 26421825 17787032 -18394983 4915756 -28879135 36614473
13468a1571170l574064e304108o016545r770720o646647A9880689M314435J4991397
13460C9186521a6099323k84284a686453n55629I022304e669180a563783B7533676
13451A9123385d633613J007016A652432p39380J2780626R950127a3654733l557909
13443a7212642f602494E9837760A7438646p286465a7030850h450826H142698k761306
13435E381392K1472595c0988143D9094780a4001097D669468N065227b5281873
13427C6792415C106715J7836600c2930925A840399K0332857c487134D6019313
13419A9074385J849968a9545484c491863D2236548g477988j462535A4022845J8964610
13411C2987455j0438422c398298k1331687n294027a2853072F11544a015385A4328278
$$ plain form
13468 -11571170 -15145234 -5304108 -11320653 -21091373 -27738020 19880689 24195124 39186521
13460 39186521 -16099323 -16383607 -1686453 -2242082 9022304 -5669180 -1563783 27533676
13451 19123385 -4633613 -3626597 1652432 913052 13693678 23643805 -13654733 -17212642
13443 -17212642 -6602494 59837760 17438646 10152181 -17030850 -8450826 8142698 5381392
13435 5381392 26853987 -30988143 49094780 -14001097 4669468 9734695 -25281873
13427 36792415 3106715 20943315 -32930925 1840399 22173256 -3487134 46019313
13419 19074385 20924353 -19545484 -3491863 42236548 -7477988 -8940523 14022845 32987455
13411 32987455 22549033 -3398298 -24729985 -30024012 -12853072 611544 -1015385 14328278
13402a7283910F823940J7139019f018444G50577f00829j7337196q05194A9062883
13393C344313O652381i31861H611234B79548a883300j6166588a705509C2986540
13384a321197B4399901c0962478B940375J9430999n326503b2689224B4856970
13376a2141161a97452l7343116C9913727a2652802C592043g287929j1176171j0107962
13368b8572062G738437R160089b3974268J1612785c766989A5743325J409917d2174031
13359B0791109H285382e250970B7484609a0103343l0026266e736794k278597B0578899
13350A299447a5968552A0969655c199993A6312549L0633759f308522B5724332
13342F612985D88784b3737741I517933A476662P706397A745317a2618393C0159891
$$ plain form
13402 -17283910 6823940 23962959 -6018444 750577 -600829 -17938025 -18743219 19062883
13393 3344313 9996694 -931861 8611234 279548 -1883300 -18049888 -1705509 32986540
13384 -1321197 24399901 -30962478 2940375 22371374 17044871 -22689224 24856970
13376 -12141161 -197452 -37540568 39913727 -12652802 3592043 -7287929 -18464100 -28572062
13368 -28572062 7738437 16898526 -23974268 -12361483 -3766989 15743325 17153242 -42174031
13359 20791109 8285382 -5250970 27484609 -10103343 -40129609 -5736794 -8015391 20578899
13350 1299447 -15968552 10969655 -3199993 16312549 46946308 -6308522 25724332
13342 6612985 488784 -23737741 9517933 1476662 9183059 1745317 -12618393 30159891
13333I981271a1107574I788012j462438J480184a6244229g451614l0208965A5724574
13324A5879049e208482j3847427R488942D6436083J9824224B7036520H158838
13316c1007502F552182J8203037D570415K9823956f178923b508603j6970295n905669
13308b5384567B1018889p793621D645786J6215945L994501K0749775F597616d4438307
13299b971322j708469j1710223D7430382a9578469B8697349d10118A0580695m060700
13291F519995j343141b431088j2534315g350694A7528650D049870J5729444a3302966
13282A040521f725653H214980l1054Q740235J8000786A6509332b2021939C4910585
13273i168568B3199857C503147J4972834L9920369k8544773a5431615B9668997
$$ plain form
13333 9981271 -11107574 9788012 8325574 9805758 -16244229 -7451614 -37660579 15724574
13324 15879049 -5208482 -19055909 -9566967 46436083 66260307 27036520 8158838
13316 -31007502 6552182 24755219 4570415 34394371 -6178923 -2508603 -19478898 -25384567
13308 -25384567 21018889 13225268 4645786 20861731 24856232 45606007 6597616 -44438307
13299 -2971322 -4679791 -16390014 47430382 -19578469 28697349 -410118 10580695 6519995
13291 6519995 5176854 -2431088 -14965403 -7350694 17528650 4049870 19779314 -13302966
13282 1040521 -6725653 8214980 8183926 16924161 34924947 16509332 -22021939 34910585
13273 -9168568 23199857 3503147 18475981 58396350 29851577 -15431615 29668997
13265d4974178b0204145B9630175n628258P539338A2879105l188193K4962971
13258C4653883e085336B3946479i828106m9281080D199231b1827206j0511211
13251c2338417i478362A0278248N802266L3621768H086294P631961J377350J2540486
13243B9636091j0607447o60731B411558f905920B1780116K1094445o900763A5493760
13234F874040K8113263C183862M0836000E54270h378122q996997O465532c447568
13225c4599576B8842510D064913R572178l048255n109773N998771b2997942K833307
13217b0164635d239410C1469818d6632171e213004m561167B7626969e546919C067612
13208B6509689E753517a5739809B6369122K6314212B2448657i545758A216074
$$ plain form
13265 -44974178 -20204145 29630175 24001917 31541255 12879105 9690912 34653883
13258 34653883 -5085336 23946479 -9828106 -59109186 4199231 -21827206 -32338417
13251 -32338417 -9478362 10278248 16080514 49702282 8086294 15718255 17095605 29636091
13243 29636091 19028644 18367913 2411558 -6905920 21780116 42874561 35973798 15493760
13234 6874040 34987303 3183862 44019862 554270 -8378122 -17375119 -10909587 -3447568
13225 -34599576 28842510 4064913 13637091 10588836 5479063 11477834 -22997942 -20164635
13217 -20164635 -4239410 31469818 -46632171 -5213004 -9774171 27626969 -5546919 3067612
13208 26509689 5753517 -15739809 26369122 52683334 22448657 -9545758 1216074
13200b9832281C1893086a837969A48187f107756j6263022H349876J5882320C341673
13191i251971A1096380c7379047a8677319B451507a8616290B7669592e500482
13183a1207281a546025C328717c7927902D254108h974981D2101077A9537713a0284139
13174A1657149a2538943A6670432o065650L266392O453150N898326e666272C1205970
13165c4879906a0318032B2731630b2419601d545080B0255029k364222b2190063
13157f685787D730778a5865752A6610035E380479c0623032E796632L0634622a3232514
13148a9817195C9205626A6850699L3167986a4517524A9900428I513479a1938688
13140B5390895b3470301A6464559e795027j4436294C7701618b6886048a0292936
$$ plain form
13200 -29832281 31893086 -1837969 148187 -6107756 -22370778 8349876 24232196 3341673
13191 -9251971 11096380 -37379047 -18677319 2451507 -18616290 27669592 -5500482
13183 -11207281 -1546025 3328717 -37927902 4254108 -8974981 42101077 19537713 -10284139
13174 11657149 -12538943 16670432 10604782 13871174 20324324 26222650 -5666272 31205970
13165 -34879906 -10318032 22731630 -22419601 -4545080 20255029 17890807 -22190063
13157 -6685787 4730778 -15865752 16610035 5380479 -30623032 5796632 36431254 -13232514
13148 -19817195 39205626 16850699 50018685 -14517524 19900428 9513479 -11938688
13140 25390895 -23470301 16464559 -5795027 -20231321 37701618 -26886048 -10292936
13132A3245703J601960B411756e808779o182161k908804k6995527a6744123G64994
13123a2552772A9655190a877455l056644I771244d2504171a6889996j1362795
13116b8252791Q22443a0717793A7345252e29586D7948911A2921332l873494c949426
13107A0728974a4070208p131080g284487B1763447C459339K60773M5372207k0648091
13099B8444228r418984o598145J4289290E345813b5172851B6381563A1264271
13091B0481241J0175181a9734258A8618811c2506950C3367820B446540J4450925
13084A6897465a5419584e703150j9204566O189555p231876A7503386O063325h44700
13075B0144832J463657b2015364F464693J2371377a8266775C9697293j9195632
$$ plain form
13132 13245703 14847663 2411756 -5808779 -11990940 -14899744 -41895271 -16744123 764994
13123 -12552772 19655190 -1877455 -4934099 9771244 -42504171 -16889996 -28252791
13116 -28252791 -27430348 -10717793 17345252 -529586 47948911 12921332 9047838 -3949426
13107 10728974 -14070208 -21201288 -7284487 21763447 3459339 3720112 49092319 28444228
13099 28444228 19025244 12427099 26716389 5345813 -25172851 26381563 11264271
13091 20481241 30656422 -19734258 18618811 -32506950 33367820 2446540 16897465
13084 16897465 -15419584 -5703150 -24907716 -18718161 -25950037 17503386 23566711 -844700
13075 20144832 21608489 -22015364 6464693 18836070 -18266775 39697293 20501661
13068B0501661a8137727B4684279G738736a8029842e945195B605584J9478578
13061B2084162d864987k1623553A8924496h762891j9506218J4130059l593935
13054a7732985C0144621a4288186k4722924a6376738j216136A0610535a6631339
13046a6960657f541979P75125L28411b190149j6435162b395612A8759603L4806169
13038E3565772C025366d4616106b17020H774562a2001875B003172d310904A901725
13029A0375216P294838J4997798C554997g073492B0799186h876300k4465150A0108709
13020a537852k4578223a0692898j7458752C931903J9317313E763190K9222349
13013C4985539f481069p980448D2222372a8923262F628431b999643I366977E15382
$$ plain form
13068 20501661 -18137727 24684279 7738736 -18029842 -5945195 2605584 22084162
13061 22084162 -4864987 -26488540 18924496 -8762891 -28269109 -14139050 -17732985
13054 -17732985 30144621 -14288186 -39011110 -16376738 -17592874 10610535 -16631339
13046 -16960657 -6541979 -5766854 -5438443 -2190149 -18625311 -2395612 18759603 53565772
13038 53565772 3025366 -44616106 -217020 8774562 -12001875 2003172 -4310904 1901725
13029 10375216 17670054 32667852 3554997 -7073492 20799186 -8876300 -33341450 10108709
13020 -1537852 -26116075 -10692898 -28151650 3931903 23249216 5763190 34985539
13013 34985539 -6481069 -14461517 42222372 -18923262 6628431 -2999643 9366977 515382
13004B662488a07180D762655A829125c4236412J3031765C8285813A0938209b5998806
12995a314362H841131g567528B930917R540135g723426B7579539h126502k783091
12987a0909593B0093731H34647P665447a27499j5503413F91570K6326262a663415
12978D546028a0580946q875349j7137582e657543B0779593j0208382K2116679
12971C2687890a1095869n670274E128091b7776159J0985825j2047698B1067998
12963C4835418j1533635A305851b848E6670247a4979694F147416N5186380a2623884
12954a8037263a696242l613911C5878385q632289O91660b1401176A7835177D18175
12945e971650k1970515A0394945K4244850a9657751j893385F06024c1135731G040869
$$ plain form
13004 2662488 -107180 4762655 1829125 -34236412 -21204647 38285813 10938209 -25998806
12995 -1314362 8841131 -7567528 2930917 12471052 -7723426 27579539 -8126502 -10909593
12987 -10909593 20093731 834647 8500094 -127499 -15630912 691570 27017832 -1663415
12978 4546028 -10580946 -19456295 -36593877 -5657543 20779593 10571211 32687890
12971 32687890 -11095869 -16766143 5128091 -27776159 -16790334 -28838032 21067998
12963 34835418 23301783 1305851 -2848 56670247 -14979694 6147416 61333796 -12623884
12954 -18037263 -1696242 -5310153 35878385 27246096 27937756 -21401176 17835177 418175
12945 -5971650 -27942165 10394945 34639795 -19657751 -21551136 606024 -31135731 7040869
12936b8829638b040560B913536d2146450a1437889I299194c5762646E967739i26355
12927A5268099F193384a7293762B6585991r402511j656415K158630k33493a824947
12918b9846570D843361d191499A2755113a4733433l3594421a3728110A141587
12910B9464650O606417b3868404J1232330A8563740J4154838b3042766R717312
12903a3325454K827840b030518j1613085A3899288a7537943j2028534C5865088
12895c3490236Q056945J1569018C1907419d9453158C7226801c597516C1379298
12887a4216508B9354843G441022a6036257A8023867c1639222A5726573J7771679
12880C3498252g555419m599042D283580O414941L7419063a6510832A1478795a8853948
$$ plain form
12936 -28829638 -2040560 2913536 -42146450 -11437889 9299194 -35762646 5967739 -926355
12927 15268099 6193384 -17293762 26585991 17183480 15527065 17685695 17452202 -1824947
12918 -29846570 4843361 -4191499 12755113 -14733433 -48327854 -13728110 1141587
12910 29464650 36071067 -23868404 -12636074 18563740 32718578 -23042766 -13325454
12903 -13325454 -10497614 -2030518 -13643603 13899288 -17537943 -29566477 35865088
12895 -33490236 -25433291 -13864273 31907419 -49453158 37226801 -3597516 31379298
12887 -14216508 29354843 7441022 -16036257 18023867 -31639222 15726573 33498252
12880 33498252 -7555419 -12154461 4283580 10698521 48117584 -16510832 11478795 -18853948
12871I91746J7213764i187933M156667C2457307E600560I52523K5640679q578383
12863A8014819M0839182d8229543J9193732I19372L455890a760451D098696J7933745
12855B2032441h477967B1022805g044372o4294527C0186546H405391J8636157
12848B7041548C129592J1498464a1660576B2197131b0776668o690178C630450
12840B2282099I194255j356797k518618d0908223J6829759I092123P215500J5333841
12832C1641464D625520c1173380A4050650g412577F263658K622955a0484287D2692059
12823a7288704B4250920a6048670A1910651b0020889F670955M002961b0323657
12815G709728a6421190B9945997a3516527A3737719b5180650f842549G890953
$$ plain form
12871 991746 18205510 -9187933 -5031266 32457307 5600560 952523 26593202 18014819
12863 18014819 58854001 -48229543 -29035811 919372 4375262 -1760451 4098696 22032441
12855 22032441 -8477967 21022805 -7044372 -71338899 30186546 8405391 27041548
12848 27041548 3129592 14628056 -11660576 22197131 -20776668 -27466846 3630450
12840 22282099 9194255 7837458 5318840 -40908223 -24078464 9092123 16307623 31641464
12832 31641464 4625520 -31173380 14050650 -7412577 6263658 8886613 -10484287 42692059
12823 -17288704 24250920 -16048670 11910651 -20020889 6670955 10673916 -20323657
12815 7709728 -16421190 29945997 -13516527 13737719 -25180650 -6842549 7890953
12807B6579445D643654d1107749J235894P985864A1471014k060007J601331a8312087
12798B0373362a853576k4133052d962576l6447115a2057220C1615421g690141
12790F625799h10938k8325392C543517K290724a3270630A544049h805231B5327343
12781A5113390J876704e5944349i491358l479008B0037551a1230455p047235Q29159
12773a7448531N253162B0727160l846791b6844975p780485E161902a2068233d17902
12764D730606M754123l897594h199258F054782K2160536a0064863A5410374d0149197
12755A3925070J804546b1615721I86665J5980359g574464k5319798F779139C51085
12746d187202m829463n634692B0128582B481650g435599E495735a4284606G989158
$$ plain form
12807 26579445 4643654 -41107749 -39871855 -31885991 11471014 9411007 11012338 -18312087
12798 20373362 -1853576 -25986628 -4962576 -41409691 -12057220 31615421 -7690141
12790 6625799 -810938 -29136330 3543517 5834241 -13270630 1544049 -8805231 25327343
12781 15113390 16990094 -55944349 -9491358 -12970366 20037551 -11230455 -18277690 -17448531
12773 -17448531 -12195369 20727160 16880369 -26844975 -34625460 5161902 -12068233 -417902
12764 4730606 9484729 5587135 -8199258 6054782 28215318 -10064863 15410374 -40149197
12755 13925070 15729616 -21615721 986665 16967024 -7574464 -32894262 6779139 351085
12746 -4187202 -9016665 -14651357 20128582 2481650 -7435599 5495735 -14284606 7989158
12737a9015236O193603A6556993D638176J1500461M849230q66980B284308J320352
12729C604660K0791771a0800197D685964b7684877B06385a7853788j0844431j986189
12721c0684408a0524921P68703f42705C0430037a2565199I255111a6789515C1026580
12712A8105165q801262f235391j8474231b415728k299025A404742B3662J4777766
12704A4801428a0448488A2606115a5651194B9070529c8853317a4281785B1103664
12696C546107c616178g53814A1889216D872377J6858909d2563901J5178675D1098422
12687G864451l278921F38197K3784989M827296d3329311A967464a1089992o76872
12679a1766864F708079e2300801a4603097I654140i952908C7477979D287557a9118988
$$ plain form
12737 -19015236 -12821633 16556993 4638176 16138637 20987867 20120887 2284308 3604660
12729 3604660 24396431 -10800197 4685964 -27684877 206385 -17853788 -28698219 -30684408
12721 -30684408 -10524921 -9756218 -642705 30430037 -12565199 9255111 -16789515 31026580
12712 18105165 9303903 -6235391 -24709622 -2415728 -4714753 1404742 23662 14801428
12704 14801428 -10448488 12606115 -15651194 29070529 -38853317 -14281785 21103664
12696 3546107 -3616178 -753814 11889216 4872377 21731286 -42563901 -27385226 41098422
12687 7864451 4585530 638197 24423186 29250482 -43329311 1967464 -11089992 -11766864
12679 -11766864 6708079 -52300801 -14603097 9654140 -9952908 37477979 4287557 -19118988
12670A002148c1210360g900637F50750J434020c4607731c831423A4506704a1773500
12661A105497N883667B600946M1968515f901597A4666945p068607i747270r557906
12653a9305176Q603290K98253d64794C7320995A6145958a805111m2935522c335702
12644A8130143b6972899g893833K1126D427868O117317L8063999M734793b7233097
12635D568200d8620313R349518A2241435k755596e4082356K1710738j4471078
12628d6842696C4822055i064425B2036001A0362686a0915456A073396J6916649
12621A7990045a4828145a966978A2602017L159084G621262a5015694a337973D7384580
12612F2460985b6902192C2028365a7906490G131772d7957783f389600l7893938
$$ plain form
12670 1002148 -31210360 -7900637 650750 2084770 -34607731 -3831423 14506704 -11773500
12661 1105497 6989164 2600946 44569461 -6901597 14666945 7598338 -9747270 -19305176
12653 -19305176 -10701886 -10403633 -464794 37320995 16145958 -1805111 -44740633 -3335702
12644 18130143 -26972899 -7893833 -7872707 4427868 10545185 48609184 53343977 -27233097
12635 4568200 -48620313 -39270795 12241435 9485839 -54082356 -32371618 -46842696
12628 -46842696 34822055 -9064425 22036001 10362686 -10915456 1073396 17990045
12621 17990045 -14828145 -1966978 12602017 15761101 7621262 -15015694 -1337973 47384580
12612 62460985 -26902192 32028365 -17906490 7131772 -47957783 -6389600 -44283538
12605d4283538A8829745G22154a6247070B0481380a8818868k9150935a5803150
12597a5600186c985588k506593n5128542b6922775b845660A2398957N71559J1351863
12589B4322379b886125A9435434A667989J7946745c6915584a0185804k924779
12582a3110583l7977319L698621H549809f339345C1230805G147793L7430067k755026
12574D1822834c7176935a1472135A2265496a4657543D1799541a3305603A8715979
12566A8354699c7755662F73822J4998194b7560799a006250r093641A6710661g233770
12557A9694566d706412C2531007r390961H899830R045087h058111k8215081E935461
12548a2214801A713343L3711909B982330M961198N194925d289278B3718539a2703162
$$ plain form
12605 -44283538 18829745 722154 -16247070 20481380 -18818868 -47969803 -15803150
12597 -15600186 -3985588 -6492181 -61620723 -26922775 -2845660 12398957 12970516 24322379
12589 24322379 -2886125 19435434 1667989 19614734 -36915584 -10185804 -13110583
12582 -13110583 -51087902 -47389281 8549809 -6339345 31230805 7147793 44577860 41822834
12574 41822834 -37176935 -11472135 12265496 -14657543 41799541 -13305603 18715979
12566 18354699 -37755662 673822 15672016 -27560799 -1006250 -10099891 16710661 -7233770
12557 19694566 -4706412 32531007 23140046 8899830 17944917 -8058111 -36273192 5935461
12548 -12214801 1713343 35425252 2982330 7943528 13138453 -4289278 23718539 -12703162
12539b3689911a0854665B35006O131632L422334d970542c27578c1383k0930654
12531b0962037C2695040a8912551C7758550F002684P774879o287262K400090b3019763
12522B4308045f0934j2093266j6346521p418794J4600158B6047176o348128g586494
12513a4900210j5213179h528384C8346550c8008676J5725918g533678A0789373
12505d3489450a7248613L192536A0478780N998451d3081482a0238911D9813188
12497C208194g314196C475805A06140a6574111A0873887b0592254k7658907a9354682
12488a624017j6729421B2274467B389704J1691128C164340G56767c415011A5228715
12479i203895A900543c4284243E014239L180838K246472b3793225i070681l1036172
$$ plain form
12539 -23689911 -10854665 235006 6366638 9788972 -4970542 -327578 -31383 -20962037
12531 -20962037 32695040 -18912551 37758550 6002684 13777563 7490301 9890391 -23019763
12522 24308045 -60934 -12154200 -28500721 -35919515 -21319357 26047176 19699048 -7586494
12513 -14900210 -30113389 -8528384 38346550 -38008676 -22282758 -7533678 10789373
12505 -43489450 -17248613 -14056077 10478780 16477231 -43081482 -10238911 49813188
12497 3208194 -7314196 3475805 106140 -16574111 10873887 -20592254 -48251161 -19354682
12488 -1624017 -18353438 22274467 2389704 14080832 3164340 756767 -3415011 15228715
12479 -9203895 1900543 -34284243 5014239 8195077 10441549 -23793225 -9070681 -40106853
12471d0106853e292672A5090636i802419B8946911N4621a0333844A0840902D176980
12462B5342564n475558a2274868H108944b476529A0064754K5425773j2545773
12455B2944754a1681122m6827224b3885388E5376970A5437457a129254j7940871
12448a9070125i347452B2511912a4859382c661152A2243842c0151324C1189764
12440d93610A3114839e5593256b1809689i76005l9996292b620202F23343O87785
12432A311128e455177j623393A3361647d428651B7618633r733937i889091C2982579
12423G723140a7147817B414154Q140361A373896a7613629h792173C368730b7143664
12414a6757065B1700920P090039a0904439j8859128I59938Q664416J0070920d217065
$$ plain form
12471 -40106853 -5292672 15090636 -9802419 28946911 29001532 -10333844 10840902 4176980
12462 25342564 19867006 -12274868 8108944 -2476529 10064754 35490527 22944754
12455 22944754 -11681122 -58508346 -23885388 55376970 15437457 -1129254 -19070125
12448 -19070125 -9347452 22511912 -14859382 -3661152 12243842 -30151324 31189764
12440 -493610 13114839 -55593256 -21809689 -976005 -40972297 -2620202 623343 1311128
12432 1311128 -5455177 -7078570 13361647 -4428651 27618633 17884696 -9889091 32982579
12423 7723140 -17147817 2414154 10554515 1373896 -17613629 -8792173 3368730 -27143664
12414 -16757065 21700920 28790959 -10904439 -29763567 959938 9624354 19695274 -4217065
12405C8149918I090467i687981A4366451d079499k4203816A9678086a5470006
12397b2521285A4887685A693846J3899901a0889497A7749095f1455933h404498
12389c000704j3200419e080225j2107604E766154a3617118q719664I01188M5014866
12381D5916054a3299341B1962481p270842d4529824D699255d8155239b3156187
12373B9134193H901497a3051557B3412780f59244j6300404H636589b859892A8360094
12364B2440135c6513460n265740J8634902q017281f250528m1250534e447492C0745549
12355b3902660Q257436G094062A601133b2631632R773732c022194j6806400A371531
12346a0344362K877131m053907A9772015i06422l035410H386607a2238715l245693
$$ plain form
12405 38149918 9090467 -9687981 14366451 -4079499 -28283315 19678086 -15470006
12397 -22521285 14887685 1693846 15593747 -10889497 17749095 -61455933 -8404498
12389 -3000704 -16201123 -5080225 -17187829 5766154 -13617118 -22336782 901188 45916054
12381 45916054 -13299341 21962481 14691639 -44529824 4699255 -48155239 -23156187
12373 29134193 8901497 -13051557 23412780 -659244 -16959648 8636589 -2859892 18360094
12364 22440135 -36513460 -41779200 -23144298 -31161579 -6250528 -47501062 -5447492 30745549
12355 -23902660 -15645224 7094062 1601133 -22631632 -12857900 -3022194 -19828594 1371531
12346 -10344362 -7467231 -11521138 19772015 -906422 -3941832 8386607 -12238715 -15484408
12338a5484408p028031l6606856K9252528F028470K6477055I006158M0219043
12331D9225201j2670176B134963P110903m409713f047930B7354783b2067191B706477
12322C8583658a1154511B5535561g974004L205586A7788579J0267920b7938883
12314D6007427c6751983J5127777D400069a842621A1371984a9966845C3111116
12306C0102415K2473231b6426715g636642A5047234D694736J1337452D534026
12298a2138990D626927N018310N7407753b5139624O852043B0021922c234110j6897227
12290b0131337L6182k0865633a0073861C026347a7472370C2510881d553573k5978061
12282c0531634B6556060c548131r27214B0649935c4678466G921774b8479963b061468
$$ plain form
12338 -15484408 -22512439 -59119295 -29866767 6028470 32505525 9006158 49225201
12331 49225201 36555025 2134963 9245866 4836153 -6047930 27354783 -22067191 2706477
12322 38583658 -11154511 25535561 -7974004 -4768418 17788579 28056499 -27938883
12314 46007427 -36751983 -21624206 4400069 -1842621 11371984 -19966845 33111116
12306 30102415 52575646 -26426715 -7636642 15047234 4694736 16032188 4534026
12298 -12138990 4626927 9645237 67052990 -25139624 -18287581 20021922 -3234110 -20131337
12290 -20131337 -20095155 -40960788 -10073861 3026347 -17472370 32510881 -4553573 -30531634
12282 -30531634 26556060 -3548131 -4475345 20649935 -34678466 7921774 -28479963 -2061468
12273B0672354a2402294a586614B8826618a8639388q939563e509901B4553084
12265A2667335a4234902m261983o788933c587837k0051246C748954c9634108L464909
12257c6169199Q230224a0250755j4708170Q641668O659535j0542101A1682273
12249a1805228j3596371d29748j6929421G558240c8029609c526576F623409a9579264
12240A662045K8569816b4176061c546515E2818966g066573A6647114a1732682
12232b8956789a3223500H765221n14975J576083e857669g51635k645910H459956
12223c015308j4197713a646874B9232987a979749A616646a125226C599979R217959
12215A2817938m366728M688898J5285575h455386o455735f684921l7818302A4099328
$$ plain form
12273 20672354 -12402294 -1586614 28826618 -18639388 -27578951 -5509901 24553084
12265 12667335 -14234902 -18496885 -25285818 -3587837 -23639083 3748954 -39634108 -36169199
12257 -36169199 -27938975 -10250755 -24958925 -16317257 -9657722 -20199823 11682273
12249 -11805228 -25401599 -429748 -17359169 7558240 -38029609 -3526576 6623409 -19579264
12240 1662045 30231861 -24176061 -3546515 52818966 -7066573 16647114 -11732682
12232 -28956789 -13223500 8765221 8250246 9826329 -5857669 -751635 -3397545 8459956
12223 -3015308 -17213021 -1646874 29232987 -1979749 1616646 -1125226 3599979 12817938
12215 12817938 8451210 13140108 28425683 -8455386 -14911121 -6684921 -44503223 14099328
12206b8656835a0838541j1393650q867283k529238C563741j584994a064142B7310639
12197b1021283B911076K8377789b6507286E245512b0249429B4582003a3579431
12189C9357541q686499a5813832j8620948a45810B520349i638783j0274632B344773
12180a8078341A8321936h971505A9429560E225935K857703a567345I286749h101284
12171D1641956A4634144J3151111H186814K8963202c201530j7693239c351149
12163f971683E610915r25068c12787n401669G554163D52237a5434220g22077l4106250
12154c4828327q183624a261018A8822184K3864802F056390b0661552A2958715
12146a2755057C2828231j6027933L881880C200019f437066K13387G145054M356868
$$ plain form
12206 -28656835 -10838541 -22232191 -31099474 -33628712 3563741 1978747 -1064142 27310639
12197 -21021283 2911076 31288865 -26507286 5245512 -20249429 24582003 -13579431
12189 39357541 30671042 -15813832 -34434780 -145810 2520349 -9638783 -19913415 2344773
12180 -18078341 18321936 -8971505 19429560 5225935 8083638 -1567345 9286749 -8101284
12171 41641956 14634144 27785255 8186814 37150016 -3201530 -20894769 -3351149
12163 -6971683 5610915 4685847 -312787 -5714456 7554163 452237 -15434220 -722077 -34828327
12154 -34828327 -43011951 -1261018 18822184 42686986 6056390 -20661552 12958715
12146 -12755057 32828231 16800298 20682178 3200019 -6437066 -6223679 7145054 11501922
12138A1501922K285608L1248863F794461d0105338A54491c786269k6258818D116917
12129b8854684A2160164a3075736e199290k7349866G356960b403531k6911207
12122b9314738a416931l1659410b328048m849494F584134a6015149A0649424D706801
12113B9959068j885838A661752k31191i98006D756821L2067321A5440381D376137
12104g069785k223946B5989374b0528507M183289b217965A1679501l65027A837774
12095H863548b0678397B837719J6559556d572675j4051704g166234A1169222J6237359
12087B7406581c333742A6989130M537305C970330a0329888a930089F489091b0776564
12078a3425745k2491606f309715Q14404C3481683a9813138A452833K898728h331498
$$ plain form
12138 11501922 13787530 45036393 6794461 -40105338 154491 -3786269 -30045087 4116917
12129 -28854684 12160164 -13075736 -5199290 -32549156 7356960 -2403531 -29314738
12122 -29314738 -1416931 -33076341 -2328048 -7177542 6584134 -16015149 10649424 4706801
12113 29959068 28073230 1661752 1430561 -998006 4756821 36824142 15440381 4376137
12104 -7069785 -9293731 25989374 -20528507 -16345218 -2217965 11679501 11314474 1837774
12095 8863548 -20678397 2837719 19397275 -4572675 -18624379 -7166234 11169222 27406581
12087 27406581 -3333742 16989130 21526435 3970330 -10329888 -1930089 6489091 -20776564
12078 -13425745 -35917351 -6309715 -5495311 33481683 -19813138 1452833 4351561 -8331498
12069F598622b5078410J1732290F203034a5725115p298503c177796k8438675B1632479
12060i334513B5825483L889469B402111J8273032B874631a4039620c436255m2955122
12052d6391377A0106079J9271346b4996289A5065978c3162633A2337232a6189042
12044c4862646p736946A9311518r474382K2629008a1294256j4807844A509549
12036I876691b9788861B5589448A2098281a1260270d133069A7022682d621665
12028C5111833D815505O754283F63457a62410G908457d657220F7844694a2035832
12019A5705724c4647413B1335162a4708237q247117A6463109m891602b4440894
12011A4742924O978262j133734C764752e35817k384203k1442839e984484A215181
$$ plain form
12069 6598622 -25078410 -13346120 6203034 -15725115 -23023618 -3177796 -31616471 21632479
12060 -9334513 25825483 29714952 2402111 20675143 2874631 -14039620 -3436255 -46391377
12052 -46391377 10106079 29377425 -24996289 15065978 -33162633 12337232 -16189042
12044 -34862646 -42599592 19311518 9837136 32466144 -11294256 -26102100 1509549
12036 9876691 -29788861 25589448 12098281 -11260270 -4133069 17022682 -4621665
12028 35111833 4815505 11569788 663457 -162410 7908457 -4657220 67844694 -12035832
12019 15705724 -34647413 21335162 -14708237 -22955354 16463109 11571507 -24440894
12011 14742924 21721186 20587452 3764752 -535817 -2920020 -24362859 -5984484 1215181
12002B1735551f899926A4977477F145774N351539b4543386n157917J754452J2828824
11994a5118027A8085065b3271842h311309B9832929a6125501I430890l85509c3366068
11985d7084183F376496a7083621B0903347a8785128e674524A1540991Q880223
11978B0421214c9378015B2066256D116513K961248a1033879j8513889D9417275
11970C439593h062419j8417002C3025554a5129486d137344j0034520C8484586
11962d2898009P387600A0019124b0162692B4763259G596496c6735765r649494
11955d6385259D0497384d5115537A6435347J3580436e863468k3225918a798493
11947A8224726q818192a7544850d202718D973435J628620L1261375c188709D8541528
$$ plain form
12002 21735551 -6899926 14977477 6145774 11497313 -24543386 -29701303 -27946851 -15118027
11994 -15118027 18085065 -23271842 -8311309 29832929 -16125501 9430890 9045381 -33366068
11985 -47084183 6376496 -17083621 20903347 -18785128 -5674524 11540991 20421214
11978 20421214 -39378015 22066256 4116513 7077761 -11033879 -29547768 49417275
11970 3439593 -8062419 -26479421 33025554 -15129486 -4137344 -14171864 38484586
11962 -42898009 -35510409 10019124 -20162692 24763259 7596496 -36735765 -46385259
11955 -46385259 40497384 -45115537 16435347 30015783 -5863468 -29089386 -1798493
11947 18224726 9406534 -17544850 -4202718 4973435 6602055 37863430 -3188709 48541528
11938e102949C0123593a1782562K637012A9127287b3750089B3525377p520362
11931A6005015a540667n2028624B1556857i964259A1259375P454458G48416c0770164
11922a6001811A3801555j60540i538485d31484B1463462J0976119b0929878A8813198
11913A8825326m393170h418680A3178825a1205867j4181437Q499080C7456798
11905d3319544K0102280B2919566f90040B3212528p687099j824299J5594740b5504315
11896a7152466J342274A4906767a2078645G799392b3729677J0667075D3238054
11888a55285l0112531i224207p631680a523180j9809288j0688531A9306589i858333
11879c8724977b434460j1439832R1464K247180A5961407I95183L3472748j2941329
$$ plain form
11938 -5102949 30123593 -11782562 -9145550 19127287 -23750089 23525377 16005015
11931 16005015 -1540667 -53569291 21556857 -9964259 11259375 18713833 748416 -30770164
11922 -16001811 13801555 13641015 -9538485 -431484 21463462 32439581 -20929878 18813198
11913 18825326 14432156 -8418680 13178825 -11205867 -25387304 -16888224 37456798
11905 -43319544 -23217264 22919566 -690040 23212528 15525429 13701130 29295870 -25504315
11896 -17152466 -15810192 14906767 -12078645 7799392 -23729677 -13062602 43238054
11888 -155285 -30267816 -9224207 -16855887 -1523180 -21332468 -32020999 19306589 -9858333
11879 -38724977 -2434460 -13874292 -13782828 -11535648 15961407 995183 34467931 21526602
11871B1526602c1664175b227306I072559a7500279A9455078p882006a1132298
11863A5001368h801137k352284j8627373O951180B2824549J9560307b6522385
11855E819197f877177A835380b9295242c807049o267014G66951h217302m011911
11847a2229213A0726336a056944j5968145b92216k7003625O342052A9172349a8255082
11838e393203j3622434B0675910c545648D2560737B0977236b6363348K874703
11831b3488645A4512905d0520542D638041b2887371E831190J9809980a274142
11823c0848455J4942657n756300F383598g772p972475D1544902a2271625d806933
11814I002597j044484J7957003f227834j5186894O207692C454914h269980k43390
$$ plain form
11871 21526602 -31664175 -2227306 9072559 -17500279 19455078 11573072 -11132298
11863 15001368 -8801137 -11153421 -29780794 -22829614 22824549 42384856 -26522385
11855 5819197 -6877177 1835380 -29295242 -3807049 -10074063 766951 -8217302 -12229213
11847 -12229213 10726336 -1056944 -17025089 -292216 -27295841 -20953789 19172349 -18255082
11838 -5393203 -19015637 20675910 -3545648 42560737 20977236 -26363348 -23488645
11831 -23488645 14512905 -40520542 4638041 -22887371 5831190 25641170 -1274142
11823 -30848455 -15905798 -21662098 6383598 -7772 -7980247 41544902 -12271625 -4806933
11814 9002597 7958113 25915116 -6227834 -21414728 -15207036 3454914 -8269980 -8513370
11806h513370C2697123d5490864B4124238J0723343j5421057b607632D7512889
11798g633186D6641160a5819634n534064g999451A6191332n330773b658015B1311107
11789f117060A2182673b1297861R185014k545497c353739l242740C9471975a0536888
11780a3419244p400869B675292K3508917A1265410J956556J1229264B215303R755977
11772A1971280c0359529J0810790B8639130b2861181D205099O807438G99921a0304765
11763b609157E782551N638026a9166705B0028468m5704h299553k3965579B8211130
11754a7552420I194978b1652187l434099A2716900h087034J107822B4690984d4039296
11745b63519o310225B0461444a8558623C4521472j0731377I434113K829375L191044
$$ plain form
11806 -8513370 32697123 -45490864 24124238 34847581 19426524 -2607632 47512889
11798 -7633186 46641160 -15819634 -21353698 -7999451 16191332 10860559 -2658015 21311107
11789 -6117060 12182673 -21297861 -12112847 -14658344 -3353739 -6596479 39471975 -10536888
11780 -13419244 -20820113 2675292 26184209 11265410 13221966 24451230 2215303 11971280
11772 11971280 -30359529 -19548739 28639130 -22861181 4205099 11012537 799921 -10304765
11763 -2609157 5782551 11420577 -19166705 20028468 19982764 -8299553 -32265132 28211130
11754 -17552420 9194978 -21652187 -25086286 12716900 -8087034 -6979212 24690984 -44039296
11745 -263519 -6573744 20461444 -18558623 34521472 23790095 9434113 12263488 15454532
11737A5454532a3142967n741290B728453a6713205A9974167q38449g729404C0832999
11728I218577m345846K4794808a981664l4793209G167742K0130473j2023235J9393368
11720C4668348h325789K630965k1912519j791173J719793a062855j9765269D558092
11711D629659c2058411I47814h780076H458873a0190948A4644441a6738196C7086921
11702d1264244I299294a2909432H633029C62741K473312K393495d236128B3588123
11693c1097786a1414495k7768377E753403a0750317K204069B2207851C331222
11685a0393003C17126b4473393m815944a2414752C533827J6715046q952534J7709271
11677B9005610I71787a1596889C0109949b5326792h764187a506941E211853f392586
$$ plain form
11737 15454532 -13142967 -18884257 2728453 -16713205 19974167 19135718 -7729404 30832999
11728 9218577 4872731 29667539 -1981664 -36774873 7167742 27298215 15274980 34668348
11720 34668348 -8325789 -5694824 -27607343 -29398516 -27678723 -1062855 -20828124 4558092
11711 4629659 -32058411 947814 -8780076 8458873 -10190948 14644441 -16738196 37086921
11702 -41264244 9299294 -12909432 8633029 362741 2836053 5229548 -4236128 23588123
11693 -31097786 -11414495 -39182872 5753403 -10750317 -8546248 22207851 3331222
11685 -10393003 317126 -24473393 -29289337 -12414752 3533827 20248873 11296339 29005610
11677 29005610 971787 -11596889 30109949 -25326792 -8764187 -1506941 5211853 -6392586
11668D861735A46823J4093360d644938q420110d455320j249383l1767251a002441
11659a9073788i214017A4510297J971036a1384762J675283H982210A26220f732053
11650A8371293n35555a3407005k825943B1094019A0002168c811612H271620M654056
11642A2925676F351129b1264770m9283050c0851897L332946a1467647A1168863
11634b0552777A7510741F988345a8922180c436842A1281943a1643908B69175Q026038
11626H295213J1144603b8974327C0260210D139090K7546207c4090822A7991281
11618A1110003R306420K5568942N736445f462148A9318901r002167c351814A1306759
11609I321984j584329a5423002l52675J847059k0449011C437057a7103426j8084416
$$ plain form
11668 4861735 146823 14240183 -4644938 -13065048 -4455320 -5704703 -37471954 -1002441
11659 -19073788 -9214017 14510297 16481333 -11384762 -9709479 8982210 126220 -6732053
11650 18371293 17835738 -13407005 -16232948 21094019 10002168 -3811612 8271620 12925676
11642 12925676 6351129 -21264770 -70547820 -30851897 -27518951 -11467647 11168863
11634 -20552777 17510741 6988345 -18922180 -3436842 11281943 -11643908 269175 8295213
11626 8295213 19439816 -28974327 30260210 4139090 31685297 -34090822 17991281
11618 11110003 20416423 45985365 51721810 -6462148 19318901 10316734 -3351814 11306759
11609 9321984 7737655 -15423002 -15775677 -13928618 -34377629 3437057 -17103426 -35187842
11601c5187842H172778J0877526a0519988r350846A4893331F428187b1382034
11593C240105P891861c5746743E669916M1015553g641050B6278658f5872j1256313
11585a1322185B780021M2915189a0013021r065521A0069364o27734L7546257E759240
11576b3163120B1376597e0004202B3108891j0392103c7144795B0143757b3991217
11568b5594751C3503804b9274477c468686A8157238d1102845B478727K6682991
11561B9161718a1543673L905614G529437P165134K4999522o040741I377171J3228916
11553B2606087j0361575c676371F359310N007789c3328787h33229E280305L2283109
11545C7563414b2113462k1561701J9964838j8206A3088574a8321054A5741820
$$ plain form
11601 -35187842 8172778 19050304 -10519988 -19870834 14893331 6428187 -21382034
11593 3240105 11131966 -35746743 5669916 46685469 -7641050 26278658 -65872 -11322185
11585 -11322185 2780021 45695210 -10013021 -19078542 10069364 9441630 46987887 5759240
11576 -23163120 21376597 -50004202 23108891 12716788 -37144795 20143757 -23991217
11568 -25594751 33503804 -29274477 -3468686 18157238 -41102845 2478727 29161718
11561 29161718 -11543673 -7638059 7529437 14694571 39694093 33653352 9377171 22606087
11553 22606087 12244512 -3676371 6359310 11367099 -33328787 -833229 5280305 37563414
11545 37563414 -22113462 -43675163 -23710325 -23728531 13088574 -18321054 15741820
11537g217043A7540738b2824115A0571767a4096051o343882k0077522N954881
11530c4562574K918388k4776622B1978411a4204133G236293L2545691A7035047
11522D34680d7790818a5436941O020579j2301590G501969O64825a0015015A0159564
11513B5788615I218870b8742718J2633947C819643J4489781e479212J548964A3945661
11504B2246176n078104E710738K2838312a2099618B0314674b7465259i459622
11496h033757j0989264A2012509d782827j0176555d539348J693128E978300b655676
11487B655741b070062G00058a1318221k3619570B3042106a8338940L510833A3156894
11478G2807312g461452j7605456A7441054a288061A2273562g329020C9448649
$$ plain form
11537 -7217043 17540738 -22824115 10571767 -14096051 -20439933 -40517455 -34562574
11530 -34562574 -31644186 -56420808 21978411 -14204133 7236293 39781984 17035047
11522 434680 -47790818 -15436941 -9416362 -21717952 7501969 8166794 -10015015 10159564
11513 25788615 9218870 -28742718 -16108771 3819643 18309424 -5479212 -3930248 13945661
11504 22246176 17168072 5710738 28549050 -12099618 20314674 -27465259 -9459622
11496 -8033757 -19023021 12012509 -4782827 -14959382 -4539348 -2846220 5978300 -2655676
11487 2655741 -2070062 700058 -11318221 -34937791 23042106 -18338940 -14828107 13156894
11478 72807312 -7461452 -25066908 17441054 -1288061 12273562 -7329020 39448649
11470d1213717B8897235c5129101a926350B9181137c3324468J5774718A7386615
11462C7677347j4716777n358142a4935629E9502646a4424230d289994B406501
11454a9725A5273772D380981M3130942b0411354j2802380i703139j6257724B6823347
11445C1917570a5022605d467367J32323j1982032B5747749b0365248A4419591
11437c8359732C5299939A2824102M242642b0355945D7842287A3323473b3684203
11429e7865617b0392595E286348c448438A6278423G584937d111396A1695336P357836
11421A9053172a8621198g589443l0631614J8663909h047318c034643R65314A1697635
11412B7256349a3447708m307602O547106B8025539a3163795o348689O825805D5077398
$$ plain form
11470 -41213717 28897235 -35129101 -1926350 29181137 -33324468 -17549750 17386615
11462 37677347 22960570 17602428 -14935629 59502646 -14424230 -4289994 2406501
11454 -19725 15273772 4380981 47511923 -20411354 -33213734 -9703139 -25960863 26823347
11445 31917570 -15022605 -4467367 -4335044 -16317076 25747749 -20365248 14419591
11437 -38359732 35299939 12824102 17066744 -20355945 47842287 13323473 -23684203
11429 -57865617 -20392595 5286348 -3448438 16278423 7584937 -4111396 11695336 19053172
11421 19053172 -18621198 -7589443 -38221057 -19557148 -8047318 -3034643 -2069329 11697635
11412 27256349 -13447708 -17755310 -11208204 28025539 -13163795 -19512484 -12686679 45077398
11403d293297a891700B5438075F553500d2559164D5699409a9020023A2809850
11395f345265B3356069a3882679C1760135e012166k4026705a746195j8780517
11388b0526712M780199A7897679K0499885f712194B5180963O054072b059172j3697849
11380a5757021I12334J7207532b450560j6423220A7197336b7732007A7909060
11372B9831201A3545311f191896J419261F908514a2090134b187092B2217168F394808
11363c77266p313151H053421M034578B106738J2900257J2941762e2625332a8876395
11354A1982961e434101E619001J7708092O561855A1404369a6380973A7453969
11346A526754c7000740R919987d091988l8515320J8190977Q167212A0339773R696624
$$ plain form
11403 -4293297 -1891700 25438075 6553500 -42559164 45699409 -19020023 12809850
11395 -6345265 23356069 -13882679 31760135 -5012166 -29038871 -1746195 -20526712
11388 -20526712 -15746513 17897679 38397564 -6712194 25180963 31235035 -2059172 -15757021
11380 -15757021 912334 18119866 -2450560 -18873780 17197336 -27732007 17909060
11372 29831201 13545311 -6191896 -4772635 6908514 -12090134 -2187092 22217168 6394808
11363 -377266 -7690417 8053421 12087999 2106738 15006995 27948757 -52625332 -18876395
11354 11982961 -5434101 5619001 23327093 29888948 11404369 -16380973 17453969
11346 1526754 -37000740 -27080753 -4091988 -42607308 -24416331 -16249119 10339773 20036397
11338B0036397b7115567Q195966Q905410E332402A585544d079667j2689531A3457622
11329B366166c8076905A7360244l469312L8433683B5271611A374735J7493941
11322A8868676b633759o60131B0582105G649286M876548e1191336B0148557b330719
11313a790548B8417800E002938J2291424D584141J0999879f099600r530860B024813
11304I419972a6958316A6248933K2661512c8567237d94195j1206875j1494788
11297b3195858D1064g182063j0950335C292391e662412A199635L9683025b1455317
11288h469563r040372E202198J3932816R604751f3424258a6015607f299450j6932405
11280b3231855N0719a0424540B7038033o824664e2481234J2712841A0416835b545590
$$ plain form
11338 20036397 -27115567 -18919601 -10014191 5332402 1585544 -4079667 -16769198 13457622
11329 2366166 -38076905 17360244 13890932 52324615 25271611 1374735 18868676
11322 18868676 -2633759 -3293890 20582105 7649286 12525834 -51191336 20148557 -2330719
11313 -1790548 28417800 5002938 17294362 4584141 15584020 -6099600 -15630460 2024813
11304 9419972 -16958316 16248933 38910445 -38567237 -494195 -11701070 -23195858
11297 -23195858 41064 -7182063 -18132398 3292391 -5662412 1199635 40882660 -21455317
11288 -8469563 -17509935 5202198 19135014 28739765 -63424258 -16015607 -6299450 -23231855
11280 -23231855 -23181136 -10424540 27038033 20213369 -52481234 -39768393 10416835 -2545590
11271a1782432l630279A0404321e513315F707311K148355j886341J341990N21826
11263H833141f241432B1104528c7889481a6383300P707848j157960j6823140G529094
11254a0866512j8471799f338367j2306665G305639J2587055N822129A1579854
11246C6148134e019062A6114790p57673l29a7811772P635046j7037785q110488
11238c5324999D405822a3699697A9441850c5224098E4165543b1701392B3709638
11230c4203093C4057441D228518Q802693E507297b6337593D883468a1737557K018797
11222i718760J299180I121477h625905B345092N9950074A6632088e2407632B9404915
11213E681354J316262a2716733B3901224I505319b2465264o49843B0638018K9353789
$$ plain form
11271 -11782432 -15412711 10404321 -5513315 6707311 8855666 6969325 8311315 8833141
11263 8833141 -6241432 21104528 -37889481 -16383300 -8675452 -9833412 -26656552 7529094
11254 -10866512 -29338311 -6338367 -18645032 7305639 19892694 25714823 11579854
11246 36148134 -5019062 16114790 15357117 15356788 -17811772 -10176726 -27214511 -35324999
11238 -35324999 4405822 -13699697 19441850 -35224098 54165543 -21701392 23709638
11230 -34203093 34057441 4228518 13031211 5507297 -26337593 4883468 -11737557 -9718760
11222 -9718760 -8419580 9121477 -8625905 2345092 62295166 16632088 -52407632 29404915
11213 5681354 6997616 -12716733 23901224 9505319 -22465264 -23115107 20638018 49991807
11205D9991807D724652K0469734b4731672K551093i047797j4643264f940536G728119
11196d0269763a3619997k3188081A0883240c295275C3892067b4347863P108291
11189a7239572K154841j6294828A6357451a1845506I995561a0549588E490666
11181e815845j0617234j2733847C648206b6409818j0515443A6262698a7432531
11173a1621585k1762494d147481r181655E0534073c038187l6911146H207230b1310618
11164a8246205B9196473i627589E663576b8991089i500545o384770B7122382b9858253
11155E351572L5268535b1448833H708753R640039G299437a5598395A776322c282956
11146e2597037a442131l2548822a5653527D901786R12790c201222j0016804E353735
$$ plain form
11205 49991807 4724652 25194386 -24731672 -22180579 -9047797 -23691061 -6940536 7728119
11196 -40269763 -13619997 -36808078 10883240 -3295275 33892067 -24347863 -17239572
11189 -17239572 -15084731 -31379559 16357451 -11845506 9995561 -10549588 5490666
11181 -5815845 -16433079 -29166926 3648206 -26409818 -36925261 16262698 -17432531
11173 -11621585 -33384079 -4147481 -13329136 50534073 -3038187 -39949333 8207230 -21310618
11164 -18246205 29196473 -9627589 5663576 -28991089 -9500545 -15885315 27122382 -29858253
11155 5351572 40620107 -21448833 8708753 18348792 7299437 -15598395 1776322 -3282956
11146 -52597037 -1442131 -33990953 -15653527 4901786 5814576 -3201222 -13218026 5353735
11137a7649384M528789j3861130d817450C7326742K5007257a6770804A0713969
11129h338530C6473331A3681771m202445J4239128o980660c736580A0760550K3301863
11121C4062413q419034j2394887i184918k7351718B358848b3919586D209808J674200
11113E884008J1052204l133497J627028a9523865G870566b5620840B2203250a4939922
11104C0892539b6422539C3678137A0283765C598277c4669662a337764j0377825
11097a1715589A3075326B832935J1114879J1201032b1460735f300633B3971465
11089a9999489j4022238A1823753J6479459b9342068A4561833K2408638j7479792
11082A9490679J0055690e02748j673877E7698064d443524d62125q788917l7142825
$$ plain form
11137 -17649384 -13120595 -26981725 -4817450 37326742 62333999 -16770804 10713969
11129 -8338530 36473331 13681771 9479326 23718454 16737794 -3736580 10760550 34062413
11121 34062413 25643379 13248492 -9184918 -36536636 2358848 -23919586 4209808 5884008
11113 5884008 16936212 13802715 15429743 -19523865 7870566 -25620840 22203250 -14939922
11104 30892539 -26422539 33678137 10283765 3598277 -34669662 -1337764 -11715589
11097 -11715589 13075326 2832935 13947814 25148846 -21460735 -6300633 23971465
11089 -19999489 -34021727 11823753 28303212 -29342068 14561833 36970471 19490679
11082 19490679 29546369 -502748 -2176625 57698064 -4443524 -462125 -9251042 -46393867
11074d6393867C556228b6837876F644525c270090H972276b9942161n533087A182487
11065A6698799a982187j5926791F78050c5729681R906539B1025354b640302m694546
11057g334848A2889122N4379809c0451358J0247624R895915m385895I845355A930971
11048a3644778E608223J0613861c7680317a5222413j763903K821190N137835k6389304
11040c5416595J5371043B7422630c650809A1173027N850404B174539d5055580
11032B35953J7197144f590314j424629b795741k2235407C817525a1731234A3667544
11023F331049b0370081C4719662b4943299D2541034E202808i906290b940756A3666376
11014A4474014L1219486a6782769j3429593F835394o83996b2455007A9295098
$$ plain form
11074 -46393867 3556228 -26837876 6644525 -3270090 8972276 -29942161 -35475248 1182487
11065 16698799 -1982187 -17908978 678050 -35729681 -25823142 21025354 -2640302 -7334848
11057 -7334848 12889122 67268931 -30451358 -20203734 -10307819 -14693714 9845355 1930971
11048 -13644778 5608223 16222084 -37680317 -15222413 -16986316 -14165126 -9027291 -35416595
11040 -35416595 -20045552 27422630 -3650809 11173027 17023431 2174539 -45055580
11032 235953 17433097 -6590314 -8014943 -2795741 -25031148 3817525 -11731234 13667544
11023 6331049 -20370081 34719662 -24943299 42541034 5202808 -9906290 -2940756 13666376
11014 14474014 45693500 -16782769 -30212362 6835394 6151398 -22455007 19295098
11006a4199383K388091F028842b239385j4337042C118876a2165092D9190787B2019506
10997B9071130b286545A1014391i026178A2872974b5487028B176500P754117L339630
10989A3270247l785157K7068767j5821966a8369206C5442088C099867Q290098
10982A1389965a213750A9029731b9711371j3300500A005813a6320060g117217
10974I618349a1819638A8244202Q866116b7368242i1640k8609511B809742J1287004
10966A4096746L564929c5123306j603240B4635180h117329j0334518B857302K4135236
10958B6992538c416448A9461023c941004k242980k2185681A354353K8133668r048591
10950B0439430a2019961F575596Q700394d619320l567812l771225j1049368A1107018
$$ plain form
11006 -14199383 -11811292 6028842 -2239385 -16576427 3118876 -12165092 49190787 22019506
10997 29071130 -2286545 11014391 -9026178 12872974 -25487028 2176500 9930617 13270247
10989 13270247 9485090 36553857 20731891 -18369206 35442088 3099867 11389965
10982 11389965 -1213750 19029731 -29711371 -43011871 1005813 -16320060 -7117217
10974 9618349 -11819638 18244202 27110318 -27368242 -91640 -28701151 2809742 14096746
10966 14096746 17661675 -35123306 -36726546 24635180 -8117329 -18451847 2857302 26992538
10958 26992538 -3416448 19461023 -3941004 -6183984 -28369665 1354353 29488021 20439430
10950 20439430 -12019961 6575596 15275990 -4619320 -8187132 -11958357 -23007725 11107018
10941E3457834g024554k8191066A3256641q48880a4351091H266165B561066h288631
10932E5222787a1729981A1084637J3669757G544747K4031790F024526N728005
10925A1752531c9181034C858218J5964919a4584076j3604606k6066259A1550105
10917g4782180c3350094B9622561l313553a8499689i091532B5014448a162528
10909c6693467E799431O771957k357512J0848295K5499654i217143F6307257b1327483
10900A0917808i259024C8840609D000588b994765k7322867J4209135A7043398
10892a1328384o966105A0416934a6126193B9336544h862472K123469B6259804
10884C4530884G052640N664631D476694c0950302c264990j1089878k0207293a2133487
$$ plain form
10941 53457834 -7024554 -35215620 13256641 12407761 -14351091 8266165 2561066 -8288631
10932 55222787 -11729981 11084637 24754394 7544747 31576537 6024526 11752531
10925 11752531 -39181034 3858218 19823137 -14584076 -28188682 -54254941 11550105
10917 -74782180 -33350094 29622561 26309008 -18499689 -9091532 25014448 -1162528
10909 -36693467 5799431 12571388 10213876 21062171 46561825 -9217143 66307257 -21327483
10900 10917808 -9259024 38840609 4000588 -2994765 -30317632 -16108497 17043398
10892 -11328384 -18294489 10416934 -16126193 29336544 -8862472 -6739003 26259804
10884 34530884 7052640 12717271 4476694 -30950302 -3264990 -14354868 -34562161 -12133487
10875a0172740P86928A2257391a7050320C2984526l009675b8749566R290304Q996470
10867a0462792A4625150j171827c75294A3572947c23810m8847633f187100j0191899
10859a6378999h133745D3348333h54973k129722e38073G496246a860644k2259050
10851b4119694l314266l597264a1411007L421218j0682837m623900A5224705i763489
10842h900119m08129l1172632A4465672h503481L296454D3270820h548065A2461967
10833a008381m722667o320074e463488l2761433g882585C4140581c016347j4026712
10825a7043059k0255198J7690714B5217840b878134A6231021J9506251h078883
10817A3902376e747231F16467c6263883j4086199C062109f543956M49461k600408
$$ plain form
10875 -10172740 -9385812 12257391 -17050320 32984526 29974851 -28749566 -19459262 -10462792
10867 -10462792 14625150 13453323 -375294 13572947 -323810 -49171443 -6187100 -16378999
10859 -16378999 -8133745 43348333 -854973 -2984695 -538073 7496246 -1860644 -24119694
10851 -24119694 -27433960 -31031224 -11411007 -7989789 -18672626 -23296526 15224705 -9763489
10842 -8900119 -9308248 -40480880 14465672 -8503481 -5207027 43270820 -8548065 12461967
10833 -1008381 -5731048 -12051122 -5463488 -38224921 -7882585 34140581 -3016347 -17043059
10825 -17043059 -37298257 -19607543 25217840 -2878134 16231021 35737272 -8078883
10817 13902376 -5747231 616467 -36263883 -50350082 3062109 -6543956 -6094495 -8694903
10809h694903k0483112E170294a0842887j5773137J587789A7895964a5857479
10801B0214465h28092k6986879B3827915c7357145B0622444a660315j0748415
10794a2408730H740864K9685802h680875L844741n583216j2883503B0947233A326858
10785G797077a237035m284675k3832623B9225537a4690386k2843506C0838788
10777C765505J6834862K6569204c285422q435753k714073D610533b2482415B3304796
10768a5509898f956785J174763p793033o900542p905631B6214032a6093205M640426
10760a1452779C1495442E903619a7094530b312712C0999888a9639608g249500
10752f627414F266174a6414530e541468n076208H26458J4808777c2696015J3725132
$$ plain form
10809 -8694903 -29178015 5170294 -10842887 -26616024 -25028235 17895964 -15857479
10801 20214465 -828092 -27814971 23827915 -37357145 20622444 -1660315 -12408730
10794 -12408730 8740864 38426666 -8680875 -4836134 -10419350 -23302853 20947233 1326858
10785 7797077 -1237035 -5521710 -29354333 29225537 -14690386 -37533892 30838788
10777 3765505 20600367 47169571 -3285422 -11721175 -14435248 4610533 -22482415 23304796
10768 -15509898 -6956785 -5782022 -13575055 -20475597 -28381228 26214032 -16093205 -11452779
10760 -11452779 31495442 5903619 -17094530 -2312712 30999888 -19639608 -7249500
10752 -6627414 6266174 -16414530 -5541468 -10617676 826458 15635235 -32696015 -18970883
10744a8970883n400995B1065544f824054A9473038a4066635H50514a7714840O489560
10736a1225280F756058J5182254c1482145Q731476o402537g161504j9800709J2892742
10728a4069471k63205D437698a1505528A1424370j70687q55895J3200433l743364
10720A9854857a0168178B0188258J0886518A0759135D38458c0076483A788180
10712c4407309A4129152m935669a4583035B0086856F310013a3798978N857519
10705g941459r275640C278305e592848E6014K5273567a6648988A6940672N202122
10697B2142794H057548b6924249f28845B9521871A4752513N64793c45492k3091943
10689b3437435A9907457J1638432C976915J915324b8475990A5177691a557583
$$ plain form
10744 -18970883 -24371878 21065544 -6824054 19473038 -14066635 850514 -17714840 -11225280
10736 -11225280 6756058 21938312 -31482145 -22750669 -29153206 -7161504 -26962213 -14069471
10728 -14069471 -14332676 4437698 -11505528 11424370 11253683 10397788 23598221 19854857
10720 19854857 -10168178 20188258 31074776 10759135 438458 -30076483 1788180
10712 -34407309 14129152 9193483 -14583035 20086856 6310013 -13798978 -7941459
10705 -7941459 -17217099 3278305 -5592848 56014 25329581 -16648988 16940672 22142794
10697 22142794 8057548 -26924249 -628845 29521871 14752513 15317306 -345492 -23437435
10689 -23437435 19907457 31545889 3976915 5892239 -28475990 15177691 -1557583
10681c468236k8912676P66684j1966497H207298b8158086g488547p845B7417516
10672A5337233M4563355b0384528M858382A2871622b3262923b901372J318232
10665a583140G115133A882514L1125646A0975213b1098433A3105958c5480736
10657B8971076c3285174h268636D04634h589564A2617282e992649k2806103a18475
10648c5786299A291433a4517065l526727c92229k1700701B946451J5578970a2952552
10639c4409478i357962B3811881b1823591A1695140j452381D951946b971613l967860
10631f939473b065171k3928358H59115d2451499e241562D2181540e8953740C225366
10622a3835900I147273A857350a4183772C5303687e756004k773278M2029G597056
$$ plain form
10681 -3468236 -32380912 -31614228 -43580725 8207298 -28158086 -7488547 -7496392 27417516
10672 15337233 59900588 -20384528 -15526146 12871622 -23262923 -2901372 -1583140
10665 -1583140 7115133 1882514 33008160 10975213 -21098433 13105958 -35480736
10657 28971076 -33285174 -8268636 404634 -8589564 12617282 -5992649 -28798752 -118475
10648 -35786299 1291433 -14517065 -18043792 -392229 -22092930 2946451 18525421 -12952552
10639 -34409478 -9357962 23811881 -21823591 11695140 10242759 4951946 -2971613 -6939473
10631 -6939473 -2065171 -25993529 859115 -42451499 -5241562 42181540 -58953740 3225366
10622 -13835900 9147273 1857350 -14183772 35303687 -5756004 -8529282 -8487253 7597056
10613a1583171A755996R38567I30812N550995a2336354D6919878F183312e486276
10604a4085874j9340067a545805D3202039j4761925a8209636e140244r294762
10597a4435006k0016331A5496334e412069k7641919M836216l901454j2427078
10590d4546304a4699679B15620a116051A0835619J2348435D469580J6889710b586042
10581A4103230a5283392A601249J5938161a5472889m710539D526057c5298869
10573E81780J2011000J0314156a4640504c566841n915822F189382M921959c6151726
10564C780400K8182991c5344642h202651A603708J3972431a9205941g522248L333928
10556d188320A3829701d532018k4146114c567397c90705l538966j0616686B3239036
$$ plain form
10613 -11583171 1755996 2694563 930812 6481807 -12336354 46919878 6183312 -5486276
10604 -14085874 -33425941 -1545805 43202039 28440114 -18209636 -5140244 -14435006
10597 -14435006 -34451337 15496334 -5412069 -33053988 -28217772 -32119226 -44546304
10590 -44546304 -14699679 215620 -1116051 10835619 23184054 4469580 21359290 -2586042
10581 14103230 -15283392 1601249 17539410 -15472889 -20183428 4526057 -35298869
10573 581780 12592780 22906936 -14640504 -3566841 -9482663 6189382 11111341 -36151726
10564 3780400 31963391 -35344642 -8202651 1603708 15576139 -19205941 -7522248 -4188320
10556 -4188320 13829701 -4532018 -28678132 -3567397 -390705 -3929671 -14546357 23239036
10547A3732705R48055o560059f824963D782885m54655c1898329G370500J6643323
10539B4013823m372594e578719l154822A8748875b4387748B4197690C971758a0174399
10530a5365814B4585218c915826A298401M38277a0476066r415230B7213702g905752
10521b6166512a2960276b639428m0468024a4212466l343277I112971f780420j5427235
10513b2207655a988443k7650411A4223930b4060829A8873998d285745B5603652
10505c15956l568425E041856a9756144A0946846K613546d7735357F660782i35992
10496H484503M470975d3551670a6650154A5475124i966875A2626117b879860j5976572
10488a8856432C117451a3017125d677574n879541j1647612p955287I584388C363630
$$ plain form
10547 13732705 14680760 8120701 -6824963 4782885 4328230 -31898329 7370500 24013823
10539 24013823 19641229 -5578719 -8733541 18748875 -24387748 24197690 3971758 -10174399
10530 -15365814 24585218 -3915826 1298401 1736678 -10476066 -19891296 27213702 -7905752
10521 -26166512 -12960276 -2639428 -43107452 -14212466 -17555743 9112971 -6780420 -22207655
10513 -22207655 -1988443 -29638854 14223930 -24060829 18873998 -4285745 25603652
10505 -315956 -3884381 5041856 -19756144 10946846 13560392 -47735357 6660782 -935992
10496 8484503 12955478 -43551670 -16650154 15475124 -9966875 12626117 -2879860 -18856432
10488 -18856432 3117451 -13017125 -4677574 -10557115 -22204727 -30160014 9584388 3363630
10479h523486j2439822C6162286D674672b4474871a1789168A9281866H686905
10471I306646c799682l6696345a8349448G54893b8742065e032748E67255b1414707
10462b6207746A5423810b2497622a0320569m1661485A0962042Q117757a995598
10454B3397037c757786C0520924p320923a9266832D152079e0449416B5194461
10446a866818E524822K0850327a9192958C5493957c0333313k577970a1051629
10438b0309631O928608B4948782a553163B3305470a7378316b316686B3767621
10430A408453c2682437a5335089M078088K080316M224294j2936914B3820141i113331
10421c059088H558748R898892J1464530b3301707n666077a1881536C1020909B72557
$$ plain form
10479 -8523486 -20963308 36162286 4674672 -24474871 -11789168 19281866 8686905
10471 9306646 -3799682 -40496027 -18349448 754893 -28742065 -5032748 567255 -21414707
10462 -26207746 15423810 -22497622 -10320569 -51982054 10962042 19079799 -1995598
10454 23397037 -3757786 30520924 23200001 -19266832 4152079 -50449416 25194461
10446 -1866818 5524822 26375149 -19192958 35493957 -30333313 -32911283 -11051629
10438 -20309631 -13381023 24948782 -1553163 23305470 -17378316 -2316686 23767621
10430 1408453 -32682437 -15335089 -11257001 -9176685 -4952391 -17889305 23820141 -9113331
10421 -3059088 8558748 18457640 29922170 -23301707 -28967784 -11881536 31020909 272557
10412a1926002A8004369e2175197a1934537d659491C1558041b6461645L275974
10405b3185671c263726a252457C0245577H039382b1908199n393897B6483201c3194983
10396a2364625B5997191F005898M382218J5274676n614437p18987r600199b7852203
10387a7620338P867572J255073k0530239r771629r959890B7072809a7918531B2249232
10378d453586j0355483M971066k5235704J3687281F233763c988205C1226960A5497125
10369C8245044f4426020H296504a6690424j121809A4913301a5979714O466527
10362i513187m330502B9970612c3085473A1233252b3547103P390337A2309497
10354a9180320C9811949a3460851j6483663A5315888P504853D31857O946990J8937849
$$ plain form
10412 -11926002 18004369 -52175197 -11934537 -4659491 31558041 -26461645 -23185671
10405 -23185671 -3263726 -1252457 30245577 8039382 -21908199 -27302096 26483201 -33194983
10396 -12364625 25997191 6005898 10388116 25662792 20048355 19329368 9729169 -27852203
10387 -17620338 -9752766 -8497693 -29027932 -38799561 -48759451 27072809 -17918531 22249232
10378 -4453586 -14809069 -9838003 -35073707 -21386426 6233763 -3988205 31226960 15497125
10369 38245044 -64426020 8296504 -16690424 -17812233 14913301 -15979714 -9513187
10362 -9513187 -13843689 29970612 -33085473 11233252 -23547103 -16156766 12309497
10354 -19180320 39811949 -13460851 -29944514 15315888 22820741 431857 7378847 26316696
10346B6316696b095184k558884B5192251B558354K074519Q096293a0724894D593642
10337a664965j4891867C4282758j3911722d8864956E163543a7622175A1781909
10329B3270949b6101664i787825A770237b393093o951425o990253N220131K954438
10321h160202q745773n444942B2748379J3313472g230855l1038182h770796M193128
10313d577668n9713559b609320F65356a4175750f086848D4798391A9131167h820892
10304a5222415L167335A0229704J3631783g394562C2080320j1808177C523136
10296f831261l43576o685869b534123A2876767L148135c1907028a4454062E445726
10287a5788719b346766l2406600K319504b68660j924821C303280M022574a0581437
$$ plain form
10346 26316696 -2095184 -4654068 25192251 2558354 4632873 12729166 -10724894 4593642
10337 -1664965 -16556832 34282758 20371036 -48864956 5163543 -17622175 11781909
10329 23270949 -26101664 -9787825 1770237 -2393093 -9344518 -16334771 -11114640 -8160202
10321 -8160202 -16905975 -22350917 22748379 36061851 -7230855 -38269037 -8770796 -4577668
10313 -4577668 -64291227 -2609320 665356 -14175750 -6086848 44798391 19131167 -8820892
10304 -15222415 -12055080 10229704 23861487 -7394562 32080320 20272143 3523136
10296 -6831261 -7174837 -13860706 -2534123 12876767 16024902 -31907028 -14454062 5445726
10287 -15788719 -2346766 -34753366 -32433862 -268660 -2193481 3303280 7325854 -10581437
10278B4180800a6461746n139564I187073d40110p364898m7645970H319469c3136909
10269e2183099D472780b2233541E873395k128431C5438b3243528d896745l1336085
10261c6232830R600797B0539643b7041510e277242j245295j2509850l0048236
10254d9080623C3843903l489964b1671451f570393k3193845B2107888r385604
10247A2722284b1693997B7611244f5056562E539443H75054a3993959e182394A7947999
10238E1428070a7557704e612289L68576j0428646B2041652c2238664a401271j9555942
10230b0957213N158231o437251P411645A424358a0065568H13376a1500674D212669
10221a0426364j6014174C23843c8453999B0527847b112127m440420o262960j9978280
$$ plain form
10278 24180800 -16461746 -21601310 9187073 -440110 -7805008 -55450978 8319469 -33136909
10269 -52183099 4472780 -22233541 5873395 3744964 35438 -23243528 -4896745 -36232830
10261 -36232830 -26632033 20539643 -27041510 -5277242 -6522537 -19032387 -49080623
10254 -49080623 33843903 30353939 -21671451 -6570393 -29764238 22107888 12722284
10247 12722284 -21693997 27611244 -65056562 5539443 875054 -13993959 -5182394 17947999
10238 51428070 -17557704 -5612289 -5243713 -15672359 22041652 -32238664 -1401271 -20957213
10230 -20957213 -15798982 -22236233 -14824588 1424358 -10065568 813376 -11500674 4212669
10221 -10426364 -26440538 323843 -38453999 20527847 -2112127 -6552547 -12815507 -32793787
10213c2793787l990238B4150645a6687970m3196499b3548460j0786206O97850
10206c3636816I223538c41713k744667a359725p174683n180351K493380j7979671
10198b9201050J962739l071396b916539l0508205k0857351b6738501c940944J147148
10190b793796E113457a4137002A1925646M576688i868849j7051094J1438593D8816967
10181c4319687C848996c8023005a1090713a528845n892728A2111582O209423a9581198
10172b662160k2969047H46597J5349149N858753J4274811A1893916D88627b9791528
10163A4908427g202855E7862488a4438171B7906079e0577171i830984d274861
10155a1737844K637018A4259360g257655o963723l8269104a1051293m694475B07509
$$ plain form
10213 -32793787 -36784025 24150645 -16687970 -59884469 -23548460 -34334666 -33636816
10206 -33636816 9223538 -341713 -3086380 -1359725 -8534408 -13714759 -11221379 -29201050
10198 -29201050 -27238311 -30309707 -2916539 -33424744 -54282095 -26738501 -3940944 -2793796
10190 -2793796 5113457 -14137002 11925646 16502334 -9868849 -26919943 -15481350 48816967
10181 -34319687 3848996 -38023005 -11090713 -1528845 -7421573 12111582 18321005 -19581198
10172 -2662160 -25631207 846597 16195746 22054499 36329310 11893916 488627 -29791528
10163 14908427 -7202855 57862488 -14438171 27906079 -50577171 -9830984 -4274861
10155 -11737844 -9100826 14259360 -7257655 -14221378 -52490482 -11051293 -15745768 207509
10146I193440c9927163m2793334b669760l876747j5213139B0782418B466077q63075
10138A603002c1145840k6236475H332399P351935E769520h545337A4292632p075548
10130G217084b1604804G935220b9204292E086757d7846687K0123501P413669F132132
10121A0284878a5906596N458036q711199q828205B6387018F907659a6963095O077453
10113a0885642J053298k762305o80352B525335a6747362A1675897d8010859c388154
10104b3956594H139291a0628994k5363313A5584145B660650b2293531A8301960
10096b0207649q89240k8920571B2550596a3396713j7120396B0176578L380771
10089B3557349N061221a9400531k4356242o980244B831659b7837444M642598Q901841
$$ plain form
10146 9193440 -39927163 -82720497 -2669760 -6546507 -21759646 20782418 2466077 1603002
10138 1603002 -31145840 -57382315 8332399 15684334 5769520 -8545337 14292632 7217084
10130 7217084 -21604804 7935220 -29204292 5086757 -47846687 -27723186 -20309517 6132132
10121 10284878 -15906596 -10448560 -19159759 -27987964 26387018 6907659 -16963095 -10885642
10113 -10885642 -9832344 -12594649 -13275001 2525335 -16747362 11675897 -48010859 -3388154
10104 -23956594 8139291 -10628994 -35992307 15584145 2660650 -22293531 18301960
10096 -20207649 -21096889 -50017460 22550596 -13396713 -30517109 20176578 23557349
10089 23557349 28618570 -19400531 -43756773 -50737017 2831659 -27837444 -23194846 -14293005
$$ [...]
##END NTUPLES=NMR SPECTRUM
##END=
