##TITLE=ST0000_MeOD-4_7212735_VkaFngzLdu
##JCAMPDX= 6.0         $$ Bruker NMR JCAMP-DX V2.0
##DATA TYPE= NMR SPECTRUM
##DATA CLASS= NTUPLES
##ORIGIN= BRUKER
##OWNER= Administrator
$$ 1.72 TOPSPIN		Version 2.1
$$ 2013-10-12 01:15:19.301 -0700  Administrator@X
$$ Compression mode = diff/dup
##.OBSERVE FREQUENCY= 400.02188249412
##.OBSERVE NUCLEUS= ^1H
##.ACQUISITION MODE= SIMULTANEOUS (DQD)
##.ACQUISITION SCHEME= undefined
##.AVERAGES= 64
##.DIGITISER RES= 22
##SPECTROMETER/DATA SYSTEM= spect
##.PULSE SEQUENCE= noesygpps1d.comp
##.SOLVENT NAME= COFFEE_meoh
##.SHIFT REFERENCE= INTERNAL, COFFEE_meoh, 1, 14.98509
##AUDIT TRAIL= $$ (NUMBER, WHEN, WHO, WHERE, PROCESS, VERSION, WHAT)
$$ ##TITLE= Audit trail, TOPSPIN		Version 2.1
$$ ##JCAMPDX= 5.01
$$ ##ORIGIN= Bruker BioSpin GmbH
$$ ##OWNER= Administrator
$$ $$ E:\/data/COFFEE/nmr/ST0000_MeOD-4_7212735_VkaFngzLdu/12/pdata/1/auditp.txt
$$ ##AUDIT TRAIL=  $$ (NUMBER, WHEN, WHO, WHERE, PROCESS, VERSION, WHAT)
(   1,<2013-10-12 01:15:14.505 -0700>,<Administrator>,<X>,<go>,<TOPSPIN 2.1>,
      <created by zg
	started at 2013-10-12 01:03:45.018 -0700,
	POWCHK enabled, PULCHK disabled,
       configuration hash MD5:
       C8 4E 4E 5D D3 5C D8 9E 9F 52 82 E0 59 8A DE 15
       data hash MD5: 64K
       13 82 B3 FA B8 80 44 64 BA 94 EA 7F 97 C4 1C 72>)
(   2,<2013-10-12 01:15:17.536 -0700>,<Administrator>,<X>,<proc1d>,<TOPSPIN 2.1>,
      <Start of raw data processing
       efp LB = 0.3 FT_mod = 6 PKNL = 1 PHC0 = 0 PHC1 = 0 SI = 128K 
       data hash MD5: 128K
       D9 8F 45 39 0B 8B 6C D0 CE 99 E7 03 5B 37 7E F1>)
(   3,<2013-10-12 01:15:18.317 -0700>,<Administrator>,<X>,<proc1d>,<TOPSPIN 2.1>,
      <pk PHC0 = 216.134 PHC1 = 0 
       data hash MD5: 128K
       00 C7 FF 9D 7A 7A 95 81 1A A0 20 02 DB A5 DF 73>)
(   4,<2013-10-12 01:15:18.786 -0700>,<Administrator>,<X>,<proc1d>,<TOPSPIN 2.1>,
      <abs ABSG = 1 
       data hash MD5: 128K
       65 71 37 49 ED EC C6 77 ED 39 A6 30 51 99 2D 8F>)
(   5,<2013-10-12 01:15:18.864 -0700>,<Administrator>,<X>,<proc1d>,<TOPSPIN 2.1>,
      <abs ABSG = 2 
       data hash MD5: 128K
       F1 E5 52 A7 39 F2 C8 8D 0F C1 E9 A0 32 DC E2 34>)
(   6,<2013-10-12 01:15:18.942 -0700>,<Administrator>,<X>,<proc1d>,<TOPSPIN 2.1>,
      <abs ABSG = 3 
       data hash MD5: 128K
       CA 8C 8E 7D 5A 26 79 4F B8 5F 0A F4 67 69 65 B5>)
(   7,<2013-10-12 01:15:19.020 -0700>,<Administrator>,<X>,<proc1d>,<TOPSPIN 2.1>,
      <abs ABSG = 4 
       data hash MD5: 128K
       C4 61 E2 8F A8 B7 C7 A4 52 92 27 18 88 70 E6 83>)
(   8,<2013-10-12 01:15:19.098 -0700>,<Administrator>,<X>,<proc1d>,<TOPSPIN 2.1>,
      <abs ABSG = 5 
       data hash MD5: 128K
       B3 47 7B 3C 2E 46 A0 2C 9A E6 FE 66 6B 4A FD F0>)
$$ ##END=
$$ 
$$ $$ hash MD5
$$ $$ F0 9A AE 37 82 A3 A5 70 B3 5A A3 C2 12 A2 4A 24
##$RELAX= 
##$RELAX= 
##$RELAX= 
##$RELAX= 
##$RELAX= 
##$RELAX= 
##$RELAX= 
##$RELAX= 
$$ Bruker specific parameters
$$ --------------------------
##$DU= <E:\>
##$EXPNO= 12
$$ [...]
150 150 150 150 150 150 150 150
##$TP07= 0
##$TPNAME0= <>
##$TPNAME1= <>
##$TPNAME2= <>
##$TPNAME3= <>
##$TPNAME4= <>
##$TPNAME5= <>
##$TPNAME6= <>
##$TPNAME7= <>
##$TPOAL= (0..7)
0.5 0.5 0.5 0.5 0.5 0.5 0.5 0.5
##$TPOFFS= (0..7)
0 0 0 0 0 0 0 0
##$TUNHIN= 0
##$TUNHOUT= 0
##$TUNXOUT= 0
##$USERA1= <user>
##$USERA2= <user>
##$USERA3= <user>
##$USERA4= <user>
##$USERA5= <user>
##$V9= 5
##$VALIST= <valist>
##$VCLIST= <CCCCCCCCCCCCCCC>
##$VD= 0
##$VDLIST= <DDDDDDDDDDDDDDD>
##$VPLIST= <PPPPPPPPPPPPPPP>
##$VTLIST= <TTTTTTTTTTTTTTT>
##$WBST= 1024
##$WBSW= 4
##$XGAIN= (0..3)
0 0 0 0
##$XL= 0
##$YL= 0
##$YMAX_a= 17492
##$YMIN_a= -20082
##$ZGOPTNS= <>
##$ZL1= 120
##$ZL2= 120
##$ZL3= 120
##$ZL4= 120
##$ABSF1= 14.98509
##$ABSF2= -5.573092
##$ABSG= 5
##$ABSL= 3
##$ALPHA= 0
##$AQORDER= 0
##$ASSFAC= 0
##$ASSFACI= 0
##$ASSFACX= 0
##$ASSWID= 0
##$AUNMP= <proc_prof1d_extract.lims>
##$AXLEFT= 0
##$AXNAME= <>
##$AXNUC= <1H>
##$AXRIGHT= 0
##$AXTYPE= 0
##$AXUNIT= <>
##$AZFE= 0.1
##$AZFW= 0.1
##$BCFW= 0
##$BC_mod= 0
##$BYTORDP= 0
##$COROFFS= 0
##$CY= 15
##$DATMOD= 1
##$DC= 0
##$DFILT= <>
##$DTYPP= 0
##$F1P= 0
##$F2P= 0
##$FCOR= 0.5
##$FTSIZE= 131072
##$FT_mod= 6
##$GAMMA= 0
##$GB= 0
##$INTBC= 1
##$INTSCL= 1
##$ISEN= 128
##$LB= 0.3
##$LEV0= 0
##$LPBIN= 0
##$MAXI= 10000
##$MC2= 0
##$MEAN= 0
##$ME_mod= 0
##$MI= 0
##$NCOEF= 0
##$NC_proc= -11
##$NLEV= 6
##$NOISF1= 0
##$NOISF2= 0
##$NSP= 0
##$NTH_PI= 0
##$NZP= 0
##$OFFSET= 14.98509
##$PC= 1
##$PHC0= 216.134
##$PHC1= 0
##$PH_mod= 1
##$PKNL= yes
##$PPARMOD= 0
##$PPDIAG= 0
##$PPIPTYP= 0
##$PPMPNUM= 2147483647
##$PPRESOL= 1
##$PSCAL= 4
##$PSIGN= 0
##$PYNMP= <proc.py>
##$REVERSE= no
##$SF= 400.02
##$SI= 131072
##$SIGF1= 0
##$SIGF2= 0
##$SINO= 400
##$SIOLD= 131072
##$SPECTYP= <>
##$SREGLST= <1H.CDCl3>
##$SSB= 0
##$STSI= 131072
##$STSR= 0
##$SW_p= 8223.68421052631
##$SYMM= 0
##$S_DEV= 0
##$TDeff= 65536
##$TDoff= 0
##$TI= <>
##$TILT= no
##$TM1= 0
##$TM2= 0
##$TOPLEV= 0
##$USERP1= <user>
##$USERP2= <user>
##$USERP3= <user>
##$USERP4= <user>
##$USERP5= <user>
##$WDW= 1
##$XDIM= 131072
##$YMAX_p= 155496505
##$YMIN_p= -304532693
##$CURPLOT= <Network HP LaserJet P1505>
##$CURPRIN= <$Network HP LaserJet P1505>
##$DFORMAT= <normdp>
##$LAYOUT= <+/1D_H.xwp>
##$LFORMAT= <normlp>
##$PFORMAT= <normpl>
##$SURQMSG= 1
$$ End of Bruker specific parameters
$$ ---------------------------------
##NTUPLES= NMR SPECTRUM
##VAR_NAME=  FREQUENCY,     SPECTRUM/REAL,   SPECTRUM/IMAG
##SYMBOL=    X,             R,               I
##VAR_TYPE=  INDEPENDENT,   DEPENDENT,       DEPENDENT
##VAR_FORM=  AFFN,          ASDF,            ASDF
##VAR_DIM=   131072,        131072,          131072
##UNITS=     HZ,            ARBITRARY UNITS, ARBITRARY UNITS
##FACTOR=    0.0627417313425164, 1,          1
##FIRST=     8223.62146879497, -340617,      -2099892
##LAST=      0,             528204,          -2510903
##MIN=       0,             -304532693,      0
##MAX=       8223.62146879497, 155496505,    0
$$ Real data points
##PAGE= N=1
##DATA TABLE= (X++(R..R)), XYDATA
$$ [...]
##PAGE= N=2
##DATA TABLE= (X++(I..I)), XYDATA
$$ plain form
71167 681770 1456257 1776291 1620679 1407698 1366351 1302553 1022360 645992 363585 163264
71156 -3243 -9806 243745 550303 564633 234077 -116033 -150129 125166 399714 406560 211324
71145 211324 123390 278400 396013 115701 -469561 -871959 -870784 -836451 -1185328 -1718565
71135 -1718565 -1805761 -1158458 -141546 685809 1074632 1073367 785614 342924 -18119 -82857
71125 -82857 125283 382633 529362 588246 607931 529090 305884 68586 10279 115857 148600
71114 148600 -40941 -310418 -408043 -252620 79784 552532 1178958 1855087 2344874 2471607
71104 2471607 2221038 1646694 802287 -191499 -1128028 -1824217 -2185336 -2168648 -1817394 -1353502
71094 -1353502 -1057687 -957071 -784706 -387696 -35910 -118787 -602876 -1025677 -1057221 -863877
$$ packed form
71167F81770P74487L20034j55612k12981m1347o3798k80193l76368k82407A63264
71156c243o563B43745L06558J4330B34077a16033l4096A25166K74548O846j95236
71145B11324q7934J55010J17613A15701d69561m02398J175L4333l48877n33237
71135a718565q7196O47303a41546F85809L88823j265k87753C42924a8119o4738
71125h2857A25283K57350J46729N8884J9685p8841k23206F8586A0279J05578L2743
71114A48600d0941k69477r7625J55423G9784M72748O26426O76129M89787J26733
71104B471607k50569n74344H02287a91499r36529o96189l61119J6688L51254M63892
71094a353502K95815J00616J72365c87696c5910q2877m84089m22801l1544J93344
$$ plain form
71084 -863877 -817292 -995409 -1123810 -941448 -465412 109911 632098 1035667 1266677 1292377
71074 1292377 1181474 1071589 1019781 950841 784928 547898 315975 131204 36088 108362
71064 108362 355291 622165 719512 627902 496412 469171 580708 737768 685789 109082
71053 -1004467 -2136991 -2660331 -2559338 -2496128 -3018295 -3891059 -4368686 -3971444 -2834074
71044 -2834074 -1452080 -331554 176223 -31957 -764775 -1647727 -2322193 -2566550 -2358043
71035 -2358043 -1919604 -1600521 -1563741 -1646065 -1643443 -1638135 -1863064 -2302820 -2653932 -2706195 -2570530
71024 -2570530 -2450813 -2323640 -1939851 -1094279 128681 1321825 1995680 1975820 1579920
71015 1579920 1299196 1299188 1350114 1242488 1088831 1126838 1356766 1495740 1240108 520409 -413583
$$ packed form
71084h63877M6585j78117j28401J82362d65412A09911N22187M03569K31010K5700
71074A292377j10903j09885n1808o8940j65913k37030k31923A31204C6088P2274
71064A08362K46929K66874R7347r1610j31490k7241J11537J57060n1979A09082
71053a004467j132524n23340J00993O3210n22167q72764m77627L97242J137370
71044b834074J381994c31554A76223c1957p32818q82952o74466k44357K08507
71035b358043M38439L19083L6780q2324K622N308k24929m39756l51112n2263J35665
71024b570530J19717J27173L83789Q45572A28681J193144O73855j9860l95900
71015A579920k80724qN0926j07626j53657L8007K29928J38974k55632E20409d13583
$$ plain form
71003 -1091971 -1116092 -486148 377817 1008225 1251346 1231806 1081807 847139 604741 493244
70993 493244 574687 764194 941837 1060501 1104199 1014867 728410 250173 -353801 -1007862
70983 -1007862 -1614698 -2019147 -2067757 -1743830 -1215798 -717001 -363583 -73456 350652 1031735
70973 1031735 1860949 2529068 2768904 2580510 2171085 1691758 1161414 695644 620656 1134417
70963 1134417 1906973 2273915 1907581 1119022 411595 -68094 -482104 -888456 -1139283 -1143624
70953 -1143624 -989286 -766585 -457901 -70584 262630 402406 342742 187270 56153 22715
70942 41209 -59364 -362747 -630944 -491353 30087 360772 -19109 -922947 -1613260 -1564394
70932 -1564394 -865521 97636 1071227 1933074 2520298 2727570 2719618 2804841 3025901 3022387
$$ packed form
71003a091971k4121d86148C77817O30408K43121j9540j49999k34668k42398j11497
70993D93244Q1443J89507J77643J18664M3698q9332k86457B50173c53801o54061
70983a007862o06836m04449m8610L23927N28032M98797L53418g3456C50652O81083
70973A031735Q29214O68119K39836j88394m09425m79327n30344m65770p4988N13761
70963A134417P72556L66942l66334p88559D11595f8094m14010m06352k50827m341
70953a143624J54338K22701L08684g0584B62630J39776n9664j55472E6153B2715
70942D1209e9364l03383k68197J39591C0087L30685a9109r03838o90313M8866
70932a564394O98873I7636R73591Q61847N87224K07272p952Q5223K21060l514
$$ plain form
70922 3022387 2420055 1306620 212073 -400318 -552822 -622443 -847382 -1064492 -969092 -546571
70912 -546571 -128063 -12700 -148991 -270059 -272742 -324761 -572389 -869584 -923812 -692048
70902 -692048 -507256 -740157 -1392652 -2117146 -2626249 -2973950 -3374688 -3834311 -4092522 -3934277
70892 -3934277 -3440599 -2876485 -2423654 -2109521 -1918995 -1830827 -1754875 -1587652 -1384154 -1344413
70882 -1344413 -1533814 -1724714 -1664101 -1449611 -1465882 -1912641 -2534953 -2902096 -2859372 -2604367
70872 -2604367 -2381897 -2245489 -2138527 -2076088 -2115590 -2158972 -1915855 -1173378 -84216 907091
70861 1443339 1486888 1175592 601939 -154913 -902623 -1438988 -1763194 -2017657 -2225054 -2270029
70851 -2270029 -2171636 -2157935 -2355048 -2569333 -2517222 -2141995 -1583493 -1006304 -637545 -776306
$$ packed form
70922C022387o02332j113435B12073d00318j52504o9621k24939k17110R5400M22521
70912e46571a28063a2700j36291j21068k683n2019k47628k97195n4228K31764
70902f92048J84792k32901o52495p24494n09103l47701m00738m59623k58211J58245
70892c934277M93678N64114M52831L14133J90526Q8168P5952J67223K03498L9741
70882a344413j89401j90900O0613K14490j6271m46759o22312l67143M2724K55005
70872b604367K22470J36408J06962O2439l9502m3382K43117P42477h4216I07091
70861A443339M3549l11296n73653a54913p47710n36365l24206k54463k07397m4975
70851b270029R8393J3701j97113k14285N2111L75227N58502N77189L68759j38761
$$ plain form
70841 -776306 -1436139 -2048767 -1901579 -965183 3905 319516 76774 -145081 -26280 302800
70830 613260 777562 691456 343919 -1249 -10992 216040 130925 -596423 -1598866 -2223131
70820 -2223131 -2259169 -2004533 -1721331 -1361263 -840859 -263705 270818 844685 1519546 2103443
70810 2103443 2297673 1990200 1279223 337910 -570976 -1081866 -998160 -561005 -219820 -128816
70800 -128816 -88634 11589 -13508 -294618 -608715 -646329 -431066 -266160 -348791 -614578
70790 -614578 -892338 -1030029 -911701 -540892 -120964 90864 30774 -170246 -408955 -693303
70780 -693303 -997485 -1190716 -1188324 -1086905 -1073135 -1226791 -1444539 -1541266 -1428978 -1211860
70770 -1211860 -1072622 -1046908 -986991 -799677 -606222 -543314 -504067 -265864 152758 449612
$$ packed form
70841g76306o59833o12628J47188R36396C905L15611G6774a45081b6280C02800
70830F13260J64302q6106C43919a249r743B16040q5115e96423j002443o24265
70820b223131l6038K54636K83202L60068N20404b63705B70818N73867O74861N83897
70810B103443J94230l07473p10977C37910e70976n10890Q3706M37155b19820R1004
70800a28816M0182A1589a3508k81110l14097l7614K15263J64906q2631k65787
70790f14578k77760j37691J18328L70809a20964I0864C0774a70246k38709k84348
70780f93303l04182j93231K392J01419J3770j53656k17748r6727J12288K17118
70770a211860J39238K5714N9917J87314J93455O2908L9247K38203A52758K96854
$$ plain form
70760 449612 370518 -62232 -637612 -1081097 -1086105 -472270 561038 1508008 2011589 2124598
70750 2124598 2047517 1814910 1410280 1001912 794854 718545 512392 111764 -275020 -487954
70740 -487954 -580202 -588505 -361243 218573 965432 1525867 1740251 1733474 1670149 1570954 1412388
70729 1412388 1278781 1294565 1435808 1523115 1443582 1306064 1300742 1446698 1585816 1624459
70719 1624459 1637225 1655713 1504230 1036627 471986 233830 374101 383938 -229990 -1314073
70709 -1314073 -2234453 -2594638 -2516073 -2214771 -1653720 -805331 14906 401783 346693 176812
70699 176812 61210 -98382 -267708 -150878 353635 863153 949487 682740 461024 439633
70689 439633 447314 395117 402312 461495 314204 -163636 -671308 -787633 -474992 -138134 -226681
$$ packed form
70760D49612p9094f2232n75380m43485n008d72270E61038R46970N03581J13009
70750B124598p7081k32607m04630m08368k07058p6309k06153A11764b75020k12934
70740d87954r2248q303K27262B18573P46859N60435K14384o777o3325r9195j58566
70729A412388j33607J5784J41243Q7307p9533j37518n322J45956J39118L8643
70719A624459J2766J8488j51483m67603D71986B33830J40271R837b29990j084083
70709a314073r20380l60185P8565L01302N61051h05331A4906L86877n5090j69881
70699A76812F1210i8382j69326J16830C53635N09518Q6334k66747k21716k1391
70689D39633P681n2197P195N9183j47291a63636n07672j16325L12641a38134q8547
$$ plain form
70678 -226681 -838892 -1630844 -2063785 -1862792 -1324214 -1074107 -1429153 -2069780 -2408665 -2187044
70668 -2187044 -1648642 -1258310 -1344015 -1867409 -2391590 -2389861 -1777469 -1081232 -907058 -1277860
70658 -1277860 -1672310 -1689962 -1475853 -1454001 -1816828 -2353872 -2667568 -2494355 -1905743 -1247656
70648 -1247656 -815656 -573098 -269778 170066 507847 458570 -41744 -868209 -1820778 -2602396
70638 -2602396 -2878025 -2581620 -2094005 -1899409 -2067626 -2257870 -2233576 -2136868 -2151062 -2111400
70628 -2111400 -1685475 -868876 -76588 286352 184691 -147518 -487570 -698456 -670541 -376138
70618 -376138 48795 427823 757435 1175194 1691963 2073908 2054100 1595693 909246 279410
70607 -99616 -222133 -284852 -528349 -969612 -1337442 -1365880 -1118462 -916735 -951233 -1071738
$$ packed form
70678b26681o12211p91952m32941K00993N38578K50107l55046o40627l38885K21621
70668b187044N38402L90332q5705n23394n24181J729O12392O96237J74174l70802
70658a277860l94450j7652K14109K1852l62827n37044l13696J73213N88612O58087
70648a247656M32000K42558b69778A70066L37781m9277d1744q26465r52569p81618
70638b602396k75629K96405M87615J94596j68217j90244K4294R6708j4194L9662
70628b111400M25925Q16599g6588B86352j01661a47518l40052k10886K7915K94403
70618c76138D8795L79028L29612M17759N16769L81945j9808m58407o86447B79410
70607i9616j22517o2719k43497m41263l67830k8438K47418K01727l4498j20505
$$ plain form
70597 -1071738 -1008196 -728462 -505217 -635201 -1134523 -1731855 -2149867 -2356152 -2513458 -2732609
70587 -2732609 -2968701 -3165912 -3380540 -3670059 -3941015 -4043226 -4004741 -4039190 -4262936 -4494689
70577 -4494689 -4433623 -4021596 -3546044 -3343789 -3443849 -3567323 -3473184 -3204234 -2921670 -2594026
70567 -2594026 -2034439 -1272826 -706524 -735950 -1326338 -2061882 -2590470 -2881669 -3064939 -3176327
70557 -3176327 -3138776 -2900981 -2498812 -1987711 -1364901 -586228 322932 1179901 1728963 1869004
70547 1869004 1762207 1649720 1587553 1450576 1180524 904120 752416 666890 502307 301007
70537 301007 344669 857258 1685426 2348906 2441460 1958886 1228886 594177 228263 171326
70527 171326 358994 566051 474615 -66436 -880008 -1609859 -1978965 -1890775 -1427102 -860103
$$ packed form
70597a071738O3542K79734K23245j29984m99322n97332m18012k06285j57306k19151
70587b732609k36092j97211k14628k89519k70956j02211L8485l4449k23746k31753
70577d494689O1066M12027M75552K02255j00060j23474R4139K68950K82564L27644
70567b594026N59587P61613N66302k9426n90388p35544n28588k91199j83270j11388
70557c176327L7551K37795M02169N11101O22810e86228C22932Q56969N49062J40041
70547A869004j06797j12487o2167j36977k70052k76404j51704q5526j64583k01300
70537C01007M3662N12589Q28168O63480R2554m82574p30000E94177B28263n6937
70527A71326J87668K07057r1436f6436q13572p29851l69106Q8190M63673N66999
$$ plain form
70517 -860103 -543010 -613553 -844216 -908577 -726256 -407104 30223 628008 1200040 1362713
70507 1362713 968623 318921 -174760 -400778 -530606 -742780 -1072861 -1400799 -1471730 -1072573
70497 -1072573 -339047 235644 281587 -30824 -219249 -57973 274316 549277 726162 789654
70487 789654 603176 92735 -548620 -1012253 -1202313 -1302398 -1526641 -1896497 -2275739 -2546664
70477 -2546664 -2695993 -2755301 -2727833 -2609695 -2435822 -2226209 -1903219 -1388397 -831050 -586676
70467 -586676 -799342 -1087625 -882048 -112509 651547 854791 573928 319235 352580 433142
70457 433142 212769 -338622 -960420 -1389546 -1529753 -1436825 -1221705 -916779 -418078 336555
70446 1103335 1408576 1012790 192583 -570804 -1082753 -1453982 -1730762 -1766508 -1493717 -1104633
$$ packed form
70517h60103L17093p0543k30663o4361J82321L19152C0223N97785N72032J62673
70507A362713l94090C18921a74760k26018j29828k12174l30081l27938p0931L99157
70497a072573c39047B35644M5943c0824j88425e7973B74316K74961J76885O3492
70487G89654j86478I2735e48620m63633j90060j00085k24243l69856l79242k70925
70477b546664j49329n9308K7468J18138J73873K09613L22990N14822N57347K44374
70467e86676k12666k88283K05577a12509F51547K03244k80863k54693L3345Q0562
70457D33142B12769c38622o21798m29126j40207R2928K15120L04926d18078C36555
70446A103335L05241l95786A92583e70804n11949l71229k76780l5746K72791L89084
$$ plain form
70436 -1104633 -856487 -832084 -979167 -1261693 -1664040 -2128406 -2588700 -3022918 -3413261 -3700618
70426 -3700618 -3813301 -3698616 -3352270 -2923002 -2740384 -3025560 -3545899 -3803227 -3656388
70417 -3656388 -3486953 -3590011 -3707763 -3456997 -2955424 -2612674 -2449020 -2090716 -1425474
70408 -1425474 -803472 -503596 -426272 -466040 -770472 -1367692 -1873877 -1895317 -1495944 -974995
70398 -974995 -404578 266546 828006 953356 703727 507217 575155 656257 486944 226099
70387 265763 752547 1444513 1975699 2180762 2211917 2377709 2820743 3356992 3688035 3711097
70377 3711097 3501949 3083217 2457759 1882009 1802040 2331368 2978866 3127018 2707258 2207438
70367 2207438 2047948 2143183 2099961 1681275 997848 350444 -21220 -82229 8444 25241 -183158
$$ packed form
70436a104633K48146K4403j47083k82526m02347m64366m60294m34218l90343k87357
70426c700618j12683J14685L46346M29268J82618k85176n20339k57328J46839
70417c656388J69435j03058j17752K50766N01573L42750J63654L58304O65242
70408a425474O22002K99876P7324l9768l04432n97220n06185k1440L99373N20949
70398i74995d04578B66546N61460J25350k49629j96510O7938Q1102j69313B26099
70387B65763M86784O91966N31186K05063L1155J65792M43034N36249L31043K3062
70377C711097k09148m18732o25458n75750p9969N29328O47498J48152m19760m99820
70367B207438j59490R5235m3222m18686o83427C50444b1220o1009H444J6797a83158
$$ plain form
70355 -641032 -1269811 -1909499 -2342469 -2386897 -2015718 -1367071 -646005 -63736 164561 -75404
70344 -595472 -929370 -747523 -244483 40821 -185111 -705174 -1141078 -1367852 -1469147 -1482306
70334 -1482306 -1411615 -1376883 -1476743 -1526972 -1207129 -529401 71864 229081 37714 -150054
70323 -151176 -19252 162106 345853 438689 330631 19858 -374388 -697936 -820173 -713054
70313 -713054 -569814 -734765 -1366092 -2226309 -2924251 -3283341 -3345543 -3139560 -2669086 -2072475
70303 -2072475 -1548354 -1112028 -642309 -190581 -1682 -142195 -331501 -294558 -125495 -131632
70293 -131632 -421513 -825104 -1168786 -1442717 -1668322 -1754367 -1604032 -1330549 -1248720 -1574282
70283 -1574282 -2164726 -2656293 -2869318 -2955322 -3082483 -3136491 -2911820 -2500286 -2236609 -2240044
$$ packed form
70355f41032o28779o39688m32970m4428L71179O48647f46005f3736A64561g5404
70344e95472l33898J81847b44483D0821a85111n20063m35904k26774j01295j3159
70334a482306P0691L4732r9860n0229L19843e29401G1864J57217C7714a50054
70323a51176a9252A62106J83747R2836j08058A9858c74388l23548j22237J07119
70313g13054J43240j64951o31327q60217o97942l59090o2202K05983M70474N96611
70303b072475N24121M36326M69719a90581a682j40513j89306L6943a25495o137
70293a31632k89881m03591l43682k73931k25605q6045J50335K73483Q1829l25562
70283a574282n90444m91567k13025q6004j27161n4008K24671M11534K63677l435
$$ plain form
70273 -2240044 -2243241 -1977310 -1560807 -1383181 -1703776 -2454714 -3333378 -3989628 -4221703 -4122283
70263 -4122283 -3998497 -4053342 -4158969 -3990368 -3346528 -2312632 -1182388 -284247 178061
70253 202884 -77141 -531482 -1054701 -1488339 -1660468 -1566041 -1419228 -1466951 -1808069 -2394205
70243 -2394205 -3075824 -3615695 -3833271 -3841496 -3984832 -4395245 -4740618 -4601550 -4016869 -3455483
70233 -3455483 -3279507 -3426510 -3618053 -3669907 -3515214 -3091434 -2377664 -1530566 -873577 -682671
70223 -682671 -969842 -1494331 -2004044 -2438948 -2858978 -3234784 -3444143 -3481528 -3522008 -3719303
70213 -3719303 -4061488 -4460727 -4808912 -4877589 -4409929 -3505441 -2709764 -2456175 -2551383 -2490988
70203 -2490988 -2154581 -1831455 -1622113 -1253899 -582929 126219 619027 1000236 1384785
$$ packed form
70273b240044l197K65931M16503J77626l20595p50938q78664o56250k32075R9420
70263d122283J23786n4845j05627J68601O43840J033896J130244b84247A78061
70253B02884g7141m54341n23219m33638j72129R4427J46813m7723l41118n86136
70243b394205o81619n39871k17576q225j43336m10413l45373J39068N84681N61386
70233c455483J75976j47003j91543n1854J54693M23780P13770Q47098O56989J90906
70223f82671k87171n24489n09713m34904m20030l75806k09359l7385m0480j97295
70213c719303l42185l99239l48185o8677M67660R04488P95677K53589r5208O0395
70203b490988L36407L23126K09342L68214e82929A26219M92808L81209L84549
$$ plain form
70194 1384785 1487216 952685 -20975 -783359 -993046 -989255 -1301897 -1993233 -2619810 -2739456
70184 -2739456 -2333512 -1755873 -1343063 -1108480 -834722 -437396 -127294 -144879 -439834 -755663
70174 -755663 -976617 -1209709 -1505137 -1676910 -1509456 -1046216 -562473 -286768 -218361 -180751
70164 -180751 22542 488054 1161667 1866167 2398963 2630593 2537098 2179769 1673073 1140375
70154 1140375 664611 283260 28763 -67869 -33526 39933 95979 183618 368724 612084
70144 612084 814740 952563 1053974 1055456 835654 445222 132555 3003 -215963 -863569
70134 -863569 -1850420 -2695868 -3085568 -3187620 -3332696 -3560123 -3622906 -3332665 -2756855 -2137656
70124 -2137656 -1738755 -1722407 -2044475 -2462574 -2720295 -2727630 -2553700 -2332403 -2238928 -2446123
$$ packed form
70194A384785J02431n34531b0975p62384k09687L791l12642o91336o26577j19646
70184b739456M05944N77639M12810K34583K73758L97326a27294j7585k94955l15829
70174g55663k20954k33092k95428j71773J67454M63240M83743K75705O8407L7610
70164a80751B2542M65512O73613P04500N32796K31630r3495l57329n06696n32698
70154A140375m75764B83260B8763f7869c3526C9933N6046Q7639J85106K43360
70144F12084K02656J37823J01411J482k19802l90432A32555C003b15963o47606
70134h63569r86851q45448l89700j02052j45076k27427o2783K90241N75810O19199
70124b137656L98901J6348l22068m18099k57721p335J73930K21297R3475k07195
$$ plain form
70114 -2446123 -2954585 -3492359 -3698953 -3414095 -2745109 -1932065 -1243880 -913428 -998809 -1301791
70104 -1301791 -1526238 -1502672 -1195146 -603248 164005 783761 923944 603178 208034 131513
70094 131513 500455 1202756 1985617 2534482 2673851 2541469 2398254 2258966 1914580 1320148
70084 1320148 683946 104507 -575893 -1394508 -2015784 -2092625 -1703434 -1206646 -793526 -383390
70073 165568 942647 1965844 3070891 3907588 4229264 4099693 3668165 2902641 1774228
70064 1774228 568024 -276520 -589466 -521723 -272782 -23761 -37812 -488298 -1182348 -1735827
70054 -1735827 -2021941 -2173958 -2180505 -1848699 -1234039 -737535 -611523 -661035 -615209 -536119
70044 -536119 -645178 -943709 -1234433 -1406727 -1524003 -1686075 -1875734 -1852668 -1232469 82973
$$ packed form
70114b446123n08462n37774k06594K84858O68986Q13044O88185L30452q5381l02982
70104a301791k24447K3566L07526N91898A64005O19756J40183l20766B08034p6521
70094A31513L68942P02301P82861N48865J39369j32382j43215j39288l44386n94432
70084A320148o36202A04507e75893q18615o21276p6841L89191M96788M13120c83390
70073A65568P77079J023197J105047Q36697L21676j29571m31528p65524j128413
70064A774228E68024b76520l12946O7743K48941b3761j4051m50486o94050n53479
70054a735827k86114j52017o547L31806O14660M96504J26012m9512M5826P9090
70044e36119j09059k98531k90724j72294j17276j62072j89659K3066O20199H2973
$$ plain form
70033 1527182 2251195 2021433 1422085 999619 593675 -174065 -1116050 -1661528 -1614795 -1229387
70023 -1229387 -622491 363665 1670863 2853508 3540802 3746480 3635725 3329220 3039785
70014 3039785 3021057 3177694 3042413 2368114 1466675 725036 77293 -718516 -1518418 -1920197
70004 -1920197 -1844872 -1581355 -1265877 -727402 42944 635286 674016 319286 77904 218470
69994 218470 566918 804044 757872 408617 -202249 -980354 -1776500 -2432979 -2806307 -2777833
69984 -2777833 -2360356 -1818113 -1539069 -1675070 -1979722 -2104745 -1980149 -1762841 -1488672
69975 -1488672 -1017938 -366200 157788 300854 183283 82898 35120 -121588 -385298 -554497
69965 -554497 -562999 -582653 -704234 -749073 -547867 -233828 -76854 -125955 -184717 -89786 126901
$$ packed form
70033A527182P24013k29762n99348m22466m05944a74065r41985n45478M6733L85408
70023a229387O06896C63665J307198J182645O87294K05678j10755l06505k89435
70014C039785j8728J56637j35281o74299r01439G25036G7293g18516p99902m01779
70004a920197P5325K63517L15478N38475D2944N92342L8730C19286G7904J40566
69994B18470L48448K37126m6172l49255b02249p78105p96146o56479l73328K8474
69984b777833M17477N42243K79044j36001l04652j25023J24596K17308K74169
69975a488672M70734c66200A57788J43066j17571H2898C5120a21588k63710j69199
69965e54497q502j9654j21581m4839K01206b33828g6854m9101n8762h9786A26901
$$ plain form
69953 324199 382997 260960 -4288 -350463 -762040 -1205385 -1471323 -1253846 -531102 249484
69942 555823 298392 -169468 -498348 -593481 -482211 -211034 57586 81601 -177669 -443900
69932 -443900 -434772 -201120 -46529 -167649 -469630 -702722 -712875 -584436 -572367 -847794
69922 -847794 -1276544 -1498950 -1258823 -615461 151480 749894 996550 888590 626858 451335
69912 451335 375738 187238 -227678 -687165 -932192 -907858 -726592 -514067 -447255 -772706
69902 -772706 -1531018 -2344719 -2740948 -2658682 -2394957 -2085993 -1564278 -798951 -147437 40733
69891 -136140 -301349 -263630 -106373 59518 182226 162994 -72258 -350089 -316226 154681
69880 744165 1016574 901577 727165 776947 934167 847239 407445 -47125 -61740 437955
$$ packed form
69953C24199N8798j22037d288l46175m11577m43345k65938K17477e31102B49484
69942E55823k57431a69468l28880r5133J11270b11034E7586K4015a77669k66231
69932d43900R128b01120d6529j21120l01981k33092j0153J28439J2069k75427
69922h47794m28750k22406K40127f15461A51480N98414K46656j07960k61732j75523
69912D51335p5597A87238b27678m59487k45027K4334J81266K12525O6812l25451
69902g72706p58312q13701l96229Q2266K63725L08964N21715P65327a47437D0733
69891a36140j65209L7719a06373E9518J22708j9232g2258k77831L3863A54681
69880G44165K72409j14997j74412M9782J57220q6928D07445d7125j4615D37955
$$ plain form
69869 1027391 1143069 542370 -516213 -1451091 -1757150 -1378404 -752032 -439150 -690694
69860 -690694 -1371266 -2189480 -2865907 -3176345 -3087110 -2871798 -2855019 -2971011 -2811474 -2208951
69850 -2208951 -1513730 -1133215 -1060311 -1082634 -1185871 -1405272 -1482825 -1122060 -529720 -257621
69839 -443554 -610844 -356922 120796 386357 343857 200302 94477 73824 307353 997048
69829 997048 2050602 3023760 3425282 3027281 1967918 675838 -368850 -930185 -1071821
69820 -1071821 -913351 -479647 133898 660215 932358 1111888 1400696 1630520 1440313
69811 1440313 838633 263811 -4427 -209640 -721490 -1477572 -2046165 -2152169 -1937485 -1725265
69801 -1725265 -1697273 -1817561 -1919495 -1798568 -1330367 -611549 46434 360504 328483 185558
$$ packed form
69869A027391J15678E42370e16213r34878l06059L78746O26372L12882k51544
69860f90694o80572q18214o76427l10438Q9235K15312J6779j15992J59537O02523
69850b208951O95221L80515P2904k2323j03237k19401p7553L60765e29720b57621
69839d43554j67290K53922A20796K65561m2500j43555I4477k0653K33529O89695
69829I97048J053554R73158M01522l98001j059363F75838c68850n61335j41636
69820a071821J58470M33704A33898N26317K72143J79530K88808K29824j90207
69811A440313o01680B63811d427k05213n11850p56082n68593j06004K14684K12220
69801a725265K7992j20288j01934J20927M68201f11549D6434L14070l2021j42925
$$ plain form
69791 185558 115430 87703 -4634 -167534 -348722 -554033 -788526 -952309 -956428 -902082 -964744
69780 -964744 -1126767 -1246668 -1394062 -1817057 -2460520 -2813403 -2478154 -1698959 -1065753 -835666
69770 -835666 -820739 -835916 -927610 -1154774 -1428397 -1639046 -1752489 -1743085 -1606224 -1450101
69760 -1450101 -1395569 -1380621 -1253901 -1053867 -965474 -980478 -849319 -425250 184476 858513
69750 858513 1557020 2070529 2006878 1269102 309084 -353901 -689112 -993651 -1383064 -1756578
69740 -1756578 -2110511 -2497314 -2724986 -2508338 -1997678 -1801291 -2314575 -3280788 -4170930
69731 -4170930 -4740620 -4995788 -4855445 -4209587 -3242224 -2346594 -1658855 -971025 -240274
69721 108620 -298626 -1092059 -1371490 -726933 229652 559108 50996 -651982 -870407 -526791
$$ packed form
69791A85558p0128k7727d634j62900j81188k05311k34493j63783m119N4346o2662
69780i64744j62023j19901j47394m22995o43463l52883L35249P79195O33206K30087
69770h35666J4927j5177r1694k27164k73623k10649j13443R404J36861J56123
69760a450101N4532J4948J26720K00034Q8393j5004J31159M24069A84476O74037
69750H58513O98507N13509o3651p37776C09084c53901l35211l04539l89413l73514
69740a756578l53933l86803k27672K16648N10660J96387n13284r66213q90142
69731d170930n69690k55168J40343O45858R67363Q95630O87739O87830b40274
69721A08620b98626p93433k79431O44557B29652L29456E0996f51982k18425L43616
$$ plain form
69711 -526791 22750 453246 602075 383618 -155035 -763417 -1185856 -1431706 -1708586 -2093004
69701 -2093004 -2400420 -2405986 -2094555 -1654313 -1277723 -993049 -678060 -261128 89909 75157
69691 75157 -365627 -876854 -1015312 -725233 -366508 -283958 -465225 -622191 -492027 -50446
69680 444739 592935 173082 -589407 -1167542 -1224890 -901340 -561067 -371680 -258274 -191284
69670 -191284 -314361 -732042 -1316823 -1843926 -2246630 -2608114 -2917333 -2977090 -2616659 -1893621
69660 -1893621 -990262 11511 1108872 2154870 2833606 2949145 2650146 2279583 2051782
69651 2051782 1941424 1823851 1620191 1324203 988626 718011 622572 730782 927987 979391
69641 979391 668784 12964 -650196 -904943 -666447 -268107 -63974 -39677 52474 249551
$$ packed form
69711e26791B2750M30496J48829k18457a55035o08382m22439k45850k76880l84418
69701b093004l07416n566L11431M40242L76590K84674L14989b61128H9909j4752
69691G5157c65627n11227j38458K90079L58725Q2550j81267j56966J30164e0446
69680D44739J48196A73082e89407n78135n7348L23550L40273J89387J13406O6990
69670a91284j23077m17681n84781n27103m02704l61484l09219n9757L60431P23038
69660a893621R03359A1511J097361J045998O78736J15539k98999l70563k27801
69651B051782j10358j17573k03660k95988l35577k70615r5439J08210J97205N1404
69641I79391l10607A2964f50196k54747K38496b68107f3974K4297E2474J97077
$$ plain form
69631 249551 277243 -60120 -550116 -762574 -532096 -168954 -184025 -827186 -1873871 -2816697
69621 -2816697 -3244751 -3067135 -2456975 -1677613 -967889 -483359 -246054 -160220 -128937 -157948
69611 -157948 -338967 -761180 -1432425 -2216074 -2838612 -3068214 -2938477 -2694756 -2460405 -2091604
69601 -2091604 -1484303 -900160 -786677 -1290556 -2096113 -2736688 -2941804 -2705586 -2179686
69592 -2179686 -1548093 -921811 -341927 72431 77026 -436976 -1181856 -1667306 -1672209 -1361518
69582 -1361518 -937371 -397076 280894 910116 1214740 1094763 688914 261548 86014 314175
69572 314175 848338 1404014 1762921 1892242 1792574 1386222 668369 -147565 -774413 -1087647
69562 -1087647 -1136652 -1017970 -856726 -832731 -1075684 -1551606 -2140869 -2770588 -3360427 -3707007
$$ packed form
69631B49551K7692f0120m89996k12458K30478a68954j5071o43161j046685r42826
69621b816697m28054J77616O10160P79362P09724d83359K37305Q5834L1283k9011
69611a57948j81019m22213o71245p83649o22538k29602J29737K43721K34351L68801
69601b091604O07301N84143J13483n03879q05557o40575k05116K36218N25900
69592b179686O31593O26282c41927G2431M595d36976p44880m85450m903L10691
69582a361518M24147c97076B80894O29222L04624j19977m05849B61548H6014K28161
69572C14175N34163N55676L58907J29321r9668m06352F68369a47565o26848l13234
69562a087647m9005J18682J61244K3995k42953m75922n89263o29719n89839l46580
$$ plain form
69552 -3707007 -3595864 -3053518 -2376866 -1876762 -1646477 -1565401 -1448044 -1199697 -919214 -859725
69542 -859725 -1201241 -1822997 -2341733 -2395380 -1883643 -985564 -24277 703861 1075386 1171293
69532 1171293 1133563 985262 639058 77988 -557838 -1111058 -1568340 -1999616 -2360449 -2467781
69522 -2467781 -2234905 -1856526 -1642034 -1673157 -1760958 -1785272 -1915595 -2349795 -2943853 -3308397
69512 -3308397 -3245696 -2892435 -2433010 -1901430 -1321075 -798576 -354338 119166 554035 567473
69502 567473 -115133 -1214776 -2149007 -2678733 -3042850 -3462461 -3808969 -3861762 -3644809 -3320085
69492 -3320085 -2888095 -2201404 -1251007 -286698 387612 663754 632031 378702 -133528 -929893
69482 -929893 -1823283 -2485947 -2772008 -2854304 -2948615 -3013856 -2880078 -2600006 -2459733 -2608778
$$ packed form
69552c707007J11143N42346O76652N00104K30285Q1076J17357K48347K80483N9489
69542h59725l41516o21756n18736n3647N11737Q98079b4277G03861L71525R5907
69532A171293l7730j48301l46204G7988e57838n53220m57282m31276l60833j07332
69522b467781K32876L78379K14492l1123q7801k4314j30323m34200n94058l64544
69512c308397O2701L53261M59425N31580N80355N22499c54338A19166M34869J3438
69502E67473a15133j099643r34231n29726l64117m19611l46508n2793K16953L24724
69492c320085M31990O86691R50397b86698C87612K76142l1723k53329a33528p96365
69482i29893q93390o62664k86061q2296r4311o5241J33778K80072J40273j49045
$$ plain form
69472 -2608778 -2855952 -2924871 -2807497 -2766347 -3025204 -3518445 -3940726 -4034921 -3836138 -3599159
69462 -3599159 -3475401 -3361331 -3144033 -2975254 -3127313 -3629540 -4231489 -4702870 -4974543
69453 -4974543 -4994591 -4693406 -4161990 -3635927 -3183387 -2610681 -1827320 -1119043 -853668 -1034403
69443 -1034403 -1346789 -1561605 -1676697 -1703876 -1548942 -1159046 -642685 -181261 99151 153841
69433 153841 9797 -236711 -466245 -597045 -587831 -435561 -228502 -139830 -280533 -601811
69423 -601811 -1014884 -1516592 -2058158 -2367820 -2130227 -1398989 -676926 -488588 -921874 -1600663
69413 -1600663 -2023398 -1931521 -1478303 -1094538 -1102280 -1413862 -1670906 -1670695 -1536852 -1466092 -1488774
69402 -1488774 -1573289 -1802521 -2266106 -2839914 -3242346 -3322452 -3184691 -3011800 -2853163 -2628525
$$ packed form
69472b608778k47174o8919J17374M1150k58857m93241m22281r4195J98783K36979
69462c599159J23758J14070K17298J68779j52059n02227o01949m71381k71673
69453d974543k0048L01185N31416N26063M52540N72706P83361P08277K65375j80735
69443a034403l12386k14816j15092k7179J54934L89896N16361a81261I9151N4690
69433A53841I797b36711k29534j30800R214J52270K07059Q8672j40703l21278
69423f01811m13073n01708n41566l09662K37593P31238f76926J88338m33286o78789
69413a600663m22735R1877M53218L83765p742l11582k57044K11J33843P0760k2682
69402a488774q4515k29232m63585n73808m02432q0106J37761J72891J58637K24638
$$ plain form
69392 -2628525 -2287891 -1907104 -1607781 -1408683 -1218616 -1004427 -878606 -917559 -970117 -829980
69382 -829980 -577558 -508636 -652755 -621718 -119502 601579 1035010 1024280 802967 544577
69372 544577 216217 -120648 -217913 12407 298223 304441 -29079 -541224 -1058466 -1441253
69362 -1441253 -1617271 -1723488 -2046157 -2629805 -3063575 -2849096 -1926771 -721861 224394
69352 554384 215457 -467488 -939562 -908929 -678051 -759515 -1185104 -1454300 -1204716 -679494
69342 -679494 -415519 -645164 -1121982 -1407535 -1223950 -618263 122097 742421 1209940 1572619
69332 1572619 1710718 1425169 774119 100606 -346970 -635040 -909881 -1144938 -1241884 -1194270
69322 -1194270 -992363 -526574 221432 996823 1467701 1547030 1383902 1115897 779489 396300
$$ packed form
69392b628525L40634L80787K99323J99098J90067K14189J25821l8953n2558J40137
69382h29980K52422O8922j44119L1037a19502F01579M33431j0730k21313k58390
69372E44577B16217a20648r7265A2407K85816O218b9079n12145n17242l82787
69362a441253j76018j06217l22669n83648m33770K14479R22325g21861B24394
69352E54384B15457d67488m72074L0633K30878q1464m25589k69196K49584N25222
69342f79494K63975k29645m76818k85553J83585O05687A22097O20324M67519L62679
69332A572619J38099k85549o51050A00606c46970k88070k74841k35057r6946M7614
69322a194270K01907M65789B21432P75391M70878P9329j63128k68005l36408l83189
$$ plain form
69312 396300 -4569 -405229 -730663 -861167 -862654 -1087792 -1812294 -2796990 -3433017 -3359481
69302 -3359481 -2786393 -2200239 -1915289 -1938222 -2098424 -2218448 -2241967 -2253185 -2334522 -2426405
69292 -2426405 -2403612 -2255603 -2089448 -1983987 -1949292 -1994214 -2108170 -2200390 -2175419 -2032304
69282 -2032304 -1777101 -1330565 -713938 -251631 -324128 -897969 -1527871 -1856671 -1891952 -1766532
69272 -1766532 -1511406 -1184097 -972645 -989435 -1107720 -1129333 -986441 -715473 -424722 -362534
69262 -362534 -767565 -1507106 -2099431 -2260637 -2184820 -2098683 -1850041 -1255929 -590525 -292129
69251 -327291 -303152 -162612 -292135 -870266 -1552283 -1972221 -2188539 -2406331 -2565278 -2491075
69241 -2491075 -2254193 -2081186 -2000130 -1815150 -1404665 -884192 -502806 -481689 -876465 -1471243
$$ packed form
69312C96300d569m00660l25434j30504j487k25138p24502r84696o36027P3536
69302c359481N73088N86154K84950k2933j60202j20024k3519j1218q1337r1883
69292b426405K2793J48009J66155J05461L4695m4922j13956r2220K4971J43115
69282b032304K55203M46536O16627b51631p2497n73841o29902l28800l5281J25420
69272a766532K55126L27309K11452j6790j18285k1613J42892K70968K90751O2188
69262c62534m05031p39541n92325j61206P5817Q6137K48642N94112e90525b92129
69251c27291K4139J40540j29523n78131o82017m19938k16318k17792j58947P4203
69241b491075K36882J73007Q1056J84980M10485N20473L81386K1117l94776n94778
$$ plain form
69231 -1471243 -1871278 -1822688 -1404650 -855538 -348253 -63505 -316274 -1329543 -2868154
69222 -2868154 -4293573 -5046639 -4989508 -4304076 -3226089 -1929246 -545098 776102 1778499
69213 1778499 2104150 1536477 303159 -977455 -1749316 -1884953 -1593198 -1093513 -490996
69203 107448 523223 607983 355930 -116044 -662304 -1164764 -1544040 -1772494 -1882064 -1923031
69193 -1923031 -1894550 -1742959 -1463523 -1180818 -1064118 -1154623 -1344069 -1548458 -1814333 -2182043
69183 -2182043 -2524939 -2647690 -2512492 -2237308 -1876926 -1365388 -736437 -259895 -228995 -657940
69173 -657940 -1271303 -1747463 -1910074 -1761003 -1449236 -1183777 -1067845 -1022253 -956099 -975101
69163 -975101 -1277400 -1830629 -2314583 -2470692 -2387536 -2325039 -2352621 -2322898 -2163850 -2000730
$$ packed form
69231a471243m00035M8590M18038N49112c48253f3505k52769j013269j538611
69222b868154j425419p53066N7131O85432J077987J296843e45098G76102J002397
69213A778499L25651n67673C03159i77455p71861j35637K91755M99685d90996
69203A07448M15775Q4760k52053a16044n46260n02460l79276k28454j09570m0967
69193a923031K8481J51591K79436K82705J16700r0505j89446k04389k65875l67710
69183b182043l42896j22751J35198K75184L60382N11538O28951b59895L0900m28945
69173f57940o13363m76160j62611J49071L11767K65459J15932M5592O6154j9002
69163i75101l02299n53229m83954j56109Q3156O2497k7582K9723J59048J63120
$$ plain form
69153 -2000730 -1926063 -1811218 -1495488 -1092073 -932391 -1176423 -1609971 -1902317 -1962506 -1927770
69143 -1927770 -1879877 -1764638 -1622961 -1709982 -2221983 -2964324 -3437483 -3270462 -2501683 -1464415
69133 -1464415 -509597 154284 483390 556549 478470 280953 -62711 -529295 -1007438 -1373575
69123 -1373575 -1541762 -1435996 -1015583 -386077 188326 466206 417393 220691 119546 274235
69113 274235 646459 961601 860807 183681 -903313 -2059666 -2976295 -3430561 -3308254
69104 -3308254 -2709438 -1959083 -1389323 -1137097 -1195097 -1525181 -1989927 -2302617 -2259740 -1983113
69094 -1983113 -1752087 -1646507 -1564800 -1550288 -1811476 -2349928 -2822322 -2909114 -2643596 -2263198
69084 -2263198 -1925024 -1718237 -1775688 -2153935 -2691324 -3170224 -3553302 -3892742 -4083392 -3920977
$$ packed form
69153b000730P4667J14845L15730M03415J59682k44032m33548k92346o0189L4736
69143a927770M7893J15239J41677q7021n12001p42341m73159J67021P68779J037268
69133a464415e09597A54284L29106P3159p8079j97517f2711m66584m78143l66137
69123a373575j68187J05766M20413c86077A88326K77880m8813j96702j01145J54689
69113B74235L72224L15142j00794A83681i03313j156353r16629m54266J22307
69104c308254N98816P50355N69760K52226n8000l30084m64746l12690M2877K76627
69094a983113K31026J05580Q1707J4512k61188n38452m72394q6792K65518L80398
69084b263198L38174K06787n7451l78247n37389m78900l83078l39440j90650J62415
$$ plain form
69074 -3920977 -3405478 -2811976 -2431909 -2364721 -2552408 -2856578 -3065972 -2983304 -2608040 -2180617
69064 -2180617 -1997037 -2198722 -2702842 -3235746 -3454104 -3189586 -2639136 -2206643 -2088364
69055 -2088364 -2107210 -2022303 -1881445 -1925344 -2206884 -2491326 -2575183 -2552547 -2645311 -2848185
69045 -2848185 -2910543 -2702352 -2450118 -2477371 -2771326 -2971626 -2820857 -2486071 -2344500 -2550502
69035 -2550502 -2932779 -3251442 -3401210 -3367607 -3152875 -2835010 -2596968 -2563008 -2609727 -2442373
69025 -2442373 -1922796 -1295497 -1023777 -1367032 -2132730 -2859676 -3218635 -3215242 -3071378 -3009789
69015 -3009789 -3131876 -3369045 -3507814 -3376125 -3072942 -2908451 -3024180 -3163859 -2938422
69006 -2938422 -2258228 -1391111 -650258 -155260 131672 274969 294983 157418 -152380 -504861
$$ packed form
69074c920977N15499N93502L80067O7188j87687l04170k09394Q2668L75264M27423
69064b180617J83580k01685n04120n32904k18358K64518N50450M32493J18279
69055b088364j8846Q4907J40858m3899k81540k84442q3857K2636r2764k02874
69045b848185o2358K08191K52234k7253k93955k00300J50769L34786J41571k06002
69035b550502l82277l18663j49768L3603K14732L17865K38042L3960m6719J67354
69025b442373N19577O27299K71720l43255p65698p26946l58959L393J43864O1589
69015c009789j22087k37169j38769J31689L03183J64491j15729j39679K25437
69006b938422O80194Q67117f50258a55260A31672J43297K0014j37565a52380l52481
$$ plain form
68996 -504861 -673761 -610649 -552890 -688285 -827763 -663777 -289727 -139615 -368731 -618666
68986 -618666 -533851 -220674 14895 139113 316300 520307 543306 362499 217427 262464
68976 262464 339828 195673 -182253 -530395 -598828 -454067 -456211 -853035 -1420205 -1684141
68966 -1684141 -1549758 -1456718 -1739092 -2086588 -1968586 -1434401 -1070056 -1167572 -1366592 -1250846
68956 -1250846 -915638 -696250 -630522 -530146 -432277 -625525 -1220663 -1952828 -2479708 -2724879
68946 -2724879 -2876014 -3157606 -3656182 -4291547 -4898383 -5336388 -5522819 -5398529 -4973551
68937 -4973551 -4437300 -4076853 -3967987 -3861164 -3530618 -3142372 -3058039 -3293095 -3403513 -2982415
68927 -2982415 -2093894 -1128782 -401117 -20929 -8028 -289834 -596720 -574615 -109221 554926
$$ packed form
68996e04861j68900O3112N7759j35395j39478J63986b89727a39615k29116k49935
68986f18666Q4815b20674A4895J24218J77187K04007K2999j80807j45072M5037
68976B62464P7364j44155a82253l48142o8433J44761k144l96824n67170k63936
68966a684141J34383R3040k82374l47496J18002N34185L64345r7516j99020J15746
68956a250846L35208K19388O5728J00376R7869j93248n95138p32165n26880k45171
68946b724879j51135k81592m98576o35365o06836m38005j86431J24290M24978
68937d973551N36251L60447J08866J06823L30546L88246Q4333k35056j10418M21098
68927b982415Q88521R65112d01117b0929h028k81806l06886K2105a09221E54926
$$ plain form
68916 1103086 1487779 1879628 2334689 2669961 2720671 2587233 2495003 2469569 2305230 1854302
68906 1854302 1188196 417014 -494580 -1596981 -2716758 -3482502 -3585694 -2968292 -1826771
68897 -1826771 -530372 524245 1116543 1290551 1214640 1019945 827195 788658 932582 1054803
68887 1054803 972340 834629 942900 1262632 1384415 1046706 456837 -19409 -253490 -281999
68877 -281999 -68699 403688 910301 1087980 748722 -17138 -943264 -1663801 -1863121 -1596456
68867 -1596456 -1351335 -1508240 -1804706 -1655135 -998399 -463734 -579420 -1146212 -1601365
68858 -1601365 -1732482 -1747341 -1816300 -1880576 -1872857 -1838875 -1799875 -1707648 -1585172 -1529978 -1527965
68847 -1527965 -1450570 -1316052 -1357233 -1679613 -2008226 -1977149 -1578796 -1109305 -733996 -387139
$$ packed form
68916A103086L84693L91849M55061L35272N0710j33438r2230k5434j64339m50928
68906A854302o66106D17014d94580j102401j119777p65744j03192O17402J141521
68897a826771e30372E24245N92298J74008p5911j94695j92750l8537J43924J22221
68887A054803q2463j37711J08271L19732J21783l37709D56837a9409k34081k8509
68877b81999f8699D03688N06613J77679l39258a7138r26126p20537j99320K66665
68867a596456K45121j56905k96466J49571O56736d63734j15686n66792m55153
68858a601365j31117j4859o8959o4276P719L3982L9000R2227J22476N5194K013
68847a527965P7395J34518m1181l22380l28613L1077L98353M69491L75309L46857
$$ plain form
68837 -387139 -112456 -145892 -463174 -548875 15071 859966 1142322 579981 -206318 -539222
68827 -539222 -525472 -757388 -1397500 -1941087 -1875385 -1286283 -735000 -698050 -1180429 -1764711
68817 -1764711 -2007894 -1862254 -1690935 -1817483 -2164738 -2459506 -2646381 -2850164 -3003696
68808 -3003696 -2831673 -2259087 -1569678 -1062224 -777366 -667741 -794643 -1174609 -1601270
68799 -1601270 -1809188 -1719532 -1408645 -972382 -553532 -350468 -424436 -607751 -744372 -875369
68789 -875369 -1021923 -983819 -643404 -345964 -612881 -1449767 -2243059 -2432242 -2051379 -1525152
68779 -1525152 -1173402 -1056311 -1097699 -1153332 -1058021 -775934 -453748 -214563 18387 358850
68769 358850 692139 751270 465656 85806 -99768 -84605 -116418 -395183 -862659 -1289770
$$ packed form
68837c87139a12456l3436l17282q5701A5071Q44895K82356n62341b06318l32904
68827e39222J3750k31916o40112n43587O5702N89102N51283L6950m82379n84282
68817a764711k43183J45640J71319j26548l47255k94768j86875k03783j53532
68808c003696J72023N72586O89409N07454K84858J09625j26902l79966m26661
68799a601270k07918Q9656L10887M36263M18850K03064p3968j83315j36621j30997
68789h75369j46554L8104L40415K97440k66917q36886p93292j89183L80863N26227
68779a525152L51750J17091m1388n5633R5311K82087L22186b14563A8387L40463
68769C58850L33289N9131k85614H5806i9768J5163l1813k78765m67476m27111
$$ plain form
68759 -1289770 -1527007 -1632176 -1756885 -1962886 -2198799 -2411336 -2569304 -2563120 -2209523 -1452782
68749 -1452782 -490693 399933 1109301 1658445 1981454 1920188 1446115 714605 -150716 -1151173
68739 -1151173 -2204713 -3040037 -3463189 -3567745 -3479300 -3067833 -2229357 -1336785 -968143
68730 -968143 -1117801 -1102586 -453656 458890 961855 917003 676559 478340 333610 345789
68720 345789 622255 878329 605694 -274596 -1318146 -2191840 -2984443 -3750332 -4187560
68711 -4187560 -4047507 -3546256 -3088239 -2824863 -2719097 -2776642 -2935857 -2961467 -2728121 -2398304
68701 -2398304 -2066473 -1512234 -664321 -40110 -235801 -1099590 -1878050 -2126594 -2020596 -1803025
68691 -1803025 -1460696 -1068025 -960363 -1307032 -1839161 -2221484 -2405714 -2410974 -2073995 -1335016
$$ packed form
68759a289770k37237j05169j24709k06001k35913k12537j57968O184L53597P56741
68749a452782d90693C99933P09368N49144L23009o1266m74073G14605a50716j000457
68739a151173j053540q35324m23152j04556Q8445M11467Q38476Q92572L68642
68730i68143j49658J5215d53656D58890N02965m4852k40444j98219j44730J2179
68720C45789K76466K56074k72635b74596j043550q73694p92603p65889m37228
68711d187560J40053N01251M58017K63376J05766n7545j59215k5610K33346L29817
68701b398304L31831N54239f64321d0110j95691q63789p78460k48544J05998K17571
68691a803025L42329L92671J07662l46669n32129l82323j84230n260L36979P38979
$$ plain form
68681 -1335016 -560707 -231709 -379973 -609725 -639577 -574087 -624209 -783548 -881599 -843935
68671 -843935 -802641 -970714 -1434399 -2044225 -2491052 -2509019 -2051742 -1329657 -697749 -449569
68661 -449569 -641080 -1091238 -1551771 -1854657 -1934147 -1827929 -1686165 -1643962 -1626705 -1436029
68651 -1436029 -1102530 -937510 -1080127 -1228251 -1070265 -769577 -674269 -706978 -487520 -27278
68640 163221 -245863 -1018919 -1790613 -2503641 -3194784 -3672480 -3705001 -3349075 -2860749 -2413083
68630 -2413083 -2056611 -1788630 -1503681 -1051907 -508749 -210717 -362268 -790070 -1242873
68621 -1242873 -1701911 -2165505 -2354239 -1973455 -1199153 -632142 -778076 -1708037 -3089131
68612 -3089131 -4324985 -4811812 -4394477 -3584343 -3087792 -3106613 -3296190 -3363451 -3409145 -3608183
$$ packed form
68681a335016e60707b31709j48264k29752k9852O5490n0122j59339r8051L7664
68671h43935M1294j68073m63685o09826m46827j7967M57277P22085O31908K48180
68661d49569j91511m50158m60533l02886p9490J06218J41764M2203J7257J90676
68651a436029L33499J65020j42617j48124J57986L00688R5308l2709K19458b7278
68640A63221b45863p73056p71694p13028o91143m77696l2521L55926M88326M47666
68630b413083L56472K67981K84949M51774e08749b10717j51551m27802m52803
68621a242873m59038m63594j88734L80784P74302N67011j45934r29961j381094
68612c089131j235854m86827M17335Q10134M96551j8821j89577o7261m5694j99038
$$ plain form
68602 -3608183 -3819983 -3711365 -3165803 -2422774 -1827123 -1512714 -1337607 -1103057 -805011
68593 -805011 -617547 -615385 -593213 -241521 503836 1314923 1676897 1297780 405727 -399773
68582 -726418 -798174 -1129065 -1825294 -2460185 -2674150 -2603748 -2585828 -2712316 -2876150 -3027085
68572 -3027085 -3152471 -3192874 -3207243 -3446086 -4017021 -4640466 -4991500 -5120459 -5249040 -5311174
68562 -5311174 -5054213 -4513069 -4016042 -3725490 -3504062 -3265589 -3149313 -3269731 -3538461
68553 -3538461 -3801547 -3947187 -3843570 -3393907 -2717185 -2095763 -1701180 -1515428 -1488571 -1562256
68543 -1562256 -1563517 -1342807 -1060762 -1096732 -1599985 -2322409 -2930717 -3275577 -3322251 -3061971
68533 -3061971 -2589761 -2093557 -1704808 -1508139 -1664412 -2260245 -3018512 -3469550 -3506370 -3484348
$$ packed form
68602c608183k11800J08618N45562P43029N95651L14409J75107K34550K98046
68593h05011J87464K162K2172b41521E03836Q11087L61974l79117D05727c99773
68582g26418p1756l30891o96229o34891k13965P0402J7920j26488j63834j50935
68572c027085j25386m0403j4369k38843n70935o23445l51034j28959j28581o2134
68562e311174K56961N41144M97027K90552K21428K38473J16276j20418k68730
68553c538461k63086j45640J03617M49663O76722O21422L94583J85752K6857p3685
68543a562256j261K20710K82045l5970n03253p22424o08308l44860m6674K60280
68533c061971M72210M96204L88749J96669j56273n95833p58267m51038l6820K2022
$$ plain form
68523 -3484348 -3655391 -3802440 -3596433 -3018870 -2221696 -1269938 -324006 176050 -85742 -804989
68513 -804989 -1326099 -1388585 -1282692 -1260518 -1171648 -845541 -530279 -650870 -1242353 -1897786
68503 -1897786 -2279564 -2446631 -2602359 -2745714 -2770277 -2768579 -2946303 -3220218 -3181538 -2595434
68493 -2595434 -1736266 -1057705 -690959 -464761 -282819 -228519 -348580 -566593 -813520 -1067404
68483 -1067404 -1270339 -1360268 -1367628 -1346412 -1255334 -1038256 -741188 -406301 24190 509174
68473 509174 763246 563987 79918 -371557 -736609 -1079169 -1226829 -1028415 -834145 -1139916
68463 -1139916 -1732989 -1777365 -892583 374065 1306715 1709504 1643945 1102468 322781 -114339
68452 8497 145545 -231525 -829078 -1018186 -778406 -563104 -478433 -246285 132862 319448
$$ packed form
68523c484348j71043j47049K06007N77563P97174R51758c24006A76050h5742p19247
68513h04989n21110o2486J05893K2174Q8870L26107L15262j20591n91483o55433
68503a897786l81778j67067j55728j43355k4563J698j77724k73915L8680N86104
68493b595434Q59168O78561L66746K26198J81942N4300j20061k18013k46927k53884
68483a067404k02935q9929p360K1216R1078K17078K97068L34887B4190M84984
68473E09174K54072j99259G9918c71557l65052l42560j47660J98414J94270l05771
68463a139916n93073m4376Q84782C74065R32650M02789o5559n41477C22781a14339
68452H497J37048b31525n97553j89108K39780K15302Q4671K32148A32862J86586
$$ plain form
68442 319448 246599 231412 404510 521019 439806 341653 335393 249353 -11811 -231440 -183538
68431 -183538 66079 278770 248862 -161578 -925165 -1699204 -2027076 -1801925 -1345656 -995215
68421 -995215 -839021 -870537 -1091346 -1375165 -1524351 -1582927 -1822730 -2289993 -2645008 -2624986
68411 -2624986 -2405902 -2281573 -2189909 -1816763 -1066346 -222929 298225 238702 -355178 -1119684
68401 -1119684 -1579302 -1502848 -1046849 -531388 -180121 -93193 -272115 -543758 -614299 -362382
68391 -362382 2514 189232 145567 29879 -29794 -18598 35715 64748 -76466 -514532 -1193868
68380 -1193868 -1841299 -2100795 -1756216 -938777 -126345 197651 -54257 -594641 -1167962 -1752785
68370 -1752785 -2319801 -2643338 -2551820 -2219493 -1982567 -1912856 -1758493 -1303204 -642511 -86653
$$ packed form
68442C19448p2849j5187J73098J16509q1213r8153o260q6040a1811k19629M7902
68431a83538F6079K12691k9908a61578p63587p74039l27872K25151M56269L50441
68421i95215J56194l1516k20809k83819j49186n8576k39803m67263l55015K0022
68411b624986K19084J24329R1664L73146P50417b22929B98225n9523c55178p64506
68401a119684m59618P6454M55999N15461a80121Q6928j78922k71643p0541K51917
68391c62382B514J86718m3665B9879b9794J1196C5715K9033g6466m38066o79336
68380a193868o47431k59496L44579Q17439a26345A97651e4257n40384n73321n84823
68370a752785n67016l23537R1518L32327K36926O9711J54363M55289f42511h6653
$$ plain form
68359 117273 -40910 -371910 -698202 -1054768 -1625671 -2430476 -3147931 -3355872 -2938500 -2197488
68349 -2197488 -1567065 -1241355 -1047151 -663079 528 654181 938850 854036 723225 712786
68339 712786 589900 80265 -703164 -1371576 -1703192 -1799499 -1868434 -2033171 -2318515 -2636839
68329 -2636839 -2772441 -2543556 -2033585 -1553627 -1330630 -1302514 -1227887 -917583 -366570 236462
68318 622611 679066 593441 641459 793080 675352 33055 -881581 -1526718 -1634969 -1418204
68308 -1418204 -1226090 -1178903 -1222109 -1403670 -1912624 -2826385 -3924153 -4795410 -5102420 -4761500
68298 -4761500 -3961095 -3026769 -2188169 -1435097 -650188 122291 653872 816535 757020 692238
68288 692238 643575 496711 221660 -130200 -577830 -1165325 -1773285 -2145421 -2125694 -1747354
$$ packed form
68359A17273d0910l31000l26292l56566n70903q04805p17455k07941M17372P41012
68349b197488O30423L25710J94204L84072E28O53653K84669q4814j30811j0439
68339G12786j22886H0265g03164o68412l31616r6307o8935j64737k85344l18324
68329b636839j35602K28885N09971M79958K22997K8116P4627L10304c66570B36462
68318F22611N6455q5625M8018J51621j17728C3055h81581o45137j08251K16765
68308a418204J92114M7187m3206j81561n08954r13761j097768q71257l07010L40920
68298d761500Q00405R34326Q38600P53072f50188A22291N31581J62663n9515o4782
68288F92238m8663j46864B21660a30200m47630n87495o07960l72136J9727L78340
$$ plain form
68278 -1747354 -1111529 -347843 305005 590506 503888 352152 468470 922636 1492430 1806218
68268 1806218 1570707 872229 256615 256887 757268 1054039 663803 -143431 -751077 -904403
68258 -904403 -807700 -709933 -677567 -708454 -816423 -979457 -1152677 -1340559 -1563243 -1782240
68248 -1782240 -1938579 -2011780 -1980054 -1815257 -1586991 -1445930 -1408706 -1299582 -1023333 -745577
68238 -745577 -659050 -719013 -760800 -714449 -542161 -179289 235515 316150 -48421 -332915 31740
68226 825942 1289288 1168849 977182 1097696 1182636 730060 -168563 -1022096 -1570632 -1835144
68216 -1835144 -1759033 -1232354 -419619 276559 600314 584946 364379 71654 -117159 -89961
68206 -89961 23722 -26810 -293209 -595983 -825634 -1093595 -1519052 -2000822 -2287244 -2215319
$$ packed form
68278a747354O35825c47843C05005K85501q6618j51736J16318M54166N69794L13788
68268A806218k35511o98478B56615K72N00381K96771l90236a43431o07646j53326
68258i04403R6703R7767L2366l0887j07969j63034j73220j87882k22684k18997
68248a782240j56339p3201L1726J64797K28266J41061L7224J09124K76249K77756
68238g45577Q6527n9963m1787M6351J72288a79289B35515Q0635d8421k84494C1740
68226H25942M63346j20439j91667J20514Q4940m52576a68563q53533n48536k64512
68216a835144P6111N26679d19619B76559L23755j5368k20567G1654a17159K7198
68206h9961B3722b6810k66399l02774k29651k67961m25457m81770k86422P1925
$$ plain form
68196 -2215319 -1846322 -1407872 -1105880 -960296 -849692 -726843 -680827 -710945 -581875 -86155
68185 612330 1087065 1095377 774564 429740 296417 472845 851281 1075677 790744 32525
68174 -792652 -1390596 -1846701 -2305431 -2608900 -2482373 -1958607 -1374034 -971766 -708322 -455316
68164 -455316 -207261 -41331 -7017 -108592 -295386 -435155 -406055 -263430 -211178 -343303
68154 -343303 -510341 -523468 -395796 -258675 -112164 149719 433228 353952 -377876 -1528548
68144 -1528548 -2464736 -2764315 -2608739 -2493678 -2628055 -2750909 -2540165 -2059019 -1699425
68135 -1699425 -1747151 -2120927 -2546246 -2872213 -3125474 -3292563 -3193528 -2690863 -1998333 -1617939
68125 -1617939 -1833365 -2314329 -2379629 -1686602 -546478 457472 979499 949920 354795 -705351
$$ packed form
68196b215319L68997M38450L01992J45584J10604J22849M6016l0118J29070h6155
68185F12330M74735Q312l20813l44824j33323J76428L78436K24396k84933C2525
68174g92652n97944m56105m58730l03469J26527N23766N84573M02268K63444K53006
68164d55316b07261d1331g017j01575j86794j39769K9100J42625N2252j32125
68154c43303j67038j3127J27672J37121a12164A49719K83509p9276c77876j150672
68144a528548r36188k99579J55576J15061j34377j22854K10744M81146L59594
68135a699425m7726l73776m25319l25967k53261j67089R9035N02665O92530L80394
68125a617939k15426m80964o5300O93027e46478D57472N22027k9579C54795g05351
$$ plain form
68114 -1792599 -2318963 -2108055 -1582713 -1266090 -1258726 -1337267 -1373933 -1419171 -1471413 -1432858 -1297978
68103 -1297978 -1175318 -1096778 -991260 -878664 -899630 -1098692 -1370308 -1693150 -2193939 -2827724
68093 -2827724 -3202473 -2966184 -2261178 -1552122 -1070498 -696322 -374813 -331683 -742158 -1419548
68083 -1419548 -2022630 -2428442 -2717082 -2913049 -2981495 -3034903 -3274748 -3651705 -3798359 -3459285
68073 -3459285 -2870511 -2535696 -2660997 -2962953 -3038764 -2785579 -2413979 -2181995 -2209431 -2456837
68063 -2456837 -2753993 -2883685 -2766559 -2575330 -2569030 -2799892 -3071711 -3186639 -3106997 -2848101
68053 -2848101 -2382776 -1771234 -1254007 -1040171 -1057517 -1066140 -971098 -854920 -753154 -636339
68043 -636339 -632227 -988022 -1675420 -2258581 -2351808 -2045739 -1677137 -1352001 -993689 -744381
$$ packed form
68114a792599n26364K10908N25342L16623P364p8541l6666m5238n2242L8555J34880
68103a297978J22660P8540J05518J12596k0966j99062k71616l22842n00789o33785
68093b827724l74749K36289P05006P09056M81624L74176L21509M3130m10475o77390
68083a419548o03082m05812k88640j95967o8446n3408k39845l76957j46654L39074
68073c459285N88774L34815j25301l01956p5811K53185L71600K31984k7436k47406
68063b456837k97156j29692J17126J91229O300k30862k71819j14928P9642K58896
68053b848101M65325O11542N17227K13836j7346q623R5042J16178J01766J16815
68043f36339M112l55795o87398n83161r3227L06069L68602L25136L58312K49308
$$ plain form
68033 -744381 -912104 -1460169 -1916825 -1960667 -1794825 -1722283 -1642882 -1319379 -952342 -1037936
68023 -1037936 -1637663 -2186343 -2170338 -1700167 -1224689 -926793 -667514 -393476 -314839 -669031
68013 -669031 -1472538 -2500416 -3379219 -3733276 -3414204 -2636325 -1801797 -1188985 -872882
68004 -872882 -858446 -1093948 -1347972 -1287587 -797204 -119275 397631 603067 551449 338030
67994 338030 42461 -240037 -429913 -518310 -556562 -640327 -909549 -1434990 -2035677 -2348889
67984 -2348889 -2216074 -1903442 -1797273 -1967016 -2195410 -2357792 -2540399 -2788844 -2977348
67975 -2977348 -3003908 -2933598 -2857978 -2770261 -2683201 -2722287 -2963478 -3284258 -3512403 -3633815
67965 -3633815 -3710090 -3673995 -3395778 -2941758 -2600415 -2609847 -2952372 -3415467 -3744193 -3737596
$$ packed form
68033g44381j67723n48065m56656m3842J65842P2542P9401L23503L67037q5594
68023a037936n99727n48680J6005M70171M75478K97896K59279K74038P8637l54192
68013f69031q03507j027878q78803l54057L19072P77879Q34528O12812L16103
68004h72882J4436k35502k54024O0385M90383a19275C97631K05436n1618k13419
67994C38030D2461b40037j89876q8397l8252q3765k69222n25441o00687l13212
67984b348889J32815L12632J06169j69743k28394j62382j82607k48445j88504
67975b977348k6560P0310P5620Q7717Q7060l9086k41191l20780k28145j21412
67965c633815p6275L6095K78217M54020L41343r432l42525m63095l28726O597
$$ plain form
67955 -3737596 -3340143 -2699045 -2049971 -1519404 -1116339 -894093 -953716 -1241106 -1515823 -1632411
67945 -1632411 -1713327 -1915709 -2169701 -2329029 -2458796 -2719443 -3007443 -2999536 -2620411 -2214187
67935 -2214187 -2115380 -2248893 -2327431 -2285483 -2304810 -2509256 -2859045 -3295253 -3750043 -4009441
67925 -4009441 -3813737 -3187246 -2486851 -2018803 -1762531 -1582811 -1535739 -1760127 -2162232 -2441739
67915 -2441739 -2435869 -2256502 -2058144 -1840416 -1548487 -1223004 -944887 -734405 -619577 -723841
67905 -723841 -1141997 -1754478 -2300317 -2649040 -2889171 -3128318 -3336346 -3456512 -3551612 -3703729
67895 -3703729 -3821729 -3701894 -3304137 -2856400 -2635251 -2712686 -2947614 -3137458 -3123513 -2836146
67885 -2836146 -2333686 -1760360 -1197832 -607018 12566 484588 615452 470191 344395 431306
$$ packed form
67955c737596L97453O41098O49074N30567M03065K22246n9623k87390k74717j16588
67945a632411q0916k02382k53992j59328j29767k60647k88000P907L79125M06224
67935b214187R8807j33513p8538M1948j9327k04446l49789m36208m54790k59398
67925d009441J95704O26491P00395M68048K56272J79720M7072k24388m02105k79507
67915b441739N870J79367J98358K17728K91929L25483K78117K10482J14828j04264
67905g23841m18156o12481n45839l48723k40131k39147k08028j20166r5100j52117
67895c703729j18000J19835L97757M47737K21149p7435k34928j89844J3945K87367
67885b836146N02460N73326N62528N90814A2566M72022J30864j45261j25796Q6911
$$ plain form
67875 431306 622464 658299 364562 -277811 -1143706 -1958207 -2402788 -2357170 -1998020 -1598356
67865 -1598356 -1300543 -1136936 -1140140 -1290035 -1428335 -1389274 -1209383 -1104250 -1261574 -1737168
67855 -1737168 -2470898 -3256901 -3765388 -3799188 -3535071 -3333099 -3297528 -3217802 -2959657 -2662185
67845 -2662185 -2436901 -2108806 -1464656 -625515 30468 254768 100331 -202697 -398013 -335832
67835 -335832 -139908 -166068 -605857 -1206866 -1599750 -1822330 -2233362 -2923611 -3534650 -3725852
67825 -3725852 -3502839 -2967147 -2092036 -989976 -102580 223061 161028 56581 -187744 -921248
67815 -921248 -1981211 -2651156 -2573244 -2272587 -2446160 -3026304 -3354209 -3132677 -2763586 -2707947
67805 -2707947 -2902183 -2998982 -2926316 -2924611 -3105108 -3235602 -3056557 -2674318 -2488092 -2719296
$$ packed form
67875D31306J91158L5835k93737b77811q65895q14501m44581M5618L59150L99664
67865a598356K97813J63607l204j49895j38300L9061J79891J05133j57324m75594
67855a737168p33730p86003n08487l3800K64117K01972L5571P9726K58145K97472
67845b662185K25284L28095O44150f25515C0468K24300A00331b02697j95316O2181
67835c35832a39908k6160m39789o01009l92884k22580m11032o90249o11039j91202
67825c725852K23013N35692Q75111i89976a02580B23061o2033E6581a87744p33504
67815i21248j059963o69945P7912L00657j73573n80144l27905K21532L69091N5639
67805b707947j94236r6799P2666J705j80497j30494J79045L82239J86226k31204
$$ plain form
67795 -2719296 -3127403 -3284273 -3082765 -2842396 -2883826 -3128458 -3212027 -2900059 -2267427 -1538680
67785 -1538680 -925008 -618146 -755253 -1275824 -1894777 -2320681 -2485888 -2517935 -2518252 -2423886
67775 -2423886 -2082773 -1437901 -640000 13695 266123 46955 -530858 -1258933 -1902002 -2273204
67765 -2273204 -2348542 -2288303 -2259878 -2246598 -2094889 -1709955 -1115307 -381006 354846 829752
67755 829752 831937 476322 117867 -73322 -249258 -510134 -654023 -523118 -406965 -790436
67745 -790436 -1753613 -2883571 -3760871 -4286495 -4542022 -4624624 -4698652 -4931532 -5213017 -5136002
67735 -5136002 -4438994 -3336806 -2260132 -1402357 -699911 -135005 183730 216827 65597
67725 -175409 -487943 -830208 -1100030 -1238247 -1287266 -1344475 -1528193 -1929538 -2457423 -2786054
$$ packed form
67795b719296m08107j56870K01508K40369m1430k44632q3569L11968O32632P28747
67785a538680O13672L06862j37107n20571o18953m25904j65207l2047l17R4366
67775b423886L41113O44872f40000A3695K52428D6955e30858p28075o43069l71202
67765b273204p5338O0239K8425J3280J51709L84934N94648c81006C54846M74906
67755H29752K185l55615A17867g3322j75936k60876j43889J30905J16153l83471
67745g90436r63177j129958q77300n25624k55527q2602p4028k32880k81485P7015
67735e136002O97008J102188J076674Q57775f99911a35005A83730L3097F5597
67725a75409l12534l42265k69822j38217m9019n7209j83718m01345n27885l28631
$$ plain form
67715 -2786054 -2670155 -2319483 -2208592 -2422806 -2449092 -1813621 -731716 138321 467143 471783
67705 471783 392740 107404 -585203 -1540288 -2368194 -2874916 -3202063 -3529225 -3792080 -3771165
67695 -3771165 -3408923 -2968903 -2840026 -3165990 -3691999 -4016269 -3974930 -3736419 -3562028 -3568438
67685 -3568438 -3698029 -3783691 -3616111 -3081465 -2297638 -1520409 -883217 -350927 55158 200857
67675 200857 119111 126583 440854 816159 795947 245995 -583528 -1432959 -2198556 -2785980
67665 -2785980 -3126981 -3362790 -3679359 -3885321 -3516027 -2542126 -1636431 -1430648 -1742793
67656 -1742793 -1894631 -1633420 -1316229 -1217147 -1131235 -859300 -711226 -1145131 -2024942 -2616975
67646 -2616975 -2432366 -1839274 -1650397 -2210869 -3102150 -3722558 -3911176 -3890139 -3824106 -3705125
$$ packed form
67715b786054J15899L50672J10891k14214k6286O35471g31716A38321L28822M640
67705D71783p9043A07404e85203r55085q27906n06722l27147l27162k62855K0915
67695c771165L62242M40020J28877l25964n26009l24270M1339K38511J74391o410
67685c568438j29591q5662J67580N34646P83827P77229O37192c50927E5158J45699
67675B00857q1746P472L14271L75305k0212B45995e83528q49431p65597n87424
67665b785980l41001k35809l16569k05962L69294R73901R05695K05783l12145
67656a742793j51838K61211L17191R9082Q5912K71935J48074m33905q79811n92033
67646b616975J84609N93092J88877n60472q91281o20408j88618K1037O6033J18981
$$ plain form
67636 -3705125 -3579950 -3571927 -3618112 -3455809 -3020503 -2663037 -2779024 -3321934 -3839004 -3918990
67626 -3918990 -3486169 -2749299 -2018333 -1523044 -1272928 -1106871 -943654 -902213 -1094013 -1421523
67616 -1421523 -1720385 -1986649 -2290006 -2562490 -2689791 -2761450 -3005470 -3469584 -3947528 -4213847
67606 -4213847 -4155762 -3710273 -2922460 -2107061 -1699629 -1815657 -2118458 -2238059 -2186022 -2247071
67596 -2247071 -2588211 -3116203 -3651960 -4104819 -4456519 -4635556 -4472173 -3865475 -3031313
67587 -3031313 -2446751 -2387941 -2610313 -2691375 -2619353 -2759948 -3241390 -3710630 -3822208 -3666796
67577 -3666796 -3512886 -3368708 -3058153 -2573475 -2101407 -1798452 -1751645 -2050131 -2644792 -3188400
67567 -3188400 -3256432 -2751043 -1961168 -1287222 -1047320 -1411566 -2243169 -3038476 -3310192 -3075230
$$ packed form
67636c705125J25175Q023m6185J62303M35306L57466j15987n42910n17070p9986
67626c918990M32821P36870P30966M95289K50116J66057J63217M1441j91800l27510
67616a421523k98862k66264l03357k72484j27301p1659k44020m64114m77944k66319
67606d213847N8085M45489P87813Q15399M07432j16028l02801j19601N2037o1049
67596b247071l41140n27992n35757m52859l51700j79037J63383O06698Q34162
67587c031313N84562N8810k22372q1062P2022j40595m81442m69240j11578J55412
67577c666796J53910J44178L10555M84678M72068L02955M6807k98486n94661n43608
67567c188400o8032N05389P89875O73946K39902l64246q31603p95307k71716K34962
$$ plain form
67557 -3075230 -2748532 -2561692 -2378583 -2139292 -2127674 -2563614 -3173180 -3475340 -3407017 -3384149
67547 -3384149 -3731195 -4270293 -4557611 -4394690 -4000413 -3715904 -3621816 -3490228 -3106957 -2567197
67537 -2567197 -2165923 -2034348 -2033658 -2038666 -2151758 -2508932 -2997428 -3343299 -3438062 -3422988 -3452732
67526 -3452732 -3502922 -3424859 -3098370 -2541095 -1961069 -1665738 -1778768 -2051101 -2102741 -1874939
67516 -1874939 -1699079 -1891970 -2445758 -3156222 -3847222 -4356387 -4512975 -4342729 -4168847
67507 -4168847 -4285947 -4596994 -4770244 -4696673 -4578461 -4601583 -4753928 -4969214 -5212375 -5379479
67497 -5379479 -5340369 -5153979 -5037939 -5055297 -5047249 -4948642 -4899521 -4898629 -4634255 -3915705 -3053923
67486 -3053923 -2504092 -2273523 -2010500 -1592852 -1276325 -1262310 -1452141 -1693198 -1975407 -2284706
$$ packed form
67557c075230L26698J86840J83109K39291J1618m35940o09566l02160O8323K2868
67547c384149l47046n39098k87318J62921L94277K84509R4088J31588L83271N39760
67537b567197M01274J31575O90n008j13092l57174m88496l45871r4763J5074k9744
67526c452732n0190P8063L26489N57275N80026K95331j13030k72333n1640K27802
67516a874939J75860j92891n53788p10464o91000n09165j56588J70246J73882
67507d168847j17100l11047j73250P3571J18212k3122j52345k15286k43161j67104
67497e379479L9110J86390J16040j7358Q048R8607M9121Q92K64374P18550Q61782
67486c053923N49831K30569K63023M17648L16527J4015j89831k41057k82209l09299
$$ plain form
67476 -2284706 -2519037 -2668730 -2848040 -3017404 -2910332 -2423693 -1889944 -1742145 -2043149
67467 -2043149 -2564999 -3206034 -4026804 -4878259 -5307418 -5013500 -4267370 -3696147 -3649527 -3883511
67457 -3883511 -3906501 -3557707 -3135480 -2949979 -2891687 -2583794 -1909701 -1204580 -877428 -1002264
67447 -1002264 -1378370 -1838835 -2305335 -2604553 -2489881 -1968203 -1469496 -1509867 -2177210 -3064436
67437 -3064436 -3734304 -4118002 -4366627 -4454630 -4166825 -3484079 -2751623 -2353645 -2372654 -2662976
67427 -2662976 -3072220 -3435198 -3541203 -3352150 -3130564 -3092141 -3034803 -2622969 -1986209 -1671420
67417 -1671420 -1949668 -2515791 -2996840 -3432534 -4036780 -4717342 -5086459 -4857466 -4095864
67408 -4095864 -3187993 -2646619 -2775786 -3390914 -3985677 -4245584 -4244808 -4123393 -3866243 -3527429
$$ packed form
67476b284706k34331j49693j79310j69364J07072M86639N33749J47799l01004
67467b043149n21850o41035q20770q51455m29159K93918P46130N71223M6620k33984
67457c883511k2990L48794M22227J85501N8292L07893O74093P05121L27152j24836
67447a002264l76106m60465m66500k99218J14672N21678M98707m0371o67343q87226
67437c064436o69868l83698k48625q8003K87805O82746P32456L97978j9009k90322
67427b662976m09244l62978j06005J89053K21586L8423N7338M11834O36760L14789
67417a671420k78248n66123m81049m35694o04246o80562l69117K28993P61602
67408d095864R07871N41374j29167o15128n94763k59907P76J21415K57150L38814
$$ plain form
67398 -3527429 -3354917 -3454358 -3580017 -3512719 -3402472 -3440164 -3423625 -3031271 -2387525 -1973615
67388 -1973615 -2048305 -2499324 -3179048 -3982782 -4612934 -4699096 -4264393 -3745247 -3439713 -3225543
67378 -3225543 -2919952 -2605153 -2428558 -2332230 -2180599 -1994729 -1896487 -1927506 -2021287 -2056257
67368 -2056257 -1909414 -1603702 -1399133 -1523237 -1798236 -1812104 -1526037 -1391071 -1695246 -2093561
67358 -2093561 -2044675 -1506025 -921732 -658607 -711595 -869750 -926839 -786618 -580340 -635499
67348 -635499 -1116977 -1725712 -1964856 -1726101 -1442487 -1614698 -2291735 -3037244 -3328053 -2992535
67338 -2992535 -2324628 -1753800 -1395323 -1036854 -596200 -360574 -587554 -1073230 -1417132
67329 -1417132 -1598978 -1933403 -2476973 -2883217 -2954575 -2955506 -3142590 -3293450 -3040482 -2487222
$$ packed form
67398c527429J72512r9441j25659O7298J10247l7692J6539L92354O43746M13910
67388a973615p4690m51019o79724q03734o30152q6162M34703N19146L05534K14170
67378c225543L05591L14799J76595R6328J51631J85870R8242l1019r3781l4970
67368b056257J46843L05712K04569j24104k74999j3868K86067J34966l04175l98315
67358b093561M8886N38650N84293K63125n2988j58155n7089J40221K06278n5159
67348f35499m81478o08735k39144K38755K83614j72211o77037p45509k90809L35518
67338b992535O67907N70828L58477L58469M40654K35626k26980m85676l43902
67329a417132j81846l34425n43570m06244p1358r31j87084j50860K52968N53260
$$ plain form
67319 -2487222 -2113816 -2126101 -2268789 -2332148 -2478059 -2862797 -3204358 -3046107 -2384861 -1760371
67309 -1760371 -1665367 -2050253 -2495067 -2724085 -2812653 -2959113 -3216681 -3486141 -3676032 -3799738
67299 -3799738 -3939271 -4154313 -4418450 -4620811 -4640127 -4446419 -4135875 -3844624 -3616432 -3377923
67289 -3377923 -3073853 -2805857 -2760063 -2947744 -3072624 -2761709 -1960979 -1046974 -510896 -561288
67279 -561288 -1040916 -1655208 -2210946 -2659032 -2985582 -3116537 -2962317 -2576131 -2218202 -2153820
67269 -2153820 -2356668 -2513736 -2398564 -2160508 -2145873 -2488850 -2996066 -3407599 -3640009 -3753810
67259 -3753810 -3806320 -3813624 -3796155 -3779418 -3748124 -3644526 -3450242 -3286352 -3396591 -3944703
67249 -3944703 -4793260 -5559377 -5954905 -6010766 -5900417 -5642863 -5134311 -4433114 -3819104 -3507929
$$ packed form
67319b487222L73406j2285j42688o3359j45911l84738l41561J58251O61246O24490
67309a760371R5004l84886m44814k29018q8568j46460k57568k69460j89891j23706
67299c799738j39533k15042k64137k02361j9316J93708L10544K91251K28192K38509
67289c377923L04070K67996M5794j87681j24880L10915Q00730R14005e10896n0392
67279e61288m79628o14292n55738m48086l26550j30955J54220L86186L57929O4382
67269b153820k02848j57068J15172K38056J4635l42977n07216m11533k32410j13801
67259c753810n2510p304J7469J6737L1294J03598J94284J63890j10239n48112
67249c944703q48557p66117l95528n5861J10349K57554N08552P01197O14010L11175
$$ plain form
67239 -3507929 -3442152 -3453165 -3527879 -3793564 -4274727 -4779944 -5061994 -5038288 -4818695 -4539721
67229 -4539721 -4218342 -3790500 -3262297 -2770163 -2485084 -2489773 -2728561 -3002355 -3025843 -2630397
67219 -2630397 -1991147 -1554542 -1632157 -2111562 -2631718 -2957033 -3093253 -3157280 -3302336 -3703891
67209 -3703891 -4421037 -5267405 -5975514 -6487940 -6917290 -7203552 -7022487 -6162414 -4878365
67200 -4878365 -3733049 -3105927 -2933874 -2928978 -2987903 -3322143 -4143392 -5270659 -6193200 -6576990
67190 -6576990 -6571965 -6524787 -6546150 -6523732 -6407111 -6228325 -5924880 -5424187 -4889121 -4607334
67180 -4607334 -4605565 -4619083 -4481017 -4294488 -4172331 -4076401 -4000775 -4040895 -4151014 -4091776 -3789089
67169 -3789089 -3524105 -3587174 -3936700 -4365077 -4782198 -5125723 -5206418 -4924565 -4515078 -4321652
$$ packed form
67239c507929O5777j1013p4714k65685m81163n05217k82050K3706K19593K78974
67229d539721L21379M27842N28203M92134K85079m689k38788k73794k3488L95446
67219b630397O39250M36605p7615m79405n20156l25315j36220o4027j45056m01555
67209c703891p17146q46368p08109n12426m29350k86262J81065Q60073J284049
67200d878365J145316O27122J72053M896n8925l34240q21249j127267r22541l83790
67190f576990N025M7178k1363K2418J16621J78786L03445N00693N35066K81787
67180d607334J769j3518J38066J86529J22157R5930P5626m0120j10119N9238L02687
67169c789089K64984o3069l49526m28377m17121l43525q0695K81853M09487J93426
$$ plain form
67159 -4321652 -4412316 -4626496 -4883543 -5204184 -5529142 -5777199 -6012857 -6306255 -6503094 -6412547
67149 -6412547 -6161201 -6036455 -5992156 -5674622 -5023219 -4496885 -4525490 -5005915 -5540668 -5933080
67139 -5933080 -6195719 -6273192 -6102361 -5884494 -5947775 -6251966 -6290666 -5656206 -4559450 -3621908
67129 -3621908 -3236981 -3311366 -3590458 -3996335 -4529680 -4999873 -5068972 -4587252 -3784465 -3110141
67119 -3110141 -2934341 -3354876 -4165236 -4984572 -5517352 -5734857 -5773501 -5701834 -5496633 -5215924
67109 -5215924 -5028999 -5033207 -5165391 -5323062 -5444823 -5459424 -5324887 -5150235 -5079282 -4995390
67099 -4995390 -4582378 -3807386 -3103688 -2872800 -2998749 -3082697 -2986104 -2874245 -2860161 -2918375
67089 -2918375 -3082606 -3406554 -3727205 -3772316 -3571014 -3509602 -3887391 -4600860 -5322219 -5795020
$$ packed form
67159d321652r0664k14180k57047l20641l24958k48057k35658k93398j96839R0547
67149f412547K51346J24746M4299L17534O51403N26334k8605m80425n34753l92412
67139e933080k62639p7473J70831K17867o3281l04191l8700O34460J096756R37542
67129c621908L84927p4385k79092m05877n33345m70193o9099M81720Q02787O74324
67119c110141J75800m20535q10360q19336n32780k17505l8644P1667K05201K80709
67109e215924J86925m208j32184j57671j21761j4601J34537J74652P0953Q3892
67099d995390M13012P74992P03698K30888j25949q3948R6593J11859J4084n8214
67089b918375j64231l23948l20651m5111K01302O1412l77789p13469p21359m72801
$$ plain form
67079 -5795020 -5892954 -5605943 -5102933 -4668211 -4456921 -4400736 -4403387 -4492535 -4705973 -4968661
67069 -4968661 -5191074 -5395638 -5657296 -5991412 -6349236 -6626822 -6642038 -6251051 -5582597 -5028748
67059 -5028748 -4879087 -5051689 -5287795 -5493556 -5728091 -5940670 -5942303 -5663401 -5266930 -4940553
67049 -4940553 -4714349 -4573935 -4616311 -4908431 -5230406 -5183869 -4660520 -4051670 -3828835 -4009317
67039 -4009317 -4238322 -4337858 -4478275 -4743133 -4853772 -4565775 -4110165 -3919255 -4032615 -4117734
67029 -4117734 -4036926 -4014481 -4170578 -4260788 -4077170 -3823229 -3830365 -4097216 -4384758 -4622567
67019 -4622567 -4904087 -5147593 -5120728 -4871251 -4818641 -5237742 -5869264 -6267014 -6387583 -6565836
67009 -6565836 -6957712 -7314715 -7400327 -7358459 -7444522 -7550221 -7294703 -6581485 -5784719 -5271600
$$ packed form
67079e795020r7934K87011N03010M34722K11290N6185k651q9148k13438k62688
67069d968661k22413k04564k61658l34116l57824k77586j5216L90987O68454N53849
67059e028748J49661j72602k36106k05761k34535k12579j633K78902L96471L26377
67049d940553K26204J40414m2376k92120l21975M6537N23349O08850K22835j80482
67039d009317k29005r9536j40417k64858j10639K87997M55610J90910j13360q5119
67029d117734Q0808K2445j56097r0210J83618K53941p136k66851k87542k37809
67019d622567k81520k43506K6865K49477N2610m19101o31522l97750j20569j78253
67009f565836l91876l57003q5612M1868q6063j05699K55518P13218P96766N13119
$$ plain form
66999 -5271600 -4957155 -4520464 -3925210 -3485841 -3437596 -3658011 -3880413 -4023896 -4200781 -4498657
66989 -4498657 -4897208 -5372619 -5938960 -6533960 -6970480 -7109229 -7034098 -6938016 -6859370 -6697314
66979 -6697314 -6515332 -6598143 -7038212 -7455968 -7413826 -7027190 -6848511 -7134020 -7545720 -7672377
66969 -7672377 -7538028 -7419355 -7417709 -7442559 -7430710 -7336399 -7031007 -6452425 -5793240 -5363139
66959 -5363139 -5319777 -5643959 -6242119 -6921771 -7421834 -7657867 -7792194 -7875096 -7626105 -6869429
66949 -6869429 -6021710 -5758916 -6226948 -6920049 -7347017 -7494033 -7593122 -7775079 -8091125 -8613479
66939 -8613479 -9305186 -9894577 -10026338 -9556003 -8719394 -8022497 -7825168 -7937843 -7814580
66930 -7814580 -7301534 -6940319 -7244014 -7929891 -8300626 -8200232 -8047312 -7990210 -7664758 -6924029
$$ packed form
66999e271600L14445M36691N95254M39369M8245k20415k22402j43483j76885k97876
66989d498657l98551m75411n66341n95000m36520j38749P5131R6082P8646J62056
66979f697314J81982q2811m40069m17756M2142L86636J78679k85509m11700j26657
66969g672377J34349J18673J646k4850J1849R4311L05392N78582O59185M30101
66959e363139M3362l24182n98160o79652n00063k36033j34327q2902K48991P56676
66949f869429Q47719K62794m68032o93101m26968j47016r9089j81957l16046n22354
66939h613479o91707n89391j31761M70335Q36609O96897J97329j12675J23263
66930g814580N13046L61215l03695o85877l70735J00394J52920N7102L25452P40729
$$ plain form
66920 -6924029 -6221164 -5978120 -6026724 -6004709 -5945385 -6118159 -6537254 -6961392 -7226675 -7346459
66910 -7346459 -7431529 -7667615 -8172144 -8749165 -9055075 -9137183 -9445612 -10091261 -10503719 -10207755
66900 -10207755 -9612478 -9545501 -10170857 -10828945 -10887719 -10356610 -9669871 -9210582 -9095222 -9174896
66890 -9174896 -9191198 -9054419 -8917310 -8883012 -8821213 -8639324 -8496038 -8483058 -8343002 -7876153
66880 -7876153 -7437532 -7575914 -8251744 -8853497 -8980072 -8781000 -8494891 -8110968 -7639381
66871 -7639381 -7325639 -7357700 -7607021 -7851110 -8052289 -8254678 -8393265 -8387732 -8313826 -8345303
66861 -8345303 -8588292 -9014195 -9445430 -9587733 -9235638 -8503727 -7725907 -7104206 -6619076
66852 -6619076 -6306235 -6396038 -7052114 -8111811 -9199382 -10005055 -10395974 -10388237 -10119823 -9778257
$$ packed form
66920f924029P02865K43044m8604K2015N9324j72774m19095m24138k65283j19784
66910g346459q5070k36086n04529n77021l05910q2108l08429o45649m12458K95964
66900a0207755N95277O6977o25356o58088n8774N31109O86739M59289J15360p9674
66890i174896j6302J36779J37109L4298O1799J81889J43286J2980J40056M66849
66880g876153M38621j38382o75830o01753j26575J99072K86109L83923M71587
66871g639381L13742l2061k49321k44089k01179k02389j38587N533P3906l1477
66861h345303k42989m25903m31235j42303L52095P31911P77820O21701M85130
66852f619076L12841q9803o56076j059697j087571q05673l90919P737K68414L41566
$$ plain form
66842 -9778257 -9475821 -9237960 -9128257 -9286642 -9785904 -10498180 -11129441 -11374504 -11109977
66833 -11109977 -10528323 -10019070 -9790765 -9658575 -9333095 -8833909 -8416351 -8141366 -7776153
66824 -7776153 -7159922 -6444952 -5906006 -5706340 -5926609 -6614855 -7653842 -8696107 -9373518
66815 -9373518 -9546032 -9316699 -8888485 -8444807 -8090918 -7876014 -7898095 -8300131 -9024986 -9655305
66805 -9655305 -9734770 -9278530 -8767861 -8589154 -8651777 -8604562 -8248509 -7676854 -7187151 -7131742
66795 -7131742 -7684874 -8649522 -9595276 -10233806 -10560915 -10665045 -10600583 -10463421 -10362649 -10264468
66785 -10264468 -10074004 -9888583 -9885402 -9906739 -9526212 -8709078 -8052498 -8067995 -8490636 -8655588
66775 -8655588 -8381753 -8093334 -8134234 -8341509 -8359041 -8105963 -7838043 -7890921 -8390820 -9098612
$$ packed form
66842i778257L02436K37861J09703j58385m99262p12276o31261k45063K64527
66833a1109977N81654N09253K28305J32190L25480M99186M17558K74985L65213
66824g776153O16231P14970N38946J99666k20269o88246j038987j042265o77411
66815i373518j72514K29333M28214M43678L53889K14904k2081m02036p24855o30319
66805i655305p9465M56240N10669J78707o2623M7215L56053N71655M89703N5409
66795g131742n53132r64648r45754o38530l27109j04130O4462J37162J00772R8181
66785a0264468J90464J85421L181k1337L80527Q17134O56580j5497m22641j64952
66775h655588K73835K88419m0900k07275j7532K53078K67920n2878m99899p07792
$$ plain form
66765 -9098612 -9558571 -9530088 -9238610 -9084675 -9198616 -9456702 -9825817 -10411844 -11173921 -11865465
66755 -11865465 -12324393 -12592450 -12665471 -12363974 -11623104 -10764661 -10299268 -10509040 -11319821
66746 -11319821 -12475102 -13663667 -14517270 -14702425 -14159618 -13221949 -12402341 -12016755 -12025097
66737 -12025097 -12239363 -12612812 -13221522 -13973127 -14500275 -14482491 -14020141 -13552735 -13410420
66728 -13410420 -13566014 -13833956 -14148242 -14533633 -14907136 -15086023 -15019058 -14889547 -14916777 -15126162
66718 -15126162 -15399089 -15684742 -16013846 -16300038 -16317197 -15998479 -15628109 -15553010 -15759833 -15927723
66708 -15927723 -15883283 -15792488 -15861698 -16060986 -16250130 -16402806 -16560873 -16695476 -16770039 -16853879
66698 -16853879 -17027788 -17242528 -17399024 -17495071 -17551658 -17468604 -17135534 -16666145 -16349863 -16346465
$$ packed form
66765i098612m59959K8483K91478J53935j13941k58086l69115n86027p62077o91544
66755a1865465m58928k68057p3021L01497P40870Q58443M65393k09772q10781
66746a1319821j155281j188565q53603j85155N42807R37669Q19608L85586q342
66737a2025097k14266l73449o08710p51605n27148J7784M62350M67406J42315
66728a3410420j55594k67942l14286l85391l73503j78887O6965J29511k7230k09385
66718a5126162k72927k85653l29104k86192j7159L18718L70370P5099k06823j67890
66708a5927723M4440R0795o9210j99288j89144j52676j58067j34603p4563q3840
66698a6853879j73909k14740j56496r6047n6587Q3054L33070M69389L16282L398
$$ plain form
66688 -16346465 -16552166 -16773319 -16903256 -16917858 -16845647 -16802846 -16945616 -17304862 -17720571 -17988729
66678 -17988729 -18042498 -17982966 -17981447 -18140611 -18374147 -18428483 -18127720 -17627268 -17328619 -17484968
66668 -17484968 -17951189 -18360960 -18480217 -18341849 -18121687 -17986976 -18042491 -18324972 -18805308
66659 -18805308 -19412307 -20063588 -20675915 -21174582 -21522574 -21737109 -21871094 -21995714 -22196876
66650 -22196876 -22529563 -22929947 -23218468 -23277298 -23230485 -23358955 -23780312 -24272112 -24494088 -24355583
66640 -24355583 -24068022 -23848285 -23708107 -23585162 -23527776 -23601923 -23706404 -23677930 -23575575 -23671051
66630 -23671051 -24097108 -24663363 -25113492 -25431298 -25765757 -26154563 -26488371 -26728956 -27026725
66621 -27026725 -27589126 -28488852 -29592160 -30624551 -31344403 -31734421 -32009145 -32368542 -32772397
$$ packed form
66688a6346465k05701k21153j29937j4602P2211M2801j42770l59246m15709k68158
66678a7988729n3769N9532J519j59164k33536n4336L00763N00452K98649j56349
66668a7484968m66221m09771j19257J38368K20162J34711n5515k82481m80336
66659a8805308o06999o51281o12327m98667l47992k14535j33985j24620k01162
66650b2196876l32687m00384k88521n8830M6813j28470m21357m91800k21976J38505
66640b4355583K87561K19737J40178J22945N7386p4147j04481K8474J02355r5476
66630b3671051m26057n66255m50129l17806l34459l88806l33808k40585k97769
66621b7026725n62401q99726j103308j032391p19852l90018k74724l59397m03855
$$ plain form
66612 -32772397 -33032774 -33085342 -33050478 -33041041 -33059631 -33133271 -33408102 -33990273 -34756739 -35440646
66602 -35440646 -35889149 -36147625 -36305674 -36382685 -36417134 -36568741 -37008111 -37699170 -38370960 -38748098
66592 -38748098 -38795431 -38743926 -38914121 -39490867 -40375388 -41220798 -41696264 -41787578 -41788793 -41945671
66582 -41945671 -42184701 -42278713 -42188509 -42079640 -42023544 -41855094 -41379184 -40602320 -39701211 -38838195
66572 -38838195 -38033970 -37134067 -35873450 -34065564 -31763202 -29167986 -26397985 -23449115
66564 -23449115 -20326343 -16985471 -13123607 -8324749 -2584591 3560413 9699449 16175436
66556 16175436 23708661 32449766 41782231 51163174 60832731 71458156 83283317 95937118
66548 95937118 109031020 122635293 137045931 152287482 168053394 184059364 200237654
$$ packed form
66612c2772397k60377n2568L4864R437j8590p3640k74831n82171p66466o83907
66602c5440646m48503k58476j58049p7011l4449j51607m39370o91059o71790l77138
66592c8748098m7333N1505j70195n76746q84521q45410m75466r1314j215j56878
66582d1945671k39030r4012R0204J08869N6096J68450M75910P76864R01109Q63016
66572c8838195Q04225Q99903J260617J807886K302362K595216K770001K948870
66564b3449115L122772L340872L861864M798858b584591C560413O139036O475987
66556A6175436P533225Q741105R332465R380943R669557J0625425J1825161J2653801
66548I5937118J3093902J3604273J4410638J5241551J5765912J6005970J6178290
$$ plain form
66541 200237654 216569280 232940632 249262946 265529479 281561814 296847877 310894870
66534 310894870 323678195 335456110 346154589 355277232 362527187 368191653 372698357
66527 372698357 376034683 377843810 377897777 376220829 372925297 368230777 362519012 356034903
66519 356034903 348600058 339971754 330473175 320889264 311638307 302367448 292518021 282017046
66511 282017046 271225104 260447849 249764534 239207097 228844460 218711694 208842673
66504 208842673 199380064 190520402 182330722 174695036 167428718 160372948 153406600 146483054
66496 146483054 139713642 133372658 127738019 122850074 118408864 113993657 109474926 105153392
66488 105153392 101362370 97972851 94491267 90690004 86919156 83631324 80754057 77782760
$$ packed form
66541B00237654J6331626J6371352J6322314J6266533J6032335J5286063J4046993
66534C10894870J2783325J1777915J0698479R122643P249955N664466M506704
66527C72698357L336326J809127N3967j676948l295532m694520n711765o484109
66519C56034903p434845q628304r498579r583911r250957r270859r849427j0500975
66511B82017046j0791942j0777255j0683315j0557437j0362637j0132766r869021
66504B08842673r462609q859662q189680p635686p266318p055770o966348o923546
66496A46483054o769412o340984n634639m887945m441210m415207m518731m321534
66488A05153392l791022l389519l481584l801263l770848l287832k877267k971297
$$ plain form
66480 77782760 74478681 71235563 68630045 66727131 64994643 62910271 60520902 58307984
66472 58307984 56575936 55148397 53711636 52272336 51095505 50284713 49665503 49102007
66464 49102007 48693025 48535444 48461348 48170699 47533061 46612849 45464813 44070659 42477810
66455 42477810 40872477 39479008 38446903 37825018 37552932 37447420 37265181 36843088 36194819
66446 36194819 35478398 34863557 34394312 33964298 33452516 32871373 32308163 31723557 30953023
66437 30953023 30007463 29253433 29108104 29559300 30134867 30372903 30192703 29761136 29151280
66428 29151280 28290833 27217774 26245970 25789677 26010625 26640913 27165417 27205930 26748175
66419 26748175 26028096 25285239 24689292 24398295 24472116 24677404 24569242 23917654 22959331
$$ packed form
66480G7782760l304079l243118k605518j902914j732488k084372k389369k212918
66472E8307984j732048j427539j436761j439300j176831q10792o19210n63496
66464D9102007m08982j57581p4096k90649o37638r20212j148036j394154j592849
66455D2477810j605333j393469j032105o21885k72086j05512j82239m22093o48269
66446C6194819p16421o14841m69245m30014n11782n81143n63210n84606p70534
66437C0953023r45560p54030j45329M51196N75567K38036j80200m31567o09856
66428B9151280q60447j073059r71804m56293K20948O30288N24504M0513m57755
66419B6748175p20079p42857n95947k90997P3821K05288j08162o51588r58323
$$ plain form
66410 22959331 22102991 21496682 21052812 20777467 20788192 21008246 21145253 21082256 21038693 21187191
66400 21187191 21334828 21193260 20785739 20352780 20009303 19758986 19696478 19840461 19838443 19258463
66390 19258463 18249148 17532065 17569598 18036856 18300659 18140916 17764769 17365044 17001597
66381 17001597 16802560 16945985 17393472 17816964 17839977 17323418 16501822 15881836 15838957 16212418
66371 16212418 16483569 16476759 16637941 17406188 18553327 19446831 19768038 19621799 19117321
66362 19117321 18298881 17434985 16897499 16679595 16438290 16110941 16079463 16545368 17105810
66353 17105810 17195997 16689051 15845448 14937168 14182325 13821954 13931917 14243600 14396139
66344 14396139 14315136 14173798 14076785 13974491 13816640 13599685 13295771 12883470 12416504 11947726
$$ packed form
66410B2959331q56340o06309m43870k75345J0725K20054J37007o2997m3563J48498
66400B1187191J47637j41568m07521m32959l43477k50317o2508J43983k018n79980
66390A9258463j009315p17083L7533M67258K63803j59743l76147l99725l63447
66381A7001597j99037J43425M47487M23492K3013n16559q21596o19986m2879L73461
66371A6212418K71151o810J61182P68247J147139Q93504L21207j46239n04478
66362A9117321q18440q63896n37486k17904k41305l27349l1478M65905N60442
66353A7105810R0187n06946q43603r08280p54843l60371J09963L11683J52539
66344A4396139q1003j41338r7013j02294j57851k16955l03914m12301m66966m68778
$$ plain form
66334 11947726 11440967 10870734 10346777 10028080 9969857 10138765 10479757 10856507 11041822
66325 11041822 10941675 10788417 10975579 11710467 12874716 14112264 14951767 14992773 14192475
66316 14192475 12956114 11814339 11039653 10650109 10632523 10932982 11286159 11321697 10932912
66307 10932912 10419792 10213876 10517914 11175731 11779262 11938503 11607508 11172638 11093922
66298 11093922 11416294 11719690 11570543 10939431 10167132 9627190 9472179 9628796 9935260
66289 9935260 10239318 10388381 10234490 9780098 9298424 9134965 9326915 9573134 9651855 9663537
66279 9663537 9716343 9608436 9113025 8441131 8070416 8132201 8302427 8350992 8463472 8863385
66269 8863385 9389224 9676543 9602844 9348991 9134697 9085278 9267697 9648677 10053170 10352691
$$ packed form
66334A1947726n06759n70233n23957l18697n8223J68908L40992L76750J85315
66325A1041822j00147j53258J87162P34888J164249J237548Q39503M1006q00298
66316A4192475j236361j141775p74686l89544j7586L00459L53177L5538l88785
66307A0932912n13120k05916L04038O57817O03531J59241l30995m34870p8716
66298A1093922L22372L03396j49147o31112p72299n39942j55011J56617L06464
66289I935260L04058J49063j53891m54392m81674j63459J91950K46219P8721J1682
66279I663537N2806j07907m95411o71894l70715O1785J70226M8565J12480L99913
66269H863385N25839K87319p3699k53853k14294m9419J82419L80980M04493K99521
$$ plain form
66259 10352691 10678912 11251742 11962319 12329605 12004612 11222507 10640613 10773966 11646150
66250 11646150 12874632 13931212 14366939 14014610 13095261 12038888 11120690 10336021 9650811
66241 9650811 9201931 9108420 9214448 9227966 9069311 8893900 8806715 8776372 8836263 9116189
66231 9116189 9578870 9933402 9953224 9752186 9639627 9811325 10242823 10730817 10960658 10717336
66221 10717336 10159640 9731009 9671242 9770129 9723665 9534074 9371631 9225495 8939398 8483736
66211 8483736 7963174 7436381 6934916 6577511 6457632 6491367 6572442 6785718 7244567 7794512
66201 7794512 8120742 8120304 7975855 7916804 8083148 8511613 9022337 9224705 8906401 8346004
66191 8346004 7990102 7925595 7949737 8011259 8193425 8356994 8255121 7994699 7930251 8065201
$$ packed form
66259A0352691L26221N72830P10577L67286l24993p82105n81894J33353Q72184
66250A1646150J228482J056580M35727l52329r19349j056373r18198p84669o85210
66241I650811m48880r3511J06028J3518j58655j75411q7185l0343N9891K79926
66231I116189M62681L54532J9822k01038j12559J71698M31498M87994K29841k43322
66221A0717336n57696m28631n9767R8887m6464j89591j62443j46136k86097m55662
66211H483736n20562n26793n01465l57405j19879L3735Q1075K13276M58849N49945
66201G794512L26230m38j44449n9051J66344M28465N10724K02368l18304n60397
66191H346004l55902o4507K4142O1522J82166J63569j01873k60422o4448J34950
$$ plain form
66181 8065201 8023357 7682247 7331932 7080210 6659524 6079381 5914264 6519936 7390968 7788018
66171 7788018 7711055 7761187 8231930 8805599 9036576 8720653 7879596 6793042 6006114 5913946
66161 5913946 6307253 6623294 6637411 6627147 6898745 7482710 8294289 9244592 10121938 10673201
66151 10673201 10918615 11142236 11462973 11630329 11353847 10651606 9781091 9006386 8526416
66142 8526416 8437001 8607066 8708002 8493454 7967176 7200606 6141597 4789093 3484094
66133 3484094 2786286 2957334 3679260 4411883 4974225 5599567 6397529 7013826 7045894 6643468
66123 6643468 6368789 6485850 6746151 6943379 7267219 7872655 8448869 8566229 8225414
66114 8225414 7713509 7107240 6313291 5470834 4878853 4553905 4267063 4037183 4185624
$$ packed form
66181H065201m1844l41110l50315k51722m20686n80143j65117O05672Q71032L97050
66171G788018p6963N0132M70743N73669K30977l15923q41057j086554p86928r2168
66161E913946L93307L16041J4117j0264K71598N83965Q11579R50303Q77346N51263
66151A0673201K45414K23621L20737J67356k76482p02241q70515p74705m79970
66142H526416q9415J70065J00936k14548n26278p66570j059009j352504j304999
66133C484094o97808J71048P21926P32623N62342O25342P97962O16297L2068m02426
66123F643468k74679J17061K60301J97228L23840O05436N76214J17360l40815
66114H225414n11905o06269p93949q42457n91981l24948k86842k29880J48441
$$ plain form
66105 4185624 4817488 5613261 6262718 6786465 7284342 7666187 7823842 7841686 7855383 7879804
66095 7879804 7915700 8039913 8243307 8348019 8234245 8015902 7876895 7861762 7906108 7917492
66085 7917492 7760025 7356428 6895663 6719787 6873622 6979385 6722087 6267748 6011437
66076 6011437 6062471 6159064 5963624 5293490 4227145 3181865 2746766 3196568 4200272
66067 4200272 5144351 5677676 5858902 5941386 6184207 6720135 7386743 7776879 7652260 7235211
66057 7235211 6932295 6879360 6935935 6984756 6980988 6796230 6306751 5642877 5123330 4922870
66047 4922870 4975715 5167770 5399344 5470096 5172334 4598507 4171868 4246360 4756307 5315527
66037 5315527 5587777 5537198 5400659 5455225 5775388 6199473 6503869 6529940 6177845 5493801
$$ packed form
66105D185624O31864P95773O49457N23747M97877L81845J57655J7844J3697K4421
66095G879804L5896J24213K03394J04712j13774k18343j39007j5133M4346J1384
66085G917492j57467m03597m60765j75876J53835J05763k57298m54339k56311
66076F011437N1034R6593j95440o70134j066345j045280m35099M49802J003704
66067D200272R44079N33325J81226Q2484K42821N35928O66608L90136j24619m17049
66057G235211l02916n2935N6575M8821l768j84758m89479o63874n19547k00460
66047D922870N2845J92055K31574P0752k97762n73827m26639P4492N09947N59220
66037E315527K72250n0579j36539N4566L20163M24085L04396K6071l52095o84044
$$ plain form
66027 5493801 4840090 4716521 5198807 5743133 5782706 5342649 4815894 4368629 3967034 3823200
66017 3823200 4281129 5226037 6077309 6484563 6625905 6696223 6536563 5987605 5221151 4447701
66007 4447701 3628735 2771137 2180568 2050875 2059584 1796381 1427248 1481568 2039775 2578544
65997 2578544 2683156 2538830 2583147 2961445 3492575 3961873 4264483 4384634 4402113 4476641
65987 4476641 4721412 5108542 5547570 6022968 6599665 7286974 7913054 8172291 7874947
65978 7874947 7184424 6532880 6236250 6248810 6349807 6466394 6679918 6971357 7132265 6975503
65968 6975503 6555182 6146480 6036317 6304110 6743189 7006286 6880077 6427415 5882369
65959 5882369 5486062 5429815 5805597 6489304 7147964 7482589 7447617 7203213 6957134 6908375
$$ packed form
66027E493801o53711j23569M82286N44326L9573m40057n26755m47265m01595j43834
66017C823200M57929R44908Q51272M07254J41342P0318j59660n48958p66454p73450
66007D447701q18966q57598n90569j29693Q709k63203l69133N4320N58207N38769
65997B578544J04612j44326M4317L78298N31130M69298L02610J20151J7479P4528
65987D476641K44771L87130M39028M75398N76697O87309O26080K59237k97344
65978G874947o90523o51544k96630J2560J00997J16587K13524K91439J60908j56762
65968F975503m20321m08702j10163K67793M39079K63097j26209m52662n45046
65959E882369l96307n6247L75782O83707O58660L34625l4972k44404k46079m8759
$$ plain form
65949 6908375 7171024 7586289 7733458 7336722 6606520 5994993 5666278 5405672 5018188
65940 5018188 4600036 4398401 4582586 5162471 5943641 6537378 6614483 6226917 5739840 5404754
65930 5404754 5154805 4864847 4626678 4650964 5012247 5587363 6158451 6507248 6502127 6181330
65920 6181330 5714534 5259566 4910194 4761787 4905853 5327150 5882867 6377486 6591643
65911 6591643 6337341 5676405 5029339 4812060 4942134 4955007 4653886 4355402 4376061 4575730
65901 4575730 4632107 4537345 4537878 4693843 4753966 4444910 3739319 2901150 2380263 2537451
65891 2537451 3299445 4163728 4685516 4866051 4940958 4961490 4816652 4552603 4393400 4456896
65881 4456896 4648778 4812876 4815757 4552787 4091302 3765944 3892345 4377116 4807154 4911026
$$ packed form
65949F908375K62649M15265J47169l96736p30202o11527l28715k60606l87484
65940E018188m18152k01635J84185N79885P81170N93737P7105l87566m87077l35086
65930E404754k49949k89958k38169K4286L61283N75116N71088L48797n121l20797
65920F181330m66796m54968l49372j48407J44066M21297N55717M94619K14157
65911F591643k54302o60936o47066k17279J30074J2873l01121k98484K0659J99669
65901D575730N6377r4762N33J55965O0123l09056p05591q38169n20887J57188
65891B537451P61994Q64283N21788J80535P4907K0532j44838k64049j59203O3496
65881D456896J91882J64098K881k62970m61485l25358J26401M84771M30038J03872
$$ plain form
65871 4911026 4729727 4375833 3912098 3514781 3476204 3902789 4569908 5155950 5472775 5446032
65861 5446032 5102936 4674441 4487511 4607042 4745227 4654144 4444849 4370588 4448584 4482958
65851 4482958 4360273 4130344 3838759 3452184 2970690 2518301 2289876 2408787 2791093
65842 2791093 3156781 3275392 3220724 3272978 3554343 3906292 4153917 4302325 4398341 4406685
65832 4406685 4356743 4420738 4672262 4928059 5015179 5038468 5166343 5301393 5240173 5067369
65822 5067369 5084858 5359941 5619647 5619076 5367553 4959945 4451234 3985633 3799193 3933881
65812 3933881 4105299 3994941 3578537 3099196 2848712 3027078 3622068 4301727 4598264
65803 4598264 4363879 3918824 3604856 3363093 2983735 2626776 2732680 3374698 4023468
$$ packed form
65871D911026j81299l53894m63735l97317l8577M26585O67119N86042L16825k6743
65861E446032l43096m28495j86930J19531J38185r1083k09295p4261P7996L4374
65851D482958j22685k29929k91585l86575m81494m52389k28425J18911L82306
65842B791093L65688J18611n4668N2254K81365L51949K47625J48408R6016Q344
65832D406685m9942O3995K51524K55797Q7120K3289J27875J35050o1220j72804
65822E067369J7489K75083K59706n71k51523m07608n08711m65601j86440J34688
65812C933881J71418j10358m16404m79341k50484J78366N94990O79659K96537
65803D598264k34385m45055l13968k41763l79358l56959J05904O42018O48770
$$ plain form
65794 4023468 4136334 3773625 3402028 3211513 2926576 2334293 1721756 1571462 1939265
65785 1939265 2392019 2579786 2624681 2814397 3120201 3266407 3182449 3096247 3154659 3219519
65775 3219519 3149111 3056478 3118398 3291850 3414799 3476132 3580318 3710584 3734602 3627899
65765 3627899 3508769 3448388 3410609 3388885 3439330 3551873 3642315 3705404 3825073 3995639
65755 3995639 4094377 4086648 4088597 4148908 4156127 4094715 4209148 4691894 5299965 5522834 5151073
65744 5151073 4513625 4110844 4125174 4328482 4381709 4177026 3917825 3876170 4073423 4247245
65734 4247245 4134772 3675018 2893719 1782704 473089 -617447 -1086526 -977017 -667434
65725 -667434 -340957 151292 827435 1291597 1151568 554457 59779 32935 348504 659409
$$ packed form
65794D023468J12866l62709l71597j90515k84937n92283o12537j50294L67803
65785A939265M52754J87767M4895J89716L05804J46206q3958q6202N8412O4860
65775C219519p0408r2633O1920J73452J22949O1333J04186J30266K4018j06703
65765C627899j19130o0381l7779k1724N0445J12543R0442O3089J19669J70566
65755C995639R8738p729J949O0311P219o1412J14433M82746O08071K22869l71761
65744E151073o37448m02781J4330K03308N3227k04683k59201m1655J97253J73822
65734D247245j12473m59754p81299j111015D73089f17447m69079J09509L09583
65725f67434L26477A51292O76143M64162j40029E54457E9779k6844L15569L10905
$$ plain form
65715 659409 774295 734399 653480 581346 521760 539397 764022 1202281 1597871 1650294 1408944
65704 1408944 1279029 1548298 2061317 2470570 2646371 2677688 2610880 2408447 2109105 1836485
65694 1836485 1665417 1613232 1715962 1981903 2333285 2721126 3195334 3701397 3944062 3697564
65684 3697564 3164134 2759943 2610268 2541552 2503676 2627887 2851537 2891222 2712982 2668701
65674 2668701 2995589 3505461 3946120 4309767 4527855 4233162 3234304 1993600 1200631
65665 1200631 989024 960976 881992 921832 1228820 1703950 2283899 3059741 3944359 4524883
65655 4524883 4467946 3903334 3249407 2789670 2528840 2331145 2094474 1878696 1888260 2189070
65645 2189070 2458560 2272978 1720460 1450862 1934367 2886436 3640647 3906313 3902052 3887831
$$ packed form
65715F59409J14886l9896q0919p2134n9586J7637K24625M38259L95590N2423k41350
65704A408944j29915K69269N13019M09253J75801L1317o6808k02433k99342k72620
65694A836485j71068n2185J02730K65941L51382L87841M74208N06063K42665k46498
65684C697564n33430m04191j49675o8716l7876J24211K23650L9685j78240m4281
65674B668701L26888N09872M40659L63647K18088k94693r98858j240704p92969
65665A200631k11607k8048p8984L9840L06988M75130N79949P75842Q84618N80524
65655D524883n6937n64612o53927m59737k60830j97695k36671k15778R564L00810
65645B189070K69490j85582n52518k69598M83505R52069P54211K65666m261j4221
$$ plain form
65635 3887831 3894810 3897008 3937599 3989673 3908638 3652625 3420386 3455450 3790752 4266401 4715519
65624 4715519 5029997 5110126 4911912 4591354 4480679 4783421 5297304 5567446 5388403 5068303
65614 5068303 5081525 5504402 5930770 5939951 5500031 4879862 4333336 3977209 3847936 3908183
65604 3908183 4015114 3990641 3741908 3305011 2843211 2632364 2913318 3625980 4348615 4620326
65594 4620326 4306862 3610176 2839041 2282531 2159554 2454584 2831350 2914351 2661220 2296271
65584 2296271 1936838 1549665 1273899 1437647 2094535 2831321 3274782 3564858 4024621
65575 4024621 4520622 4531941 3850942 2880902 2161816 1883436 1974961 2384148 3041392 3731907
65565 3731907 4251865 4598884 4808424 4723545 4215977 3600288 3483080 4059295 4798000 5025224
$$ packed form
65635C887831O979K198M0591N2074q1035k56013k32239L5064L35302M75649M49118
65624D715519L14478Q0129j98214l20558j10675L02742N13883K70142j79043l20100
65614E068303J3222M22877M26368R181m39920o20169n46526l56127j29273O0247
65604C908183J06931k4473k48733m36897m61800k10847K80954P12662P22635K71711
65594D620326l13464o96686p71135n56510j22977K95030L76766Q3001k53131l64949
65584B296271l59433l87173k75766J63748O56888P36786M43461K90076M59763
65575D024621M96001J1319o80999r70040p19086k78380R1525M09187O57244O90515
65565C731907N19958L47019K09540q4879n07568o15689j17208N76215P38705K27224
$$ plain form
65555 5025224 4667337 4203545 3984639 3870832 3573003 3105749 2731950 2551501 2321462
65546 2321462 1738695 851873 136725 115473 865309 1911603 2639541 2805073 2622528
65537 2622528 2412140 2272156 2102867 1824850 1477694 1150054 901291 759631 752376 914177
65527 914177 1250457 1670300 1979841 2017379 1821685 1614081 1595051 1816355 2250970 2857838
65517 2857838 3495676 3892002 3865672 3572725 3410589 3653835 4244692 4916759 5425332 5656381
65507 5656381 5616364 5367822 4951778 4395651 3836562 3547234 3694937 4105667 4430476 4544030
65497 4544030 4596292 4652628 4526739 4089296 3517659 3041920 2621013 2125370 1713570 1696841
65487 1696841 2028091 2242479 2016990 1551208 1252989 1245397 1357438 1437244 1451569 1373853
$$ packed form
65555E025224l57887m63792k18906j13807k97829m67254l73799j80449k30039
65546B321462n82767H51873A36725k1252P49836J046294P27938J65532j82545
65537B622528k10388j39984j69289k78017l47156l27640k48763j41660p255J61801
65527I14177L36280M19843L09541L7538j95694k07604j9030K21304M34615O06868
65517B857838O37838L96326k6330k92947j62136K43246N90857O72067N08573K31049
65507E656381m0017k48542m16044n56127n59089k89328J47703M10730L24809J13554
65497D544030N2262N6336j25889m37443n71637m75739m20907m95643m11800j6729
65487A696841L31250K14388k25489m65782k98219p592J12041P9806J4325p7716
$$ plain form
65477 1373853 1228494 1244740 1729925 2691373 3721720 4354476 4444495 4134808 3582783 2881225
65467 2881225 2197125 1781297 1742961 1907826 1996695 1897592 1680098 1404550 1066161 728430
65457 728430 532686 479521 346981 -9108 -357099 -292810 261913 947172 1392599 1593348
65447 1593348 1790616 2130691 2552479 2902492 3048817 2967952 2823933 2876756 3198216 3551326
65437 3551326 3665962 3565378 3507198 3682966 4105158 4687272 5239044 5444178 5086354 4338562
65427 4338562 3659096 3372175 3490992 3912277 4526806 5078791 5189061 4707491 3903831
65418 3903831 3165460 2623454 2190434 1811072 1498103 1223583 952465 721416 540651
65409 540651 299456 -66752 -390063 -438943 -225744 54273 365317 878927 1630846 2347576
$$ packed form
65477A373853j45359J6246M85185R61448J030347O32756R0019l09687n52025p01558
65467B881225o84100m15828l8336J64865Q8869r9103k17494k75548l38389l37731
65457G28430j95744n3165j32540i108l47991O4289B61913O85259M45427K00749
65447A593348J97268L40075M21788L50013J46325q0865j44019N2823L21460L53110
65437C551326J14636j00584n8180J75768M22192N82114N51772K05134l57824p47792
65427D338562o79466k86921J18817M21285O14529N51985J10270m81570q03660
65418C903831p38371n42006m33020l79362l12969k74520k71118k31049j80765
65409E40651k41195f6752l23311m8880K13199E4273L11044N13610P51919P16730
$$ plain form
65399 2347576 2750600 2915037 3190944 3800337 4581263 5118212 5119178 4705767 4312147 4221906
65389 4221906 4234951 3921975 3213830 2576586 2526105 3099796 3912014 4611636 5117931 5451040
65379 5451040 5528991 5229089 4575345 3768170 3019081 2400709 1885472 1502231 1383252 1609447
65369 1609447 2042059 2376022 2376592 2040550 1547203 1110511 872895 858255 974804 1096117
65359 1096117 1184963 1335850 1676235 2217253 2792877 3152098 3154505 2907294 2676694 2624271
65349 2624271 2661091 2602999 2425821 2302770 2420176 2812319 3322473 3639430 3441558 2670331
65339 2670331 1681028 986012 792112 873356 912882 844865 807940 891575 1042852 1164949
65329 1164949 1207275 1175061 1120593 1134765 1316398 1718063 2271288 2748582 2901660 2747953
$$ packed form
65399B347576M03024J64437K75907O09393P80926N36949R66m13411l93620r0241
65389D221906J3045l12976p08145o37244n0481N73691Q12218O99622N06295L33109
65379E451040P7951k99902o53744q07175p49089o18372n15237l83241j18979K26195
65369A609447M32612L33963N70l36042m93347m36692k37616j4640J16549J21313
65359A096117Q8846J50887L40385N41018N75624L59221K407k47211k30600n2423
65349B624271L6820n8092j77178j23051J17406L92143N10154L16957j97872p71227
65339B670331r89303o95016j93900Q1244L9526o8017l6925Q3635J51277J22097
65329A164949M2326l2214n4468J4172J81633M01665N53225M77294J53078j53707
$$ plain form
65319 2747953 2642140 2893699 3348872 3554995 3340324 2984738 2746484 2489867 1958049
65310 1958049 1201523 509414 69397 -62225 216723 949122 1848149 2412497 2393274 1983694
65300 1983694 1521018 1180222 995491 979694 1110749 1319739 1573447 1869864 2102622 2056234
65290 2056234 1623282 949908 319234 -24048 72861 616260 1364553 1930195 2138485 2206600
65280 2206600 2432450 2785092 2972362 2878282 2737374 2812930 3030117 3025939 2529150 1651809
65270 1651809 837540 540495 905698 1707479 2572639 3241429 3628242 3742513 3675031 3624998
65260 3624998 3763162 3982136 3896402 3225707 2150426 1178637 662294 534664 523808 504155
65250 504155 571322 847511 1302260 1742475 1920570 1679080 1064340 317559 -274330 -534356
$$ packed form
65319B747953j05813K51559M55173K06123k14671l55586k38254k56617n31818
65310A958049p56526E09414F9397f2225B16723P32399Q99027N64348j9223m09580
65300A983694m62676l40796j84731j5797J31055K08990K53708K96417K32758m6388
65290B056234m32952o73374C19234b4048G2861N43399P48293N65642K08290O8115
65280B206600K25850L52642J87270r4080j40908P5556K17187m178m96789q77341
65270A651809q14269k97045L65203Q01781Q65160O68790L86813J14271o7482n0033
65260C624998J38164K18974q5734o70695j075281r71789n16343j27630j0856j9653
65250E04155O7167K76189M54749M40215J78095k41490o14740C17559b74330k60026
$$ plain form
65240 -534356 -433971 -57376 433345 880197 1266573 1724001 2306139 2804849 2927959 2658058
65230 2658058 2301435 2155889 2252400 2452411 2645504 2755436 2668182 2295105 1688837 1029145
65220 1029145 512076 262296 277008 426954 596401 834646 1242080 1692501 1880801 1757899
65210 1757899 1701433 2046874 2612459 2945712 2923907 2801772 2715435 2507536 2136439 1925320
65200 1925320 2171442 2687113 2966126 2746629 2240656 1834618 1702902 1729752 1710927 1570525
65190 1570525 1386067 1242151 1138207 1084358 1190223 1516064 1870334 1927954 1586478 1069460
65180 1069460 639833 351627 137357 -14303 -73441 -49548 57395 319628 800135 1441652
65170 1441652 2084691 2565010 2809533 2931072 3204071 3781013 4412805 4648723 4384747
$$ packed form
65240e34356J00385e7376D33345M46852L86376M57428N82138M98710J23110k69901
65230B658058l56623j45546R6511K00011J93093J09932q7254l73077o06268o59692
65220A029145E12076k49780J4712J49946J69447K38245M07434M50421J88300j22902
65210A757899n6466L45441N65585L33253k1805j22135q6337k07899l71097k11119
65200A925320K46122N15671K79013k19497n05973m06038j31716K6850j8825j40402
65190A570525j84458j43916j03944n3849J05865L25841L54270N7620l41476n17018
65180A069460m29627k88206A37357a4303n9138K3893E7395K62233M80507O41517
65170A441652O43039M80319K44523J21539K72999N76942O31792K35918k63976
$$ plain form
65161 4384747 4005755 3869563 3873232 3721667 3430122 3286383 3406514 3596740 3647695 3557951
65151 3557951 3452618 3430672 3480506 3419070 2974548 2098006 1143577 551898 384951 357448
65141 357448 281067 244335 360575 594829 895049 1262251 1606073 1740539 1631696 1476979
65131 1476979 1440071 1467832 1450099 1367659 1173750 748746 158208 -226293 -114743 271288
65120 377969 -90760 -920189 -1674948 -2057088 -1983026 -1500965 -724105 229540 1276490 2309314
65110 2309314 3111158 3409642 3057233 2153984 1008644 -18408 -694541 -988729 -958951 -598816
65100 -598816 111250 1021591 1847952 2436479 2827434 2993285 2746413 2076568 1363722 989903
65090 989903 878897 711725 488988 516007 844216 1125324 1142473 1141827 1421173 1844542
$$ packed form
65161D384747l78992j36192L669j51565k91545j43739J20131J90226N0955q9744
65151C557951j05333k1946M9834o1436m44522q76542r54429E51898j66947k7503
65141C57448p6381l6732J16240K34254L00220L67202L43822J34466j08843j54717
65131A476979l6908K7761j7733q2440j93909m25004A58208b26293J11550B71288
65120C77969i0760q29429p54759l82140P4062M82061g24105B29540J046950J032824
65110B309314Q01844K98484l52409r03249A008644a8408o76133k94188K9778L60135
65100e98816A11250R10341Q26361N88527L90955J65851k46872o69845p12846l73819
65090I89903j11006j67172k22737K7019L28209K81108J7149o46K79346M23369
$$ plain form
65080 1844542 2023148 1815172 1392860 923060 450896 75873 -13826 225968 564923 699307
65070 699307 550283 329119 322842 619513 1040175 1349229 1499507 1611319 1752412 1867026
65060 1867026 1923229 1971454 2011003 1972927 1934239 2177686 2871629 3792544 4519108 4824423
65050 4824423 4752437 4429208 3989938 3613253 3410352 3285664 3061978 2717323 2363612 2069288
65040 2069288 1885406 1949343 2288774 2556859 2290172 1516413 834312 761177 1214650 1741196
65030 1741196 1997651 1837752 1192829 179212 -790038 -1302195 -1369036 -1372569 -1591144 -1934527
65020 -1934527 -2142886 -2088369 -1831538 -1470825 -990026 -263755 734463 1730252 2292927 2267576
65010 2267576 1942288 1693263 1630175 1747210 2207133 3128072 4138023 4523486 3974320
$$ packed form
65080A844542J78606k07976m22312m69800D50896G5873a3826B25968L38955J34384
65070F99307j49024k21164o277K96671M20662L09054J50278J11812J41093J14614
65060A867026N6203M8225L9549l8076l8688K43447O93943R20915P26564L05315
65050D824423p1986l23229m39270l76685k02901j24688k23686l44655l53711k94324
65040B069288j83882O3937L39431K68085k66687p73759o82101p3135M53473N26546
65030A741196K56455j59899o44923A79212g90038n12157o6841l533k18575l43383
65020a934527k08359N4517K56831L60713M80799b63755G34463R95789N62675k5351
65010B267576l25288k49025o3088J17035M59923R20939J009951L85463n49166
$$ plain form
65001 3974320 2965051 2255217 2164134 2450298 2731253 2826353 2758806 2619294 2487132 2423577
64991 2423577 2497444 2778659 3243783 3691263 3846006 3601224 3111866 2632848 2327342 2236783
64981 2236783 2329322 2511509 2654166 2665884 2520983 2229993 1867357 1622177 1680798 1989866
64971 1989866 2238898 2157630 1756571 1226949 730641 395652 394362 827845 1530344 2126087
64961 2126087 2320898 2082360 1560469 940858 391412 40840 -80191 -65971 -59045 -118107
64951 -118107 -142139 68372 633756 1463289 2339400 3139635 3900764 4622860 5100697 5063130
64941 5063130 4474458 3627789 2928590 2596253 2519911 2348475 1777995 851616 -20342 -395023
64931 -395023 -148139 523866 1354086 2130717 2625023 2605315 2046955 1260586 705614 659288
$$ packed form
65001C974320j009269p09834r1083K86164K80955R5100o7547j39512j32162o3555
64991B423577P3867K81215M65124M47480J54743k44782m89358m79018l05506r0559
64981B236783R2539J82187J42657J1718j44901k90990l62636k45180N8621L09068
64971A989866K49032q1268m01059n29622m96308l34989j290M33483P02499N95743
64961B126087J94811k38538n21891o19611C91412D0840h0191J4220O926n9062
64951a18107k4032F8372N65384Q29533Q76111Q00235P61129P22096M77837l7567
64941E063130n88672q46669o99199l32337p6342j71436n70480H51616b0342l74681
64931c95023a48139E23866Q30220P76631M94306j9708n58360p86369n54972m6326
$$ plain form
64921 659288 1071236 1681242 2218349 2515558 2526192 2302183 1968949 1683752 1560102 1595077
64911 1595077 1673444 1659336 1494129 1232167 1018772 1015530 1268478 1615383 1779719 1598433
64901 1598433 1120171 476990 -231375 -862471 -1172484 -1007401 -532408 -115756 57617 164864
64891 164864 515481 1229314 2160959 3037796 3605500 3703482 3299199 2500176 1552486 800204
64881 800204 528402 732518 1076834 1191929 1011967 744557 565154 483387 472503 525087
64871 525087 543206 383402 116016 58726 400948 930113 1295366 1433128 1549109 1770191
64861 1770191 2045024 2374836 2908501 3719582 4620955 5280054 5450651 5080954 4311506
64852 4311506 3423959 2706618 2293735 2138598 2115433 2085733 1916193 1575052 1235822 1168717
$$ packed form
64921F59288M11948O10006N37107K97209J0634k24009l33234k85197j23650L4975
64911A595077P8367j4108j65207k61962k13395l242K52948L46905J64336j81286
64901A598433m78262D76990b31375o31096l10013J65083M74993a15756E7617J07247
64891A64864L50617P13833R31645Q76837N67704R7982m04283p99023r47690p52282
64881H00204k71802K04116L44316J15095j79962k67410j79403q1767j0884N2584
64871E25087J8119j59804A16016n7290L42222N29165L65253J37762J15981K21082
64861A770191K74833L29812N33665Q11081R01373O59099J70597l69697p69448
64852D311506q87547p17341m12883j55137k3165k9700j69540l41141l39230o7105
$$ plain form
64842 1168717 1481720 2033669 2582947 2905142 2804159 2227491 1433920 842612 606230
64833 606230 516070 436467 574620 1075803 1565104 1464674 718768 -136548 -642864 -833279
64823 -833279 -920437 -929957 -824937 -693938 -554093 -188397 517573 1224053 1462553 1266798
64813 1266798 1146295 1391078 1714112 1716154 1452841 1333100 1601043 2128532 2649770 3000023
64803 3000023 3122779 3014282 2735648 2397098 2066122 1725914 1357728 1028534 850540
64794 850540 854376 927907 894806 661448 304614 33737 57138 436589 1026092 1562426 1866733
64783 1866733 1974952 2039806 2105745 2043287 1734246 1254627 807162 504743 282263 3262
64772 -407217 -937469 -1554328 -2264975 -3069085 -3796995 -4069437 -3622158 -2732376 -2095956 -2080706
$$ packed form
64842A168717L13003N51949N49278L22195j00983n76668p93571n91308k36382
64833F06230r0160p9603J38153N01183M89301j00430G18768a36548n06316j90415
64823h33279q7158r520J05020J30999J39845a88397E17573P06480K38500j95755
64813A266798j20503K44783L23034K042k63313j19741K67943N27489N21238L50253
64803C000023J22756j08497k78634l38550l30976l40208l68186l29194j77994
64794H50540L836P3531l3101k33358C04614C3737K3401L79451N89503N36334L04307
64783A866733J08219O4854O5939o2458l09041m79619m47465l02419k22480C262
64772d07217n30252o16859p10647q04110p27910k72442M47279Q89782O36420J5250
$$ plain form
64762 -2080706 -2254679 -1916961 -1004750 -150262 170201 190077 409418 884531 1206942 1049400
64752 1049400 520570 48703 56070 649810 1476955 1969336 1896640 1621192 1673006 2166788
64742 2166788 2809396 3370782 3862344 4232854 4177813 3438038 2188353 990960 367187
64732 436855 912965 1393561 1686729 1897967 2228829 2728769 3254645 3606659 3653695 3393635
64722 3393635 2973434 2602470 2360822 2132311 1803641 1470937 1348677 1527308 1929207
64713 1929207 2438129 2923747 3186418 3069270 2647987 2155517 1693974 1177348 596255
64704 596255 156195 38986 153977 269599 330313 493380 826394 1073868 837589 30475
64693 -907163 -1350418 -1062703 -326059 498478 1326400 2135645 2630428 2443529 1636728 715781
$$ packed form
64762b080706j73973L37718R12211a50262A70201J9876K19341M75113L22411j57542
64752A049400E20570D8703P367N93740Q27145M92381p2696k75448N1814M93782
64742B166788O42608N61386M91562L70510n5041p39775j249685I90960C67187
64732D36855M76110M80596K93168K11238L30862M99940N25876L52014M7036k60060
64722C393635m20201l70964k41648k28511l28670l32704j22260J78631M01899
64713A929207N08922M85618K62671j17148m21283m92470m61543n16626n81093
64704E96255A56195C8986J14991J15622O0714J63067L33014K47474k36279C0475
64693i07163m43255K87715c26059D98478Q27922Q09245M94783j86899q06801G15781
$$ plain form
64682 108272 -151785 -202249 -90778 152731 402711 563569 696898 918129 1251119 1623192
64672 1623192 1889545 1867637 1535121 1208182 1279384 1707683 2025761 1964008 1789165 1850978
64662 1850978 2074173 2158997 2057520 1942027 1865168 1784033 1813701 2095493 2429537 2385008
64652 2385008 1860911 1280254 1111176 1360522 1627771 1537037 1058012 504819 271722 513131
64642 513131 1060785 1641399 2069599 2203790 1939185 1424749 1091409 1196699 1469658 1487555
64632 1487555 1275377 1186153 1293117 1349839 1354118 1638344 2223536 2545660 2147448 1333620
64622 1333620 806162 861149 1246962 1620034 1794683 1657559 1190221 581485 73277 -297029
64611 -611137 -799816 -707915 -397665 -126122 -1967 97276 232863 274801 144014 -39001 -167681
$$ packed form
64682A08272a51785n0464i0778A52731K49980J60858J33329K21231L32990L72073
64672A623192K66353k1908l32516l26939P1202M28299L18078o1753j74843O1813
64662A850978K23195Q4824j01477j15493p6859q1135K9668K81792L34044m4529
64652B385008n24097n80657j69078K49346K67249r0734m79025E04819k33097K41409
64642E13131N47654N80614M28200J34191k64605n14436l33340J05290K72959J7897
64632A487555k12178q9224J06964N6722M279K84226N85192L22124l98212q13828
64622A333620n27458N4987L85813L73072J74649j37124m67338E81485G3277b97029
64611f11137j88679R1901L10250a26122a967I7276J35587M1938j30787c9001j28680
$$ plain form
64600 -167681 -322755 -583026 -815898 -841291 -714719 -652261 -693680 -624253 -292569 121842
64589 280937 108892 -63011 164204 806510 1463885 1748595 1665340 1523431 1568634 1808471
64579 1808471 2131910 2436551 2627631 2643458 2535934 2400477 2168661 1621731 732591 -132270
64568 -531983 -411417 -65232 300724 722644 1170577 1391785 1253071 1022366 1041178 1245989
64558 1245989 1321944 1262253 1386005 1728116 1823226 1358691 739712 641859 1172264 1859839
64548 1859839 2384003 2868481 3408417 3758796 3710079 3434024 3168082 2793446 2049522 1031543
64538 1031543 156634 -314170 -449514 -386928 -195626 -23267 -75636 -310698 -356563 104385
64527 978336 1880578 2479617 2618865 2271151 1600862 1018101 924240 1304389 1689094 1616852
$$ packed form
64600a67681j55074k60271k32872k5393J26572O2458m1419O9427b92569A21842
64589B80937A08892f3011A64204O42306O57375K84710q3255j41909M5203K39837
64579A808471L23439L04641J91080J5827j07524j35457k31816n46930G32591a32270
64568e31983J20566f5232C00724M21920M47933K21208j38714k30705J8812K04811
64558A245989P5955n9691J23752L42111R5110m64535o18979r7853N30405O87575
64548A859839N24164M84478N39936L50379m8717k76055k65942l74636p43924j017979
64538A031543A56634c14170j35344O2586J91302b3267n2369k35062m5865A04385
64527I78336R02242N99039J39248l47714o70289n82761r3861L80149L84705p2242
$$ plain form
64517 1616852 1081572 457204 44457 -189808 -423950 -666583 -728172 -456770 97339 742046
64507 742046 1283470 1618041 1795979 2008712 2388959 2777306 2822438 2401836 1816414 1444542
64497 1444542 1318463 1205041 1011821 903718 1045040 1424525 1943790 2501912 2977651
64488 2977651 3296645 3524319 3714411 3681060 3175139 2331867 1657620 1448350 1489462 1492037
64478 1492037 1529347 1778519 2093543 2196716 2121672 2064225 1893982 1272151 281862 -502124
64467 -713243 -600396 -575792 -705525 -860650 -1030599 -1178795 -1060521 -557531 -26891 52249
64456 -316500 -727328 -948448 -1023948 -861224 -206039 850530 1774828 2243739 2571694 3201534
64446 3201534 4017057 4494874 4403189 4022639 3713882 3552942 3424850 3249618 3034917 2841177
$$ packed form
64517A616852n35280D57204D4457a89808k34142k42633o1589K71402I7339O44707
64507G42046N41424L34571J77938K12733L80247L88347M5132m20602n85422l71872
64497A444542j26079j13422j93220j08103J41322L79485N19265N58122M75739
64488B977651L18994K27674J90092l3351n05921q43272o74247k09270M1112K575
64478A492037L7310K49172L15024J03173p5044n7447j70243o21831B81862e02124
64467g13243J12847K4604j29733j55125j69949j48196J18274N02990b6891E2249
64456c16500m10828k21120p5500J62724b06039H50530R24298M68911L27955O29840
64446C201534Q15523M77817r1685l80550l08757j60940j28092j75232k14701j93740
$$ plain form
64436 2841177 2752457 2792675 2846469 2737949 2394968 1887668 1356724 990995 1005135 1484155
64426 1484155 2250994 3008615 3612974 4102929 4496028 4714889 4733083 4640632 4506766 4290885
64416 4290885 3947223 3530174 3150968 2903173 2849263 2985843 3191970 3302230 3261419 3125366
64406 3125366 2902533 2511965 1930511 1267725 656732 188576 -8692 215958 832338 1541263
64396 1541263 2010078 2152893 2118684 2078520 2096290 2139712 2145064 2114963 2174569 2443775 2838585
64385 2838585 3135153 3267019 3377655 3493619 3364910 2812536 2047294 1381322 737949
64376 737949 -235743 -1562474 -2727699 -3186143 -2896548 -2254345 -1636808 -1134587 -648288
64367 -648288 -113410 411107 859071 1303226 1871899 2482903 2816592 2702442 2419620 2412200
$$ packed form
64436B841177q8720M0218N3794j08520l42981n07300n30944l65729J4140M79020
64426A484155P66839P57621O04359M89955L93099K18861J8194r2451j33866k15881
64416D290885l43662m17049l79206k47795n3910J36580K06127J10260m0811j36053
64406C125366k22833l90568n81454o62786o10993A88576h692B15958O16380P08925
64396A541263M68815J42815l4209m0164J7770M3422N352l0101N9606K69206L94810
64385B838585K96568J31866J10636J15964j28709n52374p65242o65972o43373
64376G37949b35743j326731j165225m58444K89595O42203O17537N02221M86299
64367f48288a13410D11107M47964M44155N68673O11004L33689j14150k82822p420
$$ plain form
64357 2412200 2767187 3185425 3416233 3456022 3321906 2952660 2450955 2134856 2138272 2153880
64347 2153880 1794384 1082091 382537 -31317 -138393 1476 318802 662086 904054 1155633
64337 1155633 1656993 2383718 2957827 3072463 2854465 2646150 2520068 2204486 1502939
64328 1502939 627126 3376 -206080 -279561 -584433 -1100742 -1401689 -1156357 -564582 -163447
64317 -214249 -436655 -421516 -164399 -33018 -280708 -787592 -1277639 -1576366 -1585936 -1233376
64307 -1233376 -625264 -100495 90802 63505 28469 -136996 -700582 -1454640 -1694705 -1015572
64297 -1015572 169126 1145357 1694521 2096525 2561494 3030398 3432403 3748940 3824208 3478909
64287 3478909 2896631 2587792 2826088 3327516 3584717 3323117 2566504 1519592 545152
$$ packed form
64357B412200L54987M18238K30808L9789j34116l69246n01705l16099L416J5608
64347B153880l59496p12293C82537c1317j07076A476L17326L43284K41968K51579
64337A155633N01360P26725N74109J14636k17998k08315j26082l15582p01547
64328A502939F27126C376b06080p3481l04872n16309l00947K45332e64582a63447
64317b14249k22406J5139a64399c3018k47690n06884m90047k98727r570L52560
64307a233376O08112a00495I0802k7297B8469a36996n63586p54058k40065O79133
64297a015572A69126R76231N49164M02004M64969M68904M02005L16537P5268l45299
64287C478909n82278l08839K38296N01428K57201k61600p56613j046912E45152
$$ plain form
64277 39620 106775 430366 583485 375822 -142929 -819810 -1405469 -1606634 -1327692 -781130
64267 -781130 -241062 205084 557091 711897 549776 126692 -361616 -745114 -924468 -869614
64257 -869614 -686161 -568453 -573929 -555964 -406380 -210500 -73053 744 -71408 -471852 -1108266
64246 -1108266 -1482346 -1248055 -700312 -372923 -346709 -360562 -431680 -824623 -1418609 -1663041
64236 -1663041 -1318503 -789470 -520904 -471405 -430454 -465240 -685365 -828512 -494659 298284
64225 1116439 1632478 1887177 2041013 2105740 1999178 1745622 1544689 1626712 1991514 2311875
64215 2311875 2247097 1901187 1790064 2229742 2901936 3175931 2751679 1847116 875077 125081
64204 -303862 -455717 -435412 -304762 -95474 48624 -98684 -531236 -847943 -602935 208968
$$ packed form
64277C9620O7155L23591J53119k07663a42929o76881n85659k01165K78942N46562
64267g81130b41062B05084L52007J54806j62121A26692c61616l83498j79354N4854
64257h69614J83453J17708n476J7965J49584J95880g3053G44g1408m00444o36414
64246a108266l74080K34291N47743L27389K6214j3853p1118l92943n93986k44432
64236a663041L44538N29033K68566M9499M0951l4786k20125j43147L33853B98284
64225A116439N16039K54699J53836O4727j06562k53556k00933Q2023L64802L20361
64215B311875o4778l45910j11123M39678O72194K73995m24252r04563H75077A25081
64204c03862j51855K0305J30650i5474D8624i8684m32552l16707K45008B08968
$$ plain form
64193 1136081 1674018 1579169 916547 16943 -660943 -844329 -654512 -392736 -184302 -1066
64182 58437 -189572 -636461 -801892 -292748 772271 1889414 2612397 2790446 2501303 1927021
64172 1927021 1319627 992257 1212273 1963673 2781116 2996951 2359758 1357823 724911
64163 724911 638006 625980 287220 -187379 -344261 -76293 326404 587940 654366 548405
64153 548405 272588 -90657 -351400 -363604 -125770 282090 760453 1180777 1447962 1630803
64143 1630803 1918992 2372447 2809306 3034402 3076782 3055331 2885933 2346401 1470992 672540
64132 343036 467345 763195 1059186 1333291 1489234 1386809 1106605 911676 872456 793227
64122 793227 631807 699139 1187640 1714172 1670005 951822 42464 -608799 -981341 -1228625
$$ packed form
64193A136081N37937r4849o62622A6943f60943j83386J89817K61776a84302a066
64182E8437a89572m46889j65431b92748G72271J117143P22983J78049k89143n74282
64172A927021o07394l27370K20016P51400Q17443K15835o37193j001935o32912
64163G24911q6905j2026B87220a87379j56882g6293C26404K61536O6426j05961
64153E48405B72588i0657k60743j2204a25770B82090M78363M20324K67185J82841
64143A630803K88189M53455M36859K25096M2380k1451j69398n39532q75409F72540
64132C43036J24309K95850K95991K74105J55943j02425k80204j94929l9220p9229
64122G93227j61420O7332M88501N26532m4167p18183D2464f08799l72542k47284
$$ plain form
64112 -1228625 -1348675 -1276149 -1116517 -1111573 -1422204 -1987378 -2512962 -2623430 -2202958 -1600042
64102 -1600042 -1284799 -1267762 -1112030 -598258 -54270 182885 321530 772362 1428300 1705158
64092 1705158 1289754 494969 -175883 -491958 -428842 19698 719947 1285810 1367444 1028155
64082 1028155 681690 669764 974805 1277370 1214540 684696 19983 -244271 52643 403177
64072 403177 118086 -875306 -1897561 -2230836 -1811365 -1141667 -691656 -551837 -569518 -588498
64062 -588498 -499053 -205383 324018 980377 1543151 1809824 1721963 1392850 1005161 656754
64052 656754 317310 -48703 -364983 -506670 -439387 -206934 194804 805914 1534256 2117869
64042 2117869 2334018 2178907 1788663 1281495 779133 499078 648966 1184129 1761666
$$ packed form
64112a228625j20050P2526J59632M944l10631n65174n25584j10468M20472O02916
64102a600042L15243J7037J55732N13772e4270A82885J38645M50832O55938K76858
64092A705158m15404D94969a75883l16075O3116A9698P00249N65863Q1634l39289
64082A028155l46465j1926L05041L02565o2830n29844A9983b44271E2643L50534
64072D03177A18086h75306j022255l33275M19471O69698M50011J39819j7681j8980
64062e88498Q9445b05383C24018O56359N62774K66673q7861l29113l87689l48407
64052F56754C17310d8703l16280j41687O7283b06934A94804O11110P28342N83613
64042B117869K16149j55111l90244n07168n02362k80055J49888N35163N77537
$$ plain form
64033 1761666 2002788 1800954 1380745 1079841 1069168 1272698 1554370 1915631 2396485 2807463
64023 2807463 2771556 2163008 1366985 935100 1057344 1507348 1986976 2316399 2381092 2176856
64013 2176856 1912746 1809838 1759214 1430424 778858 185814 3161 221332 693315 1358583
64003 1358583 2022209 2232658 1761483 1051372 811523 1211391 1781967 2067669 2036673 1830167
63993 1830167 1459211 890660 199587 -493601 -1074836 -1371473 -1257621 -921470 -800221
63984 -800221 -1079576 -1407125 -1261572 -509737 502652 1279839 1481133 1057423 282398 -399039
63973 -691980 -621103 -371153 -86089 126041 182008 153901 238700 425270 361860 -211701 -1031176
63962 -1031176 -1578902 -1706133 -1697053 -1763724 -1816279 -1770956 -1733860 -1724429 -1498459 -864067 8417
$$ packed form
64033A761666K41122k01834m20209l00904j0673K03530K81672L61261M80854M10978
64023B807463l5907o08548p96023m31885J22244M50004M79628L29423O4693k04236
64013B176856k64110j02908n0624l28790o51566A85814C161K18171M71983O65268
64003A358583O63626K10449m71175p10111k39849L99868N70576K85702l0996k06506
63993A830167l70956n68551A99587d93601n81235k96637J13852L36151J21249
63984h00221k79355l27549J45553e09737E02652P77187K01294m23710B82398c99039
63973f91980P0877K49950h6089A26041N5967k8107Q4799J86570o3410b11701q19475
63962a031176n47726j27231R080o6671n2555M5323L7096R431K25970O34392H417
$$ plain form
63950 791138 1367309 1804401 2096797 2166901 2048775 1838829 1478126 793412 -207262 -1237881
63940 -1237881 -1985645 -2351363 -2414765 -2279715 -2011383 -1647529 -1211206 -736960 -290500 69131
63929 324072 454045 418963 266853 181990 281029 414477 367242 246750 419600 970933
63919 970933 1470308 1466444 1040571 633289 441290 270326 -46982 -396551 -624029 -758629
63909 -758629 -827859 -652455 -66490 742343 1342359 1513472 1422275 1318293 1215012 942365
63899 942365 396721 -352983 -1129380 -1721134 -1944478 -1741421 -1231419 -612164 -6801 554146
63888 1024556 1298257 1309858 1146101 1018705 1115969 1466558 1924608 2285664 2435262 2395122
63878 2395122 2238601 1999540 1685363 1337358 1023226 782987 626990 570840 619348 727545
$$ packed form
63950G91138N76171M37092K92396P0104j18126k09946l60703o84714b07262j030619
63940a237881p47764l65718o3402J35050K68332L63854M36323M74246b90500F9131
63929C24072J29973l5082j52110q4863R9039J33448m7235j20492J72850N51333
63919I70933M99375l864m25873m07282j91999j70964d6982l49569k27478j34600
63909g58629o9230J75404f6490G42343O00016J71113r1197j03982j03281k72647
63899I42365C96721c52983p76397n91754k23344K03057N10002f12164f801E54146
63888A024556K73701J1601j63757j27396R7264L50589M58050L61056J49598m0140
63878B395122j56521k39061l14177l48005l14132k40239j55997n6150M8508J08197
$$ plain form
63868 727545 829778 884458 823482 504567 -145032 -924030 -1458755 -1598164 -1583327 -1712265
63858 -1712265 -1952836 -2049668 -1937621 -1841983 -1959480 -2222356 -2433429 -2478211 -2313422 -1881939
63848 -1881939 -1195024 -462847 -9886 -13814 -357162 -738410 -909068 -820313 -581730 -305661
63838 -305661 -8250 334141 663945 821923 658983 173924 -427151 -817542 -799081 -533794
63828 -533794 -431951 -690005 -1012375 -947793 -453973 67800 301150 361408 547572 941338
63818 941338 1363811 1581608 1448108 985477 452779 202298 328206 562042 632571 589357
63808 589357 618942 702021 691203 631896 729811 1004236 1219342 1212357 1098150 1076657 1176092
63797 1176092 1245838 1103196 668605 61409 -442515 -674715 -790415 -1081313 -1579671 -2014805
$$ packed form
63868G27545J02233N4680o0976l18915a45032p78998n34725j39409J4837j28938
63858a712265k40571r6832J12047R5638j17497k62876k11073m4782J64789M31483
63848a881939O86915d62847i886l928l43348l81248j70658Q8755K38583K76069
63838c05661h250C34141L29804J57978j62940A73924d27151l90391J8461K65287
63828e33794J01843k58054l22370O4582d53973F7800K33350O0258J86164L93766
63818I41338M22473K17797j33500m62631D52779B02298J25908K33836P0529m3214
63808E89357K9585Q3079j0818n9307R7915K74425K15106o985j14207k1493R9435
63797A176092O9746j42642m34591F1409d42515k32200j15700k90898m98358m35134
$$ plain form
63787 -2014805 -2176744 -2139467 -2071373 -1996540 -1823828 -1473682 -908064 -172905 523182 921723
63777 921723 992707 968045 1020723 1060342 936572 662117 273401 -368058 -1385207 -2526092
63767 -2526092 -3210110 -3020451 -2107502 -1110689 -701247 -1103041 -1940216 -2565957 -2605406 -2168178
63757 -2168178 -1553575 -905919 -254050 270367 467856 299510 -68136 -423696 -579632 -325055
63747 -325055 470752 1619709 2620141 3036984 2858959 2429412 2068378 1825281 1569198
63738 1569198 1223146 861501 621765 584759 729304 927757 971866 704514 199891 -264153
63727 -502839 -612018 -737752 -755260 -395189 310378 920011 994185 486815 -285993 -902974
63717 -902974 -1059930 -766373 -396327 -331995 -466022 -272047 529053 1611885 2482429 3000923
$$ packed form
63787b014805j61939L7277O8094P4833J72712L50146N65618a72905E23182L98541
63777I21723P0984k4662N2678L9619j23770k74455B73401c68058j017149j140885
63767b526092o84018J89659R12949R96813M09442m01794q37175o25741l9449M37228
63757b168178O14603O47656b54050B70367J97489j68346f8136l55560j55936K54577
63747c25055D70752J148957J000432M16843j78025m29547l61034k43097k56083
63738A569198l46052l61645k39736l7006J44545J98453M4109k67352A99891b64153
63727e02839j09179j25734j7508L60071C10378O09633P4174D86815b85993o16981
63717i02974j56956K93557L70046O4332j34027J93975E29053J082832Q70544N18494
$$ plain form
63707 3000923 3285719 3391035 3369279 3409011 3561279 3518033 3048661 2500668 2406248 2664703
63697 2664703 2641826 2149765 1792222 2086218 2674487 2789140 2243206 1572631 1303660 1426517
63687 1426517 1589174 1515940 1131898 458563 -447290 -1459730 -2364877 -2929426 -3019074 -2660819
63677 -2660819 -2009969 -1309933 -872090 -932853 -1390832 -1787794 -1746523 -1392533 -1144747 -1104685
63667 -1104685 -895758 -180743 864434 1703147 1914666 1433043 492181 -496940 -1114537
63658 -1114537 -1175716 -854693 -516630 -402739 -446787 -349183 131984 877408 1432214 1445265
63648 1445265 1033134 566704 176440 -298113 -907485 -1458558 -1860297 -2299943 -2900635
63639 -2900635 -3434418 -3573999 -3255063 -2607811 -1713331 -659943 295012 888250 1149716
$$ packed form
63707C000923K84796J05316k1756L9732J52268m3246m69372n47993r4420K58455
63697B664703k2877m92061l57543K93996N88269J14653n45934o70575k68971J22857
63687A426517J62657p3234l84042D58563d47290j012440r05147n64549q9648L58255
63677b660819O50850P00036M37843o0763m57979l96962M1271L53990K47786M0062
63667a104685K08927a80743H64434Q38713K11519m81623D92181d96940o17597
63658a114537o1179L21023L38063J13891m4048R7604A31984P45424N54806J3051
63648A445265m12131m66430A76440b98113o09372n51073m01739m39646o00692
63639b900635n33783j39581L18936O47252Q94480f59943B95012N93238K61466
$$ plain form
63630 1149716 1358550 1724877 2233704 2720737 2961238 2786810 2300053 1900601 1900812 2153370
63620 2153370 2236390 1965642 1537859 1206923 1042617 1029187 1181356 1461052 1706944 1737558
63610 1737558 1475065 970863 406122 51863 78005 354094 553395 503343 332826 236802
63600 236802 234148 264437 416358 875834 1622087 2310409 2562907 2340997 1939511 1620394
63590 1620394 1368510 1057707 726893 549307 592342 764388 963464 1105469 1034036 635621
63580 635621 84712 -266275 -334026 -402176 -641793 -796094 -562317 -51420 440104 948016
63570 948016 1744631 2756479 3448697 3391301 2689889 1765223 935583 331333 5414 -74682
63559 -72265 -180767 -483724 -937559 -1418118 -1750490 -1789667 -1554703 -1252751 -1123284 -1253111
$$ packed form
63630A149716K08834L66327N08827M87033K40501j74428m86757l99452K11K52558
63620B153370Q3020k70748m27783l30936j64306j3430J52169K79696K45892L0614
63610A737558k62493n04202D06122E1863K6142K76089J99301n0052j70517r6024
63600B36802k654L0289J51921M59476P46253O88322K52498k21910m01486l19117
63590A620394k51884l10803l30814j77586M3035J72046J99076J42005p1433l98415
63580F35621H4712b66275o7751o8150k39617j54301K33777e1420D40104N07912
63570I48016P96615J011848O92218n7396p01412r24666q29640C31333E414g4682
63559g2265j08502l02957m53835m80559l32372l9177K34964L01952J29467j29827
$$ plain form
63549 -1253111 -1516622 -1664235 -1523415 -1190009 -977794 -1085734 -1351623 -1430470 -1167680 -684516
63539 -684516 -171931 213091 281558 -103320 -772421 -1247292 -1135347 -481989 324825 934052
63529 934052 1281586 1555203 1982755 2614269 3270141 3711420 3833105 3655074 3214778 2607397
63519 2607397 2078481 1871479 1932105 1921215 1601199 1102733 753835 757597 1093570 1600432
63509 1600432 2044694 2203678 2024563 1694214 1464547 1390589 1270216 845127 58497 -872482
63498 -1637077 -2071536 -2179215 -1950046 -1335389 -497111 103230 95307 -390773 -924109 -1319273
63488 -1319273 -1720101 -2170623 -2445478 -2405780 -2214555 -2027611 -1740671 -1273440 -877087 -854821
63478 -854821 -1094479 -1176361 -903579 -452708 7183 569793 1358958 2233163 2885961 3180932
$$ packed form
63549a253111k63511j47613J40820L33406K12215j07940k65889p8847K62790M83164
63539f84516a71931B13091O8467a03320o69101m74871J11945d81989C24825O09227
63529I34052L47534K73617M27552O31514O55872M41279J21685j78031m40296o07381
63519B607397n28916k07002O0626j0890l20016m98466l48898L762L35973N06862
63509A600432M44262J58984j79115l30349k29667p3958j20373m25089E8497h72482
63498a637077m34459j07679K29169O14657d97111A03230p923c90773n33336l95164
63488a319273m00828m50522k74855L9698J91225J86944K86940M67231L96353K2266
63478h54821k39658q1882K72782M50871G183N62610P89165Q74205O52798K94971
$$ plain form
63468 3180932 3270461 3371756 3478506 3347724 2815543 2102527 1691183 1830862 2248926 2454858
63458 2454858 2276424 1987224 1948327 2254036 2718430 3067608 3103838 2799170 2318624 1913632
63448 1913632 1735655 1755394 1855257 1954228 2050112 2217758 2578020 3156600 3701785 3761000
63438 3761000 3121676 2174192 1648659 1883769 2464764 2698005 2344659 1735893 1260763
63429 1260763 990812 822333 717661 666313 600666 524883 593019 883367 1200729 1280359
63419 1280359 1103728 842764 588087 337040 172838 214209 404722 567346 665078 812675
63409 812675 1045323 1277693 1469491 1611149 1576602 1258070 846035 676206 754456 742656
63399 742656 494487 273109 293328 374659 270022 69243 21954 169060 398472 679134
$$ packed form
63468C180932Q9529J01295J06750j30782n32181p13016m11344J39679M18064K05932
63458B454858j78434k89200l8897L05709M64394L49178L6230l04668m80546m04992
63448A913632j77977J9739R9863R8971R5884J67646L60262N78580N45185N9215
63438C761000o39324r47484n25533K35110N80995K33241l53346o08766m75130
63429A260763k69951j68479j04672n1348o5647p5783O8136K90348L17362P9630
63419A280359j76631k60964k54677k51047j64202M1371J90513J62624R7732J47597
63409H12675K32648K32370J91798J41658l4547l18532m12035j69829P8250j1800
63399G42656k48169k21378K0219Q1331j04637F9243B1954J47106K29412K80662
$$ plain form
63389 679134 971240 1052439 726173 146710 -290225 -354097 -136669 111554 159872 -85409
63378 -496785 -843515 -1067996 -1271028 -1350877 -968748 -96694 703679 892493 622068 428896
63368 428896 452027 398091 161676 -14822 151 70518 155565 388945 672114 606629 42645
63356 -620806 -881006 -610847 52528 961558 1855993 2309137 2126800 1656126 1408502 1479347
63346 1479347 1595064 1619886 1700290 1917065 2087030 2008355 1729602 1485939 1475287 1747069
63336 1747069 2196857 2587279 2646882 2252484 1526610 725359 40442 -465571 -770745 -841284
63326 -841284 -711400 -526516 -387720 -177091 333422 1188362 2187316 3114346 3851163 4246809
63316 4246809 4151999 3729149 3453364 3542630 3600965 3152306 2358332 1800029 1629922 1409544
$$ packed form
63389F79134K92106Q1199l26266A46710b90225o3872a36669A11554M8318h5409
63378d96785l46730k24481k03032p9849L82129i6694G03679J88814k70425j93172
63368D28896K3131n3936A61676a4822A51P0367Q5047K33380K83169o5485D2645
63356f20806k60200K70159E2528R09030Q94435M53144j82337m70674k47624P0845
63346A479347J15717K4822Q0404K16775J69965p8675k78753k43663j0652K71782
63336A747069M49788L90422N9603l94398p25874G25359D0442d65571l05174p0539
63326h41284J29884J84884J38796a77091C33422Q54940R98954R27030P36817L95646
63316D246809r4810m22850k75785Q9266N8335m48659p93974n58303j70107k20378
$$ plain form
63306 1409544 844332 230590 1297 208573 687718 1402088 2311398 3119773 3494562 3453728
63296 3453728 3286831 3152075 2959978 2604547 2109755 1556109 1017994 586203 349626
63287 349626 336984 507112 758893 936048 906873 677307 356781 23697 -255235 -305242
63277 -305242 42502 674443 1244518 1565733 1731203 1782550 1561608 1069155 688297 776704
63267 776704 1213678 1595856 1710721 1562451 1118967 386311 -343776 -663741 -492312 -118029
63256 176679 313020 291455 148472 50921 182025 485186 720303 801784 885811 1097093
63246 1097093 1366777 1590034 1779356 2013159 2348264 2775213 3145475 3220226 2973091 2758101
63236 2758101 2932907 3378245 3675157 3712077 3767797 3978395 4117163 4020455 3854673 3765815
$$ packed form
63306A409544n65212B30590A297K07276M79145P14370R09310Q08375L74789m0834
63296C453728j66897j34756j92097l55431m94792n53646n38115m31791k36577
63287C49626j2642J70128K51781J77155k9175k29566l20526B3697b55235n0007
63277c05242D2502O31941N70075L21215J65470N1347k20942m92453l80858Q8407
63267G76704M36974L82178J14865j48270m43484C86311c43776l19965J71429a18029
63256A76679J36341k1565j42983E0921J31104L03161K35117Q1481Q4027K11282
63246A097093K69684K23257J89322K33803L35105M26949L70262P4751k47135k14990
63236B758101J74806M45338K96912L6920N5720K10598J38768r6708j65782q8858
$$ plain form
63226 3765815 3603175 3249360 2943093 2971426 3240590 3440059 3467039 3405611 3239053 2901673
63216 2901673 2528128 2353878 2422279 2644315 3044038 3617306 4019805 3809756 3068534 2405605
63206 2405605 2200364 2165025 1859619 1348299 1061301 1199500 1581064 1966251 2216750 2161116
63196 2161116 1634690 777934 82670 -29586 402374 998828 1446689 1664537 1641054 1315942
63186 1315942 707219 44748 -371217 -456433 -386013 -309964 -131352 320130 964599 1505302
63176 1505302 1810431 2075069 2489325 2891234 2921837 2447962 1665252 853609 232550 -2076
63165 209713 591305 733716 643306 820771 1581203 2532581 3023962 2931793 2641443 2364722
63155 2364722 1927104 1268711 701918 474613 429440 343516 309684 477413 652417 524152
$$ packed form
63226C765815j62640l53815l06267K8333K69164J99469K6980o1428j66558l37380
63216B901673l73545j74250O8401K22036L99723N73268M02499k10049p41222o62929
63206B405605k05241l5339l05406n11320k86998J38199L81564L85187K50499n5634
63196B161116n26426G77934H2670b9586D02374N96454M47861K17848k3483l25112
63186A315942o08723D4748c71217q5216P0420P6049a31352C20130O44469N40703
63176A505302L05129K64638M14256M01909L0603m73875p82710q11643B32550b076
63165B09713L81592J42411r0410J77465P60432R51378M91381r2169k90350k76721
63155B364722m37618o58393n66793k27305m5173q5924l3832J67729J75004j28265
$$ plain form
63145 524152 167933 -47942 -21196 -42034 -333984 -779900 -1194541 -1604863 -2116392 -2683671
63135 -2683671 -3155054 -3430003 -3471382 -3260857 -2826310 -2243828 -1577529 -902127 -383599 -195739
63125 -195739 -320715 -562222 -781617 -975578 -1109386 -1084046 -944112 -906195 -1056832 -1215251
63115 -1215251 -1243216 -1285525 -1480116 -1588711 -1205461 -295649 708881 1349560 1490545 1258364
63105 1258364 862720 518427 347783 273752 135360 -42233 -30170 280724 653048 688460
63095 688460 191311 -667715 -1455003 -1725667 -1320220 -508535 244970 740998 1197904 1871623
63085 1871623 2613320 2933216 2482960 1381186 82086 -971349 -1551984 -1630376 -1273674 -588753
63074 280114 1170210 1979303 2725186 3460148 4085948 4316215 3925874 3056282 2189035 1738604
$$ packed form
63145E24152A67933d7942b1196k0838k91950m45916m14641m10322n11529n67279
63135b683671m71383k74949m1379K10525M34547N82482O66299O75402c83599J87860
63125a95739j24976k41507k19395j93961j33808K5340J39934L7917j50637j58419
63115a215251k7965m2309j94591j08595L83250b95649G08881O40679J40985k32181
63105A258364l95644l44293j70644p4031A35360d2233J2063B80724L72324L5412
63095F88460A91311f67715p87288k70664M05447e08535B44970M96028M56906O73719
63085A871623P41697L19896m50256j101774H2086i71349n80635p8392L56702e88753
63074B80114Q90096Q09093P45883P34962O25800K30267l90341q69592q67247m50431
$$ plain form
63064 1738604 1678771 1619531 1243109 600917 -16840 -384737 -428583 -120965 508834 1252628
63054 1252628 1816010 2135358 2444566 2892385 3245191 3168551 2687503 2102594 1500596 680706
63043 -349401 -1122953 -1190036 -667632 -86567 200022 239186 201821 151698 104429 88465 64666
63032 64666 -68369 -318358 -562833 -714869 -797066 -795764 -605724 -258359 -82264 -419643 -1174309
63021 -1174309 -1816232 -1912852 -1540767 -1072841 -663029 -133052 626215 1367845 1773648 1898888
63011 1898888 2083065 2426379 2633815 2497419 2271644 2316945 2538609 2516246 2156667 1869603
63001 1869603 2001510 2394885 2686734 2804958 2926134 3098659 3188864 3150615 3093941 3065381
62991 3065381 2966226 2744358 2506381 2369733 2325582 2311803 2310966 2298949 2184096 1885684 1424481
$$ packed form
63064A738604n9833n9240l76422F00917a6840l67897m3846a20965E08834P43794
63054A252628N63382L19348L09208M47819L52806p6640m81048n84909o01998F80706
63043c49401p73552o7083N22404h6567B00022L9164l7365n0123m7269j5964k3799
63032F4666f8369k49989k44475j52036q2197J302J90040b58359h2264l37379p54666
63021a174309o41923r6620L72085M67926M09812a33052F26215P41630M05803J25240
63011A898888J84177L43314K07436j36396k25775M5301K21664k2363l59579k87064
63001A869603J31907L93375K91849J18224J21176J72525R0205l8249n6674k8560
62991C065381r9155k21868k37977j36648m4151j3779q37j2017j14853k98412m61203
$$ plain form
62980 1424481 867461 221643 -548483 -1404750 -2174854 -2617986 -2578215 -2135657 -1613921 -1354960
62970 -1354960 -1418177 -1524567 -1340818 -809109 -184125 216701 264860 62023 -195018 -356746
62960 -356746 -357602 -180832 147859 539049 898293 1252600 1737704 2370825 2905201 3053148
62950 3053148 2839008 2573939 2444324 2279840 1821724 1102566 442376 150470 351416
62941 351416 1021875 2009890 3004103 3655098 3827202 3661181 3336484 2870980 2257570 1705598
62931 1705598 1533451 1758877 1972036 1788022 1344561 1133439 1323951 1486654 1119700
62922 1119700 282890 -463453 -633615 -154026 739249 1664761 2201402 2144359 1746688 1493871
62912 1493871 1573421 1778134 1963916 2277774 2770999 3113463 3003373 2655203 2530528 2691925
$$ packed form
62980A424481n57020B21643e48483q56267p70104m43132L9771M42558N21736K58961
62970a354960o3217j06390J83749N31709a84125B16701M8159F2023a95018j61728
62960c56746q56J76770A47859L91190L59244L54307M85104O33121N34376J47947
62950C053148k14140k65069j29615j64484m58116p19158D42376A50470K00946
62941C51416O70459R88015R94213O50995J72104j66021l24697m65504o13410n51972
62931A705598j72147K25426K13159j84014m43461k11122J90512J62703l66954
62922A119700B82890d63453j70162a54026G39249R25512N36641n7043l97671k52817
62912A493871P9550K04713J85782L13858M93225L42464j10090l48170j24675J61397
$$ plain form
62902 2691925 2784086 2637132 2524350 2707290 2993007 2927693 2320266 1466591 919226 1072305
62892 1072305 1886829 2974036 3966795 4765604 5386418 5718589 5611846 5114478 4421818
62883 4421818 3651543 2884876 2350023 2260137 2459275 2524200 2268305 1868362 1458475 953043
62873 953043 391557 74892 108296 123523 -220059 -677533 -702609 -155915 579104 1079384
62863 1079384 1174419 849669 218907 -384806 -598250 -408027 -155505 -106709 -165622 -36996
62852 460552 1240983 1987200 2377914 2401903 2372716 2506494 2641275 2579923 2496690 2625764
62842 2625764 2680550 2093528 893138 -146027 -427069 -211119 -131647 -373849 -643435 -694400
62832 -694400 -558843 -405547 -438214 -801979 -1366729 -1753664 -1787184 -1726545 -1799694 -1732664
$$ packed form
62902B691925R2161j46954j12782J82940K85717o5314o07427q53675n47365J53079
62892A072305Q14524J087207R92759P98809O20814L32171j06743m97368o92660
62883D421818p70275p66667n34853q9886J99138O4925k55895l99943m09887n05432
62873I53043C91557G4892L3404J5227b20059m57474k5076a55915E79104N00280
62863A079384R5035l24750B18907c84806k13444J90223a55505M8796n8913c6996
62852D60552P80431P46217L90714K3989k9187J33778J34781o1352q3233J29074
62842B625764N4786n87022H93138a46027k81042b11119P9472k42202k69586n0965
62832f94400J35557J53296l2667l63765n64750l86935l3520O0639p3149O7030
$$ plain form
62822 -1732664 -1096384 29125 1116210 1816090 2131626 2042560 1446890 568100 -13098 43030
62811 464042 747971 690068 417464 164114 165823 531608 1026072 1172268 752467 47027
62800 -557125 -980450 -1301281 -1435225 -1241501 -808532 -369976 -23942 246542 383423 326794
62790 326794 188316 102225 -16300 -294748 -557477 -484727 -128268 54174 -236416 -812659
62780 -812659 -1329656 -1662254 -1800208 -1620410 -1006183 -74069 905542 1731240 2280960 2426009
62770 2426009 2136872 1635850 1274072 1234102 1423422 1616464 1616455 1342564 887441 477539
62760 477539 275885 213402 63501 -332585 -929002 -1483947 -1676922 -1370109 -878380 -835196
62750 -835196 -1556008 -2556266 -2913406 -2158324 -676362 771286 1726947 2184029 2290363
$$ packed form
62822a732664O36280B9125J087085O99880L15536q9066n95670E68100a3098D3030
62811D64042K83929n7903k72604A64114J709L65785M94464J46196m19801D7027
62800e57125m23325l20831j33944J93724M32969c69976b3942B46542J36881n6629
62790C26794j38478q6091a6300k78448k62729P2750a28268E4174b36416n76243
62780h12659n16997l32598j37954J79798O14227g4069I05542Q25698N49720J45049
62770B426009k89137n01022l61778l9970J89320J93042rk73891m55123m09902
62760D77539k01654o2483F3501c32585n96417n54945j92975L06813M91729M3184
62750h35196p20812j000258l57140P55082f76362G71286R55661M57082J06334
$$ plain form
62741 2290363 2125628 1726896 1167857 563019 34105 -325233 -465342 -342955 105076 849009
62731 849009 1601006 1896356 1469704 521805 -465885 -1150296 -1508118 -1685119 -1798128 -1867085
62721 -1867085 -1816963 -1527582 -975811 -340793 130648 386469 601067 919453 1285156 1577746
62711 1577746 1792599 1961770 1977369 1659148 1023374 390331 171357 542393 1282531 1902812
62701 1902812 2004763 1590699 987832 441672 -84757 -607839 -812912 -340708 653279 1540996
62691 1540996 1903668 1901295 1848109 1722382 1342372 799480 387576 205394 140766 201258
62681 201258 539122 1118877 1658667 1998953 2287301 2676326 3040001 3126879 2838810 2239498
62671 2239498 1447949 669624 193210 164297 397538 523532 292136 -296447 -1027543 -1544025
$$ packed form
62741B290363j64735l98732n59039E63019C4105c25233j40109J22387A05076P43933
62731H49009P51997K95350m26652E21805d65885o84411l57822j77001j13009o8957
62721a867085N0122K89381N51771c40793A30648K55821K14598L18386L65703K92590
62711A577746K14853J69171J5599l18221o35774C90331A71357L71036P40138O20281
62701A902812J01951m14064o02867D41672h4757n23082k05073c40708F53279Q87717
62691A540996L62672k373n3186j25727l80010n42892C87576j82182o4628O0492
62681B01258L37864N79755N39790L40286K88348L89025L63675Q6878k88069n99312
62671B239498p91549F69624A93210k8913K33241J25994k31396b96447p31096n16482
$$ plain form
62661 -1544025 -1511180 -851678 227413 1468942 2671345 3512107 3558341 2724581 1555757
62652 1555757 732696 346109 -50065 -694543 -1267416 -1365930 -1028329 -596641 -252739 94599
62641 544429 1003365 1250433 1124921 666892 103613 -344995 -656673 -937498 -1182342 -1249926
62631 -1249926 -1124931 -1050428 -1268700 -1704190 -2023839 -1986912 -1661209 -1326494 -1225715 -1369731
62621 -1369731 -1521344 -1406413 -1002907 -594095 -487782 -722186 -1100972 -1462826 -1819301
62612 -1819301 -2229863 -2626397 -2810946 -2621391 -2094057 -1460382 -970868 -733986 -751965 -1060417
62602 -1060417 -1707001 -2558725 -3256262 -3471995 -3170220 -2542162 -1764237 -952737 -309439
62592 -103741 -399571 -895530 -1161243 -1017002 -600813 -95417 463291 1042809 1421205 1341704
$$ packed form
62661a544025L2845O59502B27413J241529J202403Q40762M6234q33760j168824
62652A555757G32696C46109e0065o44478n72873r8514L37601M31688b52739I4599
62641E44429M58936K47068j25512m58029A03613c44995l11678k80825k44844o7584
62631a249926J24995P4503k18272m35490l19649L6927L25703L34715J00779j44016
62621a369731j51613J14931M03506M08812J06313k34404l78786l61854l56475
62612a819301m10562l96534j84549J89555N27334O33675M89514K36882j7979l08452
62602a060417o46584q51724o97537k15733L01775O28058P77925Q11500c09439
62592a03741k95830m95959k65713J44241M16189i5417D63291N79518L78396p9501
$$ plain form
62582 1341704 884167 511587 629382 1188872 1838144 2357172 2746322 2934833 2688403
62573 2688403 1934338 981981 232348 -221935 -534276 -760709 -842524 -909431 -1287330 -2056531
62563 -2056531 -2818917 -3121401 -2995433 -2851167 -2893769 -2900078 -2614308 -2129121 -1740302 -1575378
62553 -1575378 -1508189 -1327936 -852364 6257 1084608 1936890 2182614 1904978 1539547 1377085
62543 1377085 1365475 1376471 1373190 1226709 682712 -254160 -1114767 -1426839 -1280284 -1188219
62533 -1188219 -1458829 -1937921 -2304383 -2349427 -1976094 -1204507 -253901 582572 1210707 1718245
62523 1718245 2068967 2043196 1570196 914990 403085 98341 -148067 -471477 -909348 -1382539
62513 -1382539 -1642130 -1399141 -682512 36234 249393 -108337 -704938 -1231306 -1596900 -1772254
$$ packed form
62582A341704m57537l72580J17795N59490O49272N19028L89150J88511k46430
62573B688403p54065r52357B32348b21935l12341k26433q1815o6907l77899p69201
62563b056531p62386l02484J25968J44266m2602o309K85770M85187L88819J64924
62553a575378O7189J80253M75572F257J078351Q52282K45724k77636l65431j62462
62543A377085j1610J0996l281j46481n43997b54160q60607l12072J46555R2065
62533a188219k70610m79092l66462m5044L73333P71587b53901E82572O28135N07538
62523A718245L50722k5771m73000o55206D03085I8341a48067l23410m37871m73191
62513a382539k59591K42989f82512C6234K13159a08337n96601n26368l65594j75354
$$ plain form
62503 -1772254 -1675360 -1290310 -765522 -304921 -13185 117123 135807 115581 155255 298327
62493 298327 408006 201435 -471192 -1368206 -1993741 -2062243 -1738544 -1356728 -1047767 -785082
62483 -785082 -633013 -674837 -754207 -602180 -267719 -133146 -393727 -777910 -926095 -807061
62473 -807061 -576357 -251159 207267 621009 688521 335860 -213773 -712591 -1088222 -1388978
62463 -1388978 -1652223 -1828342 -1780976 -1415452 -849443 -356606 -87412 24498 28388 -163116
62452 -529667 -799320 -763131 -555045 -366000 -40228 710417 1751582 2528270 2665118 2295398
62442 2295398 1734213 1084448 291754 -600751 -1416811 -2000410 -2324930 -2487907 -2610382
62433 -2610382 -2688946 -2567470 -2121306 -1427929 -683184 -22842 479589 750239 806945 822230
$$ packed form
62503a772254R6894L85050N24788c04921a3185A17123J8684k0226L9674J43072
62493B98327J09679B01435d71192q97014o25535o8502L23699L81816L08961K62685
62483g85082J52069m1824p9370J52027b67719a33146k60581l84183j48185J19034
62473h07061K30704b51159B07267M13742O7512C35860b13773m98818l75631l00756
62463a388978k63245j76119M7366L65524N66009c56606h7412B4498L890a63116
62452e29667k69653L6189K08086J89045d0228G10417J041165P76688J36848l69720
62442B295398n61185o49765B91754f00751q16060n83599l24520j62977j22475
62433b610382p8564J21476M46164O93377f83184b2842D79589K70650N6706J5285
$$ plain form
62423 822230 910863 926623 665499 203531 -186893 -403591 -553512 -657542 -592595 -360817
62413 -360817 -169235 -181128 -387072 -740206 -1184771 -1520624 -1505114 -1170711 -807011 -564765
62403 -564765 -351800 -213192 -477484 -1284945 -2202512 -2586949 -2229080 -1458094 -742675 -378701
62393 -378701 -424029 -677435 -757641 -417971 193175 698022 888819 864271 830734 902954
62383 902954 1078941 1296269 1504949 1733088 2041488 2372967 2529532 2380055 2029180 1702931
62373 1702931 1513899 1390886 1179591 774600 229859 -240665 -488937 -676623 -1105673
62364 -1105673 -1723753 -2020097 -1611705 -791343 -268693 -433825 -1060732 -1660479 -1906296
62355 -1906296 -1747699 -1353990 -1005148 -867590 -818266 -621872 -312148 -237424 -654252 -1409319
$$ packed form
62423H22230Q8633J5760k61124B03531a86893k16698j49921j04030O4947K31778
62413c60817a69235j1893k05944l53134m44565l35853J5510L34403L63700K42246
62403e64765K12965J38608k64292q07461r17567l84437L57869P70986P15419L63974
62393c78701m5328k53406q0206L39670A93175N04847J90797k4548l3537P2220
62383I02954J75987K17328K08680K28139L08400L31479J56565j49477l50875l26249
62373A702931j89032j23013k11295m04991B29859b40665k48272j87686m29050
62364a105673o18080k96344M08392g91343b68693j65132o26907n99747k45817
62355a906296J58597L93709L48842J37558M9324J96394L09724P4724m16828p55067
$$ plain form
62345 -1409319 -2110989 -2491904 -2490634 -2103863 -1366485 -467845 310425 855774 1292262 1691103
62335 1691103 1854384 1574842 1038576 721652 850551 1197068 1491129 1773291 2148643
62326 2148643 2436211 2377155 2061601 1812001 1693499 1478086 1095171 764894 616692 523109
62316 523109 441410 581246 1021469 1440368 1488209 1233421 992869 880760 779719 645661
62306 645661 589472 694375 923182 1164111 1265571 1134377 906771 870124 1088171 1296561
62296 1296561 1339613 1476195 1975230 2594010 2816231 2543492 2221821 2274962 2674549 3084576
62286 3084576 3209490 3000227 2714380 2737274 3129166 3405212 3019758 2031136 1011906
62276 336106 -116373 -546003 -925728 -1237685 -1645081 -2173572 -2474962 -2193306 -1428206 -594359
$$ packed form
62345a409319p01670l80915J270L86771P37378d67845C10425N45349M36488L98841
62335A691103J63281k79542n36266l16924J28899L46517K94061K82162L75352
62326B148643K87568n9056l15554k49600j18502k15413l82915l30277j48202r3583
62316E23109q1699J39836M40223M18899M7841k54788k40552j12109j01041j34058
62306F45661n6189J04903K28807K40929J01460j31194k27606l6647K18047K08390
62296A296561M3052J36582M99035O18780K22221k72739l21671N3141L99587M10027
62286C084576J24914k09263k85847K2894L91892K76046l85454r88622A011906
62276C36106a16373m29630l79725l11957m07396n28491l01390K81656P65100e94359
$$ plain form
62265 79359 682500 1316749 1891431 2253873 2359192 2246011 1942627 1481311 984226 660994
62255 660994 651323 855578 991644 884507 649333 512961 520822 542013 512170 501616 538875
62244 538875 538967 461926 399363 422543 450383 355893 137468 -85109 -198188 -162054 20344 353477
62232 353477 836950 1362694 1641511 1374345 608830 -172297 -475739 -273384 61843 209354
62222 209354 125324 -81478 -232473 -59598 600361 1514301 2207450 2519633 2777122 3271850
62212 3271850 3800595 3937864 3597837 3058730 2505111 1831844 954800 85166 -476835 -739575
62202 -739575 -1027106 -1528315 -1961419 -1852235 -1142184 -335699 48995 9976 -111085 -170129
62192 -170129 -326907 -670812 -1029220 -1199180 -1152019 -951943 -669098 -432911 -379224 -470736
$$ packed form
62265G9359O03141O34249N74682L62442J05319j13181l03384m61316m97085l23232
62255F60994r671K04255J36066j07137k35174j36372P861K1191k9843j0554L7259
62244E38875R2p7041o2563K3180K7840r4490A37468h5109j13079L6134B0344L33133
62232C53477M83473N25744K78817k67166F08830a72297l03442K02355F1843J47511
62222B09354q4030h1478j50995e9598F00361R13940O93149L12183K57489M94728
62212C271850N28745J37269l40027n39107n53619o73267q77044H5166d76835k62740
62202g39575k87531n01209m33104J09184P10051c35699D8995I976a11085n9044
62192a70129j56778l43905l58408j69960M7161K00076K82845K36187N3687r1512
$$ plain form
62182 -470736 -536227 -527177 -528187 -463992 -68363 702710 1455503 1767343 1671610 1552357 1670436
62171 1670436 1968820 2255816 2403662 2402638 2341489 2311011 2279593 2147103 1952910 1879848
62161 1879848 1979903 2069418 2010005 1916874 1931434 1944027 1735167 1283719 749836 234955
62150 -266156 -736334 -1114774 -1359165 -1419288 -1233061 -865718 -548492 -436745 -417114 -285543
62140 -285543 -23423 222514 316848 171409 -232428 -685698 -780298 -321722 395522 920684
62130 920684 1124466 1147320 1059910 869480 717902 728699 740802 535072 253931 227722
62120 227722 436050 556706 543508 688168 1024285 1155228 873343 512100 408845 396302
62110 396302 150878 -272245 -596220 -728132 -633741 -92543 922837 1784379 1698911 717201
$$ packed form
62182d70736o5491R050j010O4195f8363G02710P52793L11840r5733j19253J18079
62171A670436K98384K86996J47846j024o1149l0478l1418j32490j94193p3062
62161A879848J00055Q9515n9413r3131J4560J2593k08860m51448n33883B34955
62150b66156m70178l78440k44391o0123J86227L67343L17226J11747J9631J31571
62140b85543b3423B22514R4334j45439b32428m53270r4600c21722C95522N25162
62130I20684K03782K2854q7410j90430j51578J0797J2103k05730B53931k6209
62120B27722K08328J20656j3198J44660L36117J30943k81885l61243j03255j2543
62110C96302A50878b72245l23975j31912R4391i2543I22837Q61542q5468G17201
$$ plain form
62099 -205939 -289332 305060 913527 1203556 1312317 1423526 1527235 1512137 1269199 739944
62089 739944 16122 -642572 -1008181 -1073252 -970519 -781517 -522041 -242243 -16304 140079
62078 260319 375888 527518 731272 851268 649038 131325 -269539 -114389 476426 938847
62068 938847 972485 853656 945372 1184926 1278151 1193356 1168775 1308386 1439456 1379342 1144703
62057 1144703 873977 695683 678349 764006 752191 496781 113063 -160195 -274043 -344139
62047 -344139 -331896 -38383 480330 763137 436839 -278238 -772408 -702833 -285957 19046
62036 -40017 -370762 -710041 -875028 -878416 -831482 -781000 -699505 -588783 -459908 -216233 271038
62024 919321 1435944 1643869 1640826 1539662 1243364 634615 -183053 -1029349 -1883057 -2732344
$$ packed form
62099b05939q3393C05060O08467K90029J08761J11209J03709j5098k42938n29255
62089G39944A6122f42572l65609o5071J02733J89002K59476b42243a6304A40079
62078B60319J15569J51630K03754J19996k02230A31325b69539a14389D76426M62421
62068I38847L3638j18829R1716K39554R3225q4795k4581J39611J31070o0114k34639
62057A144703k70726j78294j7334Q5657j1815k55410A13063a60195j13848p0096
62047c44139J2243c8383D80330K82807l26298b78238m94170O9575b85957A9046
62036d0017l30745l39279j64987l388M6934N0482Q1495J10722J28875b16233B71038
62024I19321N16623K07925l043j01164k96298o08749a83053q46296q53708q49287
$$ plain form
62014 -2732344 -3292061 -3164304 -2312107 -1177840 -296418 73653 -37871 -457746 -941675 -1218417
62004 -1218417 -1071007 -425815 555467 1457853 1859804 1743259 1544452 1651276 1976697
61995 1976697 2195671 2226629 2199250 2078475 1697135 1156345 820929 819578 862694 694460
61985 694460 451642 398584 535487 676499 751931 828843 943232 1091753 1304471 1561962
61975 1561962 1706496 1593537 1298482 1042297 933462 906115 920299 1105113 1607250 2292242
61965 2292242 2685018 2361728 1468454 703482 609481 969854 1121462 804755 419604 427354
61955 427354 834221 1396958 2014299 2643666 3037056 2889953 2221563 1391155 750024 419319
61945 419319 340836 353290 236795 -133294 -635068 -1008793 -1131320 -1098893 -1042613 -944709
$$ packed form
62014b732344n59717J27757Q52197J134267b96418G3653c7871m19875m83929k76742
62004a218417J47410d25815E55467R02386M01951j16545j98807J06824L25421
61995A976697K18974L0958k7379j20775l81340n40790l35416j351M3116j68234
61985F94460k42818n3058J36903J41012P5432P6912J14389J48521K12718K57491
61975A561962J44534j12959k95055k56185j08835k7347J4184J84814N02137O84992
61965B292242L92776l23290q93274G03482r4001L60373J51608l16707l85151P750
61955D27354M06867N62737O17341O29367L93390j47103o68390q30408o41131l30705
61945D19319p8483J2454j16495a33294n01774l73725j22527L2427N6280R7904
$$ plain form
61935 -944709 -649419 -34387 773773 1337767 1221856 512798 -86065 99671 993954 1884142
61925 1884142 2245562 2212915 2158524 2078177 1671312 937293 369853 431286 1013488 1601572
61915 1601572 1885875 2001782 2168475 2341519 2373737 2350803 2524904 2935169 3289673 3273609
61905 3273609 2860822 2297885 1883352 1773023 1893538 2026093 2055738 2115730 2378790 2757422
61895 2757422 2984595 2968887 2850567 2672344 2235298 1403482 369011 -535481 -1169756 -1603963
$$ packed form
61935i44709K95290c4387G73773N63994j15911E12798h6065I9671Q94283Q90188
61925A884142L61420l2647n4391q0347m06865p34019C69853O1433N82202N88084
61915A601572K84303J15907J66693J73044L2218k2934J74101M10265L54504j6064
61905C273609m12787n62937m14533j10329J20515J32555K9645N9992K63060L78632
61895B757422K27173j5708j18320j78223m37046q31816C69011e35481o34275m34207
$$ [...]
##END NTUPLES=NMR SPECTRUM
##END=
