##TITLE=ST0000_MeOD-4_7212735_VkaFngzLdu
##JCAMPDX= 6.0         $$ Bruker NMR JCAMP-DX V2.0
##DATA TYPE= NMR SPECTRUM
##DATA CLASS= NTUPLES
##ORIGIN= BRUKER
##OWNER= Administrator
$$ 1.72 TOPSPIN		Version 2.1
$$ 2013-11-22 21:27:45.191 -0800  Administrator@X
$$ Compression mode = diff/dup
##.OBSERVE FREQUENCY= 400.02188249412
##.OBSERVE NUCLEUS= ^1H
##.ACQUISITION MODE= SIMULTANEOUS (DQD)
##.ACQUISITION SCHEME= undefined
##.AVERAGES= 8
##.DIGITISER RES= 22
##SPECTROMETER/DATA SYSTEM= spect
##.PULSE SEQUENCE= zg30
##.SOLVENT NAME= COFFEE_meoh
##.SHIFT REFERENCE= INTERNAL, COFFEE_meoh, 1, 14.98509
##AUDIT TRAIL= $$ (NUMBER, WHEN, WHO, WHERE, PROCESS, VERSION, WHAT)
$$ ##TITLE= Audit trail, TOPSPIN		Version 2.1
$$ ##JCAMPDX= 5.01
$$ ##ORIGIN= Bruker BioSpin GmbH
$$ ##OWNER= Administrator
$$ $$ E:\/data/COFFEE/nmr/ST0000_MeOD-4_7212735_VkaFngzLdu/20/pdata/1/auditp.txt
$$ ##AUDIT TRAIL=  $$ (NUMBER, WHEN, WHO, WHERE, PROCESS, VERSION, WHAT)
(   1,<2013-11-22 21:27:38.488 -0800>,<Administrator>,<X>,<go>,<TOPSPIN 2.1>,
      <created by zg
	started at 2013-11-22 21:26:32.988 -0800,
	POWCHK enabled, PULCHK disabled,
       configuration hash MD5:
       C8 4E 4E 5D D3 5C D8 9E 9F 52 82 E0 59 8A DE 15
       data hash MD5: 64K
       F8 F9 E8 09 3B 6A 2C F3 3D A8 6C 66 AB 01 B3 2F>)
(   2,<2013-11-22 21:27:41.410 -0800>,<Administrator>,<X>,<proc1d>,<TOPSPIN 2.1>,
      <Start of raw data processing
       efp LB = 0 FT_mod = 6 PKNL = 1 PHC0 = 0 PHC1 = 0 SI = 32K 
       data hash MD5: 32K
       55 31 AA DE 50 F5 A3 0F 5E CF FE 2D C9 9C 1E BF>)
(   3,<2013-11-22 21:27:41.691 -0800>,<Administrator>,<X>,<proc1d>,<TOPSPIN 2.1>,
      <pk PHC0 = 112.5439 PHC1 = 0 
       data hash MD5: 32K
       DB 92 C1 46 7F AA 33 E2 EF C8 E3 4C 8E 64 F2 9C>)
(   4,<2013-11-22 21:27:41.785 -0800>,<Administrator>,<X>,<proc1d>,<TOPSPIN 2.1>,
      <abs ABSG = 1 
       data hash MD5: 32K
       33 D7 51 8F D2 F2 46 85 5E C2 14 C5 AE 97 62 E5>)
(   5,<2013-11-22 21:27:41.847 -0800>,<Administrator>,<X>,<proc1d>,<TOPSPIN 2.1>,
      <abs ABSG = 2 
       data hash MD5: 32K
       41 0F 28 51 79 F1 C5 1F 2F D6 AB BB 1B 2D 51 8D>)
(   6,<2013-11-22 21:27:41.910 -0800>,<Administrator>,<X>,<proc1d>,<TOPSPIN 2.1>,
      <abs ABSG = 3 
       data hash MD5: 32K
       74 AA D1 CC 3C 66 F6 F4 6B 3B B0 46 4A 55 ED 6F>)
(   7,<2013-11-22 21:27:41.957 -0800>,<Administrator>,<X>,<proc1d>,<TOPSPIN 2.1>,
      <abs ABSG = 4 
       data hash MD5: 32K
       9E A8 14 3B 9A A0 2E 8F 73 1B 30 2F 0C 4D 01 86>)
(   8,<2013-11-22 21:27:42.035 -0800>,<Administrator>,<X>,<proc1d>,<TOPSPIN 2.1>,
      <abs ABSG = 5 
       data hash MD5: 32K
       0F 18 94 C1 FE B0 3A F4 B9 6B 8E 06 B8 41 09 F5>)
$$ ##END=
$$ 
$$ $$ hash MD5
$$ $$ 46 99 A4 78 DC 05 19 D3 99 D1 57 36 79 9C A6 E2
##$RELAX= 
##$RELAX= 
##$RELAX= 
##$RELAX= 
##$RELAX= 
##$RELAX= 
##$RELAX= 
$$ Bruker specific parameters
$$ --------------------------
##$DU= <E:\>
##$EXPNO= 20
##$NAME= <ST0000_MeOD-4_7212735_VkaFngzLdu>
##$PROCNO= 1
$$ [...]
150 150 150 150 150 150 150 150
##$TP07= 0
##$TPNAME0= <>
##$TPNAME1= <>
##$TPNAME2= <>
##$TPNAME3= <>
##$TPNAME4= <>
##$TPNAME5= <>
##$TPNAME6= <>
##$TPNAME7= <>
##$TPOAL= (0..7)
0.5 0.5 0.5 0.5 0.5 0.5 0.5 0.5
##$TPOFFS= (0..7)
0 0 0 0 0 0 0 0
##$TUNHIN= 0
##$TUNHOUT= 0
##$TUNXOUT= 0
##$USERA1= <user>
##$USERA2= <user>
##$USERA3= <user>
##$USERA4= <user>
##$USERA5= <user>
##$V9= 5
##$VALIST= <valist>
##$VCLIST= <CCCCCCCCCCCCCCC>
##$VD= 0
##$VDLIST= <DDDDDDDDDDDDDDD>
##$VPLIST= <PPPPPPPPPPPPPPP>
##$VTLIST= <TTTTTTTTTTTTTTT>
##$WBST= 1024
##$WBSW= 4
##$XGAIN= (0..3)
0 0 0 0
##$XL= 0
##$YL= 0
##$YMAX_a= 1591
##$YMIN_a= -1962
##$ZGOPTNS= <>
##$ZL1= 120
##$ZL2= 120
##$ZL3= 120
##$ZL4= 120
##$ABSF1= 14.98509
##$ABSF2= -5.573092
##$ABSG= 5
##$ABSL= 3
##$ALPHA= 0
##$AQORDER= 0
##$ASSFAC= 0
##$ASSFACI= 0
##$ASSFACX= 0
##$ASSWID= 0
##$AUNMP= <proc_prof1d_extract_pilot.lims>
##$AXLEFT= 0
##$AXNAME= <>
##$AXNUC= <1H>
##$AXRIGHT= 0
##$AXTYPE= 0
##$AXUNIT= <>
##$AZFE= 0.1
##$AZFW= 0.1
##$BCFW= 0
##$BC_mod= 0
##$BYTORDP= 0
##$COROFFS= 0
##$CY= 15
##$DATMOD= 1
##$DC= 0
##$DFILT= <>
##$DTYPP= 0
##$F1P= 0
##$F2P= 0
##$FCOR= 0.5
##$FTSIZE= 32768
##$FT_mod= 6
##$GAMMA= 0
##$GB= 0
##$INTBC= 1
##$INTSCL= 1
##$ISEN= 128
##$LB= 0
##$LEV0= 0
##$LPBIN= 0
##$MAXI= 10000
##$MC2= 0
##$MEAN= 0
##$ME_mod= 0
##$MI= 0
##$NCOEF= 0
##$NC_proc= -15
##$NLEV= 6
##$NOISF1= 0
##$NOISF2= 0
##$NSP= 0
##$NTH_PI= 0
##$NZP= 0
##$OFFSET= 14.98509
##$PC= 1
##$PHC0= 112.5439
##$PHC1= 0
##$PH_mod= 1
##$PKNL= yes
##$PPARMOD= 0
##$PPDIAG= 0
##$PPIPTYP= 0
##$PPMPNUM= 2147483647
##$PPRESOL= 1
##$PSCAL= 4
##$PSIGN= 0
##$PYNMP= <proc.py>
##$REVERSE= no
##$SF= 400.02
##$SI= 32768
##$SIGF1= 0
##$SIGF2= 0
##$SINO= 400
##$SIOLD= 32768
##$SPECTYP= <>
##$SREGLST= <1H.CDCl3>
##$SSB= 0
##$STSI= 32768
##$STSR= 0
##$SW_p= 8223.68421052631
##$SYMM= 0
##$S_DEV= 0
##$TDeff= 65536
##$TDoff= 0
##$TI= <>
##$TILT= no
##$TM1= 0
##$TM2= 0
##$TOPLEV= 0
##$USERP1= <user>
##$USERP2= <user>
##$USERP3= <user>
##$USERP4= <user>
##$USERP5= <user>
##$WDW= 1
##$XDIM= 32768
##$YMAX_p= 411601154
##$YMIN_p= -95719858
##$CURPLOT= <Network HP LaserJet P1505>
##$CURPRIN= <$Network HP LaserJet P1505>
##$DFORMAT= <normdp>
##$LAYOUT= <+/1D_H.xwp>
##$LFORMAT= <normlp>
##$PFORMAT= <normpl>
##$SURQMSG= 1
$$ End of Bruker specific parameters
$$ ---------------------------------
##NTUPLES= NMR SPECTRUM
##VAR_NAME=  FREQUENCY,     SPECTRUM/REAL,   SPECTRUM/IMAG
##SYMBOL=    X,             R,               I
##VAR_TYPE=  INDEPENDENT,   DEPENDENT,       DEPENDENT
##VAR_FORM=  AFFN,          ASDF,            ASDF
##VAR_DIM=   32768,         32768,           32768
##UNITS=     HZ,            ARBITRARY UNITS, ARBITRARY UNITS
##FACTOR=    0.250966925370066, 1,           1
##FIRST=     8223.43324360094, 3409068,      -5256023
##LAST=      0,             -2242357,        -24207787
##MIN=       0,             -95719858,       0
##MAX=       8223.43324360094, 411601154,    0
$$ Real data points
##PAGE= N=1
##DATA TABLE= (X++(R..R)), XYDATA
$$ [...]
18283B2330119b819036j1224879f016471k4882760e159408A7789356J1395953
18276B9185309j0420183F822478J9535799b9109122B0340902d123445n390839
18269i514284A5186470a2699880B406987J5625016a0058605A9218450b4414848
18261A4245377a7164555B9926390b8826043H869747a083319D4635081c2311831
18253B0782360E387113a5420500b062068j589000A7781757h32457A6287152Q770744
18245B5057896a5748823n89133k9170898c497200q606896k0474263E910091j385296
18237D524795J911744c6152615E0182802b4975778G337140A164904K0585423b463958
18228D6002208i931688m523180l6145775A779969O4680541a7909157l3757377
$$ plain form
18283 22330119 -2819036 -14043915 -6016471 -30899231 -5159408 17789356 29185309
18276 29185309 18765126 6822478 26358277 -29109122 20340902 -4123445 -9514284
18269 -9514284 15186470 -12699880 2406987 18032003 -10058605 19218450 -24414848
18261 14245377 -17164555 29926390 -28826043 8869747 -1083319 44635081 -32311831
18253 20782360 5387113 -15420500 -2062068 -3651068 17781757 -832457 16287152 25057896
18245 25057896 -15748823 -16337956 -45508854 -3497200 -12104096 -32578359 5910091 4524795
18237 4524795 6436539 -36152615 50182802 -24975778 7337140 1164904 21750327 -2463958
18228 46002208 -9931688 -14454868 -50600643 1779969 66460510 -17909157 -51666534
18221e1666534J7232912Q945384f553852m5273167B2056468b3525924K380649
18214b1145275A3164422R504515G10304N93487a608804k2160928G402440a5501276
18205H900638a3688174M451513B8988972c736188A5180189b7650511L477278o289130
18197c0462363B2765797A0357833a5847999j2011361E062481L960148a7333289
18189A6527197a8595700j3294886g329083j6014502B4901372H675184a2652182
18181a1328012J312683n550679D4603546b272059A5200717K53033l012143a4378026
18172B7335300c1379995j232910I633926J0778602a5213132q224514a220297A5430227
18163B6619694I366804b8197667n24830r640608B9977067a8616168m663318A4717021
$$ plain form
18221 -51666534 -34433622 -25488238 -6553852 -51827019 22056468 -23525924 -21145275
18214 -21145275 13164422 22668937 710304 1303791 -1608804 -23769732 7402440 -15501276
18205 8900638 -13688174 -9236661 28988972 -3736188 15180189 -27650511 -24173233 -30462363
18197 -30462363 22765797 10357833 -15847999 -27859360 5062481 9022629 -17333289
18189 16527197 -18595700 -31890586 -7329083 -23343585 24901372 8675184 -12652182
18181 -11328012 -10015329 -15566008 44603546 -2272059 15200717 15453750 12441607 -14378026
18172 27335300 -31379995 -32612905 9633926 20412528 -15213132 -23437646 -1220297 15430227
18163 26619694 9366804 -28197667 -28722497 -38363105 29977067 -18616168 -23279486 14717021
18154b4316725D77082K4602104n466693c0217797H265637J936497b5417843A4846043
18145B4243093a0298189B4991592a0127312j948462r956600a0095232B1964361
18137C0671139A5055859l897219f035821m39418k4844019g98471q51177E4539450
18128a1754074B3325685c9717818F600639J2570148a7660804B7382764C479646
18120A4616019N993637N022577P3299d463918d54786j4601565C9323657b7314903
18111i139527j168468a662102I778501C226613b7281637J0807195B0180071E176840
18102H424696J1959542c0715531f748539B1122182D748474b7744996p390353A5307697
18093G971767M941976D520098a4550251c945520k266757E83055P770953Q568944
$$ plain form
18154 -24316725 477082 25079186 19612493 -30217797 8265637 10202134 -25417843 14846043
18145 24243093 -10298189 24991592 -10127312 -12075774 -22032374 -10095232 21964361
18137 30671139 15055859 11158640 -6035821 -6475239 -31319258 -798471 -1649648 54539450
18128 -11754074 23325685 -39717818 6600639 19170787 -17660804 27382764 3479646
18120 14616019 20609656 25632233 25705532 -4463918 -454786 -15056351 39323657 -27314903
18111 -9139527 -10307995 -1662102 9778501 3226613 -27281637 -16474442 20180071 5176840
18102 8424696 20384238 -30715531 -6748539 21122182 4748474 -27744996 -35135349 15307697
18093 7971767 12913743 4520098 -14550251 -3945520 -6212277 583055 8354008 16922952
18085A6922952a108840A7874334O725063n870787C96291M20035Q456601O767333
18077A6040260b772841l8092998a7477951h138990j0464969C461801e378515A9336775
18068A3274696c929613F559733c4291514B03704Q604327a6055198d122539j9694019
18060b3816558J0079219j1701209a2090725j2007032b28251A8947954D66202K0668509
18052B1134711a7302901I442687c4222289a1445941A3807159A05155J670647L3738029
18044C5513831D697063b0772105K13654B5898582L522416c325788A493089J3081138
18036A4574227G03245J9740875g253739b320842B3139911b1739699G34990J3691791
18028A4426781a3919359C9694047O627907A324925M3358303c5865432a3029185
$$ plain form
18085 16922952 -1108840 17874334 24599397 18728610 396291 816326 9272927 16040260
18077 16040260 -2772841 -40865839 -17477951 -8138990 -18603959 3461801 -5378515 19336775
18068 13274696 -3929613 6559733 -34291514 203704 8808031 -16055198 -4122539 -23816558
18060 -23816558 -13737339 -25438548 -12090725 -24097757 -228251 18947954 466202 21134711
18052 21134711 -17302901 9442687 -34222289 -11445941 13807159 105155 1775802 35513831
18044 35513831 4697063 -20772105 -20558451 25898582 29420998 -3325788 1493089 14574227
18036 14574227 703245 20444120 -7253739 -2320842 23139911 -21739699 734990 14426781
18028 14426781 -13919359 39694047 46321954 1324925 44683228 -35865432 -13029185
18020a2324275m5956032b7471172a2125716M389281A6720014b707016E360165
18012A2431554d0783330a3159854j5991008q926952J6293239A0037764A689229
18004C2830197I53016J8270988A730380b219350A5312743a7020893j0208899N700520
17996b1529272R805767k6265900J2323764G066947b2194451j4010855i059488
17988C9102966B242087o34275K1860942F073587A471732a0022039A28643c459584
17979b5172592A2943528J2849104j1555093a6762042d762980l4047665B7708433
17971B4401405C952651c71450k1916111A2920567K8183805j9165839M0482514
17964F2421047a7313998H091764K6628085E127076c39729j5293439j9606564D0071286
$$ plain form
18020 -12324275 -58280307 -27471172 -12125716 -7736435 16720014 -2707016 5360165
18012 12431554 -40783330 -13159854 -29150862 -38077814 -21784575 10037764 1689229
18004 32830197 953016 19224004 1730380 -2219350 15312743 -17020893 -27229792 -21529272
17996 -21529272 -11723505 -37989405 -25665641 7066947 -22194451 -36205306 -9059488
17988 39102966 2242087 1607812 23468754 6073587 1471732 -10022039 128643 -3459584
17979 -25172592 12943528 25792632 14237539 -16762042 -4762980 -38810645 27708433
17971 24401405 3952651 -371450 -22287561 12920567 41104372 21938533 62421047
17964 62421047 -17313998 8091764 34719849 5127076 -339729 -15633168 -35239732 40071286
17955B0396678c030404j2440251A2908783c1394169a347570B9682678a0413720
17947c4871426G237945e824568p552K047571m4811971A6177740d209003A7636021
17938D3633197i301592j6528364P118670a545842B7336868K186868j2230432K082893
17930A9376197C43699Q621765a3470402l3331166B8654897c6198944H060111a5952843
17921g738263A6652922A774109b1891406j1347997a1653250C1288704A0373552
17913B808324K2841421b5720157C661461m2744O537432l298237j046085B73658
17904B6940053d4414777a4051654K749331C8213657h907849A2261686P383411
17897A9645097c7526733A258707d3925221A5073934M793491b1650052e040660
$$ plain form
17955 20396678 -3030404 -15470655 12908783 -31394169 -1347570 29682678 -10413720
17947 -34871426 7237945 -5824568 -5832120 -3784549 -48596520 16177740 -4209003 17636021
17938 43633197 -9301592 -25829956 -18711286 -1545842 27336868 29523736 17293304 19376197
17930 19376197 343699 8965464 -13470402 -46801568 28654897 -36198944 8060111 -15952843
17921 -7738263 16652922 1774109 -21891406 -33239403 -11653250 31288704 10373552
17913 2808324 25649745 -25720157 3661461 3618717 10156149 6857912 5811827 273658
17904 26940053 -44414777 -14051654 -11302323 38213657 -8907849 12261686 19645097
17897 19645097 -37526733 1258707 -43925221 15073934 19867425 -21650052 -5040660
17889c357288D876031J6107690a2506133k1505716e28546j2128642A584698J6087210
17881A7671908p788451a0268126c623777C1177080j3220000C403899L6306435
17874C9710334b0053033o474325F484440C34781K2566776J5576833c6843843A3967197
17865a887798k6597655G038742c4742176D9345942G001065J3529029a717804j7830897
17857a9548701D8548748b5844441e867354j2247129J881015k0053524d199533
17849i182337a992581B0553099b3826315R029425j7283769B7052581R546575k450570
17841C4148586b9750610M758471A3690305b0187637b913481E442737b256453D5280207
17832A3499187g239320j2021344p945054b753982j6447040B1566315a5848262
$$ plain form
17889 -3357288 4876031 20983721 -12506133 -34011849 -528546 -12657188 1584698 17671908
17881 17671908 9883457 -10268126 -3623777 31177080 17957080 3403899 39710334
17874 39710334 -20053033 -26527358 6484440 334781 22901557 38478390 -36843843 13967197
17865 -1887798 -28485453 7038742 -34742176 49345942 7001065 20530094 -1717804 -19548701
17857 -19548701 48548748 -25844441 -5867354 -18114483 -16233468 -36286992 -4199533
17849 -9182337 -1992581 20553099 -23826315 -14796890 -32080659 27052581 36599156 34148586
17841 34148586 -29750610 -24992139 13690305 -20187637 -2913481 5442737 -2256453 45280207
17832 13499187 -7239320 -19260664 -27205718 -2753982 -19201022 21566315 -15848262
17824A5672668M0208139A4575604D267583d0747185a2583995M400644E358630
17816b2203223E121162a5994309C7589525a7606252k4566397A1365514L496469
17809A4861983h992578k1154182B1810185G014671J8522376d912853A5503895
17801c3922820G496863K4988148a3112475M341668A3741973a3537643a544176
17793D8706338A6875516i511672B63312h164122l6831393J2693399J4479804p965455
17785b5787767B4121209A8181f51829C873050K3293398j2260766J12492E449627
17776a3990619A0462674L3678637a1673932C1651493M897642A0988396c1403831
17768a0657331D460115J0960912d0169019C9218333i899404D279889J4522981
$$ plain form
17824 15672668 55880807 14575604 4267583 -40747185 -12583995 -8183351 5358630
17816 -22203223 5121162 -15994309 37589525 -17606252 -42172649 11365514 14861983
17809 14861983 -8992578 -30146760 21810185 7014671 25537047 -4912853 15503895
17801 -33922820 7496863 32485011 -13112475 -8770807 13741973 -13537643 -1544176
17793 48706338 16875516 -9511672 263312 -8164122 -44995515 -32302116 -17822312 -25787767
17785 -25787767 24121209 18181 -651829 3873050 27166448 14905682 15018174 5449627
17776 -13990619 10462674 44141311 -11673932 31651493 36549135 10988396 -31403831
17768 -10657331 4460115 15421027 -40169019 39218333 -9899404 4279889 18802870
17761A8802870m680704K662058h772333j4635940B7573033h408896B3251844B84828
17752C6330962a8974045G384737a9686520c455585p020267G975799f852601D287324
17743C2397342F465195K770724O267773d213613I376867b4030193A9706453a827792
17734B6143704D295281J4092929b1381803a0134682A739579d243968A2934649
17726b588669O245j2160113P288890c00752A0239774I95663L4107394a8269697
17717d598176A2467792j005027c9255002B3861788J087705J9587405a0825777
17709C830276L800870K9757121j8044526H821610J1678026f986691B0498917b106513
17700E81165J5578753M031082c5551123G846517d3732849C868647M0459168A0203272
$$ plain form
17761 18802870 14122166 16784224 -8772333 -23408273 27573033 -8408896 23251844 284828
17752 36330962 -18974045 7384737 -19686520 -3455585 -10475852 7975799 -6852601 4287324
17743 32397342 6465195 9235919 15503692 -4213613 9376867 -24030193 19706453 -1827792
17734 26143704 4295281 18388210 -21381803 -10134682 1739579 -4243968 12934649
17726 -2588669 -2582424 -14742537 -7453647 -300752 10239774 995663 35103057 -18269697
17717 -4598176 12467792 11462765 -39255002 23861788 24949493 44536898 -10825777
17709 3830276 7631146 37388267 19343741 8821610 20499636 -6986691 20498917 -2106513
17700 581165 16159918 20191000 -35551123 7846517 -43732849 3868647 44327815 10203272
17691C041843D86331g523079j3937271B4920435a3529552K075637K963799m801
17683h494917j254437I45748K9474074D602808I37637b9597682a2122162o336199
17675a8458361C4861238p589226a2837075M596397q521444D9533419c4926481
17667b484252l4800763F3378858a8757442A1902193b1940604L266655A220068
17659a5558123A1892500j687763c7654963a5522463C621418b0956717C5889777
17651c6452709D434230L6939735A4162451P019238G418313a0679218l458643A741758
17642B2091063a4051119k6640471D9034972d6727461K0125863D5858980A2403499
17634c9142642H124533a5286955k713167B6132961b1728827D8611786j5780719
$$ plain form
17691 3041843 486331 -7523079 -21460350 24920435 -13529552 -11453915 -8490116 -8494917
17683 -8494917 -9749354 945748 30419822 4602808 937637 -29597682 -12122162 -18458361
17675 -18458361 34861238 27272012 -12837075 -8240678 -16762122 49533419 -34926481
17667 -2484252 -37285015 63378858 -18757442 11902193 -21940604 -18673949 1220068
17659 -15558123 11892500 10204737 -37654963 -15522463 3621418 -20956717 35889777
17651 -36452709 4434230 41373965 14162451 21181689 7418313 -10679218 -14137861 1741758
17642 22091063 -14051119 -40691590 49034972 -46727461 -26601598 45858980 12403499
17634 -39142642 8124533 -15286955 -18000122 26132961 -21728827 48611786 32831067
17627C2831067J091605p234350i23238k3880991C2385000A16205J5303422F324993
17618a3051802C2078016A1796326a9689586e910224H11308a3753153N780731G131538
17609g432917B5965659b9522608A1445707B92143f352536b375127B6623953a0298695
17600a434776P15501A3987290K5567209d272639j7424446k2300324a1850926j4689990
17592b6540916C9037586d7468243B7257878I772005O110221Q704554a7300227
17584a7264551j0855043A3458704D27770K1151613Q219597b3693389a0272549
17576a3487249a651967A7768541g163377A2612102J1356118I411741J9064752
17569B8476493b4419683B4290942b7627484m839481a217751F2802592c780334
$$ plain form
17627 32831067 33922672 26688322 -923238 -24804229 32385000 116205 15419627 6324993
17618 -13051802 32078016 11796326 -19689586 -5910224 811308 -13753153 -7972422 7131538
17609 -7432917 25965659 -29522608 11445707 292143 -6352536 -2375127 26623953 -10298695
17600 -1434776 -719275 13987290 39554499 -4272639 -21697085 -43997409 -11850926 -26540916
17592 -26540916 39037586 -47468243 27257878 9772005 15882226 24586780 -17300227
17584 -17264551 -28119594 13458704 427770 21579383 29798980 -23693389 -10272549
17576 -13487249 -1651967 17768541 -7163377 12612102 23968220 9411741 28476493
17569 28476493 -24419683 24290942 -27627484 -32466965 -1217751 62802592 -3780334
17561a8169256f81818k5031916C5851918A0647763d3239117B7172030b4740986
17553b0626564A9404392h507730m3006973A4182375b0507422k792238n349050
17546b8648710R884343j8105137C3277728a8231643A4762115A883544a1932969
17538b1490956e063464I482228a6087612d203970I682783c9062451e014566k9914050
17530c4928616B9648698D514565J0664673c0570988A8593449a5526872K492957
17523a3033915j2038276B6846744a855212A2400607a6313248C59525a2626483
17515a0136006C2079053a0377127a75798B947053f362592H827768L8752638h645144
17506A2410148i586947j3247548j6826064i360367m180087n835869C9286700b7274106
$$ plain form
17561 -18169256 -681818 -25713734 35851918 10647763 -43239117 27172030 -24740986
17553 -20626564 19404392 -8507730 -51514703 14182375 -20507422 -23299660 -28648710
17546 -28648710 -18764367 -36869504 33277728 -18231643 14762115 1883544 -11932969
17538 -21490956 -5063464 9482228 -16087612 -4203970 9682783 -39062451 -5014566 -34928616
17530 -34928616 29648698 4514565 15179238 -30570988 18593449 -15526872 -13033915
17523 -13033915 -25072191 26846744 -1855212 12400607 -16313248 359525 -12626483
17515 -10136006 32079053 -10377127 -175798 2947053 -6362592 8827768 47580406 -8645144
17506 12410148 -9586947 -22834495 -39660559 -9360367 -13540454 -19376323 39286700 -27274106
17497g548384B1701661H038049J6171482Q668658j5472212F450605c485706E5964423
17488C1262434a2182108c076143A7594281f972427B7044214g591938k755217j6745381
17480b7092536a16288D102642J7997853r815937a5312902l5500157B4896631m98139
17472B4398492c0768280f364960A6313340O532123a0809675k5397312A1431104
17464A0132717a9022766g780705B5151527C071653c8960869C1802953A3616914
17456A1526896c616535f74496k9509584B9295423Q93664j4615235m280698A263338
17447b129576A1232054B430237d7573A3279374K5379198Q15562a6429868A0331100
17438a5013847j0956444g111570D25994a856070k8609137d475305C4894722a6241421
$$ plain form
17497 -7548384 21701661 8038049 24209531 32878189 17405977 6450605 -3485706 55964423
17488 31262434 -12182108 -3076143 17594281 -6972427 27044214 -7591938 -10347155 -27092536
17480 -27092536 -116288 4102642 22100495 12284558 -15312902 -50813059 24896631 24398492
17472 24398492 -30768280 -6364960 16313340 22845463 -10809675 -36206987 11431104
17464 10132717 -19022766 -7780705 25151527 3071653 -38960869 31802953 13616914
17456 11526896 -3616535 -674496 -30184080 29295423 30189087 15573852 11293154 1263338
17447 -2129576 11232054 2430237 -47573 13279374 38658572 39474134 -16429868 10331100
17438 -15013847 -25970291 -7111570 425994 -1856070 -30465207 -4475305 34894722 -16241421
17429B2037060f442248E6493799C660758J3944554H081363L071691J2972140b3362745
17420a0008577B2226565K3624437a1555480a390140j2293820l881087P30408G522493
17411d1818851a9539582P172076a65801q888027A2916586d441313a50405n866854
17403f017259C4288417c1618204B5371619a4095635A6131415b7942675a1407988
17395d241778C5464869G153372a7142783e20053k7452689A7665456J0414067a2699588
17386A7645535g1563910b9453656A0480382d4428909A0907191e1506035C0247421
17378a248285A4455484J0197952F58592c1219284C918959i019001a249069E315264
17369E939065e481481A3218143b5719538P088519M25687A190394d3497051b121576
$$ plain form
17429 22037060 -6442248 56493799 3660758 17605312 8081363 11153054 24125194 -23362745
17420 -10008577 22226565 45851002 -11555480 -1390140 -13683960 -17565047 -16834639 7522493
17411 -41818851 -19539582 -12367506 -165801 -9053828 12916586 -4441313 -150405 -6017259
17403 -6017259 34288417 -31618204 25371619 -14095635 16131415 -27942675 -11407988
17395 -4241778 35464869 7153372 -17142783 -520053 -27972742 17665456 28079523 -12699588
17386 17645535 -71563910 -29453656 10480382 -44428909 10907191 -51506035 30247421
17378 -1248285 14455484 24653436 658592 -31219284 3918959 -9019001 -1249069 5315264
17369 5939065 -5481481 13218143 -25719538 -18631019 -18205332 1190394 -43497051 -2121576
17360A8808117q517796b0144641F859795b7971966B6043825c4669677B7382147
17352G438013b0482422A905238J8964409F091690K224992D80158a339232O35380
17344g03852m1517692a6184556A7222045g861066l8107041A0097856K0526213
17337C0624069a1105176F269277c9135114O037753J1275481m765372a883486j2951503
17329a4834989J477996O484568L21887A6656634E195326K1420875B092743K449563
17321D542306O399154J7995261A0793170a8040503f339075k2803876D393565e3620609
17312C2352786c0667706B0210425J086914c0307896E4740926B5897468a615203
17304d2569363J9549484a1390980B6888355c4357825g471496k0292216G737356
$$ plain form
17360 18808117 10290321 -20144641 6859795 -27971966 26043825 -34669677 27382147
17352 7438013 -20482422 1905238 20869647 6091690 8316682 480158 -1339232 -703852
17344 -703852 -42221544 -16184556 17222045 -7861066 -45968107 10097856 30624069
17337 30624069 -11105176 6269277 -39135114 -33097361 -21821880 -26587252 -1883486 -14834989
17329 -14834989 -13356993 -6872425 -6550538 16656634 5195326 26616201 2092743 4542306
17321 4542306 10941460 28936721 10793170 -18040503 -6339075 -29142951 4393565 -53620609
17312 32352786 -30667706 20210425 21297339 -30307896 54740926 25897468 -1615203
17304 -42569363 -23019879 -11390980 26888355 -34357825 -7471496 -27763712 7737356
17296B8598259b9949823A5943681c287817H405778P907524j754177c8361860J1159617
17288b7202243c121648Q44229n690230I446822J651427a5136024A5541070b9593329
17279D81103b0516478C8254882d4719089A4587151c2163056C5014770c6978898
17271g1593470C5379662j1129187B553676K3425531H757345K309863A214756l00505
17263I14251L0091396I854970b3902636l00069K114871e69118C8707217e4644115
17254I887456h116017B8992137o348289d101114o094421A0845663K8007000e2325725
17245E005185J3163990E132561K0633491a3491041A1393683b6086559J1035417
17238a5051142m659525A7129448n794837J6798788d041098m441613a482976j0104793
$$ plain form
17296 28598259 -29949823 15943681 -3287817 8405778 16313302 14559125 -38361860 -27202243
17288 -27202243 -3121648 -2277419 -7967649 9446822 11098249 -15136024 15541070 -29593329
17279 481103 -20516478 38254882 -44719089 14587151 -32163056 35014770 -36978898
17271 -71593470 35379662 24250475 2553676 25979207 8757345 11067208 1214756 914251
17263 914251 31005647 9854970 -23902636 -24202705 -22087834 -569118 38707217 -54644115
17254 9887456 -8116017 28992137 22643848 -4101114 -10195535 10845663 38852663 -52325725
17245 5005185 18169175 5132561 25766052 -13491041 11393683 -26086559 -15051142
17238 -15051142 -19710667 17129448 11334611 28133399 -4041098 -8482711 -1482976 -11587769
17230a1587769A2201948b621097p866391j961327d292959m130781j9071155m696108
17222c2191003B2539451F882354K5937311b1850631I45550a8912343j0052343
17215b8964686b858007G500890K3064588a1929559a715238j299515G751495b208560
17206a066610B0463650o701002b1690303j400415i119384J520288D2766089k0520423
17198B2245666c4730847A915540c070472k6158636a2615928A9784230e0426903
17190A7176629d139745o926812E05283J1824829a983471j672701A3583824a3462322
17181A9160639r207896e063165q548851C8067075b5017444D720327J7706657c9223433
17172b3884277D008384e5324188B87147d5147779a979182B4794307k041172c5841433
$$ plain form
17230 -11587769 12201948 -2621097 -10487488 -12448815 -4292959 -8423740 -27494895 -32191003
17222 -32191003 22539451 6882354 32819665 -21850631 945550 -18912343 -28964686
17215 -28964686 -2858007 7500890 30565478 -11929559 -1715238 -3014753 7751495 -2208560
17206 -1066610 20463650 13762648 -21690303 -23090718 -9119384 -7599096 42766089 22245666
17198 22245666 -34730847 1915540 -3070472 -29229108 -12615928 19784230 -50426903
17190 17176629 -4139745 -11066557 505283 12330112 -1983471 -3656172 13583824 -13462322
17181 19160639 9952743 -5063165 -13612016 38067075 -25017444 4720327 22426984 -39223433
17172 -23884277 4008384 -55324188 287147 -45147779 -1979182 24794307 22753135 -35841433
17163c6994240B2174949K9323906A2423914O865669F702059J3239572m894260
17156A5047371a2608943A5883294p755454C210424J5461360H423018M707760b226673
17147e657570j042603j0270717B4390599A064295b6933121a2431212c330124n114956
17139h445080A2867364c69560j0577549j2210512o962472A6613818j429907F319671
17130c4050679I880577g702718B6455499a3766041A1574644A199952e8891014
17122A4275192R084477C117033R716281a0313231j063389b730325F5747994E189482
17113c4500278R923637F867426J6154803b723571G634200J725973R675200e627312
17104A4956864a1595149A6361653a4145652C1483092b3544008F556779R183035
$$ plain form
17163 -36994240 22174949 51498855 12423914 19289583 6702059 19941631 15047371
17156 15047371 -12608943 15883294 8127840 3210424 18671784 8423018 13130778 -2226673
17147 -5657570 -6700173 -16970890 24390599 1064295 -26933121 -12431212 -3330124 -8445080
17139 -8445080 12867364 -369560 -10947109 -23157621 -30120093 16613818 15183911 6319671
17130 -34050679 9880577 -7702718 26455499 -13766041 11574644 1199952 -58891014
17122 14275192 23359669 3117033 12833314 -10313231 -11376620 -2730325 65747994 5189482
17113 -34500278 -24576641 6867426 23022229 -2723571 7634200 9360173 19035373 -5627312
17104 14956864 -11595149 16361653 -14145652 31483092 -23544008 6556779 15739814
17097A5739814l898649j385929b6819107A1463992C334024a386240L80673l8874846
17089c9880413A2441356a5629927n778533a095829A5948279f256893k1183552
17082b7440445A9339245c7605088c118533k2010369O217308d791186B0549352
17074B6758042c8094289J8326063M783327b16100k7090674f465001B5863938j1437196
17066A4426742a860476A6117113c4982212B0181989J2252825E494258b9259929
17058A3992985j809901P495327H264362c9716134a5867748j381550A3338608J3309071
17050B6647679A2332687j293891b9144013N617244C2378707o074594A644029b0145654
17041d9467260b4642464I697804L034017n308762K724264B938279e236343D4102259
$$ plain form
17097 15739814 11841165 10455236 -26819107 11463992 3334024 -1386240 -1005567 -39880413
17089 -39880413 12441356 -15629927 -21408460 -1095829 15948279 -6256893 -27440445
17082 -27440445 19339245 -37605088 -3118533 -25128902 -18911594 -4791186 20549352
17074 26758042 -38094289 -19768226 -14984899 -216100 -27306774 -6465001 25863938 14426742
17066 14426742 -1860476 16117113 -34982212 20181989 32434814 5494258 -29259929
17058 13992985 12183084 19678411 8264362 -39716134 -15867748 -17249298 13338608 26647679
17050 26647679 12332687 11038796 -29144013 -23526769 32378707 26304113 1644029 -20145654
17041 -49467260 -24642464 9697804 12731821 7423059 10147323 2938279 -5236343 44102259
17032b9766054C3143842b7927386b455525a018626n599078j8966685D153943f897489
17023A7648925E897589J7879754i792114l0117712A4064003g348802l4013091
17016d1361893C4814300b0288455a392690B2113723A485838a1743875d593162
17008E322922d1751887A3429905c4869589J5344758B2468352J2601733A0690085
17000D673879a3751323B417718c479630k5001794d391913C9289903j6171295b7622080
16991a1446495D3305217B875311f9247956D438385R055400e6948186Q226008C32927
16982a4651687A6746984a7255975G52883a7445069o158169h641711A2940214M127666
16974A7067880B705120a70540B707787e4394562a1538745D3449050A5596653b2762431
$$ plain form
17032 -29766054 33143842 -27927386 -2455525 -1018626 -6617704 -25584389 4153943 -6897489
17023 17648925 5897589 23777343 -9792114 -39909826 14064003 -7348802 -41361893
17016 -41361893 34814300 -20288455 -1392690 22113723 1485838 -11743875 -4593162
17008 5322922 -41751887 13429905 -34869589 -19524831 22468352 35070085 10690085
17000 4673879 -13751323 2417718 -3479630 -28481424 -4391913 39289903 23118608 -27622080
16991 -11446495 43305217 2875311 -69247956 4438385 13493785 -56948186 -48722178 332927
16982 -14651687 16746984 -17255975 752883 -17445069 -23603238 -8641711 12940214 17067880
16974 17067880 2705120 -170540 2707787 -54394562 -11538745 43449050 15596653 -22762431
16965h406934A3820394n588301K482819c278817o657120A6593154q114327L368083
16957A1846910a5830100A9079891b444810n418798m587492j9998141j2319147
16950d4768388C726336a1076486A5274645m638019c4520171a4224635k5721546
16943c9946181F916803J4152367p367053o427499a8453419A468035c795794B3536586
16934a5768832E7671509g492684m3388248C946362a0114212c846650B6317322
16926I801359a8277905H823882l606600L0834282j7851661L4196915B104914l30361
16918A774553J6193535D30385M3126975D602506b1372676B7971235j567334c2304462
16909A0890662K4821634A124857f094491o811350B3121428c18515k5202379A4897003
$$ plain form
16965 -8406934 13820394 8232093 10714912 -3278817 -9935937 16593154 8478827 11846910
16957 11846910 -15830100 19079891 -2444810 -7863608 -12451100 -32449241 -44768388
16950 -44768388 3726336 -11076486 15274645 10636626 -34520171 -14224635 -39946181
16943 -39946181 6916803 21069170 13702117 7274618 -18453419 1468035 -3795794 23536586
16934 -15768832 57671509 -7492684 -50880932 3946362 -10114212 -3846650 26317322
16926 9801359 -18277905 8823882 5217282 36051564 18199903 52396818 2104914 1774553
16918 1774553 17968088 430385 43557360 4602506 -21372676 27971235 26403901 -32304462
16909 10890662 35712296 1124857 -6094491 -12905841 23121428 -318515 -25520894 14897003
16900C053573J7529425A137371K0042812B197511a1917316l627711q128485C1709773
16891a2893434C9050527B743087J1225368C587351J3061515d040060A0696815
16883d455569A6548037a8696565N717297E356745j869067a6490383q662754a1861144
16874c1118873h340412J100890l979567j6428073f517231j5707149R631378A0956331
16865a0990089o561919P722042k4813011F5864962F283735A552182b357659j8343075
16857b0700734g639343j1974037B6789460b1190357o387550G862366J5171969
16850B3034335p202937M259738C154634a3487822A4884724c48811l821849j7088783
16842b1259443A0324545b8576994J1145260g6851D342871h637807b815351j8466344
$$ plain form
16900 3053573 20582998 1137371 21180183 2197511 -11917316 -15545027 -23673512 31709773
16891 -12893434 39050527 2743087 13968455 3587351 16648866 -4040060 10696815
16883 -4455569 16548037 -18696565 -12979268 5356745 3487678 -16490383 -25153137 -11861144
16874 -31118873 -8340412 -7239522 -11219089 -27647162 -6517231 -22224380 -12593002 10956331
16865 -10990089 -17552008 -9829966 -34642977 65864962 6283735 1552182 -2357659 -20700734
16857 -20700734 -7639343 -19613380 26789460 -21190357 -27577907 7862366 23034335
16850 23034335 15831398 20091136 3154634 -13487822 14884724 -348811 -4170660 -21259443
16842 -21259443 10324545 -28576994 -17431734 -76851 4342871 -8637807 -2815351 -21281695
16834b1281695k0905304c479913B9992311l783017a0885775k0367810j193672
16827c2447257l369402d61088r434002I738712c6241191q824567D2536394b1699744
16818b1384035A8018395d666547A362919K567544K5871262j3358203a7042015
16810B8852471b399675j257276A8052336J0623362J4284753A0565151B797452
16802b6875079A1134647J846684h718477k4583022N752952E958563K9058460A453474
16793F003706K9543897E711615i8307j2549652b294842C0112229a3737902D325206
16784c5131138L720305a4354886G031043a9142300B3968857B886651c6459416
16776b2337573j7427397a2686960G359661b0296368j1335174E701539L974916
$$ plain form
16834 -21281695 -42186999 -3479913 29992311 26209294 -10885775 -31253585 -32447257
16827 -32447257 -35816659 -461088 -9895090 9738712 -36241191 -45065758 42536394 -21699744
16818 -21384035 18018395 -4666547 1362919 3930463 29801725 16443522 -17042015
16810 28852471 -2399675 -3656951 18052336 28675698 42960451 10565151 2797452
16802 -26875079 11134647 12981331 -8718477 -33301499 -27548547 5958563 35017023 1453474
16793 6003706 35547603 5711615 -98307 -12647959 -2294842 30112229 -13737902 4325206
16784 -35131138 -31410833 -14354886 7031043 -19142300 23968857 2886651 -36459416
16776 -22337573 -39764970 -12686960 7359661 -20296368 -31631542 5701539 9676455
16769I676455b9319091h137590m874233m456494A510208i686650J993641j5553075
16761b3246084N477351h479953B7729139j1403268b1175405A8546404d3955978
16753a2598895j0880935E126940J7855633n237480c2861371a3443206r350687
16746b2793893j2951863A4567598i532589C7195335A3447218b7335618k885226
16739c0220844G351601N20315l812661K6822908b0435085H757641l042353b2055396
16730B7168153b9931744a904378n568122A4042753o158415a4303135e207955B0935568
16721A8084605b4329684D020665b9977386I466430c2015559N68327C1776578j4725852
16713A7050726E464278a7090198F876500M739529a2946629A849554N79342J2431434
$$ plain form
16769 9676455 -29319091 -8137590 -13011823 -17468317 1510208 -9686650 -7693009 -23246084
16761 -23246084 -17768733 -8479953 27729139 16325871 -21175405 18546404 -43955978
16753 -12598895 -23479830 5126940 22982573 17745093 -32861371 -13443206 -22793893
16746 -22793893 -35745756 14567598 -9532589 37195335 13447218 -27335618 -30220844
16739 -30220844 7351601 7871916 4059255 30882163 -20435085 8757641 5715288 -22055396
16730 27168153 -29931744 -1904378 -7472500 14042753 7884338 -14303135 -5207955 20935568
16721 18084605 -24329684 4020665 -29977386 9466430 -32015559 -31447232 31776578 17050726
16713 17050726 5464278 -17090198 6876500 11616029 -12946629 1849554 2428896 14860330
16705A4860330l220972a8890497k0874848a7795340A9442628a7970508l7204050
16698e5174558a0846009G127724c63657o80500C2484450b1451836k5380456f801212
16689c2893270B271673a1864073n3330701b2354221C0142616d2251806C973428
16681A2356691B186757J488670a6053642n863706D1150009b5632682A9305208
16673i472541k1590303B0024331a0372779n657444A7302184E176108b4452077
16665a1836599D213934R3526J6399835b3667839N688599p5551155b4944145A8931576
16656a3054849D447149J8669920h164147b878658j2758600J274245A2552320h195729
16647a0871621G308505K04644e5629618c27719k6212115i976201l0515001a5104079
$$ plain form
16705 14860330 11639358 -18890497 -39765345 -17795340 19442628 -17970508 -55174558
16698 -55174558 -10846009 7127724 -363657 -1044157 32484450 -21451836 -46832292 -6801212
16689 -32893270 2271673 -11864073 -65194774 -22354221 30142616 -42251806 3973428
16681 12356691 2186757 3675427 -16053642 -21917348 41150009 -25632682 19305208
16673 -9472541 -31062844 20024331 -10372779 -16030223 17302184 5176108 -24452077
16665 -11836599 4213934 4307460 20707295 -23667839 -17979240 -93530395 -24944145 18931576
16656 -13054849 4447149 23117069 -8164147 -2878658 -15637258 -14363013 12552320 -8195729
16647 -10871621 7308505 7513149 -55629618 -327719 -26539834 -9976201 -40491202 -15104079
16638A4674922Q152562b267279G2947593L6110894K9187028J51035206R195691
16631B98476412N1944882O1179860o9716649J4105948K4833112j01875436m6588207
16624B32359922m7350039R363656n2480482l053886M349986F3303267j5145918
16617D8157349A1532200L8899151A9241642a1963683C9523173j2683491J1409618
16610C8249300J6485206A645983K9966080K3151222B3658150O363836B635548
16602E1610493b7026944A7176789M996722p546909e926459D2451423d8831462
16594g806138I406562a6557257C1666958b5359274B6688767A1127790K0592984
16587C1720774G433628J6214500R200630F814616O803943g585937F8497612E675449
$$ plain form
16638 14674922 22827484 -2267279 72947593 109058487 138245515 289280721 298476412
16631 298476412 350421294 411601154 341884505 355990453 380823565 278948129 232359922
16624 232359922 185009883 194373539 141893057 138839171 143189157 63303267 48157349
16617 48157349 11532200 50431351 19241642 -11963683 39523173 26839682 38249300
16610 38249300 54734506 1645983 31612063 54763285 23658150 30021986 2635548
16602 51610493 -27026944 17176789 22173511 14626602 -5926459 42451423 -48831462
16594 -7806138 9406562 -16557257 31666958 -25359274 26688767 11127790 31720774
16587 31720774 7433628 23648128 32848758 6814616 13618559 -7585937 68497612 5675449
16578I291774J2924444K883913C822386M0602996a1147043j532983A9407226q064681
16570A1342545A933270O977618J593216a9349980M312982j472887b127021B6198726
16561C3230183F169716K4870935c541045D648821c35587A0757787N248062O977993
16553B2983842a9669213m212718C5250496c7686844A8230418h535219j27842C3044490
16544h292990D3991800C432686K1572110i044339D041415K7610973c820888k086624
16536e907512k6592976A312978L782338a6772704A6817062K2485337e307687C6474612
16527B6064286J6849944b7333418D306055J4706223J0237697J5620830k1044129
16520B3826676G283439b8596201q190027K661926A6434133a567187C0305285d2862161
$$ plain form
16578 9291774 22216218 25100131 3822386 44425382 -11147043 -12680026 19407226 11342545
16570 11342545 1933270 8910888 10504104 -19349980 -15036998 -16509885 -2127021 26198726
16561 33230183 6169716 31040651 -3541045 4648821 -335587 10757787 16005849 22983842
16553 22983842 -19669213 -23881931 35250496 -37686844 18230418 -8535219 -8663061 33044490
16544 -8292990 43991800 3432686 25004796 -9044339 4041415 31652388 -3820888 -5907512
16536 -5907512 -32500488 1312978 5095316 -16772704 16817062 39302399 -5307687 36474612
16527 26064286 42914230 -27333418 4306055 19012278 29249975 44870805 23826676
16520 23826676 7283439 -28596201 -36786228 -34124302 16434133 -1567187 30305285 -42862161
16511g593500A9929571B874401l48821a7528394J400003n03046A5356776P883046
16503B3239822A0542463B428053e416365B6749630a5275741A9389776B84903M1149040
16495D1433943c0935804f274592k7376459m892150J4222389K790838A0859899
16487A7448039a2801018L885564j3710842A8103717E796775M3688312G325871
16479d3805649A7137891a2812479r693161E437400a2221108F11299J7913457j003110
16471A7521646b2913575B626132d3213738C6148020a628125D771760b1197041
16463d260748k2346672B6286818j1403612a3083395j0669290E199097q11319J3559051
16455A7946829A968333a936061o058092b277273o994520A2040575J6041794O01397
$$ plain form
16511 -7593500 19929571 2874401 2525580 -17528394 -16128391 -16631437 15356776 23239822
16503 23239822 10542463 2428053 -5416365 26749630 -15275741 19389776 284903 41433943
16495 41433943 -30935804 -6274592 -33651051 -38543201 -24320812 -21529974 10859899
16487 17448039 -12801018 -8915454 -22626296 18103717 5796775 49485087 7325871
16479 -43805649 17137891 -12812479 -22505640 5437400 -12221108 611299 18524756 17521646
16471 17521646 -22913575 2626132 -43213738 36148020 -1628125 4771760 -21197041
16463 -4260748 -26607420 26286818 14883206 -13083395 -23752685 5199097 4387778 17946829
16455 17946829 1968333 -1936061 -7994153 -2277273 -9271793 12040575 28082369 28683766
16447B8683766E791271L0847716I041145Q526792R190717G165994L792815P430509
16439A8389318c8127350h057674k2377520F248909e6639457K2752667C5153650
16431b5359838J1254958f645732L015492j3189608B0475017I576914d0660313
16423d782907A387993h263828j456032o444017D166935c0592980J3621220j0333690
16415b7305450D09536a4336422j487565A7517932L452929m502228a394047k4621068
16407b6015115d91862C734531J8133873D857313b1119002A4309420a221668D759915
16398i700583G96873c983829K18086C523435a8755518A544959a1558830C916321
16389A7869002c139997G125617J2862783d899207p263363D0109309b0740597g01596
$$ plain form
16447 28683766 5791271 36638987 9041145 17567937 26758654 7165994 10958809 18389318
16439 18389318 -38127350 -8057674 -30435194 6248909 -56639457 -33886790 35153650
16431 -25359838 -14104880 -6645732 -3630240 -16819848 20475017 9576914 -40660313
16423 -4782907 1387993 -8263828 -9719860 -16163877 4166935 -30592980 -16971760 -27305450
16415 -27305450 409536 -14336422 -15823987 17517932 20970861 16468633 -1394047 -26015115
16407 -26015115 -491862 3734531 21868404 4857313 -21119002 14309420 -1221668 4759915
16398 -9700583 796873 -3983829 -3765743 3523435 -18755518 1544959 -11558830 3916321
16389 17869002 -3139997 7125617 19988400 -4899207 -12162570 40109309 -20740597 -701596
16380c9824847D942539K1944970F521377h411509m2736241C375591d2361451a909517
16371a8076029A1670658A53460a5714740B5935736d9901209D009283b715764m196748
16363f912512C6971519A335700J5757616o685077K0231067j0262484c1215874
16355i664454J616039F147165P877939a586602k6395603J0146814G645688M108573
16347A1754261J9222885F410613J3941980b302539E7008224A3752342b219172
16339B7699300A2179727a9195821g833932m012407B9590600a7136863e159207
16331c5153566J6090282C4099186b006999l0511578K690414B7085182q61214g378997
16322a7140594H083665a7035643B169688J1673694a1172209j2401487C4281503
$$ plain form
16380 -39824847 4942539 26887509 6521377 -8411509 -51147750 3375591 -42361451 -1909517
16371 -18076029 11670658 153460 -15714740 25935736 -49901209 4009283 -2715764 -6912512
16363 -6912512 36971519 1335700 17093316 10408239 30639306 20376822 -31215874
16355 -9664454 -8048415 6147165 14025104 -1586602 -27982205 -17835391 7645688 11754261
16347 11754261 30977146 6410613 20352593 -2302539 57008224 13752342 -2219172
16339 27699300 12179727 -19195821 -7833932 -11846339 29590600 -17136863 -5159207
16331 -35153566 -19063284 34099186 -2006999 -32518577 -29828163 27085182 26223968 -7378997
16322 -17140594 8083665 -17035643 2169688 13843382 -11172209 -23573696 34281503
16314C561889b4269289C7074214g357805n668612C5071425n212123C511061f764502
16305a0824706B3210842G262984c209115A8112287a9431370L97036b363466B4104101
16296C1071873b7954463C6052850b8447739F148160K0503263q632704a4727293
16288a940852j7184485O137808A4514L3024980a2576709C25064J538039d241399
16279B9593292b406057C7871447A3224384M025359J6079198e23202k0270556r120813
16271b9914571b55414C1923477j684371A4186275d242400C4078043a3326597c137585
16262a0090302H693857b0571994i534085l2993647B0141756A458549K794817c6475186
16253D280852a709003B742198N568096C503676K81663f2819448B3869560B461564
$$ plain form
16314 3561889 -24269289 37074214 -7357805 -13026417 35071425 29859302 3511061 -6764502
16305 -10824706 23210842 7262984 -3209115 18112287 -19431370 -19034334 -2363466 24104101
16296 31071873 -27954463 36052850 -28447739 6148160 26651423 18018719 -14727293
16288 -1940852 -19125337 -12987529 14514 33039494 -12576709 325064 1863103 -4241399
16279 29593292 -2406057 37871447 13224384 17249743 33328941 -523202 -20793758 -29914571
16271 -29914571 -255414 31923477 30239106 14186275 -4242400 34078043 -13326597 -3137585
16262 -10090302 8693857 -20571994 -9534085 -42527732 20141756 1458549 4253366 -36475186
16253 4280852 -1709003 2742198 8310294 3503676 3785339 -62819448 23869560 2461564
16244g092265A6744445o647153h457352j9432957a010318C6645160a0318918N21215
16236i797703j0808913f785815j7664782b167629j3876354o306819B4427015a8495473
16227a3753622M229921C486145J5736563a026938l611576C2415483i650775Q58262
16219h792513k363270a323168A491153J5934047p739377a9239211k1203457A6952546
16210E594083g023221l0846670P597595P166541A6884212F405131a1875751E220856
16201c2077334a253550A2220890k724896a2396778A1212764a4998164L15136j470543
16193a6153571B9448039I813679c2454296J6009633J030448j3502207O561264
16186b2355158A0613886f47130H342576b6604717N405925A4227174P769950d070273
$$ plain form
16244 -7092265 16744445 10097292 -8457352 -27890309 -1010318 36645160 -10318918 -9797703
16236 -9797703 -20606616 -6785815 -24450597 -2167629 -16043983 -22350802 24427015 -18495473
16227 -13753622 -9523701 3486145 19222708 -1026938 -4638514 32415483 -9650775 -8792513
16219 -8792513 -11155783 -1323168 1491153 17425200 9685823 -19239211 -40442668 16952546
16210 5594083 -7023221 -37869891 -30272296 -23105755 16884212 6405131 -11875751 5220856
16201 -32077334 -1253550 12220890 9495994 -12396778 11212764 -14998164 -14683028 -16153571
16193 -16153571 29448039 9813679 -32454296 -16444663 -15414215 -28916422 -22355158
16186 -22355158 10613886 -647130 8342576 -26604717 -21198792 14227174 21997124 -4070273
16177b9089962A116072a639348k3280k9639680H998334L7706972h106434C481910
16168h051185C6509490a6740870m1637092g54391l6514867j7354892b3231155
16160E8884131h218470B1786883a9212638P660429G018767J7084992k322179M400266
16152B6181846a9236656A948843N042260i007856D084218K0415221I372956a1071810
16143A9061527o02772K0839612c533586D5186527A4086369g879049q660146D9137297
16134a5881324B4334451p17490C314768e462892l028932I130945L8716935A3091585
16125D0581805a0026799l9209024J6362197C7559535K384753q228378j804950
16118B9910960l378329a8497233A5349685c443622A6821937o258008L4223713
$$ plain form
16177 -29089962 1116072 -1639348 -1662628 -31302308 8998334 46705306 -8106434 3481910
16168 -8051185 36509490 -16740870 -58377962 -754391 -37269258 -54624150 -23231155
16160 58884131 -8218470 21786883 -19212638 -11552209 7018767 24103759 21781580 26181846
16152 26181846 -19236656 1948843 6991103 -9007856 4084218 24499439 9372956 -11071810
16143 19061527 18458755 39298367 -3533586 45186527 14086369 -7879049 -16539195 49137297
16134 -15881324 24334451 23616961 3314768 -5462892 -8491824 9130945 47847880 13091585
16125 40581805 -10026799 -49235823 -32873626 37559535 39944288 31715910 29910960
16118 29910960 26532631 -18497233 15349685 -3443622 16821937 10563929 44787642
16111D4787642A4314409R460191e882364B9538696m802806a7607173C526768a4882364
16102e5880203a4816231k3515494E826148d6643566A9996938c792335I345598
16094a397264A8317460B586015c8542927J7257973A5384995a6752775h179558
16086c520244k6172775J1411561d137914A4367317K5791391F42020a2340295G152934
16077b2505452e622915l5879092c969220D1596010d391748j8889849i784582F0538641
16068B2427881c1278274B0248080r428893J4628853A188297L7425380A1996381
16060A8892990b5585987F584181J6962328I865581d852388l5061111G41039J1063317
16052A1804356a4729795C8162141c5144446F020736k972982a7162886g713825
$$ plain form
16111 44787642 14314409 23774600 -5882364 29538696 24735890 -17607173 3526768 -14882364
16102 -55880203 -14816231 -38331725 5826148 -46643566 19996938 -3792335 9345598
16094 -1397264 18317460 2586015 -38542927 -21284954 15384995 -16752775 -8179558
16086 -3520244 -29693019 -18281458 -4137914 14367317 40158708 642020 -12340295 7152934
16077 -22505452 -5622915 -41502007 -3969220 41596010 -4391748 -23281597 -9784582 60538641
16068 22427881 -31278274 20248080 10819187 25448040 1188297 38613677 11996381
16060 18892990 -25585987 6584181 23546509 9865581 -4852388 -39913499 741039 11804356
16052 11804356 -14729795 38162141 -35144446 6020736 3047754 -17162886 -7713825
16044B3674692A0850361m613551a2089329H972229C618264J9500944J42550d299762
16035A1578541b5835863J2444906A8837066D211082a684769B7340846F915329
16027b4924315A6255040a0654210k1174991k854686R303954a1662602H673040
16019D4917845C071574m74896N5289212B5624264b1831080D0155905A7697138
16011a7028932G135838i9416q298189A9966101K150127a8547635a1944l7309907
16003c7321851A2476914A727734K7972977b5719639A1485748d038656p073437
15996a1112093j5731377R223576k161765Q377065G359524a8252356B7796320g561217
15987I359275J527924M970668h558098B430711L689050c8803072C1882297a1066099
$$ plain form
16044 23674692 10850361 6236810 -12089329 8972229 3618264 23119208 23261758 -4299762
16035 11578541 -25835863 -13390957 18837066 4211082 -1684769 27340846 6915329
16027 -24924315 16255040 -10654210 -31829201 -34683887 -25379933 -11662602 8673040
16019 44917845 3071574 2596678 57885890 25624264 -21831080 40155905 17697138
16011 -17028932 7135838 -99416 -8397605 19966101 22116228 -18547635 -11944 -37321851
16003 -37321851 12476914 1727734 29700711 -25719639 11485748 -4038656 -11112093
15996 -11112093 -26843470 -17619894 -19781659 -11404594 7359524 -18252356 27796320 -7561217
15987 9359275 10887199 15857867 -8558098 2430711 6119761 -38803072 31882297 -11066099
15978C5954387o372161H032894b372654A5200764b755213J69446p761232B7845180
15969A1113260E028950c1812542N122459a2596068d745573j8532249h188765A9263350
15960b5766546P315832A1130161Q258782K2634454D963898M7259676a8658701
15952d7983560b0990383Q955895m910538H757945h557841L289635B4751632C732700
15943h942811A0611972a6551180e499613G355235J8917273b3132181a104125C3787990
15934H906263d361130l92535o343692k9629921a754841C0202031a4926413A1595419
15925b1112350C1071465p344393d3833728M957915n76218A8534589a7171835B8413708
15916a0933844C9368773b4499312K074600D4074056A5559337c56388o955142m307588
$$ plain form
15978 35954387 29582226 8032894 -2372654 15200764 -2755213 -2585767 -10346999 27845180
15969 11113260 5028950 -31812542 -26690083 -12596068 -4745573 -23277822 -8188765 19263350
15960 -25766546 -18450714 11130161 19388943 42023397 4963898 52223574 -18658701
15952 -47983560 -20990383 -12034488 -16945026 8757945 -8557841 -5268206 24751632 3732700
15943 -8942811 10611972 -16551180 -5499613 7355235 26272508 -23132181 -1104125 33787990
15934 8906263 -4361130 -4753665 -11097357 -40727278 -1754841 30202031 -14926413 11595419
15925 -21112350 31071465 23727072 -43833728 -38875813 -39452031 18534589 -17171835 28413708
15916 -10933844 39368773 -24499312 -22424712 44074056 15559337 -356388 -7311530 -11619118
15908a1619118A2194716b311685J028948k9507659a1924658B547592K2589249
15901B5136841c5227722f459384A1509450c731120L8445C3857961H55620L1987435
15893C2843055L456894a1440435D5153070a0829684F774559c9039754n173560
15886d4213314a8835308A5728540a2638494J975577M782377j5705849C5552104
15878D9995690a5174564A0446368K496187M042514J1910941D02942b1818290B2532272
15869B2091250R301944A318828N9951162B4841651j0151838J419340a9942893
15861A2748406G79487b6699931C315544Q707719a5193995B5253445a1837425j1557201
15853b3394626D6083920A0568482c1456338E6868227k7855790I621082d0899303
$$ plain form
15908 -11619118 12194716 -2311685 -1282737 -30790396 -11924658 2547592 25136841
15901 25136841 -35227722 -6459384 11509450 -3731120 -3692675 33857961 855620 32843055
15893 32843055 36299949 -11440435 45153070 -10829684 6774559 -39039754 -44213314
15886 -44213314 -18835308 15728540 -12638494 -10662917 -5880540 -21586389 35552104
15878 49995690 -15174564 10446368 12942555 16985069 28896010 402942 -21818290 22532272
15869 22091250 31393194 1318828 61269990 24841651 14689813 16109153 -19942893
15861 12748406 779487 -26699931 3315544 12023263 -15193995 25253445 -11837425 -23394626
15853 -23394626 46083920 10568482 -31456338 56868227 29012437 9621082 -40899303
15845g362339j2122403O382044r357454E362182k379258b868981C780108K2040528
15837B5820636a2343838o478432j2844457B1431218a4355904K509429B9559276
15829c0204310A9963328E407594b0349237B297401a1132540A441814J1287494
15822A2729308J168530D08106J6200149f1334863a4414473D9843837b9097310
15814H188817a8334057j0646650a3040093C1279442a4761425j4767900A4268395
15806A9583269a1857507e784985B533464O42336c9339694d645600j3726508B4612353
15797c5735529D8922223b0102171d672793A2524365O260798b9432898j6097790
15790d5530688B8441472d1082336d171057A5551582I15471L6191146a3570624
$$ plain form
15845 -7362339 -19484742 -13102698 -22460152 5362182 2982924 -2868981 3780108 25820636
15837 25820636 -12343838 -18822270 -31666727 21431218 -14355904 -11846475 29559276
15829 -30204310 19963328 5407594 -20349237 2297401 -11132540 1441814 12729308
15822 12729308 13897838 408106 16608255 -61334863 -14414473 49843837 -29097310
15814 8188817 -18334057 -28980707 -13040093 31279442 -14761425 -29529325 14268395
15806 19583269 -11857507 -5784985 2533464 3175800 -39339694 -4645600 -18372108 24612353
15797 -35735529 48922223 -20102171 -4672793 12524365 18785163 -29432898 -45530688
15790 -45530688 28441472 -41082336 -4171057 15551582 915471 37106617 -13570624
15782H093495A042924J6173918g2476492C327217b7438661b190909m3486772A2130109
15773b8294495D6627775A4809448b5957203j3177856A2327898n793521a3288575
15765b3031955A8000761n790273N688719b5712247F15405O3594812d091956j5477134
15757a9569090k9208873B2310934a3769687A8094722H170490K7515619M176502
15750C9862611F983294K1585679o802748g041412o400057k51929A8369753a0291162
15741a4576859A7048957h240716m6707418i25898j7189450o407520B597758c7919009
15732B197871L6059368a3755617j92433B2688915L7620513g820671j4275231O528042
15724a5567860j3378576B1662387P20943e0886997a3403731A0097043R01606b076980
$$ plain form
15782 8093495 1042924 17216842 -72476492 3327217 -27438661 -2190909 -45677681 12130109
15773 -28294495 46627775 14809448 -25957203 -39135059 12327898 6534377 -13288575
15765 -23031955 18000761 12210488 17899207 -25712247 615405 64210217 -4091956 -19569090
15757 -19569090 -48777963 22310934 -13769687 18094722 8170490 35686109 39862611
15750 39862611 6983294 28568973 21766225 -7041412 -13441469 -13693398 18369753 -10291162
15741 -14576859 17048957 -8240716 -54948134 -925898 -18115348 -24522868 2597758 -37919009
15732 2197871 38257239 -13755617 -13948050 22688915 60309428 -7820671 -22095902 -15567860
15724 -15567860 -28946436 21662387 22383330 -50886997 -13403731 10097043 10998649 -2076980
15715B521446g150964B9535208J3874803a195100B6830478A2566931a7514273
15707b6146293K61757A4388146B762553O843044J8953203C131434J5692620n029930
15699A3794124d671371A0296061a0346108k6269131N756649h667244G352578O332975
15691A3685553J0236215C754939a6069339B8535508C771058b1770676b499091
15683F453960N098228J3640093a0253753q519017A0269014b262895B7218471e1896512
15674b0199601G0598986a9275115j8967457A0656253b4480223h902815k2188754
15667c1091569H713044J4585998r460331J976795E332620J8886863a987843D149634
15658A1774340c1127405B3604845r235370d2581004a9539948R09605B7426352
$$ plain form
15715 2521446 -7150964 29535208 43410011 -1195100 26830478 12566931 -17514273
15707 -26146293 -25884536 14388146 2762553 9605597 28558800 3131434 18824054 13794124
15699 13794124 -4671371 10296061 -10346108 -36615239 -30858590 -8667244 7352578 13685553
15691 13685553 23921768 3754939 -16069339 28535508 3771058 -21770676 -2499091
15683 6453960 11552188 25192281 -10253753 -18772770 10269014 -2262895 27218471 -51896512
15674 -20199601 70598986 -19275115 -38242572 10656253 -24480223 -8902815 -31091569
15667 -31091569 8713044 23299042 13838711 15815506 5332620 24219483 -1987843 4149634
15658 11774340 -31127405 23604845 14369475 -42581004 -19539948 -18630343 27426352
15650a9024071a825763m4766577L230064D343374d0250271A4473680c3554315
15642C0075216a9464414B2551223b3953687C1209818A5234808K1973637a2310885
15634b3966664g912417b565913j4998794k2594554a7619535C7402817b2001458
15626a1660613p71F207475i553255A768568L6652420g082629A3298385a3748087
15617I165999D82446c73581k9742946C458515c8972027D0839773f012927A5156301
15608a9252223k8407736B5167383f0070033C0150493D983620K4577436A0062102
15600b041139A6762451g435935d76525l1001536J4657514H346260K8605997J170003
15592C8122260A8744749a665932B1443636a6177867j7873417O103291Q114720
$$ plain form
15650 -19024071 -1825763 -46592340 -43362276 4343374 -40250271 14473680 -33554315
15642 30075216 -19464414 22551223 -23953687 31209818 15234808 37208445 -12310885
15634 -23966664 -7912417 -2565913 -17564707 -40159261 -17619535 37402817 -22001458
15626 -11660613 -11661384 6207475 -9553255 1768568 38420988 -7082629 13298385 -13748087
15617 9165999 482446 -373581 -30116527 3458515 -38972027 40839773 -6012927 15156301
15608 -19252223 -47659959 25167383 -60070033 30150493 4983620 29561056 10062102
15600 -2041139 16762451 -7435935 -476525 -31478061 -16820547 8346260 36952257 38122260
15592 38122260 18744749 -1665932 21443636 -16177867 -34051284 -27947993 -19833273
15585a9833273A2085953K164545k233947b9039773L812742E3651116d3082102
15577a239089l199536D923597a0936999H129213a7518569j4914999K753182a4002512
15568a1062860C3870244d87132l7389380Q719952A5888673a8057436C058315C3636
15559B7202261J5286729p742922b46041m9370681g216831C1706684b3930015D6271806
15550a2043212j0882618O372030R17786D7714876D061756a264280j1375057N133523
15542g505814i05895j0962844C658280b0473699a044669C9012064g837507A5250888
15533d711062A3625945a26760m7108893F390160P065554E901198b2891544b403605
15524A0922047K921555a061749H860562E46845b1102119A4357471f267308A942146
$$ plain form
15585 -19833273 12085953 14250498 12016551 -29039773 -25227031 53651116 -43082102
15577 -1239089 -4438625 4923597 -10936999 8129213 -17518569 -32433568 -29680386 -14002512
15568 -11062860 33870244 -487132 -37876512 -29156560 15888673 -18057436 3058315 33636
15559 27202261 42488990 34746068 -246041 -49616722 -7216831 31706684 -23930015 46271806
15550 -12043212 -22925830 -16553800 -15636014 47714876 4061756 -1264280 -12639337 -7505814
15542 -7505814 -905895 -11868739 3658280 -20473699 -1044669 39012064 -7837507 15250888
15533 -4711062 13625945 -126760 -47235653 6390160 13455714 5901198 -22891544 -2403605
15524 10922047 13843602 -1061749 8860562 546845 -21102119 14357471 -6267308 1942146
15515a1770251p47549B056155b1054042B4092444h14369m5261244J814668f345197
15506b9311218A1903256K1392083j0408251l034374a5311523E0201405k1641238
15499B8560167a1039994B7491936d706551B2356785a3707048B6293060a8928915
15491h036583m761489J781516b511271k0222373j9442878a9370956A1748178g801498
15482F037909L0214718A4077625a6104030N929073B831545a6486758f58162p997914
15474h656076j0084914C220964J8491711a9568867B8965546c106063k3368217
15467b6474280o2417c854644l6497884F845296b2043253k027993i920441H549466
15458B9155946a1278294k9412781C2285333j1494212C211946c1983325A946111
$$ plain form
15515 -11770251 -12517800 2056155 -21054042 24092444 -814369 -46075613 -44260945 -6345197
15506 -29311218 11903256 33295339 22887088 19852714 -15311523 50201405 28560167
15499 28560167 -11039994 27491936 -4706551 22356785 -13707048 26293060 -18928915
15491 -8036583 -12798072 -11016556 -2511271 -22733644 -42176522 -19370956 11748178 -7801498
15482 6037909 36252627 14077625 -16104030 -10174957 2831545 -16486758 -658162 -8656076
15474 -8656076 -18740990 3220964 21712675 -19568867 28965546 -3106063 -26474280
15467 -26474280 -26536697 -3854644 -40352528 6845296 -22043253 -24071246 -9920441 8549466
15458 29155946 -11278294 -40691075 32285333 20791121 3211946 -31983325 1946111
15450b369123j414455A2966304h78095l5043063A6993456C415205b3460037A7808749
15441a9928376B6273584Q79850d2136309a0456723K47803c634984G644695g081192
15432A0480275J0928117L891396c4337716A2898332a2829058j0758105C8714287
15424a3440656H359065a6560896O945314j4964217p428780h970331A910782J3561764
15416A5472546g561600G485342b61047k5769698b044614j9222192A1848674d9744259
15407a4220896r824829B6145890C344884J6345597f10705C9583847c6860016A4918741
15398B9055552A3896368K0743399a3918541C5351983A4358068L359499k576125
15391A5141442A822740f032315a695527C1392366b2874927A4472557L4298489
$$ plain form
15450 -2369123 -3783578 12966304 -878095 -35921158 16993456 3415205 -23460037 17808749
15441 -19928376 26273584 27153434 -42136309 -10456723 -10208920 -3634984 7644695 -7081192
15432 10480275 21408392 25299788 -34337716 12898332 -12829058 -23587163 38714287
15424 -13440656 8359065 -16560896 -9615582 -24579799 -32008579 -8970331 1910782 15472546
15416 15472546 -7561600 7485342 -261047 -26030745 -2044614 -21266806 11848674 -49744259
15407 -14220896 -24045725 26145890 3344884 19690481 -610705 39583847 -36860016 14918741
15398 29055552 13896368 34639767 -13918541 35351983 14358068 17717567 15141442
15391 15141442 1822740 -6032315 -1695527 31392366 -22874927 14472557 48771046
15384D8771046C102200c1080651j5790650E036738b576791B8820427h031374D04179
15375b7807190h501014A9259793a2133640j2839704j3879116c477530C150405
15367B0381311L5711805a3911276j0524583D0213701e829829A7052396C475149
15359a642918G155803C490806b4175329H550820f981803B3726460b2139918C6301857
15350B4018953a7418976G942865b8459682j5249150B4440768a2259545I641972
15342I943290J5737944k391269j1296735b7340613g026473l334664j6797812C5664770
15333A020513L01802h412633L840061k2332069A3242196i480948C555977O032172
15325I588149B599800J233050K2961502g634531j339007j2278930B358258b3925990
$$ plain form
15384 48771046 3102200 -31080651 -46871301 5036738 -2576791 28820427 -8031374 404179
15375 -27807190 -8501014 19259793 -12133640 -24973344 -38852460 -3477530 3150405
15367 20381311 56093116 -13911276 -24435859 40213701 -5829829 17052396 3475149
15359 -1642918 7155803 3490806 -24175329 8550820 -6981803 23726460 -22139918 36301857
15350 24018953 -17418976 7942865 -28459682 -43708832 24440768 -12259545 9641972
15342 9943290 25681234 23289965 11993230 -27340613 -7026473 -10361137 -27158949 35664770
15333 1020513 1322315 -8412633 -4572572 -26904641 13242196 -9480948 3555977 9588149
15325 9588149 2599800 3832850 26794352 -7634531 -8973538 -21252468 2358258 -23925990
15316B5798954f192567D635723e72370B8616290A511699N5283336G4451M5242435
15308D5316886A9592471e5406320a4885718K356565I959657c313699k0035972
15301b3349671A4564988b936903B3382064b5184789g260630m1902959B1818714
15293A1939483J0177562Q497449B450352a4242658A8382710o605138e0251440
15285b4685431M538178k382964I165687C296309a8747424E942148L2744259c1763584
15276i451727A5830723K080306f2508762B0609913e496210j2657154H655633a2691898
15267b0618265m883528A3558837J1851331j851868J68399B901994d4195224C9334996
15258B9440132h83148E901534L9246271b1536839A3934568b1001465A2311495
$$ plain form
15316 25798954 -6192567 4635723 -572370 28616290 1511699 56795035 74451 45316886
15308 45316886 19592471 -55406320 -14885718 -12529153 9959657 -3313699 -23349671
15301 -23349671 14564988 -2936903 23382064 -25184789 -7260630 -49163589 21818714
15293 11939483 22117045 30614494 2450352 -14242658 18382710 11777572 -50251440
15285 -24685431 -20147253 -22530217 9165687 3296309 -18747424 5942148 38686407 -31763584
15276 -9451727 15830723 17911029 -62508762 20609913 -5496210 -18153364 8655633 -12691898
15267 -20618265 -25501793 13558837 25410168 23558300 23726699 2901994 -44195224 39334996
15258 29440132 -883148 5901534 45147805 -21536839 13934568 -21001465 12311495
15250c8849893b287431B1462386a1602160j6634906A6679138J7752330i65386
15242e311865C7711038a3932667G895484c5238457l154721A1440737d3744884
15234C13967J0670234M249300B405386N696233a7406j4034034C7556142d761180
15225G346544K4824270b2176520A5488962a3330243A1852227B623984b0379409
15217a742025k1115144A4545749a7524557k3680339D909699J608656A505143N133172
15209F638315b5234797E956267a4520809p91549B312930e959923d64640l7406161
15201c7870801B8938752A277696J0497547A376274b7289614C450476a1719819
15193f093556r167866O537217D2184820H627764a4116693C078529b9094688Q323751
$$ plain form
15250 -38849893 -2287431 21462386 -11602160 -28237066 16679138 34431468 -965386
15242 -5311865 37711038 -13932667 7895484 -35238457 -38393178 11440737 -43744884
15234 313967 10984201 15233501 2405386 8101619 -17406 -14051440 37556142 -4761180
15225 7346544 32170814 -22176520 15488962 -13330243 11852227 2623984 -20379409
15217 -1742025 -22857169 14545749 -17524557 -41204896 4909699 6518355 1505143 6638315
15209 6638315 -25234797 5956267 -14520809 -15312358 2312930 -5959923 -464640 -37870801
15201 -37870801 28938752 1277696 11775243 1376274 -27289614 3450476 -11719819
15193 -6093556 -15261422 -8724205 42184820 8627764 -14116693 3078529 -29094688 -20770937
15185b0770937j6616833B0236078n492509o940916a8760033A9434894J6377356
15178C5812250f199235j6101265B0461731c1213814A4130169c3033852m4276941
15171g7310793b8602554a550063m74506A1807643N213586b5529462J0981025j0511190
15163b5059627O279354B1057851a6141054l2699064A8306389E407102a1771258
15155A9456385b931438D530876b767708C1519288b1093814A4799724a650000q824505
15147a0474505B5995123M092530b4462805B6691628c3626627A2653890D230246
15139B317373a4740887C2236351c33083C4966550G124475a127491j3457405B1886862
15130F133224J0721742P07981p891597a8852208F509999a413455B748977K9441248
$$ plain form
15185 -20770937 -37387770 20236078 14743569 7802653 -18760033 19434894 35812250
15178 35812250 -6199235 -22300500 20461731 -31213814 14130169 -33033852 -77310793
15171 -77310793 -28602554 -1550063 -2024569 11807643 17021229 -25529462 -14548437 -25059627
15163 -25059627 -18780273 21057851 -16141054 -48840118 18306389 5407102 -11771258
15155 19456385 -2931438 4530876 -2767708 31519288 -21093814 14799724 -1650000 -10474505
15147 -10474505 25995123 30087653 -24462805 26691628 -33626627 12653890 4230246
15139 2317373 -14740887 32236351 -333083 34966550 7124475 -1127491 -14584896 21886862
15130 6133224 16854966 17562947 9671350 -18852208 6509999 -1413455 2748977 32190225
15122C2190225G81806c4807111A2873538h423036A275654e3823545a679643G079081
15113a6647893A3392366F104047J881315c6673981D4918254j1847631j0964081
15106B2106542n113365J8986322j1074341h606228E602526g059426B841574b6340149
15097a1858712B3399623f187066j1319255a315351B0907653r811968b4443703
15089e918596A2030803c1329153P11617A6174029O24707o963491j036334c0037993
15080C4681696Q615678a6412004c185741n942659B0536610b732491H468727a3772313
15071i782021M692096m283639j2039676I407966d2768986J0046223b75312j0825544
15063a1100856D92808a3096768E37276J7443033K2609281a1909211l1515636A6659164
$$ plain form
15122 32190225 781806 -34807111 12873538 -8423036 1275654 -53823545 -1679643 7079081
15113 -16647893 13392366 6104047 7985362 -36673981 44918254 33070623 22106542
15106 22106542 16993177 35979499 24905158 -8606228 5602526 -7059426 2841574 -26340149
15097 -11858712 23399623 -6187066 -17506321 -1315351 20907653 11095685 -24443703
15089 -5918596 12030803 -31329153 -30617536 16174029 16798736 9835245 8798911 -30037993
15080 34681696 43297374 -16412004 -3185741 -9128400 20536610 -2732491 8468727 -13772313
15071 -9782021 -5089925 -9373564 -21413240 9407966 -42768986 -32722763 -275312 -11100856
15063 -11100856 492808 -13096768 537276 17980309 40589590 -11909211 -43424847 16659164
15054g394515l1619751C2499950K7634567d3436241E50759c758968C0958975a673975
15045C8785842b769658q606666C0993112A2552612L1781480j3235511H628211
15037B5294142I772594a3537915E0478465c6766148a7676644M301125D2817759
15029A8394803b3345494m9413773A7046895l982442c8592428A3137756c8844463
15021C2049435r153022D795806A291492L523267J8092767e262283B288510c5376048
15012C1391101d8822411B6887783B743339A371153N521063d285795D4860838j6775533
15004B8085305D819540a9278640a668813A4960519b195780l0602442C3519440
14996E105097a4268785O570964K511682A0119868L006889k911452b1571105O075917
$$ plain form
15054 -7394515 -39014266 32499950 60134517 -43436241 550759 -3758968 30958975 -1673975
15045 38785842 -2769658 -11376324 30993112 12552612 44334092 31098581 8628211
15037 25294142 9772594 -13537915 50478465 -36766148 -17676644 -13375519 42817759
15029 18394803 -23345494 -72759267 17046895 13064453 -38592428 13137756 -38844463
15021 32049435 22896413 4795806 1291492 4814759 22907526 -5262283 2288510 -35376048
15012 31391101 -48822411 26887783 2743339 1371153 6892216 -4285795 44860838 28085305
15004 28085305 4819540 -19278640 -1668813 14960519 -2195780 -32798222 33519440
14996 5105097 -14268785 -7697821 -5186139 10119868 13126757 10215305 -21571105 -15495188
14988a5495188d696452e95286C6757839a7485178j930694b857727j414469q097437
14980a2369633N224322C2527113n044368P131400b865116j4993351G10251J9800227
14972B0510478b4653037A7453806c795658j9730551B966826M5534496F239784
14964a8985114B1935247c3347851J2255962k5038248a2911683A0237789a2849477
14956B5852671a4506940m995410O855646A1865677a7611464O439972k3608305
14949c4779797J4113263j2525248J2899216n81136m593167i641329A2933189b7078939
14940A9467565a2657172C9071363e914344J516699E496355R729081d6315118J8012996
14932b8302122A6696360J7651255a477555H009923c2032476A0316466L461716
$$ plain form
14988 -15495188 -4696452 -595286 36757839 -17485178 -19415872 -2857727 -4272196 -12369633
14980 -12369633 -7145311 32527113 27482745 34614145 -2865116 -17858467 710251 20510478
14972 20510478 -24653037 17453806 -3795658 -23526209 2966826 48501322 6239784
14964 -18985114 21935247 -33347851 -21091889 -46130137 -12911683 10237789 -12849477
14956 25852671 -14506940 -19502350 -12646704 11865677 -17611464 -11171492 -34779797
14949 -34779797 -20666534 -33191782 -20292566 -20873702 -25466869 -9641329 12933189 -27078939
14940 19467565 -12657172 39071363 -5914344 -4397645 5496355 15225436 -46315118 -28302122
14932 -28302122 16696360 34347615 -1477555 8009923 -32032476 10316466 13778182
14925A3778182L6336624j7736238b099485o447223A9847751L1136669H372198
14917B0798571k336180K756025G278256N703195h975965m3428866M150073a6045579
14908b6320141a717707j0856131O134225k2099205d653073b263140j3279008E570329
14899d3026792A2889662d829306k911137A16664M3773549j7929051p897172a1593592
14890c3238564i103280D9474917k3933891G168293b995343C158890d7106602N221641
14882d1884961J6177930A8295619G307126O74182a8675639o609008j873597A0401919
14873h968567c67253l2756112q250355A8402977P30385J4762907q332925c4211724
14864b3700402A8760555b1341970d27679A8066821a6447875I757593K331851J8016820
$$ plain form
14925 13778182 50114806 32378568 -2099485 -8546708 19847751 50984420 8372198
14917 20798571 18462391 21218416 7278256 12981451 -8975965 -52404831 -48254758 -16045579
14908 -26320141 -1717707 -12573838 -6439613 -28538818 -4653073 -2263140 -15542148 5570329
14899 -43026792 12889662 -4829306 -7740443 116664 43890213 25961162 18063990 -11593592
14890 -33238564 -9103280 49474917 25541026 7168293 -2995343 3158890 -47106602 -41884961
14882 -41884961 -25707031 18295619 7307126 7981308 -18675639 -25284647 -27158244 10401919
14873 -8968567 -367253 -33123365 -41373720 18402977 19133362 33896269 25563344 -34211724
14864 -23700402 18760555 -21341970 -427679 18066821 -16447875 9757593 12089444 30106264
14856C0106264d746482k250966D2383175a0895008A0818678b9262358B9980484
14848d717430C321998J0938034g891415l7218119a3300284E252094J6088220d2586897
14839a9163837H314379k226411J1965562J1513972J7449308h185775B2215853
14831A0807727e5854901C893239d533280r054627k4849497A807424d9262326a8575894
14822B5793559j1088022E816098L0910383o082963e402432H918589R244237a4165129
14813E026872a571459A3368447c136612A8717295a9557586C5070428c1225461
14805i427746H0630a8386324K476876b039761j3086972E125461c0592518C074284
14796b0913698A1111420g40683m6315816N386189D93461a7183702L099034r240635
$$ plain form
14856 30106264 -4746482 -6997448 42383175 -10895008 10818678 -29262358 29980484
14848 -4717430 3321998 14260032 -7891415 -45109534 -13300284 5252094 21340314 -42586897
14839 -19163837 8314379 6087968 18053530 29567502 47016810 -8185775 22215853
14831 10807727 -55854901 3893239 -4533280 -13587907 -38437404 1807424 -49262326 -18575894
14822 25793559 14705537 5816098 36726481 30643518 -5402432 8918589 18162826 -14165129
14813 5026872 -1571459 13368447 -3136612 18717295 -19557586 35070428 -31225461
14805 -9427746 80630 -18386324 -15909448 -2039761 -15126733 5125461 -30592518 3074284
14796 -20913698 11111420 -740683 -47056499 -41670310 493461 -17183702 -14084668 -23325303
14788b3325303l303464E3355155b8484124o256120J658890g892032B0761041K465063
14780B3226104f747326B5114864J8878615j8360649h63258B745801e033408C5665987
14771a8482556A2992102L5236915b3790199e437816B5723141c1042625a3834544
14763a7137907l156636C0508880c254643l8316608k522779B766120N7795292a0232807
14754D2657681j1647799j3738081a2843084K624460k3266085B6100596a4586668
14746c4286103A3312943K0022376h1912k0831896a0330125E89470N505738J0991201
14738A7086409a2428067N05274A0781363C619896K0020012j816225O39297I216976
14729a5052796A0109167b237440j3831893g695014l4107481B3750984L917150
$$ plain form
14788 -23325303 -26628767 53355155 -28484124 -34740244 -33081354 -7892032 20761041 23226104
14780 23226104 -6747326 25114864 43993479 25632830 -863258 2745801 -5033408 35665987
14771 -18482556 12992102 48229017 -23790199 -5437816 25723141 -31042625 -13834544
14763 -17137907 -20294543 30508880 -3254643 -41571251 -44094030 2766120 60561412 -10232807
14754 42657681 31009882 17271801 -12843084 -10218624 -33484709 26100596 -14586668
14746 -34286103 13312943 33335319 -81912 -20913808 -10330125 589470 6095208 17086409
14738 17086409 -12428067 -11922793 10781363 3619896 23639908 21823683 22462980 9216976
14729 -15052796 10109167 -2237440 -16069333 -7695014 -41802495 23750984 27668134
14722B7668134q590465P815757l148788A120526N04038c4622334A0360045M4017569
14714E4377614b0390074A4239355c896658q166307C2883950c3000582l477564
14707c6478146a2490637B623122a9572007G05685a1680928a902202O13578B1546620
14698a8251933c935399k3538094G041186k342156b772788m285355C8435825A8100362
14689d2996604B7371802i56071j5053876K635831H930017b1346441d230111l848281
14681h078392k2481798g092074J843482j4989452R233659A8925506a3952229j6637597
14673c0589826f001029E804a8534756k9180270A7530411a9538757c323911D4541491
14664c3123672D023225f1162906A1170666h989321l449146k4272717H346423a6787001
$$ plain form
14722 27668134 19077669 26893426 23744638 1120526 1624564 -34622334 10360045 54377614
14714 54377614 -20390074 14239355 -3896658 -12062965 32883950 -33000582 -36478146
14707 -36478146 -12490637 2623122 -19572007 705685 -11680928 -1902202 -1288624 21546620
14698 -18251933 -3935399 -27473493 7041186 4699030 -2772788 -7058143 38435825 18100362
14689 -42996604 27371802 -956071 -16009947 -13374116 8930017 -21346441 -4230111 -8078392
14681 -8078392 -30560190 -7092074 -5248592 -20238044 -11004385 18925506 -13952229 -30589826
14673 -30589826 -6001029 5804 -18534756 -47715026 17530411 -19538757 -3323911 44541491
14664 -33123672 4023225 -61162906 11170666 -8989321 -12438467 -36711184 8346423 -16787001
14655a9068187A4490869C276061j542243c9264186J9541414G3955c8284398D621996
14646A7973827d278022A38805L425510a4862973n207395M424092I152124l293038
14638E859086a9030595k719090M093978D8823327e230986j910855I462220C503951
14629g610299A4869548b6939493A4258593l328458L418987c9669306B0093990
14621I68592M62419i235524A0492032J3347554M1348589h018727B5892270b5110287
14612c1733426M628892q031793G94477b4628606A2059622i516846K93086G940626
14603b6396659q705974a4455239A0758238a7052783F012038a9015308f969187
14595I470759K4250736n174492b7618709C2025707L643598c2573614A4266236
$$ plain form
14655 -19068187 14490869 3276061 1733818 -39264186 -19722772 73955 -38284398 4621996
14646 17973827 -4278022 138805 3564315 -14862973 -20070368 -15646276 9152124 5859086
14638 5859086 -19030595 -21749685 -17655707 48823327 -5230986 -7141841 9462220 3503951
14629 -7610299 14869548 -26939493 14258593 10930135 14349122 -39669306 20093990
14621 968592 1431011 -9235524 10492032 23839586 65188175 -8018727 25892270 -25110287
14612 -31733426 -27104534 -35136327 794477 -24628606 12059622 -9516846 -9223760 7940626
14603 -26396659 -35102633 -14455239 10758238 -17052783 6012038 -19015308 -6969187
14595 9470759 33721495 28547003 -27618709 32025707 35669305 -32573614 14266236
14587C382167K0472143c6797766B3262615d9283957B3734808j953643G098049
14579F800064K404204c1817854E453332J4046757J9856309j8647595b0824354
14571c8684710J8498123D434042a2003424m405252a841675j6672977B2465866
14563a0854427j980164A261356b6324526B7464367a5935151k388745H204257A750018
14554B7596753i31535j1234687O007088B5808994B769836b9868006a635803A7718380
14545c1361115B9301793p004866o765536E814765K6066480J3678138a4301749
14537A4298900d887562j0986281C404657d4028569A5862591K0086250b3539587
14529A4197175p52236d407770C4866349B540503P382468K6993157i508978C2161565
$$ plain form
14587 3382167 23854310 -36797766 23262615 -49283957 23734808 21781165 7098049
14579 6800064 9204268 -31817854 5453332 19500089 39356398 20708803 -20824354
14571 -38684710 -20186587 4434042 -12003424 -16408676 -1841675 -18514652 22465866
14563 -10854427 -12834591 1261356 -26324526 27464367 -15935151 -18323896 8204257 1750018
14554 27596753 -931535 -12166222 -6159134 25808994 2769836 -29868006 -1635803 17718380
14545 -31361115 29301793 22296927 15531391 5814765 31881245 45559383 -14301749
14537 14298900 -4887562 -15873843 3404657 -44028569 15862591 35948841 -23539587
14529 14197175 13444939 -4407770 34866349 2540503 9922971 36916128 -9508978 32161565
14520a5804601I207568K0632431c541852k6692269a1145298o59844j7326593R558114
14512a9573621h815564j115871C5706641J4956917A4457069J0361144D503367
14504b933633B4569157a0074734C4858799b9349077g075485B0559987I043028
14496B0309945b5037656B0864438C901984a4030009a523598j7858019H195473
14488a2034223k8354965g469157E384340b0955483H142446a1677274k1664064
14481c3341338f755554n636457B581129N788064F01972J4607698b478663A6021220
14472C035809b5865930L989924j1815253B0247257c9310539A4232499f769131
14464A9044980n231448b7556548J1945058n993244k6928637H7384432l4755081
$$ plain form
14520 -15804601 9207568 29839999 -3541852 -30234121 -11145298 -11805142 -29131735 -19573621
14512 -19573621 -8815564 -9931435 35706641 50663558 14457069 24818213 4503367
14504 -2933633 24569157 -10074734 34858799 -29349077 -7075485 20559987 9043028
14496 20309945 -25037656 20864438 3901984 -14030009 -1523598 -19381617 8195473
14488 -12034223 -40389188 -7469157 5384340 -20955483 8142446 -11677274 -33341338
14481 -33341338 -6755554 -12392011 2581129 8369193 601972 15209670 -2478663 16021220
14472 3035809 -25865930 -21876006 -33691259 20247257 -39310539 14232499 -6769131
14464 19044980 13813532 -27556548 -15611490 -21604734 -48533371 87384432 52629351
14457E2629351i704156b682256C6519202b6468362c007100l0816220A3774456
14449d2822914e549246j0757422P247309K259226I018230a4319985A6964595a9432367
14440a350624G480811a4756667d791947A3416716k669610i126271b55001m7299185
14432d7554186f150536j1906383B2818574h855560A0928085a205543l7036754
14425c8242297c662891k5507622J0108683E850946e097670j438604K795941k1074853
14417b4815186j6739064B7440168o974023o919122a2677517D5843381g953609
14409A1609085j494487p04701c6404968D056455K7181183q486981F827036a4722666
14400b6250262C2911875L7617640C623263J7807442e7270036c588636k2879003
$$ plain form
14457 52629351 -9704156 -2682256 36519202 -26468362 -3007100 -33823320 13774456
14449 -42822914 -5549246 -16306668 -9059359 -6800133 9018230 -14319985 16964595 -19432367
14440 -1350624 7480811 -14756667 -4791947 13416716 10747106 -9126271 -255001 -47554186
14432 -47554186 -6150536 -18056919 22818574 -8855560 10928085 -1205543 -38242297
14425 -38242297 -3662891 -29170513 -19061830 5850946 -5097670 -6536274 -3740333 -24815186
14417 -24815186 -41554250 27440168 20466145 13547023 -12677517 45843381 -7953609
14409 11609085 10114598 9409897 -36404968 4056455 31237638 22750657 6827036 -14722666
14400 -26250262 32911875 70529515 3623263 21430705 -57270036 -3588636 -26467639
14393b6467639C9043425a3668035D4677977b1810934E762151d293718k7505444
14386c1799162D0268877l659398b1244080L563786P724895G933210K7565603e4530095
14377g614542k9284887Q674826k1252627E097687J1337242a2720331C573997P208052
14369A0782049g184456n2133403D1327813a3747011l3118642J5962642i613290
14361A6576911f105357K668615G991199a5194340j2949824k0447362D363071b2728190
14352i324421o514253e239429m5620896C077476b749964A5366807J9297420j6971565
14344A7692662A41414a482239B5269562a9921673C6800088b2801107a0485876
14336H016299J0565329b6477107a0506415j2579311i397087B6932418a8376692
$$ plain form
14393 -26467639 39043425 -13668035 44677977 -21810934 5762151 -4293718 -31799162
14386 -31799162 40268877 36609479 -21244080 -17680294 -9955399 7933210 35498813 -54530095
14377 -7614542 -36899429 -28224603 -49477230 5097687 16434929 -12720331 3573997 10782049
14369 10782049 -7184456 -59317859 41327813 -13747011 -46865653 -30903011 -9613290
14361 16576911 -6105357 -3436742 7991199 -15194340 -28144164 -48591526 4363071 -22728190
14352 -9324421 -15838674 -5239429 -50860325 3077476 -2749964 15366807 34664227 17692662
14344 17692662 141414 -1482239 25269562 -19921673 36800088 -22801107 -10485876
14336 8016299 18581628 -26477107 -10506415 -23085726 -9397087 26932418 -18376692
14328B5199334r539692J6810867j4111274K0564115e6024675a6915673A4874614
14320i052855H475730d2332926C591052G50321J0430809g023571l0066052a8082610
14311d6209148a4651487j126087A5958277M729937e953276k2024685j1140884
14304c9118845J9544989K518029j8024030B60714a4847122M308180k7191613B013434
14295b406771n2892938B5789470D991364b3764470k170822D646063d352721k1219767
14287b5572488a2724326k741074A4355073b6365470f075175B567076M830647a017568
14278b6774151A6166361G17774J2897004c1422001J5162489F865994h095112h54032
14269A144530Q554529a3243655E83647b0181584l0021924J5952795Q927379f143900
$$ plain form
14328 25199334 15659642 32470509 18359235 38923350 -56024675 -16915673 14874614
14320 -9052855 8475730 -42332926 3591052 750321 11181130 -7023571 -37089623 -18082610
14311 -46209148 -14651487 -15777574 15958277 20688214 -5953276 -27977961 -39118845
14304 -39118845 -19573856 -17055827 -35079857 260714 -14847122 -10538942 -37730555 2013434
14295 -2406771 -55299709 25789470 4991364 -23764470 -25935292 4646063 -4352721 -25572488
14287 -25572488 -12724326 -15465400 14355073 -26365470 -6075175 2567076 7397723 -1017568
14278 -26774151 16166361 717774 13614778 -31422001 -16259512 6865994 -8095112 -854032
14269 1144530 9699059 -13243655 583647 -20181584 -50203508 -34250713 -25323334 -6143900
14260f637541a538630o0151109A8081423a2915887E196260P931588a3981038J764636
14252a2216402m823004C1028864b5730515l82455B498746K2552571d4721103h528079
14243b8137228J079605b75386o879848B0878640h791452D556063b7051875k1980471
14235d9032346J9266030j5496922b2089068j4066137d77936k2181019n0771643
14228g3430598c0637629j0499043p459429P331554M216602J3509402D9260509
14220G5152644K225160k4554658K1250732C6049266L5380931P3621876N3366302
14213A98418375J2198523Q60431k9390760o956934N4246717Q2627566O8665437
14206C80669355l4599301p0212196k9830946m4656326O4977275M4586177J8786802
$$ plain form
14260 -6637541 -1538630 -61689739 18081423 -12915887 5196260 13127848 -13981038 -12216402
14252 -12216402 -17039406 31028864 -25730515 -26112970 2498746 25051317 -44721103 -8528079
14243 -28137228 -27057623 -275386 -7155234 20878640 -8791452 4556063 -27051875 -49032346
14235 -49032346 -29766316 -45263238 -22089068 -36155205 -477936 -22658955 -73430598
14228 -73430598 -30637629 -41136672 -48596101 -41264547 -37047945 -23538543 49260509
14220 75152644 77377804 52823146 74073878 36049266 71430197 145052073 198418375
14213 198418375 210616898 211477329 182086569 175129635 229376352 312003918 380669355
14206 380669355 346070054 275857858 246026912 201370586 266347861 310934038 329720840
14199C29720840p4698873p3308554J3240798l9655081L9569262j7473594J5890388
14192A93285186j9379588q3011368P118499m2113380j4761153K5151737j9337680
14185D6952253B0538066M2821347j5466910j4724481N153435p856859J5820981
14178D6285579j5162298O155427D049186Q802132F281093L1119022k571849K6584257
14170F1412523A0654085N7585580j9165279H282532R436366J2288778b5508525
14162a7500651O682948k2994288B7550764j1795153b2607415A2167343k539561
14155I627782L5979496J584657j5892392M258136j4007456c428960o761550C1341703
14146A1200316K4807854C927642K5045391J3642072H886507g388736A151004R703737
$$ plain form
14199 329720840 255021967 181713413 194954211 155299130 194868392 177394798 193285186
14192 193285186 173905598 90894230 98012729 55899349 41138196 66289933 46952253
14185 46952253 20538066 63359413 47892503 33168022 38321457 30464598 46285579
14178 46285579 31123281 37278708 4049186 12851318 6281093 37400115 34828266 61412523
14170 61412523 10654085 68239665 49074386 8282532 17718898 30007676 -25508525
14162 -17500651 -10817703 -33811991 27550764 15755611 -22607415 12167343 9627782
14155 9627782 45607278 47191935 31299543 35557679 21550223 -3428960 -10190510 31341703
14146 11200316 36008170 3927642 28973033 42615105 8886507 -7388736 1151004 10854741
14138A0854741J4336817c073804F094489g569817k0713202E820815L5084355E656732
14129a6861619l410567C62940K2844523e738421l01343D0758032c8097106D217336
14120B7970047g90603A2892532J09943f356767A9989041a3210746H011457b7155808
14111D7163693A0750906C944228b0552807C5958527c655974B5709496c0877418
14103A6534702E67379a8637469L632460b680841p191114j9044357B6813237g622826
14094B9350463a5773679h49175A1843802N979675a4756697e967553H405970n84255
14086G821715a8319601k5274518a448847D6730039k1472961J0226978a5811738
14078b606436A7041035o457057m839618J812955L9025604a902108l896860B8802751
$$ plain form
14138 10854741 25191558 -3073804 6094489 -7569817 -28283019 5820815 40905170 5656732
14129 -16861619 -20272186 362940 23207463 -5738421 -6039764 40758032 -38097106 4217336
14120 27970047 -790603 12892532 13002475 -6356767 19989041 -13210746 8011457 -27155808
14111 47163693 10750906 3944228 -20552807 35958527 -3655974 25709496 -30877418
14103 16534702 567379 -18637469 -15005009 -2680841 -9871955 -28916312 26813237 -7622826
14094 29350463 -15773679 -849175 11843802 17823477 -14756697 -5967553 8405970 7821715
14086 7821715 -18319601 -43594119 -1448847 46730039 25257078 35484056 -15811738
14078 -2606436 17041035 10583978 5744360 7557315 46582919 -1902108 -5798968 28802751
14069a2332712F791509K7991825c509514A7664275C987176i926963k084872D3247201
14060F563866a3468092A2461981b9929250I446982l13227Q479327K7625668I640312
14051A0364035b9757042h072934I923142o73947b5589018g684039j03801j3666134
14043b1453974B086506K2307742b9422682H926731J5489501f889665A4114298
14035C4190078j2330066r454816J9658299J6223621E719975g861315A271812K5686278
14027B6958090a0285061r680492I404905b9250649a0884649F068185Q047458a171986
14018D6892494j9862536l923663K0599730d3611661A2960904J9177740M0938937
14011G3077581b1136547B0351493F110648a2508274B7202391b1375134p141844
$$ plain form
14069 -12332712 6791509 34783334 -3509514 17664275 3987176 -9926963 -12011835 43247201
14060 6563866 -13468092 12461981 -29929250 9446982 9133755 17613082 45238750 9640312
14051 10364035 -29757042 -8072934 9923142 9249195 -25589018 -7684039 -7787840 -21453974
14043 -21453974 2086506 24394248 -29422682 8926731 24416232 -6889665 14114298
14035 34190078 21860012 12405196 32063495 48287116 5719975 -7861315 1271812 26958090
14027 26958090 -10285061 -19965553 9404905 -29250649 -10884649 6068185 14115643 -1171986
14018 46892494 27029958 23106295 43706025 -43611661 12960904 32138644 73077581
14011 73077581 -21136547 20351493 6110648 -12508274 27202391 -21375134 -28516978
14004b8516978J2726782A1895354a879049F2316565A8145956M322430K6156271
13997D8624657C192441K7062302A1785486R696360c0896052B3019270m863810
13990A8155460e7700020C0067351B927451J0667658K145075b3853198k3082140
13983d6935338c913468F842134L4751605h351431j1552292B7165045c149335q581036
13975a1730371B6326827b3812886G6099732h421367A5525122M130146a9395610
13967F93000L559916e5145662I723240a2290897A2024429g615021A9506902Q646877
13959B8153779B590854c101582A6538098f184311D46009c3254180c567351j9290808
13951b2858159B0785297g880981A11978M1167408A0851253g977315l945176A9450036
$$ plain form
14004 -28516978 -15790196 11895354 -1879049 62316565 18145956 22468386 48624657
13997 48624657 3192441 30254743 11785486 21481846 -30896052 23019270 18155460
13990 18155460 -57700020 30067351 2927451 13595109 15740184 -23853198 -46935338
13983 -46935338 -3913468 6842134 41593739 -8351431 -19903723 27165045 -3149335 -11730371
13975 -11730371 26326827 -23812886 76099732 -8421367 15525122 19655268 -19395610
13967 693000 4252916 -55145662 9723240 -12290897 12024429 -7615021 19506902 28153779
13959 28153779 2590854 -3101582 16538098 -6184311 446009 -33254180 -3567351 -22858159
13951 -22858159 20785297 -7880981 111978 41279386 10851253 -7977315 -11922491 19450036
13942b489509p771580i78137B1580076g311286J098016j8105684c158954F230306
13933F819446L393919L0785560a6075178A3305405O017730b3954509G961413J2277805
13925B0239218R426425b1784829b666443o0582486d608568B99340d9243619a5723916
13916A8581881a1485254b19455j1331250k6852925D686474a450753A4208634c711156
13907c4834109a6202008B3766728O292742e939124o895984K816901C7060K6970332
13899B7007392b0445198D0315687j2158104j3693100k73708a9868213e775113
13891D9236852a1015896B3666512d0690553A2849327b184035A8087659E558402
13883b3959105G173717a7775669j0349671E786147K2169148c422038E515659b3621513
$$ plain form
13942 -2489509 -10261089 -978137 21580076 -7311286 -6213270 -24318954 -3158954 6230306
13933 6819446 10213365 40998925 -16075178 13305405 19323135 -23954509 7961413 20239218
13925 20239218 29665643 -21784829 -2666443 -63248929 -4608568 299340 -49243619 -15723916
13916 18581881 -11485254 -219455 -11550705 -38403630 4686474 -1450753 14208634 -3711156
13907 -34834109 -16202008 23766728 30059470 -5939124 -12835108 -10018207 37060 27007392
13899 27007392 -20445198 40315687 28157583 14464483 14190775 -19868213 -5775113
13891 49236852 -11015896 23666512 -40690553 12849327 -2184035 18087659 5558402
13883 -23959105 7173717 -17775669 -28125340 5786147 27955295 -3422038 5515659 -23621513
13874D5189437D539447a1912405E0225669A4881385i779862E41264b4253591c997992
13865g193937D436929j298735L657161A408652M5294360d209572k8347583D4385627
13856c571274j0288551A4979338m343241l187208a0468642D0581028F203300h077585
13847b240177B3240207b2949090n582778A2435842d379981l0799202H600667b521038
13838A0622769K8618815G824033P751050Q197653D586553c893433A0695795J1938474
13830B2634269a9755796B6385107a6441443Q134540L035933m890736H260568J6358561
13822B4619129n07692h890330A0581346Q113874J526791Q156894J8790995b5637710
13813H026061R099853G078168a1026210M300343B8720851a7892685D7086237F690133
$$ plain form
13874 45189437 4539447 -11912405 50225669 14881385 -9779862 541264 -24253591 -3997992
13865 -7193937 4436929 3138194 6795355 1408652 46703012 -4209572 -32557155 44385627
13856 -3571274 -13859825 14979338 10636097 7448889 -10468642 40581028 6203300 -8077585
13847 -2240177 23240207 -22949090 -28531868 12435842 -4379981 -35179183 8600667 -2521038
13838 10622769 39241584 7824033 15575083 23772736 4586553 -3893433 10695795 22634269
13830 22634269 -19755796 26385107 -16441443 -8306903 -5270970 -10161706 8260568 24619129
13822 24619129 24111437 -8890330 10581346 18695220 20222011 28378905 47169900 -25637710
13813 8026061 17125914 7078168 -11026210 -6725867 28720851 -17892685 47086237 6690133
13804B6924894i163159E830473J9996838e567059j8702906A4744665K964615c8298613
13795B5714407F763469B928232a3795382A400184b9984858A1480730b2167818
13787c3494143a0385922A7408993l598923c019810l6095838A7195050b5408438
13779E1284074b847802B1405381B801499b5394636o25293A7027190H204727g176243
13770d0949508k2474863C657652A190266a5099455C9423649b6757043a2973905
13762A7398143M425351E006412b2291380O857606m39066A8680896c9400470A6785
13753A2313365H20901b193693B9043529d2765060C3822632i750776J205679B4662028
13744c588532j9162038d611912B5516804j2042201R005593n243381f225807n121965
$$ plain form
13804 26924894 -9163159 5830473 25827311 -5567059 -24269965 14744665 17709280 -38298613
13795 25714407 6763469 2928232 -13795382 1400184 -29984858 11480730 -22167818
13787 -33494143 -10385922 17408993 13810070 -3019810 -39115648 17195050 -25408438
13779 51284074 -2847802 21405381 2801499 -25394636 -26019929 17027190 8204727 -7176243
13770 -40949508 -63424371 3657652 1190266 -15099455 39423649 -26757043 -12973905
13762 17398143 21823494 5006412 -22291380 -15433774 -15872840 18680896 -39400470 16785
13753 12313365 820901 -2193693 29043529 -42765060 33822632 -9750776 -8545097 24662028
13744 -3588532 -22750570 -4611912 25516804 13474603 22480196 17236815 -6225807 -11347772
13736a1347772A5438787O0102711a2265601m551140e701465n0652144e701455
13728B8120704a8489918c699454l322064C4688561g940092a002694B9108103a8525883
13719b5983318G540904c844159l00275A4785318K250380L46287K4018024j8286578
13711B3113431o378470H332383J0271000g179524k7981345D632734b4354718j5073990
13703c9428708J4138812f552978B5349121l010884M107192P946564j4699409J0558562
13695C0251146R530501b1868514D3754062B003660i334679L952620j910999B9666442
13686B5244073a36662j6542310p814345C638319a8003886E273448a8206999F016866
13677f194955a287453H253547L8274819D901503L4606328c0124445A0805510D780547
$$ plain form
13736 -11347772 15438787 75541498 -12265601 -16816741 -5701465 -56353609 -5701455
13728 28120704 -18489918 -3699454 -7021518 34688561 -7940092 -1002694 29108103 -18525883
13719 -25983318 7540904 -3844159 -4144434 14785318 17035698 17381985 41400009 23113431
13711 23113431 16734961 8332383 18603383 -7179524 -35160869 4632734 -24354718 -39428708
13703 -39428708 -25289896 -6552978 25349121 22338237 26445429 34391993 19692584 30251146
13695 30251146 39781647 -21868514 43754062 2003660 -9334679 -5382059 -7293058 29666442
13686 25244073 -136662 -16678972 -24493317 3638319 -18003886 5273448 -18206999 6016866
13677 -6194955 -1287453 8253547 46528366 4901503 39507831 -30124445 10805510 4780547
13668a0962729a332845B4923425a5306075d439686P26556A7353531d1401145A490335
13659h809543B6075453A0632746J4115547Q323400i711387L825259A2858075m428218
13651H429857b1657141m0378623A2496788k197178a1874224a421406A5567648
13643E159980L4026381k544938a9017271B1032163Q57221a2523432j7782102C0041906
13634D5621256H27252O217988J2937016D193591e3183285A8875843a591442C466367
13625e6962351i172254a487947C1729074A781700a3766777E172505C48796L0013661
13617C0362457j2257278c961974k8157404A6152155d695906q753722A8594239
13609H693252J3721913i463701A533921J5748028P788945Q701311B583033L6868564
$$ plain form
13668 -10962729 -1332845 24923425 -15306075 -4439686 -3713130 17353531 -41401145 1490335
13659 -8809543 26075453 10632746 24748293 33071693 -9711387 -5886128 12858075 8429857
13651 8429857 -21657141 -62035764 12496788 10299610 -11874224 -1421406 15567648
13643 5159980 39186361 36641423 -19017271 21032163 21889384 -12523432 -30305534 30041906
13634 45621256 827252 7045240 19982256 4193591 -53183285 18875843 -1591442 3466367
13625 -56962351 -9172254 -1487947 31729074 1781700 -13766777 5172505 348796 30362457
13617 30362457 18105179 -3961974 -32119378 16152155 -4695906 -13449628 18594239
13609 8693252 22415165 -9463701 1533921 17281949 25070894 33772205 2583033 39451597
13601C9451597A0631382J6087318a1592054B2398267b9642299J3587111r39231
13594a6994419A6517749g515017E911522a7298181C1990011c2346719B8398836
13586a7150117j327218A6684J8640596a633685A1600786c8972743C5989508b5452335
13577a6758267A4905683K3369495A2662717l571657l298953K1303559j3046371
13570A4049295b158320C8886434c4454658C3232249n171978a1911918b778999
13562b2129352A8957109q847225a3268350H132082b0774821A0587749N327452
13555A5915201p804714R699718c301676j0553087B5926508a9218145P428475C0441005
13546A8229304c9113276c685810B5877538o637111b7758186D992580a171090B8768852
$$ plain form
13601 39451597 10631382 26718700 -11592054 22398267 -29642299 -16055188 -16994419
13594 -16994419 16517749 -7515017 5911522 -17298181 31990011 -32346719 28398836
13586 -17150117 -18477335 16684 18657280 -1633685 11600786 -38972743 35989508 -25452335
13577 -16758267 14905683 38275178 12662717 9091060 5792107 27095666 14049295
13570 14049295 -2158320 38886434 -34454658 33232249 28060271 -11911918 -2778999
13562 -22129352 18957109 10109884 -13268350 8132082 -20774821 10587749 15915201
13555 15915201 8110487 17810205 -3301676 -13854763 25926508 -19218145 -11789670 30441005
13546 18229304 -39113276 -3685810 25877538 19240427 -27758186 4992580 -1171090 28768852
13537a6832188A2244227L771388B626839L967886a6363825M801479B0640251G029465
13528C5733694a3730789B8465419d537066j0679228E2514207a9683306b050941
13520B82785b8282847A1658676f681175A6764942b9252577E790585j793265a7359888
13511C5701972i719937l090546A6988827b4712987k364330B4752074d230828B6447095
13502B7162053c344121n5116283A0069966a1212200A1974808c8925518j6078A063635
13493f451887j4145624C5689042b2577235P444716B920045Q608538J2080765G862681
13484G490689a9690004e151176j5444494C0305131b2014522C0440253a2316720
13476a6398955N288816E295666L1118776c4073152l2484547B7256334c254480
$$ plain form
13537 -16832188 12244227 16015615 2626839 6594725 -16363825 -11562346 20640251 7029465
13528 35733694 -13730789 28465419 -4537066 -15216294 52514207 -19683306 -2050941
13520 282785 -28282847 11658676 -6681175 16764942 -29252577 5790585 3997320 -17359888
13511 35701972 -9719937 -12810483 16988827 -24712987 -27077317 24752074 -4230828 26447095
13502 27162053 -3344121 -58460404 10069966 -11212200 11974808 -38925518 -38941596 1063635
13493 -6451887 -20597511 35689042 -22577235 -15132519 2920045 11528583 23609348 7862681
13484 7490689 -19690004 -5151176 -20595670 30305131 -22014522 30440253 -12316720
13476 -16398955 -11110139 5295666 36414442 -34073152 -66557699 27256334 -3254480
13468g822819G714901b2863174B973570a8321983a310355E8928070b5680861g730131
13459D6788517q834831I717397a654282C891258L2704102c8536847a4695224E467420
13450i537385m0828861A4019249K2371962b953423l9952085g561164j0439713
13443a8000877A0799927c0019002b58263I371303J6070270b2534520c08935j0807982
13435a1116917j0260763P627282l1951423A9700751j906316b3920926a0792939
13427b2414211I62231J7092719B617808c8345006B6876874j2295690g920062l3352758
13419d1272820j800863B2021117C132394c084528A4575603C959162a8298110A6143180
13410A9349959q478139K0577392b1931111A8694035A505065a4872017m313177
$$ plain form
13468 -7822819 7714901 -22863174 2973570 -18321983 -1310355 58928070 -25680861 -7730131
13459 46788517 37953686 9717397 -1654282 3891258 36595360 -38536847 -14695224 5467420
13450 -9537385 -50366246 14019249 36391211 -2953423 -42905508 -7561164 -18000877
13443 -18000877 10799927 -30019002 -258263 9371303 25441573 -22534520 -308935 -11116917
13435 -11116917 -21377680 -13750398 -45701821 19700751 17794435 -23920926 -10792939
13427 -22414211 962231 18054950 2617808 -38345006 26876874 14581184 -7920062 -41272820
13419 -41272820 -43073683 22021117 3132394 -3084528 14575603 3959162 -18298110 16143180
13410 19349959 10871820 31449212 -21931111 18694035 1505065 -14872017 -19185194
13403a9185194A4273577a972095A894627c3985608h373635j2235504J555009D1022053
13394c491106B2164297J2923660a0056361A6441804D230321O280342D713324g629232
13385d3655366B4666523F526050c2979785D8271239j5259504j5521622D880156
13377E1918372F267601J758894b094588B2195871G180624a9395486F855143L444327
13369A0299470b8111103C1153872e1190819K0151190F8238254a548831l943919
13362e492750H598274L680448b2232549h016186j0747713F341b3269525B1126633
13353A2852376b8388294B345292b1083357A5795188C15772b8056742c976309o893442
13345a0869751D6664809j1756434a0482641k9395037J849020A2164563c5017514
$$ plain form
13403 -19185194 14273577 -1972095 1894627 -33985608 -8373635 -20609139 -19054130 41022053
13394 -3491106 22164297 35087957 -10056361 16441804 4230321 10510663 4713324 -7629232
13385 -43655366 24666523 6526050 -32979785 48271239 33011735 17490113 4880156
13377 51918372 6267601 8026495 -2094588 22195871 7180624 -19395486 6855143 10299470
13369 10299470 -28111103 31153872 -51190819 -31039629 68238254 -1548831 -5492750
13362 -5492750 8598274 12278722 -22232549 -8016186 -18763899 6341 -23269525 21126633
13353 12852376 -28388294 2345292 -21083357 15795188 315772 -28056742 -3976309 -10869751
13345 -10869751 46664809 34908375 -10482641 -39877678 -38028658 12164563 -35017514
13337A0628440P617994d734576b059594j0140448B028834J2288469b4479742f978602
13328B7721940H507618a2389867l0858620c537099D6840261f51920j6954192k324579
13320a9930691k9492904g758834m932606G013558a2728621A374385J5193273E985060
13311b552273C1935613l101631d0329540B2070224H849059e047193D781264B096402
13302B3123450C516550b1250476p240586C1368102c139851A7917758J83359k790476
13294A5310641Q40943a540063A5719222k936810m525525l849857L1230564B618549
13285I328165P605888c00949m859336B6462939b1796928C0777707D725958c676953
13276C6853609d560978E176080J8158379f119235b918153D6523511b801244B3125469
$$ plain form
13337 10628440 18246434 -4734576 -2059594 -12200042 2028834 14317303 -24479742 -6978602
13328 27721940 8507618 -12389867 -43248487 -3537099 46840261 -651920 -17606112 -19930691
13320 -19930691 -49423595 -7758834 -12691440 7013558 -12728621 1374385 16567658 5985060
13311 -2552273 31935613 28833982 -40329540 22070224 8849059 -5047193 4781264 2096402
13302 23123450 3516550 -21250476 -28491062 31368102 -3139851 17917758 18101117 15310641
13294 15310641 16151584 -1540063 15719222 12782412 8256887 4407030 35637594 2618549
13285 9328165 16934053 -300949 -5160285 26462939 -21796928 30777707 4725958 -3676953
13276 36853609 -4560978 5176080 23334459 -6119235 -2918153 46523511 -2801244 23125469
13267E786594a3800753m223929E246250P686543a1630697C265524b7825280A2435987
13258c2961772a1433510H145157f027943B7771141b046159q485527C2156028h142915
13249f438334A2590155j658259M3674248k7076033p035749a0841857A4947681
13241b2167257A3854042J9847259A2498914a491820k6723031O837413E403648
13233d4688114E734201a0226518I201176K721596i581292j2814667A8144590d6578661
13224e1519923b5421106E655995J240663Q011257O282081c5114753D5735475B0505004
13215D0326109d2791183B2601317a1546319B1884625H263850K318398A591914
13207A168815f127519B8771174d1682105A7216878m071602a0945008A9310222
$$ plain form
13267 5786594 -13800753 -18024682 5246250 12932793 -11630697 3265524 -27825280 12435987
13258 -32961772 -11433510 8145157 -6027943 27771141 -2046159 -10531686 32156028 -8142915
13249 -6438334 12590155 10931896 54606144 27530111 20494362 -10841857 14947681
13241 -22167257 13854042 33701301 12498914 -1491820 -28214851 -21377438 5403648
13233 -44688114 5734201 -10226518 9201176 11922772 -9581292 -22395959 18144590 -46578661
13224 -51519923 -25421106 5655995 6896658 14907915 21189996 -35114753 45735475 20505004
13215 40326109 -42791183 22601317 -11546319 21884625 8263850 10582248 1591914
13207 1168815 -6127519 28771174 -41682105 17216878 13145276 -10945008 19310222
13199a6340220A9561084a1187879A9707769Q258805a4564505B0555592b95864
13191E147144c0359745a0186855I33621Q162079J5767165a7871814b7184q041067
13183h068251A9123672L7421020d310870p02601A0917278Q205193K441887a5010990
13174a7074770O889873B0796528p180783M0676271b1631338A1772825D14220J408404
13166A822624J9497200n145501A312818L199840K18159L450856b2341191Q551302
13158a3789889k5232953j5390875K6994497C838169o22849M170488K8318851C573167
13149C3136058A323942d114733k399028D333510O1713480b3260358D3187499c5224370
13140B848948J260382a0111154m5824256a8224393e467287a026811B2793449e3200490
$$ plain form
13199 -16340220 19561084 -11187879 19707769 27966574 -14564505 20555592 -295864
13191 5147144 -30359745 -10186855 933621 9095700 24862865 -17871814 -27184 -8068251
13183 -8068251 19123672 56544692 -4310870 -5013471 10917278 19122471 21564358 -15010990
13174 -17074770 -10184897 20796528 13615745 54292016 -21631338 11772825 414220 1822624
13166 1822624 21319824 16174323 1312818 4512658 4730817 8181673 -22341191 -13789889
13158 -13789889 -39022842 -54413717 -27419220 3838169 3215320 7385808 35704659 3573167
13149 33136058 1323942 -4114733 -6513761 4333510 66046990 -23260358 43187499 -35224370
13140 2848948 4109330 -10111154 -55935410 -18224393 -5467287 -1026811 22793449 -53200490
13131B5144588J3968224f0788139K6798300C8753177c0810878D74369c7415883
13123g547890F576780d4757728B994815L6079130D193265a4604658B0884489m329275
13115A6555214m215470Q345577a7746598g190643q991093l2591918C1275910f289836
13106a1037524B9665366h781534B3590879d529831j1219660E0011387i393303
13098C1694897b4577870I840497d0953221a705494o927914L237664q011453E5141867
13089A9400750J7213595j5291344r185925L9769219d433215k6676353A4706569
13081c1820043a1025682L830576j1820413h55642D4984439g0800A6201394J1186572
13073B7387966b5383691B499797K6562747d0238828l628043B1875610B353388
$$ plain form
13131 25144588 39112812 -60788139 -33989839 38753177 -30810878 474369 -37415883
13123 -7547890 6576780 -44757728 2994815 39073945 4193265 -14604658 20884489 16555214
13115 16555214 12339744 20685321 -17746598 -7190643 -16181736 -48773654 31275910 -6289836
13106 -11037524 29665366 -8781534 23590879 -4529831 -15749491 50011387 -9393303
13098 31694897 -24577870 9840497 -40953221 -1705494 -8633408 -5395744 -13407197 55141867
13089 19400750 36614345 21323001 12137076 51906295 -4433215 -31109568 14706569
13081 -31820043 -11025682 -7195106 -19015519 -855642 44984439 -70800 16201394 27387966
13073 27387966 -25383691 2499797 29062544 -40238828 -43866871 21875610 2353388
13065B832467J6352090a9075458Q385349B7699029j0617414m016277J6269086
13058B9334424a0574563E0238985a0210581D1744316a7360679C0406718a5161550
13050e825833B0195380f505659j291941l5406876p448692g830222A6773930g23790
13041A8858211F715375c4235099b729286k562557b361020k244997A4122118d5363277
13032D0311251a366485C3160750c723911F281643C02299c2529641B2534866a2024555
13023f0172116B919747g53635A1260007J3076079K8314472a6101062F852468K8029808
13015C4882276p419456a7284208F33893K909208P817958c747883D28083J9643080
13007B0071163h546505C0082916a6171544L549616B2223022d9764420i154581
$$ plain form
13065 2832467 19184557 -19075458 -10690109 27699029 17081615 13065338 29334424
13058 29334424 -10574563 50238985 -10210581 41744316 -17360679 30406718 -15161550
13050 -5825833 20195380 -6505659 -7797600 -43204476 -50653168 -7830222 16773930 -723790
13041 18858211 6715375 -34235099 -2729286 -5291843 -2361020 -4606017 14122118 -45363277
13032 40311251 -1366485 33160750 -3723911 6281643 302299 -32529641 22534866 -12024555
13023 -60172116 2919747 -753635 11260007 24336086 52650558 -16101062 6852468 34882276
13015 34882276 27462820 -17284208 633893 3543101 11361059 -3747883 428083 20071163
13007 20071163 -8546505 30082916 -16171544 -12621928 22223022 -49764420 -9154581
12999b2235664G651427b7387513C0725681R271208d151588F866706K7609071j6565009
12991A7910768d3880116a5218941M457682K621227I682853a2168918j1401507
12984b3570425A8032179b5541676a344010A4030102k162529h622973A0729097
12976h487322A5602788K1586936c1955339Q778532C2607449a8562022A3974518
12968d329892A1152557b3908808A6384069G47837L3905495c5848864A2337282
12960d477959j4334673B0741503d3212971J1908570C1285186a7499644D9005031
12952h348910A1529381K7060005a4010973p967163D1544094j378898j1285430
12945B8879766i953697J121533C501794d3508090A2735435a1049567k2412797
$$ plain form
12999 -22235664 7651427 -27387513 30725681 39996889 -4151588 6866706 34475777 17910768
12991 17910768 -43880116 -15218941 -10761259 -8140032 9682853 -12168918 -23570425
12984 -23570425 18032179 -25541676 -1344010 14030102 11867573 -8622973 10729097
12976 -8487322 15602788 37189724 -31955339 -23176807 32607449 -18562022 13974518
12968 -4329892 11152557 -23908808 16384069 747837 34653332 -35848864 12337282
12960 -4477959 -18812632 20741503 -43212971 -31304401 31285186 -17499644 49005031
12952 -8348910 11529381 38589386 -14010973 -21978136 41544094 40165196 28879766
12945 28879766 -9953697 -8832164 3501794 -43508090 12735435 -11049567 -33462364
12938c3462364A3667673J5307349H525122k064013c1703148B1735871i913411
12930B7966949j3684566b6851460O485684m960017L742830a0661222A7113372
12922A2133162a5747928L762565D7550236f63075I11549L2094431c7056293B9648771
12913A1687064a31820F554240j566677A137145a1913440H76307h363900I474282
12904e273796j8070567j580177d254601F3478884d699464k5361143c778205B4936526
12895A3775365K459699K444107H305702Q156167b9248289A6505723a3476599B6956664
12886B0840198h903177l894188A892274i495727l601197K262131j1218262i374738
12877c4728728B506024J7079503J4442051I68096D69862Q846922K3292734c2499471
$$ plain form
12938 -33462364 13667673 28975022 8525122 6461109 -31703148 21735871 -9913411
12930 27966949 14282383 -26851460 -20365776 -25325793 -21582963 -10661222 17113372
12922 12133162 -15747928 -11985363 47550236 -663075 911549 33005980 -37056293 29648771
12913 11687064 -131820 6554240 4987563 1137145 -11913440 876307 -8363900 9474282
12904 -5273796 -23344363 -24924540 -4254601 63478884 -4699464 -30060607 -3778205 24936526
12895 13775365 16235064 18679171 8305702 16461869 -29248289 16505723 -13476599 26956664
12886 20840198 -8903177 -12797365 1892274 -9495727 -13096924 -10834793 -22053055 -9374738
12877 -34728728 2506024 19585527 34027578 968096 469862 9316784 32609518 -32499471
12868a5562925A913829f78525C532897J4468483a2773089A5503779f5993560B8321123
12859c701639a32665j2120174m8210803D54482J1977981d8047377a3616459E292895
12850d9712962A8087512a6068573C6092815h86353E006639b4315974C0026789
12842B9278908H081486b1078970A7620265A973693a0346637h12702q424515C8027362
12833c2596450j9735876a1200776b647891D69315J5494125a2038835D610517g922142
12824H281663c254032n995774j3301639D7061420b3434387a990136j8061551B1409206
12815b9942299e791350m042001B6936301r565789P939114b7736314B3385235o498049
12807A6887186e9056285E502551a2628549k2290884J4769796C3700243c763196
$$ plain form
12868 -15562925 1913829 -678525 3532897 18001380 -12773089 15503779 -65993560 28321123
12859 -3701639 -132665 -12252839 -60463642 454482 12432463 -48047377 -13616459 5292895
12850 -49712962 18087512 -16068573 36092815 -886353 5006639 -24315974 30026789
12842 29278908 8081486 -21078970 17620265 1973693 -10346637 -812702 -9237217 38027362
12833 -32596450 -52332326 -11200776 -2647891 469315 15963440 -12038835 4610517 -7922142
12824 8281663 -3254032 -9249806 -22551445 47061420 -23434387 -1990136 -20051687 21409206
12815 -29942299 -5791350 -9833351 26936301 17370512 25309626 -27736314 23385235 16887186
12807 16887186 -59056285 5502551 -12628549 -34919433 -20149637 33700243 -3763196
12799b4604361e077809G985862B312460M0475365a5444743A8285674a5623080
12791A2395129g196294B6109195a5791128J183963A96208b1482286O251925E1228607
12782D4540552B1823173G772399J294641b3767287B4362600d1489941B8225605
12774B5043844a6595520J962602d133455C2203159a1847660c909315a751304A4439977
12765e9686135g505473F536056a8238520f403933j0130066b278602j2798343K89105
12757a4787840C939066a8358565e035667G550653a3188510l976424E163072d0840303
12748d005297C3002419k174425b545458j663796B0433325L9835635c1435369g642786
12739c0564927a3206461C9646725a9775409B1579179k623112J7839405J2924793
$$ plain form
12799 -24604361 -5077809 7985862 2312460 42787825 -15444743 18285674 -15623080
12791 12395129 -7196294 26109195 -15791128 -14607165 196208 -21482286 -15230361 51228607
12782 44540552 21823173 7772399 9067040 -23767287 24362600 -41489941 28225605
12774 25043844 -16595520 -14632918 -4133455 32203159 -11847660 -3909315 -1751304 14439977
12765 -59686135 -7505473 6536056 -18238520 -6403933 -16533999 -2278602 -15076945 -14787840
12757 -14787840 3939066 -18358565 -5035667 7550653 -13188510 -17164934 5163072 -40840303
12748 -4005297 33002419 30827994 -2545458 -4209254 20433325 60268960 -31435369 -7642786
12739 -30564927 -13206461 39646725 -19775409 21579179 18956067 36795472 49720265
12732D9720265b1216770H618377j52747i261440j0827298D2340099c412778C8617184
12723D3880759a64560A2301008c1671621C1328130a1021128j6978320A941759
12715A3150567b1005800g604953L461552C8039000A2528741b6557287C625517
12707E255853a9678750g362036B9217086h353160j7784585h462917B0840746Q643449
12699B9484195b5069999D6633122c626265i05935j2657309A041856b4580495d540174
12690A0559250L070640c592622q761503G183964B133432a068498j361349k8430228
12682c0860075J1094156A0378241L975175K5207768j4662418O220243B798127
12674A1771433N161370d6502092a3186163R44314A3316811c3158939J6316063
$$ plain form
12732 49720265 -21216770 8618377 8465630 -9261440 -20088738 42340099 -3412778 38617184
12723 43880759 -164560 12301008 -31671621 31328130 -11021128 -27999448 1941759
12715 13150567 -21005800 -7604953 -4143401 38039000 12528741 -26557287 3625517
12707 5255853 -19678750 -7362036 29217086 -8353160 -26137745 -8462917 20840746 29484195
12699 29484195 -25069999 46633122 -3626265 -905935 -13563244 1041856 -24580495 -4540174
12690 10559250 13629890 -3592622 -12354125 7183964 2133432 -1068498 -2429847 -30860075
12682 -30860075 -19765919 10378241 14353416 39561184 24898766 31119009 2798127
12674 11771433 16932803 -46502092 -13186163 -12241849 13316811 -33158939 -16842876
12667a6842876C682256K3946149H870468J2971159e880846D381766c8201722B6524178
12658F6129648E253949l18692a1220355A3191791b9534384j4756771a3837430
12650c7921516a112862l0052550J2742341j1058479I996790a1383051l211320
12643a4594371J729534A203930c9589282g019795A2797032m967667J2831373m358990
12635A6301748b5620075e608814f16066B5882193j1532579K7375977A4258157
12627A3164171F255003L449250K1728560h830221A977796a6619656C3301706a4284913
12618C366517K5714368A3404269D431959a7487571k7124388a8631513C302503
12610c0071416A141286L2439805j0073072n968791i319008j5471454B5455875
$$ plain form
12667 -16842876 3682256 27628405 8870468 21841627 -5880846 4381766 -38201722 26524178
12658 66129648 5253949 4935257 -11220355 13191791 -29534384 -44291155 -13837430
12650 -37921516 -1112862 -31165412 -18423071 -29481550 9996790 -11383051 -14594371
12643 -14594371 -12864837 1203930 -39589282 -7019795 12797032 7829365 20660738 16301748
12635 16301748 -25620075 -5608814 -616066 25882193 14349614 41725591 14258157
12627 13164171 6255003 9704253 31432813 -8830221 1977796 -16619656 33301706 -14284913
12618 3366517 29080885 13404269 4431959 -17487571 -44611959 -18631513 3302503
12610 -30071416 1141286 33581091 23508019 17539228 -9319008 -24790462 25455875
12602a821518q29594a122870j3428308J704658j7858312B4205304R65703d68300
12593C1700261j3688519J234139f129038A8555986a6920166j1848743L365758
12586b5403151A4530086a221561E533174J4147105J643973a4713713e215746A5890763
12577a1801916B3045772A1158051J787676o436626G88363a1216808j2438721P451413
12569a6204116D051239J6923591J722115M052861c7401763D676724M5093591C288626
12560C6871564e747027H865509a3446628H915583J9968737a4125777j6034086
12553c0159863J4173509K445759O532134F825455j895510N414025b2968304h71631
12544B0498533b3491358j2814566J7343205r843401R633390B2907464g896091
$$ plain form
12602 -1821518 -2651112 -1122870 -14551178 -12846520 -30704832 24205304 25171007 -468300
12593 31700261 18011742 19245881 -6129038 18555986 -16920166 -28768909 -25403151
12586 -25403151 14530086 -1221561 5533174 19680279 21324252 -14713713 -5215746 15890763
12577 -11801916 23045772 11158051 12945727 6509101 788363 -11216808 -23655529 -16204116
12569 -16204116 4051239 20974830 22696945 26749806 -37401763 4676724 49770315 3288626
12560 36871564 -5747027 8865509 -13446628 8915583 28884320 -14125777 -30159863
12553 -30159863 -15986354 -13540595 -7008461 6825455 4929945 10343970 -22968304 -871631
12544 20498533 -23491358 -36305924 -18962719 -28806120 -19172730 22907464 -7896091
12536I025785K001595N2335e3720528a8670777j3340953n99385C349569J135465
12528D485034L3940160f497512a078393r349845k239646n882313A9707906D851436
12519d894465A8809269J2404976c0868592B7373197c7629870A9718558J7709487
12512C7428045a3513708J369639p738030G151263b9028114O620060e203894p737210
12504a2941104I260722f608041A8527661c8177633c927561j5286763C933368a9518991
12495A2658530a3103964F4856437D593065I1609a6049722N860152C736035K6498426
12487C0234461a1184284D827839b1218899L298995L045002l1549761A3696865
12479b754335j9954362D4964219c3045652K139023A3779871a5687416b631243
$$ plain form
12536 9025785 11027380 11079715 -53720528 -18670777 -32011730 -32611115 3349569 4485034
12528 4485034 38425194 -6497512 -1078393 -10428238 -12667884 -18550197 19707906 4851436
12519 -4894465 18809269 31214245 -30868592 27373197 -37629870 19718558 37428045
12512 37428045 -13513708 -12144069 -19882099 7151263 -29028114 -22408054 -5203894 -12941104
12504 -12941104 9260722 -6608041 18527661 -38177633 -3927561 -19214324 3933368 -19518991
12495 12658530 -13103964 64856437 4593065 91609 -16049722 -10189570 3736035 30234461
12487 30234461 -11184284 4827839 -21218899 -17919904 -14874902 -46424663 13696865
12479 -2754335 -22708697 44964219 -33045652 -30906629 13779871 -15687416 -2631243
12471B6673542a0154146q292249p046752a560774E1274402j051551b5753381B9395348
12462A2571998a4982339M139683M290553J60824k3616702G467561a1788451A2947431
12453d667818j7111304c807015J112619A2235996a4767043p794629p804699j6961597
12445d7327968E7208714j1472759r75512H061707a5084427f557784A3878746D419168
12436d0185027A5737015j76061J0880784h832479j97384E251242J8999939A621680
12427a4630738C1571723b3861491f822224m133874n302644G485283b8979855B6231326
12418b7281344G69209d300358B7675254a4908268j4487479N180428A2052159M973220
12410A7025379b494410k6935682c647431j9268836L146513B5178894k543937b3390722
$$ plain form
12471 26673542 -10154146 -18446395 -25493147 -1560774 51274402 50222851 -25753381 29395348
12462 12571998 -14982339 -10842656 -6552103 -6391279 -30007981 7467561 -11788451 12947431
12453 -4667818 -21779122 -3807015 -2694396 12235996 -14767043 -22561672 -30366371 -47327968
12445 -47327968 57208714 45735955 44760443 8061707 -15084427 -6557784 13878746 4419168
12436 -40185027 15737015 15560954 26441738 -8832479 -9029863 5251242 24251181 1621680
12427 -14630738 31571723 -23861491 -6822224 -10956098 -16258742 7485283 -28979855 26231326
12418 -27281344 769209 -4300358 27675254 -14908268 -29395747 -24215319 12052159 17025379
12410 17025379 -2494410 -29430092 -3647431 -22916267 -19769754 25178894 22634957 -23390722
12401g683371b63767o594360I3834J9498800K5042879a2223232F356310b2852716
12392E323013P926687b35757A2295012b4264589a1805358d974548k382029A8806113
12383e238781A6342066a7524113B876127b2313300n566910C7162804A6263827
12375I414909b223557F876160d513895F957138b0679402A584030J9407645c062432
12366B1648075p387900a8180913H612881g261596n719617D847771A380893J7941180
12358A9322073l060960J8664851A5727945K740694H390962D026803P130882J266132
12350A2423817N258738a5649485B6208715G853938I066a9406185a525661F45741
12341d0606516R826955A1077387J2276870D142399L928848J104102e1475570A9101792
$$ plain form
12401 -7683371 -263767 -6858127 93834 19592634 44635513 -12223232 6356310 -22852716
12392 5323013 13249700 -235757 12295012 -24264589 -11805358 -4974548 -7356577 18806113
12383 -5238781 16342066 -17524113 2876127 -22313300 -27880210 37162804 16263827
12375 9414909 -2223557 6876160 -4513895 6957138 -20679402 1584030 20991675 -3062432
12366 21648075 14260175 -18180913 8612881 -7261596 -12981213 4847771 1380893 19322073
12358 19322073 16261113 34925964 15727945 18468639 8390962 4026803 11157685 12423817
12350 12423817 17682555 -15649485 26208715 7853938 9066 -19406185 -1525661 645741
12341 -40606516 -30779561 11077387 23354257 4142399 8071247 9175349 -51475570 19101792
12332G825648M849242i834185D645679M305403K4336617c7404365H432056L9252279
12324D7684335G066562a998006p018001b864093l392169j2130261r59819g901143
12315c5637054j7192476L82647B1657907i567098l7854608I438877J5195434b3385399
12306B069791a8847263A2836754J6021603B897439a9891830j4985357a4322741
12298A4270725b820445A4815595A939835b550603B3922784e876804H12963K6752364
12290B7565327d0758735R654898A9538828M496481D359467b6747741J2399285
12283a4348456F055487Q769982a0683231B4624227E913706J9657753j1903448
12276A3668011c7143015a566751e80710j5296824F487629c671890B1541820I339651
$$ plain form
12332 7825648 12674890 -9834185 4645679 8951082 33287699 -37404365 8432056 47684335
12324 47684335 7066562 -1998006 -9016007 -2864093 -6256262 -18386523 -19346342 -7901143
12315 -35637054 -52829530 -52446883 21657907 -9567098 -47421706 9438877 24634311 -23385399
12306 2069791 -18847263 12836754 28858357 2897439 -19891830 -34877187 -14322741
12298 14270725 -2820445 14815595 1939835 -2550603 23922784 -5876804 812963 27565327
12290 27565327 -40758735 -31103837 19538828 24035309 4359467 -26747741 -14348456
12283 -14348456 6055487 14825469 -10683231 24624227 5913706 25571459 13668011
12276 13668011 -37143015 -1566751 -580710 -15877534 6487629 -3671890 21541820 9339651
12267h869239j3413184r235806B6744751b6576219C3867980j2542811b3520905
12259D878727L6073362A2060791a9010959O757376A623086E16553K1013894i796492
12250a0244202E3724703B1331010j0215616b1574150A616313c9347605F638014
12242A2249972M941129G432800L098130a6833948A1615391e438892k5927790B5982972
12233a3470408a731638A730706i252596J414522I216700P43041L2926751c376908
12224E234017a9310532A4089174c506805I366579a0414951C3087375n604566e6022461
12215b7858147C2417886d212877H633069b2708322C678860a7932772G400752l307417
12207D093335c4978283k72989A618226K156129e858578A2946881R713447F527020
$$ plain form
12267 -8869239 -22282423 -31518229 26744751 -26576219 33867980 21325169 -23520905
12259 4878727 40952089 12060791 -19010959 -12253583 1623086 516553 21530447 -9796492
12250 -10244202 53724703 21331010 11115394 -21574150 1616313 -39347605 6638014
12242 12249972 17191101 7432800 10530930 -16833948 11615391 -5438892 -31366682 25982972
12233 -13470408 -1731638 1730706 -9252596 -7838074 9216700 9959741 42886492 -3376908
12224 5234017 -19310532 14089174 -3506805 9366579 -10414951 33087375 27482809 -56022461
12215 -27858147 32417886 -4212877 8633069 -22708322 3678860 -17932772 7400752 4093335
12207 4093335 -34978283 -35251272 1618226 3774355 -5858578 12946881 22660328 6527020
12198C442002J8929418A984235b2805980A6415462a337553I030674a2555210A4545162
12189A6214623h371980B9979411c095944p446121M651366j1246359j3900522j7099963
12181d8137543A6351601a2169381r411488C7755799H768988a8845498K817971
12174a6027527K43234E219693b2968802C2751015f719879A4251111J1884566c0314192
12165G08919L8350879A992850c776005l5464018H604453b9103480C7805234c3681666
12156c9579870C6700762b9183609A1369861b9034212d844738k2822432f22406
12148a4297776D549972K0244703d2360834B0844719r182567e524172I432618J6460794
12140B5893412c4495479J4797134D4292442a5204113j858769g003756H587577
$$ plain form
12198 3442002 22371420 1984235 -22805980 16415462 -1337553 9030674 -12555210 14545162
12189 16214623 -8371980 29979411 -3095944 -10542065 -5890699 -17137058 -31037580 -48137543
12181 -48137543 16351601 -12169381 -21580869 37755799 8768988 -18845498 -16027527
12174 -16027527 -15784293 5219693 -22968802 32751015 -6719879 14251111 26135677 -30314192
12165 708919 39059798 1992850 -3776005 -39240023 8604453 -29103480 37805234 -33681666
12156 -39579870 36700762 -29183609 11369861 -29034212 -4844738 -27667170 -622406
12148 -14297776 4549972 24794675 -42360834 20844719 11662152 -5524172 9432618 25893412
12140 25893412 -34495479 -19698345 44292442 -15204113 -17062882 -7003756 8587577
12132C0504792c429595H59657O172607b99775F713836R341190D294277a3920216
12123B5507604a2058151A9517495q896908D7233g192156B685143O842528B144490
12114d5673854B3954303c145049m4354465G742664J591542M8493218A0046310
12106g316067A7574742a4541422C7839341H560080c057410A9473427c6078189
12098A4146758l028822h107446k8091117B2665715c0247169K856249C9299193
12090D0967280a1595894A9581851Q672354h531965m288834q2899059A7985847
12082C2280302a9077584L416901L344299M557230L52107J888765A8784266b8288704
12073b9072847H975985e3256769f927756C3717626d247131C5506087a3194894
$$ plain form
12132 30504792 -3429595 859657 7032264 -299775 6713836 16055026 4294277 -13920216
12123 25507604 -12058151 19517495 10620587 47233 -7192156 2685143 9527671 2144490
12114 -45673854 23954303 -3145049 -47499514 7742664 9334206 57827424 10046310
12106 -7316067 17574742 -14541422 37839341 8560080 -3057410 19473427 -36078189
12098 14146758 11117936 -8107446 -36198563 22665715 -30247169 -27390920 39299193
12090 40967280 -11595894 19581851 28254205 -8531965 -12820799 -95719858 17985847
12082 32280302 -19077584 -15660683 -12316384 -7759154 -7407047 -5518282 18784266 -28288704
12073 -29072847 8975985 -53256769 -6927756 33717626 -4247131 35506087 -13194894
12065c6638001A8885317h552423m5699464E3672259a419683l940232m3150665
12058d8510580f024731j542568B349670d8323351J3988181B4954615n062136f1334597
12049A1190292a1099E9298407A7181406d1692927C4469168a6076262B7473084
12041a0366730M493916A7363781B943133J5691305J2408756e616511q698220F507172
12032c824614B187162J9334116a4494750E49356b1663302I612095a1314230D0543763
12023d4966357A0247577c6373559b991437l0210866n619668I396942L615434c1425574
12014c4038702C0818403A2720475J8173743j0575766J3220184j802738a3867671
12006C6274215A6249096e0173122b1708279j2099553C1150496C251797b9900688
$$ plain form
12065 -36638001 18885317 -8552423 -54251887 53672259 -1419683 -5359915 -48510580
12058 -48510580 -6024731 -7567299 2349670 -48323351 -34335170 24954615 19892479 -61334597
12049 11190292 -11099 59298407 17181406 -41692927 34469168 -16076262 27473084
12041 -10366730 -5872814 17363781 2943133 18634438 31043194 -5616511 -14314731 6507172
12032 -3824614 2187162 21521278 -14494750 549356 -21663302 9612095 -11314230 40543763
12023 -44966357 10247577 -36373559 -2991437 -33202303 -38821971 9396942 13012376 -31425574
12014 -34038702 30818403 12720475 30894218 20318452 33538636 31735898 -13867671
12006 36274215 16249096 -50173122 -21708279 -33807832 31150496 3251797 -29900688
11998a9763986N877000N127011H26529b195719k7577232n776652F279618b0354281
11989a1314906A8479578b8609017a1668133A6539976D391253a0019607l1779164
11982d1798771g3102A7578257f613311j1543959G768323c4277855a2913246o33033
11974a3546279B318022K541624A970691b5461885e234276r506674L025765f91275
11965c7113960C6121571H823244d730244B8036071A0830541a6206998I176593
11957A4566669b5067582E519691J7913075p037556a2370574Q22938F206706K0731507
11949B6938213J5558403A0728090D781224L9950884j8671888a262375m1057488
11942d2319863g477695D779048O000344f6048065D3060336q485501j4607509e329128
$$ plain form
11998 -19763986 -13886986 -8759975 826529 -2195719 -29772951 -35549603 6279618 -20354281
11989 -11314906 18479578 -28609017 -11668133 16539976 4391253 -10019607 -41798771
11982 -41798771 -73102 17578257 -6613311 -18157270 7768323 -34277855 -12913246 -13546279
11974 -13546279 2318022 4859646 1970691 -25461885 -5234276 -14740950 -11715185 -691275
11965 -37113960 36121571 8823244 -4730244 28036071 10830541 -16206998 9176593
11957 14566669 -25067582 5519691 23432766 16395210 -12370574 -11547636 6206706 26938213
11949 26938213 42496616 10728090 4781224 44732108 26060220 -1262375 -42319863
11942 -42319863 -7477695 4779048 10779392 -66048065 43060336 34574835 19967326 -5329128
11933b20283j5257598B205474c2858242C0944840b554359l8628099K709970g576833
11924b4075902M49789j4126338g646349C5691317n135606o487324n414668A685585
11915f958793B8464981c7141689C1846556a5314794A3081139L1290613a3405857
11907G164185c4574140c40699E705137A70054i043199A3150704h118299C009925
11898d5355943A6070034K1969329J7017908A3051650b0816303i950702M944444
11891e006258j4720558r788841A3864142K416218k500046c8766668O993689a1884853
11882D7340240A8012215h418253D7231273H674037K2697755A0212912J4231290
11875B4444202G947758g174748C1803732c0512175R955668B7911822B412152i170180
$$ plain form
11933 -220283 -15477881 2205474 -32858242 30944840 -2554359 -41182458 -38472488 -7576833
11924 -24075902 -23626113 -37752451 -7646349 35691317 30555711 24068387 18653719 1685585
11915 -6958793 28464981 -37141689 31846556 -15314794 13081139 44371752 -13405857
11907 7164185 -34574140 -340699 5705137 170054 -9043199 13150704 -8118299 3009925
11898 -45355943 16070034 38039363 55057271 13051650 -20816303 -9950702 -5006258
11891 -5006258 -19726816 -29515657 13864142 16280360 13780314 -38766668 -31772979 -11884853
11882 47340240 18012215 -8418253 47231273 8674037 31371792 10212912 24444202
11875 24444202 7947758 -7174748 31803732 -30512175 -20556507 27911822 2412152 -9170180
11866h652627D111269g598998q822100K214693l0467154R420907A5412436b9874714
11857A5256399c1353336B6279698K7291657B4850120k768999L5645976b0808628
11849H168723a8363227A1433080a0495152l008576L08772J869525j3202759A1158331
11840B2642174b8222491P204197h575290j0505644L847015n943022D0779351J2470232
11832E3249583b1326971B9440780J6298012H880221O745041K7906727c4108169
11824a0476172D9216506I864118l983253P393224c7792209G503375a5651271D762395
11815B8949298r113093O694854A423387d2189897A054184N510177A130620a9483654
11806b3853582B942317e2434409a3633306j2524563J0335981N747247B0038863
$$ plain form
11866 -8652627 4111269 -7598998 -16421098 -14206405 -44673559 -35252652 15412436 -29874714
11857 15256399 -31353336 26279698 53571355 24850120 22081121 57727097 -20808628
11849 8168723 -18363227 11433080 -10495152 -13503728 -13194956 -11325431 -24528190 11158331
11840 22642174 -28222491 -21018294 -8575290 -19080934 -15233919 -21176941 40779351 53249583
11832 53249583 -21326971 29440780 45738792 8880221 15625262 43531989 -34108169
11824 -10476172 49216506 9864118 5880865 13274089 -37792209 7503375 -15651271 4762395
11815 28949298 19836205 26531059 1423387 -42189897 1054184 6564361 1130620 -19483654
11806 -23853582 2942317 -52434409 -13633306 -26157869 -15821888 -10074641 20038863
11798b17683l5800419a4181450F419580a1412242j8597756C6674831b0307203
11790e0570351E107735c312381A4963722j975809D146827a4109687L588772l456752
11782a3977667C9787453c472495m527606L873429o748649n880601E3468223j5145031
11774C8323192b5239415A3262524a2799102g03763j503541p809380K430663D5974879
11765c3526519B931178K6004008c996342D1351024A744500a4916091C482097a4199681
11756a4413595j5749875h473807k5657527B5236627B999239M270652b1072449
11748b5644661R809361A1841452c0334540b222975B5810742J8379590a0039481
11740a637845j0123077E9472955d5354059A6588683B574592c3234179B2164617
$$ plain form
11798 -217683 -36018102 -14181450 6419580 -11412242 -30009998 36674831 -20307203
11790 -50570351 5107735 -3312381 14963722 12987913 4146827 -14109687 -10520915 -13977667
11782 -13977667 39787453 -3472495 -8000101 -4126672 -10875321 -16755922 53468223 38323192
11774 38323192 -25239415 13262524 -12799102 -703763 -2207304 -10016684 -7586021 45974879
11765 -33526519 2931178 28935186 -3996342 41351024 1744500 -14916091 3482097 -14199681
11756 -14413595 -30163470 -8473807 -34131334 25236627 2999239 7269891 -21072449
11748 -25644661 -15835300 11841452 -30334540 -2222975 25810742 44190332 -10039481
11740 -1637845 -11760922 59472955 -45354059 16588683 2574592 -33234179 22164617
11732c2980087J5678510H95014J481333J856653J4929589J4302666a0302720l351518
11724a3654238B1582476D257074c7869710B9534250a2129680c597275n1045312
11717e4642587C3763624a6613353b394580h72369j0985552C0065098b65537l4559776
11709c4825313G471575m2576L8237863a483681m2363089A8672475N732270q131805
11701A6272940D178364J1197373C110276g565661p297341A7306151a9091025H47189
11692a7043721A1048494P948153f676649j0395627e727708G144775j713818a8777149
11683a1763366e434446n6508400K1792086N417899j7962932b3722210A5180451
11675B398322h182253j5639596e308881B1483425B781149J3805373a2321557D87079
$$ plain form
11732 -32980087 -17301577 895014 2376347 4233000 19162589 33465255 -10302720 -13654238
11724 -13654238 21582476 4257074 -37869710 29534250 -12129680 -3597275 -54642587
11717 -54642587 33763624 -16613353 -2394580 -872369 -11857921 30065098 -265537 -34825313
11709 -34825313 7471575 7428999 45666862 -1483681 -43846770 18672475 24404745 16272940
11701 16272940 4178364 15375737 3110276 -7565661 -14863002 17306151 -19091025 847189
11692 -17043721 11048494 18996647 -6676649 -17072276 -5727708 7144775 5430957 -18777149
11683 -11763366 -5434446 -61942846 -40150760 -34732861 -52695793 -23722210 15180451
11675 2398322 -8182253 -23821849 -5308881 21483425 2781149 16586522 -12321557 487079
11666b9704472B9241273j4178705a5369593C1594705a3100930C0605758a0679710
11658h074376E765816M6004949A7349705N633771a1720043C0069563p465806e240657
11649B4561359c4338937b352021A3513975c5682138C4361518g487190A0310157
11641I861521N676966b415340j7975274k3316947J2331534C8011552j4109319
11634B3902233l893833H567078J5841912d2919552a3937128b517254B3939644
11626A9559049a9928742O698657F317971B493152J2329888L6345763b1378423
11618b8591440I630723d667903k2511484B067162R220251P677196q973468A22710
11609A6085761a7296476f95054D5096288j6645878I670510b7904011N172599o944610
$$ plain form
11666 -29704472 29241273 15062568 -15369593 31594705 -13100930 30605758 -10679710
11658 -8074376 5765816 51770765 17349705 22983476 -11720043 30069563 22603757 -5240657
11649 24561359 -34338937 -2352021 13513975 -35682138 34361518 -7487190 10310157
11641 9861521 15538487 -2415340 -20390614 -43707561 -31376027 38011552 23902233
11634 23902233 20008400 8567078 24408990 -42919552 -13937128 -2517254 23939644
11626 19559049 -19928742 -13230085 6317971 2493152 14823040 51168803 -21378423
11618 -28591440 9630723 -4667903 -27179387 2067162 11287413 18964609 9991141 122710
11609 16085761 -17296476 -695054 45096288 28450410 9670510 -27904011 -22731412 -29676022
11601b9676022C093662b4743258i79323k7439134J3550432C82260a2252733K357021
11593i895712B91221L4837175b704842m617909j1308813B7781753d1748997D764922
11584C316963a97303F617525a6566783F7608501c5760034B7349162I502204i464874
11575a2215683B5296463h478887F304648e529231j7231403f409166H287677K2742863
11567C1030540q709527E624374e4847605C9752139A0172230O64119l196621d0393721
11558I812284c308949k3737496A5288718q64785I94027J6059176L296635J6555803
11550C6905641Q367088b3076196h297372B09377g032055B4759311c8558057J8982122
11542a9575935j0939786C6298388J3841989E9318J1912352a9945590D8575649
$$ plain form
11601 -29676022 3093662 -24743258 -979323 -28418457 -14868025 382260 -12252733 -9895712
11593 -9895712 291221 35128396 -2704842 -7322751 -18631564 27781753 -41748997 4764922
11584 3316963 -197303 6617525 -16566783 67608501 -35760034 27349162 9502204 -9464874
11575 -12215683 25296463 -8478887 6304648 -5529231 -22760634 -6409166 8287677 31030540
11567 31030540 22321013 5624374 -54847605 39752139 10172230 10836349 7639728 -40393721
11558 9812284 -3308949 -27046445 15288718 14423933 994027 17053203 20349838 36905641
11550 36905641 45272729 -23076196 -8297372 209377 -7032055 24759311 -38558057 -19575935
11542 -19575935 -30515721 36298388 50140377 59318 11971670 -19945590 48575649
11534b0784385L331595M218308B806243N1646999b199108p068429a180689m616783
11526e797472D2592863H154110b758321A0700357h994416H126929K316271M533234
11518A4976434b5202173j7806669A9678991b6298838F23247g301354A965508d3420676
11509b9943785h836475B9648097b2411911D928235K8696158I240699j785850h483703
11500a3426373a087905D6528791b171003P41780F360540d535476l1601867J2422711
11492b3714632D1098854b4933498L662470H812406h31701B1769073A778638a4344401
11483a6380289j946016r600797B0551078d2153286a6209193c012050C130307K54363
11475C384670e413513q169463a056465k0235329A0915248b7150631a0864390C4079020
$$ plain form
11534 -20784385 -17452790 -13234482 2806243 54453242 -2199108 -9267537 -1180689 -5797472
11526 -5797472 42592863 8154110 -2758321 10700357 -8994416 8126929 10443200 14976434
11518 14976434 -25202173 -43008842 19678991 -26298838 623247 -7301354 1965508 -43420676
11509 -29943785 -8836475 29648097 -22411911 4928235 33624393 9240699 7454849 -8483703
11500 -13426373 -1087905 46528791 -2171003 -1429223 6360540 -4535476 -36137343 -23714632
11492 -23714632 41098854 -24933498 -21271028 8812406 -831701 21769073 1778638 -14344401
11483 -16380289 -18326305 -27927102 20551078 -42153286 -16209193 -3012050 3130307 3384670
11475 3384670 -5413513 -13582976 -1056465 -21291794 10915248 -27150631 -10864390 34079020
11466e301535A1868179e0823605A5554338a0901780F166224a1683601A6795871
11458h367695B3189324q086656m85742J1998688a1582251k2244159H947810C156928
11449b0471464E7264722c741319G658162a5702148K323561C6787339j7245396
11442A9541943b9307683A2971013J3244712a2259683c996671A9889588M864665
11435B4754253b2334687i694066D3825223b0050448r588666H409887c2372917
11427B9581384d653730N68291D569330c4899392f124850A5952323b1352007K906026
11419a8445981j4754800G524238c9055349I061701i272713B318020M3881860j9482669
11411B6717211a4554052A39752L903415a2694641N857247A1604755K3367034A0725217
$$ plain form
11466 -5301535 11868179 -50823605 15554338 -10901780 6166224 -11683601 16795871
11458 -8367695 23189324 15102668 14616926 26615614 -11582251 -33826410 8947810 3156928
11449 -20471464 57264722 -3741319 7658162 -15702148 -13378587 36787339 19541943
11442 19541943 -29307683 12971013 26215725 -12259683 -3996671 19889588 24754253
11435 24754253 -22334687 -9694066 43825223 -20050448 -29639114 8409887 -32372917
11427 29581384 -4653730 -4085439 4569330 -34899392 -6124850 15952323 -21352007 -18445981
11419 -18445981 -33200781 7524238 -39055349 9061701 -9272713 2318020 46199880 26717211
11411 26717211 -14554052 139752 4043167 -12694641 -6837394 11604755 34971789 10725217
11402A5352986a3126721B709225g23158A7510009K7759873j4067896b750949j5291078
11394a8042027c632917E7404353j9792569a0791387A2690826a2430079B3902416
11386A5836814b1687554j1075647F05344b0086B3751113H614640h805783b207843
11377I932231R967071a7805637B5777953D999179L3694483b9567531a097621B3956467
11368E3148304A725288a5188737E9224923a6767887F953324b0943103A2229881
11360g912088G587389a1953120K304946F089645c224522B884449b0593606e625757
11351b9799520J090994A1857086B116957J2203101F832959d559655F8084904A6015787
11342a9490580k6213204I625858g978815H104677O413505e0430824F72879K0726514
$$ plain form
11402 15352986 -13126721 2709225 -723158 17510009 45269882 31201986 -2750949 -18042027
11394 -18042027 -3632917 57404353 37611784 -10791387 12690826 -12430079 23902416
11386 15836814 -21687554 -32763201 605344 -20086 23751113 8614640 -8805783 -2207843
11377 9932231 19899302 -17805637 25777953 4999179 38693662 -29567531 -1097621 23956467
11368 53148304 1725288 -15188737 59224923 -16767887 6953324 -20943103 12229881
11360 -7912088 7587389 -11953120 -9648174 6089645 -3224522 2884449 -20593606 -5625757
11351 -29799520 -28708526 11857086 2116957 14320058 6832959 -4559655 68084904 16015787
11342 -19490580 -45703784 9625858 -7978815 8104677 14518182 -50430824 672879 21399393
11334B1399393A603142J9754991a0465839k6295381B5692514J1226914F731964
11326g615385n4897563C234126c9412677i301094C0034631e3771068A5951038
11318B062024K5685444e901251j3348618p082041O928241B1982588H000436J4218195
11310B2218631b1481435B3397579b2712045A1817054c1710481C7570544A7590106
11302A4743643J6268996j1706070K1822554f956826j1454565B279776d797156
11294b6376724B849670K4881177E868934O646147J03989a8352241A7475735a3846288
11285g328267C72034P355901a9070376K918098b695820p23862m3672884h207104
11276A5966090a7199651c793332F923222b9076469F3166945C578996a7122459
$$ plain form
11334 21399393 1603142 21358133 -10465839 -36761220 25692514 36919428 6731964
11326 -7615385 -62512948 3234126 -39412677 -9301094 30034631 -53771068 15951038
11318 2062024 27747468 -5901251 -19249869 -26331910 -19403669 21982588 8000436 22218631
11310 22218631 -21481435 23397579 -22712045 11817054 -31710481 37570544 17590106
11302 14743643 31012639 19306569 41129123 -6956826 -18411391 2279776 -4797156
11294 -26376724 2849670 27730847 5868934 12515081 12619070 -18352241 17475735 -13846288
11285 -7328267 372034 7727935 -19070376 -16152278 -2695820 -3419682 -47092566 -8207104
11276 15966090 -17199651 -3793332 6923222 -29076469 63166945 3578996 -17122459
11268h422907A4520544g771586o261694A4862643K8797270f701415k811753k9988429
11260c9501597J7177906H364849K4285930J2698401R231177A8428861R275612
11253B7704473P381587h68731l1790124B11924J6814393L87170b190076o303733
11245h493809J937305B1710037a7801149A564316f846293r358170A1067354A121229
11236B5152788A823033d2838609B4700277D089480K3440764K013129F108676J6193215
11228B2301891a5717452M487433I117038g874050B6469257d695273D5027280D611963
11219d863827H269359b6716629a1175289o564073A8561234b5707654g82712j6057838
11211a6840550A8072276d771071k0531033e63526I239033J1235666r601329M265998
$$ plain form
11268 -8422907 14520544 -7771586 -14033280 14862643 43659913 -6701415 -9513168 -39501597
11260 -39501597 -22323691 8364849 32650779 45349180 54580357 18428861 27704473
11253 27704473 35086060 -868731 -32658855 211924 17026317 17413487 -2190076 -8493809
11245 -8493809 -6556504 21710037 -17801149 1564316 -6846293 -16204463 11067354 1121229
11236 25152788 1823033 -42838609 24700277 4089480 27530244 29543373 6108676 22301891
11228 22301891 -15717452 -11230019 9117038 -7874050 26469257 -4695273 45027280 4611963
11219 -4863827 8269359 -26716629 -11175289 -17739362 18561234 -25707654 -782712 -16840550
11211 -16840550 18072276 -4771071 -25302104 -563526 9239033 20474699 10873370 15139368
11203A5139368a4839237H040197h494423q915158B729130M052140K2202939c2078905
11194a9343088E405985J258421J7645094A1394554k544199g316493B1133018j098209
11186B0034809J0336388o794204b8587693C0268718b3720791A7784643l444275
11179A4340368g776711b143703F469258J036915k344042a6797936O069685p545449
11171a8273700j2650690a3438994j1306051D022466Q1443r89815L6697610b8564936
11162D171403b0428047A0172830a6598564c114880l2595144a6874641l740121
11155b0614762A6746322a926026m184180j1279233h514404l785124A2076852C783517
11146A3995901B038650J4955253m188875b1274519B8352423a1174803A4668703
$$ plain form
11203 15139368 -14839237 8040197 -8494423 -17409581 2729130 6781270 28984209 -32078905
11194 -19343088 5405985 6664406 24309500 11394554 8850355 -7316493 21133018 20034809
11186 20034809 30371197 23576993 -28587693 30268718 -23720791 17784643 14340368
11179 14340368 -7776711 -2143703 6469258 7506173 5162131 -16797936 -10728251 -18273700
11171 -18273700 -30924390 -13438994 -24745045 4022466 4103909 3114094 39811704 -28564936
11162 4171403 -20428047 10172830 -16598564 -3114880 -35710024 -16874641 -20614762
11155 -20614762 16746322 -1926026 -6110206 -17389439 -8514404 -12299528 12076852 3783517
11146 13995901 2038650 16993903 12805028 -21274519 28352423 -11174803 14668703
11138A9209066e313149A4937298L85215b9835451b207354j6087329D5884663a454254
11129D651340K5551687I461982c9689230B4309497a4215201e002750N86876k3897506
11121b8313380n48404O884693l117636p021775E032091K8840343A0634761K4947641
11113C5582402a8571246D0090717K066298J386006g764732b079917H391263B5867
11104C702939m79637d4493923a2021916p210369n647572A783908J7624272f323434
11095C593029K4418270g689556o3094945A8514311q327460O972074Q620644j1654560
11087A4125009e6210402D478623c986304j8556411L758693F059025f497425k1631347
11079b8128772B2032330a1092341B6197934F419050b2292965D4903319A554534
$$ plain form
11138 19209066 -5313149 14937298 15322513 -29835451 -2207354 -18294683 45884663 -1454254
11129 4651340 30203027 9461982 -39689230 24309497 -14215201 -5002750 -4415874 -28313380
11121 -28313380 -28861784 -21977091 -25094727 -32116502 5032091 33872434 10634761 35582402
11113 35582402 -18571246 40090717 42157015 43543021 -7764732 -2079917 8391263 25867
11104 3702939 3223302 -44493923 -12021916 -19232285 -24879857 1783908 19408180 -6323434
11095 3593029 28011299 -7689556 -70784501 18514311 10186851 17158925 25779569 14125009
11087 14125009 -56210402 4478623 -3986304 -22542715 -18784022 6059025 -6497425 -28128772
11079 -28128772 22032330 -11092341 26197934 6419050 -22292965 44903319 1554534
11071d1654882A3483327F443397a6970302B3893102a3268079B1461354g814464
11063b7582458D556092e271222B1437451j050287a0994166l4393383D8933726
11055B4590369G562920j082869b2850585C3477772j2076284k909221i0538A4487206
11046C7288162h198266k4383728f693908k094129l1041282J9248044B2814097
11038C6001232r573268j554017l40466b5954960B7828955A3489542f152550I176190
11029g748727B3676300F524833R967400e2686905A8955181J242074I519725l170679
11021F349046a4254695a777057j7902505j2794743B1986335g068059k093683A728444
11012d9846067F916925b1336176A0781641J052913L497289a3806895M690474D1878852
$$ plain form
11071 -41654882 13483327 6443397 -16970302 23893102 -13268079 21461354 -7814464
11063 -27582458 4556092 -5271222 21437451 20387164 -10994166 -45387549 48933726
11055 24590369 7562920 6480051 -22850585 33477772 21401488 18492267 -90538 14487206
11046 37288162 -8198266 -32581994 -6693908 -8788037 -39829319 -20581275 22814097
11038 36001232 26427964 24873947 24533481 -25954960 27828955 13489542 -6152550 9176190
11029 -7748727 23676300 6524833 16492233 -52686905 18955181 20197255 9519725 6349046
11021 6349046 -14254695 -1777057 -19679562 -32474305 21986335 -7068059 -9161742 1728444
11012 -49846067 6916925 -21336176 10781641 11834554 15331843 -13806895 -9116421 41878852
11003B222687R17222M655026b4663925H168838O41116j342877a0895193c067302
10994b0183117E1939927j8212388L852254d807418G760157a0701510A1983177
10986A4707198o058629j151050j004792h134919j2213317E3563939A5075536a2783748
10977a0213468D6624170a3487919B3765744A1230647M038619F409564a4011657
10969A8237165H774957M010391a452280j4251112M943748D3560413c2917657A1664955
10960a899593M6733C0836235b1280672j6433563a998002j0277285A3419826i35774
10951d068863A6171201p153397K7383611P469494a620584C4359395j4273976a7769372
10942D8848613A1141188R472468l562243L1320397A9649220p5353H253579i81895
$$ plain form
11003 2222687 3139909 7794935 -24663925 8168838 8809954 7467077 -10895193 -3067302
10994 -20183117 51939927 33727539 37579793 -4807418 7760157 -10701510 11983177
10986 14707198 8648569 7497519 6492727 -8134919 -20348236 53563939 15075536 -12783748
10977 -10213468 46624170 -13487919 23765744 11230647 15269266 6409564 -14011657
10969 18237165 8774957 12785348 -1452280 -15703392 -10759644 43560413 -32917657 11664955
10960 -1899593 -1852860 30836235 -21280672 -37714235 -1998002 -12275287 13419826 -935774
10951 -4068863 16171201 9017804 36401415 43870909 -1620584 34359395 20085419 -17769372
10942 48848613 11141188 20613656 17051413 48371810 19649220 19573867 8253579 -981895
10933A7307711b0999092A8523555h414738A8082975K8719706a657118D619296
10925A2615539a7874831A7321742D53975R929587J0770710e371446C1405596b1228854
10916a7679934A8739644c8573132a2406443q283193g230197A3455142N046360
10909A8501502a657892G508532M4994521A1879085K3873162e0932458C1325083
10901E928702a6535342D292528c282129k3575536A2651207f834764G79880J4603143
10893A5383023d378406o578650g41992k5871866a1852160e481979H45682J0518688
10885A1364370J899663c3283765f442641J412239j9881481F3100569a138330H043356
10876a4798933A4719163K0504968F426720e9469763C4174612R929840c307459
$$ plain form
10933 17307711 -20999092 18523555 -8414738 18082975 46802681 -1657118 4619296
10925 12615539 -17874831 17321742 453975 10383562 21154272 -5371446 31405596 -21228854
10916 -17679934 18739644 -38573132 -12406443 -20689636 -7230197 13455142 18501502
10909 18501502 -1657892 7508532 52503053 11879085 35752247 -50932458 31325083
10901 5928702 -16535342 4292528 -3282129 -26857665 12651207 -6834764 779880 15383023
10893 15383023 -4378406 -10957056 -741992 -26613858 -11852160 -5481979 845682 11364370
10885 11364370 13264033 -33283765 -6442641 -5030402 -24911883 63100569 -1138330 8043356
10876 -14798933 14719163 35224131 6426720 -59469763 34174612 44104452 -3307459
10868C5393109B647446b2119362j5524561C032685L2525940b2985087h512594
10860B5230430b3940232I972187O247407a6841445I625735a4036649a4509k492599
10852b507108A1028191c7839637a224365k1629368A1394933O369533a5780243
10844A028931e792212A7299775p295363m399872J1124396g406466j3829984q50122
10836b2086572h554918A2048717m937580K6528288c905485J361730A5221207K2962274
10828C8183481d0032832A3744537b2239076A059526a1869791A1085424a4341968
10820c9361206C318062q26464b2236438C0449814F957176B361972a513158k4748844
10812b6262002C5377774a5908384A0216255a7323713B9049459J715248j2637189
$$ plain form
10868 35393109 2647446 -22119362 -37643923 3032685 35558625 -22985087 -8512594
10860 25230430 -23940232 9972187 16219594 -16841445 9625735 -14036649 -14509 -2507108
10852 -2507108 11028191 -37839637 -1224365 -22853733 11394933 17764466 -15780243
10844 1028931 -5792212 17299775 10004412 5604540 16728936 -7406466 -21236450 -22086572
10836 -22086572 -8554918 12048717 7111137 33639425 -3905485 -2543755 15221207 38183481
10828 38183481 -40032832 13744537 -22239076 1059526 -11869791 11085424 -14341968
10820 -39361206 3318062 2491598 -22236438 30449814 6957176 2361972 -1513158 -26262002
10812 -26262002 35377774 -15908384 10216255 -17323713 29049459 30764707 18127518
10805A8127518f756381A1206532b5966506G763949a754773j4796197F026088a7173598
10796a4180176B2111044l347826b2270373A1753149b1710715A7913579b8719653
10788c8293520k417972a1565678q545254b955119r121728B148306R202480J8522960
10780B9873746A3437617J1024697d0206766D6813271b0446159C9756313d4866937
10772E088456d0829655a380324j9413062A1618994O463983L3780659D777709a1070139
10763g336499k951515a151696A3364289H38199M554762K0581337j964713K649757
10755B6659342n580501a7859878L585713d918498r824846o251993k1755058B4706633
10746c7128568F171177N130536A595385L8464278b501089l810321C5215736a0773737
$$ plain form
10805 18127518 -6756381 11206532 -25966506 7763949 -1754773 -16550970 6026088 -17173598
10796 -14180176 22111044 18763218 -22270373 11753149 -21710715 17913579 -28719653
10788 -38293520 -40711492 -11565678 -20110932 -2955119 -12076847 2148306 11350786 29873746
10780 29873746 13437617 24462314 -40206766 46813271 -20446159 39756313 -44866937
10772 5088456 -40829655 -1380324 -20793386 11618994 18082977 51863636 4777709 -11070139
10763 -7336499 -10288014 -1151696 13364289 838199 5392961 25974298 24009585 26659342
10755 26659342 21078841 -17859878 -14274165 -4918498 -14743344 -20995337 -42750395 24706633
10746 -37128568 6171177 11301713 1595385 40059663 -2501089 -6311410 35215736 -10773737
10737A025390R759075E134245J311942a0621824H441078c165010j546333A5555558
10728C1222305a4655318C9306984A8902365n731131B889550d774340j2554759
10721a7329099B7533005q17674q561438m682779b141062j6282657M996349l9158364
10713e2585734I653061B855704a5130301A4495946P702558K232093b4279968C4529891
10704B0407528A298855c7972320b41151p027097D015681K5998423j0557929F77738
10695b4725163J622779a1246964C7722399a6204352k0510875B6127417q877292
10688A7250125d253682A524875k86652b8980609i701195j7698727H915147j344430
10680G570717J0431364E423632a9133658A4112860K4454483I477434O775435O763150
$$ plain form
10737 1025390 10784465 5134245 6446187 -10621824 8441078 -3165010 -4711343 15555558
10728 31222305 -14655318 39306984 18902365 13171234 2889550 -4774340 -17329099
10721 -17329099 27533005 26715331 18153893 13471114 -2141062 -18423719 -13427370 -52585734
10713 -52585734 9653061 2855704 -15130301 14495946 22198504 24430597 -24279968 34529891
10704 20407528 1298855 -37972320 -241151 -7268248 4015681 30014104 19456175 677738
10695 -24725163 -23102384 -11246964 37722399 -16204352 -36715227 26127417 17250125
10688 17250125 -4253682 1524875 1238223 -28980609 -9701195 -27399922 8915147 7570717
10680 7570717 18002081 5423632 -19133658 14112860 38567343 9477434 16252869 23016019
10672B3016019a6535992G137219K5214782j1476437b2090458c325092g80852j804980
10664b585832n235046K378315l1491352k420492D022701b9702854J4142121p123894
10656b2684627b745242E8406966a4420574a76086C6753761j0483591o470527d62692
10647c1081064M061648b881733k5076705c894767A5464422h956305k3273526R516523
10639b2713308P172057k0487358A2030235b562749B0972806a1483149D362276
10631B806296g140049A1403804b6190599N403310q062200b56859j2367378B2533985
10622A4224199J8021538j1607858b0850974h814628j5621883J0210386G551767
10614c624362H921395a9727474f304331E820430b5819603i684831A4507429L2437970
$$ plain form
10672 23016019 -16535992 7137219 32352001 20875564 -22090458 -3325092 -780852 -2585832
10664 -2585832 -7820878 -5442563 -36933915 -39354407 4022701 -29702854 -15560733 -22684627
10656 -22684627 -2745242 58406966 -14420574 -176086 36753761 26270170 19799643 -462692
10647 -31081064 -27019416 -2881733 -27958438 -3894767 15464422 -8956305 -32229831 -22713308
10639 -22713308 -15541251 -36028609 12030235 -2562749 20972806 -11483149 4362276
10631 2806296 -7140049 11403804 -26190599 -20787289 -28849489 -256859 -12624237 22533985
10622 14224199 32245737 20637879 -20850974 -8814628 -24436511 -14226125 7551767
10614 -3624362 8921395 -19727474 -6304331 5820430 -25819603 -9684831 14507429 46945399
10606D6945399J1082019d500462B2035161C547420K7288111d3153668K0515382
10599b2638286E025671a2613138J621896l1906168M744409C5315481p31969j1407050
10591B3176462f001740j850293C316869b8727394B6277941G110009J895021c5301706
10582i606659C912770Q234736d249353H78480J7351520O519667a2717171f136470
10573c1757592J2758479p25494A0684066a7941999P973350n250300C1428375k531077
10565B8897298C873374a6720677D03001J875367g899367A8274824l821746d4916906
10556B297717J0720294a8548961B5660640b3631249N318904M70452a676033k4055348
10548b5731381H212143b4356157A2514545L229431K4024070d544000B0738156
$$ plain form
10606 46945399 58027418 -4500462 22035161 3547420 30835531 -43153668 -22638286
10599 -22638286 5025671 -12613138 -10991242 -42897410 -38153001 35315481 34583512 23176462
10591 23176462 -6001740 -7852033 3316869 -28727394 26277941 7110009 9005030 -35301706
10582 -9606659 3912770 12147506 -4249353 878480 18230000 24749667 -12717171 -6136470
10573 -31757592 -18999113 -19724607 10684066 -17941999 -9968649 -15218949 31428375 28897298
10565 28897298 3873374 -16720677 403001 2278368 -7899367 18274824 14453078 -44916906
10556 2297717 13018011 -18548961 25660640 -23631249 -18312345 -17841893 -1676033 -25731381
10548 -25731381 8212143 -24356157 12514545 15743976 39768046 -4544000 20738156
10540D593329c0459779l60529i496844A9006472l22369b7536138D0748298b4636144
10531C1009453o526883H293070a9188525E3645366B2530427a5938785L261382
10524a2677403j5451817B1536414E307305i229449E0952973b4580766l9184936
10517f3765702D4436979m48941j2588779J8273518j4441106A1528097K1413549
10510C2941646J246571g383534I784490c618889B2343808b108132B3273890d684442
10501D6857409E53821b0459742F460149a6905195j286522e285347p463703j0267072
10493b3016122B0793244d4265958d576226l9600415F8381658b2206891Q657230
10486a3549661p235847A1646535i482091m65269M724227H452072M0497562c5033984
$$ plain form
10540 4593329 -30459779 -30820308 -9496844 19006472 18684103 -27536138 40748298 -24636144
10531 31009453 24482570 8293070 -19188525 53645366 22530427 -15938785 -12677403
10524 -12677403 -28129220 21536414 5307305 -9229449 50952973 -24580766 -63765702
10517 -63765702 44436979 43988038 31399259 49672777 35231671 11528097 32941646
10510 32941646 34188217 -7383534 9784490 -3618889 22343808 -2108132 23273890 -4684442
10501 46857409 553821 -20459742 6460149 -16905195 -18191717 -5285347 -12749050 -23016122
10493 -23016122 20793244 -44265958 -4576226 -44176641 68381658 -22206891 -13549661
10486 -13549661 -20785508 11646535 -9482091 -9947360 -5223133 8452072 48949634 -35033984
10477D824713a7548355b5771k7095335A3635905n105542J1297545J2386026N729026
10469C7942960A0330244b7940119e33556I957074k830119R1638c13136G7590076
10460a1441582k669072A8202535F031657Q199547a345119j9442046o99293A312744
10451B406472J2592964H6501e6480883C2129622A167545i821709j0359772A3924598
10442A8954023C893728b6558502a0663897C3912611a7984401B259603b0945937
10434A3994104c3034041O328970A7017912a965988d57657E0222329a3281282C1140115
10425A3964931B160724c8421786J5610441C8433966D341678L280093j129883K8271688
10417C4763576H334779a4113173b590751C9541555c6053859C2356234d296519
$$ plain form
10477 4824713 -17548355 -25771 -27121106 13635905 8530363 19827908 32213934 37942960
10469 37942960 10330244 -27940119 -533556 9957074 7126955 7218593 -313136 77590076
10460 -11441582 -14110654 18202535 6031657 14231204 -1345119 -20787165 -21486458 1312744
10451 2406472 14999436 86501 -56480883 32129622 1167545 -9821709 -20181481 13924598
10442 18954023 3893728 -26558502 -10663897 33912611 -17984401 2259603 -20945937
10434 13994104 -33034041 -26705071 17017912 -1965988 -457657 50222329 -13281282 31140115
10425 13964931 2160724 -38421786 -22811345 38433966 4341678 7621771 6491888 34763576
10417 34763576 8334779 -14113173 -2590751 39541555 -36053859 32356234 -4296519
10409A4582443a1540625A144284K218807K4518745A3197350b5663596A1565907
10401a53721k2713307A836273M8828674b7593076J1927754A452487b4083232B0250513
10392b2543370b006722r985511k2898136B6493695b775665B2864277a5161696
10384g756932B3915076a3738414k0654507A3020073l140018c4410395C401489
10376E888025N583500p72610c4934557E084512L512618P803114L781385a1401647
10367I978493f023719r58504C0394112b1592854m222970C1235769P683539c954603
10358b1392610A7138g258506F522909a2766487A4532922a9254844C989296A863546
10349a178175B711873K8598740b9021459E6646226A5865828K776230E016275J2452595
$$ plain form
10409 14582443 -11540625 1144284 3363091 27881836 13197350 -25663596 11565907
10401 -153721 -22867028 1836273 50664947 -27593076 -15665322 1452487 -24083232 20250513
10392 -22543370 -2006722 -11992233 -34890369 26493695 -2775665 22864277 -15161696
10384 -7756932 23915076 -13738414 -34392921 13020073 9880055 -34410395 3401489
10376 5888025 11471525 10698915 -34934557 5084512 8597130 16400244 20181629 -11401647
10367 9978493 -6023719 -6982223 30394112 -21592854 -25815824 31235769 38919308 -3954603
10358 -21392610 17138 -7258506 6522909 -12766487 14532922 -19254844 3989296 1863546
10349 -1178175 2711873 31310613 -29021459 56646226 15865828 18642058 5016275 17468870
10341A7468870M358225G879269c2816446d094596o6389835B896551b1666951k9252666
10333e0919617D4289445b08821k2541590K47134n876318j040135j1057481A0666483
10324E9218099D182945K3945284b8517492G080987C95826a9339375F217754d0792633
10315D1448583H971335m368820g846965k897365j7124342A538225c8680707D92398
10306C496186N427566O1971608b6431355e943149A558321a5002347B2149662n50087
10298B1599575r437498Q1326a5772095H571010a8203131j6024852B0679167J7489288
10290C8168455C889476a6316639A3418750R63051h372233E0550297A5947712c895642
10281G616538e2238694B4915268o795071b994035j4072340G59966L2457658G204910
$$ plain form
10341 17468870 21827095 7879269 -32816446 -4094596 -70484431 2896551 -21666951 -50919617
10333 -50919617 44289445 -208821 -22750411 -22503277 -28379595 -29419730 -40477211 10666483
10324 59218099 4182945 28128229 -28517492 7080987 395826 -19339375 6217754 -40792633
10315 41448583 8971335 4602515 -7846965 -10744330 -27868672 1538225 -38680707 492398
10306 3496186 8923752 70895360 -26431355 -5943149 1558321 -15002347 22149662 21599575
10298 21599575 12162077 12243403 -15772095 8571010 -18203131 -34227983 20679167 38168455
10290 38168455 3889476 -16316639 13418750 14381801 -8372233 50550297 15947712 -3895642
10281 7616538 -52238694 24915268 18120197 -2994035 -17066375 759966 33217624 7204910
10272i535363p60010A6101239C408099j033498J5227905p033056m65963K074059
10264A2177546C492707J370472R951511B137362L6836403A3869940i114517C8707983
10255d256642j8787881D3772621n75311A282445O834594K0737811b483914j9943672
10247b2427586H103811K9571090a4874191B738424J963164k239937a8384696q295256
10239b6679952Q585578e63564C516466h777694l6109484a8751203L090308A7177116
10230a7391500h062789B5985201j0786936J7688259B328754R066939a7839500
10222a7619446k140451C1180779b4738640I815223f83537l9385056a0674812e148353
10213a5141702C562025b403666j4624788B1744683a6670670C2168213J2502394
$$ plain form
10272 -9535363 -10295373 16101239 3408099 2374601 17602506 10569450 10103487 12177546
10264 12177546 3492707 4863179 14814690 2137362 38973765 13869940 -9114517 38707983
10255 -4256642 -23044523 43772621 43197310 1282445 8117039 28854850 -2483914 -22427586
10247 -22427586 8103811 37674901 -14874191 2738424 4701588 2461651 -18384696 -26679952
10239 -26679952 -18094374 -563564 3516466 -8777694 -44887178 -18751203 -15660895 17177116
10230 -17391500 -8062789 25985201 15198265 32886524 2328754 11395693 -17839500
10222 -17619446 -19759897 31180779 -24738640 9815223 -683537 -40068593 -10674812 -5148353
10213 -15141702 3562025 -2403666 -17028454 21744683 -16670670 32168213 44670607
10206D4670607j7052108j2622233L523539D011997M6937617a656830C5370248
10198a0579139d630531l78069F7735412a5434297B9023039j2959586D782878a3047565
10189a4205191k35183I716044e214968j4842465h344341k2946741f946252C1942212
10180b1829642j5799821C5320638C454058a9467179d428939B1860954a5099506
10172A1560603C269603d04316l9088403g723928B949898b4676499i826096A749897
10163d827965m215958D961421Q128641a6467041b110451j3752181H194039B118819
10154a646621j3469236l2915235G191049L2593060C586101b368501A159803a183405
10145f635941k5226355D372601a3613115D84042J1836551b0192187j589901j1870649
$$ plain form
10206 44670607 27618499 14996266 18519805 4011997 50949614 -1656830 35370248
10198 -10579139 -4630531 -5008600 67735412 -15434297 29023039 16063453 4782878 -13047565
10189 -14205191 -14440374 9716044 -5214968 -20057433 -8344341 -31291082 -6946252 31942212
10180 -21829642 -37629463 35320638 3454058 -19467179 -4428939 21860954 -15099506
10172 11560603 3269603 -404316 -39492719 -7723928 2949898 -24676499 -9826096 1749897
10163 -4827965 -9043923 4961421 13090062 -16467041 -2110451 -15862632 8194039 2118819
10154 -1646621 -15115857 -48031092 7191049 39784109 3586101 -2368501 1159803 -1183405
10145 -6635941 -31862296 4372601 -13613115 484042 12320593 -20192187 -21782088 -33652737
10137c3652737n20027B4823419c1575616P983878Q972183A8724603i283287N55920
10129h727367j1267288r067263C732115K0937388B619517J4854174e441311D176405
10120c6368799P740123B8596607m046088F658669b107092c23272C754057O265905
10112A0019962b1153647H070567d5035442A1699602R832365d819495j2058021
10105a6877516c343198n141892A8273461a2818958H897496N853314M183729P775269
10097B6709808a5919058A9039048D199371a677795B0760269i556130R18265k947433
10089a1585298A8262261k040203l612167c1264623i325227C6844653r864821p031875
10081A9947957a6129563l7582152b1860731k531021N666214D559538a9518599
$$ plain form
10137 -33652737 -34172764 24823419 -31575616 -23591738 -14619555 18724603 -9283287 -8727367
10129 -8727367 -19994655 -29061918 3732115 24669503 2619517 17473691 -5441311 4176405
10120 -36368799 -28628676 28596607 24550519 6658669 -2107092 -323272 3754057 10019962
10112 10019962 -21153647 8070567 -45035442 11699602 21531967 -4819495 -16877516
10105 -16877516 -3343198 -8485090 18273461 -12818958 8897496 14750810 18934539 26709808
10097 26709808 -15919058 19039048 4199371 -1677795 20760269 -9556130 -8637865 -11585298
10089 -11585298 18262261 16222058 12609891 -31264623 -9325227 36844653 26979832 19947957
10081 19947957 -16129563 -53711715 -21860731 -24391752 -18725538 4559538 -19518599
$$ [...]
##END NTUPLES=NMR SPECTRUM
##END=
