##TITLE=ST0000_MeOD-4_7212735_VkaFngzLdu
##JCAMPDX= 6.0         $$ Bruker NMR JCAMP-DX V2.0
##DATA TYPE= NMR SPECTRUM
##DATA CLASS= NTUPLES
##ORIGIN= BRUKER
##OWNER= Administrator
$$ 1.72 TOPSPIN		Version 2.1
$$ 2013-11-22 21:29:03.972 -0800  Administrator@X
$$ Compression mode = diff/dup
##.OBSERVE FREQUENCY= 400.02188249412
##.OBSERVE NUCLEUS= ^1H
##.ACQUISITION MODE= SIMULTANEOUS (DQD)
##.ACQUISITION SCHEME= undefined
##.AVERAGES= 4
##.DIGITISER RES= 22
##SPECTROMETER/DATA SYSTEM= spect
##.PULSE SEQUENCE= zgpsd0
##.SOLVENT NAME= COFFEE_meoh
##.SHIFT REFERENCE= INTERNAL, COFFEE_meoh, 1, 14.98509
##AUDIT TRAIL= $$ (NUMBER, WHEN, WHO, WHERE, PROCESS, VERSION, WHAT)
$$ ##TITLE= Audit trail, TOPSPIN		Version 2.1
$$ ##JCAMPDX= 5.01
$$ ##ORIGIN= Bruker BioSpin GmbH
$$ ##OWNER= Administrator
$$ $$ E:\/data/COFFEE/nmr/ST0000_MeOD-4_7212735_VkaFngzLdu/21/pdata/1/auditp.txt
$$ ##AUDIT TRAIL=  $$ (NUMBER, WHEN, WHO, WHERE, PROCESS, VERSION, WHAT)
(   1,<2013-11-22 21:28:57.425 -0800>,<Administrator>,<X>,<go>,<TOPSPIN 2.1>,
      <created by zg
	started at 2013-11-22 21:27:49.863 -0800,
	POWCHK enabled, PULCHK disabled,
       configuration hash MD5:
       C8 4E 4E 5D D3 5C D8 9E 9F 52 82 E0 59 8A DE 15
       data hash MD5: 64K
       31 F1 08 37 7C 61 E5 7F AD B7 96 7D 56 B3 32 F5>)
(   2,<2013-11-22 21:29:00.253 -0800>,<Administrator>,<X>,<proc1d>,<TOPSPIN 2.1>,
      <Start of raw data processing
       efp LB = 0 FT_mod = 6 PKNL = 1 PHC0 = 0 PHC1 = 0 SI = 32K 
       data hash MD5: 32K
       73 E7 F6 A6 DF 6A F5 42 58 C7 6D 8D 16 F5 4E 90>)
(   3,<2013-11-22 21:29:00.550 -0800>,<Administrator>,<X>,<proc1d>,<TOPSPIN 2.1>,
      <pk PHC0 = -63.44055 PHC1 = 0 
       data hash MD5: 32K
       93 76 22 34 C7 2D 28 E4 E6 4D B5 40 EB 72 AE 0C>)
(   4,<2013-11-22 21:29:00.644 -0800>,<Administrator>,<X>,<proc1d>,<TOPSPIN 2.1>,
      <abs ABSG = 1 
       data hash MD5: 32K
       04 5E 64 07 88 98 DD BC FE 14 E4 F9 D1 58 2D 29>)
(   5,<2013-11-22 21:29:00.707 -0800>,<Administrator>,<X>,<proc1d>,<TOPSPIN 2.1>,
      <abs ABSG = 2 
       data hash MD5: 32K
       CB 91 FA 31 5C 54 83 93 3C 56 60 38 70 4A D4 6E>)
(   6,<2013-11-22 21:29:00.753 -0800>,<Administrator>,<X>,<proc1d>,<TOPSPIN 2.1>,
      <abs ABSG = 3 
       data hash MD5: 32K
       E7 DD F3 84 66 E7 85 70 D6 F6 AB 8A 05 0E 5C EA>)
(   7,<2013-11-22 21:29:00.800 -0800>,<Administrator>,<X>,<proc1d>,<TOPSPIN 2.1>,
      <abs ABSG = 4 
       data hash MD5: 32K
       B0 88 22 90 49 32 4E F9 D0 32 93 DB 9A 27 12 F0>)
(   8,<2013-11-22 21:29:00.863 -0800>,<Administrator>,<X>,<proc1d>,<TOPSPIN 2.1>,
      <abs ABSG = 5 
       data hash MD5: 32K
       B1 BA 65 19 F2 D2 9B AE E6 B2 D1 88 DB DB E8 94>)
$$ ##END=
$$ 
$$ $$ hash MD5
$$ $$ AC 60 30 6A DE 42 54 91 93 8A 17 8F A3 D3 A0 B1
##$RELAX= 
##$RELAX= 
##$RELAX= 
##$RELAX= 
##$RELAX= 
##$RELAX= 
##$RELAX= 
##$RELAX= 
$$ Bruker specific parameters
$$ --------------------------
##$DU= <E:\>
##$EXPNO= 21
##$NAME= <ST0000_MeOD-4_7212735_VkaFngzLdu>
$$ [...]
150 150 150 150 150 150 150 150
##$TP07= 0
##$TPNAME0= <>
##$TPNAME1= <>
##$TPNAME2= <>
##$TPNAME3= <>
##$TPNAME4= <>
##$TPNAME5= <>
##$TPNAME6= <>
##$TPNAME7= <>
##$TPOAL= (0..7)
0.5 0.5 0.5 0.5 0.5 0.5 0.5 0.5
##$TPOFFS= (0..7)
0 0 0 0 0 0 0 0
##$TUNHIN= 0
##$TUNHOUT= 0
##$TUNXOUT= 0
##$USERA1= <user>
##$USERA2= <user>
##$USERA3= <user>
##$USERA4= <user>
##$USERA5= <user>
##$V9= 5
##$VALIST= <valist>
##$VCLIST= <CCCCCCCCCCCCCCC>
##$VD= 0
##$VDLIST= <DDDDDDDDDDDDDDD>
##$VPLIST= <PPPPPPPPPPPPPPP>
##$VTLIST= <TTTTTTTTTTTTTTT>
##$WBST= 1024
##$WBSW= 4
##$XGAIN= (0..3)
0 0 0 0
##$XL= 0
##$YL= 0
##$YMAX_a= 301
##$YMIN_a= -543
##$ZGOPTNS= <>
##$ZL1= 120
##$ZL2= 120
##$ZL3= 120
##$ZL4= 120
##$ABSF1= 14.98509
##$ABSF2= -5.573092
##$ABSG= 5
##$ABSL= 3
##$ALPHA= 0
##$AQORDER= 0
##$ASSFAC= 0
##$ASSFACI= 0
##$ASSFACX= 0
##$ASSWID= 0
##$AUNMP= <proc_prof1d_extract_pilot.lims>
##$AXLEFT= 0
##$AXNAME= <>
##$AXNUC= <1H>
##$AXRIGHT= 0
##$AXTYPE= 0
##$AXUNIT= <>
##$AZFE= 0.1
##$AZFW= 0.1
##$BCFW= 0
##$BC_mod= 0
##$BYTORDP= 0
##$COROFFS= 0
##$CY= 15
##$DATMOD= 1
##$DC= 0
##$DFILT= <>
##$DTYPP= 0
##$F1P= 0
##$F2P= 0
##$FCOR= 0.5
##$FTSIZE= 32768
##$FT_mod= 6
##$GAMMA= 0
##$GB= 0
##$INTBC= 1
##$INTSCL= 1
##$ISEN= 128
##$LB= 0
##$LEV0= 0
##$LPBIN= 0
##$MAXI= 10000
##$MC2= 0
##$MEAN= 0
##$ME_mod= 0
##$MI= 0
##$NCOEF= 0
##$NC_proc= -19
##$NLEV= 6
##$NOISF1= 0
##$NOISF2= 0
##$NSP= 0
##$NTH_PI= 0
##$NZP= 0
##$OFFSET= 14.98509
##$PC= 1
##$PHC0= -63.44055
##$PHC1= 0
##$PH_mod= 1
##$PKNL= yes
##$PPARMOD= 0
##$PPDIAG= 0
##$PPIPTYP= 0
##$PPMPNUM= 2147483647
##$PPRESOL= 1
##$PSCAL= 4
##$PSIGN= 0
##$PYNMP= <proc.py>
##$REVERSE= no
##$SF= 400.02
##$SI= 32768
##$SIGF1= 0
##$SIGF2= 0
##$SINO= 400
##$SIOLD= 32768
##$SPECTYP= <>
##$SREGLST= <1H.CDCl3>
##$SSB= 0
##$STSI= 32768
##$STSR= 0
##$SW_p= 8223.68421052631
##$SYMM= 0
##$S_DEV= 0
##$TDeff= 65536
##$TDoff= 0
##$TI= <>
##$TILT= no
##$TM1= 0
##$TM2= 0
##$TOPLEV= 0
##$USERP1= <user>
##$USERP2= <user>
##$USERP3= <user>
##$USERP4= <user>
##$USERP5= <user>
##$WDW= 1
##$XDIM= 32768
##$YMAX_p= 288554282
##$YMIN_p= -112982818
##$CURPLOT= <Network HP LaserJet P1505>
##$CURPRIN= <$Network HP LaserJet P1505>
##$DFORMAT= <normdp>
##$LAYOUT= <+/1D_H.xwp>
##$LFORMAT= <normlp>
##$PFORMAT= <normpl>
##$SURQMSG= 1
$$ End of Bruker specific parameters
$$ ---------------------------------
##NTUPLES= NMR SPECTRUM
##VAR_NAME=  FREQUENCY,     SPECTRUM/REAL,   SPECTRUM/IMAG
##SYMBOL=    X,             R,               I
##VAR_TYPE=  INDEPENDENT,   DEPENDENT,       DEPENDENT
##VAR_FORM=  AFFN,          ASDF,            ASDF
##VAR_DIM=   32768,         32768,           32768
##UNITS=     HZ,            ARBITRARY UNITS, ARBITRARY UNITS
##FACTOR=    0.250966925370066, 1,           1
##FIRST=     8223.43324360094, -5054918,     24511600
##LAST=      0,             3766850,         -13463390
##MIN=       0,             -112982818,      0
##MAX=       8223.43324360094, 288554282,    0
$$ Real data points
##PAGE= N=1
##DATA TABLE= (X++(R..R)), XYDATA
$$ [...]
##PAGE= N=2
##DATA TABLE= (X++(I..I)), XYDATA
18241c791877C9052742h260318r904621b282931k455992C4391087A0929469a0068155
$$ -3791877 39052742 -8260318 -18164939 -2282931 -4738923 34391087 10929469 -10068155
18232I096815A930794J1901856c4497062D9374371i773134k4040476a5170696
$$ 9096815 1930794 13832650 -34497062 49374371 -9773134 -33813610 -15170696
18224B8337897c296205J485872B8113722j0003786b2404770e540256A8839763
$$ 28337897 -3296205 -1810333 28113722 18109936 -22404770 -5540256 18839763
18216B588152b4490749E999506L6503862j6798542O756871l376942b7326292H233426
$$ 2588152 -24490749 5999506 42503368 25704826 32461697 29084755 -27326292 8233426
18207B5249776o933626C120255f8310543a516820C0490222j1095095G990484J7692779
$$ 25249776 18316150 3120255 -68310543 -1516820 30490222 19395127 7990484 25683263
18199B5683263d506649k2384532d412189A3799225i123335B3937827a0412254
$$ 25683263 -4506649 -26891181 -4412189 13799225 -9123335 23937827 -10412254
18191C6454119b81569j3259027F895478J9653713p235559c016049C0169644b9088064
$$ 36454119 -281569 -13540596 6895478 26549191 19313632 -3016049 30169644 -29088064
18182E5022737b7516057a2335305B0663488B821298c6470232O02300a6596159
$$ 55022737 -27516057 -12335305 20663488 2821298 -36470232 -35867932 -16596159
18174C2432904D217037c2684670a076159q075121A2266846a0866832D9671751
$$ 32432904 4217037 -32684670 -1076159 -9151280 12266846 -10866832 49671751
18166b0730627K353117F6599K5130849a0824584D0555021j2852525K472871A3814977
$$ -20730627 -18377510 66599 25197448 -10824584 40555021 27702496 30175367 13814977
18157C3019813e0739201a4979626L842666B9466882b689727p551345m32077j4050248
$$ 33019813 -50739201 -14979626 -11136960 29466882 -2689727 -10241072 -10673149 -24723397
18149b4723397B9519071a3397528A465603K7690838j3224143D825991a4566055
$$ -24723397 29519071 -13397528 1465603 29156441 15932298 4825991 -14566055
18141D8947429q473059a1217602A7469939a2652592E7639019a4060844B764178
$$ 48947429 40474370 -11217602 17469939 -12652592 57639019 -14060844 2764178
18133b6510881B6263597R632418i677130F727241b1307035A4284832K625700n803274
$$ -26510881 26263597 35896015 -9677130 6727241 -21307035 14284832 16910532 11107258
18125A1107258a7895871c561789j7852527A2740545M498085c8101732b994528
$$ 11107258 -17895871 -3561789 -21414316 12740545 17238630 -38101732 -2994528
18117c9821494K869965A2537932a3666308C0306487c448283l0034841I910756
$$ -39821494 -36951529 12537932 -13666308 30306487 -3448283 -33483124 9910756
18109e823454A21226a0661577j9529262J0499903B312269K4760844B717844A28842
$$ -5823454 121226 -10661577 -30190839 -19690936 2312269 27073113 2717844 128842
18100A9016278O822326a5983470j0565121B5625023G390891r09183A165059K6978255
$$ 19016278 25838604 -15983470 -26548591 25625023 7390891 6481708 1165059 28143314
18092B8143314A567799K3626082a0848435G373337a5252213H829398K4106928
$$ 28143314 1567799 25193881 -10848435 7373337 -15252213 8829398 32936326
18085C2936326e369136a477615A4816738k7491E682440e440109F9905539D400281
$$ 32936326 -5369136 -1477615 14816738 14789247 5682440 -5440109 69905539 4400281
18076A8677564R095786r044626A208614a5476650a397974D135492Q186846c64391
$$ 18677564 27773350 18728724 1208614 -15476650 -1397974 4135492 12322338 -364391
18067c1465978i967701M032449B049669f419986j8437935M339617f743239C1151093
$$ -31465978 -9967701 -5935252 2049669 -6419986 -24857921 -20518304 -6743239 31151093
18058A7260795l145186c280821C9072911b726464B2010556a5262681C8140589
$$ 17260795 14115609 -3280821 39072911 -2726464 22010556 -15262681 38140589
18050A3626054i915489k099434I722209J9383744b9423070B0098915H193299J6648212
$$ 13626054 -9915489 -12014923 9722209 29105953 -29423070 20098915 8193299 24841511
18042B4841511d0417370H032621J8284650q080472a0891738A719704L9386430
$$ 24841511 -40417370 8032621 26317271 18236799 -10891738 1719704 41106134
18035D1106134A8845673E95658b6711904B551245M2376075b444187k3675338D571713
$$ 41106134 18845673 595658 -26711904 2551245 44927320 -2444187 -26119525 4571713
18026a4799506A2028105c3108498c870322j8893551N270548A1249674p45150a1019356
$$ -14799506 12028105 -33108498 -3870322 -22763873 -17493325 11249674 10504524 -11019356
18017I26388c0052184A2151294O273723M623384B679119a1566266H619786N596039
$$ 926388 -30052184 12151294 18425017 23048401 2679119 -11566266 8619786 14215825
18009A4215825a6834686O132430d048803m119980o275048k2118517H637064O806988
$$ 14215825 -16834686 -10702256 -4048803 -8168783 -14443831 -36562348 8637064 15444052
18001A5444052P595882j516736d11854j3135005I709391a2919444E391576M611940
$$ 15444052 23039934 21523198 -411854 -13546859 9709391 -12919444 5391576 10003516
17993A0003516a0060295j5701869j8017112A3360399J6284011f501332n6689493
$$ 10003516 -10060295 -25762164 -43779276 13360399 29644410 -6501332 -63190825
17986f3190825a9982055A4604407c6856842B0915848h354009k474241q479413
$$ -63190825 -19982055 14604407 -36856842 20915848 -8354009 -10828250 -19307663
17979a9307663A0439545M0223005P420677A9341660a323410l626953D791309K5081075
$$ -19307663 10439545 50662550 58083227 19341660 -1323410 -4950363 4791309 29872384
17971B9872384i435164l143022j548118A3769827a4008286J711295k469441H621364
$$ 29872384 -9435164 -12578186 -14126304 13769827 -14008286 -12296991 -14766432 8621364
17962C643011J0846956b8051533E9071668e420134A4619599R996428r587580b1927493
$$ 3643011 14489967 -28051533 59071668 -5420134 14619599 24616027 15028447 -21927493
17953A6499484J2620964A3595905d7285907h577155A7121418b0388229C8337029
$$ 16499484 29120448 13595905 -47285907 -8577155 17121418 -20388229 38337029
17945b6617968C479136J876586c9161851h009130B423864M1130904c3849585A4173733
$$ -26617968 3479136 5355722 -39161851 -8009130 2423864 43554768 -33849585 14173733
17936b474391B5875199g189712k4779775j036414I266128J8773530h403724m1465450
$$ -2474391 25875199 -7189712 -31969487 -33005901 9266128 28039658 -8403724 -49869174
17928d9869174D5129191m474898d0028278f260088H000683M1201148b1692871
$$ -49869174 45129191 40654293 -40028278 -6260088 8000683 49201831 -21692871
17920a913606k995092k6375014J1017670A5095277b0695241E6243644I033081
$$ -1913606 -4908698 -31283712 -20266042 15095277 -20695241 56243644 9033081
17912a8862689I465114b9656568a1120019M927576J440604n0143244C3797288
$$ -18862689 9465114 -29656568 -11120019 -6192443 -4751839 -54895083 33797288
17904B5019293b7525288f029674D4858673a5949906A0296319J5681067a69694
$$ 25019293 -27525288 -6029674 44858673 -15949906 10296319 25977386 -169694
17896F800157K768987a653014B2214496r408759L6500105J0620091f08368D011020
$$ 6800157 9569144 -1653014 22214496 12805737 49305842 59925933 -608368 4011020
17887B6095053B165374J6995731d228341E749090K0549561j1527801b3561144
$$ 26095053 2165374 19161105 -4228341 5749090 26298651 14770850 -23561144
17879B8298885A249756g384136B4362279p126549F813730L4600259e1444933a9405308
$$ 28298885 1249756 -7384136 24362279 17235730 6813730 41413989 -51444933 -19405308
17870A8406617J3443074N006970j5457310b620856H862288J8290507m82453a4527771
$$ 18406617 31849691 36856661 21399351 -2620856 8862288 27152795 26670342 -14527771
17861f134898B091322L9143631A1192769J2197030a2810997c537532q70490o318083
$$ -6134898 2091322 41234953 11192769 23389799 -12810997 -3537532 -4408022 -10726105
17853a0726105G9310793B4275874c535576A6962320L9089730k7656143E78063
$$ -10726105 79310793 24275874 -3535576 16962320 56052050 28395907 578063
17845g600266A9882717B160023c4743534d567249m918136B7718909e806094A5465470
$$ -7600266 19882717 2160023 -34743534 -4567249 -9485385 27718909 -5806094 15465470
17836h231026F24733K049432K9261895f5635377A6403690o143558a1770653c496750
$$ -8231026 624733 2674165 31936060 -65635377 16403690 10260132 -11770653 -3496750
17827B969098J672003N264495c806226p464538A6938866G205819a2732549l0071779
$$ 2969098 4641101 9905596 -3806226 -11270764 16938866 7205819 -12732549 -42804328
17819d2804328A503207J5675345E806089J145085a8916362k6105987O232521B6899665
$$ -42804328 1503207 17178552 5806089 6951174 -18916362 -45022349 -38789828 26899665
17810C8988135o118396G901498P068364J0272126q803945a7602083C993957d9458590
$$ 38988135 32869739 7901498 14969862 25241988 16438043 -17602083 3993957 -49458590
17801A1432231L433446a9015062k607338R185717B5205704c7230237B9484360
$$ 11432231 14865677 -19015062 -21622400 -12436683 25205704 -37230237 29484360
17793H564733P455895J5759282c7472843B116188K6344242L294690A702996a3587464
$$ 8564733 16020628 31779910 -37472843 2116188 28460430 31755120 1702996 -13587464
17784a2088957L674495l3409867a0226658A7121412c010468k9116154P398925
$$ -12088957 -8414462 -41824329 -10226658 17121412 -3010468 -32126622 -24727697
17777b4727697N572159E699680c2495172h847777I145065J6647532r498765a3359859
$$ -24727697 -19155538 5699680 -32495172 -8847777 9145065 25792597 16293832 -13359859
17768d9323717A7951126B315893b0959859D3188703g050025k1095005J1511743
$$ -49323717 17951126 2315893 -20959859 43188703 -7050025 -28145030 -16633287
17761a6633287j366050d362932A2049802g417855j1094804B9321824D341227h08327
$$ -16633287 -17999337 -4362932 12049802 -7417855 -18512659 29321824 4341227 -808327
17752F956060L6351284i302904A2545753a845020E040496I01215a1595535G592069
$$ 6956060 43307344 -9302904 12545753 -1845020 5040496 901215 -11595535 7592069
17743c3652385D60767d2225272B3481391f770356D234799g503777D1411072b8314161
$$ -33652385 460767 -42225272 23481391 -6770356 4234799 -7503777 41411072 -28314161
17734A0193036d9537012C393816M5870037B00456O796337C320639b6782779J2516061
$$ 10193036 -49537012 3393816 49263853 200456 6996793 3320639 -26782779 -14266718
17726a4266718B238847K354840d72078B5736102D350681K5183936a0029187A4151807
$$ -14266718 2238847 4593687 -472078 25736102 4350681 29534617 -10029187 14151807
17717C3601053Q18117K904128B822344P084890g759012D1466648A2359203a9581574
$$ 33601053 34419170 37323298 2822344 9907234 -7759012 41466648 12359203 -19581574
17708b8882601D5044557g788090r431398a443401B1523398i374619A4128055g212128
$$ -28882601 45044557 -7788090 -17219488 -1443401 21523398 -9374619 14128055 -7212128
17699a3729029K432320j0287728B0714753j426694J7666583j4190120b488206
$$ -13729029 -11296709 -21584437 20714753 19288059 36954642 22764522 -2488206
17691D624432K530385h026117J604981j7510979B2986340m440002B110295L687371
$$ 4624432 7154817 -8026117 -6421136 -23932115 22986340 18546338 2110295 5797666
17683E797666c9828866f961874C738135L1047726A5461391m443699d5732071D2004592
$$ 5797666 -39828866 -6961874 3738135 34785861 15461391 11017692 -45732071 42004592
17674C2803514j331138g326458J287198B596938b33045B1025699O594663E209408
$$ 32803514 31472376 -7326458 -6039260 2596938 -233045 21025699 27620362 5209408
17665a7042726F0738665b5757952B3850155c605918E557622J3829724a3363936
$$ -17042726 60738665 -25757952 23850155 -3605918 5557622 19387346 -13363936
17657a9240385j7138008B8161254a6328080C0025965G18489L9652417H074714
$$ -19240385 -36378393 28161254 -16328080 30025965 718489 40370906 8074714
17649b5101789D59894K3184316A0029439J7451961p358510e412443m3819078b2060723
$$ -25101789 459894 23644210 10029439 27481400 20122890 -5412443 -49231521 -22060723
17640B0562218A110026L1287875n976863j1981776i230276K961784j7816667a1584457
$$ 20562218 1110026 32397901 26421038 14439262 -9230276 -6268492 -24085159 -11584457
17631H82795L7246702H783800b0488367C5781025A4148065m54691M119920M650275
$$ 882795 38129497 8783800 -20488367 35781025 14148065 13693374 17813294 22463569
17623B2463569e491829D201930H41595i302247J386044p201277A5681248J6404119
$$ 22463569 -5491829 4201930 841595 -9302247 -7916203 -15117480 15681248 32085367
17615C2085367A3545341L5592941d549458j965244B5675608A1626899l8119g342391
$$ 32085367 13545341 49138282 -4549458 -6514702 25675608 11626899 11588780 -7342391
17606b8117374D44103M2314033D394285J1055658a5831334A6636616b8496172
$$ -28117374 444103 42758136 4394285 15449943 -15831334 16636616 -28496172
17598d077089B2721970j527992a2386904P93988C972859d0452936a7539219E507624
$$ -4077089 22721970 21193978 -12386904 -11592916 3972859 -40452936 -17539219 5507624
17589B2312943J022625F111582i830205J248917B1056051b961555A0911659J6459325
$$ 22312943 23335568 6111582 -9830205 -8581288 21056051 -2961555 10911659 27370984
17581B7370984E039319d548936J725735B004363a5055592j6734459B6349983j3033253
$$ 27370984 5039319 -4548936 -2823201 2004363 -15055592 -31790051 26349983 13316730
17573A3316730o264383c3504719B3710751a1867177C6271873a9499590j4166387
$$ 13316730 7052347 -33504719 23710751 -11867177 36271873 -19499590 -33665977
17566c3665977i0903j3551341c905728n728616E2920864B0757477d871189H833944
$$ -33665977 -90903 -13642244 -3905728 -9634344 52920864 20757477 -4871189 8833944
17557C2108299Q504919d448895a96827C6417970q880888j133116i755789n326650
$$ 32108299 40613218 -4448895 -196827 36417970 27537082 26403966 -9755789 -15082439
17549a5082439M877113E664961J488441J7345501A1604024J2919232O520006A1041196
$$ -15082439 -10205326 5664961 7153402 24498903 11604024 24523256 31043262 11041196
17540b4787907B1572034c0338142J5026381A9940330J3008599d0381119d53330
$$ -24787907 21572034 -30338142 -15311761 19940330 32948929 -40381119 -453330
17532C9921059c1270411C8752118j337374c0426127H133691d986194j0593436
$$ 39921059 -31270411 38752118 37414744 -30426127 8133691 -4986194 -15579630
17525a5579630A511453L1790648c739130A1433933i463079L578747j5521276L246964
$$ -15579630 1511453 33302101 -3739130 11433933 -9463079 -5884332 -21405608 -18158644
17517a8158644A8737739a2120747j4876148A7344052m991946b585713C220014
$$ -18158644 18737739 -12120747 -26996895 17344052 12352106 -2585713 3220014
17509A5608881a6921230e64736k3100904B8564065F509919J4190671n571054b3895063
$$ 15608881 -16921230 -564736 -23665640 28564065 6509919 20700590 15129536 -23895063
17500I751917a1549457I097604J020348C029982e1457769K5336602i648060n721944
$$ 9751917 -11549457 9097604 10117952 3029982 -51457769 -26121167 -9648060 -15370004
17492a5370004L936907I924235K1089359a012784B1181505j874499a9586271A039143
$$ -15370004 -11433097 9924235 31013594 -1012784 21181505 19307006 -19586271 1039143
17483g321245J257494B6204736n859053L947268b113963B26048J2624456d0855499
$$ -7321245 -6063751 26204736 20345683 24292951 -2113963 226048 12850504 -40855499
17474a3814520G561290M0923625e592703j7415066a1202923k8302007B2229738
$$ -13814520 7561290 48484915 -5592703 -23007769 -11202923 -39504930 22229738
17466e082235B7115072G607297l698444a2201796k7600458a3683039m433900I803476
$$ -5082235 27115072 7607297 3908853 -12201796 -39802254 -13683039 -18116939 9803476
17457a7380095b725198j3771313A4846517K4315118j8189918f430258m3064908
$$ -17380095 -2725198 -16496511 14846517 39161635 20971717 -6430258 -49495166
17450d9495166a8529509C68765M390366a8704507A7337527K1811834j5492351
$$ -49495166 -18529509 368765 4759131 -18704507 17337527 39149361 23657010
17443B3657010c08927C2357679E094535k272496J2758185J8469748N87986a9086452
$$ 23657010 -308927 32357679 5094535 2822039 15580224 34049972 34637958 -19086452
17434a5987756B4337590h977906A9092698F665609J8177776j2119388J7353248
$$ -15987756 24337590 -8977906 19092698 6665609 24843385 12723997 30077245
17427C0077245D848588L127710i845308b976064j4349031c85757A5770208o865587
$$ 30077245 4848588 7976298 -9845308 -2976064 -17325095 -385757 15770208 8904621
17419H904621i849403a49286C1556946B33838d7862184F887495G36283J2420643
$$ 8904621 -9849403 -149286 31556946 233838 -47862184 6887495 736283 13156926
17411A3156926E410656J5168966b9064313h088119a786341r299659A1063756f617690
$$ 13156926 5410656 20579622 -29064313 -8088119 -1786341 -11086000 11063756 -6617690
17402b5719013G01945J5435599K2790006E950686O5536399b70381j8700831j7103987
$$ -25719013 701945 16137544 38927550 5950686 71487085 -270381 -18971212 -36075199
17394c6075199c207415A8512533H076547l62859a9569259D848303c545397B6034329
$$ -36075199 -3207415 18512533 8076547 7713688 -19569259 4848303 -3545397 26034329
17385b3973805J1370700C2989979A0222416b7980198D3489597I922996b311776
$$ -23973805 -12603105 32989979 10222416 -27980198 43489597 9922996 -2311776
17377B6467306n858593L5006622G058606R171580K7879774r552548a3035941D0556922
$$ 26467306 20608713 55615335 7058606 16230186 44109960 34557412 -13035941 40556922
17368E931816i143748G463305a0067914A3327988e577072F017543K871459a6149687
$$ 5931816 -9143748 7463305 -10067914 13327988 -5577072 6017543 8889002 -16149687
17359A8912340d073578A8948672q842058J7927007a8710698C8437382E728935
$$ 18912340 -4073578 18948672 10106614 28033621 -18710698 38437382 5728935
17351A7560965J6689242A3272714b6317815M363917e666652B297887K6156155
$$ 17560965 34250207 13272714 -26317815 -21953898 -5666652 2297887 28454042
17344B8454042E052770b7804805J143216i952279B2815250b978287C5444793F446699
$$ 28454042 5052770 -27804805 -26661589 -9952279 22815250 -2978287 35444793 6446699
17335B0629005K2921021k409160F049825J2215258F894654d709145A0775428m951827
$$ 20629005 43550026 41140866 6049825 18265083 6894654 -4709145 10775428 5823601
17327E823601K5821016B179898f172972F627451A969782K7013108b6285803A2626709
$$ 5823601 31644617 2179898 -6172972 6627451 1969782 28982890 -26285803 12626709
17318A9953031a1283798A4275856i696253j8276844d053958j0596623J989202
$$ 19953031 -11283798 14275856 -9696253 -27973097 -4053958 -14650581 -12661379
17311a2661379j9710635B9389983j3473473J0837873B94867a2277255A7295751
$$ -12661379 -32372014 29389983 15916510 26754383 294867 -12277255 17295751
17303a9586630C7283947i892550D1877425j9586535a4765387a636384j0338974
$$ -19586630 37283947 -9892550 41877425 22290890 -14765387 -1636384 -11975358
17296a1975358E871897O494987J9178348A824308a5133686j211106H338507c4331079
$$ -11975358 5871897 12366884 31545232 1824308 -15133686 -16344792 8338507 -34331079
17287B0733524K2066911I153399C974449O700760a5452968P35134F308405J4122026
$$ 20733524 42800435 9153399 3974449 10675209 -15452968 -14717834 6308405 20430431
17279B0430431a7401682A3410752M333512n690005L2634175g301593r95062B041188
$$ 20430431 -17401682 13410752 17744264 12054259 44688434 -7301593 -8296655 2041188
17270g648089C2532083a021896C4150463j1436391C698544K3737j043719h239022
$$ -7648089 32532083 -1021896 34150463 22714072 3698544 3722281 2678562 -8239022
17261B0623779a4501121A8685685m80037a9908028B5542365G661804L238454j594836
$$ 20623779 -14501121 18685685 18205648 -19908028 25542365 7661804 10900258 9305422
17253I305422b0067787Q441367j3583029A4924176c3394976D58208P499229a9154034
$$ 9305422 -20067787 -11626420 -25209449 14924176 -33394976 458208 7957437 -19154034
17244a3469660K327072A5387649F870381J288131g060612A5763650e639334k806246
$$ -13469660 -11142588 15387649 6870381 8158512 -7060612 15763650 -5639334 -8445580
17236h445580B1427435j0243399A994482M1936288d482161H493038c4006079D8239092
$$ -8445580 21427435 11184036 1994482 43930770 -4482161 8493038 -34006079 48239092
17227A514868d8263046A2823756d166933F977288c923077A7691195b1012150c174091
$$ 1514868 -48263046 12823756 -4166933 6977288 -3923077 17691195 -21012150 -3174091
17218d677980A949524K2189265h481270b205859C5273472l629145a6145531j5373682
$$ -4677980 1949524 24138789 -8481270 -2205859 35273472 31644327 -16145531 -31519213
17210c1519213J1809251b833506A2161185O319586a6121968B7624361a024284
$$ -31519213 -19709962 -2833506 12161185 18480771 -16121968 27624361 -1024284
17202a99828A598763N152880a1561804k599585B8855811A1826060J9682042e646718
$$ -199828 1598763 6751643 -11561804 -14161389 28855811 11826060 31508102 -5646718
17193f516189a611688F410943O426743C681655n61470f1681950A3802640c3194237
$$ -6516189 -1611688 6410943 12837686 3681655 3120185 -61681950 13802640 -33194237
17184b0082257c432148J239695m227690D5005161c1896987A0117551a0965469
$$ -20082257 -3432148 -2192453 -6420143 45005161 -31896987 10117551 -10965469
17176C540384b980682B525831i348967J85597B2242589D134570b8291447A6476349
$$ 3540384 -2980682 2525831 -9348967 -9163370 22242589 4134570 -28291447 16476349
17167a5275034C738257J0229275K6363470a0302475A1682815L801183K5928761
$$ -15275034 3738257 13967532 40331002 -10302475 11682815 15483998 41412759
17160D1412759b0660331L730353I28504J1509097K0731355D840381c179027C8199271
$$ 41412759 -20660331 -16929978 928504 12437601 33168956 4840381 -3179027 38199271
17151i76361A1951264a8924065A3491999L315898a1994780A9605262a7320274
$$ -976361 11951264 -18924065 13491999 16807897 -11994780 19605262 -17320274
17143A6636075o390669b2034321d472325F513565M328824a8250715j3866852A8001578
$$ 16636075 10245406 -22034321 -4472325 6513565 10842389 -18250715 -32117567 18001578
17134B581212K099703c4474754E252497J121894d168461B4017868j0214584c2150160
$$ 2581212 4680915 -34474754 5252497 6374391 -4168461 24017868 13803284 -32150160
17125a935496G509186J2163822a1285400e085978o24333j5250392f726304o912328
$$ -1935496 7509186 19673008 -11285400 -5085978 -5710311 -20960703 -6726304 -13638632
17117a3638632D6331988c5576164J2659436r245165I134597a0175661k2098224
$$ -13638632 46331988 -35576164 -22916728 -32161893 9134597 -10175661 -32273885
17110c2273885R637997R259011B6197701j0035111a9934938f717860H744986b790411
$$ -32273885 -22635888 -13376877 26197701 16162590 -19934938 -6717860 8744986 -2790411
17101c0377934a2310503K346316A9907354c597650R88459A2844202O786780a5968530
$$ -30377934 -12310503 -9964187 19907354 -3597650 -2609191 12844202 19630982 -15968530
17092C3727872o10116q694224A1206110P50830A014094h379266D6201025B146214
$$ 33727872 33117756 24423532 11206110 11956940 1014094 -8379266 46201025 2146214
17083a493983A4020288k02436a1743326M035593B5280716l172122b7755655B5025620
$$ -1493983 14020288 13817852 -11743326 -7707733 25280716 22108594 -27755655 25025620
17074C2095056G142172K4808269e851233b387658A7457668a0426662A4624014
$$ 32095056 7142172 31950441 -5851233 -2387658 17457668 -10426662 14624014
17066g290749A8413624A926181O535798b1086731c221750k4359225G719364e2753940
$$ -7290749 18413624 1926181 8461979 -21086731 -3221750 -27580975 7719364 -52753940
17057B0276650E094229c092237C2218426A2620671n025768K048642f088088q361444
$$ 20276650 5094229 -3092237 32218426 12620671 7594903 9643545 -6088088 -14449532
17049a4449532L903028E6180957c1143675C0003749J1310735g382558B56421a4513321
$$ -14449532 -10546504 56180957 -31143675 30003749 41314484 -7382558 256421 -14513321
17040B7207108G932581M924459B94170M781938Q53190P661461d754394A9520429
$$ 27207108 7932581 12857040 294170 5076108 5929298 13590759 -4754394 19520429
17031b6595710f379220A1448666a1958228D711088b0068223A4703377i514799
$$ -26595710 -6379220 11448666 -11958228 4711088 -20068223 14703377 -9514799
17023a1285930A0452736D067377b0419585P524454A156482c6148223h729535C6158685
$$ -11285930 10452736 4067377 -20419585 -12895131 1156482 -36148223 -8729535 36158685
17014d856750H93840c286939E2269439a2481673B7797998b6595315C2330556n015304
$$ -4856750 893840 -3286939 52269439 -12481673 27797998 -26595315 32330556 27315252
17006B7315252M0418773c3672834P086373D3380003A326898o37003J0135757K4191724
$$ 27315252 67734025 -33672834 -26586461 43380003 1326898 689895 10825652 35017376
16998C5017376e8178587A190361b8173019B6153534b9726981J3912720K608487
$$ 35017376 -58178587 1190361 -28173019 26153534 -29726981 -15814261 -13205774
16991a3205774B1934732n081727a0022826k3801339c212276C676268a6186874
$$ -13205774 21934732 16853005 -10022826 -33824165 -3212276 3676268 -16186874
16983b1665972D854919c8909036a7134952A5989960a5236820A6986395a1928152
$$ -21665972 4854919 -38909036 -17134952 15989960 -15236820 16986395 -11928152
16975A9927933F251150L5618027a4066518B2027260J0983839j6242656Q233955
$$ 19927933 6251150 41869177 -14066518 22027260 33011099 16768443 25002398
16968B5002398r028357c7598948M491644A0483535a7272880b495767B6308621
$$ 25002398 15974041 -37598948 -33107304 10483535 -17272880 -2495767 26308621
16960b2529409L007876Q918232B1323273m240105a550421j3815926o393861g343028
$$ -22529409 -19521533 -10603301 21323273 17083168 -1550421 -15366347 -21760208 -7343028
16951B1045529L78099b1019187I904352M898750J9549421G281228M7575570n283133
$$ 21045529 21423628 -21019187 9904352 14803102 34352523 7281228 54856798 49573665
16943D9573665a9352583a408072B3154025a2755127N467143n311962j6689156
$$ 49573665 -19352583 -1408072 23154025 -12755127 -7287984 -12599946 -29289102
16936b9289102C6415510j7392272a630876l578191A3252743b5695774f430448
$$ -29289102 36415510 19023238 -1630876 -5209067 13252743 -25695774 -6430448
16928b3392601B3306254d747635A2858603J4571431J0452457q442735b1375586
$$ -23392601 23306254 -4747635 12858603 27430034 37882491 29439756 -21375586
16920a7790280C4624347A3547985e632312j100070B9565370j2233901a5551249
$$ -17790280 34624347 13547985 -5632312 -6732382 29565370 17331469 -15551249
16912E0176402k2057426c499593E034504K943886c3623092A0074131L7960769
$$ 50176402 28118976 -3499593 5034504 7978390 -33623092 10074131 48034900
16905D8034900b1803618F253847a106727r152529C3224656a0121211B1068704
$$ 48034900 -21803618 6253847 -1106727 -10259256 33224656 -10121211 21068704
16897a0294147A9677629b9293479h233856A3836976m851691a6331964m399136
$$ -10294147 19677629 -29293479 -8233856 13836976 8985285 -16331964 -20731100
16890b0731100b894185A728671K1139580K214651J6468551a2245786B3481964
$$ -20731100 -2894185 1728671 22868251 25082902 41551453 -12245786 23481964
16882B7416312A1768580c0422141H412149e9947874K7449211I367693B842274
$$ 27416312 11768580 -30422141 8412149 -59947874 -32498663 9367693 2842274
16874h161001m2202504f823443q897785A993081a6736925j516818B578706b3485470
$$ -8161001 -50363505 -6823443 -15721228 1993081 -16736925 -18253743 2578706 -23485470
16865a248479A0803959c2617610C163862J0007606a9064931A4505662d894204
$$ -1248479 10803959 -32617610 3163862 13171468 -19064931 14505662 -4894204
16857C806945c2302082J0719084B7097784E503579L932047b4497220B226068K0553920
$$ 3806945 -32302082 -21582998 27097784 5503579 9435626 -24497220 2226068 22779988
16849B2779988k458204g877760k5952281B8263383b674518p109297p620904C1071637
$$ 22779988 20321784 -7877760 -33830041 28263383 -2674518 -9783815 -17404719 31071637
16840a2671818A1995455f280465B6596228A1521208a1932286J522248A1108993
$$ -12671818 11995455 -6280465 26596228 11521208 -11932286 -10410038 11108993
16832c94201E610164c6791635a4960669N372394B7747201d584108j2493830A4988466
$$ -394201 5610164 -36791635 -14960669 -9588275 27747201 -4584108 -17077938 14988466
16823b0893786j866502A4092452a1605934B1169036o678530k287602O160063n480647
$$ -20893786 -22760288 14092452 -11605934 21169036 14490506 12202904 18362967 12882320
16815A2882320K122631L342614b7141466B9906041f363543l1200284h052321B4189945
$$ 12882320 15004951 18347565 -27141466 29906041 -6363543 -37563827 -8052321 24189945
16806H195750a7021365K933757E205108k148494J1294734a2992861K218857B1103624
$$ 8195750 -17021365 -14087608 5205108 3056614 14351348 -12992861 -10774004 21103624
16797D8622662j5185898c4426362A2922056g174969B7023006j3427225b0447962
$$ 48622662 33436764 -34426362 12922056 -7174969 27023006 13595781 -20447962
16789d241502l6317595D290241a4042075m620367l011138e833335k482791m252750
$$ -4241502 -40559097 4290241 -14042075 -18662442 -21673580 -5833335 -8316126 -12568876
16781a2568876H505638J6976159b7272193h24196A9047971G202690K2468637j2879207
$$ -12568876 8505638 25481797 -27272193 -824196 19047971 7202690 29671327 16792120
16773A6792120J8682317A7302230J6786536e542887l4137845J7270373A8001325
$$ 16792120 35474437 17302230 34088766 -5542887 -39680732 -22410359 18001325
16765A6107921o312323m10680a8597094C003483L550692c3135069a4486390e221506
$$ 16107921 9795598 9384918 -18597094 3003483 6554175 -33135069 -14486390 -5221506
16756b2399057B8145905A1461873h015342b713159C8981667a4105190b596535
$$ -22399057 28145905 11461873 -8015342 -2713159 38981667 -14105190 -2596535
16748A7627679J0300037J3002611B0265648L5012276k3290317A241886N648447
$$ 17627679 27927716 40930327 20265648 55277924 31987607 1241886 6890333
16741F890333c8195338g169971k5542411j1974976B6260580b0071473M819798
$$ 6890333 -38195338 -7169971 -32712382 -44687358 26260580 -20071473 -15251675
16734a5251675E188902K428935d37541A5404199b270530k792729p474608D336794
$$ -15251675 5188902 7617837 -437541 15404199 -2270530 -5063259 -12537867 4336794
16725b2857386G010433j17290i904742A543282K2672163O8159393B559278b662871
$$ -22857386 7010433 6893143 -9904742 1543282 24215445 92374838 2559278 -2662871
16716D2891675b4557766f982607C7191152A2517907R196297g143028A7421121
$$ 42891675 -24557766 -6982607 37191152 12517907 21714204 -7143028 17421121
16708A4164034K0011415G164696b6146861A2766011J4848818c2272551B6610545
$$ 14164034 34175449 7164696 -26146861 12766011 27614829 -32272551 26610545
16700e036137j1939778e999709A5984779d5204082N967225a1997721c471431C8567700
$$ -5036137 -16975915 -5999709 15984779 -45204082 -39236857 -11997721 -3471431 38567700
16691A7090783J1060763h580274I355685a1661097l4170327A0837185m865448
$$ 17090783 28151546 -8580274 9355685 -11661097 -45831424 10837185 5971737
16684E971737K5802709k606372b9433342A8990727d4798919A2087455b45886j6479748
$$ 5971737 31774446 29168074 -29433342 18990727 -44798919 12087455 -245886 -16725634
16676a6725634B0235079F373760a8387824m354252j4502058A5459242D40480O861165
$$ -16725634 20235079 6373760 -18387824 -22742076 -37244134 15459242 440480 7301645
16668G301645J3203562b413840l5084719A4565255J554083m655458a0570358a140416
$$ 7301645 20505207 -2413840 -37498559 14565255 16119338 11463880 -10570358 -1140416
16659A1129573C84239R82657a223603p951066A3979683J0480133K0882206C760971
$$ 11129573 384239 1366896 -1223603 -9174669 13979683 24459816 45342022 3760971
16650A3696354O754033b2417142r28618H501811d0479334I964756N5652740B6404260
$$ 13696354 20450387 -22417142 -23345760 8501811 -40479334 9964756 65617496 26404260
16641A5814884L2341517J3602823H4133b3799398B2931676a3502937E554585B07777
$$ 15814884 48156401 61759224 84133 -23799398 22931676 -13502937 5554585 207777
16632f839159C4591425A5800695K0099459Q557766A7871338L1758216e373918
$$ -6839159 34591425 15800695 35900154 44457920 17871338 49629554 -5373918
16624C0244247J793604d2621809J2419105C634696b9779683q780682J3789559
$$ 30244247 32037851 -42621809 -30202704 3634696 -29779683 -38560365 -24770806
16617b4770806j39937D5506882j0666793e156757A2463528e0464769B1308108
$$ -24770806 -24910743 45506882 34840089 -5156757 12463528 -50464769 21308108
16609f012718C529651h100658A7095977D741354J0191538c1299587C1152634c2765389
$$ -6012718 3529651 -8100658 17095977 4741354 14932892 -31299587 31152634 -32765389
16600c0235232C677907a6509737G370552a2649077m435853A54091J0484936C308818
$$ -30235232 3677907 -16509737 7370552 -12649077 -17084930 154091 10639027 3308818
16591H793253c5304495J0479347F476002c4649045J5777883N089348k0226021
$$ 8793253 -35304495 -24825148 6476002 -34649045 -18871162 -13781814 -34007835
16584c4007835m967463C671514b7145319j6793703E065726L3440441b1112323
$$ -34007835 -38975298 3671514 -27145319 -43939022 5065726 38506167 -21112323
16576B5888262A0905100J2825892k164350p721764M87914G077182R439534c2987890
$$ 25888262 10905100 23730992 21566642 13844878 14332792 7077182 16516716 -32987890
16567b1086745a931390E31644N8513461d439519E609291a4939899l0687232a5599343
$$ -21086745 -1931390 531644 59045105 -4439519 5609291 -14939899 -45627131 -15599343
16558A0421334a6346437o476531N961730a609825A5108370a3729271A3740133
$$ 10421334 -16346437 -22822968 -16861238 -1609825 15108370 -13729271 13740133
16550b305520p299504k602044j5629555J1232884o013857A3413184C72391Q585499
$$ -2305520 -9605024 -12207068 -27836623 -16603739 -22617596 13413184 372391 8957890
16542H957890A119432J3676060I16467K087825b493720j8813915B2213931b0136381
$$ 8957890 1119432 14795492 916467 3004292 -2493720 -21307635 22213931 -20136381
16533c5350854f13714o592477j3551785a413077n451659k6675148E957354P819398
$$ -35350854 -613714 -7206191 -20757976 -1413077 -6864736 -33539884 5957354 13776752
16525A3776752F58236c0209689F384332b2031455b982757J158149G19454b0932994
$$ 13776752 658236 -30209689 6384332 -22031455 -2982757 -1824608 719454 -20932994
16516A1003623c675575l6659337a2116861j7672231A0846479n264300A806836
$$ 11003623 -3675575 -40334912 -12116861 -29789092 10846479 5582179 1806836
16508c603458G06599L7012155b2849225C062394b428654m437810G111340A056784
$$ -3603458 706599 37718754 -22849225 3062394 -2428654 -6866464 7111340 1056784
16499G362585J8213781a3118733G959784J0868973a9461999A7485863J6327951
$$ 7362585 25576366 -13118733 7959784 18828757 -19461999 17485863 33813814
16492C3813814a7450424A2208228M942587J9122718b523375B6951488J001055
$$ 33813814 -17450424 12208228 17150815 36273533 -2523375 26951488 27952543
16485B7952543b7376860A7684055J5827208d244558q156619A5103849J736182
$$ 27952543 -27376860 17684055 33511263 -4244558 -12401177 15103849 16840031
16478A6840031P58911b7195549I202270J5626445A0883031a2139073D254411Q970257
$$ 16840031 17598942 -27195549 9202270 24828715 10883031 -12139073 4254411 13224668
16470A3224668A796509H09389a0878139F089116L825786e69523l6030437J3597432
$$ 13224668 1796509 809389 -10878139 6089116 9914902 -569523 -36599960 -23002528
16462b3002528H483239k966083J9493730a4366087N795979m5940984b4751754
$$ -23002528 8483239 5517156 25010886 -14366087 -8570108 -54511092 -24751754
16454B5476806H199001R558988f931807m478519o5665A6720933R402993a5695783
$$ 25476806 8199001 17757989 -6931807 -11410326 -11475991 16720933 26123926 -15695783
16445D419506e890168p474577j0132259q517104a1565854B2290660H285778J9845377
$$ 4419506 -5890168 -13364745 -23497004 -32014108 -11565854 22290660 8285778 28131155
16437B8131155r636907a2598739j952984A2278196J02893L6111148A8574405a0667523
$$ 28131155 18494248 -12598739 -14551723 12278196 12381089 48492237 18574405 -10667523
16428C3501326b2193388G331709d548085H329766K713352J64524K0411494A524926
$$ 33501326 -22193388 7331709 -4548085 8329766 11043118 11207642 31619136 1524926
16419b657839q998133D9248385a9572711g602117B9038432b5777362B0206192
$$ -2657839 -11655972 49248385 -19572711 -7602117 29038432 -25777362 20206192
16411B492027J0036809R883188b587052a184628k714853l8421182J0652372I476426
$$ 2492027 12528836 22412024 -2587052 -1184628 -3899481 -42320663 -31668291 9476426
16402G368011a8741466j1461361B0777930f666383A3506372b3626007c485490
$$ 7368011 -18741466 -30202827 20777930 -6666383 13506372 -23626007 -3485490
16394D09798a7312287C7117225d730023I304510h951933A0165613M234691g322888
$$ 409798 -17312287 37117225 -4730023 9304510 -8951933 10165613 14400304 -7322888
16385a943218l6543221A97900552a3927346A347395a3688471B5368500o679944
$$ -1943218 -38486439 197900552 -13927346 1347395 -13688471 25368500 18688556
16378A8688556a8968499R353543D311276J5211171L44495h295525l4499711G3533343
$$ 18688556 -18968499 -9614956 4311276 19522447 19866942 -8295525 -42795236 73533343
16369E045975b292327C4430424g965455C7837483J6686243i972305G543210R847418
$$ 5045975 -2292327 34430424 -7965455 37837483 54523726 -9972305 7543210 17390628
16361A7390628J4263253a7965236H722695L5380525A6597559c5968626H262706
$$ 17390628 31653881 -17965236 8722695 44103220 16597559 -35968626 8262706
16353E226872a8861767i119669C3009698b119931D5327905j9559633E65515P043721
$$ 5226872 -18861767 -9119669 33009698 -2119931 45327905 25768272 565515 7609236
16345G609236j921407H85432d149338C882529N145480m481139a7009519j85633
$$ 7609236 5687829 885432 -4149338 3882529 9028009 4546870 -17009519 -17195152
16337a7195152B2153207P613680E022615K2666936c933173C5102344A0179719
$$ -17195152 22153207 29766887 5022615 27689551 -3933173 35102344 10179719
16329d2152917D0399812A4502220B694451J8592586q460577P040520P616350J2969285
$$ -42152917 40399812 14502220 2694451 21287037 12826460 19866980 27483330 40452615
16321D0452615j8148870j634707h354854A5852176b9178193B8100099D808665
$$ 40452615 22303745 20669038 -8354854 15852176 -29178193 28100099 4808665
16313a4426417j3742934D336287J117360O4425096C2266190b5183903F64589c9386277
$$ -14426417 -28169351 4336287 5453647 69878743 32266190 -25183903 664589 -39386277
16304B401690i089767A6190495M460843k671095m340651a5190205o7129l756184
$$ 2401690 -9089767 16190495 20651338 17980243 13639592 -15190205 -15257334 -19013518
16296a9013518c999076m3920614e585370E065052d268865B900439K4753704K1464065
$$ -19013518 -3999076 -47919690 -5585370 5065052 -4268865 2900439 27654143 49118208
16288D9118208b6919010C7056942a3491407f173139G967045i199488C8420913
$$ 49118208 -26919010 37056942 -13491407 -6173139 7967045 -9199488 38420913
16280b0095262C339164a3230368j804122B2870749e619915j2530844C9289255
$$ -20095262 3339164 -13230368 -15034490 22870749 -5619915 -18150759 39289255
16272D4015116i804406k5997501J4955544c680626j868257J196685A6754411d0492987
$$ 44015116 -9804406 -35801907 -20846363 -3680626 -5548883 -4352198 16754411 -40492987
16263b9285178D631031i642726d010001A3520461d1463923J1286943a3390787
$$ -29285178 4631031 -9642726 -4010001 13520461 -41463923 -30176980 -13390787
16255E321489d5563834a7813311C570556J3840440a4060617A2292468B440943
$$ 5321489 -45563834 -17813311 3570556 17410996 -14060617 12292468 2440943
16247b923090n676405r030463A785653i708723c874957r782857D0164108A5288294
$$ -2923090 -8599495 -17629958 1785653 -9708723 -3874957 -13657814 40164108 15288294
16238b5530945A3572685C384634i813349j6834518E469556b3469845L145931k397886
$$ -25530945 13572685 3384634 -9813349 -26647867 5469556 -23469845 -20323914 -22721800
16230b2721800j0476423D07368b8985331E9219230g035838A6621615p105028h326493
$$ -22721800 -33198223 407368 -28985331 59219230 -7035838 16621615 9516587 -8326493
16221a2162250i55292C4161686a7512780A1254047C855191M6649984k1946923
$$ -12162250 -955292 34161686 -17512780 11254047 3855191 50505175 28558252
16214B8558252B168028J4923322J5214140b1233749L279102C3595832D84459O298623
$$ 28558252 2168028 17091350 32305490 -21233749 -17954647 33595832 484459 6783082
16206F783082j564172i55710D0864403a863132p67306k7471983C885632a1630803
$$ 6783082 5218910 -955710 40864403 -1863132 -2630438 -30102421 3885632 -11630803
16197b8978638L553320A6522842b1460521C8330060A4309962M142482l633637
$$ -28978638 -25425318 16522842 -21460521 38330060 14309962 18452444 14818807
16190A4818807a6089016A9518285a8762614r648018a1488359A4165734K1306709
$$ 14818807 -16089016 19518285 -18762614 -28410632 -11488359 14165734 35472443
16183C5472443a6296676B8437907I239389C082303g466822j5298214C4357784
$$ 35472443 -16296676 28437907 9239389 3082303 -7466822 -22765036 34357784
16175a9019222k345889I55583J0805633f465617D746743e64950A2308915c3697899
$$ -19019222 -21365111 955583 11761216 -6465617 4746743 -564950 12308915 -33697899
16166C0179684i702884B450518N8078311k3650994B383744a9358324A6301858
$$ 30179684 -9702884 2450518 60528829 36877835 2383744 -19358324 16301858
16158c075237C3602031C549584g3695C4905486f6599465a681278o472679H584842
$$ -3075237 33602031 3549584 -73695 34905486 -66599465 -1681278 -8153957 8584842
16149g916564l936602B0243447D217465K1099910c9356525A8925071K1937202
$$ -7916564 -11853166 20243447 4217465 25317375 -39356525 18925071 40862273
16142D0862273A5126749c5440783e656655A2750399b9935756J0660524D5644860
$$ 40862273 15126749 -35440783 -5656655 12750399 -29935756 -19275232 45644860
16134B492008b70433m2681662D96330L197352L7246952n148322a842474A7417151
$$ 2492008 -270433 -42952095 496330 3693682 40940634 35792312 -1842474 17417151
16125A698399c882481B128894M734336L2314317c737942B0209097o815853i176590
$$ 1698399 -3882481 2128894 6863230 39177547 -3737942 20209097 13393244 -9176590
16116A0584555K6914937F772090B162328P269307b4216387k5268837e144239B316580
$$ 10584555 37499492 6772090 2162328 9431635 -24216387 -49485224 -5144239 2316580
16107f136828A3232487J1054426M62633b1409316K507729A6468425N160457b0585996
$$ -6136828 13232487 24286913 24749546 -21409316 -18901587 16468425 21628882 -20585996
16098d084876A9622399r9401B961685c5505226D28125a3004612r88491C206090
$$ -4084876 19622399 19522998 2961685 -35505226 428125 -13004612 -13993103 3206090
16089c8637788g88735B6095797c5125469A5270776a8568443G45730J1135598d555231
$$ -38637788 -788735 26095797 -35125469 15270776 -18568443 745730 11881328 -4555231
16080A2417495M5992472k5851214a3759976M276526D2745342d054990q529332
$$ 12417495 58409967 32558753 -13759976 -9483450 42745342 -4054990 -12584322
16073a2584322k5035148n352752A8893303h329251a544316k0383261B5075695
$$ -12584322 -37619470 -42972222 18893303 -8329251 -1544316 -21927577 25075695
16065C1958187o171546A2307193a9528848B8459486j0942139a475909p296310
$$ 31958187 25786641 12307193 -19528848 28459486 17517347 -1475909 -8772219
16058h772219B577432a1421726j7161437C5255893a5511620d937298A1640177
$$ -8772219 2577432 -11421726 -28583163 35255893 -15511620 -4937298 11640177
16050A3282914K1267769b1652922A2901922a2282877A6622549K694447a8089120
$$ 13282914 34550683 -21652922 12901922 -12282877 16622549 19316996 -18089120
16042F676772p99430a7040199p368019j112759a2526549B6906663J6008330j6828371
$$ 6676772 5877342 -17040199 -24408218 -25520977 -12526549 26906663 42914993 26086622
16034B6086622b8884297a989745C5930242A3498700c3360106J2023036h262056
$$ 26086622 -28884297 -1989745 35930242 13498700 -33360106 -21337070 -8262056
16026f067044F0646018C976114K9768208a2591434j6521618I750568D65690P095557
$$ -6067044 60646018 3976114 33744322 -12591434 -29113052 9750568 465690 7561247
16018G561247L6238195H566207Q880831a4223808H244770B557205J0352742n074586
$$ 7561247 43799442 8566207 17447038 -14223808 8244770 2557205 12909947 7835361
16010G835361B082078c0251174A2999311A363154e110542m630489m2383494a5044232
$$ 7835361 2082078 -30251174 12999311 1363154 -5110542 -9741031 -52124525 -15044232
16001B0373202a0090195A47858d873744B7053262K4734306I874896i231367c834083
$$ 20373202 -10090195 147858 -4873744 27053262 51787568 9874896 -9231367 -3834083
15992B4099115a7967441C8050259J8063194b3267850h77257j0888714A8490158
$$ 24099115 -17967441 38050259 56113453 -23267850 -877257 -11765971 18490158
15984A1185231P170617g770049j3242858n2716487A5091489a9714379I991378
$$ 11185231 18355848 -7770049 -21012907 -73729394 15091489 -19714379 9991378
15976b266085B2772140A386847b7415163n040502A9023751O597912i922531L300145
$$ -2266085 22772140 1386847 -27415163 -32455665 19023751 25621663 -9922531 -6622386
15968f622386k422688G447828f2574895J7711243F627023c637218m4950998b4144729
$$ -6622386 -9045074 7447828 -62574895 -44863652 6627023 -3637218 -48588216 -24144729
15959E1449924i85552C0942194j3252398b1116905B2342211O577639J5821256
$$ 51449924 -985552 30942194 17689796 -21116905 22342211 28919850 44741106
15952D4741106a7265371J345760l5725145K5609271C1145018E476892J3000497
$$ 44741106 -17265371 -15919611 -51644756 -26035485 31145018 5476892 18477389
15945A8477389m115933K0991539A1400947J1152592a0481168B5370473b295293
$$ 18477389 14361456 35352995 11400947 22553539 -10481168 25370473 -2295293
15937C5539583j6776065E356837i532366k8478599C7970913j8308083m109066
$$ 35539583 18763518 5356837 -9532366 -38010965 37970913 19662830 15553764
15930A5553764b1726159d680883n338278b604535j4499344A8521222b1926767
$$ 15553764 -21726159 -4680883 -10019161 -2604535 -17103879 18521222 -21926767
15922d268914I526114b9699037A7505857J7307900L36358a8059445q558644g983852
$$ -4268914 9526114 -29699037 17505857 34813757 35150115 -18059445 -26618089 -7983852
15913b9492489D5309103F022072J7866772a9460833A0804765a7994707H413698
$$ -29492489 45309103 6022072 23888844 -19460833 10804765 -17994707 8413698
15905B041946b2620022A6587828b2987821A8964297E459338J482235L1608618
$$ 2041946 -22620022 16587828 -22987821 18964297 5459338 6941573 38550191
15898C8550191a050408p028045m73436F676221R769740c3934307a5224899l4031909
$$ 38550191 -1050408 -8078453 -8551889 6676221 16445961 -33934307 -15224899 -49256808
15890d9256808J2924430D542418L2757203b6582757K980172B9620242e98663D103356
$$ -49256808 -36332378 4542418 37299621 -26582757 -23602585 29620242 -598663 4103356
15881e482791k6546555b3256k3565260E4322132B6765571e1886642J6238001J4617877
$$ -5482791 -32029346 -23256 -23588516 54322132 26765571 -51886642 -35648641 -21030764
15873b1030764e754969B472779a4727678C2097809j029288o754616k943376a9348550
$$ -21030764 -5754969 2472779 -14727678 32097809 31068521 24313905 21370529 -19348550
15864d370994m753312k2729877c788188l573702A2417374b8827655a2106339k475261
$$ -4370994 -9124306 -31854183 -3788188 -7361890 12417374 -28827655 -12106339 -14581600
15856a4581600I160637b3722514J1809819k4155503C2760155B76342J8055562
$$ -14581600 9160637 -23722514 -11912695 -36068198 32760155 276342 18331904
15849A8331904e166758B5427790H983123b9641592a1353834D928647J139159a4097467
$$ 18331904 -5166758 25427790 8983123 -29641592 -11353834 4928647 6067806 -14097467
15840E380985J6256667E354878L900431d495025o389153B7683843H347344a2721006
$$ 5380985 21637652 5354878 9255309 -4495025 -10884178 27683843 8347344 -12721006
15831a4825054k0218376j7141244a644744j2031569e103445B2510809b6745084
$$ -14825054 -35043430 -52184674 -1644744 -13676313 -5103445 22510809 -26745084
15823I292302L829640g114550n999080C1297111C845730a1104180A299238O229555
$$ 9292302 13121942 -7114550 -13113630 31297111 3845730 -11104180 1299238 7528793
15815G528793C740342M96685d128069k727909B7908497J7578907b9421376a3746139
$$ 7528793 3740342 4237027 -4128069 -6855978 27908497 45487404 -29421376 -13746139
15806A0729515a4947643b186656p039415b38272B2871351G074421d071368k790464
$$ 10729515 -14947643 -2186656 -9226071 -238272 22871351 7074421 -4071368 -6861832
15798f861832A4819496a70269l6162736J3915081A0507922a4094607C4441152
$$ -6861832 14819496 -170269 -36333005 -22417924 10507922 -14094607 34441152
15790a8739929d300372B8317895a4284306C403599b8608668g865310d52782G209547
$$ -18739929 -4300372 28317895 -14284306 3403599 -28608668 -7865310 -452782 7209547
15781A6822457A46774N656299j366777a9074801h61049l0829350e531200A0699534
$$ 16822457 146774 5803073 4436296 -19074801 -861049 -31690399 -5531200 10699534
15772D8091338G909431K202044L2866112j3067447A2176330E748531P758678a3036518
$$ 48091338 7909431 10111475 42977587 29910140 12176330 5748531 13507209 -13036518
15763C1517391a1543922j1115694B4217738b2223908B0910956n471946k783948
$$ 31517391 -11543922 -22659616 24217738 -22223908 20910956 15439010 12655062
15756A2655062m886516d2053213B1375922p925417K1131982A0015198K9708590
$$ 12655062 7768546 -42053213 21375922 13450505 34582487 10015198 39723788
15749C9723788A6194162i108804D7105006b1627417K205908A3502597c1100063
$$ 39723788 16194162 -9108804 47105006 -21627417 -19421509 13502597 -31100063
15741a5039623G02810e0696326G672186O147675Q204659m129894b8228579q522445
$$ -15039623 702810 -50696326 7672186 13819861 22024520 17894626 -28228579 -36751024
15733c6751024A632933C50238L6859509e36165A3126412K9295479a457871C659775
$$ -36751024 1632933 350238 37209747 -536165 13126412 42421891 -1457871 3659775
15724b3388235D969337a1796383c62598j5323008l2682277i717028A0390929a9625524
$$ -23388235 4969337 -11796383 -362598 -15685606 -48367883 -9717028 10390929 -19625524
15715B111079a5471620A3795124n743094d2178720h12698H665647e430456l182001
$$ 2111079 -15471620 13795124 8052030 -42178720 -812698 8665647 -5430456 -8612457
15707h612457G4042430a159094B0725278E054666J903883O63592R811274n158473
$$ -8612457 74042430 -1159094 20725278 5054666 6958549 7622141 17433415 12274942
15699A2274942a3060634k180080A5777656h916648a206863B1022506a4397503
$$ 12274942 -13060634 -15240714 15777656 -8916648 -1206863 21022506 -14397503
15691B4951958G189516M49669a957369e22281j1642125E205635h689997A5432140
$$ 24951958 7189516 7639185 -1957369 -522281 -12164406 5205635 -8689997 15432140
15682i540168H090160l612065g302934C2935871C022161d1247958g712366j3465033
$$ -9540168 8090160 4478095 -7302934 32935871 3022161 -41247958 -7712366 -21177399
15674b1177399O464474A4178794l809789b0899744a613185A4038958a6520445
$$ -21177399 -14712925 14178794 10369005 -20899744 -1613185 14038958 -16520445
15666i420538d067821B4358168c105988l2810852E903290b0288744C8688850A0895682
$$ -9420538 -4067821 24358168 -3105988 -35916840 5903290 -20288744 38688850 10895682
15657a6481380I626766K661267D146496R769464N148020l997401d275971j0411254
$$ -16481380 9626766 12288033 4146496 13915960 19063980 15066579 -4275971 -14687225
15649a4687225n250721P12057J31991F368938j832382i741502b256059A8910572
$$ -14687225 -19937946 -19225889 -19093898 6368938 4536556 -9741502 -2256059 18910572
15640a6933262k1448503A6992670n584386c11267m2410742A0269574e9139833
$$ -16933262 -38381765 16992670 11408284 -311267 -42722009 10269574 -59139833
15632H082050d751660r183979B5876969C237921a9838287A5837448L32538M3287433
$$ 8082050 -4751660 -13935639 25876969 3237921 -19838287 15837448 16169986 59457419
15624E9457419j9865241A3565230K2532486d3319222A3373737D772493J2787676
$$ 59457419 39592178 13565230 36097716 -43319222 13373737 4772493 17560169
15617A7560169g48284j7258499B4634122J8722388c7991908C5876084j2214386
$$ 17560169 -748284 -18006783 24634122 43356510 -37991908 35876084 23661698
15610B3661698d657894j1121899j1721503B5700650b0396657C2368185c0490963
$$ 23661698 -4657894 -15779793 -27501296 25700650 -20396657 32368185 -30490963
15602e596192A1163172b6356070f545911o681765F872153K9815620A2004052i657030
$$ -5596192 11163172 -26356070 -6545911 -13227676 6872153 36687773 12004052 -9657030
15593a7342909A6193255J3456587A046566a806349B2575524k112505F276882M763175
$$ -17342909 16193255 29649842 1046566 -1806349 22575524 20463019 6276882 11040057
15585A1040057K0658002d2080169C1486498J470586c4432704K456186R30177A1741610
$$ 11040057 31698059 -42080169 31486498 32957084 -34432704 -31976518 -31046341 11741610
15576I82200N595727k053485M332723c269613j7897363J0539090A4187389O641574
$$ 982200 6577927 4524442 8857165 -3269613 -21166976 -10627886 14187389 20828963
15568B0828963b3349410j4198477K001268J6792064d246457C949862n26678f50354
$$ 20828963 -23349410 -37547887 -35546619 -18754555 -4246457 3949862 3423184 -650354
15559d8408168G004273a7018707B0316130R783986A1601335c7871398e945117
$$ -48408168 7004273 -17018707 20316130 30100116 11601335 -37871398 -5945117
15551c1489401D278964b8594257C4043482j0949903a7758551k016238D0186021
$$ -31489401 4278964 -28594257 34043482 23093579 -17758551 -19774789 40186021
15543B6503346d583258l3367441a0826249D513887a7446884B3961218b7711157
$$ 26503346 -4583258 -37950699 -10826249 4513887 -17446884 23961218 -27711157
15535D435580K7991664a7899115A2818543L367547E179939J319037Q001116a4965817
$$ 4435580 32427244 -17899115 12818543 16186090 5179939 6498976 14500092 -14965817
15526i367395F211451j945962b2754067M907616A3203367k926772d6410819c17112
$$ -9367395 6211451 4265489 -22754067 -17846451 13203367 10276595 -46410819 -317112
15517b1993061b602635A6644091a0424636j3525745k9727117a3847398B790020
$$ -21993061 -2602635 16644091 -10424636 -23950381 -53677498 -13847398 2790020
15509a7724609A3683588a928737A1065063L2168404b1985223l807567A9293563
$$ -17724609 13683588 -1928737 11065063 43233467 -21985223 -25792790 19293563
15501B1055354H554519l020545a5997791A1069313c396419m688281q129550m2647007
$$ 21055354 8554519 5533974 -15997791 11069313 -3396419 -8084700 -16214250 -58861257
15493e8861257K9121537A3962723L0487217a9405846C9376350A7181176d558194
$$ -58861257 -29739720 13962723 44449940 -19405846 39376350 17181176 -4558194
15485B7124418b3766586j249105G5215361C7241857a8530657A442886M2689431
$$ 27124418 -23766586 -25015691 75215361 37241857 -18530657 1442886 44132317
15478D4132317A649777H07936a3592377B8872148J1795165D868556P430648b4663023
$$ 44132317 1649777 807936 -13592377 28872148 40667313 4868556 12299204 -24663023
15469D7238991b3703253A019769m49352b0936393C2477053h793193C6798240D163811
$$ 47238991 -23703253 1019769 570417 -20936393 32477053 -8793193 36798240 4163811
15460c8152483A9182529a4567032A7349878E83787K6666796J4617264d0316547
$$ -38152483 19182529 -14567032 17349878 583787 27250583 41867847 -40316547
15452B6326461r398381j168944n832974j091558K793103J121533e604681j1152631
$$ 26326461 16928080 15759136 9926162 8834604 11627707 12749240 -5604681 -16757312
15444a6757312j848073f7749o003585A9945941K209697K427571G956097C813427
$$ -16757312 -18605385 -67749 -6071334 19945941 22155638 24583209 7956097 3813427
15435g972116n9291366b316249j0560584A1153836M746096c9293379g344241j2512999
$$ -7972116 -67263482 -2316249 -12876833 11153836 15899932 -39293379 -7344241 -19857240
15427a9857240B7316627N499322A3585109J5351430b0919646A77128L9819958
$$ -19857240 27316627 32815949 13585109 28936539 -20919646 177128 39997086
15420C9997086b5118557N406814k442621b754707j9257394A1758332g983476A3444711
$$ 39997086 -25118557 -19711743 -22154364 -2754707 -22012101 11758332 -7983476 13444711
15411b6031394B539113M986946P136458E414322J3395382a7478363j2995420a072641
$$ -26031394 2539113 7526059 14662517 5414322 18809704 -17478363 -30473783 -1072641
15402b1939617e28448j4577505A2006675a2780730A6211927D871066a4902341
$$ -21939617 -528448 -15105953 12006675 -12780730 16211927 4871066 -14902341
15394d0496949i731808A2032095K0301127C242996h410287n907798l5312821a058491
$$ -40496949 -9731808 12032095 32333222 3242996 -8410287 -14318085 -49630906 -1058491
15385A9606865a2159720I495175g924004A2420408O813787d0652786B8251252
$$ 19606865 -12159720 9495175 -7924004 12420408 19234195 -40652786 28251252
15377B788142O025323b4984442a962845F474453F44498b2895557N081058G16585
$$ 2788142 8813465 -24984442 -1962845 6474453 644498 -22895557 -17814499 716585
15368G064944c2727611a2929539B2946765G341188g647871A4594430J7376282
$$ 7064944 -32727611 -12929539 22946765 7341188 -7647871 14594430 31970712
15361C1970712A225120a4177577b86857k0041887F88387d303035F852548a3210961
$$ 31970712 1225120 -14177577 -286857 -20328744 688387 -4303035 6852548 -13210961
15352D9138620b1335664A0825576K054030d444725A5401023B302756a8599116
$$ 49138620 -21335664 10825576 12879606 -4444725 15401023 2302756 -18599116
15344E4557748F687611c2374172B5724149F373140J0793117b9484473J1094512
$$ 54557748 6687611 -32374172 25724149 6373140 17166257 -29484473 -18389961
15337a8389961b048894j9596804C983576d5087690i141192C6047103B615977b9920356
$$ -18389961 -2048894 -21645698 3983576 -45087690 -9141192 36047103 2615977 -29920356
15328c2520377a6213729n306539A4980573a1421823J065749r217483n443149l810209
$$ -32520377 -16213729 -21520268 14980573 -11421823 -10356074 -19573557 -25016706 -28826915
15320b8826915A7280800a3553501k9609311D387677L313299C247946J4059880
$$ -28826915 17280800 -13553501 -43162812 4387677 7700976 3247946 17307826
15313A7307826b2464127E68376h525837M222729A7386067a0469783d001719A2181879
$$ 17307826 -22464127 568376 -8525837 -4303108 17386067 -10469783 -4001719 12181879
15304C8591256g8736o897493E82972b4066161H272525b082289l5142023C737712
$$ 38591256 -78736 -6976229 582972 -24066161 8272525 -2082289 -37224312 3737712
15295c397447j9031160C4975368a0513463L924163A6990260d1799910B9191535
$$ -3397447 -22428607 34975368 -10513463 -6589300 16990260 -41799910 29191535
15287b1706129B8919379A269318J4473653M43999a8509420C7084374C843005f015410
$$ -21706129 28919379 1269318 15742971 16186970 -18509420 37084374 3843005 -6015410
15278B9350020C545889a9928891A20963J4429673h720722C3268713d6170961g037827
$$ 29350020 3545889 -19928891 120963 14550636 -8720722 33268713 -46170961 -7037827
15269b2979077j908963q428608M372742e252689E771156a7695125I310554J6806435
$$ -22979077 -24888040 -33316648 -28943906 -5252689 5771156 -17695125 9310554 26116989
15261B6116989a7077563f399684j0327639D750036b5927056J1609420N960147
$$ 26116989 -17077563 -6399684 -16727323 4750036 -25927056 -14317636 -8357489
15254h357489A0402663b389900C406405n59781m48584J0759493o184550f457597
$$ -8357489 10402663 -2389900 3406405 2846624 2398040 13157533 6972983 -6457597
15245b6383360a785375I370327a6267870h099141L641481k7326232B7077211H249582
$$ -26383360 -1785375 9370327 -16267870 -8099141 -4457660 -31783892 27077211 8249582
15236a8272077B4790808c4604442h229021B4570893E042547b3088826I309976
$$ -18272077 24790808 -34604442 -8229021 24570893 5042547 -23088826 9309976
15228a8826634d697258M17994n118799q179843M394175A4953208o210119c9893721
$$ -18826634 -4697258 -4279264 -9398063 -17577906 -13183731 14953208 8743089 -39893721
15219a8512926A3523718J9619575c8148227D3239356h191799o853422j840832
$$ -18512926 13523718 33143293 -38148227 43239356 -8191799 -15045221 -16886053
15212a6886053N022458j0343285F036103J467421b962085j5803959Q285820B2210828
$$ -16886053 -11863595 -22206880 6036103 7503524 -2962085 -18766044 -10480224 22210828
15203A3921741J0661941e747103C8180293j8549001a3719100E7863906j6832798
$$ 13921741 24583682 -5747103 38180293 19631292 -13719100 57863906 41031108
15196D1031108b526433n6872467A2210764K9079797a2138744m72994c969438l108935
$$ 41031108 -2526433 -59398900 12210764 41290561 -12138744 -12611738 -3969438 -7078373
15188g078373k1289552D797998j357560J9031373B897792b8312555D230667c7660885
$$ -7078373 -28367925 4797998 3440438 22471811 2897792 -28312555 4230667 -37660885
15179c8022545B1160771b2486717B8198438A3026834K1764894b4654789B9648400
$$ -38022545 21160771 -22486717 28198438 13026834 34791728 -24654789 29648400
15171B2465185d2732403a0260611q882373C31045J808650J107763J678004N174874
$$ 22465185 -42732403 -10260611 -19142984 331045 2139695 3247458 4925462 10100336
15163A0100336J2978344E248707f789727E481572N228118D352817a501070o193367
$$ 10100336 23078680 5248707 -6789727 5481572 10709690 4352817 -1501070 -7694437
15155g694437B0536010A453842M759570e624724j3789862e685746F106309b2430461
$$ -7694437 20536010 1453842 6213412 -5624724 -19414586 -5685746 6106309 -22430461
15146d0495594B9557293b8014748A6664298c665405j0443905F110030J6578401
$$ -40495594 29557293 -28014748 16664298 -3665405 -14109310 6110030 22688431
15139B2688431P360445j1228343i139041A3352055b0053812D995278a15535l698166
$$ 22688431 30048876 18820533 -9139041 13352055 -20053812 4995278 -115535 -3813701
15131c813701A7568646M3328256A6086667c0737928I662274L855754m963955K154436
$$ -3813701 17568646 60896902 16086667 -30737928 9662274 13518028 8554073 10708509
15123A0708509K2660100K068034C202330P132761j913245d2669056C4372626a3685906
$$ 10708509 33368609 35436643 3202330 10335091 8421846 -42669056 34372626 -13685906
15114b1895282n665947a2183622A895969L491804K9265663C689791K2727360b336061
$$ -21895282 -27561229 -12183622 1895969 5387773 34653436 3689791 26417151 -2336061
15105c7299749A040905a8978657Q517393L011488A8674058e379384A4344427K222617
$$ -37299749 1040905 -18978657 -10461264 -7449776 18674058 -5379384 14344427 16567044
15097A6567044B371922l35670K331048a5793416f762332A8406613R298543b7571260
$$ 16567044 2371922 2036252 4367300 -15793416 -6762332 18406613 27705156 -27571260
15088B5386351A2144075i62272B6588625a4486638F524804c725363A6333185C238423
$$ 25386351 12144075 -962272 26588625 -14486638 6524804 -3725363 16333185 3238423
15079a3979352A582753Q483053K1623333e519229A2241419a2126222l7810818
$$ -13979352 1582753 10065806 31689139 -5519229 12241419 -12126222 -49937040
15072d9937040A2755132a9370001d969147A9976897D698491a8083102G168838
$$ -49937040 12755132 -19370001 -4969147 19976897 4698491 -18083102 7168838
15064c813502H368035R141223C440846a0083360m199169B6611501m277206F092575
$$ -3813502 8368035 17509258 3440846 -10083360 -14282529 26611501 22334295 6092575
15055E792K581645d360739j0286278l7171872b5872313a643056H164116C759181
$$ 5792 2587437 -4360739 -14647017 -51818889 -25872313 -1643056 8164116 3759181
15046B8441845A2468235a7828894C145127a5300522l1482681a0398285B5882568
$$ 28441845 12468235 -17828894 3145127 -15300522 -46783203 -10398285 25882568
15038a3457691n074687A0908910a0997926A6140045a6857028n446682D828900
$$ -13457691 -18532378 10908910 -10997926 16140045 -16857028 -22303710 4828900
15030d946094E614348b902228D2468376A0004722K6461082c3595953h753633B8869594
$$ -4946094 5614348 -2902228 42468376 10004722 36465804 -33595953 -8753633 28869594
15021c3016100B2248463N007450i114694k5395358I03761J1777208g372146C945138
$$ -33016100 22248463 27255913 -9114694 -34510052 903761 12680969 -7372146 3945138
15012C0702411f226275D4014787d7383639a5177011j5238859d647860J557289
$$ 30702411 -6226275 44014787 -47383639 -15177011 -30415870 -4647860 -3090571
15005c090571K54225C085662p77568J1951185a131177m3881360a5089232D3079883
$$ -3090571 -2836346 3085662 2308094 14259279 -1131177 -45012537 -15089232 43079883
14996a2184836A8119334g974308a924850j5814396O624096d612082j8442653F103715
$$ -12184836 18119334 -7974308 -1924850 -17739246 -11115150 -4612082 -23054735 6103715
14987B3010012a8391182l5582638a9373933A2769432B990939j353173a4836659
$$ 23010012 -18391182 -53973820 -19373933 12769432 2990939 1637766 -14836659
14979A0016694A347592b4847209j0498062A7442263b5887272J0328322A0057167
$$ 10016694 1347592 -24847209 -35345271 17442263 -25887272 -15558950 10057167
14971c3681631I268670d298602G093758E86939L8677516e1959419b809424k4465211
$$ -33681631 9268670 -4298602 7093758 586939 39264455 -51959419 -2809424 -27274635
14963b7274635j354753J486329a156637d12978p191031B4686555c895631A3970093
$$ -27274635 -28629388 -27143059 -1156637 -412978 -7604009 24686555 -3895631 13970093
14954i092520j962167k3507183C981498a5249221K845053E541700c589183l815960
$$ -9092520 -11054687 -34561870 3981498 -15249221 -12404168 5541700 -3589183 -7405143
14946g405143A2435456b3572755J0254786j7126728c670438B8203113a9960316
$$ -7405143 12435456 -23572755 -13317969 -30444697 -3670438 28203113 -19960316
14938a6110616E949957J1955205J270867a7666054q871189g865653j5406462A3393335
$$ -16110616 5949957 17905162 19176029 -17666054 -26537243 -7865653 -23272115 13393335
14929a7093041P121995d349383j5859662i861697C1547917A3270385b0405187
$$ -17093041 -9971046 -4349383 -20209045 -9861697 31547917 13270385 -20405187
14921F282354b8221998a3818501a036187q232920j407791B8217159b945031C0997446
$$ 6282354 -28221998 -13818501 -1036187 -9269107 -10676898 28217159 -2945031 30997446
14912A5424094A738856R676975C90695d825992B1344327b447563k3654031B5061506
$$ 15424094 1738856 11415831 390695 -4825992 21344327 -2447563 -26101594 25061506
14903C5792440b0949802d786995j1958046B731958K9425364e4226089C9451688
$$ 35792440 -20949802 -4786995 -16745041 2731958 32157322 -54226089 39451688
14895c659662J083543l1425733c52873B801146d3911254a3847877B6222860m078437
$$ -3659662 -2576119 -34001852 -352873 2801146 -43911254 -13847877 26222860 22144423
14887B2144423a214556B2074762e5233361a8385475k974232o700813a3174380
$$ 22144423 -1214556 22074762 -55233361 -18385475 -21359707 -28060520 -13174380
14879i211635o04535A1270178e081950r902327A0377794P165848e468458j5853383
$$ -9211635 -9816170 11270178 -5081950 -14984277 10377794 17543642 -5468458 -21321841
14871b1321841R526761C1479634F621365j039299b6796343O534555A224066a4796437
$$ -21321841 -11795080 31479634 6621365 5582066 -26796343 -20261788 1224066 -14796437
14862c9962872A2440659b0187402e36065j9968813D74492e571839A9151105K445641
$$ -39962872 12440659 -20187402 -536065 -20504878 474492 -5571839 19151105 21596746
14854B1596746J5915695A0871392R46877d4297453a1027987q456168C481008a9909500
$$ 21596746 37512441 10871392 11818269 -44297453 -11027987 -19484155 3481008 -19909500
14845D5745058d7626871b3023181e878235D644448p19037J540242J8998122J4587069
$$ 45745058 -47626871 -23023181 -5878235 4644448 3925411 5465653 24463775 39050844
14837C9050844e716239C4607869J9500947a672865j631282k5713836N058577B122703
$$ 39050844 -5716239 34607869 54108816 -1672865 -3304147 -29017983 -23959406 2122703
14828A8407075a8759201A0203778a376844q973534k1304729g673184p643189l6160239
$$ 18407075 -18759201 10203778 -1376844 -10350378 -31655107 -7673184 -15316373 -51476612
14820e1476612A5172731h897197E0739327f420140G646813b5745903B4529589
$$ -51476612 15172731 -8897197 50739327 -6420140 7646813 -25745903 24529589
14812F988519N7388857a4469106A3322611a905319l8026822J7618723B829416
$$ 6988519 64377376 -14469106 13322611 -1905319 -39932141 -22313418 2829416
14804c677606k7921789G215445J6291096J3869558H9936K0663875d676778j9876178
$$ -3677606 -31599395 7215445 23506541 37376099 89936 20753811 -4676778 -24552956
14796b4552956C0838333L146508j5752600N033327q919341J2710671d1432969
$$ -24552956 30838333 33984841 18232241 23265568 14346227 27056898 -41432969
14788D629015c023029A0476188N360921a5107980k654741A0337104d370976C0732113
$$ 4629015 -3023029 10476188 15837109 -15107980 -17762721 10337104 -4370976 30732113
14779a8614668a297049k951470j7384350j7815434J4538425J1420013F634615
$$ -18614668 -1297049 -4248519 -21632869 -39448303 -24909878 -13489865 6634615
14771D4415958k0892857a4434212p574682a514799C1993764g719886j2771461
$$ 44415958 23523101 -14434212 -22008894 -1514799 31993764 -7719886 -20491347
14764b0491347j801805j0654432F0771601a8690468B739964K9296087J9529082
$$ -20491347 -22293152 -32947584 60771601 -18690468 2739964 32036051 51565133
14757E1565133A4653326b5035124B9371419g29785E5119691h120381l4394266
$$ 51565133 14653326 -25035124 29371419 -729785 55119691 -8120381 -42514647
14750d2514647A1018613a7808373j5388493C549689J1692923h845391j3258290
$$ -42514647 11018613 -17808373 -33196866 3549689 15242612 -8845391 -22103681
14743b2103681D2459723a6601956j222702F743093a4749033m647043k7234573
$$ -22103681 42459723 -16601956 -17824658 6743093 -14749033 -19396076 -46630649
14736d6630649e146300B085928J2630463Q501318J101127J0040491H021497A059402
$$ -46630649 -5146300 2085928 14716391 23217709 24318836 34359327 8021497 1059402
14727c5238804a6201364C6159318b5110836i574886K074034j8972940M994010
$$ -35238804 -16201364 36159318 -25110836 -9574886 -7500852 -26473792 -21479782
14720b1479782B8341629G286007c268712j2240171O605397A3175650K2579568
$$ -21479782 28341629 7286007 -3268712 -15508883 -8903486 13175650 35755218
14713C5755218a7118670B0254314a7211744G245764N090294K9909557A3127019
$$ 35755218 -17118670 20254314 -17211744 7245764 12336058 42245615 13127019
14705A8801945Q427184a3558225r255050l754864j5349424J9444745b430438A5407328
$$ 18801945 27229129 -13558225 -22813275 -26568139 -41917563 -22472818 -2430438 15407328
14696a0902698j6145008D183528K9120893f0996720b0209360A2902566F89408
$$ -10902698 -27047706 4183528 33304421 -60996720 -20209360 12902566 689408
14688B8643255K563903c1972827F127404g902911k0553920a0971421B7832674
$$ 28643255 31207158 -31972827 6127404 -7902911 -28456831 -10971421 27832674
14680c443086B0301086r60141b967942j4586590B2483496A412637h934196B4823211
$$ -3443086 20301086 19340945 -2967942 -17554532 22483496 1412637 -8934196 24823211
14671f066602j7979148Q843914O554333A4041248f0314881a867099B5900818e477637
$$ -6066602 -24045750 -15201836 -8647503 14041248 -60314881 -1867099 25900818 -5477637
14662A4469030J9050653D984807J1328688M353676c0360457f14476l0687691a4063103
$$ 14469030 33519683 4984807 16313495 20667171 -30360457 -614476 -31302167 -14063103
14653b1360994e524020k5907087J2012699f549005I343883a0067350M650790j667849
$$ -21360994 -5524020 -31431107 -19418408 -6549005 9343883 -10067350 -5416560 -7084409
14645g084409k3118779a1085208j2094380B9044259j0744695J1358725D27275
$$ -7084409 -30203188 -11085208 -23179588 29044259 18299564 29658289 427275
14637E286245c3902709A5566070a0992951B8129778f354121B5238101a3004887
$$ 5286245 -33902709 15566070 -10992951 28129778 -6354121 25238101 -13004887
14629B783240b6697201a553982p8396949E99587a6042946m3652130B2502704A0478709
$$ 2783240 -26697201 -1553982 -79950931 599587 -16042946 -59695076 22502704 10478709
14620B8737007J405527F561645J0968103l944648K6478543b706970D183851J5595142
$$ 28737007 30142534 6561645 17529748 13585100 40063643 -2706970 4183851 19778993
14612A9778993c8587813L970636P279892g393378n221644A9550131E957979Q995056
$$ 19778993 -38587813 -34617177 -27337285 -7393378 -12615022 19550131 5957979 14953035
14604A4953035b1810382B6749866D430830J1372016C4627J3586246J9305728A4085900
$$ 14953035 -21810382 26749866 4430830 15802846 34627 13620873 32926601 14085900
14595c6506968A8650268i138146j7778945A4653049a1463935d813386k1196122
$$ -36506968 18650268 -9138146 -26917091 14653049 -11463935 -4813386 -26009508
14588b6009508B7732615q19169P00710B01748K1304384b6918352I627131K5532949
$$ -26009508 27732615 26913446 27614156 201748 21506132 -26918352 9627131 35160080
14580C5160080B632914c2010515a5532821K432680O11859D369167e7334l0472011
$$ 35160080 2632914 -32010515 -15532821 -13100141 -12488282 4369167 -57334 -30529345
14572c0529345B8964444a6761510h210205L613360m607714A7665699a217434A2574904
$$ -30529345 28964444 -16761510 -8210205 -4596845 -9204559 17665699 -1217434 12574904
14563I282870L946819O37977c2974366o533851I075785b8096545G53979N3092255
$$ 9282870 13229689 13867666 -32974366 -39508217 9075785 -28096545 753979 53846234
14555E3846234a6495017I796144m132861d4060147C449599K2228289a0067556
$$ 53846234 -16495017 9796144 5663283 -44060147 3449599 25677888 -10067556
14547C3028467o703729D59427J2421385g87137k0325405k1630306a4950055C9821925
$$ 33028467 26324738 459427 12880812 -787137 -21112542 -42742848 -14950055 39821925
14538C5750349C057820d879724A785441b848425A7781302a0468003c433355j7563951
$$ 35750349 3057820 -4879724 1785441 -2848425 17781302 -10468003 -3433355 -20997306
14530b0997306A3766737f701323D0787059a2700771k4304315C0816388A1542215
$$ -20997306 13766737 -6701323 40787059 -12700771 -37005086 30816388 11542215
14522d684559A0110915a8708258A6285506J2218228a1094208B474133g291472
$$ -4684559 10110915 -18708258 16285506 28503734 -11094208 2474133 -7291472
14514b5301216J240782A9955627a3225055E818504a995196c75744j3574743B3708679
$$ -25301216 -24060434 19955627 -13225055 5818504 -1995196 -375744 -13950487 23708679
14505A1144304f047984j9222299H69156N449708Q91970c765351A2637944N059260
$$ 11144304 -6047984 -25270283 869156 6318864 7210834 -3765351 12637944 17697204
14497A7697204Q096512P317844j5881782J4758800K0452963j9089356A3481715
$$ 17697204 25793716 33111560 17229778 31988578 52441541 33352185 13481715
14489D612005a2389505A4145073c2293214d481209A5711022J6818428j1986511
$$ 4612005 -12389505 14145073 -32293214 -4481209 15711022 32529450 20542939
14482B0542939c0961663J1622363A1150860b2821054K512647q922367D826316
$$ 20542939 -30961663 -19339300 11150860 -22821054 -20308407 -29230774 4826316
14474a7259490c921946L10741l0787612a1119546l4596131a9253322k9890746
$$ -17259490 -3921946 -3611205 -34398817 -11119546 -45715677 -19253322 -49144068
14467d9144068B6261702a8578146j4884588a141313j0357101n602921j9075543
$$ -49144068 26261702 -18578146 -33462734 -1141313 -11498414 -17101335 -36176878
14460c6176878f837049L138247C3628668b3971978O399751N246870B576819b3807949
$$ -36176878 -6837049 -3698802 33628668 -23971978 -17572227 -12325357 2576819 -23807949
14451B4300709d5180170J4474050C4219246F084382B809693a2305182G30341K6783741
$$ 24300709 -45180170 -30706120 34219246 6084382 2809693 -12305182 730341 27514082
14443B7514082b2007408A4330106J5237683b3879778B1568334J0916690k682771
$$ 27514082 -22007408 14330106 29567789 -23879778 21568334 32485024 29802253
14436B9802253A976982A42291e0141k6588145I772994K9856465r213153a1009857
$$ 29802253 1976982 142291 -50141 -26638286 9772994 39629459 30416306 -11009857
14427b7226209A3212680j837280K7052641A3944042E104662f377455C8825019
$$ -27226209 13212680 11375400 38428041 13944042 5104662 -6377455 38825019
14419A6031359h243748E245098A55363J6530241E873286J2853120b4142973O487825
$$ 16031359 -8243748 5245098 155363 16685604 5873286 18726406 -24142973 -17655148
14411a7655148G108294b1611256E635502F54636d841193I505065J7342827h407046
$$ -17655148 7108294 -21611256 5635502 654636 -4841193 9505065 26847892 -8407046
14402b8360566j9704f459390F435545d653040k2282603A792021J2700993a5592514
$$ -28360566 -28380270 -6459390 6435545 -4653040 -26935643 1792021 14493014 -15592514
14393B0090072c216730B4127650n586851J8620214b0914882h414057B7316998
$$ 20090072 -3216730 24127650 18540799 37161013 -20914882 -8414057 27316998
14385b9789509j6527391J0619198P833000C5157050j6052421J4740063n66840
$$ -29789509 -46316900 -35697702 -27864702 35157050 19104629 33844692 33277852
14378C3277852b2183443b965253j52078l0461062i291833B9040555C337084a384883
$$ 33277852 -22183443 -2965253 -3117331 -33578393 -9291833 29040555 3337084 -1384883
14369a3480438C4991912J6278485d073343B3121058b731642A0160358b0260992
$$ -13480438 34991912 51270397 -4073343 23121058 -2731642 10160358 -20260992
14361c287138A2219166a59296D597740N289031P869243C174825O273130J3027917
$$ -3287138 12219166 -159296 4597740 9886771 17756014 3174825 9447955 22475872
14353B2475872L3762072A8567808J4376303p112022a2359207q89935L646748j002920
$$ 22475872 56237944 18567808 32944111 25832089 -12359207 -13249142 -9602394 -10605314
14345a0605314J189206j7385482A6011949C232757L09202c837169A6663082a2981547
$$ -10605314 -9416108 -26801590 16011949 3232757 3541959 -3837169 16663082 -12981547
14336c4853741D5132725a1749255C978091d291224E4239929C923220c0097405
$$ -34853741 45132725 -11749255 3978091 -4291224 54239929 3923220 -30097405
14328a6748450A2842188F173277a6508523o539267j0842290B6552713r61411J4246977
$$ -16748450 12842188 6173277 -16508523 -23047790 -33890080 26552713 25591302 39838279
14320C9838279j6038096o145338K0831837j5751838J6863823C972917L1668189
$$ 39838279 23800183 17654845 38486682 22734844 39598667 3972917 35641106
14313C5641106A4933896b2250455i664122A7523351J9402511j1471163a0054642
$$ 35641106 14933896 -22250455 -9664122 17523351 36925862 25454699 -10054642
14305b209094F648665K7001291A5250867i187856o018583A2585016P162571g20828
$$ -2209094 6648665 33649956 15250867 -9187856 -15206439 12585016 19747587 -720828
14296b126843D949009M933140F25427P458047l990106O766356J6019648j0346734
$$ -2126843 4949009 9882149 625427 8083474 4093368 10859724 26879372 16532638
14288A6532638J7556781C925277D22039K2919115a2324262L158150A1308393K0703968
$$ 16532638 34089419 3925277 422039 23341154 -12324262 -9166112 11308393 32012361
14280C2012361A4396773O037069L3277145e4156465B9668307J108181M905492
$$ 32012361 14396773 20433842 53710987 -54156465 29668307 30776488 35681980
14273C5681980d922129B0002914Q837293l868043f101193C9205661J2504479G528628
$$ 35681980 -4922129 20002914 28840207 24972164 -6101193 39205661 51710140 7528628
14264E0421482k0494587j1808557K2236042K158862j4510529p079228b599936
$$ 50421482 29926895 18118338 40354380 42513242 28002713 20923485 -2599936
14256C4282867a3874652E1986432j6710285p448359p3836E49554L7649304N697434
$$ 34282867 -13874652 51986432 35276147 27827788 27753952 549554 38198858 43896292
14248D3896292j0655594a370248B8852312N1162751C3543019n124967A854386
$$ 43896292 33240698 -1370248 28852312 80015063 33543019 28418052 1854386
14240D0499422L5509800a943099C3417402M5885466j2450004D521152J9296737
$$ 40499422 76009222 -1943099 33417402 79302868 66852864 4521152 23817889
14233B3817889M9418227M777143L660528k2079636K2873599K11915M3957710k6801901
$$ 23817889 73236116 78013259 81673787 59594151 82467750 82679665 126637375 99835474
14225I9835474j9729160J5789294M432837L3379432l7484347O537043R385823
$$ 99835474 80106314 95895608 100328445 133707877 96223530 102760573 112146396
14218A12146396l7538636J7300514J573969m0938024J509839K7381909l1394051
$$ 112146396 74607760 91908274 93482243 52544219 54054058 81435967 50041916
14211E0041916M2032807M0622166n647362l5191776k7080111A1977188M713495
$$ 50041916 92074723 132696889 127049527 91857751 64777640 11977188 16690683
14204A6690683L5369416O0970819l1317469A8778603i5531510l4044664p933972
$$ 16690683 52060099 113030918 81713449 18778603 -95531510 -129576174 -137510146
14197a37510146K4728725N0622308k70808j01046830o9386185q905172l2122149
$$ -137510146 -112781421 -62159113 -62429921 -163476751 -232862936 -241768108 -273890257
14190b73890257L9484616J6308697K5848835M4483150O253399j3753487N1077035
$$ -273890257 -234405641 -218096944 -192248109 -147764959 -141511560 -155265047 -104188012
14183a04188012Q046042l2715001K7373937J3267447K3420772l4193131J6362479
$$ -104188012 -96141970 -128856971 -101483034 -88215587 -64794815 -98987946 -82625467
14176h2625467k218718k535510K2273208r113430P782283L0206751p8366157M6479403
$$ -82625467 -84844185 -87379695 -65106487 -74219917 -66437634 -36230883 -114597040 -68117637
14168f8117637b4400479k8688209k8103637K3109823k7666512J8988904K5539810
$$ -68117637 -24400479 -53088688 -81192325 -58082502 -85749014 -66760110 -41220300
14161d1220300r000912k0398947p886528j643250b2431010m6221196l672656K4857027
$$ -41220300 -50221212 -70620159 -78506687 -80149937 -22431010 -68652206 -72324862 -47467835
14153d7467835a8234925j4237958q857605L251737j6706357j0005644J2586811
$$ -47467835 -18234925 -32472883 -41330488 -38078751 -54785108 -64790752 -52203941
14146e2203941J0031540K38882K0861906K24302l4037943o411847A1438462b5720699
$$ -52203941 -42172401 -41933519 -21071613 -20847311 -54885254 -61297101 11438462 -25720699
14137f3299820K0000037q726807L472004J2757740k6723249b6421571l2829681
$$ -63299820 -43299783 -52026590 -48554586 -35796846 -62520095 -26421571 -59251252
14130e9251252J4818504g817539n8532993K4463568J4672831B0665134b2333069
$$ -59251252 -44432748 -7817539 -66350532 -41886964 -27214133 20665134 -22333069
14122a7034481r489822l8361350J2763273K0478920P329831h910250o7628602
$$ -17034481 -26524303 -64885653 -52122380 -31643460 -24313629 -8910250 -76538852
14115g6538852K3673611N346373k291604N963739O891921J4222445d973381j0628724
$$ -76538852 -52865241 -47518868 -49810472 -43846733 -36954812 -22732367 -4973381 -15602105
14107a5602105I892048b1587281r637457P940335j5167378Q907702j9673464A7595229
$$ -15602105 9892048 -21587281 -31224738 -23284403 -38451781 -29544079 -49217543 17595229
14098b2891654d478316J156225j9246218G81572f1039103d711603m8944186B741865
$$ -22891654 -4478316 -3322091 -22568309 781572 -61039103 -4711603 -53655789 2741865
14089b5138708a1923959j9778445E372930d0212170i303053E453102f261717K106862
$$ -25138708 -11923959 -31702404 5372930 -40212170 -9303053 5453102 -6261717 -4154855
14081d154855B4640850a7010435k0226229K68673B653143c099334e49774m2887239
$$ -4154855 24640850 -17010435 -37236664 -36967991 2653143 -3099334 -549774 -43437013
14073d3437013O751849a4469871j6445439j574790A6747922d0048478E610407
$$ -43437013 -36685164 -14469871 -30915310 -32490100 16747922 -40048478 5610407
14065F5764e7506901b8532989g345237k7708062p342694A5533432h30547l2306396
$$ 65764 -57506901 -28532989 -7345237 -35053299 -42395993 15533432 -830547 -33136943
14057c3136943A1502724f069169j0051527n371572k4532410J6664139R557589
$$ -33136943 11502724 -6069169 -16120696 -21492268 -46024678 -29360539 -19802950
14050a9802950p634685F471646g504422k4955644J5272213M450622e140109g02608
$$ -19802950 -27437635 6471646 -7504422 -32460066 -17187853 -12737231 -5140109 -702608
14041e8651920g175574j0841085j7691826a4185593k6893263k1541986r841259
$$ -58651920 -7175574 -18016659 -35708485 -14185593 -41078856 -62620842 -72462101
14034g2462101a8226336e203639n969123A2335206a999248j7592329B9263142
$$ -72462101 -18226336 -5203639 -11172762 12335206 -1999248 -19591577 29263142
14026b7615302F711018a4028909l09903B1753341b6444983j0189671J6005768
$$ -27615302 6711018 -14028909 -14338812 21753341 -26444983 -36634654 -20628886
14019b0628886B041377J4601416f397796m996474j7002360l0565878Q586361a9087866
$$ -20628886 2041377 16642793 -6397796 -11394270 -28396630 -58962508 -50376147 -19087866
14010B3769690b809061l0450682P16062a5545236q929135g645549B5301279C302842
$$ 23769690 -2809061 -33259743 -32543681 -15545236 -24474371 -7645549 25301279 3302842
14001h578795K662735j156166K833126E157645f939436j838765C831396a6689444
$$ -8578795 -5916060 -7072226 -4239100 5157645 -6939436 -8778201 3831396 -16689444
13992a7510042l870873e546769A6831674f654067q836920B6479564f802088c297238
$$ -17510042 -21380915 -5546769 16831674 -6654067 -15490987 26479564 -6802088 -3297238
13983a113821k1692774k280369c80224j0539578B4554768a9005907G898239g173217
$$ -1113821 -22806595 -25086964 -380224 -10919802 24554768 -19005907 7898239 -7173217
13974b722352A7673732b2356877j4293262b958303l4340323e855470B9477452
$$ -2722352 17673732 -22356877 -36650139 -2958303 -37298626 -5855470 29477452
13966c9312446g228731q709453e56988A3351532c9323927C7653789A4412563C695807
$$ -39312446 -7228731 -15938184 -556988 13351532 -39323927 37653789 14412563 3695807
13957b2779373A134346b9358664m8920925A8161676a8891550I041247e243405
$$ -22779373 1134346 -29358664 -78279589 18161676 -18891550 9041247 -5243405
13949a0012196c441746k0928104A7480116d301247j0888061j460911I743000D385519
$$ -10012196 -3441746 -24369850 17480116 -4301247 -15189308 -16650219 9743000 4385519
13940b441597I965952k463034J8794587c1974899P748154I894911k441217J5763896
$$ -2441597 9965952 7502918 26297505 -31974899 -24226745 9894911 7453694 23217590
13932B3217590d0104724g232189E7197996g558329B1381752k519741c923528G371472
$$ 23217590 -40104724 -7232189 57197996 -7558329 21381752 18862011 -3923528 7371472
13923e738266j9610354k8703215A6976899g3569324B1282673b0086332l704265
$$ -5738266 -25348620 -54051835 16976899 -73569324 21282673 -20086332 -23790597
13916b3790597M462880m6229990c2176501m415569m403816o881415a3876516j3777293
$$ -23790597 -19327717 -65557707 -32176501 -36592070 -40995886 -47877301 -13876516 -27653809
13908b7653809q880165J0609929A7647726b1143765O647188k3659226o28075j370189
$$ -27653809 -36533974 -25924045 17647726 -21143765 -14496577 -38155803 -38783878 -40154067
13900d0154067j3471994K0439872J4831376B6945827c603322I047211d3716691
$$ -40154067 -53626061 -33186189 -18354813 26945827 -3603322 9047211 -43716691
13892e223510j0870019k3872736a9677714n2115389f260272a429226l4767061
$$ -5223510 -16093529 -39966265 -19677714 -71793103 -6260272 -1429226 -36196287
13885c6196287j3200233b0786345k112223e511889k1785019k79129a1136793k1290646
$$ -36196287 -49396520 -20786345 -22898568 -5511889 -27296908 -27576037 -11136793 -32427439
13877c2427439a1500160n0568408d54431j4330961l383580N3527k0367001a3616683
$$ -32427439 -11500160 -62068568 -454431 -14785392 -18168972 -18115445 -38482446 -13616683
13868H224236a4734611A2437998d867823B3247652a0405962b111638A718989e4672701
$$ 8224236 -14734611 12437998 -4867823 23247652 -10405962 -2111638 1718989 -54672701
13859E264698N005042a3238805c3396j0636546k0418672O052506A0634159b6952445
$$ 5264698 10269740 -13238805 -33396 -10669942 -31088614 -25036108 10634159 -26952445
13850e7540641a7496795D4307d004696j5099066J566576M623704j4856023O446761
$$ -57540641 -17496795 44307 -4004696 -19103762 -17537186 -12913482 -27769505 -21322744
13842b1322744A837567K776331c6742813a2784432B5715471b210420j4151728
$$ -21322744 1837567 4613898 -36742813 -12784432 25715471 -2210420 -16362148
13835a6362148N828146G44587d093025r653443j3446613J1630059k4196443I870631
$$ -16362148 -10534002 744587 -4093025 -13746468 -27193081 -15563022 -39759465 9870631
13826a918880l5846806A3925877j475660b8318378G883855O897426m354511i781847
$$ -1918880 -37765686 13925877 12450217 -28318378 7883855 14781281 10426770 -9781847
13817h670034l6913366k2104573b5216124h469128j1153543k9196332J7672104
$$ -8670034 -45583400 -67687973 -25216124 -8469128 -19622671 -48819003 -31146899
13810c1146899J3840340j4059577a4119707N906266j7518936k203958a0164911
$$ -31146899 -17306559 -31366136 -14119707 -8213441 -25732377 -27936335 -10164911
13802c2845287l498666J7444394A4212820d830574J378128H9014J2146842a6641260
$$ -32845287 -36343953 -18899559 14212820 -4830574 -3452446 89014 12235856 -16641260
13793E154305a6398588F005380a9375182L190432a821668j7656078r323186A0278047
$$ 5154305 -16398588 6005380 -19375182 -16184750 -1821668 -19477746 -28800932 10278047
13784a7198577G327373c0957701J0770206m919688K704754C7181283a9156100
$$ -17198577 7327373 -30957701 -20187495 -25107183 -22402429 37181283 -19156100
13776c9430250b297927A3227488O710847b7226360a407591E844591c0672787L665162
$$ -39430250 -2297927 13227488 19938335 -27226360 -1407591 5844591 -30672787 -27007625
13768b7007625j32018D024762c9978223j4599619a5241985n268274A9570950c5917887
$$ -27007625 -27139643 4024762 -39978223 -54577842 -15241985 -20510259 19570950 -35917887
13759D63435i930107j0604909l14451M186403q567740b996231j5858704A6057349
$$ 463435 -9930107 -20535016 -20849467 -16663064 -25230804 -2996231 -18854935 16057349
13750A3414442c2190550A7298364d869027k5997959P596580k0356053a0136450
$$ 13414442 -32190550 17298364 -4869027 -30866986 -23270406 -43626459 -10136450
13742a5492662o04502n667878B2572954H417457K0594127a4410444A0797565d2765265
$$ -15492662 -16097164 -21765042 22572954 8417457 29011584 -14410444 10797565 -42765265
13733a6226928j9505578m5380359b240640I051716L288491m342294c2310145a1785319
$$ -16226928 -35732506 -81112865 -2240640 9051716 12340207 7997913 -32310145 -11785319
13724E0482703g474124B4144091o024895J9469605h76725B9418399a8535507P807394
$$ 50482703 -7474124 24144091 18119196 37588801 -876725 29418399 -18535507 -10728113
13716a0728113B5826705b8286618a2834217B2071480d3453219K1539849j1700065
$$ -10728113 25826705 -28286618 -12834217 22071480 -43453219 -21913370 -33613435
13709c3613435A5481021f801301Q75761j7640976b313519n0222298A9823864a3476710
$$ -33613435 15481021 -6801301 -5925540 -23566516 -2313519 -52535817 19823864 -13476710
13700A430970c6943465A1245034c2694728R354038O862246B7633879j0655243
$$ 1430970 -36943465 11245034 -32694728 -23340690 -16478444 27633879 16978636
13693A6978636a9829495a475213j8534893R976544A3899930l970486b5773236
$$ 16978636 -19829495 -1475213 -20010106 -10033562 13899930 9929444 -25773236
13685b5746014a0548516c951821k0419340h939784A4065022a2458575G220403
$$ -25746014 -10548516 -3951821 -24371161 -8939784 14065022 -12458575 7220403
13677b1213409J0335862C4770169C718901c1851700K594259r010127a768142j4341357
$$ -21213409 -10877547 34770169 3718901 -31851700 -29257441 -38267568 -1768142 -16109499
13669a6109499l2746906A3910732a9803083a389950j7170720j8273229J8234440
$$ -16109499 -48856405 13910732 -19803083 -1389950 -18560670 -36833899 -18599459
13662a8599459B4715484d2774709a3489715B2081395a1542550D914353a4820343
$$ -18599459 24715484 -42774709 -13489715 22081395 -11542550 4914353 -14820343
13654b1161362m662905f500950F094972a9208251k1624711J4982864q293221P408412
$$ -21161362 -25824267 -6500950 6094972 -19208251 -40832962 -25850098 -34143319 -26734907
13646b6734907k0487958g772130B7268694A2464900f853679j6504146C023096
$$ -26734907 -47222865 -7772130 27268694 12464900 -6853679 -23357825 3023096
13638h161227j9423026J2983526M345348A9964c1201605a2402493k8054944A6497928
$$ -8161227 -27584253 -14600727 -10255379 19964 -31201605 -12402493 -40457437 16497928
13629D681063b600229n360983n9730607c822730B828138K160067R947104e526
$$ 4681063 -2600229 -7961212 -67691819 -3822730 2828138 4988205 14935309 -5526
13620g331278j9186190J495274C0406605b5048150g737622q605502P489806m466450
$$ -7331278 -26517468 -25022194 30406605 -25048150 -7737622 -16343124 -8853318 -13319768
13612a3319768A0742822a2954059c961842C4381845H610601b2178069p859057
$$ -13319768 10742822 -12954059 -3961842 34381845 8610601 -22178069 -30037126
13605c0037126D4243875q202823a2464521O33613q727296A0406130c5147283B3007150
$$ -30037126 44243875 36041052 -12464521 -11830908 -20558204 10406130 -35147283 23007150
13596d0132360A8134321c031004j6407535p986429P245197A7897076o90734q419987
$$ -40132360 18134321 -3031004 -19438539 -27424968 -20179771 17897076 17206342 8786355
13588H786355b185760A4339820f029974k1211076e138299C690542J4080706c3150227
$$ 8786355 -2185760 14339820 -6029974 -27241050 -5138299 3690542 17771248 -33150227
13579d0615881A319130d6424260J5198911h075611A2405412a9787699A1104459
$$ -40615881 1319130 -46424260 -31225349 -8075611 12405412 -19787699 11104459
13571f857445j3098754d413168k9777507E89467c1543418K357888A3641901c6892252
$$ -6857445 -19956199 -4413168 -34190675 589467 -31543418 -29185530 13641901 -36892252
13562g728541J16898j1421900H352274b0555154n692817h924255l5463345i684295
$$ -7728541 -7611643 -19033543 8352274 -20555154 -26247971 -8924255 -44387600 -9684295
13553E0807505B1621864f0387633B7947362F690791a3946890G791091J0843046
$$ 50807505 21621864 -60387633 27947362 6690791 -13946890 7791091 18634137
13546A8634137b6249381k0228838a6594356d747760j6851865J743494k052917
$$ 18634137 -26249381 -46478219 -16594356 -4747760 -21599625 -19856131 -21909048
13539b1909048A3348356a0193219A9007276a9537463N009583H249282f67106j3777619
$$ -21909048 13348356 -10193219 19007276 -19537463 -14527880 8249282 -667106 -14444725
13531a4444725j3445348e102881l522876j8875843i3821n0768168D937669e1682907
$$ -14444725 -27890073 -5102881 -8625757 -27501600 -93821 -50861989 4937669 -51682907
13522b2034889j2222058D4864892a7525370j3741222k4110200A4874937d3170857
$$ -22034889 -34256947 44864892 -17525370 -31266592 -55376792 14874937 -43170857
13514c4900557o88601c725016j0231014j2858886j7206651K1655409q34268j8028587
$$ -34900557 -35589158 -3725016 -13956030 -26814916 -44021567 -22366158 -23200426 -41229013
13506d1229013J2631863m156305l8759334i678514d29114F214934b7054216I495725
$$ -41229013 -28597150 -32753455 -71512789 -9678514 -429114 6214934 -27054216 9495725
13497A2058710d0278898f663514n120839B5574299g516607j9972742A272625b8567503
$$ 12058710 -40278898 -6663514 -11784353 25574299 -7516607 -27489349 1272625 -28567503
13488B5411647r290385i590403k1639720f270906I074985e358543l7316786j2732185
$$ 25411647 16121262 -9590403 -31230123 -6270906 9074985 -5358543 -42675329 -55407514
13480e5407514K4803120b247029k4677272A0664098b1722366e810897B664376
$$ -55407514 -30604394 -2247029 -26924301 10664098 -21722366 -5810897 2664376
13472a9758389m973244E502242c4836884A7015934b3478661A0235127J7757265
$$ -19758389 -24731633 5502242 -34836884 17015934 -23478661 10235127 27992392
13465B7992392K7789843A6022896k531231f475223D5371623b6324817i253077
$$ 27992392 55782235 16022896 13491665 -6475223 45371623 -26324817 -9253077
13457a001159l059978D743912j601558f702525H731952c0275497i674346Q161
$$ -1001159 -4061137 4743912 3142354 -6702525 8731952 -30275497 -9674346 -9666185
13449i666185A0635904A298860b944141G587830a4454657O763487j6829905A7073173
$$ -9666185 10635904 1298860 -2944141 7587830 -14454657 -7691170 -24521075 17073173
13440a703641D978503b2064516e740443B268147n69189c7061085R819264J2426375
$$ -1703641 4978503 -22064516 -5740443 2268147 1698958 -37061085 -27241821 -14815446
13432a4815446n603191r921277j168605J4627985q126256B380099a3499755d643137
$$ -14815446 -20418637 -30339914 -31508519 -16880534 -25006790 2380099 -13499755 -4643137
13423c7251670l968356J5610546A9931065H74569J1531748h680724B359584b3442522
$$ -37251670 -41220026 -25609480 19931065 874569 12406317 -8680724 2359584 -23442522
13414d3823820j3878864K0968309k763272D112091a7220739H103498J4794414
$$ -43823820 -57702684 -36734375 -39497647 4112091 -17220739 8103498 22897912
13407B2897912b5032931L402656P734819A5343006N406074k029913e024751q373662
$$ 22897912 -25032931 -21630275 -13895456 15343006 20749080 18719167 -5024751 -13398413
13399a3398413j6688063a2180882j0568867G587566b8939253b758063o1126890
$$ -13398413 -30086476 -12180882 -22749749 7587566 -28939253 -2758063 -63884953
13392f3884953f007441F0034437B5188329d03728k1514894h943165B2952375c8693071
$$ -63884953 -6007441 60034437 25188329 -403728 -21918622 -8943165 22952375 -38693071
13383B7406756d2302918A6543707a4079685q96369p656040a1265028C469215a2353736
$$ 27406756 -42302918 16543707 -14079685 -14976054 -22632094 -11265028 3469215 -12353736
13374C5414721a2213195j1837938C030470b1543258e585755j396954j8575149
$$ 35414721 -12213195 -24051133 3030470 -21543258 -5585755 -6982709 -25557858
13367b5557858A4051831c6234491A5164642n916412f626722A4086823b6649217
$$ -25557858 14051831 -36234491 15164642 9248230 -6626722 14086823 -26649217
13359g64595o2973443K8548658a6581752j3054222b114665H36861f635230C6503693
$$ -764595 -63738038 -35189380 -16581752 -29635974 -2114665 836861 -6635230 36503693
13350E176192R037556i948495A3598195a7150226I185776i355760k9136706A1758436
$$ 5176192 14213748 -9948495 13598195 -17150226 9185776 -9355760 -38492466 11758436
13341e7698907A902615a0476235n0912973a6767986k0370003a5820546A1522595
$$ -57698907 1902615 -10476235 -61389208 -16767986 -37137989 -15820546 11522595
13333a3717861L09909A6009784e8795833C287606j86473a9288058j4859694h81862
$$ -13717861 -13407952 16009784 -58795833 3287606 3101133 -19288058 -34147752 -881862
13324G222865a7302040o101896j933803N193102f625343R0450j5205854R182935
$$ 7222865 -17302040 -23403936 -25337739 -20144637 -6625343 -6534893 -21740747 -12557812
13316a2557812J229890j1601955m368796A8204731p948928k875244J3203708b0687113
$$ -12557812 -11327922 -22929877 -27298673 18204731 10255803 7380559 20584267 -20687113
13307A5125050J0796241i397062b058786E490547b2694010M617424l428508k0102386
$$ 15125050 25921291 -9397062 -2058786 5490547 -22694010 -18076586 -21505094 -41607480
13299d1607480J3852399j952179B3481089b431682a33565D2177687A8911889G095141
$$ -41607480 -27755081 -29707260 23481089 -2431682 -133565 42177687 18911889 7095141
13290A6851006g907382c908214l2997836D575082L431501g040875j7015735l984910
$$ 16851006 -7907382 -3908214 -36906050 4575082 8006583 -7040875 -24056610 -28041520
13282b8041520B968595J2739275b4327942c112653f29336j8800105m081850A7108534
$$ -28041520 2968595 15707870 -24327942 -3112653 -629336 -19429441 -23511291 17108534
13273A2124966K3014013n346300c2181208R51377A5011589m079432e4043365a8931335
$$ 12124966 35138979 29792679 -32181208 -31229831 15011589 10932157 -54043365 -18931335
13264B3360104M891914e0983723C93433a801699n5784761g613344h6782A0516323
$$ 23360104 28252018 -50983723 393433 -1801699 -57586460 -7613344 -86782 10516323
13255I713689b07437A0768516k320755d2356137a004224k7312588E057034J1708310
$$ 9713689 -207437 10768516 8447761 -42356137 -1004224 -28316812 5057034 16765344
13247A6765344D461417J4374349r021176b5150313l0966037H218610b8905712
$$ 16765344 4461417 18835766 9814590 -25150313 -56116350 8218610 -28905712
13239b6214272a1857764J817926k5636505J2809486j7296048e152113p190665
$$ -26214272 -11857764 -10039838 -35676343 -22866857 -40162905 -5152113 -12342778
13232a2342778D579489a508519A5590231M784271d225177A9097363H342702l716112
$$ -12342778 4579489 -1508519 15590231 20374502 -4225177 19097363 8342702 4626590
13224D626590O467489c6404542A1380523i769540k9018079F829879J4111560c6795189
$$ 4626590 11094079 -36404542 11380523 -9769540 -38787619 6829879 20941439 -36795189
13215a5808225C044401i599456k9186406L2187a8714246A9726876b9001080h473432
$$ -15808225 3044401 -9599456 -38785862 -38753675 -18714246 19726876 -29001080 -8473432
13206f6369561A8731316b2231482g65485j5885921A604654J4298366h173485A8036475
$$ -66369561 18731316 -22231482 -765485 -16651406 1604654 15903020 -8173485 18036475
13197b3097236h336735K094411H828477a0911309L95187k5806489B5070113c6133907
$$ -23097236 -8336735 -6242324 8828477 -10911309 -10516122 -36322611 25070113 -36133907
13188e8006900B2316954B68549i464282j2807127N074273J613495B8991641b625876
$$ -58006900 22316954 268549 -9464282 -22271409 -17197136 -15583641 28991641 -2625876
13179b6872495B2000774a6290865e490065a545101l213955k58644C578938K8744250
$$ -26872495 22000774 -16290865 -5490065 -1545101 -4759056 -5017700 3578938 32323188
13171C2323188a9091782P65181A6942805a971414k1395714I010664c7165424a109182
$$ 32323188 -19091782 -18326601 16942805 -1971414 -23367128 9010664 -37165424 -1109182
13162b2283482A2587591c0922332A896725e573093H099468a705952B5389669e87675
$$ -22283482 12587591 -30922332 1896725 -5573093 8099468 -1705952 25389669 -587675
13153b0404923H660659a9992018g300992A1726105b6666797G449744R869752K4375633
$$ -20404923 8660659 -19992018 -7300992 11726105 -26666797 7449744 17319496 41695129
13145D1695129n710007a7300613J613760F784775c1702093j0534980a7801897
$$ 41695129 35985122 -17300613 -15686853 6784775 -31702093 -42237073 -17801897
13137d8286561D22467g208939C524445e274347C0044100p233717b0208724A316434
$$ -48286561 422467 -7208939 3524445 -5274347 30044100 22810383 -20208724 1316434
13128a1752491a771885B5899013a0683715A5637426a7364486g776106j9145690
$$ -11752491 -1771885 25899013 -10683715 15637426 -17364486 -7776106 -26921796
13121b6921796C416956e659783k29314j1979012j9003695f748713q005112m6256598
$$ -26921796 3416956 -5659783 -5889097 -17868109 -36871804 -6748713 -14753825 -61010423
13113f1010423A3332762c896654M4569K43991k3427975E450189J1926901n951707
$$ -61010423 13332762 -3896654 -3852085 -3608094 -27036069 5450189 17377090 11425383
13105A1425383b4471374J0291302K351634R06670M67232j6110661l215436k1375936
$$ 11425383 -24471374 -14180072 -11828438 -10921768 -10454536 -26565197 -29780633 -51156569
13097e1156569A8795245e161263G128714a8310627H577461b1252766j4187616
$$ -51156569 18795245 -5161263 7128714 -18310627 8577461 -21252766 -35440382
13090c5440382J4957535C753513M7391406c5598242m942148B160113g094357j9542813
$$ -35440382 -20482847 3753513 51144919 -35598242 -40540390 2160113 -7094357 -26637170
13082b6637170k6507027a838836A9794643C105743c4680046I524430b9716428
$$ -26637170 -53144197 -1838836 19794643 3105743 -34680046 9524430 -29716428
13074h439471i28994n749619q965112B6620604G061243J1293850a5162300P054640
$$ -8439471 -928994 -6678613 -15643725 26620604 7061243 18355093 -15162300 -8107660
13066h107660A3273216m084716R346588q602735h165680j9201739N701417e41473
$$ -8107660 13273216 9188500 18535088 9932353 -8165680 -27367419 -21666002 -541473
13057A8630772b0011809H230110P367374B173999L485312b9593382D899352J005891
$$ 18630772 -20011809 8230110 15597484 2173999 5659311 -29593382 4899352 5905243
13049E905243c10250k7676289a0370295B6522612A988761g889192k860589j040103
$$ 5905243 -310250 -27986539 -10370295 26522612 1988761 -7889192 -10749781 -11789884
13041a1789884n667184F150220d3241175B7155788j3537879i165207c832369k3181512
$$ -11789884 -17457068 6150220 -43241175 27155788 13617909 -9165207 -3832369 -27013881
13033b7013881d13090H501414d2372424a7389906a450726C253544a285119j2923327
$$ -27013881 -413090 8501414 -42372424 -17389906 -1450726 3253544 -1285119 -14208446
13025a4208446b386263A4941203h199682q712650P87609k2659696O774010J0251518
$$ -14208446 -2386263 14941203 -8199682 -16912332 -16124723 -38784419 -32010409 -21758891
13017b1758891o366490A1764003b5116021j0488565B8249994a1845596B577500
$$ -21758891 -28125381 11764003 -25116021 -35604586 28249994 -11845596 2577500
13009c5330058j58025m697904A9022520a4041896D120066N965312a9946146n8770586
$$ -35330058 -35488083 -40185987 19022520 -14041896 4120066 10085378 -19946146 -78716732
13001g8716732e395542n721096j9988722M516373J2791064o059202C820110K1359130
$$ -78716732 -5395542 -11116638 -31105360 -26588987 -13797923 -19857125 3820110 25179240
12993B5179240B399238K7893931A0757393b9649776r586404a1411867k007767
$$ 25179240 2399238 30293169 10757393 -29649776 -39236180 -11411867 -13419634
12986a3419634D7467201h758764p320508B6828130A0936412f12124H493463a5139420
$$ -13419634 47467201 -8758764 -16079272 26828130 10936412 -612124 8493463 -15139420
12977a3834894j318569B0368121f44338k5830235A172164a5341986m8546402B620383
$$ -13834894 -15153463 20368121 -644338 -26474573 1172164 -15341986 -63888388 2620383
12968h04711A2927806M1731696b271061D434854g113780M0901L352817j3017040
$$ -804711 12927806 54659502 -2271061 4434854 -7113780 -7072879 -3720062 -16737102
12960a6737102A6399715M583467b3907436I595853c4204856C5505380b1166845
$$ -16737102 16399715 20983182 -23907436 9595853 -34204856 35505380 -21166845
12952A6551082b9037263d405339E8969002b0171531a688027A5066678D659761
$$ 16551082 -29037263 -4405339 58969002 -20171531 -1688027 15066678 4659761
12944b2231983A2612083c879333l9903837A1165655C064213a7990266o732626
$$ -22231983 12612083 -3879333 -43783170 11165655 3064213 -17990266 -24722892
12937b4722892j0510248f583428a636940j3860146R3146r475663A3157971b3705838
$$ -24722892 -35233140 -6583428 -1636940 -15497086 -15403940 -24879603 13157971 -23705838
12928c9345289g565356F636710h172210A7467244a7607144r003202H361011b1615704
$$ -39345289 -7565356 6636710 -8172210 17467244 -17607144 -26610346 8361011 -21615704
12919g613463A9135382h514613A7874917c7789323a2012685c900893p593260c604773
$$ -7613463 19135382 -8514613 17874917 -37789323 -12012685 -3900893 -11494153 -3604773
12910b0374181B2841621O54476a2056991A2194009a9305529c160924I931249B537451
$$ -20374181 22841621 23496097 -12056991 12194009 -19305529 -3160924 9931249 2537451
12901A3561756k902183a528778k3987392n390800C4362618c307821B8850184B496712
$$ 13561756 10659573 -1528778 -25516170 -30906970 34362618 -3307821 28850184 2496712
12892e223455k4211708B903654d449240A4910171l055976a7380510P442715A6999166
$$ -5223455 -29435163 2903654 -4449240 14910171 11854195 -17380510 -9937795 16999166
12883e708701k8291695j0355080J2522434k544100j149732A7832564c2440909
$$ -5708701 -34000396 -44355476 -31833042 -34377142 -35526874 17832564 -32440909
12875A9679970a7810946j6858671J5990882n907651o769001g33591A3776751A228262
$$ 19679970 -17810946 -34669617 -18678735 -24586386 -31355387 -733591 13776751 1228262
12866b1243957l3147194a6207858M875438C2504537d0787857G798732a2673721
$$ -21243957 -54391151 -16207858 -11332420 32504537 -40787857 7798732 -12673721
12858a8588647M750996F696996i209918A8233433m508672B201114J4880638e656063
$$ -18588647 -13837651 6696996 -9209918 18233433 13724761 2201114 17081752 -5656063
12849C107025e303658I238454e828278j4833900d530152k6823070D773858a7234477
$$ 3107025 -5303658 9238454 -5828278 -20662178 -4530152 -31353222 4773858 -17234477
12840D55901J1011744a9973800R570583B5903115A2897569K3911900b4056123
$$ 455901 11467645 -19973800 -10403217 25903115 12897569 36809469 -24056123
12832C8452233a9935593r901894K490283C4318542I898630f8484m5056393b092915
$$ 38452233 -19935593 -29837487 -27347204 34318542 9898630 -68484 -45124877 -2092915
12823c7978311c869679I413195i891206j2343389C799783R599988d1922844B537567
$$ -37978311 -3869679 9413195 -9891206 -22234595 3799783 13399771 -41922844 2537567
12814a9659209d131804m321061j5101006e772872j9528945E676946c9876223a4135169
$$ -19659209 -4131804 -8452865 -23553871 -5772872 -25301817 5676946 -39876223 -14135169
12805a2064186c138266A405480b904136k0898150B559101g986705j0801173B0033279
$$ -12064186 -3138266 1405480 -2904136 -23802286 2559101 -7986705 -18787878 20033279
12796G061644b8033786i563017m1680155b2928220Q135842H629333a6437180d765196
$$ 7061644 -28033786 -9563017 -51243172 -22928220 -14792378 8629333 -16437180 -4765196
12787a1734247D627825M202011d5006935a1639017e174943j6977530a82330H588789
$$ -11734247 4627825 8829836 -45006935 -11639017 -5174943 -22152473 -182330 8588789
12778c396320k2462624J1057684d147737j5448342G746573f438124j2228495c108652
$$ -3396320 -25858944 -14801260 -4147737 -19596079 7746573 -6438124 -18666619 -3108652
12769b3556143k907709D129798K3384556E881105b1487951G578773h916623j5056847
$$ -23556143 -26463852 4129798 27514354 5881105 -21487951 7578773 -8916623 -23973470
12761b3973470m1214036b4944944D766075p63147a0100721k214936H528591d1642957
$$ -23973470 -65187506 -24944944 4766075 4002928 -10100721 -12315657 8528591 -41642957
12752E489325a3581314Q22102I582502l431847J7860424g630453l879765L045076
$$ 5489325 -13581314 -12759212 9582502 6150655 24011079 -7630453 -11510218 -8465142
12744h465142B1166400c4253387h172178k463791j3121486H879841h882457j8177254
$$ -8465142 21166400 -34253387 -8172178 -10635969 -23757455 8879841 -8882457 -27059711
12736b7059711I846364J2279214B741734a9439570j1565415G133078b2729971
$$ -27059711 9846364 22125578 2741734 -19439570 -31004985 7133078 -22729971
12728a4460726k6680166K0279809p055224C1833355A0551881M149705g477255
$$ -14460726 -41140892 -20861083 -27916307 31833355 10551881 14701586 -7477255
12720a7105672A17697a3464757e549407j3812009n00405A9903862a8387213D829125
$$ -17105672 117697 -13464757 -5549407 -19361416 -19861821 19903862 -18387213 4829125
12711c1549102i295254k4568425A4654576L0116080d3656747J2659187J523791
$$ -31549102 -9295254 -33863679 14654576 44770656 -43656747 -30997560 -29473769
12704b9473769o135261I285865a2171327M848113j0354903A216337i590990L779321
$$ -29473769 -35609030 9285865 -12171327 -7323214 -17678117 1216337 -9590990 -5811669
12696e811669J560136F548062j369592J1856972d7870530c15715C8882679b1575474
$$ -5811669 -4251533 6548062 5178470 17035442 -47870530 -315715 38882679 -21575474
12687f861934r784593N918B4089104h149369H147412g453410k8490779D689855
$$ -6861934 -16646527 -16640609 24089104 -8149369 8147412 -7453410 -35944189 4689855
12678b0850597A0089521a9596141B22006J468317a4961125e428083C924702M130507
$$ -20850597 10089521 -19596141 222006 1690323 -14961125 -5428083 3924702 8055209
12670H055209C645024K0992464b3805668A1722609J0472138i382678A5362575
$$ 8055209 3645024 24637488 -23805668 11722609 22194747 -9382678 15362575
12662A2479735h619651j4794203Q11255f550308j2086425A4085978b9311493C3607023
$$ 12479735 -8619651 -23413854 -22602599 -6550308 -18636733 14085978 -29311493 33607023
12653g588701b74326r476529C244330g015245k2633293A6350000b3314053B402797
$$ -7588701 -274326 -9750855 3244330 -7015245 -29648538 16350000 -23314053 2402797
12644A181268c8610025D147991A573714a2629907k3764025i265010d550584A0803784
$$ 1181268 -38610025 4147991 1573714 -12629907 -36393932 -9265010 -4550584 10803784
12635b5800754i695941A49674K1912326F709883a2713676l068924B8651634A1430179
$$ -25800754 -9695941 149674 22062000 6709883 -12713676 -15782600 28651634 11430179
12626e3793382a9768047A1063515b3717464g858361n4710512b8546490L67942
$$ -53793382 -19768047 11063515 -23717464 -7858361 -62568873 -28546490 -28178548
12619b8178548B2124127D49313J2590154D758496c7008459B222152e1642958i00226
$$ -28178548 22124127 449313 13039467 4758496 -37008459 2222152 -51642958 -900226
12610a1950988k2032122B1896630h784948l225319l2023434J0902263C2980230
$$ -11950988 -33983110 21896630 -8784948 -12010267 -44033701 -33131438 32980230
12602g589007A5901019f347173B1648458b0269208m54465g756596A5797247d272786
$$ -7589007 15901019 -6347173 21648458 -20269208 -20723673 -7756596 15797247 -4272786
12593b4619110r05372i458031B8741949a8853697k769259A9646896H976231A892363
$$ -24619110 -25524482 -9458031 28741949 -18853697 -21622956 19646896 8976231 1892363
12584a5938157B0153133b3914269l1585859J5360735a3879799j2338678a1764029
$$ -15938157 20153133 -23914269 -55500128 -40139393 -13879799 -26218477 -11764029
12576e6470771b0132487l4421030b4591121h423596B4683292o365576a4767696
$$ -56470771 -20132487 -54553517 -24591121 -8423596 24683292 18317716 -14767696
12568a7698418M698269C52443a1625153A6387844F608651M633022J941930c5358893
$$ -17698418 -13000149 352443 -11625153 16387844 6608651 11241673 13183603 -35358893
12559a2687954A1221976a0205023D3593207c756448j2584788B834343g870139
$$ -12687954 11221976 -10205023 43593207 -3756448 -16341236 2834343 -7870139
12551a34076l2642601o590171g809719J674368j7558608j9491759a9055263A7438159
$$ -134076 -32776677 -39366848 -7809719 -6135351 -23693959 -43185718 -19055263 17438159
12542G935552l883078O090741D745678c2367869f540912A8099358n019524e8037854
$$ 7935552 4052474 10143215 4745678 -32367869 -6540912 18099358 13079834 -58037854
12533a3708220j0164382j482871I368860b1370254o076309D743643K0214678a5130801
$$ -13708220 -23872602 -25355473 9368860 -21370254 -27446563 4743643 24958321 -15130801
12524A896713K7719530A1754953b5230050E1999893A824816c7607931a3578733
$$ 1896713 29616243 11754953 -25230050 51999893 1824816 -37607931 -13578733
12516a7136968c647109j9941145b537576C2031873I562273a9813844j0417885
$$ -17136968 -3647109 -23588254 -2537576 32031873 9562273 -19813844 -30231729
12509c0231729K570393a1398700G546367b225823A7511604h673952L307145o324127
$$ -30231729 -27661336 -11398700 7546367 -2225823 17511604 -8673952 -5366807 -11690934
12501a1690934J496379c051674m72442k9364346J94735E0304032A6506217C541943
$$ -11690934 -10194555 -3051674 -3524116 -32888462 -32693727 50304032 16506217 3541943
12492a6374653n19492A5245396F930073B057699c3585579A428705a9348577b640771
$$ -16374653 -16894145 15245396 6930073 2057699 -33585579 1428705 -19348577 -2640771
12483d0268614A2814250d194026l5207506J1583395p664615a2531920C70389a9421888
$$ -40268614 12814250 -4194026 -39401532 -27818137 -35482752 -12531920 370389 -19421888
12474h292200j7485223B4430962b678066k184670J722300p114734n004804N911093
$$ -8292200 -25777423 24430962 -2678066 -4862736 -3140436 -10255170 -15259974 -9348881
12466i348881K980268j4349504l836217n408802k1708369b4682203J1196191b806660
$$ -9348881 -6368613 -20718117 -24554334 -29963136 -51671505 -24682203 -13486012 -2806660
12457a3016206m1273169a127151k7679066R504778B0521696g0882445A3291616
$$ -13016206 -54289375 -1127151 -28806217 -19301439 20521696 -70882445 13291616
12449c2846128c258578j2563366A9896294C251993O29325K444624b9389308N380317
$$ -32846128 -3258578 -15821944 19896294 3251993 3881318 6325942 -29389308 -24008991
12441b4008991G81825c1953110A7730190B525539c1836375L6484B2625046A0026424
$$ -24008991 781825 -31953110 17730190 2525539 -31836375 -31799891 22625046 10026424
12432b686587j8763590B2192953f7629218A3689536b4823710f741786j6312990
$$ -2686587 -21450177 22192953 -67629218 13689536 -24823710 -6741786 -23054776
12425b3054776j630822m764204a1520588j8992419J4228187q719682D1063741
$$ -23054776 -24685598 -29449802 -11520588 -30513007 -16284820 -25004502 41063741
12417a4109989O05185k9438754a0235542a350678o87976j8648425f976040B0942914
$$ -14109989 -13504804 -42943558 -10235542 -1350678 -2038654 -20687079 -6976040 20942914
12408d812489n403201A248363E51244a3436503j7731572D334921c1027293B809167
$$ -4812489 -10215690 1248363 551244 -13436503 -31168075 4334921 -31027293 2809167
12399i980102F19241M371969d7800319b1781254j7788516g358539k5587375Q292150
$$ -9980102 619241 4991210 -47800319 -21781254 -39569770 -7358539 -32945914 -24653764
12391b4653764A1087982b9132458J2050635B0557004c661217q214186m09173i940
$$ -24653764 11087982 -29132458 -17081823 20557004 -3661217 -11875403 -12284576 -9940
12382f718304k4038979k023692C283099K3498985J3195828B98244d0767658B0960300
$$ -6718304 -30757283 -32780975 3283099 26782084 39977912 298244 -40767658 20960300
12373b833889J399282j2473778B5226707d6082638a9037954d257691a74885A932764
$$ -2833889 -1434607 -13908385 25226707 -46082638 -19037954 -4257691 -174885 1932764
12364D3365929d726460j0211801b387305B6027511r802478b682991j9497455Q210814
$$ 43365929 -4726460 -14938261 -2387305 26027511 16225033 -2682991 -22180446 -13969632
12356a3969632D2210719b7962570j0609026A3203727d416525j4050212Q50254
$$ -13969632 42210719 -27962570 -38571596 13203727 -4416525 -18466737 -17616483
12349a7616483A1993373J075311a2180224A6194181c5293525c941780C0465825
$$ -17616483 11993373 13068684 -12180224 16194181 -35293525 -3941780 30465825
12341D681689K2738662F17055a2288844C736762j93198a2062508o252023h325596
$$ 4681689 27420351 617055 -12288844 3736762 3543564 -12062508 -18314531 -8325596
12332B755309a9942715a102393j7484487I297723d307551C944738O287516C744531
$$ 2755309 -19942715 -1102393 -18586880 9297723 -4307551 3944738 10232254 3744531
12323a5463931A0856916a5872029j066785K947514D176493a5599340m83372j0539109
$$ -15463931 10856916 -15872029 -16938814 -13991300 4176493 -15599340 -16082712 -26621821
12315b6621821O45122J1660434R46426j7254243B0255911I79195b3392945P788044
$$ -26621821 -25976699 -14316265 -13369839 -30624082 20255911 979195 -23392945 -15604901
12307a5604901K384226j1851815P043194n920764Q910763E106724L5988729k684416
$$ -15604901 -13220675 -25072490 -18029296 -23950060 -15039297 5106724 41095453 38411037
12299C8411037c7680470b7700k6812532i933616m0856398h324508F885295a5633796
$$ 38411037 -37680470 -27700 -26840232 -9933616 -50790014 -8324508 6885295 -15633796
12290g804077j1771443c771671B2110620b0526405B6863451F332452j728633b2092314
$$ -7804077 -19575520 -3771671 22110620 -20526405 26863451 6332452 4603819 -22092314
12281b0357630m926556A6973843l468739H52359h877857p934675p682998l0516788
$$ -20357630 -25284186 16973843 13505104 852359 -8877857 -16812532 -24495530 -55012318
12273e5012318B669078b3049499C385317b8229596J0629576k1952057I433246
$$ -55012318 2669078 -23049499 3385317 -28229596 -17600020 -39552077 9433246
12265a6945557H457788c6619339A0745853l11545B403139b7717134Q357701j6549712
$$ -16945557 8457788 -36619339 10745853 10434308 2403139 -27717134 -19359433 -35909145
12257c5909145A0231635K1508219I91287d790578A6129204J4115053m933724a6333707
$$ -35909145 10231635 31739854 991287 -4790578 16129204 30244257 25310533 -16333707
12248a8582208C4157495H31942a0866817p590031f1005r835732B0606783C437013
$$ -18582208 34157495 831942 -10866817 -18456848 -61005 -9896737 20606783 3437013
12239c1686037J3063734C7299233f863041k4136691F576787b509279j4715538
$$ -31686037 -18622303 37299233 -6863041 -30999732 6576787 -2509279 -17224817
12232a7224817r702945J2678366O424309A5328999c9105989C944643c4881553
$$ -17224817 -26927762 -14249396 -7825087 15328999 -39105989 3944643 -34881553
12224C0103787D843634a6605704C0211354A1863374b3226748L716727K232231
$$ 30103787 4843634 -16605704 30211354 11863374 -23226748 -19510021 -17277790
12217a7277790C566154a3610081d671572l0305387a0125836j5496194d061457
$$ -17277790 3566154 -13610081 -4671572 -34976959 -10125836 -25622030 -4061457
12209d0255187D740417a8872481A1480527L450595b8725218J0341198H269103
$$ -40255187 4740417 -18872481 11480527 14931122 -28725218 -18384020 8269103
12201a2661347C003876a1443016A1223276a5006654q976283R536717A4207691
$$ -12661347 3003876 -11443016 11223276 -15006654 -23982937 -14446220 14207691
12193d4870419A0701720d699319A6543399a3682637d496120k2562323l888123
$$ -44870419 10701720 -4699319 16543399 -13682637 -4496120 -27058443 -30946566
12186c0946566B2487467a5580684L273409p939320A0047206L635974h616267l124598
$$ -30946566 22487467 -15580684 -12307275 -20246595 10047206 13683180 -8616267 -11740865
12178a1740865N28561c297400j1577693l1566646m583499A4780166e833417l7408955
$$ -11740865 -11212304 -3297400 -14875093 -46441739 -51025238 14780166 -5833417 -43242372
12170d3242372A7999577A816890J147762b0821603p228429J2480647q148692m068679
$$ -43242372 17999577 1816890 2964652 -20821603 -28050032 -15569385 -23718077 -27786756
12162b7786756D473277n61514c4125212J6946783j8434389a2434686K246124F445175
$$ -27786756 4473277 3911763 -34125212 -17178429 -35612818 -12434686 -10188562 6445175
12153a4440550k4409582D685985b3939013c076629B2191051f468252j6135329
$$ -14440550 -38850132 4685985 -23939013 -3076629 22191051 -6468252 -22603581
12146b2603581A8953650b285573j2672142A1310482a860369G501398e1579525
$$ -22603581 18953650 -2285573 -14957715 11310482 -1860369 7501398 -51579525
12138c1734373L546702D8252788i891860M373961B9418716a3568301a267778k0547652
$$ -31734373 -28187671 48252788 -9891860 -5517899 29418716 -13568301 -1267778 -21815430
12130b1815430c175786l6550909C4367076a6245271j9191453A9336196E113298
$$ -21815430 -3175786 -39726695 34367076 -16245271 -35436724 19336196 5113298
12122c0415352m729311J1030413O597949j0924892B3383685a0998415o905192
$$ -30415352 -35144663 -24114250 -17516301 -28441193 23383685 -10998415 -17903607
12115a7903607A116279J5137644a4398029N919428B5139315b0932793a945999
$$ -17903607 1116279 16253923 -14398029 -8478601 25139315 -20932793 -1945999
12107B0419742g550661j8480230r698828e722141K727772l4177042D011457J3713689
$$ 20419742 -7550661 -26030891 -35729719 -5722141 -2994369 -37171411 4011457 17725146
12099A7725146H480790d1729697J2119861G101332a7683473n89332A5876888J4949924
$$ 17725146 8480790 -41729697 -29609836 7101332 -17683473 -18272805 15876888 30826812
12091C0826812a4264046F481598k693259M811291b4123146a0057876k842687K321679
$$ 30826812 -14264046 6481598 3788339 8599630 -24123146 -10057876 -12900563 -10578884
12083a0578884j7024690G551440e389352k002039F366138L280595i933337A6024071
$$ -10578884 -27603574 7551440 -5389352 -7391391 6366138 9646733 -9933337 16024071
12074a7418399q484728A9927597M88926a8975950j6722538g07205q967381r455450
$$ -17418399 -25903127 19927597 20416523 -18975950 -35698488 -707205 -9674586 -19130036
12066a9130036D1432375E941845a1120711E576066c1068760N435074h131617j4718936
$$ -19130036 41432375 5941845 -11120711 5576066 -31068760 -25633686 -8131617 -22850553
12058b2850553j9798571A0907817c0699966A1988866M918269j262918m728923
$$ -22850553 -42649124 10907817 -30699966 11988866 16907135 15644217 10915294
12051A0915294c8308736a4311304p783580A1470482B663410a2192134j2565134
$$ 10915294 -38308736 -14311304 -22094884 11470482 2663410 -12192134 -24757268
12044b4757268f113041q046332j4048837e81457A4934160D041976P343135a3392996
$$ -24757268 -6113041 -14159373 -28208210 -581457 14934160 4041976 11385111 -13392996
12035g322641A0499703c8071767D25279a7043470A5155874f851078j9464874A9474968
$$ -7322641 10499703 -38071767 425279 -17043470 15155874 -6851078 -26315952 19474968
12026b461581L64971B2534911M817464A522085a5853868j1817651N935139A8765101
$$ -2461581 -2096610 22534911 27352375 1522085 -15853868 -27671519 -21736380 18765101
12017C563514c2219361A5867372b6424045D4841436b9615724A9979619c2639374
$$ 3563514 -32219361 15867372 -26424045 44841436 -29615724 19979619 -32639374
12009a7964498k9872522A1441688J1845527b8869516E493652O292195i837771
$$ -17964498 -47837020 11441688 23287215 -28869516 5493652 11785847 -9837771
12001a6436113H106362J3628410b0000391B3913576b4463184Q832224k4639419
$$ -16436113 8106362 21734772 -20000391 23913576 -24463184 -15630960 -40270379
11994d0270379i021344A9280484a7546514J670118K635073k754371B1514342c9226687
$$ -40270379 -9021344 19280484 -17546514 -15876396 -13241323 -15995694 21514342 -39226687
11985A5904080n388993a8205541j1841590j2708638a4412129N671960B7548521
$$ 15904080 10515087 -18205541 -30047131 -42755769 -14412129 -8740169 27548521
11977b7140215D318619a1832230f22153j9382344c394192j9793191R75286C1996264
$$ -27140215 4318619 -11832230 -622153 -20004497 -3394192 -23187383 -22212097 31996264
11968A895186K6728675c0264565k7532027J4312260B8489031d5335055a6736751
$$ 1895186 28623861 -30264565 -57796592 -43484332 28489031 -45335055 -16736751
11960b4689644I997463a7412710A068409Q015411a9015741B0024000H583132i297798
$$ -24689644 9997463 -17412710 1068409 9083820 -19015741 20024000 8583132 -9297798
11951c0792286H528641i75196j9540729A477669f939796B2871241a7833468F433909
$$ -30792286 8528641 -975196 -20515925 1477669 -6939796 22871241 -17833468 6433909
11942e0459222B5431115i97960A3007895A317913c481448B5598259c3323337F862158
$$ -50459222 25431115 -997960 13007895 1317913 -3481448 25598259 -33323337 6862158
11933F642808i868055A679584c1996562j2032151a8092071p675566H261679K739156
$$ 6642808 -9868055 1679584 -31996562 -44028713 -18092071 -25767637 8261679 11000835
11925A1000835b74621j3255546J81954j732238L032875A0256441e0990636K1598453
$$ 11000835 -274621 -13530167 -13348213 -15080451 -12047576 10256441 -50990636 -29392183
11917b9392183O519466Q158606A6917285g34218k4389833B6343378E344159b6304822
$$ -29392183 -22872717 -14714111 16917285 -734218 -25124051 26343378 5344159 -26304822
11908C8160914a399452E11365a1549079C610541c361585J429880k1158069A3501697
$$ 38160914 -1399452 511365 -11549079 3610541 -3361585 -1931705 -23089774 13501697
11899h61334A118155K1423636a9973533j389418A9691472E338215c149320m3406427
$$ -861334 1118155 22541791 -19973533 -21362951 19691472 5338215 -3149320 -46555747
11891d6555747b1836271B5146392b1712219h707385k5161034f601268q453595
$$ -46555747 -21836271 25146392 -21712219 -8707385 -33868419 -6601268 -15054863
11884a5054863j229628a404753E779674a746627o623626j856240l368102C4060318
$$ -15054863 -16284491 -1404753 5779674 -1746627 -8370253 -10226493 -13594595 34060318
11875g968081j5113819A0467070g152526l6328415a2017786A2597122E707765
$$ -7968081 -23081900 10467070 -7152526 -43480941 -12017786 12597122 5707765
11867H036130j46525J9977469a9251180A3866235a5268508k11862n4057127b8551496
$$ 8036130 7889605 27867074 -19251180 13866235 -15268508 -15480370 -69537497 -28551496
11858I479166i287874A654465b6250911I561617h5782B618926c5632905a3429570
$$ 9479166 -9287874 1654465 -26250911 9561617 -85782 2618926 -35632905 -13429570
11849a5725343B34821a0839542k3766200R924930O112412D4744586e135946A6699241
$$ -15725343 234821 -10839542 -34605742 -24680812 -18568400 44744586 -5135946 16699241
11840B7392519b7305132k0332515a7349508B8615186b3804674A4485104J6095950
$$ 27392519 -27305132 -47637647 -17349508 28615186 -23804674 14485104 30581054
11833C0581054a3253322e62720n2861783F995742a8431534b603679F64347a0043059
$$ 30581054 -13253322 -562720 -53424503 6995742 -18431534 -2603679 664347 -10043059
11824F723599L5050306c2184995J4506050I502268a9424206l1529574B8549184
$$ 6723599 41773905 -32184995 -17678945 9502268 -19424206 -50953780 28549184
11816i429449B3768604b059313B091767b1343986D919343a9839545A407854b8767604
$$ -9429449 23768604 -2059313 2091767 -21343986 4919343 -19839545 1407854 -28767604
11807a5052712O67723p035244B902153N290290a0213232j6313952J05824a203332
$$ -15052712 -14384989 -21420233 2902153 8192443 -10213232 -26527184 -26421360 -1203332
11798F8211410c8894k8470751l8652242K4857822C9377952G984949a6529685N695057
$$ 68211410 -38894 -28509645 -67161887 -42304065 39377952 7984949 -16529685 -10834628
11790a0834628M737948o632872m244576B6853869G887757a5443810f748894j848955
$$ -10834628 -6096680 -12729552 -16974128 26853869 7887757 -15443810 -6748894 -8597849
11782h597849D191665K8207259j6108841c3573026Q352998L199681p418431B0874238
$$ -8597849 4191665 32398924 16290083 -33573026 -25220028 -22020347 -29438778 20874238
11773a7786037H335651f370057n0312426k410897B0518410a9067228K778251l3304353
$$ -17786037 8335651 -6370057 -56682483 -59093380 20518410 -19067228 -16288977 -49593330
11765d9593330J5642278a364214B091831a1179229m787590C4285742b0942433
$$ -49593330 -33951052 -1364214 2091831 -11179229 -15966819 34285742 -20942433
11757c5613267j751536A8206711a5790531B1920732c7464273a1708334c593250
$$ -35613267 -37364803 18206711 -15790531 21920732 -37464273 -11708334 -3593250
11749c3195058B2617104E275086b3380981C4236474e89501E568088L302735b3437443
$$ -33195058 22617104 5275086 -23380981 34236474 -589501 5568088 8870823 -23437443
11740e6020895B4103689A0026753b4527823b641178l790869C1096951c932017
$$ -56020895 24103689 10026753 -24527823 -2641178 -6432047 31096951 -3932017
11732h507802k3902078A3574905a1836492o781508c677491B1478743c9249253
$$ -8507802 -32409880 13574905 -11836492 -18618000 -3677491 21478743 -39249253
11724B7937405b2515526A6894423a6142366f297869B6780502i490635B6135802
$$ 27937405 -22515526 16894423 -16142366 -6297869 26780502 -9490635 26135802
11716f003333j3284561k0518547c650886B1161697a2865878l767834k2535135
$$ -6003333 -19287894 -39806441 -3650886 21161697 -12865878 -16633712 -39168847
11709c9168847H342244a3357205K711950g23347o327728j6696610P802572J322795
$$ -39168847 8342244 -13357205 -10645255 -723347 -7051075 -23747685 -15945113 -14622318
11701a4622318k423172B0114334D615000c5598643a7304059H911800a0015654
$$ -14622318 -17045490 20114334 4615000 -35598643 -17304059 8911800 -10015654
11693i158235l1490009A6185170o750891a9280672G962943K871763b6340967J1949331
$$ -9158235 -40648244 16185170 9434279 -19280672 7962943 10834706 -26340967 -14391636
11685a4391636G336310b4152332B5280782c07942C5666554a9833623e745257o597808
$$ -14391636 7336310 -24152332 25280782 -307942 35666554 -19833623 -5745257 -12343065
11677a2343065j9487788L860621o341840C287355b9937640B403027b1692550g0900
$$ -12343065 -31830853 -27970232 -34312072 3287355 -29937640 2403027 -21692550 -70900
11668B9862599b6620219C402368J1282507I82428d4411197B4301484a254028l193976
$$ 29862599 -26620219 3402368 14684875 982428 -44411197 24301484 -1254028 -4448004
11660d448004j5162345j5746893J0183980C2652105b1683978q896813B3246728
$$ -4448004 -19610349 -35357242 -25173262 32652105 -21683978 -30580791 23246728
11652a8200816A5196303a7207330B3998179b7023277B0518594K5627947b6223911
$$ -18200816 15196303 -17207330 23998179 -27023277 20518594 46146541 -26223911
11644a6564543l5859634e485366k6521298E841653J0628930c0406339d832300
$$ -16564543 -52424177 -5485366 -32006664 5841653 16470583 -30406339 -4832300
11636d7713737d239782l3066374a5198851H943114g364469k0828995h978754j9473181
$$ -47713737 -4239782 -37306156 -15198851 8943114 -7364469 -28193464 -8978754 -28451935
11628b8451935B2874416I468141Q200854J5764748i898812d531701D1866098a8740589
$$ -28451935 22874416 9468141 17668995 33433743 -9898812 -4531701 41866098 -18740589
11619E563358O568317A318671K4010773c0811880J4127331B6609354b2032407
$$ 5563358 12131675 1318671 25329444 -30811880 -16684549 26609354 -22032407
11611a7549532f750022D357331J4851246b7408433A4124824f651249B4369807
$$ -17549532 -6750022 4357331 19208577 -27408433 14124824 -6651249 24369807
11603B3445578G893456K09579b8984507B5637652h497476c035834l0447458G758612
$$ 23445578 7893456 8103035 -28984507 25637652 -8497476 -3035834 -33483292 7758612
11594c210542l7068772a2344669A9592857c2127271i508923j7871690J3500802
$$ -3210542 -40279314 -12344669 19592857 -32127271 -9508923 -27380613 -13879811
11587a3879811j0088452B725033b1790798P350604o317291d346843m241425l218287
$$ -13879811 -23968263 2725033 -21790798 -14440194 -20757485 -4346843 -8588268 -11806555
11579a1806555a562947n517562A305907f213152A3213693a5521831A9094616a9703140
$$ -11806555 -1562947 -7080509 1305907 -6213152 13213693 -15521831 19094616 -19703140
11570b4735282j5596303B801022c0621774g32669q180143A8817c2860991F712812
$$ -24735282 -40331585 2801022 -30621774 -732669 -8912812 18817 -32860991 6712812
11561C5789103a0315013q109875B8574002E582473A349908Q096915J0137057b6355490
$$ 35789103 -10315013 -18424888 28574002 5582473 1349908 9446823 19583880 -26355490
11552b9065540k6222767i128013k730359E076763O130050a3465178A431404a9572094
$$ -29065540 -55288307 -9128013 -11858372 5076763 11206813 -13465178 1431404 -19572094
11543a5235624K298931F524118a4548300A0733276a4929992A621948J0146285
$$ -15235624 -12936693 6524118 -14548300 10733276 -14929992 1621948 11768233
11536A1768233c277997A7360091C759046a0292610A069113J0807721D299989c569637
$$ 11768233 -3277997 17360091 3759046 -10292610 1069113 11876834 4299989 -3569637
11527b1497304A5995792G344869i231826j5772654d484240H06521J0966769E452826
$$ -21497304 15995792 7344869 -9231826 -25004480 -4484240 806521 11773290 5452826
11518A5824735E561720a6436113L251452o57225k4203125B6973348p323077c3475665
$$ 15824735 5561720 -16436113 -13184661 -13841886 -38045011 26973348 19650271 -33475665
11509B594030M221554b0863284A6167007a4964335c110080m776954j1564369B1333656
$$ 2594030 6815584 -20863284 16167007 -14964335 -3110080 -7887034 -19451403 21333656
11500b26262j0733163A3841163Q882934a4265876k3325398D054829a3333443N897459
$$ -226262 -10959425 13841163 22724097 -14265876 -37591274 4054829 -13333443 -7435984
11492g435984k1305926F745328J5396529e2911127b2711757A213303K1662214
$$ -7435984 -28741910 6745328 22141857 -52911127 -22711757 1213303 22875517
11485B2875517b4706158E673863N313022G73591b809212A6815423g106654D702270
$$ 22875517 -24706158 5673863 10986885 773591 -2809212 16815423 -7106654 4702270
11476B8489333a4051381A1542106k156926J6446753h824720j2391274k0730524
$$ 28489333 -14051381 11542106 9385180 25831933 -8824720 -21215994 -41946518
11469d1946518f141268P25208G037144a5804642c305236C46841L208301a8028381
$$ -41946518 -6141268 -5416060 7037144 -15804642 -3305236 346841 3555142 -18028381
11460a2084728m3146503K4115699g901925B9135092k91560g487219q767257C8883857
$$ -12084728 -55231231 -31115532 -7901925 29135092 28843532 -7487219 -16254476 38883857
11451A5146603K140293H016449b9072445C7022900F228278d643090q012373M369305
$$ 15146603 17286896 8016449 -29072445 37022900 6228278 -4643090 -12655463 -8286158
11443h286158k8192305a0850271l4940589K2231477A9337197f0651549a7398274
$$ -8286158 -36478463 -10850271 -45790860 -23559383 19337197 -60651549 -17398274
11435a1870153m400544g944745H415347h730963r66212a520504I341051b9072237
$$ -11870153 -16270697 -7944745 8415347 -8730963 -9697175 -1520504 9341051 -29072237
11426a1021233I85494b0536640A7642229l226366J1190218a8456994A4707244
$$ -11021233 985494 -20536640 17642229 14415863 25606081 -18456994 14707244
11418a957010j2647633D52808c2849771a5032024j4058984a4198726D1666945
$$ -1957010 -14604643 452808 -32849771 -15032024 -29091008 -14198726 41666945
11410a0476760A9378197a2121884C473720R533514a76243q571075k3198142P079057
$$ -10476760 19378197 -12121884 3473720 13007234 -176243 -8747318 -31945460 -24866403
11402b4866403A7682129a5217745a028716A6786762d0252188a9858963h993215
$$ -24866403 17682129 -15217745 -1028716 16786762 -40252188 -19858963 -8993215
11394f103372l528196n600542C409005J7564873h267077E9132608d0548837a2886139
$$ -6103372 -9631568 -15232110 3409005 20973878 -8267077 59132608 -40548837 -12886139
11385B769584i91023D172623d3127133a5294069O00072k1002667E342497b9571283
$$ 2769584 -991023 4172623 -43127133 -15294069 -14693997 -35696664 5342497 -29571283
11376b1892786D737488b453106l6134073A1255916b1366187r824996a2023927
$$ -21892786 4737488 -2453106 -38587179 11255916 -21366187 -31191183 -12023927
11368A032393b4674471B798157L8478600a9559231e593144p787197j943896k3199616
$$ 1032393 -24674471 2798157 41276757 -19559231 -5593144 -13380341 -15324237 -38523853
11360c8523853J1039709a1212628k3723459J4465527j3227187I115222a0984742
$$ -38523853 -27484144 -11212628 -34936087 -20470560 -33697747 9115222 -10984742
11352B6643180D777940f333396B780387e717767F00304a0740676k4905998a2461013
$$ 26643180 4777940 -6333396 2780387 -5717767 600304 -10740676 -35646674 -12461013
11343c4415236g038813j1128293N391175A3573205c724733j540530A6729912J3128908
$$ -34415236 -7038813 -18167106 -12775931 13573205 -3724733 -5265263 16729912 29858820
11335B9858820B01468c3852855f007280B82781L5401511b7040083h495958A0304519
$$ 29858820 201468 -33852855 -6007280 282781 35684292 -27040083 -8495958 10304519
11326D155596b8830490J2289451g18882l115263C897300d399922j009524b338857
$$ 4155596 -28830490 -16541039 -718882 -3834145 3897300 -4399922 -5409446 -2338857
11317d6119136A2950337F121925A443509n63634J4541395N904803H431441f089210
$$ -46119136 12950337 6121925 1443509 879875 15421270 21326073 8431441 -6089210
11308h248212E065371e923013m3460743a5485937A1559442n463321e5005781a0612401
$$ -8248212 5065371 -5923013 -49383756 -15485937 11559442 6096121 -55005781 -10612401
11299c5780372J7025287h465097l6143240A6426913b38748A1116525n171743e212499
$$ -35780372 -18755085 -8465097 -44608337 16426913 -238748 11116525 5944782 -5212499
11290a3239382a080014o996895m1079512K2581826A411778J4839332b2278027
$$ -13239382 -1080014 -8076909 -49156421 -26574595 1411778 16251110 -22278027
11282A7986493m324950c8418346B6046849a6363604F696267J3970140i526190
$$ 17986493 13661543 -38418346 26046849 -16363604 6696267 20666407 -9526190
11274A2843998b1684326j4745406B692441f445397D982764K0251524h257412r895573
$$ 12843998 -21684326 -36429732 2692441 -6445397 4982764 25234288 -8257412 -18152985
11266a8152985m708665B203882b0482282n304870G002808f870722j6030412D0629124
$$ -18152985 -22861650 2203882 -20482282 -25787152 7002808 -6870722 -22901134 40629124
11257c0999268i128023k3858685A3782346e167543G890149a0784881B4514680
$$ -30999268 -9128023 -32986708 13782346 -5167543 7890149 -10784881 24514680
11249D046452c1487682O523426j7133578a3328827a519240p628964C0690475j931020
$$ 4046452 -31487682 -24964256 -42097834 -13328827 -1519240 -9148204 30690475 28759455
11241B8759455c2375987H538280a9941533j7410649j853026A304894J095760d736123
$$ 28759455 -32375987 8538280 -19941533 -37352182 -39205208 1304894 2400654 -4736123
11232B1535183G070169b7351509j7223527B0779338a917588j155522l1753258
$$ 21535183 7070169 -27351509 -44575036 20779338 -1917588 -3073110 -34826368
11225c4826368i187540k7145506B9185687A968979K1026697a3188837I271857
$$ -34826368 -9187540 -36333046 29185687 1968979 22995676 -13188837 9271857
11217d4126645J2984306J0755803A1017369a1126623k9259338J8061388b423226
$$ -44126645 -31142339 -20386536 11017369 -11126623 -40385961 -22324573 -2423226
11209a0300966A6745879n206923a3546239I248103N266416e3770802A3971879
$$ -10300966 16745879 11538956 -13546239 9248103 14514519 -53770802 13971879
11201f0808862F604735a9051842o386072i067458M63440k1558948C0383519n653562
$$ -60808862 6604735 -19051842 -25437914 -9067458 -8604018 -30162966 30383519 24729957
11193B4729957k812919i83173l0228672A0385107b710058l3516727a2461890e874924
$$ 24729957 21917038 -983173 -31211845 10385107 -2710058 -36226785 -12461890 -5874924
11184c8855463B6764612h451708k0191276a1574433n811041h574120j430016D885420
$$ -38855463 26764612 -8451708 -28642984 -11574433 -17385474 -8574120 -10004136 4885420
11175b3514352O456578B5411743q922161R090603H274766i778405J77177A7382728
$$ -23514352 -17057774 25411743 16489582 25580185 8274766 -9778405 -9601228 17382728
11166h020113a825816B8208608b4565319F052646K2171919b718388j6363756A1107576
$$ -8020113 -1825816 28208608 -24565319 6052646 28224565 -2718388 -19082144 11107576
11157a3398689A9927010J0466910l341783b1485280h815492B1660315a3548771
$$ -13398689 19927010 30393920 27052137 -21485280 -8815492 21660315 -13548771
11149a1892170k802641a466672A3996547J3620662b4437662C862117d3135079
$$ -11892170 -14694811 -1466672 13996547 27617209 -24437662 3862117 -43135079
11141f226400l0786322J8185560H816850R054951R56343a2433349K374457j010013
$$ -6226400 -37012722 -18827162 8816850 17871801 18828144 -12433349 -10058892 -11068905
11133a1068905b51423A5524420m148475B846777c634459l0365615J0607271h134851
$$ -11068905 -251423 15524420 11375945 2846777 -3634459 -34000074 -23392803 -8134851
11124b6906390O132969g833039r486481j4265722a2156365D668328b952892E321425
$$ -26906390 -20773421 -7833039 -17319520 -31585242 -12156365 4668328 -2952892 5321425
11115b4622066r351143p326368J9314252i981161A2476930d534571j8871807A0742815
$$ -24622066 -33973209 -41299577 -21985325 -9981161 12476930 -4534571 -23406378 10742815
11106i115817B91639L2567958b4594307B0201244b7895329I92497O73012L5867289
$$ -9115817 291639 32859597 -24594307 20201244 -27895329 992497 1665509 37532798
11098C7532798j5047448r137621b4117627Q648273G759105N5332755c467534l9854553
$$ 37532798 22485350 13347729 -24117627 -15469354 7759105 63091860 -3467534 -43322087
11090d3322087B0352465f629357r436234p564272k3278546d268375A7909800b8346935
$$ -43322087 20352465 -6629357 -16065591 -23629863 -46908409 -4268375 17909800 -28346935
11081A3923785K0675126F329191k561613J583480c5424393B0122663c1190183
$$ 13923785 34598911 6329191 3767578 5351058 -35424393 20122663 -31190183
11073a8093637b308349B62161g277721A6481568d0009311B1129581J5885979B94403
$$ -18093637 -2308349 262161 -7277721 16481568 -40009311 21129581 37015560 294403
11064i507503m647625A8810596a6362054A4929886o585562a3933834k978622k208012
$$ -9507503 -14155128 18810596 -16362054 14929886 8344324 -13933834 -16912456 -19120468
11056a9120468A3989685d093297j104660a292199r486564H488169b8671193B0974224
$$ -19120468 13989685 -4093297 -5197957 -1292199 -10778763 8488169 -28671193 20974224
11047b9683337O68902K249350j965509a944075k8837907A3631416i037917j6889454
$$ -29683337 -29014435 -26765085 -28730594 -1944075 -30781982 13631416 -9037917 -25927371
11039b5927371b312762l1918065j731986A3557311a565173P04014j5813866A1180975
$$ -25927371 -2312762 -34230827 -35962813 13557311 -1565173 -861159 -16675025 11180975
11030C4123752c4156597a4777130d334721B6996919a05560G790895a0082818j0230713
$$ 34123752 -34156597 -14777130 -4334721 26996919 -105560 7790895 -10082818 -20313531
11022b0313531C4141148B344864Q829179b8791478A8935324b0209041j640562
$$ -20313531 34141148 2344864 11174043 -28791478 18935324 -20209041 -21849603
11015b1849603a168952D6990118b658659A8754634p589805Q10389J403916D556836
$$ -21849603 -1168952 46990118 -2658659 18754634 11164829 11975218 13379134 4556836
11006D3494639A1788006a189408l184137A1321871n480202Q237436c0859305J0888339
$$ 43494639 11788006 -1189408 -4373545 11321871 5841669 14079105 -30859305 -19970966
10998a9970966k285651P844578c208097n986009m812440D730380b0192673G739770
$$ -19970966 -22256617 -14412039 -3208097 -9194106 -14006546 4730380 -20192673 7739770
10989b7110235j4682806E1181065b1702988J094853k918452J0680576L715220
$$ -27110235 -41793041 51181065 -21702988 -20608135 -23526587 -12846011 -9130791
10982i130791j6074155a2309008B1023514H318881Q596952G294461i737414j6509952
$$ -9130791 -25204946 -12309008 21023514 8318881 16915833 7294461 -9737414 -26247366
10974b6247366J0684346B0556478a2348378j0204649j193588R978805l1105584
$$ -26247366 -15563020 20556478 -12348378 -22553027 -23746615 -13767810 -44873394
10967d4873394J1037838A3430024J6579762d0492386H635347e980918A0894885
$$ -44873394 -33835556 13430024 30009786 -40492386 8635347 -5980918 10894885
10959a818202k7681879I789721G15815c901134j8296676j4285996i331678A8106958
$$ -1818202 -29500081 9789721 715815 -3901134 -22197810 -36483806 -9331678 18106958
10950d3506208J5305363H980778O93679P095441A717582J0742933b4492086A470601
$$ -43506208 -28200845 8980778 9674457 16769898 1717582 12460515 -24492086 1470601
10941a2385844c781829A3324759c4641815o01554a4111942k4393390o072046B8366408
$$ -12385844 -3781829 13324759 -34641815 -35243369 -14111942 -38505332 -44577378 28366408
10932F555319J6664071d7873768R533849J5245369F38223a9868870k0561750C46396
$$ 6555319 23219390 -47873768 -38339919 -23094550 638223 -19868870 -40430620 346396
10923b2301632d138613l711372c265342k2219749j0051039f576192p301818l4873986
$$ -22301632 -4138613 -7849985 -3265342 -25485091 -35536130 -6576192 -13878010 -48751996
10915d8751996i729825p234360B0247449K3115376b9533655b66566B851976e154893
$$ -48751996 -9729825 -16964185 20247449 43362825 -29533655 -266566 2851976 -5154893
10906d671085p93941A9092421c6419919E060585b0761120g377938b711303q923614
$$ -4671085 -5465026 19092421 -36419919 5060585 -20761120 -7377938 -2711303 -11634917
10898a1634917j5469347B0857785h696874n0596289Q500093c770827j1756014
$$ -11634917 -27104264 20857785 -8696874 -59293163 -50793070 -3770827 -15526841
10891a5526841k1111110J1129696L072244A4168738e79198k8263072a837522p03889
$$ -15526841 -36637951 -25508255 -22436011 14168738 -579198 -28842270 -1837522 -2541411
10883b541411o1846708a2064204C3717783a5311342j646786r400896j229842A792394
$$ -2541411 -64388119 -12064204 33717783 -15311342 -16958128 -26359024 -27588866 1792394
10874a996524n182037C808778c2227673B5091895A1383488k919675b727730j0780491
$$ -1996524 -7178561 3808778 -32227673 25091895 11383488 8463813 -2727730 -13508221
10866a3508221c510157j7519186N583426j4533943E2545514b3507157D917942
$$ -13508221 -3510157 -21029343 -15445917 -29979860 52545514 -23507157 4917942
10858E1388062b7710229C7348855b8260715f623687B3621101b8372916N961729
$$ 51388062 -27710229 37348855 -28260715 -6623687 23621101 -28372916 -22411187
10851b2411187h453176B2437150a2863853C9238206b4920676C70920a5740896
$$ -22411187 -8453176 22437150 -12863853 39238206 -24920676 370920 -15740896
10843b9533843R811747o055238r99333o051246f579737k1205317a0992328H765926
$$ -29533843 -19722096 -25777334 -26776667 -32827913 -6579737 -27785054 -10992328 8765926
10834a8052864c60049j2775259b352871m143482B1065809a7982862e678626C8579266
$$ -18052864 -360049 -13135308 -2352871 -6496353 21065809 -17982862 -5678626 38579266
10825d6088947A2782022c3394024g818413r393548B6139194b9386654O632126
$$ -46088947 12782022 -33394024 -7818413 -17211961 26139194 -29386654 -22754528
10818b2754528A097340J2998635b094462k2164560A4576291B944384h891206k0640227
$$ -22754528 1097340 14095975 -2094462 -24259022 14576291 2944384 -8891206 -29531433
10810b9531433i465680p527282k5007826A7678976d7863452f333362k2151175
$$ -29531433 -9465680 -16992962 -42000788 17678976 -47863452 -6333362 -28484537
10803b8484537a72169l0306782C952037J812261c184465C046087A349272h125192
$$ -28484537 -172169 -30478951 3952037 5764298 -3184465 3046087 1349272 -8125192
10794h572638k7687077j7864205e008523l9821853C886590a1338516l8398775
$$ -8572638 -36259715 -54123920 -5008523 -44830376 3886590 -11338516 -49737291
10787d9737291a6825690A5339562a4912580H684022K9985348C774788f830700
$$ -49737291 -16825690 15339562 -14912580 8684022 38669370 3774788 -6830700
10779A1578783f335147A792697b2492932G883316a0490098D169230L0413674D842928
$$ 11578783 -6335147 1792697 -22492932 7883316 -10490098 4169230 34582904 4842928
10770d0656687A7044678i353123L913317m5419966A184169K574063c4370139J4736434
$$ -40656687 17044678 -9353123 -5439806 -50859772 1184169 3758232 -34370139 -19633705
10762a9633705A2330375P347577d258698j3943081g719118A5529521d302701r472999
$$ -19633705 12330375 19677952 -4258698 -18201779 -7719118 15529521 -4302701 -13775700
10754a3775700K77808j9261952Q799707e836691l6282375a4405159B426097J3141220
$$ -13775700 -13497892 -32759844 -23960137 -5836691 -42119066 -14405159 2426097 15567317
10746A5567317c1341799n225852J6147158C4406385b1426824E401028M1607953
$$ 15567317 -31341799 -36567651 -20420493 34406385 -21426824 5401028 47008981
10739D7008981b7706831j1800921J807748Q953993C0091431a4435786C4056468
$$ 47008981 -27706831 -39507752 -37700004 -28746011 30091431 -14435786 34056468
10731B6235650d735976q397792A0203788a1852818k5453655C6937087j457137
$$ 26235650 -4735976 -13133768 10203788 -11852818 -37306473 36937087 35479950
10724C5479950J9547887b4153963K522422c020976r807760k1486180B9720544
$$ 35479950 55027837 -24153963 -21631541 -3020976 -12828736 -34314916 29720544
10716d4347681b147987l950605q114073A407450M21479J0630225c157873j3580427
$$ -44347681 -2147987 -6098592 -14212665 1407450 1828929 12459154 -3157873 -16738300
10708a6738300d642063p706474b103288A4750142L816191B010705c7258883J6497530
$$ -16738300 -4642063 -12348537 -2103288 14750142 18566333 2010705 -37258883 -20761353
10700b0761353H68047a6842327r003342F849262c0307568A4085803b3947943l514647
$$ -20761353 868047 -16842327 -25845669 6849262 -30307568 14085803 -23947943 -27462590
10692b7462590R007233B112475a6868040L642687I06656c2905586A641596O066582
$$ -27462590 -18455357 2112475 -16868040 -13225353 906656 -32905586 1641596 7708178
10684G708178c2630442i050113A5033119c5052917A3421604d4603426A0869811
$$ 7708178 -32630442 -9050113 15033119 -35052917 13421604 -44603426 10869811
10676c7175327D0872589f103230I90107N863833c1708363N383387C0355919b3845674
$$ -37175327 40872589 -6103230 990107 6853940 -31708363 -26324976 30355919 -23845674
10667B3201923b958624A181144a9266194P922330k569141A6518324a1878726n697603
$$ 23201923 -2958624 1181144 -19266194 -11343864 -13913005 16518324 -11878726 -17576329
10659a7576329B299873d1981987A4399298d3166290B123811c7772739B2586429
$$ -17576329 2299873 -41981987 14399298 -43166290 2123811 -37772739 22586429
10651c717040j6687676k3473965B2125045A510362f523530l7844953a614988j0354696
$$ -3717040 -20404716 -43878681 22125045 1510362 -6523530 -44368483 -1614988 -11969684
10643a1969684F674017b4883891P841189A6785276b4357656i341049j482470j1384346
$$ -11969684 6674017 -24883891 -17042702 16785276 -24357656 -9341049 -10823519 -22207865
10635b2207865i517589j495869o822467c708246A129692g35064F245079a2834566
$$ -22207865 -9517589 -11013458 -17835925 -3708246 1129692 -735064 6245079 -12834566
10626f5900645f495526A5253690c6756503J123524P167331d863986B2555951a436466
$$ -65900645 -6495526 15253690 -36756503 -35632979 -28465648 -4863986 22555951 -1436466
10617h330957j0497605h422734q131104M696574k4609524B621273g289097n0785981
$$ -8330957 -18828562 -8422734 -16553838 -11857264 -36466788 2621273 -7289097 -58075078
10609e8075078A6884383b8014689c683785j7025791M141979r037823h887730E757984
$$ -58075078 16884383 -28014689 -3683785 -20709576 -16567597 -25605420 -8887730 5757984
10600c2606881B017924b0442383B813081c6740332i258428I481533b2111685i51309
$$ -32606881 2017924 -20442383 2813081 -36740332 -9258428 9481533 -22111685 -951309
10591D209883A689423J5900777G518668e5574850b7780140c585718A3884351f549796
$$ 4209883 1689423 17590200 7518668 -55574850 -27780140 -3585718 13884351 -6549796
10582I713652R006860a3972905o187998D340235a2327796N120487I369434b1732136
$$ 9713652 18720512 -13972905 -20160903 4340235 -12327796 -7207309 9369434 -21732136
10573E0508970A2945284c8843450C5595016b0641733j7593663c278990j9240068
$$ 50508970 12945284 -38843450 35595016 -20641733 -38235396 -3278990 -22519058
10566b2519058b319939E598907c1344376O191990A4955760g652231A469372b6614082
$$ -22519058 -2319939 5598907 -31344376 -25152386 14955760 -7652231 1469372 -26614082
10557a4333765j9008176h337857O16341L425428l4346249J1894271A5634915l375428
$$ -14333765 -33341941 -8337857 -7721516 -4296088 -38642337 -26748066 15634915 12259487
10549A2259487b278829n7184462b5694380J350987M508875h342005A1385458K259750
$$ 12259487 -2278829 -59463291 -25694380 -24343393 -19834518 -8342005 11385458 13645208
10541A3645208a976187j2777137C752148a0970691c929008m7234856C990001c8935336
$$ 13645208 -1976187 -14753324 3752148 -10970691 -3929008 -51163864 3990001 -38935336
10532b815211k3028244H755158b8063503B7542343d4327634B0438245c2060453
$$ -2815211 -25843455 8755158 -28063503 27542343 -44327634 20438245 -32060453
10524c9616130O878668A4570651J5169239H999941K2824542o807725i573215l2956798
$$ -39616130 -32737462 14570651 29739890 8999941 31824483 25016758 -9573215 -42530013
10516d2530013A5194653a5897092D193104K0429450D649493a6874716L568664
$$ -42530013 15194653 -15897092 4193104 24622554 4649493 -16874716 -13306052
10509a3306052C440607d735329l302290A3704877E736067c832557p34098j9522572
$$ -13306052 3440607 -4735329 -8037619 13704877 5736067 -3832557 -4566655 -24089227
10501b4089227D2458674o543330b1171777F000342J3191044a4799950q121323
$$ -24089227 42458674 35915344 -21171777 6000342 19191386 -14799950 -22921273
10494b2921273A1216861a3888987n1907953I92153f408767m61485J318625A8301352
$$ -22921273 11216861 -13888987 -65796940 992153 -6408767 -6870252 -5551627 18301352
10485b9131993F771132b7871124L364242C0202539A1428593N58018a7500572B0750039
$$ -29131993 6771132 -27871124 -24506882 30202539 11428593 11986611 -17500572 20750039
10476b4197442B1360732G263706D65564d7583255E423403c9896777J8975442A4062773
$$ -24197442 21360732 7263706 465564 -47583255 5423403 -39896777 -20921335 14062773
10467C1702389a0039069d590695k4500029a2050379k176533n41532E463250b6332976
$$ 31702389 -10039069 -4590695 -29090724 -12050379 -14226912 -14768444 5463250 -26332976
10458A3996201c4005949G093666J702372A196424a918420k7179121c361245B1316386
$$ 13996201 -34005949 7093666 8796038 1196424 -1918420 -29097541 -3361245 21316386
10449a7835870M851943O250174b923107m9612570b2814742O387629N550641B0533195
$$ -17835870 -12983927 -6733753 -2923107 -52535677 -22814742 -16427113 -10876472 20533195
10440A4931430i663941b115996k1844106B1264614B466482a1929984e898009r083689
$$ 14931430 -9663941 -2115996 -23960102 21264614 2466482 -11929984 -5898009 -14981698
10432a4981698l260580j3765789d792680B5901303j1779942l411606E166J3103037
$$ -14981698 -18242278 -32008067 -4792680 25901303 14121361 10709755 5166 13108203
10424A3108203a8774350A8618148b5767188K721373D139157d7628165b3438175
$$ 13108203 -18774350 18618148 -25767188 -23045815 4139157 -47628165 -23438175
10416b4248013H532982l93142k984406B087026c5216268a344169C0451313a5662094
$$ -24248013 8532982 8139840 5155434 2087026 -35216268 -1344169 30451313 -15662094
10407b836512o521817C6490614h750016l4339489C4433817r376600b0467829J0207918
$$ -2836512 -9358329 36490614 -8750016 -43089505 34433817 25057217 -20467829 -10259911
10399a0259911C4681708b7315938J1396571c700088j2826612c755501H720106
$$ -10259911 34681708 -27315938 -15919367 -3700088 -16526700 -3755501 8720106
10391A9365836a4265669l4431449i963731A066160d2479651J3568352C281255
$$ 19365836 -14265669 -48697118 -9963731 1066160 -42479651 -28911299 3281255
10383b9881040q140502Q601671a826840l5731322a2408964q214682R99670f990705
$$ -29881040 -38021542 -29419871 -1826840 -37558162 -12408964 -20623646 -19623976 -6990705
10374d293088k4075870h865201j7889501M360702A5833468a8444846l0768483
$$ -4293088 -28368958 -8865201 -26754702 -22394000 15833468 -18444846 -49213329
10367d9213329a3618270e845218A4961745B596057J6385385a2822707l5219384
$$ -49213329 -13618270 -5845218 14961745 2596057 18981442 -12822707 -48042091
10360d8042091A1280985L0706413c7327141A108760c9600372O307486D012543
$$ -48042091 11280985 41987398 -37327141 1108760 -39600372 -33292886 4012543
10352f10658e1629k5726676B1727519g46413k8789263J4492855l612774c639720
$$ -610658 -51629 -25778305 21727519 -746413 -29535676 -15042821 -18655595 -3639720
10343b7524007B160283b2102807k5759832A2041521e267710l4250701A6416047
$$ -27524007 2160283 -22102807 -47862639 12041521 -5267710 -39518411 16416047
10335d9510480f272878j9800494O680344k0691996C155865j386046c8168755J76583
$$ -49510480 -6272878 -26073372 -19393028 -40085024 3155865 1769819 -38168755 -37992172
10327c7992172J420739a0361322k9296094a1848481M454115A1049947A347395
$$ -37992172 -36571433 -10361322 -39657416 -11848481 -7394366 11049947 1347395
10319e8251134O408259a2966397A0610658l692716d4695819a7508984C130776
$$ -58251134 -51842875 -12966397 10610658 6917942 -44695819 -17508984 3130776
10311E490300O430327M029649b6919954j034055J1492058n417539j1153920G41037
$$ 5490300 11920627 15950276 -26919954 -27954009 -16461951 -21879490 -33033410 741037
10302A0405050a3020200c757776k942543p752162O08959E484977a6005458K338078
$$ 10405050 -13020200 -3757776 -6700319 -14452481 -13843522 5484977 -16005458 -13667380
10294a3667380o859017r697491M872556a0328065m0554311b875074B0054677d1546805
$$ -13667380 -20526397 -30223888 -25351332 -10328065 -50882376 -2875074 20054677 -41546805
10285b243916A8682183a688233j783843r082054B758516d295548D151601a6617873
$$ -2243916 18682183 -1688233 -3472076 -12554130 2758516 -4295548 4151601 -16617873
10276A0540767c1846576f663879l6807906J2825215g765339r780849A5249720
$$ 10540767 -31846576 -6663879 -43471785 -30646570 -7765339 -17546188 15249720
10268a4741204B6308371d4890876J6988595e054593l0121760J5728931L438391
$$ -14741204 26308371 -44890876 -27902281 -5054593 -35176353 -19447422 -16009031
10261a6009031o072619B2241598i460591j2283137e482750j9153597q59297g144537
$$ -16009031 -22081650 22241598 -9460591 -21743728 -5482750 -24636347 -25495644 -7144537
10252b2033801k4730705K3341533A9998367b2770101f235059I983674a8219254
$$ -22033801 -46764506 -23422973 19998367 -22770101 -6235059 9983674 -18219254
10244B6362893c68078m7313003B2457994b0706550C505206a1589118p563106m915792
$$ 26362893 -368078 -47681081 22457994 -20706550 3505206 -11589118 -19152224 -24068016
10236b4068016N552795q157341O283634l2892603a0736723j6565308L62509g601898
$$ -24068016 -18515221 -26672562 -20388928 -53281531 -10736723 -27302031 -26939522 -7601898
10227d2336700G522666a7765528k8110516p91502B405256b3949393r773618A7996972
$$ -42336700 7522666 -17765528 -45876044 -46667546 2405256 -23949393 -33723011 17996972
10218e026536A7445201e9276794a8110263q448687B819118N777468a1376239I417847
$$ -5026536 17445201 -59276794 -18110263 -26558950 2819118 8596586 -11376239 9417847
10209b0307807A5945530F517482K6069006b5070451B318843K1025566j1359070
$$ -20307807 15945530 6517482 32586488 -25070451 2318843 23344409 11985339
10202A1985339k360314G659d6586364a0710236j1872334A9984425d047309A469287
$$ 11985339 9625025 7659 -46586364 -10710236 -22582570 19984425 -4047309 1469287
10193b9870343a2593280m6596088K2785333e817576l9963210n803596a0419997
$$ -29870343 -12593280 -59189368 -36404035 -5817576 -45780786 -51584382 -10419997
10185e5528623B7517413b6996248B636290a0712467k050563A8187597q932242
$$ -55528623 27517413 -26996248 2636290 -10712467 -12763030 18187597 9255355
10178I255355H34105K6098261H922868a1735803G743145c0552239i011238B2200294
$$ 9255355 834105 26932366 8922868 -11735803 7743145 -30552239 -9011238 22200294
10169a5451742d454924l437892m180278B815252e506594G402529c102599p142829
$$ -15451742 -4454924 -7892816 -12073094 2815252 -5506594 7402529 -3102599 -10245428
10161a0245428B6361901G068484i324008A0520747A123246a6616486j0736072
$$ -10245428 26361901 7068484 -9324008 10520747 1123246 -16616486 -27352558
10154b7352558a0094102j1168887G590708Q835960e0971809B5146244H320737
$$ -27352558 -10094102 -21262989 7590708 16426668 -50971809 25146244 8320737
10146a526910A6926516b7854874A0878714N30715a9537665p123843k9145902B8447649
$$ -1526910 16926516 -27854874 10878714 11409429 -19537665 -26661508 -55807410 28447649
10137f299502m44758G360832d662166j3327608m677711f207966n36508C8406414
$$ -6299502 -6744260 7360832 -4662166 -17989774 -22667485 -6207966 -6744474 38406414
10128e73889I996611B43727d315191j1572746k5941305J0182122C0888472b1509400
$$ -573889 9996611 243727 -4315191 -15887937 -41829242 -31647120 30888472 -21509400
10119C9480509j5575243e831634k372021B362099P956821N269210a9168422G326106
$$ 39480509 23905266 -5831634 -8203655 2362099 10318920 15588130 -19168422 7326106
10110b2440285k2070100A4221589d3773551a625587j5303731D584853c9183569
$$ -22440285 -44510385 14221589 -43773551 -1625587 -16929318 4584853 -39183569
10102e9460137A3197641l358121K9984141b3371801J571122P895790l3252929
$$ -59460137 13197641 9839520 39823661 -23371801 -21800679 -13904889 -47157818
$$ [...]
##END NTUPLES=NMR SPECTRUM
##END=
