##TITLE=ST0000_MeOD-4_7212735_VkaFngzLdu
##JCAMPDX= 6.0         $$ Bruker NMR JCAMP-DX V2.0
##DATA TYPE= NMR SPECTRUM
##DATA CLASS= NTUPLES
##ORIGIN= BRUKER
##OWNER= Administrator
$$ 1.72 TOPSPIN		Version 2.1
$$ 2013-11-22 21:40:43.646 -0800  Administrator@X
$$ Compression mode = diff/dup
##.OBSERVE FREQUENCY= 400.02188249412
##.OBSERVE NUCLEUS= ^1H
##.ACQUISITION MODE= SIMULTANEOUS (DQD)
##.ACQUISITION SCHEME= undefined
##.AVERAGES= 64
##.DIGITISER RES= 22
##SPECTROMETER/DATA SYSTEM= spect
##.PULSE SEQUENCE= noesygpps1d.comp
##.SOLVENT NAME= COFFEE_meoh
##.SHIFT REFERENCE= INTERNAL, COFFEE_meoh, 1, 14.85448
##AUDIT TRAIL= $$ (NUMBER, WHEN, WHO, WHERE, PROCESS, VERSION, WHAT)
$$ ##TITLE= Audit trail, TOPSPIN		Version 2.1
$$ ##JCAMPDX= 5.01
$$ ##ORIGIN= Bruker BioSpin GmbH
$$ ##OWNER= Administrator
$$ $$ E:\/data/COFFEE/nmr/ST0000_MeOD-4_7212735_VkaFngzLdu/22/pdata/1/auditp.txt
$$ ##AUDIT TRAIL=  $$ (NUMBER, WHEN, WHO, WHERE, PROCESS, VERSION, WHAT)
(   1,<2013-11-22 21:40:38.771 -0800>,<Administrator>,<X>,<go>,<TOPSPIN 2.1>,
      <created by zg
	started at 2013-11-22 21:29:08.597 -0800,
	POWCHK enabled, PULCHK disabled,
       configuration hash MD5:
       C8 4E 4E 5D D3 5C D8 9E 9F 52 82 E0 59 8A DE 15
       data hash MD5: 64K
       F3 80 AF 54 25 A1 41 0A CB 90 F2 12 D8 D3 89 0D>)
(   2,<2013-11-22 21:40:41.724 -0800>,<Administrator>,<X>,<proc1d>,<TOPSPIN 2.1>,
      <Start of raw data processing
       efp LB = 0.3 FT_mod = 6 PKNL = 1 PHC0 = 0 PHC1 = 0 SI = 128K 
       data hash MD5: 128K
       6B 56 76 01 ED 7C 7F 61 9C 9E 69 8A B6 15 F9 74>)
(   3,<2013-11-22 21:40:42.693 -0800>,<Administrator>,<X>,<proc1d>,<TOPSPIN 2.1>,
      <pk PHC0 = -84.32556 PHC1 = 0 
       data hash MD5: 128K
       D4 C8 75 D4 21 15 16 3B 92 8B C3 49 A7 D4 B1 BB>)
(   4,<2013-11-22 21:40:43.146 -0800>,<Administrator>,<X>,<proc1d>,<TOPSPIN 2.1>,
      <abs ABSG = 1 
       data hash MD5: 128K
       E5 E1 ED 97 AA 5F 9B 0B C9 BB DB 7D 6D 3D 9A 2B>)
(   5,<2013-11-22 21:40:43.240 -0800>,<Administrator>,<X>,<proc1d>,<TOPSPIN 2.1>,
      <abs ABSG = 2 
       data hash MD5: 128K
       EA 39 A1 55 C4 D0 56 87 E3 57 E3 2F D5 DC 81 1A>)
(   6,<2013-11-22 21:40:43.302 -0800>,<Administrator>,<X>,<proc1d>,<TOPSPIN 2.1>,
      <abs ABSG = 3 
       data hash MD5: 128K
       A3 A5 9F EC 0C DC 5D 36 61 F3 1B F2 A7 E7 69 15>)
(   7,<2013-11-22 21:40:43.396 -0800>,<Administrator>,<X>,<proc1d>,<TOPSPIN 2.1>,
      <abs ABSG = 4 
       data hash MD5: 128K
       29 C0 35 4A BA 48 5D D0 E6 A6 6E 6B 2C CB 16 B6>)
(   8,<2013-11-22 21:40:43.474 -0800>,<Administrator>,<X>,<proc1d>,<TOPSPIN 2.1>,
      <abs ABSG = 5 
       data hash MD5: 128K
       F1 E6 69 38 88 9B E7 FF C0 54 F1 68 34 1F 91 26>)
$$ ##END=
$$ 
$$ $$ hash MD5
$$ $$ 04 5B 6A 66 C0 0A 33 EE B1 B3 47 78 2D 96 DA 74
##$RELAX= 
##$RELAX= 
##$RELAX= 
##$RELAX= 
##$RELAX= 
##$RELAX= 
##$RELAX= 
##$RELAX= 
$$ Bruker specific parameters
$$ --------------------------
##$DU= <E:\>
##$EXPNO= 22
$$ [...]
150 150 150 150 150 150 150 150
##$TP07= 0
##$TPNAME0= <>
##$TPNAME1= <>
##$TPNAME2= <>
##$TPNAME3= <>
##$TPNAME4= <>
##$TPNAME5= <>
##$TPNAME6= <>
##$TPNAME7= <>
##$TPOAL= (0..7)
0.5 0.5 0.5 0.5 0.5 0.5 0.5 0.5
##$TPOFFS= (0..7)
0 0 0 0 0 0 0 0
##$TUNHIN= 0
##$TUNHOUT= 0
##$TUNXOUT= 0
##$USERA1= <user>
##$USERA2= <user>
##$USERA3= <user>
##$USERA4= <user>
##$USERA5= <user>
##$V9= 5
##$VALIST= <valist>
##$VCLIST= <CCCCCCCCCCCCCCC>
##$VD= 0
##$VDLIST= <DDDDDDDDDDDDDDD>
##$VPLIST= <PPPPPPPPPPPPPPP>
##$VTLIST= <TTTTTTTTTTTTTTT>
##$WBST= 1024
##$WBSW= 4
##$XGAIN= (0..3)
0 0 0 0
##$XL= 0
##$YL= 0
##$YMAX_a= 315477
##$YMIN_a= -360970
##$ZGOPTNS= <>
##$ZL1= 120
##$ZL2= 120
##$ZL3= 120
##$ZL4= 120
##$ABSF1= 14.85448
##$ABSF2= -5.7037
##$ABSG= 5
##$ABSL= 3
##$ALPHA= 0
##$AQORDER= 0
##$ASSFAC= 0
##$ASSFACI= 0
##$ASSFACX= 0
##$ASSWID= 0
##$AUNMP= <proc_prof1d_extract.lims>
##$AXLEFT= 0
##$AXNAME= <>
##$AXNUC= <1H>
##$AXRIGHT= 0
##$AXTYPE= 0
##$AXUNIT= <>
##$AZFE= 0.1
##$AZFW= 0.1
##$BCFW= 0
##$BC_mod= 0
##$BYTORDP= 0
##$COROFFS= 0
##$CY= 15
##$DATMOD= 1
##$DC= 0
##$DFILT= <>
##$DTYPP= 0
##$F1P= 0
##$F2P= 0
##$FCOR= 0.5
##$FTSIZE= 131072
##$FT_mod= 6
##$GAMMA= 0
##$GB= 0
##$INTBC= 1
##$INTSCL= 1
##$ISEN= 128
##$LB= 0.3
##$LEV0= 0
##$LPBIN= 0
##$MAXI= 10000
##$MC2= 0
##$MEAN= 0
##$ME_mod= 0
##$MI= 0
##$NCOEF= 0
##$NC_proc= -6
##$NLEV= 6
##$NOISF1= 0
##$NOISF2= 0
##$NSP= 0
##$NTH_PI= 0
##$NZP= 0
##$OFFSET= 14.85448
##$PC= 1
##$PHC0= -84.32556
##$PHC1= 0
##$PH_mod= 1
##$PKNL= yes
##$PPARMOD= 0
##$PPDIAG= 0
##$PPIPTYP= 0
##$PPMPNUM= 2147483647
##$PPRESOL= 1
##$PSCAL= 4
##$PSIGN= 0
##$PYNMP= <proc.py>
##$REVERSE= no
##$SF= 400.020052247193
##$SI= 131072
##$SIGF1= 0
##$SIGF2= 0
##$SINO= 400
##$SIOLD= 131072
##$SPECTYP= <>
##$SREGLST= <1H.CDCl3>
##$SSB= 0
##$STSI= 131072
##$STSR= 0
##$SW_p= 8223.68421052631
##$SYMM= 0
##$S_DEV= 0
##$TDeff= 65536
##$TDoff= 0
##$TI= <>
##$TILT= no
##$TM1= 0
##$TM2= 0
##$TOPLEV= 0
##$USERP1= <user>
##$USERP2= <user>
##$USERP3= <user>
##$USERP4= <user>
##$USERP5= <user>
##$WDW= 1
##$XDIM= 131072
##$YMAX_p= 428538095
##$YMIN_p= -2325140
##$CURPLOT= <Network HP LaserJet P1505>
##$CURPRIN= <$Network HP LaserJet P1505>
##$DFORMAT= <normdp>
##$LAYOUT= <+/1D_H.xwp>
##$LFORMAT= <normlp>
##$PFORMAT= <normpl>
##$SURQMSG= 1
$$ End of Bruker specific parameters
$$ ---------------------------------
##NTUPLES= NMR SPECTRUM
##VAR_NAME=  FREQUENCY,     SPECTRUM/REAL,   SPECTRUM/IMAG
##SYMBOL=    X,             R,               I
##VAR_TYPE=  INDEPENDENT,   DEPENDENT,       DEPENDENT
##VAR_FORM=  AFFN,          ASDF,            ASDF
##VAR_DIM=   131072,        131072,          131072
##UNITS=     HZ,            ARBITRARY UNITS, ARBITRARY UNITS
##FACTOR=    0.0627417313425164, 1,          1
##FIRST=     8223.62146879497, 1041,         -36464
##LAST=      0,             -6811,           -37686
##MIN=       0,             -2325140,        0
##MAX=       8223.62146879497, 428538095,    0
$$ Real data points
##PAGE= N=1
##DATA TABLE= (X++(R..R)), XYDATA
$$ [...]
72141G9804J4713m05j4320k2204k3342A5388F995P816K3578K9588K4584J7575
72129A10136J5038J2659N133k898l786Q26L499K908L180M345K720q59k183j831
72115A48887l669o518o208m966r062j7356k1794j9593j5197r882o40R359J1503
72102E4864O349M997J0639J1484k11j4205j7947j5679j8788c262k1006o236O459
72089b4045Q527N623c653G150J5179J6792J4095O723r09k353J948M479J778q98
72075F3984L41J20p795j8647A7281F917K864P100N86q206a090m503a682G916J2199
72060B0115J4264J6384J6327J2718P204K272j366l991m772k389J815K731m259
72047G7053j6810k5123A4344n832R561J8192K0428J7900R505k688r763n196N520
$$ y = [79804, 94517, 94112, 79792, 57588, 34246, 15388, 6995, 14811, 38389, 67977, 92561, 110136, 125174, 137833, 142966, 140068, 136282, 137108, 140607, 143515, 146695, 151040, 153760, 152901, 150718, 148887, 145218, 138700, 132492, 127526, 118464, 101108, 79314, 59721, 44524, 34642, 34002, 43361, 54864, 61213, 66210, 76849, 88333, 88122, 73917, 55970, 40291, 21503, -3262, -24268, -30504, -24045, -15518, -9895, -3653, 7150, 22329, 39121, 53216, 59939, 59030, 56677, 58625, 63104, 64882, 63984, 64325, 64445, 56650, 38003, 17281, 6917, 9781, 16881, 17467, 9261, -1090, -5593, -1682, 7916, 20115, 34379, 50763, 67090, 79808, 87012, 89284, 87918, 83927, 79155, 76766, 78581, 81312, 77053, 60243, 35120, 14344, 8512, 18073, 36265, 56693, 74593, 84098, 81410, 71647, 66451, 71971]
72034G1971J1072P747n8r927k2802B3577a1700k2305l789J0196a1762H69J384
72021B253h213j0234N766A2171L1861K5711J5974Q277J707l346m616m477q180
72008G5082j4662j6200q721K743R902Q066k116j4319j8229p799J0667K3504K3747
71995G1665J6378R948P828P893O069j97q329j1818r413r831k0198B7573c104j2072
71981a5176e384A6460K2142J3504n95j1209q376M034J0080M301j70O881J7290
71968G4342K0386J9764K0608J4551m612k1387j6442K769J1851O095K919Q361P952
71955A47157k765n306J0570K4901J5342q691j9690j0061K679K854q659k3564l3769
71942I0998l0970j3249O986J4337J0480J0670J8843K0166L991j7960k5414j4307
$$ y = [71971, 83043, 90790, 90732, 80805, 58003, 23577, -11700, -34005, -37794, -27598, -11762, 869, 2253, -8213, -18447, -12681, 12171, 44032, 69743, 85717, 93994, 95701, 92355, 87739, 83262, 75082, 60420, 44220, 35499, 38242, 48144, 56210, 54094, 39775, 21546, 13747, 24414, 47918, 71665, 88043, 97991, 105819, 113712, 119781, 119584, 111255, 99437, 90024, 80193, 59995, 27573, -3104, -15176, -5384, 16460, 38602, 52106, 51511, 40302, 31926, 35960, 46040, 50341, 50171, 57052, 74342, 94728, 114492, 135100, 149651, 145039, 123652, 107210, 109979, 121830, 127925, 130844, 139205, 147157, 144392, 139086, 149656, 174557, 189899, 181208, 161518, 151457, 154136, 156990, 148331, 124767, 90998, 60028, 46779, 53765, 68102, 78582, 89252, 108095, 128261, 132252, 114292, 88878, 74571]
71930G4571J451Q627O350R10k646j954L618J1062J3355N181j0291k2691k3790
71917F3753j4317j153R530J4421J2030M477j286k07K855j582j2776j7708q337
71904D9700N283O021r222k5671a155j2614N262C686O253n89M177J8232K6551K0093
71890G8403O356k650o502j3426k5284C132b7842j7321J523K0167A1348M2291L9021
71877I2660K2148n139k8882l2287j3787Q307J5853J1021Q837J4045J6275P743
71865A16794m809r364l240N242O196k538j3399j6698j1777p632r528j0400j893
71852C6954J1103J6329J1873P463Q472R096L380o053j3420j6624j6025j2727r959
71839B9862j0238I253C518N05P01F29c352A033J1864J0289L306r28R3M918J2354
$$ y = [74571, 76022, 84649, 90999, 91909, 89263, 87309, 90927, 101989, 115344, 120525, 110234, 87543, 63753, 49436, 48283, 57813, 72234, 84264, 88741, 87455, 87248, 90103, 88521, 75745, 58037, 49700, 54983, 61004, 51782, 26111, -1155, -13769, -8507, 3686, 9939, 9350, 13527, 31759, 58310, 78403, 84759, 82109, 75607, 62181, 36897, 3132, -27842, -45163, -43640, -23473, 11348, 53639, 92660, 114808, 109669, 80787, 48500, 34713, 43020, 58873, 69894, 78731, 92776, 109051, 116794, 111985, 102621, 99381, 104623, 110819, 108281, 94882, 78184, 66407, 58775, 49247, 38847, 36954, 48057, 64386, 76259, 83722, 92194, 101290, 104670, 98617, 85197, 68573, 52548, 39821, 29862, 19624, 9253, 3518, 4023, 4724, 629, -3352, 1033, 12897, 23186, 26492, 25564, 25657, 30575, 42929]
71824D2929J9103K0430J7726J7838K0539J5695p51j6951j9386r562J790R773J4922
71811A34095J4240M179j0546k1135k5175k4662j7905m105P035L318j1844k0910
71799B6585A2135j553N554P509J2119J9740K2133J3577k055j4495j4990k984J2877
71786F9567K1965K1383J6868J3466Q766j748j4867j9915j0754M714J0529n69j8649
71773A00756k7466k2050j1613n861m566k342K417P944J3821J9765K2244J7796
71761A10845Q683Q56k991m719o218p301p523o707m385j399o37k874l603J448Q336
71746H1811P168o142k3143k9662A0961Q22J3835R989n033A4166a716p727O71a006
71731A3569J8910J8830J7526J8516J9120J4921P997L975K737p67p275j1949j2474
$$ y = [42929, 62032, 82462, 100188, 118026, 138565, 154260, 153509, 136558, 117172, 107610, 109400, 119173, 134095, 148335, 152514, 141968, 120833, 95658, 70996, 53091, 48986, 56021, 59339, 47495, 26585, 12135, 10582, 16136, 23645, 35764, 55504, 77637, 91214, 89159, 74664, 59674, 56690, 69567, 91532, 112915, 129783, 143249, 152015, 150267, 135400, 115485, 104731, 109445, 119974, 119405, 100756, 73290, 51240, 39627, 33766, 29200, 26858, 29275, 37219, 51040, 70805, 93049, 110845, 119528, 120384, 117393, 112674, 106456, 99155, 91632, 84925, 80540, 79141, 78504, 75630, 72027, 73475, 81811, 88979, 82837, 59694, 30032, 10961, 11783, 25618, 35607, 30574, 14166, -1716, -9443, -8772, -1006, 13569, 32479, 51309, 68835, 87351, 106471, 121392, 129389, 133364, 136101, 135334, 128059, 116110, 103636]
71718A03636j1806j1972j1351r246p076l785L338J0844R127m962k0678B1348D113
71704f269j1966j6711j5417p183J569O925J0451J2773J0756L945j522m78L784
71691i343c830B550J1537J8379J9271J5049J4509J8229J4931q38j8605k6746k6939
71678D1327A6131b883n397a760C356b349j1467p416j485J238M137g966F333J8151
71664B4484K1791K0859J0136m971j2853j2090j1249j1626m779R116J5847P866
71652E2531k864k885K684O6j0891j7314H801k702M959J0381J5062J6456J1910
71639F4867M039j719l338k863p12O996K1273L2156K5673K341j8973k2748j5752
71626I1240j4545j9858j7279k225J1071R382l010j3123j4595q755O45Q005Q822
$$ y = [103636, 91830, 79858, 68507, 59261, 52185, 48400, 51738, 62582, 71709, 66747, 46069, 21348, 4113, -6269, -18235, -34946, -50363, -57546, -55977, -49052, -38601, -25828, -15072, -11127, -12649, -13127, -9343, -3830, 2550, 14087, 32466, 51737, 66786, 81295, 99524, 114455, 113617, 95012, 68266, 41327, 16131, -2883, -8280, -1760, 3356, -2349, -13816, -21232, -22717, -21479, -17342, -7966, 6333, 24484, 46275, 67134, 77270, 72299, 59446, 47356, 36107, 24481, 19702, 28818, 44665, 52531, 49667, 46782, 49466, 49532, 38641, 21327, 8801, 6099, 11058, 21439, 36501, 52957, 64867, 68906, 67187, 63849, 60986, 60274, 67270, 88543, 120699, 146372, 148713, 129740, 106992, 91240, 76695, 56837, 39558, 37333, 48404, 57786, 54776, 41653, 27058, 18303, 18948, 26953, 35775]
71613C5775O730R880J6688J4994Q35j2409j1618j812K707k199r358j3028j3173
71600B4012j0761F278B145G74O353J8680K5096J7701L698l705k584o97M46Q204
71586G3966K4013L5549K8881M756k0693l0882k3522j0226j697L063R240J3381
71574A05829Q202j889l864K997L955p106j5447p962N607Q107J007j661K003J472
71560A01250m889o126K371J1282J1853O064o78o476r623p539k157J066J421L232
71546A01051O795O420q50j0665j6438j4127l665Q239R751l070j6879j4246M624
71533E6940K2704K7746K2726J4977O767l81k656q3J507j497n842o538j750O739
71519A41359J2247N317j3941k8510k1088K423J8203J3823n20j1224j6852j9748
$$ y = [35775, 42505, 52385, 69073, 84067, 84902, 72493, 60875, 59063, 61770, 59571, 50213, 37185, 24012, 13251, 6278, 2145, 774, 7127, 25807, 50903, 68604, 72302, 68597, 66013, 65316, 65762, 73966, 97979, 133528, 162409, 167165, 146472, 115590, 92068, 81842, 80145, 83208, 92448, 105829, 114031, 112142, 108278, 111275, 115230, 108124, 92677, 84715, 90322, 98429, 99436, 97775, 99778, 101250, 96361, 90235, 92606, 103888, 115741, 121805, 121127, 114651, 105028, 97489, 95332, 96398, 97819, 101051, 107846, 114266, 113416, 102751, 86313, 72186, 68521, 76760, 86511, 83441, 66562, 52316, 56940, 79644, 107390, 130116, 145093, 151860, 151479, 148823, 148740, 150247, 148750, 142908, 136370, 134620, 141359, 153606, 158923, 144982, 116472, 95384, 97807, 116010, 129833, 129313, 118089, 101237, 81489]
71507H1489j6529n627N992J1591J2237J0145L612n691j0119p187l795l087K107
71494G5138J4300K0858J0147r667j9780j3383J343J5134K3004K0227O065q999
71482A34387j1019J85R441M250j0576j8187p108J6614L3895L1292J5067J879l363
71469A96757j0828k5165l4827k9786j8005j2300j0270j878R272Q943n061j8961
71457D7891k3142B525a8868j5878r90J6598F514K3579J7221J3916J5573J8939
71445I5742J9073J4639J0335J0989J3385R143l019j3237j1912j862M637k04j1262
71432A36447j6431j0102P27N230J788k110k365l311p711j0266p288n098r449j2704
71418E7357l657J3206K1522J5921P494M038q80j2256j9930j2207M306J1255K809
$$ y = [81489, 64960, 59333, 65325, 76916, 89153, 99298, 102910, 97219, 87100, 79913, 76118, 73031, 75138, 89438, 110296, 120443, 110776, 90996, 77613, 78956, 94090, 117094, 137321, 143386, 134387, 123368, 123553, 132994, 137244, 126668, 108481, 101373, 117987, 151882, 183174, 198241, 200120, 196757, 185929, 160764, 125937, 96151, 78146, 65846, 55576, 53698, 62970, 71913, 66852, 47891, 24749, 2525, -18868, -34746, -35736, -19138, 6514, 30093, 47314, 61230, 76803, 95742, 114815, 129454, 139789, 150778, 164163, 173306, 170287, 157050, 145138, 143276, 147913, 147709, 136447, 120016, 109914, 110641, 115871, 117659, 115549, 113184, 109873, 102162, 91896, 84608, 79510, 70061, 57357, 53700, 66906, 88428, 104349, 111843, 115881, 115001, 102745, 82815, 70608, 74914, 86169, 88978]
71405H8978p681o442M081J0944P116k691r934j1098q201l935P37M769O007L879
71391G6529J379K070N727Q919R275P031K846k930q109q054J32J2397J8475J0692
71377A36379o648j9628j9699j3586j3142j8046j7565r167l596o682E82K909J8958
71364B2449K4866J8329Q596l03r906j3796j392K2038L5034K6102P392m409q599
71351A26401j2508j3984n211J0471J7972P873j1936k2958j2308J5070L7961L6689
71339A73532J2417j5018k9604l2246k9201j9090n38J6196J8544R133J767J213
71327A07105q76q875j4389r506N85M920P76n937j0042j0899r406o875n935q008
71313B2638r760n650N240J7063K2305J7858P003k239j871Q532J8009J2957o439
$$ y = [88978, 81297, 74855, 78936, 89880, 96996, 94305, 84371, 73273, 65072, 61137, 61874, 66643, 72650, 76529, 77908, 79978, 85705, 94624, 103899, 110930, 113776, 110846, 102737, 94683, 94815, 107212, 125687, 136379, 129731, 110103, 90404, 76818, 63676, 45630, 28065, 18898, 15302, 8620, 582, 3491, 22449, 47315, 65644, 74240, 73937, 64031, 50235, 48843, 70881, 105915, 132017, 139409, 135000, 126401, 113893, 99909, 94698, 105169, 123141, 131014, 119078, 96120, 83812, 98882, 136843, 173532, 185949, 170931, 141327, 109081, 79880, 60790, 60252, 76448, 94992, 104125, 105892, 107105, 106229, 97354, 82965, 73459, 74044, 78964, 79740, 73803, 63761, 52862, 43456, 36581, 30646, 22638, 12878, 7228, 12468, 29531, 51836, 69694, 76697, 74458, 72587, 81119, 99128, 112085, 105646]
71300A05646k2490j9088k436N683l840j5978j3585j090L978l414j2090F823h471
71286b6149j4473j157J3103a1721G30R746J1458J2411J1850J5300K3491K7572
71274A12558J8268l666k6648l6044k5291l091J3017J4064P487M201M142J699p15
71261G9981L835J2117J2096O10j1135j3356r610q263r988r683n244J249P331J1069
71247F1009J1324J0085J0970J3435J2662P201J710k5O66K086M657N869M38r773
71233A32314j4080p753j027m874j4199j5498o741J701L694L227L632K380p84m82
71219H1510N190R769O952j768j1012j7069j7100r958j467j566j1003A5146D913
71205A0029J6576K1180K3860K4477J7445M157m885l798N94j236r253j6397j8802
$$ y = [105646, 83156, 64068, 61632, 67315, 63475, 47497, 33912, 32822, 36800, 33386, 21296, 6823, -8471, -26149, -40622, -41779, -28676, -11721, 730, 10476, 21934, 34345, 46195, 61495, 84986, 112558, 130826, 127160, 100512, 64468, 39177, 36086, 49103, 63167, 70654, 74855, 78997, 80696, 79981, 83816, 95933, 108029, 108639, 97504, 84148, 74538, 66275, 56287, 46604, 41360, 42609, 49940, 61009, 72333, 82418, 93388, 106823, 119485, 126686, 128396, 128371, 129037, 131123, 135780, 141649, 142087, 132314, 118234, 110481, 109454, 104580, 90381, 74883, 68142, 69843, 73537, 76764, 80396, 82776, 81992, 81510, 86700, 96469, 103421, 101653, 90641, 73572, 56472, 46514, 45047, 43481, 32478, 15146, 4913, 10029, 26605, 47785, 71645, 96122, 113567, 117724, 112839, 109041, 109635, 108399, 99146, 82749, 63947]
71192F3947j7546j2527j304J4631K7187K9060K2364J6275J5403J3981M651r529
71180A66593j7288j3609n859k905l972l288q73j541n764q959q675n515J670J2687
71166A02702J8387P484j5311k8916k1153n605l638j5764A5838E522J2042K7408
71154D4972K7197J4814q96j1975j6066j7359j9595B208f917e22A6520J9433K1069
71141E7022K5944K5987J3445n359j6579j4691n099M353P229r89j6516k4313j2249
71128C8185J1688K5829J9648L715o146n231J967R776J1938K791j4659k7507k6419
71115D5575j5973o127O75P305J2948J5375J7530K1943K2124J0736n511j1690n761
71102A09149p74l461m863J461N833j873j3594j3788k235P690R785R691J0043N855
$$ y = [63947, 46401, 33874, 32570, 47201, 74388, 103448, 125812, 142087, 157490, 171471, 176122, 166593, 149305, 135696, 129837, 126932, 122960, 119672, 118799, 117258, 111494, 102535, 93860, 88345, 90015, 102702, 121089, 128573, 113262, 84346, 63193, 57588, 53950, 38186, 15838, 5522, 17564, 44972, 72169, 86983, 86087, 74112, 58046, 40687, 21092, 2208, -6917, -522, 16520, 35953, 57022, 82966, 108953, 122398, 117039, 100460, 85769, 80670, 85023, 92252, 91263, 74747, 50434, 38185, 49873, 75702, 95350, 99065, 92919, 87688, 89655, 99431, 111369, 114160, 99501, 71994, 45575, 29602, 23475, 24150, 31455, 44403, 59778, 77308, 99251, 121375, 132111, 126600, 114910, 109149, 108375, 104914, 100051, 101512, 107345, 105472, 91878, 78090, 75855, 83545, 93330, 103021, 113064, 118919]
71088A18919k728o476j050O181R255J2931K0879K3874J0744j4081l4323m0461
71076A03664l5254k3073m558J6165K7932K1738Q25k0614k8056j7984j815M095
71064D3065l274q705J094J6299J3922j0661A7258a6974j2457J0807D707K7632
71052C2339K8539K6276K0757J2739R6j8137l3029l0890j1227Q449J1661J035q841
71039C9767j1411j2221I95a3721o040M904g300J261l331J430A881J0800L303k562
71025A3422N7N587N149J68M66J0566K4527L4624L8468L5569K4037N880r661j5011
71011A73848j3882j5253j9114j6106k674J0868J1757l19j4199j9839j5432m840
70999G4815N802R138O67j4858k4631j9376l262J0195J1885M962n34J726R846J7208
$$ y = [118919, 116191, 109715, 108665, 114846, 124101, 137032, 157911, 181785, 192529, 178448, 144125, 103664, 68410, 45337, 40779, 56944, 84876, 106614, 107439, 86825, 58769, 40785, 38970, 43065, 39791, 31086, 32180, 48479, 62401, 51740, 17258, -16974, -29431, -18624, 4707, 32339, 60878, 87154, 107911, 120650, 120746, 102609, 69580, 38690, 27463, 35912, 47573, 48608, 39767, 28356, 16135, 995, -13721, -19761, -14857, -7300, -6039, -9370, -7940, 1881, 12681, 15984, 13422, 13479, 19066, 24215, 24383, 24849, 35415, 59942, 94566, 133034, 168603, 192640, 198520, 188859, 173848, 159966, 144713, 125599, 109493, 106819, 117687, 129444, 129125, 114926, 95087, 79655, 74815, 80617, 89755, 90422, 75564, 50933, 31557, 28295, 38490, 50375, 55337, 54803, 56529, 66375, 83583]
70985H3583J8313J2594M927J956N730J1313J2844J0618Q203L678q806k6050l2805
70972A06098j9820J36M829r831k4956k2932o620R236J5869J3364M196o749j0909
70959E1911m407M410L806o412j5458j4925m613J1951K8778L5847K6611Q272m382
70946A21389o590o297q827j0229q805j0601j6799j7205o075N059K363q874j1084
70933A7425M05J2098J2660O702N057J0313J6520J7409J1123P21p454q741m855
70920H9383j241m70j642m647r723j3411j1158m495O6J90O4K692N992Q283J0970
70905G0853J3122R974J224m888j363P745J2873J1061O732K831j904o884p622k545
70891A11209K593J137n269q153l664J205k519j2463j5980o315P717J2441N570
$$ y = [83583, 101896, 114490, 119417, 121373, 127103, 138416, 151260, 161878, 170081, 173759, 164953, 138903, 106098, 86278, 86414, 91243, 81412, 56456, 33524, 26904, 36140, 52009, 65373, 69569, 62820, 51911, 47504, 51914, 55720, 49308, 33850, 18925, 14312, 26263, 55041, 90888, 117499, 125771, 121389, 114799, 108502, 99675, 89446, 80641, 70040, 53241, 36036, 29961, 35020, 37383, 28509, 17425, 17830, 29928, 42588, 49290, 54347, 64660, 81180, 98589, 109712, 110433, 102979, 94238, 89383, 88142, 87672, 86030, 81383, 71660, 58249, 47091, 42596, 42662, 42852, 42916, 45608, 51600, 59883, 70853, 83975, 93949, 95173, 90285, 88922, 96667, 109540, 120601, 127333, 130164, 128260, 121376, 113754, 111209, 113802, 114939, 109670, 101517, 97853, 99058, 96539, 84076, 68096, 61781, 69498, 81939, 87509]
70878H7509m222j0685j4617j5605q682O917K1895K4764J2825o520k1601k2713
70866D9265q509J0689K0911J9027J4615J5333J7293J3919O723N67n119j1996j5112
70853A27606r541j373j319q691j2823j0581j0499j6059j6835l949J4042K0093
70841G0071R190q188k0207k3200I292A483M205J2038J4498J6058J9525K0880J4787
70828A03474L005o651r061n898q18N541J3473J9688J8657Q723n254j5899j9102
70815A09878j6251j2377j1937j4421j3966n487Q317J8679K0604J8059J6976J6090
70803A34164R228m176j5958j8113j0887K18J1415K0451K2657J4357P03p124o080
70790A50855o140j5185k5038k2057q299K03l226p855n285k735o673o417R858L1201
$$ y = [87509, 83287, 72602, 57985, 42380, 33698, 40615, 62510, 87274, 100099, 93579, 71978, 49265, 40756, 51445, 72356, 91383, 105998, 121331, 138624, 152543, 159266, 159833, 154714, 142718, 127606, 118065, 116692, 115373, 106682, 93859, 83278, 72779, 56720, 39885, 35936, 49978, 70071, 79261, 71073, 50866, 27666, 9292, 1483, 5688, 17726, 32224, 48282, 67807, 88687, 103474, 106479, 99828, 90767, 84869, 84051, 89592, 103065, 122753, 141410, 150133, 144879, 128980, 109878, 93627, 81250, 69313, 54892, 40926, 35439, 43756, 62435, 83039, 101098, 118074, 134164, 143392, 139216, 123258, 105145, 94258, 94476, 105891, 126342, 148999, 163356, 164059, 156935, 150855, 144715, 129530, 104492, 82435, 74136, 74339, 71113, 63258, 57973, 55238, 48565, 42148, 52006, 83207]
70776H3207L5201K0510Q266R086Q515o944k6880l2396k1954q725r64J970K56o900
70762F2248j5538k0448D981a2924n854d655B3948K5777J2307L396O00o049j6627
70749D3352j8734p413P447J6518K0038J8369Q103o948j4452j0218m253l543j482
70736D6784P018J2804O511m982q691l868K092Q180J6089J8563P536r006j3909
70723H5121m076P304J1302J0985P817k714j6918k0303p757O796J0590R976J6348
70710A14471K4498J9989K410j3924k0435k1674k2358k0383j5365j2410j2797j0282
70698A1740j740O530Q311O294O251Q946J3098J9470K5556K2801P665r192j3571
70685A12159m832N503R425Q043L784l196j0576j4112j2995q433J112J4401J9872
$$ y = [83207, 118408, 138918, 147184, 156270, 164785, 157841, 130961, 98565, 76611, 67886, 66922, 68892, 69148, 62248, 46710, 26262, 4981, -12924, -18778, -4655, 23948, 49725, 62032, 65428, 66028, 59979, 43352, 24618, 17205, 24652, 41170, 61208, 79577, 87680, 80732, 66280, 56062, 51809, 48266, 46784, 53802, 66606, 73117, 68135, 59444, 55576, 57668, 65848, 81937, 100500, 108036, 99030, 85121, 81045, 88349, 99651, 110636, 118453, 115739, 98821, 78518, 70761, 77557, 88147, 98123, 114471, 138969, 158958, 161368, 147444, 127009, 105335, 82977, 62594, 47229, 34819, 22022, 11740, 10000, 16530, 24841, 31135, 37386, 46332, 59430, 78900, 104456, 127257, 134922, 125730, 112159, 107327, 112830, 122255, 130298, 134082, 130886, 120310, 106198, 93203, 84770, 85882, 100283, 120155]
70672A20155O748j5440k2821p514J1441J4588O619M212J0261J3351O295p128j9714
70659A21053k4796j7266r29R771N968k360o70Q046R277Q05o075p659j1894j8877
70645F4394j5899Q11J5470J4262M892L230J0442J5715J4762J3006J3653J3585
70633A68323J0262M850j026n932p345m470o92L78j455n832j3346k0251j8133n464
70619I9867O090N182l470o160m56K292m367j1078n515J0050K0268J4351j866j2262
70605A12926p323O434J4302R236k332r649q568k434L668O644N953L021r60o738
70591A24180j4013j7906j3540m197J286J93j896k124m828j1340j4436r232j571
70578C0576J821M080J0465J6484J4202N999J340K404L193J327N29J397n81o024
$$ y = [120155, 126903, 111463, 88642, 81128, 92569, 107157, 113776, 117988, 128249, 141600, 147895, 140767, 121053, 96257, 78991, 78062, 87833, 93801, 91441, 90771, 98817, 108094, 108899, 102824, 95165, 83271, 64394, 48495, 49306, 64776, 79038, 83930, 87160, 97602, 113317, 128079, 141085, 154738, 168323, 178585, 183435, 182409, 176477, 169132, 164662, 163970, 164348, 162893, 157061, 143715, 123464, 105331, 99867, 105957, 111139, 107669, 101509, 101053, 103345, 98978, 87900, 82385, 92435, 112703, 127054, 125188, 112926, 105603, 112037, 126339, 135575, 133243, 123594, 115026, 112592, 116260, 122904, 128857, 131878, 130918, 124180, 110167, 92261, 78721, 74524, 75810, 76003, 74107, 71983, 67155, 55815, 41379, 32147, 30576, 32397, 36477, 46942, 63426, 77628, 83627, 84967, 87371, 90564, 91891, 92420, 93817, 93236, 87212]
70564H7212q659l865N322J2418J3809J0488O566N164M117m24m588Q04J3376J5274
70550A57014l277k5675k8254j1212N851J3814J9851K5315K0040L060j1343j5834
70538A49350j9647k6888k4278m453J4977J3622j636p242L757J6780J9413J2762
70526A46517Q89j4174k5557k4155j1553N96O134Q816R960M367p203j3363p292
70513G3982K068J991o936j3352j0282j86J2286K4495L2724L1725K0560O095k189
70500A72981r60L904L146o611j9367k5759k1933j1718j390N284P368N673K910
70487A13528K608N677Q781P600J416o449j2194j4353j3446j0344o130k535o66
70474G3493R85M865R375Q233j476j2285j2667j255J0599J3032R229Q132J0010
$$ y = [87212, 78553, 74688, 80010, 92428, 106237, 116725, 123291, 128455, 132572, 132148, 127560, 128364, 141740, 157014, 153737, 128062, 99808, 88596, 94447, 108261, 128112, 153427, 173467, 176527, 165184, 149350, 129703, 102815, 78537, 74084, 89061, 102683, 101047, 93805, 97562, 114342, 133755, 146517, 147406, 133232, 107675, 83520, 71967, 72563, 78697, 87513, 97473, 101840, 94637, 81274, 73982, 76050, 78041, 71105, 57753, 47471, 47285, 59571, 84066, 116790, 148515, 169075, 175170, 172981, 172021, 175925, 179071, 172460, 153093, 127334, 105401, 93683, 92293, 97577, 104945, 110618, 113528, 116136, 121813, 130594, 138194, 139610, 133161, 120967, 106614, 93168, 82824, 76694, 74159, 73493, 74478, 79343, 88718, 96951, 95475, 83190, 70523, 69268, 79867, 92899, 102128, 110260, 120270]
70461A20270O827l732j2450j0074L41P213M464k614n320j549L923O712P336Q525
70447A29872J0852J2572J2285R522L575n502j4460j7776j2574j909P413R981N443
70434A49294j781o918r808j4067k0240k2834j7701r431n398l875M276K0576L3526
70421I5619L2375K0387R260M888M403L983L199K355N85k937q065j3225j4857j0446
70407A27524l754k472p454r541j924R403J3864J0500O253L871O75k631k033R99
70393A43280N75k641j240N948J0633Q472N635O317L695p980k0305k0653j0687
70380A21049l789n717q618n349k4m65o798j2304j1862n986J253N716N749K944
70366G5799P0j274k45L619P758O754k43m952J26Q859P599m916j4179j0663l299
$$ y = [120270, 127097, 123365, 110915, 100841, 101182, 108395, 112859, 110245, 104925, 103376, 107299, 114011, 121347, 129872, 140724, 153296, 165581, 175103, 178678, 173176, 158716, 140940, 128366, 126457, 133870, 143851, 149294, 147513, 140595, 130787, 116720, 96480, 73646, 55945, 46514, 41116, 37241, 41517, 62093, 95619, 127994, 148381, 157641, 162529, 166932, 170915, 174114, 176469, 177054, 174117, 166052, 152827, 137970, 127524, 123770, 121298, 113844, 104303, 102379, 111782, 125646, 136146, 142399, 146270, 146945, 144314, 142281, 143280, 143855, 141214, 139974, 145922, 156555, 165027, 170662, 176979, 180674, 172694, 152389, 131736, 121049, 117260, 111543, 102925, 97576, 97552, 97087, 90289, 77985, 66123, 60137, 61390, 67106, 72855, 75799, 75869, 74595, 74350, 77969, 85727, 92481, 92238, 87286, 87412, 96271, 103870, 98954, 84775, 74112, 70813]
70351G0813l970q052k988R586J5522J0983P678J1581J1841K6j2046p101J2011
70338A15884K5805K4447J6650J1638N956o418k1125k8786k7570k3091j8960j3769
70326F0661o250J744P668J0964J2983J4909J4657P013r130k3897k3905r664J520
70313E9273l732j6888j8948o715L143k341h69j5394OH23K0086R799J509O742J9915
70298E8874K5289J5919J149o392n680m169m456k442K606N272L070J32j388n813
70284H1971j4615j9142j0161Q711K3898K6554J9376J0718P071R457J2255P677
70272A63770l588r513j634J0420R395n558j7545j7089j5135k3260l3053k8175
70260B9035r743N043P008L185M12m096j0492q527P505K4734K5089R244l831j051
$$ y = [70813, 66843, 58791, 55803, 65389, 80911, 91894, 99572, 111153, 122994, 123020, 110974, 103873, 115884, 141689, 166136, 182786, 194424, 200380, 193962, 172837, 144051, 116481, 93390, 74430, 60661, 54411, 56155, 63823, 74787, 87770, 102679, 117336, 124349, 115219, 91322, 67417, 57753, 59273, 55541, 38653, 19705, 12990, 16133, 13792, -869, -16263, -16257, 823, 20909, 30708, 32217, 38959, 58874, 84163, 100082, 101231, 94839, 89159, 84990, 80534, 78092, 80698, 85970, 89040, 89172, 87784, 81971, 67356, 48214, 38053, 46764, 70662, 97216, 116592, 127310, 134381, 143838, 156093, 163770, 160182, 150669, 149035, 159455, 168850, 163292, 145747, 128658, 113523, 90263, 57210, 29035, 19292, 24335, 31343, 34528, 34940, 30844, 20352, 11825, 19330, 44064, 69153, 78397, 74566, 73515]
70246G3515J0502J5609R778J464p72J553N3q838j7503j4751N62J7346K4922K3029
70232A36469J6832Q400j182p087o699o576j3593k1412j7348k897N545J51o960
70219H3643l246N029M372l206l074R292K1556K1523J0217m265j5946j9975j1824
70206I4096M633J3771K662k1129l3400j8272J3950L6766L3472J0628j2551k2900
70194A01726j9686p738Q610K4377L2715K9193J6137R00r583j2802j1715j2340
70182A39794j7526k2540j9993r711J99L543L146N614J2978K2243K9312L0275K2738
70169B00072R771m34k628M24L458N248N819J895q916k2020k9721k9684k4961j8026
70155I0297j0032l936k455l610l024K76M393Q864J3818J6849J5878J3347J2564
$$ y = [73515, 84017, 99626, 109404, 110868, 110096, 111649, 111702, 102864, 85361, 70610, 71172, 88518, 113440, 136469, 153301, 161701, 160519, 153432, 146733, 140157, 126564, 105152, 87804, 84907, 90452, 90603, 83643, 80397, 85426, 89798, 86592, 83518, 92810, 114366, 135889, 146106, 141841, 125895, 105920, 94096, 98729, 112500, 115162, 94033, 60633, 42361, 56311, 93077, 126549, 137177, 124626, 101726, 82040, 74302, 82912, 107289, 140004, 169197, 185334, 186234, 176651, 163849, 152134, 139794, 122268, 99728, 79735, 70024, 70223, 73766, 76912, 82526, 95504, 117747, 147059, 177334, 200072, 209843, 209409, 206781, 207205, 210663, 215911, 221730, 223625, 214709, 192689, 162968, 133284, 108323, 90297, 80265, 76329, 73874, 70264, 67240, 67516, 71909, 80773, 94591, 111440, 127318, 140665, 153229]
70142A53229J1946Q246L151N21j041o196j4730k1517k3200j9354r797K190P358
70129I0806M26r394p761N565J6767J6928J0137K426n127r528m629P722J5348J0508
70115A40194j149j0763j6340j7915j2740k297M422K061l519m955l112j138K724
70102G5473Q923J1299O192k97j938j669l511l784K29K017k695n206K240J0222
70088I7495N534n859p147K140O681K217J739J1557K0233J8089J1241P788M691
70075A76399k052o945n272l094o358r745p521o358j4200k3137j7931R36J5924
70062I0646J4303J109j0195j1485l930M192L329p199j5778j1775k95M616j35m035
70048E3368n83M003L359J500M358R309J0582Q764P526O477N089Q517K0010L0892
$$ y = [153229, 165175, 173421, 176572, 177093, 176052, 169856, 155126, 133609, 110409, 91055, 81258, 83448, 90806, 91232, 81838, 74077, 79642, 96409, 113337, 123474, 125900, 120773, 111245, 106616, 114338, 129686, 140194, 139045, 128282, 111942, 94027, 81287, 78990, 83412, 85473, 81954, 76999, 73887, 72749, 75473, 84396, 95695, 101887, 101590, 99652, 97983, 94472, 90688, 90917, 92934, 90239, 85033, 87273, 97495, 103029, 97170, 90023, 92163, 98844, 101061, 102800, 114357, 134590, 152679, 163920, 171708, 176399, 174347, 167402, 162130, 159036, 152678, 142933, 135412, 129054, 114854, 91717, 73786, 74722, 90646, 104949, 106058, 95863, 84378, 80448, 84640, 87969, 80770, 64992, 53217, 52922, 57538, 57403, 53368, 52785, 56788, 60147, 61647, 66005, 75314, 85896, 94660, 102186, 108663, 113752, 122269, 142279, 173171]
70034A73171K8411J2507m861j6097k2597k3070j1832N909J1296m396k3646k4290
70022A00505j0065k909q089o682J2932L4331L5048J6764p0m167k058k698p385
70009A55457j4960k4519l0328k4743j0280J89M71j42P915J7511J3320m999j8584
69996F6308j1317J0565K5558K0865M847m526j05Q465Q546K24n370j648N177N436
69982A33025j305p369q263p043p377p424k939O318J5517J8521J2242m5q989o868
69968A28001K682P059O88o374k651O228M023j1411k2561j6406k607J472n071r301
69954G3771n259J555P583J4296J7500Q921p059j2471L49J5801J5682L040o065
69941A27644o685p071j0590r874L0J3523K1958K1799J3973K136p233r403p223
$$ y = [173171, 201582, 214089, 209228, 193131, 170534, 147464, 135632, 141541, 152837, 148441, 124795, 100505, 90440, 87531, 79442, 72760, 85692, 120023, 155071, 171835, 171765, 167598, 165540, 162842, 155457, 140497, 115978, 85650, 60907, 50627, 50816, 51287, 51145, 59060, 76571, 89891, 84892, 66308, 54991, 65556, 91114, 111979, 116826, 112300, 112195, 120660, 129206, 129430, 124060, 122412, 127589, 133025, 131720, 124351, 116088, 109045, 101668, 94244, 91305, 97623, 113140, 131661, 143903, 143858, 134869, 128001, 130683, 137742, 138430, 132056, 129405, 135633, 139656, 128245, 105684, 89278, 86671, 88143, 83072, 73771, 68512, 70067, 77650, 91946, 109446, 118367, 111308, 98837, 99186, 114987, 130669, 133709, 127644, 120959, 113888, 103298, 93424, 93454, 106977, 128935, 150734, 164707, 166843, 159610, 150207, 142984]
69928A42984p254j0363j2100j1561j2124j3106r130J27P359P796N017L542K582
69915I3769Q95R39L255L030k073o267m270l59r71k541L391J4270J6620M814r548
69900A14954j2575n391J389N417J4047K7953L4795K5414Q257j601l147p927j8810
69887A82775k3202j2249M014R186J314p970j0322o944p82O895J1832Q348j468
69874A61427p198k320P668J2203P304j811p250o126k810l134o108n024J369M817
69860A53007j55o426n122p13l921j3118j6422j2017j1586j9596k2859q597J6760
69847D9235L5307L7620K8140J5945O934J888k084o224n957K476J2119J0970j263
69834A85106j2288j5191j5164j4439n221J3559K6002J8754R78q775p785o912r355
$$ y = [142984, 135730, 125367, 113267, 101706, 89582, 76476, 67346, 67473, 74832, 82628, 87645, 91187, 93769, 94664, 95603, 98858, 101888, 99815, 93548, 89278, 88919, 87948, 85407, 88798, 103068, 119688, 124502, 114954, 102379, 96988, 98377, 103794, 117841, 145794, 180589, 206003, 214260, 212659, 209512, 201585, 182775, 159573, 147324, 151338, 160524, 161838, 153868, 143546, 136602, 135820, 142715, 154547, 162895, 161427, 154229, 151909, 159577, 171780, 179084, 177273, 170023, 163897, 161087, 157953, 151845, 146821, 148190, 153007, 152852, 146426, 141304, 140591, 136670, 123552, 107130, 95113, 83527, 63931, 41072, 32475, 49235, 84542, 122162, 150302, 166247, 173181, 175069, 172985, 166761, 160804, 163280, 175399, 186369, 185106, 172818, 157627, 142463, 128024, 122803, 136362, 162364, 181118, 182096, 173321, 165536, 158624, 149269]
69821A49269p844p70M020K435j545n557j0973j3868o331R099J7050P620j0364
69808A32241k0173j5887m987L698Q625J2710J5966J3529J893j3970k3187j9887
69796I0571q147N308J8067K8672L2265K5705J3365K619l573n803m727l049n401
69783A85872j0723j0653j664P891R806P397N914O29j3150k5569k2780p690M758
69770A30038R567J3040J4692O068j0882k1809k0558j6374j6240j5247j0148p551
69758E4596j1047j3441r688n280l641K449J7261L0969L2878K6673K1786J7470
69746A60985O823q674j9426k0095j4388r674j0937j6440j7355p764M466O290l05
69733E3506k81R196J2699L383k791O928J9026J5193L160M177J8343K5780J8667
$$ y = [149269, 141425, 140655, 144675, 147110, 145565, 140008, 129035, 115167, 108836, 117935, 134985, 142605, 132241, 112068, 96181, 91194, 94892, 103517, 116227, 132193, 145722, 147615, 133645, 110458, 90571, 82424, 87732, 105799, 134471, 166736, 192441, 205806, 208425, 204852, 199049, 194322, 191273, 185872, 175149, 164496, 162832, 170723, 180529, 187926, 193840, 194469, 181319, 155750, 132970, 125280, 130038, 139605, 152645, 167337, 173405, 162523, 140714, 120156, 103782, 87542, 72295, 62147, 54596, 43549, 30108, 20420, 15140, 11499, 13948, 31209, 62178, 95056, 121729, 143515, 160985, 167808, 159134, 139708, 119613, 105225, 95551, 84614, 68174, 50819, 43055, 47521, 53811, 53506, 53225, 62421, 75120, 78503, 75712, 82640, 101666, 116859, 120019, 124196, 142539, 168319, 186986]
69720A86986R694Q002P006k14j0205j7900k2176k0116r628K47l260j5658j7311
69707I5467j761J3422J1887N16l882J644P270P190M088J642J528M469P430L912
69693A54822o732j4734j1476j639L490J730P67M196N204k474j2689j1964L344
69680A11845J9887K1771R989K14N33J530n736j2903p736L441L525p875j2891l315
69666A22279P910R001O004P734R543M978J299P854J7298J4364r85j3814j5712
69653A77753j2727j2057j2930j2421j0593p685l909l196r574j8522j9254q054
69641D6831O370J2804Q190k458j1899j5075j1778o488l153p15L810R604J3200
69628D9243J3534J1876Q739N077L945O299Q032O368N254P966Q968K213n993l496
$$ y = [186986, 196680, 204682, 211688, 211474, 201269, 183369, 161193, 141077, 131449, 131696, 128436, 112778, 95467, 93706, 107128, 119015, 119531, 115649, 117293, 124563, 131753, 135841, 137483, 139011, 143480, 150910, 154822, 148090, 133356, 121880, 120241, 123731, 125461, 126228, 130424, 135628, 133154, 120465, 108501, 111845, 131732, 153503, 163492, 163706, 164239, 165769, 160033, 147130, 139394, 142835, 146360, 138485, 125594, 122279, 130189, 139190, 145194, 152928, 162471, 167449, 168748, 176602, 193900, 208264, 207279, 193465, 177753, 165026, 152969, 140039, 127618, 117025, 109340, 105431, 102235, 92661, 74139, 54885, 46831, 53201, 66005, 74195, 71737, 59838, 44763, 32985, 26497, 23344, 22629, 26439, 36043, 49243, 62777, 74653, 83392, 88469, 92414, 98713, 106745, 113113, 118367, 126333, 135301, 137514, 131521, 128025]
69614A28025R625K0720K2448J9168J4422N401n684p598M556J9683K4296J7895
69602B72957P755k716j1902j4620r765o926j3856k2027j7143j264Q662M460l703
69589A89912l978K105O128N400K853J49l123o548r371j1754j3426j3330j1550
69576A33467q742m011K300M624k439j4163j8836j3059n822l729j134Q599K0413
69563I7468K5297K4651K6260K9493K5789J2827k363j4556k3803k6740j7062J60
69551A57421O566p126k4578k1421L304K4074J8490p942k9388k6951n503J3728
69539A00674J4516J51j2316j1240r54P126Q889Q587R182Q259L200m773j1998j3870
69525A05433o010J0469K4959K5147J0658o233j4902j5796j3950j0287m125J386
$$ y = [128025, 137650, 158370, 180818, 199986, 214408, 219809, 214125, 206527, 211083, 230766, 255062, 272957, 280712, 277996, 266094, 251474, 241709, 234783, 220927, 198900, 181757, 180493, 189155, 193615, 189912, 185934, 188039, 194167, 199567, 202420, 202569, 199446, 192898, 183527, 171773, 158347, 145017, 133467, 124725, 120714, 123014, 127638, 125199, 111036, 92200, 79141, 73319, 69590, 68456, 77055, 97468, 122765, 147416, 173676, 203169, 228958, 241785, 239422, 224866, 201063, 174323, 157261, 157421, 163987, 156861, 132283, 110862, 114166, 138240, 156730, 148788, 119400, 92449, 86946, 100674, 115190, 115341, 103025, 91785, 90831, 97957, 106846, 115433, 124615, 132874, 136074, 131301, 119303, 105433, 99423, 109892, 134851, 159998, 170656, 164423, 149521, 133725, 119775, 109488, 105363, 106749]
69513A06749K609J070M62O86J69J645R204K0240K6133K1994J1803L309Q94L698
69499B10665P692R237Q396Q111Q648N786k057q244n274M145R836P108O9p888j8273
69484B37957k9464l2619k1449j617J4267J7828Q743o795j7459j3313K052J0995
69472A69126J585j5856k1156j0896j436m908j4197j6639j2043q341o289O30J3157
69459G2737K2842K3137J6902J0483O108L341L632Q529J5097J7069J1060j71j0556
69446B00210j5745j5782j4004j2829j0100j187J3528K5070K3380Q698p689j4923
69434A78627j1623k420R395K0791K4242J2975p146j8951j3048q10n77j3261k1252
69421A56942j3534k064n543k3045l4800k8785j5124q912q022J396K0886L4014
$$ y = [106749, 109358, 110428, 110890, 111576, 111745, 113390, 122594, 142834, 168967, 190961, 202764, 206073, 206967, 210665, 218357, 227594, 235990, 244101, 252749, 258535, 256478, 248234, 242960, 247105, 256941, 264049, 264118, 256230, 237957, 208493, 175874, 154425, 152808, 167075, 184903, 193646, 186851, 169392, 156079, 158131, 169126, 170711, 154855, 133699, 122803, 121367, 116459, 102262, 85623, 73580, 65239, 58950, 59580, 72737, 95579, 118716, 135618, 146101, 152209, 155550, 159182, 167711, 182808, 199877, 210937, 210766, 200210, 184465, 168683, 154679, 141850, 131750, 130563, 144091, 169161, 192541, 201239, 193550, 178627, 167004, 164584, 173979, 194770, 219012, 231987, 224841, 205890, 192842, 192032, 191455, 178194, 156942, 143408, 141344, 135801, 112756, 77956, 49171, 34047, 25135, 17113, 18509, 39395, 73409]
69409G3409K8355J2903N140O867M417p930j7023r067J0098K2186J9624J1578Q009
69396A68566Q195P861P876R201O419m632j6720j8720j2163r949j6561k0087r930
69383I9356N941J0566K49j2405j5981j1022k594Q104K0176K8342K8033K1403J3433
69370A93601N400l156r619j1355j0846j1216q717K084J5926J9370R182o89K750
69357A92715J3322J4823M457m017p52P779J1298J0673J1784J1337R08j5826k2416
69344B36085j0958N240Q158j734q279k770O269P667K142k501l144j893J78K579
69330B37039K003l317p904n396J81j823j2453j9865j6303r844j1810j8756j6930
69317A14822k588J1969J4120M706p129j5827k0443j8521p115R879K1802K1962
$$ y = [73409, 101764, 114667, 119807, 126674, 131091, 123161, 106138, 97071, 107169, 129355, 148979, 160557, 168566, 176761, 184622, 192498, 201699, 208118, 203486, 186766, 168046, 155883, 145934, 129373, 109286, 99356, 105297, 115863, 116112, 103707, 87726, 76704, 74110, 82214, 102390, 130732, 158765, 180168, 193601, 199001, 195845, 186226, 174871, 164025, 152809, 144092, 146176, 162102, 181472, 190654, 189965, 192715, 206037, 220860, 225317, 221300, 220548, 228327, 239625, 250298, 262082, 273419, 274327, 258501, 236085, 225127, 230367, 238525, 236791, 228512, 225742, 232011, 239678, 241820, 239319, 236175, 234282, 234460, 237039, 239042, 235725, 227821, 222425, 222606, 220783, 208330, 188465, 172162, 162318, 150508, 131752, 114822, 112234, 124203, 138323, 143029, 135900, 120073, 99630, 81109, 73994, 83873, 105675, 127637]
69305A27637J5237J1639J3973J5556J0370J533l010j058J403j534q479j3587j3930
69292A55750j1024o171J914J3410K3858K6998K0909R659j426j0179j6323j8112
69280A89263j3731n765k07Q24J721N573P108p58j4382j9948q877J1697K6309K5791
69266B04618J2896k461j0398o882L103R152M919o525j7172k1059j6076m130P219
69253A57204Q324j928j2536j2894n621q66j275n17M895J1092J4136J3372O704
69240A80090q301k5800l2939k4517r849o52J301J82k443m993j374J1449K4629
69227A06783K5353J2622k277j0525j3604j6083j7789j5792r656k316J769q94q955
69214D8636j4913j1136K405J8574K9898L1988K3229P195n891p075Q00O184L300
$$ y = [127637, 142874, 154513, 168486, 184042, 194412, 195945, 192935, 191877, 193280, 191746, 183267, 169680, 155750, 144726, 138555, 140469, 153879, 177737, 204735, 225644, 235303, 233877, 223698, 207375, 189263, 175532, 169767, 169560, 170384, 172105, 177678, 184786, 184028, 169646, 149698, 140821, 152518, 178827, 204618, 217514, 215053, 204655, 197773, 200876, 210028, 214947, 208422, 191250, 170191, 154115, 149985, 157204, 165528, 163600, 151064, 138170, 132549, 131683, 130408, 129891, 134786, 145878, 160014, 173386, 180090, 171789, 145989, 113050, 88533, 78684, 78032, 79333, 79515, 77072, 72079, 70705, 82154, 106783, 132136, 144758, 142481, 131956, 118352, 102269, 84480, 68688, 59032, 56716, 58485, 57591, 48636, 33723, 22587, 24992, 43566, 73464, 105452, 128681, 135876, 129985, 122910, 123710, 129894, 133194]
69201A33194k509n125o017q732j1384r763l674M388J3000J9705J9214R676j881
69188A50092o490m189j920j559K575J2434J9234J2728n464k2523k7520k0329p875
69175I9194L946J2294J4797J0316K780p30J240J532n121j1718o531R251J9973
69162A51223J5165L483O76Q800J5637J2760N423K882N933Q118N503Q66r71Q31
69148B36329K433J30m812p324m843j73L452P085J2342J5476J0899M78o412m067
69134B60993K542M215k443j3294k1500k1605j2518k06N062j595j3589j9400j4158
69121A52504k171R842J7577J8293J1048k00q032r162p946r639j3062j3703j1661
69108A33688j0657r437j284J4310K5514K0801N022n281k946J797k596j3221j9700
$$ y = [133194, 130685, 125560, 119543, 110811, 99427, 89664, 85990, 90378, 103378, 123083, 142297, 151973, 150092, 143602, 139413, 137493, 135934, 138509, 150943, 170177, 182905, 177441, 154918, 127398, 107069, 99194, 103140, 115434, 130231, 140547, 143327, 142597, 143837, 145369, 140248, 128530, 121999, 131250, 151223, 166388, 169871, 170547, 179347, 194984, 207744, 213167, 216049, 221982, 230100, 235603, 236469, 235498, 236329, 238762, 238892, 234080, 226756, 221913, 221740, 225192, 232277, 244619, 260095, 270994, 271472, 265060, 260993, 263535, 267750, 265307, 252013, 230513, 208908, 196390, 196184, 201246, 199651, 186062, 166662, 152504, 150333, 160175, 177752, 196045, 207093, 206893, 198861, 189699, 181753, 172114, 159052, 145349, 133688, 123031, 113594, 112310, 126620, 152134, 172935, 177957, 172676, 169730, 171527, 168931, 155710, 136010]
69095A36010k0744k3909l0865B7758E796j631J8889L1298L0249J6114o19n512
69083I4584L449J1950P892k665n958p61K809J316J822O924Q517J087q950j3525
69069A08491j4229j5929j5989q996K117R186J1009J3337J7257J6990J1139P163
69057A41546R959J2848O214r014k2926k9134k9023k4287j2662N586K2149K7222
69045I8478K0701J2441J0534J2757J1821O540L525P368J3291J2934N712P5K614
69032B18791R615J2195P628J601o13q76m000j0061j4890j7114j9901k4232k4545
69019A33598j5263k01R308P223O19J856J3766K5556K4531J0274n088j0469o886
69006A88824l149l446m188l102m738j2472j9683j6168k330R933J1652O093J442
$$ y = [136010, 115266, 91357, 60492, 27758, 5796, 4165, 23054, 54352, 84601, 100715, 100096, 94584, 98033, 109983, 117875, 115210, 109252, 108491, 111300, 112616, 114438, 121362, 129879, 130966, 122016, 108491, 94262, 78333, 62344, 53348, 55465, 64651, 75660, 88997, 106254, 123244, 134383, 141546, 151505, 164353, 170567, 161553, 138627, 109493, 80470, 56183, 43521, 49107, 71256, 98478, 119179, 131620, 142154, 154911, 166732, 173272, 176797, 184165, 197456, 210390, 216102, 216177, 218791, 228406, 240601, 248229, 249830, 249217, 248341, 244341, 234280, 219390, 202276, 182375, 158143, 133598, 118335, 118134, 127442, 134665, 135284, 137140, 150906, 176462, 200993, 211267, 206179, 195710, 188824, 185675, 182229, 178041, 174939, 170201, 157729, 138046, 121878, 119548, 129481, 141133, 147226, 148668]
68993A48668J97O8M75K304L616J746o37K955J3422K1811J7472J20j7818k2125
68979A72274j0708M252R378L989j949k005L10l01l459o797j0099j0889k727J4781
68965A56050K9519K9030J5605J050r582j8631k3660j8306n801J922K209N806J7392
68952A82603K4790J6735J090n972j771L397L671K682L599M909N565N310M29j1683
68938B35354k3815k4370j3182k925j688k653L681J3939J6218P043l311l657M677
68925B05311J0538P605J881K224O787M982p034j9777k2211j4057k541O656R961
68912A90325M409o285r925K2J2203R773p182k2327k4529j7064o061O669J6637
68899A46665J5828M779n086o984o977j0788j2817o512L349Q563J0595J5598K1477
$$ y = [148668, 148865, 148933, 149408, 151712, 155328, 157074, 156437, 159392, 172814, 194625, 212097, 212217, 194399, 172274, 161566, 165818, 175196, 179185, 177236, 175231, 175541, 175240, 171781, 164984, 154885, 143996, 141269, 156050, 185569, 214599, 230204, 231254, 221672, 203041, 179381, 161075, 155274, 157196, 159405, 165211, 182603, 207393, 224128, 225218, 219246, 217475, 220872, 224543, 227225, 230824, 235733, 241298, 246608, 247037, 235354, 211539, 187169, 173987, 171062, 169374, 166721, 170402, 184341, 200559, 207602, 204291, 200634, 205311, 215849, 223454, 225335, 227559, 234346, 239328, 232294, 212517, 190306, 176249, 173708, 180364, 190325, 194734, 188449, 178524, 178546, 190749, 200522, 193340, 171013, 146484, 129420, 123359, 130028, 146665, 162493, 167272, 162186, 155202, 148225, 137437, 124620, 118108, 121457, 130020, 140615, 156213, 177690]
68886A77690K0108R622m192j5677k0736j4330L422K0516K2356Q502p344j4021
68874A85916j1927n710K973J2516J8371J7245J0834L239j997j788M894J3142J3904
68861B61612K968j3168k2379j7879m488N444L618n644j0256m603M305O812K460
68848B08802j554K81Q134J8379K3649J5843l860k1116k2493j1534l173m069p363
68835A99926o269k977k196m691r972j7602k2754j8138m196R476J6476K0173K3746
68822A81002K1855R622n796j1362l515R382J8123J9893J5654O964l462j2444j8956
68809B26960k3667k5918k3600j6141n614M886J2650J6068J5634J3244R192J815
68797B05509p818j3064p623N763J5895J3947K346p937q102R18J0450J2268N022
$$ y = [177690, 197798, 207420, 203228, 187551, 166815, 152485, 155907, 176423, 198779, 207281, 199937, 185916, 173989, 168279, 171252, 183768, 202139, 219384, 230218, 233457, 231460, 229672, 234566, 247708, 261612, 264580, 251412, 229033, 211154, 206666, 212110, 215728, 210084, 199828, 195225, 199530, 206342, 208802, 207248, 207529, 215663, 234042, 257691, 273534, 269674, 248558, 226065, 214531, 211358, 207289, 199926, 193657, 190680, 188484, 183793, 173821, 156219, 133465, 115327, 111131, 120607, 137083, 157256, 181002, 202857, 212479, 206683, 195321, 191806, 201188, 219311, 239204, 254858, 261822, 258360, 245916, 226960, 203293, 177375, 153775, 137634, 132020, 136906, 149556, 165624, 181258, 194502, 203694, 205509, 197691, 184627, 177004, 182767, 198662, 212609, 214955, 207018, 198916, 199834, 210284, 222552, 227574]
68784B27574n525j0617l865J3395L0064L2079J5407q923k6059l1706l1241k7461
68772A73122j7342j997R002Q898L732M009R393R581M95q018m650P966J5970J0887
68758B21048k077j3073j8942k1652k0396j2270O07J1821J8894K3885K5223J7489
68746B30557K111j0745j5110j4701j0696L297K4502L2744J5218j0197j5985l407
68734B27588K386o836j2098k106P768L193m962j162P731N614n390j0943r382j0433
68720A90968j4008j0085J714J0068J0264R094J0114Q451K891k43Q53o76q032j4601
68706A96772j4802j2358j2671j3999j0834j505J0277J7844J5965P608L923J0385
68694A96605J6320Q517p447j3193m896J057n690j3295o904Q887J8513J7234J1715
$$ y = [227574, 222049, 211432, 207567, 220962, 251026, 283105, 298512, 289589, 263530, 231824, 200583, 173122, 155780, 153783, 162785, 171683, 175415, 179424, 188817, 198398, 198893, 190875, 186225, 194191, 210161, 221048, 218971, 205898, 186956, 165304, 144908, 132638, 133245, 145066, 163960, 187845, 213068, 230557, 232668, 221923, 206813, 192112, 181416, 184713, 209215, 241959, 257177, 246980, 230995, 227588, 229974, 223138, 211040, 208934, 216702, 219895, 214933, 213771, 221502, 227116, 221726, 210783, 201401, 190968, 176960, 166875, 168589, 178657, 188921, 198015, 208129, 216580, 219471, 219228, 220081, 219405, 211373, 196772, 181970, 169612, 156941, 142942, 132108, 130603, 140880, 158724, 174689, 182297, 186220, 196605, 212925, 221442, 213995, 200802, 195906, 196963, 191273, 177978, 171074, 179961, 198474, 215708, 227423]
68681B27423N171m798j5903k0838j8095j4138j3075j0846j643J4471L1470M1247
68669B20446L7434J9516n087k5157l3099k8649j7223n942R22M834J0099J6941
68657A95035J9762J3988K155q758j3823j2187n821J053L843J926o88r91l85kL263
68642A98370J1116J6976J1378m873j8450j7244l414J0135J4370J1686Q890P164
68630B46104K682m715r275p520l753l904p831j2106j6454k1117k0945j0702M063
68617A34527J0312L747n719p558k717J504K039O12r68o52M660J4471K1930K0330
68603A96518J0426j871j2033j7674j6401q117K022P196N566J450Q49O385J4465
68590A88781J7144J0522J490Q40Q525J2646O034l677n853k008j513o543r669n184
$$ y = [227423, 232594, 227796, 211893, 191055, 172960, 158822, 145747, 134901, 133258, 147729, 179199, 220446, 257880, 277396, 272309, 247152, 214053, 185404, 168181, 162239, 163161, 167995, 178094, 195035, 214797, 228785, 230940, 222182, 208359, 196172, 190351, 191404, 195247, 197173, 196485, 195494, 195109, 195107, 198370, 209486, 226462, 237840, 232967, 214517, 197273, 193859, 203994, 218364, 230050, 238940, 246104, 248786, 244071, 234796, 227276, 223523, 219619, 211788, 199682, 183228, 162111, 141166, 130464, 134527, 144839, 148586, 142867, 135309, 132592, 134096, 136135, 136747, 135779, 135127, 139787, 154258, 176188, 196518, 206944, 205073, 193040, 175366, 158965, 150848, 152870, 160066, 165632, 167082, 167931, 174316, 188781, 205925, 216447, 217937, 218777, 227302, 239948, 245982, 242305, 236452, 234444, 232931, 226388, 216719, 211535]
68576B11535L805R640P264j926j0262r838j172P003Q678O444L864n94o402n664
68562B22375N588J6533J3129k282j3893j3685q828p671r591j1370j3543j5917
68550A60845j4393p278O02M232M588N526Q200J0831J0849O459m44l068L526J4567
68536B05042K0040J7089J1765Q420N082Q32q24N82l37n263p018k25Q482Q095k264
68521B69498j3108j6860j4560j0965p923l726K865Q346N163j0025k8588l5438
68509A44679k4486m649J1156J7740J6365R215J171J143J3039K7347K9233J5426
68497B57379k063r032k109J0206J5230N855j2468k4478j9004o79J4894J6784O480
68484B56995p541j7327j7981r461J498N413q65j1084j6966j6193j2030p981n032
$$ y = [211535, 215340, 224980, 232244, 230318, 220056, 210218, 209046, 216049, 224727, 231171, 235035, 234441, 228039, 222375, 227963, 244496, 257625, 255343, 241450, 227765, 218937, 211266, 201675, 190305, 176762, 160845, 146452, 139174, 139776, 144008, 148596, 154122, 162322, 173153, 184002, 190461, 190017, 186949, 190475, 205042, 225082, 242171, 253936, 262356, 267438, 268270, 267446, 268028, 267691, 262428, 255410, 255185, 263667, 271762, 269498, 256390, 239530, 224970, 214005, 206082, 202356, 205221, 213567, 218730, 208705, 180117, 144679, 120193, 115544, 126700, 144440, 160805, 170020, 171191, 172334, 185373, 212720, 241953, 257379, 255316, 246284, 244175, 254381, 269611, 275466, 262998, 238520, 219516, 218837, 233731, 250515, 256995, 249454, 232127, 214146, 204685, 206183, 211596, 210731, 199647, 182681, 166488, 154458, 146477, 141445]
68471A41445k372J001M450N221J985r61L073J3493J9755J2641l662j5654j6042
68458A64373r762l911J320P104P594l637j9928k4548j1094P182J4370J1226R169
68445A49458J0706P897j105p341o077m373p221p042L171J5102J6039R100Q264
68432A86578J4897J4611P21j3471j3602m369o92o197j1652j0721n883J47P990
68419A58357J4847J3767L793o129q003m053l74L110R784J6867J7044R899M769
68406B33678R055J7826J8935P254r204j7960j5517j0409j1719j6492j2961K565
68394A95051J7905J9323R677M143Q756J2749N407q047j4316j0171m014j340K192
68381B37315J0867J9130J7366N404m912k445J0102J8476J2760j730j1596j0688
$$ y = [141445, 139073, 140074, 144524, 149745, 151730, 150769, 153842, 167335, 187090, 199731, 196069, 180415, 164373, 154611, 150700, 152020, 159124, 166718, 163081, 143153, 118605, 107511, 114693, 129063, 140289, 149458, 160164, 168061, 166956, 159615, 153538, 149165, 141944, 134902, 138073, 153175, 169214, 178314, 186578, 201475, 216086, 216807, 203336, 189734, 185365, 184673, 178476, 166824, 156103, 150220, 150367, 158357, 173204, 186971, 190764, 184635, 176632, 172579, 172205, 175315, 185099, 201966, 219010, 228909, 233678, 242733, 260559, 279494, 286748, 277544, 259584, 244067, 233658, 221939, 205447, 192486, 195051, 212956, 232279, 241956, 246099, 254855, 267604, 273011, 264964, 250648, 240477, 236463, 235123, 237315, 248182, 267312, 284678, 290082, 285170, 282725, 292827, 311303, 324063, 322333, 310737, 300049]
68369C00049l967K263P029R972P107l571j6401k3122k1163j3299k833O314Q642
68356B57020K441o135r928r561j0042j1624j1003r289j0593j3472j2004n577K87
68343A50520L315O301Q564M981l539p781l249K417J000l862k490P160J7962K2639
68329B03938J9161J0038P40l260j242L300R287J8986K9576L0380J4583j0428k9953
68316B95106l6017l0316j8304o425j130l086m381K234J3182J9009J7293J3972
68304B61137J3061J2093Q198K965j82kJ481j74q061j8292k1198j2222J235Q278
68290B48317O610J516k720l966N65R382J1786k037k5988m1688l7749j8697L487
68277A48818J7676J5619j385j6211r486J5529L3457K8267J2302N237O311J235
$$ y = [300049, 296082, 298345, 305374, 315346, 322453, 318882, 302481, 279359, 258196, 244897, 242064, 248378, 257020, 259461, 253326, 243398, 233837, 223795, 212171, 201168, 191879, 181286, 167814, 155810, 150233, 150520, 153835, 160136, 168700, 173681, 170142, 162361, 159112, 161529, 162529, 158667, 156177, 163337, 181299, 203938, 223099, 233137, 233877, 230617, 229375, 232675, 241962, 260948, 290524, 320904, 335487, 325059, 295106, 259089, 228773, 210469, 204044, 202914, 199828, 195447, 197681, 210863, 229872, 247165, 261137, 274198, 286291, 294489, 297454, 297272, 297270, 298751, 298577, 290516, 272224, 251026, 238804, 240039, 248317, 254927, 256443, 253723, 249757, 250322, 259704, 271490, 269453, 243465, 201777, 164028, 145331, 148818, 166494, 182113, 180728, 164517, 155031, 170560, 204017, 232284, 244586, 249823, 256134, 257369]
68265B57369j1303j7155r514J271M116J252K67J608J601J498M621P421K434q674
68251B36812j2722n96J8993K7650J8748M605J86N426Q902N076m9p5K909L222r55
68236C18132q923k0475l1609l1559j2747J6124L4062K8417Q007p323p794q76J803
68223B85239j42K416J2190J7709O899j4216k4533j2468R058J7642O916r852j8536
68210B78322j7434j1615m247J866K096l473o632j849L626l26r595j0135M57Q575
68196B29636O100L076R714J7308J0993n610j4860j1695q896j4040j7706j0691
68184A93329J237Q295J0389J0156L338j1548k2196j5073M921J9625J9924J1996
68172B34393L970j695l208J561R251J2803J0398N812Q97m581p534m999j322k316
$$ y = [257369, 246066, 228911, 219397, 220668, 224784, 226036, 226303, 227911, 229512, 231010, 235631, 243052, 245486, 236812, 224090, 223494, 242487, 270137, 288885, 293490, 293676, 299102, 308004, 313080, 313031, 312956, 315865, 319087, 318132, 309209, 288734, 257125, 225566, 212819, 228943, 263005, 291422, 299429, 292106, 284312, 283436, 285239, 285097, 287513, 299703, 317412, 324311, 310095, 285562, 273094, 282152, 299794, 306710, 296858, 278322, 260888, 249273, 245026, 246892, 248988, 245515, 238883, 237034, 240660, 240334, 230739, 220604, 221061, 229636, 235736, 238812, 248526, 265834, 276827, 271217, 256357, 244662, 235766, 221726, 204020, 193329, 194566, 202861, 213250, 223406, 226744, 215196, 193000, 177927, 182848, 202473, 222397, 234393, 238363, 236668, 233460, 235021, 244272, 257075, 267473, 273285, 274182, 269601, 262067, 257068, 255746, 253430]
68158B53430m433r04L590j483j2360j2685J156J2419Q421k224n867m026n796j0728
68144B18510j1823q339l781L278J5210K6603K9806K5816K0682J4697M501p070
68132C28090j2773j1354q108o292n020m328n755q612j0844j1834j0233k423J1504
68119B42018K3690K5891J8384P406k033o662l880M322J1318J3957J4281J0154
68107C58846m757k5356l2816j9370k796j469o637J752K0989L0049K3389J6323
68095C58147J6530J3552R15j2487j9522k4502k8863k5690j6265j3474j8995j5545
68083B13801N362K5245K3973R073K184P078R665L217m290n477j340N183J1797
68070C05471J4199J0354N393M300L523k274j0281j5073j8041k1433j9540p578
$$ y = [253430, 248997, 248093, 251683, 250200, 237840, 225155, 226311, 238730, 247151, 244927, 239060, 235034, 229238, 218510, 206687, 198348, 194567, 197845, 213055, 239658, 269464, 295280, 315962, 330659, 335160, 328090, 315317, 303963, 295855, 289563, 284543, 280215, 274460, 265848, 255004, 243170, 232937, 230514, 242018, 265708, 291599, 309983, 317389, 315356, 308694, 304814, 309136, 320454, 334411, 348692, 358846, 354089, 328733, 295917, 276547, 273751, 272282, 265645, 267397, 288386, 318435, 341824, 358147, 374677, 388229, 389144, 376657, 357135, 332633, 303770, 278080, 261815, 248341, 229346, 213801, 219163, 244408, 268381, 277454, 279638, 286716, 296381, 299598, 295308, 289831, 288491, 293674, 305471, 319670, 330024, 335417, 339717, 343240, 340966, 330685, 315612, 297571, 276138, 256598, 249020]
68058B49020O155R862N394K690K020k892p629q16J4598K1522J3721M407M565Q138
68044C30755O191J325j883q357k1755l1141k2665r13J4246J2212K833O65O297
68031B87810Q814K970l117K13R164J0305l12j0291q265l23K26o196p359j87M450
68016B87902K42m532j187O357R887R039P316L524m093j0510r085r79O981J0630
68002C11492R553L883m401j0621j2734j3552j3676q534J669O350k026j4187j4303
67989B38913j043J2441J8033K0328K3461K1895J0164o012j5313j3921p819m094
67977B97033m503p238j1147j5680j7726j2069J741J4968J7651J1321P339J0656
67965B92346J2887O117m334q722p777q782j1124p235L177J0822R839M138l83j678
$$ y = [249020, 255175, 265037, 270431, 273121, 275141, 272249, 264620, 263804, 278402, 299924, 313645, 318052, 322617, 330755, 336946, 338271, 336388, 328031, 306276, 275135, 252470, 251557, 265803, 278015, 280848, 281513, 287810, 296624, 299594, 296477, 296690, 305854, 316159, 315847, 305556, 297291, 296968, 297194, 290998, 283639, 283452, 287902, 288144, 283612, 282425, 288782, 298669, 307708, 315024, 318548, 314455, 303945, 294860, 293881, 300862, 311492, 321045, 324928, 320527, 309906, 297172, 283620, 269944, 261410, 263079, 269429, 267403, 253216, 238913, 237870, 250311, 268344, 288672, 312133, 334028, 344192, 338180, 322867, 308946, 301127, 297033, 292530, 285292, 274145, 258465, 240739, 228670, 230411, 245379, 263030, 274351, 281690, 292346, 305233, 311350, 307016, 298294, 290517, 281735, 270611, 263376, 266553, 277375, 287214, 291352, 290969, 289291]
67951B89291J042P116J0606N578l522o423l388n539j4990j7501k893J7671K5161
67938C02209J6123K301p237j2238j3076q254m24M461N377O628R153Q189J446n794
67924C08864o628q66M225Q04j0787j9459j3404M532J6679J0954l239o971M077
67911B88781J6659J9207J3193M285o357j6773j9376r793M295J0864Q116M868O960
67898C24929R336M056p512j4708j0437j193m38j1554k1986j7824q99J3803J5716
67885B81289P799p29l695M86R338J5941J4224P729P127J5290K0935J2770m472
67872C84032j4690r189M550J2120O332p132j5558j1758k166P36m564n045Q751
67859C46419K6991L1109J7240K35n584j270L056J996j528k111K245P689P150j256
$$ y = [289291, 290333, 297449, 308055, 313633, 310111, 303688, 300300, 294761, 279771, 262270, 259377, 277048, 302209, 318332, 320633, 313396, 301158, 288082, 279828, 279404, 283865, 289242, 295870, 305023, 313212, 314658, 308864, 302236, 301370, 305595, 306399, 295612, 276153, 262749, 267281, 283960, 294914, 291675, 284704, 288781, 305440, 324647, 337840, 342125, 335768, 318995, 299619, 289826, 294121, 304985, 313101, 317969, 324929, 334265, 338321, 330809, 316101, 305664, 304471, 304033, 292479, 270493, 252669, 251770, 265573, 281289, 289088, 288359, 284664, 285150, 294488, 310429, 324653, 332382, 339509, 354799, 375734, 388504, 384032, 369342, 360153, 364703, 376823, 383155, 376023, 360465, 348707, 346541, 347277, 342713, 337668, 346419, 373410, 404519, 421759, 421994, 416410, 415140, 418196, 420192, 418664, 416553, 418798, 426487, 433637, 432381]
67845D32381q625m015R656J5274J595k1767l5404l2208k1452j3047o470K829J3183
67832C31930J7920J3715L281q726j8508k2294j7297n937L419L408m232r523m275
67819B82881R364K0840K0999J0042k992p928j765R475J7064J7556J3838R389M705
67806D03468L48k32N274J2678J3987N951o733j7119k2600k5131k6850k6836k2010
67793B94195j1439K34N615K755j376J337J0170J6838J5857R371K037l529n170
67780C36895o81P900J3934J4043J2982J6262K0605J7140L456j2296k0214j8367
67768C91659j2817j0303j1848j2354o449M525J2458J0990K645m850p675p725o373
67755C41883j664O527J2826J1548M053k326k300K405O026M895K41l684l347J405
$$ y = [432381, 423756, 419741, 429397, 444671, 446266, 424499, 389095, 356887, 335435, 322388, 315918, 318747, 331930, 349850, 363565, 366846, 358120, 339612, 317318, 300021, 294084, 297503, 300911, 296679, 287156, 282881, 292245, 313085, 334084, 344126, 341134, 333206, 331441, 340916, 357980, 375536, 389374, 398763, 403468, 403816, 403584, 408858, 421536, 435523, 441474, 434741, 417622, 395022, 369891, 343041, 316205, 294195, 282756, 282990, 288605, 291360, 289984, 291321, 301491, 318329, 334186, 343557, 345594, 342065, 336895, 336214, 344114, 358048, 372091, 385073, 401335, 421940, 439080, 442536, 430240, 410026, 391659, 378842, 368539, 356691, 344337, 337888, 342413, 354871, 365861, 368506, 363656, 355981, 348256, 341883, 340219, 346746, 359572, 371120, 375173, 372847, 370547, 372952, 378978, 383873, 384114, 380430, 377083, 378488]
67741C78488O989Q360L186m958q866n525j519p301k4138l9290l7292j5635J2602
67728B65101L0468K9622J3656o120j7591j5014k720Q953J2498Q073R06l643k814
67715C21375K274O836O276J000m199o024n720n893p055q177p958m693K111R382
67701B99535J3368J5365J9674K4731K3436J6034J4350K5247L6285K9038M136j8691
67689E02508k5504k1325j6298j1384m433j6l419j0888j4659j3242r058r87J1440
67676C82735K0517J7748O881j074m787j2863k6306l3334k5978j0883J998J1201
67664C25855J7677J7550J0668P606J6163K6672K3445P210o714j0353r383p958
67652D18438k744M116J394j3562k5685k1276p125O49n97j328R10j509r913j3594
$$ y = [378488, 385477, 393837, 397023, 392065, 383199, 377674, 376155, 368854, 344716, 305426, 268134, 252499, 265101, 295569, 325191, 338847, 332727, 315136, 300122, 297402, 306355, 318853, 326926, 327832, 324189, 321375, 323649, 330485, 336761, 337761, 333562, 327538, 321818, 315925, 308870, 300693, 292735, 288042, 290153, 299535, 312903, 328268, 347942, 372673, 396109, 412143, 426493, 451740, 488025, 517063, 521199, 502508, 477004, 455679, 439381, 427997, 423564, 423548, 420129, 409241, 394582, 381340, 372282, 371295, 382735, 403252, 421000, 427881, 426807, 422020, 409157, 382851, 349517, 323539, 312656, 314654, 325855, 343532, 361082, 371750, 379356, 395519, 422191, 445636, 452846, 446132, 435779, 426396, 418438, 415694, 419810, 421204, 407642, 381957, 360681, 353556, 354205, 353608, 352280, 353190, 351681, 341768, 328174]
67638C28174m834J0074J9921K1559J8937J4969R547K179o764j4483j4357j761
67626C83161J6224K3805J4203j156o967k347K560L696P038J6337K6239K9220K2215
67613E34228N079j9588m1787m7004l0060k442J8690K5560K0792Q985n997j8584
67601D47872k3952k2974j9275j2158R69J4757J6626J791j7726k4767j5124Q59
67589C46898J2435J7782J8986J5099N102n977j0473q002o552j1078j5074q415
67577C50731Q105K1737K2335J3310N397L145J602m856j4372j9217j4115k490N825
67564C77137M527j703k519N041J2845J2606N536j984p062r459p405j479J571k270
67550C85382m715M557J9502K2501R358m058n421k564p079j3307p678Q153J8614
$$ y = [328174, 323340, 333414, 353335, 374894, 393831, 408800, 418347, 420526, 413762, 399279, 384922, 383161, 399385, 423190, 437393, 436237, 429270, 426923, 429483, 433179, 440217, 456554, 482793, 512013, 534228, 539307, 519719, 477932, 430928, 400868, 398426, 417116, 442676, 463468, 472453, 466456, 447872, 423920, 400946, 381671, 369513, 370482, 385239, 401865, 403656, 385930, 361163, 346039, 346898, 359333, 377115, 396101, 411200, 416302, 410325, 399852, 391850, 385298, 374220, 359146, 350731, 358836, 380573, 402908, 416218, 421615, 424760, 426362, 421506, 407134, 387917, 373802, 371312, 377137, 381664, 379961, 377442, 382483, 395328, 407934, 413470, 411486, 404424, 394965, 387560, 386081, 387652, 385382, 380667, 385224, 404726, 427227, 436585, 432527, 427106, 424542, 417463, 404156, 396478, 404631, 423245]
67537D23245J6172Q149J731m334j0146q776L413J8264K4098J8333P424j867p225
67524D88481r688j1472j3741j5202j4230j2096j1375j1462r201l844J753M481
67512C82404K620l863j0830j0861k144P120J0339J3665K4640L3890K4238r47j6308
67499D53963p929Q376J2226O415N199Q106M360m458o287n66N88n940q967k888
67485D62198L138J585j910o41J713P5j615K258R331J5020K0097K4287K0469N528
67471E61533r747j3021q032p907j4415j7239j3202j1940j8754k4260j7718j685
67459D03613J3495K2368K4377J8096M654p464j0535q190q605r214j71J5741K0174
67446D78339L726j7024j8438m3J6343J5703N566J000N409J1540J2988Q208j074
$$ y = [423245, 439417, 447566, 449297, 444963, 434817, 426041, 429454, 447718, 471816, 490149, 497573, 495706, 488481, 478793, 467321, 453580, 438378, 424148, 412052, 400677, 389215, 380014, 376170, 377923, 382404, 385024, 381161, 370331, 359470, 357326, 364446, 374785, 388450, 413090, 446980, 471218, 470271, 453963, 446034, 454410, 466636, 473051, 478250, 486356, 490716, 486258, 479971, 479405, 479993, 474053, 465086, 462198, 465336, 466921, 465011, 464370, 466083, 466158, 464543, 466801, 476132, 491152, 511249, 535536, 556005, 561533, 551786, 538765, 530733, 522826, 508411, 491172, 477970, 466030, 447276, 423016, 405298, 403613, 417108, 439476, 463853, 481949, 486603, 479139, 468604, 460414, 451809, 442595, 442424, 458165, 478339, 482065, 465041, 446603, 446560, 462903, 478606, 484172, 485172, 490581, 502121, 515109, 523317, 522243]
67433E22243r443j0461m755o14j813j238O758J4504J1284K82o086m991m790q581
67419E02299r507m779j237j866J130J2280K2141J9884Q619j428q340j6118k1648
67406E01430j6413p93J3497J6801J0246P79n807o559k774p04n321j2927j5272
67393D76183j0481l625K842J1021J9187K0688J4547Q802Q486Q156K476l325k316
67380E52641P05m013j3129j1614N202K1940K1792P081o712j1444j0608o332M636
67367E50145J8589K0851L735j8724k5547j5196n051n023n821J708R538N772m737
67354E30239p045J194P973O613K888Q65l543r003l012J9169L9640L6186J1371
67341F33535j0086j2656n876n505j0717q974K825J2967J0801m84j0741j6710k2246
$$ y = [522243, 512800, 502339, 497584, 496970, 495157, 493919, 500677, 515181, 526465, 526747, 520661, 515670, 510880, 502299, 492792, 488013, 486776, 484910, 486040, 498320, 520461, 540345, 548964, 547536, 539196, 523078, 501430, 485017, 484224, 497721, 514522, 524768, 525547, 519740, 513181, 510407, 509703, 504382, 491455, 476183, 465702, 462077, 464919, 475940, 495127, 515815, 530362, 539164, 547650, 555806, 558282, 554957, 552641, 553346, 549333, 536204, 524590, 529792, 551732, 573524, 580605, 573893, 562449, 551841, 545509, 550145, 568734, 589585, 593320, 574596, 549049, 533853, 528802, 523779, 517958, 519666, 529204, 534976, 530239, 523194, 524388, 532361, 538974, 541862, 542727, 539184, 530181, 527169, 546338, 585978, 622164, 633535, 623449, 610793, 604917, 599412, 588695, 579721, 582546, 595513, 606314, 605830, 595089, 578379, 556133]
67328E56133k6984k3532r416N125Q572L744L380J1022J6104J0681J644L04P017
67315E63794J3331J4170J0373L341m905r391p965o434r321r181L194J9564J9898
67302F00468M60j7854j6447k116O510N158L706O951J0506J3242J9176K5526K1823
67289F77109N311j2571k0116j8066j3725r681m152L088J0833J8293K2323J7530
67277F76176M299p927j1126q380p261q064o264k964l508p006o883k310M52K05
67263F09439M527J6390K5393K0129M542n828k259Q505J3706Q181k123p604n207
67250F87791j175k690q237j0495p934o439p334k660J1241K2575J6259n534k4127
67237F61241k5236j1806L728J2466J3060R193N812M624K838j484n419o465p641
$$ y = [556133, 529149, 505617, 496201, 501326, 509898, 513642, 517022, 528044, 544148, 554829, 556473, 556777, 563794, 577125, 591295, 601668, 605009, 600104, 590713, 582748, 576314, 566993, 557812, 561006, 580570, 600468, 600928, 583074, 566627, 564511, 571021, 576179, 579885, 586836, 597342, 610584, 629760, 655286, 677109, 682420, 669849, 649733, 631667, 617942, 608261, 604109, 607197, 618030, 636323, 658646, 676176, 680475, 672548, 661422, 653042, 645781, 637717, 631453, 628489, 624981, 617975, 611092, 608782, 609234, 609439, 613966, 630356, 655749, 675878, 680420, 674592, 672333, 680838, 694544, 702725, 700602, 692998, 687791, 686616, 683926, 675689, 665194, 657260, 650821, 643487, 640827, 652068, 674643, 690902, 685368, 661241, 636005, 624199, 627927, 640393, 653453, 662646, 668458, 673082, 675920, 674436, 669017, 662552, 654911]
67224F54911j0986j0900l208L565j246j0785o981J2001K6930K4813J4557P670
67212G00341M34j2305k1026j6023o548o970j2208o443R425J9657J9849J9682K0163
67199G08028J1272m114p818L577Q967l787j5266l733J9596K6486J2369k261n965
67186G47351q341j6618k1693j4614j385P117R003P574K812n500j2446j2979q393
67173F71888l196M61J684o32l798r29R985K0573K1579J4988J0457J1393J1504
67160G65957N815j186j617N602J4257J8441J6759R883j368j3701k0618j7976r268
67147G70980k328j235m269q333j0822p907K732J5811K1145J5498O418J435j12
67134G99013n24K967J0889J4515O622n080o728J517N963K90o308m961K93J188
$$ y = [654911, 643925, 633025, 629817, 633382, 632136, 621351, 614370, 626371, 653301, 678114, 692671, 700341, 700775, 688470, 667444, 651421, 644873, 637903, 625695, 619252, 628677, 648334, 668183, 687865, 708028, 719300, 715186, 707368, 710945, 719912, 716125, 700859, 697126, 716722, 743208, 755577, 753316, 747351, 739010, 722392, 700699, 686085, 684700, 691817, 700820, 708394, 711206, 705706, 693260, 680281, 671888, 668692, 669153, 670837, 670205, 666407, 665478, 675463, 696036, 717615, 732603, 743060, 754453, 765957, 771772, 770586, 768969, 774571, 788828, 807269, 824028, 833911, 832543, 818842, 798224, 780248, 770980, 768652, 767417, 763148, 754815, 743993, 736086, 738818, 754629, 775774, 791272, 797690, 799125, 799013, 798489, 801456, 812345, 826860, 833482, 828402, 821674, 823191, 829154, 829444, 823136, 818175, 818468, 819656]
67120H19656k558o173q279j0180j1616j2205j2791j1736n212N298J2222J2947
67108G69373J4487K1168K4910J6505J292o699m099j765q182j7618j7963n399J1623
67095G97633K0570J5470J031j2735j9305j8087j0320K081J3112J5147Q360J852
67083H14809J335J920j990o389m148M055J2796K0046K3838J7439o12j6307j3888
67070H52904J543Q806j142j4966j7275p806O073K0669L1985L1539J6479k750j3605
67057I12454j5257j4166j1624m315O237J2907J0694N91j1642j7090r220O860J5945
67044H82374R917j752n804l301l784o449q32J3950K4175J9750O579m492j1507
67031I18824j7034j7980r255N926J7867K1229J7685R298l345j5698j8979r261
$$ y = [819656, 817098, 810925, 802646, 792466, 780850, 768645, 755854, 744118, 738906, 744204, 756426, 769373, 783860, 805028, 829938, 846443, 847735, 841036, 836937, 835172, 826990, 809372, 791409, 786010, 797633, 818203, 833673, 834704, 821969, 802664, 784577, 774257, 776338, 789450, 804597, 812957, 814809, 816144, 818064, 816074, 809685, 805537, 809592, 822388, 842434, 866272, 883711, 883099, 866792, 852904, 854447, 863253, 862111, 847145, 829870, 822064, 828137, 848806, 880791, 912330, 928809, 926059, 912454, 897197, 883031, 871407, 867092, 873329, 886236, 896930, 897521, 885879, 868789, 859569, 866429, 882374, 892291, 890539, 884735, 881434, 877650, 871201, 870369, 884319, 908494, 928244, 934823, 930331, 918824, 901790, 883810, 874555, 880481, 898348, 919577, 937262, 946560, 943215, 927517, 908538, 899277]
67019H99277O517J6882J6615R582K773l52j490m387j0063j4799j3918p696j432
67006H97509J246K323M897P932R308J1182J6615K2118K0717J3554J0783J7024
66994A035208K3026J8115N315l845n562n225m595J129J1349J5827Q116m319r986
66981A084553p831n173n554o267n355l317J321J0187J7592J2697o382k5548k7859
66968A033064j2389M956J0218O601P707J7983K5766J8346J8j0630j910J7208K6827
66955A143765J6724n192k2374k4033j1446N779J7697K0020J4595N591l970j2495
66943A144661j8518k0345j6748p994L273J2657J7133J7807J8492K1283K4405K4284
66931A220390J8692Q166m131j3754j7354j4338o960p3K82p818j7135j6266k730
$$ y = [899277, 905794, 922676, 939291, 948873, 951646, 951294, 949804, 945417, 935354, 920555, 906637, 898941, 897509, 898755, 901078, 905975, 913907, 923215, 934397, 951012, 973130, 993847, 1007401, 1018184, 1035208, 1058234, 1076349, 1081664, 1077819, 1072257, 1067032, 1062437, 1063566, 1074915, 1090742, 1098858, 1094539, 1084553, 1076722, 1071549, 1065995, 1059728, 1054373, 1051056, 1052377, 1062564, 1080156, 1092853, 1086471, 1060923, 1033064, 1020675, 1025631, 1035849, 1042450, 1050157, 1068140, 1093906, 1112252, 1112270, 1101640, 1099730, 1116938, 1143765, 1160489, 1155297, 1132923, 1108890, 1097444, 1103223, 1120920, 1140940, 1155535, 1161126, 1157156, 1144661, 1126143, 1105798, 1089050, 1081056, 1084329, 1096986, 1114119, 1131926, 1150418, 1171701, 1196106, 1220390, 1239082, 1247248, 1243117, 1229363, 1212009, 1197671, 1190711, 1190638, 1190920, 1183102, 1165967, 1149701, 1146971]
66918A146971J3180K0895K0724J8017J3073N182P69O107J5088J6432J1547J1799
66906A299784J8064J8203P848k223n366r529j8994k1240o192J3439J7709P589
66894A319092J230O820J5372J8342J6581J1229K37j2845j8219j1991r03P072R457
66881A361474O105k101r966j0978n105K338Q922J5430J9549J7666J1774O227p20
66868A420615j2402k2612k0282n209J1954K4944L4890L8408K8014P782o008n607
66856A494487n42j46m15M705J1618J5077J6555J6479R921q33j736J3104K7891
66843A606165K4890Q748k922n321p265j1613j1262l157P799J8270K7411K9308
66831A681051J7707l86p724L529K3501L7119L6926K3789M491j0207j3534j0068
$$ y = [1146971, 1160151, 1181046, 1201770, 1219787, 1232860, 1238042, 1238811, 1244918, 1260006, 1276438, 1287985, 1299784, 1317848, 1336051, 1343899, 1341676, 1336310, 1326781, 1307787, 1286547, 1280355, 1293794, 1311503, 1319092, 1320322, 1327142, 1342514, 1360856, 1377437, 1388666, 1388903, 1376058, 1357839, 1345848, 1344945, 1352017, 1361474, 1367579, 1365478, 1355512, 1344534, 1339429, 1341767, 1350689, 1366119, 1385668, 1403334, 1415108, 1421335, 1420615, 1408213, 1385601, 1365319, 1360110, 1372064, 1397008, 1431898, 1470306, 1498320, 1506102, 1500094, 1494487, 1493945, 1493799, 1493384, 1498089, 1509707, 1524784, 1541339, 1557818, 1567739, 1566906, 1565170, 1578274, 1606165, 1631055, 1639803, 1636881, 1631560, 1624295, 1612682, 1601420, 1598263, 1606062, 1624332, 1651743, 1681051, 1698758, 1698372, 1690648, 1694177, 1717678, 1754797, 1791723, 1815512, 1820003, 1809796, 1796262, 1786194]
66819A786194q340p549p20J0310J4885R964N137P426J1161Q301J052j707M324
66806A840438J4952K1431J7573O973J270M964N971p757k5281k2304M332K8847
66794A891409L0210J7829J3051J9398K5730K8137L1033L1672K1298K169j0843
66783B101093q577K681J2110J5872J5239J1237N285M67m36L956J3168K1753K0296
66770B214144O872n118k29J7985K9241K1833N871k639j293J572J473R40K382N864
66756B298898J2127K0782K6172K1253O827p130j0895l943N680R108L812n168j0141
66743B367382o640M828J9910L0747K8895J4263k24r29R036J3871Q897Q627K4155
66730B522818M3803M8208L6517K3551J6448J0539O122J0995K3238K8800K2990
$$ y = [1786194, 1777854, 1770305, 1769585, 1779895, 1794780, 1804744, 1809881, 1817307, 1828468, 1836769, 1837821, 1836114, 1840438, 1855390, 1876821, 1894394, 1901367, 1902637, 1907601, 1913572, 1905815, 1880534, 1858230, 1862562, 1891409, 1921619, 1939448, 1952499, 1971897, 1997627, 2025764, 2056797, 2088469, 2109767, 2111936, 2101093, 2092516, 2095197, 2107307, 2123179, 2138418, 2149655, 2154940, 2155407, 2154971, 2158927, 2172095, 2193848, 2214144, 2221016, 2215898, 2215669, 2233654, 2262895, 2284728, 2290599, 2287960, 2286667, 2288239, 2289712, 2290652, 2293034, 2298898, 2311025, 2331807, 2357979, 2379232, 2386059, 2378929, 2368034, 2364091, 2369771, 2378879, 2382691, 2377523, 2367382, 2360742, 2365570, 2385480, 2416227, 2445122, 2459385, 2459161, 2458232, 2467268, 2481139, 2490036, 2498663, 2522818, 2566621, 2614829, 2651346, 2674897, 2691345, 2701884, 2708006, 2719001, 2742239, 2771039, 2794029]
66719B794029J9129K6812L5807L3344K5137K4697L0719L1110K4209K0096K3101
66708C088190K7547L0018L2046L0862K2103J3260J9439M0981N8389N5718L8183
66697C456736K0852J1139J0003J9240L6687N1097N2410M3635L5403L2861L4435
66686C804498L8180M1734M0404L3560L0016L9478O0290Q1062R1710Q8209P1484
66675D420625M8704L1827K7639L1730L7265M4093N2581N6242N1710M9967O3140
66664D915523Q2712Q6524O9012M9403M4879M8983M4654K8607J3213J0318K1471
66653E415299M0064N5932O0577N4065M5651M4150M9565N6269O0495O1268N8151
66642F001486N2991N1268N6701O5629P0643O9379O6719O8468P4720P9526P7009
$$ y = [2794029, 2813158, 2839970, 2875777, 2909121, 2934258, 2958955, 2989674, 3020784, 3044993, 3065089, 3088190, 3115737, 3145755, 3177801, 3208663, 3230766, 3244026, 3263465, 3304446, 3362835, 3418553, 3456736, 3477588, 3488727, 3498730, 3517970, 3554657, 3605754, 3658164, 3701799, 3737202, 3770063, 3804498, 3842678, 3884412, 3924816, 3958376, 3988392, 4027870, 4088160, 4169222, 4260932, 4349141, 4420625, 4469329, 4501156, 4528795, 4560525, 4597790, 4641883, 4694464, 4750706, 4802416, 4852383, 4915523, 4998235, 5084759, 5153771, 5203174, 5248053, 5297036, 5341690, 5370297, 5383510, 5393828, 5415299, 5455363, 5511295, 5571872, 5625937, 5671588, 5715738, 5765303, 5821572, 5882067, 5943335, 6001486, 6054477, 6105745, 6162446, 6228075, 6298718, 6368097, 6434816, 6503284, 6578004, 6657530, 6734539]
66631F734539O8735O4325P1798Q7209R7622R5569Q6747Q1483Q2582Q5354Q7108
66620G643071R1864J04514J22484J35526J35430J25663J18872J23597J36724J51372
66610H889117J67022J85801K03069K11323K13119K20182K36512K50821K51042
66601A0828008K40920K36873K51357K82592L17589L42896L55810L67066L89173
66592A3612284M21642M53004M77851N04041N39806N81744O21603O58756O98655
66583A8569386P43039P89110Q37084Q93159R65024J056632J165048J280886J395885
66574B7695253J512245J640031J783965J939706K105839K289890K495702K713449
66566D4176080K931741L153620L390649L646148L914699M194253M487657M795367
$$ y = [6734539, 6803274, 6867599, 6939397, 7026606, 7124228, 7219797, 7306544, 7388027, 7470609, 7555963, 7643071, 7734935, 7839449, 7961933, 8097459, 8232889, 8358552, 8477424, 8601021, 8737745, 8889117, 9056139, 9241940, 9445009, 9656332, 9869451, 10089633, 10326145, 10576966, 10828008, 11068928, 11305801, 11557158, 11839750, 12157339, 12500235, 12856045, 13223111, 13612284, 14033926, 14486930, 14964781, 15468822, 16008628, 16590372, 17211975, 17870731, 18569386, 19312425, 20101535, 20938619, 21831778, 22796802, 23853434, 25018482, 26299368, 27695253, 29207498, 30847529, 32631494, 34571200, 36677039, 38966929, 41462631, 44176080, 47107821, 50261441, 53652090, 57298238, 61212937, 65407190, 69894847, 74690214]
66558G4690214N119203N471500N866303O299204O748326P198886P655325Q125137
66550A27174098Q603454R082239R564993J0061532J0573736J1096395J1628472
66543A97784919J2172327J2720129J3247496J3721758J4111551J4387971J4523422
66536B92669573J4496328J4299275J3942312J3447355J2836468J2121041J1297643
66529C85109995J0350293R255635P990082O539914M910841L131324J250011o68431
66521D27869664k550643m329825n962997p435794q751676r920217j0955633j1877036
66513C66085843j2698072j3412393j3993246j4410871j4650586j4716139j4622570
66506B67581966j4391700j4051883j3633718j3161594j2652114j2122132j1592284
$$ y = [74690214, 79809417, 85280917, 91147220, 97446424, 104194750, 111393636, 119048961, 127174098, 135777552, 144859791, 154424784, 164486316, 175060052, 186156447, 197784919, 209957246, 222677375, 235924871, 249646629, 263758180, 278146151, 292669573, 307165901, 321465176, 335407488, 348854843, 361691311, 373812352, 385109995, 395460288, 404715923, 412706005, 419245919, 424156760, 427288084, 428538095, 427869664, 425319021, 420989196, 415026199, 407590405, 398838729, 388918512, 377962879, 366085843, 353387771, 339975378, 325982132, 311571261, 296920675, 282204536, 267581966, 253190266, 239138383, 225504665, 212343071, 199690957, 187568825, 175976541]
66499A75976541j1076596j0572268j0067553r559016r054224q558928q071645
66492A09016311p592946p130034o687703o264475n864109n500676n181303m890324
66484E9904741m602438m308520m018494l742655l482362l237662l010879k800221
66476C0701510k599986k409314k231730k065024j902069j743616j599059j470632
66468A4680080j348545j227926j119803j036385r73059r13931q49657p81835p14921
66459E714018o52472n98120n52471n10829m69367m30528l97071l64932l28998
66450A409230k92986k66450k53053k46988A10872a10168j91305j58181j38322
66441e97976j40127j51426j51065j31905j05495q5848p7225p7325q2303q5644
$$ y = [175976541, 164899945, 154327677, 144260124, 134701108, 125646884, 117087956, 109016311, 101423365, 94293331, 87605628, 81341153, 75477044, 69976368, 64795065, 59904741, 55302303, 50993783, 46975289, 43232634, 39750272, 36512610, 33501731, 30701510, 28101524, 25692210, 23460480, 21395456, 19493387, 17749771, 16150712, 14680080, 13331535, 12103609, 10983806, 9947421, 8974362, 8060431, 7210774, 6428939, 5714018, 5061546, 4463426, 3910955, 3400126, 2930759, 2500231, 2103160, 1738228, 1409230, 1116244, 849794, 596741, 349753, 110872, -110168, -301473, -459654, -597976, -738103, -889529, -1040594, -1172499, -1277994, -1363842, -1441067, -1518392, -1600695, -1686339]
66431a686339q0139o5724n0612m1735l8401l7111l6960l7095l4044k5993j6482
66420b150635j0322q392r347j3418k0739k7492k7595j8681m971N976R316O426
66408b269874K176j652p887j6648k0140j1115M529J1434L420q333r823j178O376
66395b318715N784j05n085m911K277J3504J9193J1452m133j2221o373L145N319
66382b290869M720J2598K5860K7644J1158p906r602O529K3777K9860K7391K4217
66370b114623K2113J7151N952j0248k4454k7600j7946n066J922P765K2581M0671
66358b081782M2100K0988j636m213P098J0726K364k331M686J2433J1264Q380J3902
66345a956021K2829K2181J0305j264l420Q99L185M37k148J454R244J2202O226
$$ y = [-1686339, -1766478, -1832202, -1882814, -1924549, -1962950, -2000061, -2037021, -2074116, -2108160, -2134153, -2150635, -2160957, -2169349, -2178696, -2192114, -2212853, -2240345, -2267940, -2286621, -2291592, -2285616, -2276300, -2269874, -2267698, -2269350, -2277237, -2293885, -2314025, -2325140, -2320611, -2309177, -2305757, -2314090, -2323913, -2325091, -2318715, -2312931, -2313036, -2318121, -2323032, -2320755, -2307251, -2288058, -2276606, -2280739, -2292960, -2299333, -2296188, -2290869, -2286149, -2273551, -2247691, -2220047, -2208889, -2216795, -2226397, -2219868, -2196091, -2166231, -2138840, -2114623, -2092510, -2075359, -2069407, -2079655, -2104109, -2131709, -2149655, -2154721, -2152799, -2145034, -2122453, -2081782, -2039682, -2018694, -2020330, -2024543, -2017445, -2006719, -2004355, -2006686, -2002000, -1989567, -1978303, -1969923, -1956021, -1933192, -1911011, -1900706, -1901970, -1905390, -1904491, -1901306, -1900869, -1903017, -1901563, -1892319, -1880117, -1873891]
66332a873891p52R14Q639J2611J2455J6705K4427K1600K499j7940k3090j5698
66320a831521q392k229J0508K7435L6404L3945K8763K5505J9169Q831K898M088
66308a644596J368j3657l1101l4114k0696m176N249R959J6021K3103K5842K0851
66296a645947R923j718r403j2040j0949o174L031J3140J6575J0871M008N026J1562
66283a612095J2989N759j044K228J3388K2036K2406J8114J5215J5046J5134J4138
66271a456686J3022J2128R673M162k983q213q568l284N660J3477J5082J0031L697
66258a392802J051P91j098l742k549K439N460L719J205J322K007K027N154J1595
66244a363421J1576k616k1336k5509j0660P059J1645M719k321m747n290m609m77
$$ y = [-1873891, -1874643, -1873729, -1865090, -1852479, -1840024, -1823319, -1798892, -1777292, -1774793, -1792733, -1815823, -1831521, -1839913, -1842142, -1831634, -1804199, -1767795, -1733850, -1705087, -1679582, -1660413, -1651582, -1648684, -1644596, -1643228, -1656885, -1687986, -1722100, -1742796, -1746972, -1741723, -1731764, -1715743, -1692640, -1666798, -1645947, -1636024, -1637742, -1647145, -1659185, -1670134, -1676308, -1673277, -1660137, -1643562, -1632691, -1628683, -1623657, -1612095, -1599106, -1593347, -1594391, -1592163, -1578775, -1556739, -1534333, -1516219, -1501004, -1485958, -1470824, -1456686, -1443664, -1431536, -1421863, -1417701, -1420684, -1428897, -1437465, -1440749, -1435089, -1421612, -1406530, -1396499, -1392802, -1391751, -1390960, -1392058, -1395800, -1398349, -1395910, -1390450, -1386731, -1385526, -1384204, -1382197, -1380170, -1375016, -1363421, -1351845, -1354461, -1375797, -1401306, -1411966, -1404907, -1393262, -1388543, -1390864, -1395611, -1400901, -1405510, -1405987]
66231a405987N700R834J2188J6353K0809J8715Q405k119m699n22L486L919K414
66218a311504J026Q81L546Q567J0578M128q249j7783k0163j9208j7934j2276J305
66205a377086J6401K1745J4511K799m754o196l106L129R591J1699Q479M597M376
66192a293815P099J0657J5628K1923K5360K2532J6319J1350O563j447r133p625
66180a174589M723J7443J8632O841r589k1212k3096j5808m786K833M064K484L363
66167a188697P259R784O819j442j0596j4648r366M679K0878K9210K3107O488p214
66154a123739p119L089R464N498j18K893J1589J6132J6108J9919K8997L3444K5809
66141i58034J0418m300j4760j9888j7956j0991n614m094o32Q210J5643J3494L314
$$ y = [-1405987, -1400287, -1390453, -1378265, -1361912, -1341103, -1322388, -1313983, -1316102, -1320801, -1321323, -1317837, -1313918, -1311504, -1310478, -1309597, -1306051, -1297484, -1286906, -1282778, -1291027, -1308810, -1328973, -1348181, -1366115, -1378391, -1377086, -1360685, -1338940, -1324429, -1321630, -1326384, -1332580, -1335686, -1332557, -1322966, -1311267, -1302788, -1298191, -1293815, -1286716, -1276059, -1260431, -1238508, -1213148, -1190616, -1174297, -1162947, -1156384, -1157831, -1166964, -1174589, -1169866, -1152423, -1133791, -1126950, -1136539, -1157751, -1180847, -1196655, -1201441, -1198608, -1194544, -1192060, -1188697, -1181438, -1171654, -1164835, -1166277, -1176873, -1191521, -1200887, -1196208, -1175330, -1146120, -1123013, -1116525, -1123739, -1130858, -1127769, -1118305, -1112807, -1112925, -1110032, -1098443, -1082311, -1066203, -1046284, -1017287, -983843, -958034, -947616, -951916, -966676, -986564, -1004520, -1015511, -1021125, -1025219, -1025851, -1017641, -1001998, -988504, -985190]
66128i85190p652j6020k0858j8782r180L89L219L866R794J6700J4293M681J456
66115a003284Q876J4933R399k615j1099j4743j6110j1639K853K0272K5686J2740
66103i64731q520k1081j5778J924J7094J8329P967j081O17J0055J7434J7638J3998
66090i06135J2441J3817J2098J387j4273k1889j5073m802o036j5447j4069N332
66078i52649K5851K8347J5515M186J557J437j64M42M102M638j147p974j0850j2388
66064h99097j6247j8685j2901L12J1657J3363O915K9j725J441P120J4439K1727
66051h71652K2776J1209r561k5313k4287r569N107J0183P697N674Q996J5627J9274
66038h33839J6019R029M731L855P82o215j0478p686m598q704j4059q614N859J3484
$$ y = [-985190, -992842, -1008862, -1029720, -1048502, -1057682, -1057293, -1054074, -1050208, -1040414, -1023714, -1009421, -1004740, -1003284, -994408, -979475, -970076, -972691, -983790, -998533, -1014643, -1026282, -1023429, -1003157, -977471, -964731, -973251, -994332, -1010110, -1008186, -991092, -972763, -964796, -965877, -965260, -955205, -937771, -920133, -906135, -893694, -879877, -867779, -866392, -880665, -902554, -917627, -922429, -928465, -943912, -957981, -952649, -926798, -898451, -882936, -878750, -877193, -875756, -875920, -875478, -871376, -866738, -867885, -875859, -886709, -899097, -915344, -934029, -946930, -946618, -934961, -921598, -914683, -914654, -916379, -914938, -907818, -893379, -871652, -848876, -837667, -847228, -872541, -896828, -906397, -901290, -891107, -883410, -877736, -868740, -853113, -833839, -817820, -808791, -804060, -800205, -799423, -805638, -816116, -823802, -828400, -837104, -851163, -859777, -853918, -840434]
66024h40434O236n068p017j409P56l446o430k257O068J1285R600M045K332R323
66010h16416J9463J9907M731j6325k6679j8626J448J9966K5342J5140o15o296
65998g78960L701J8054K1809J3426K735m559j1251j8070j8800r738K919J0154
65986g68580J0238P842O393N415L507Q72l17K596Q726J1210L337j1785k2442k1560
65972g64548j3939p651l946l0L718N676P793J1143R944j555j7451k4101j6415
65959h11362k795P260J2727J6061J6629J3756J0546R820J0171R522Q427O582J161
65946f91495p073j1166o907j23J134j819j376L943P252L047o502j4814j5786o795
65932g48480P765J7090J4441O608O456J5776K2358J5470k226k0250l1034l1775
$$ y = [-840434, -834198, -839266, -846283, -847692, -846936, -850382, -856812, -859069, -853001, -841716, -832116, -828071, -825739, -816416, -796953, -777046, -772315, -788640, -815319, -833945, -832497, -812531, -787189, -772049, -772664, -778960, -775259, -757205, -735396, -721970, -719235, -723794, -735045, -753115, -771915, -781653, -778734, -768580, -758342, -750500, -744107, -738692, -735185, -734313, -734630, -732034, -723308, -712098, -708761, -720546, -742988, -764548, -778487, -786138, -790084, -790114, -786396, -780720, -772927, -761784, -751840, -753395, -770846, -794947, -811362, -814157, -806897, -794170, -778109, -761480, -747724, -737178, -727358, -717187, -707665, -699238, -692656, -691495, -698568, -709734, -716641, -716764, -715630, -717449, -718825, -714882, -707630, -704583, -711085, -725899, -741685, -748480, -740715, -723625, -709184, -702576, -696120, -680344, -657986, -642516, -644742, -664992, -696026, -727801]
65920g27801k2154o177P169J1028P933O447J0936J7241J8355J2559M979J406J801
65907f56278J794l05k380n329j4255k7918l3762k2068p51J3958J8265K0655K3348
65894f85026J8938P272l44L29j177j0460j5449n478R271J2618O960N699Q062J460
65880f47325j2920j7427m748J0298J2743O348J902k08m270n756K716J6247K0678
65867f21722J0400n617j5587j5406p476L285J0376R297L789L706J2711K1960K0986
65854e69298J1714M773K902k549j4939k1770j0676R200J5058L61j5835j4375L34
65841f05100J0196P831J98o355j2094j6200j4148m977N832J2206J1753N471j341
65828f06728l45J0218J8844J2259o737k1443k1431j1887j968O201J3722J8909
$$ y = [-727801, -749955, -756132, -748963, -737935, -730002, -723555, -712619, -695378, -677023, -664464, -659485, -658079, -656278, -654484, -654789, -657169, -662498, -676753, -704671, -738433, -760501, -761252, -747294, -729029, -708374, -685026, -666088, -658816, -659160, -658831, -660008, -670468, -685917, -691395, -682124, -669506, -662546, -656847, -648785, -647325, -660245, -677672, -682420, -672122, -659379, -653031, -651129, -651337, -655607, -661363, -658647, -642400, -621722, -611322, -616939, -632526, -647932, -655408, -652123, -641747, -632450, -628661, -624955, -612244, -590284, -569298, -557584, -552811, -549909, -552458, -567397, -589167, -599843, -590643, -575585, -575224, -591059, -605434, -605100, -594904, -587073, -586875, -593230, -605324, -621524, -635672, -640649, -634817, -622611, -610858, -605387, -606728, -607073, -596855, -578011, -565752, -572489, -593932, -615363, -627250, -629218, -623017, -609295, -590386]
65816e90386K0035J8136J3299L730q371j5894j5266j0787p699n799k109N060J5761
65803e80290K6008K5327N605k4935m5733m5943l3541j8501R74K6205M3163L5242
65791e86419P886j3140r971R554K3915K0478M011j1424j5308p646M161J3561J8027
65778e42315J5810N972o417j1959q455n013q908j3939r450L009J0656N973n000
65765e70036j1066p290J790O376O7j1995j6066n072J2115K1352J9107J1292R89
65752e48437j2936k6360k9285j7391K233J8749K6152K4244J7149J1359R546O146
65740e18831n092j9605k5544j9379j0075n794m525j022N088J2580K2167L0568
65728e39464K8267J1690p093j2048k436Q289J1734J2767J6581J7801R394l948
$$ y = [-590386, -570351, -552215, -538916, -535186, -543557, -559451, -574717, -585504, -593203, -599002, -601111, -596051, -580290, -554282, -528955, -523350, -548285, -594018, -639961, -673502, -692003, -691029, -664824, -621661, -586419, -578533, -591673, -601644, -592090, -568175, -547697, -543686, -555110, -570418, -578064, -573903, -560342, -542315, -526505, -520533, -526950, -538909, -547364, -552377, -561285, -575224, -584674, -581665, -571009, -565036, -570036, -581102, -588392, -586602, -580226, -580159, -592154, -608220, -613292, -601177, -579825, -560718, -549426, -548437, -561373, -587733, -617018, -634409, -632176, -613427, -587275, -563031, -545882, -534523, -524977, -518831, -523923, -543528, -569072, -588451, -598526, -604320, -608845, -609867, -604779, -592199, -570032, -539464, -511197, -499507, -506600, -518648, -521084, -512795, -501061, -488294, -471713, -453912, -444518, -448466]
65716d48466j0113n492J181J567k446l836K96Q007J6001J9269J1538p283k5878
65703d45655l0053j6682M689K2044K7524J7555m177k3959k8084j7989p324k454
65691e04565L656J4921K1797J5427K206n711o809o977o411r87P694J4240J8091
65678d33428K0593J7781P034l226l041K696R27p878r709j05P735K727r145j5955
65664d22994j5340j2173r541q571j0039j0587m138P990J4921R076m642j5886j8716
65651e00640j2061J137J1837J1289L788L133J1575J4178J736j3112j3844l257
65639d84241N163R722J7325K3433J4861o640k1378j7383m970O63j048k320k607
65626d69420o585j2021j0942k222N509N211q3k294J971R217J4152J4239J0241
$$ y = [-448466, -458579, -464071, -462890, -461323, -463769, -467605, -467309, -459302, -443301, -424032, -412494, -419777, -445655, -475708, -492390, -487701, -465657, -438133, -420578, -424755, -448714, -476798, -494787, -502111, -504565, -500909, -485988, -464191, -448764, -446558, -452269, -459078, -466055, -472466, -473453, -465759, -451519, -433428, -412835, -395054, -388020, -391246, -394287, -391591, -390664, -398542, -408251, -408356, -400621, -397894, -407039, -422994, -438334, -450507, -460048, -468619, -478658, -489245, -493383, -485393, -470472, -461396, -466038, -481924, -500640, -512701, -511564, -499727, -488438, -484650, -481517, -469942, -455764, -454028, -467140, -480984, -484241, -479078, -469356, -452031, -428598, -413737, -420377, -441755, -459138, -464108, -463445, -464493, -466813, -469420, -476005, -488026, -498968, -501190, -495681, -490470, -490553, -492847, -490876, -481659, -467507, -453268, -443027]
65613d43027M915J427R56J006k008p539j0641q622n012l880l385Q0M077L111j795
65598d70337m260l427n101j0135j1067m542J775J074j670J724R430J3485J1951
65585d71100Q510M045j895m162L036J4883J9412J3332N999N626R032Q343K193
65572c82746l628m041q77j615j0620k0677j7971L52J8876K0944Q370m209j0265
65559d08107j5095k0643k0249j1225p20N550J0537J6931K0526J8574J6305J8081
65547c69535J8816J1598j281j1286j3220p134L316R229L99k1326l8431l5906j8604
65534d73365k956L052K621j252p461r958k534R224J2749O605K181M996O816J199
65520d48083n226m582m12R69L141J2094K1707J9564O028l921L02J2482J8762J2956
$$ y = [-443027, -438112, -436685, -435729, -434723, -436731, -444270, -454911, -463533, -468545, -472425, -475810, -475730, -471653, -468542, -470337, -474597, -478024, -483125, -493260, -504327, -508869, -507094, -506020, -507690, -505966, -496536, -483051, -471100, -462590, -458545, -460440, -464602, -461566, -446683, -427271, -413939, -407940, -402314, -393282, -384939, -382746, -386374, -390415, -391292, -392907, -403527, -424204, -442175, -441823, -422947, -402003, -393633, -397842, -408107, -423202, -443845, -464094, -475319, -476039, -470489, -459952, -443021, -422495, -403921, -387616, -369535, -350719, -339121, -340402, -351688, -364908, -372042, -368726, -359497, -359098, -380424, -418855, -454761, -473365, -476321, -473269, -470648, -471900, -479361, -489319, -491853, -482629, -469880, -463275, -461094, -456098, -449282, -448083, -453309, -457891, -458303, -457334, -454193, -442099, -420392, -400828, -394800, -398721, -398419, -385937, -367175, -354219]
65506c54219M47q473p441J58L877j564q021l723R191J4554K027j9401l1483k6047
65492d30118j1224k160p373k0515k4495q902J5756K7971K1060J0044Q778J1533
65480d09645O571j780Q71J5041K4467J7928J333j4196k4419k7948k1575p184M409
65467d36127M661k069n360k366J302J637J392N751J6160K7838L2070K3365N727
65454c26019j0663j9433k1491j8971j1527K2J1789K0389K3475J6935p91k0710
65442c56995k9292k5185j9905j8684j3388o35P942M899K704J4150K8021K4140
65430c82228N942m012R31M008m354j1073m627M621J716r416j4486j1050p700p130
65416d38858l937L021P574N790O54k780j484M876J2419J4242P785j049m939l286
$$ y = [-354219, -353772, -362245, -369686, -369528, -365651, -367215, -375236, -378959, -369768, -355214, -353187, -372588, -404071, -430118, -441342, -443502, -450875, -471390, -495885, -504787, -489031, -461060, -440000, -429956, -421178, -409645, -403074, -404854, -403983, -388942, -364475, -346547, -345214, -359410, -383829, -411777, -433352, -440536, -436127, -431466, -433535, -438895, -441261, -439959, -438322, -436930, -431179, -415019, -387181, -355111, -331746, -326019, -336682, -356115, -377606, -396577, -408104, -408082, -396293, -375904, -352429, -335494, -336285, -356995, -386287, -411472, -431377, -450061, -463449, -464084, -456142, -451243, -448539, -434389, -406368, -382228, -376286, -380298, -379367, -375359, -379713, -390786, -395413, -390792, -389076, -398492, -412978, -424028, -431728, -438858, -442795, -439774, -432200, -426410, -425756, -428536, -430020, -425144, -412725, -398483, -390698, -391747, -396686, -399972]
65402c99972K60L768N803L082m235q796m625L442N939K174J77M285R610R150J366
65387c68572r012j3858p137P921J9384J9283J2619Q056M220n335j6307j5141J189
65374c62690J7602J8703P082j990N41R223J1845J624j6318k8243k3839o523J0714
65361c62269J9668K2656K3392J9189O685r588k0372k1464j5984q522j290M270
65349c43629O031K954k765o450n241k674o663j9014k8472k0986J321J8227J3251
65336c94110o989k0666j4851L522J8421K0073R863l975j2969j3499p666N24Q443
65323d13879J3700J3032N972j871l295K768J0673J4561J2801P264J717L74M288
65310c31895Q973Q590K737l200m030J105R157J4774J3172N255j613j928R55R25
$$ y = [-399972, -399712, -395944, -390141, -387059, -391294, -400090, -404715, -401273, -395334, -393160, -392983, -388698, -379088, -369938, -368572, -377584, -391442, -398579, -390658, -371274, -351991, -339372, -331316, -327096, -332431, -348738, -363879, -362690, -345088, -326385, -319303, -321293, -320752, -311529, -299684, -298060, -314378, -342621, -366460, -372983, -362269, -342601, -319945, -296553, -277364, -270679, -280267, -300639, -322103, -338087, -346609, -347899, -343629, -337598, -334644, -337409, -343859, -349100, -351774, -358437, -377451, -405923, -426909, -425588, -407361, -394110, -401099, -421765, -436616, -433094, -414673, -394600, -384737, -388712, -401681, -415180, -422846, -422322, -413879, -400179, -387147, -381175, -383046, -386341, -383573, -372900, -358339, -345538, -338274, -336557, -336183, -331895, -322922, -314332, -311595, -314795, -318825, -317720, -308563, -293789, -280617, -275362, -276975, -278903, -277948, -277023]
65296b77023j085q24j514r953k1291k0511m311R950N782j0841k1360j8825j0724
65283c82530k888N825J4166J6866J4264J2833J3516R254k718j5406k2692k6552
65271c66062k8751k4155r158R989K4202L1361L2741K6270J1646k885q226n864
65259c08892l124l67O974J5688J6013O581k997p259j1602j9010k1186j1585J124
65246c39642L816j762k513M643P809k90r131m941Q577J4548O231m124k904O266
65232c13417Q405k128j5146j9267j5400j1307q502j900R294J8018J8384J2580
65220c20386N817n07o375q145k316P322J2581J1274Q937R019P844K577k222k279
65206b76859l094j2848k7220l1260j8914j718P234J0141J7108K7384K9094J7080
$$ y = [-277023, -278108, -278932, -280446, -290399, -311690, -332201, -336512, -326562, -320780, -331621, -352981, -371806, -382530, -385418, -379593, -365427, -348561, -334297, -321464, -307948, -298694, -301412, -316818, -339510, -366062, -394813, -418968, -428126, -418137, -393935, -362574, -329833, -303563, -291917, -294802, -303028, -308892, -312016, -312383, -305409, -289721, -273708, -267127, -270124, -277383, -288985, -307995, -329181, -340766, -339642, -335826, -337588, -340101, -335458, -327649, -327939, -337070, -342011, -333434, -318886, -312655, -316779, -319683, -313417, -305012, -307140, -322286, -341553, -356953, -368260, -376762, -378662, -369368, -351350, -332966, -320386, -314569, -315076, -321451, -329596, -331912, -324590, -312009, -300735, -291798, -282779, -274935, -272358, -274580, -276859, -279953, -292801, -320021, -351281, -370195, -371913, -364679, -354538, -337430, -310046, -280952, -263872]
65194b63872O10r530j3315j6132j7885j4331o090L17O16k363k955N12M374M523
65180c35521J708L88J928K144j272k509M677J4833J4997K520r716r445J055J1248
65166c02965J4698R997k069j4392j4168K034J9123K0171Q339O62L381P072N808
65153b42309N849J0844J1950J036j5505k4970k4257j9346j3440m337P540J5770
65141b91175J4561N725k606m217j757l491j1303j5296n682J2306K2975J9197Q596
65128b52167J34n579r396p322J754R303O259n289j5745j9219j5406n317P532J5119
65114b95339J1973K972k075l92K710L177K637L884P319J2189J7339K0246J8139
65101a95221J0127k688j6949k5767k2537r997j299o161j8290k2244j1512N315
$$ y = [-263872, -263262, -272792, -286107, -302239, -320124, -334455, -340545, -340228, -339612, -341975, -344930, -344418, -340044, -335521, -333813, -333425, -331497, -329353, -330625, -333134, -328457, -313624, -298627, -296107, -305823, -315268, -314213, -302965, -288267, -278270, -280339, -294731, -308899, -306865, -287742, -267571, -259232, -258570, -255189, -248117, -242309, -236460, -225616, -213666, -212630, -228135, -253105, -277362, -296708, -310148, -314485, -306945, -291175, -276614, -270889, -273495, -277712, -279469, -282960, -294263, -309559, -315241, -302935, -279960, -260763, -252167, -252033, -257612, -267008, -274330, -272576, -263273, -257014, -262303, -278048, -297267, -312673, -317990, -310458, -295339, -283366, -280394, -282469, -282861, -280151, -276974, -274337, -270453, -263134, -250945, -233606, -213360, -195221, -185094, -187782, -204731, -230498, -253035, -263032, -264331, -270492, -288782, -311026, -322538, -317223]
65089c17223J5567J4978R136N922P272P630J771o525q202j854L936L559J506J936
65075b60591K30p256j3473j1067n664o628r810l401J1754K2456K3433K2509K3557
65062b13951J9030M365j3214k6620l7996m8042m6915k6177O141L1265L7248K5867
65050b88999P353o278p961j536K850K533N015J3016J5998M585j3951k4054k0792
65037c12221j1484l101K345L385J33k111O64L138j774r721j0060k636K690L619
65023c37134Q932K0706K6725J8655O831O208J5034J8902J1663N88p740j5129k3104
65010b48863k6322k0070q847k352n435j4939k3627k4451j4087L448J8104K2469
64998c44972J8652J3485Q403p67j3546k0624j4485o44P468M234k574k859L768
$$ y = [-317223, -301656, -286678, -277542, -271620, -264348, -256718, -254947, -261472, -269674, -271528, -267592, -264033, -262527, -260591, -260361, -267617, -281090, -292157, -297821, -304449, -314259, -317660, -305906, -283450, -260017, -237508, -213951, -194921, -190556, -203770, -230390, -268386, -316428, -363343, -389520, -383379, -352114, -314866, -288999, -281646, -287924, -295885, -297421, -294571, -292038, -287023, -274007, -258009, -253424, -267375, -291429, -312221, -323705, -326806, -324461, -321076, -320943, -323054, -322390, -319252, -321026, -330747, -340807, -343443, -340753, -337134, -328202, -307496, -280771, -262116, -255285, -249077, -234043, -215141, -203478, -202890, -210630, -225759, -248863, -275185, -295255, -304102, -306454, -311889, -326828, -350455, -374906, -388993, -385545, -367441, -344972, -326320, -312835, -304432, -305199, -318745, -339369, -353854, -354498, -347030, -342796, -345370, -348229, -344461]
64985c44461R283P265j132r030r132Q46J4914K2205J6882M406m464m963q94K912
64971b95363O151J0229J4043J5069J2300O230j884q905j0571o301j349j130m576
64958b66057o290m188j412q42j410l36M332J3477K4968L1122K3604M405j2185
64945a90812j3660l435L754o61j1032j6773j4482q810m944l577k530r23l15j483
64931b69683j907N57J987m417j7108k3917j6553k973K079l782r364o732M20O639
64917c44754J3476K3808L4279L8291L2210J6569l019j4670q690Q444J6792N666
64905a81598j3448k2409j6974m901P628J7435J9401J2363N869R209J6406J3895
64893a37124R97r654j1389j0210j1084j0591p016o264j2210j9788k2521j9689
$$ y = [-344461, -335178, -327913, -329045, -338075, -347207, -346361, -331447, -309242, -292360, -287954, -292418, -297381, -298275, -295363, -289212, -278983, -264940, -249871, -237571, -231341, -233225, -242130, -252701, -259002, -260351, -261481, -266057, -272347, -276535, -277947, -278789, -280199, -280535, -276203, -262726, -237758, -206636, -183032, -178627, -190812, -204472, -207907, -204153, -204814, -215846, -232619, -247101, -255911, -260855, -264432, -266962, -267885, -268200, -269683, -271590, -271033, -269046, -273463, -290571, -314488, -331041, -334014, -331935, -335717, -345081, -351813, -351393, -344754, -331278, -307470, -273191, -234900, -202690, -186121, -189140, -203810, -212500, -204056, -187264, -181598, -195046, -217455, -234429, -239330, -231702, -214267, -194866, -182503, -176634, -167425, -151019, -137124, -136127, -145781, -157170, -167380, -178464, -189055, -196071, -202335, -214545, -234333, -256854, -276543]
64881b76543j2765k845N011L867m212q053l224Q54l769r508l396J4160K9383L1035
64867b40005J9734M116o546q255n727p750j6075k2540k0050j1186k253M897R888
64854c01752R495L768R17P100J5226J3638L707j653K666O297j149j4726k0068
64841b76534j0960M231J2665J0020K613j195O02M463P884J1749J6351J8903J6560
64828a82648R952L010O61N478J3775J6905J0789J947j574j975n835r514l460Q246
64814a34243P895j0361k8754k8637j3311K050J1909J9087K1343J4771N599M142
64802a28510R371J1745Q596M612L6q335j6164j5077o648k3M014J2678K4312K6962
64788g2431J7431P468N326M232l378j1529r926N40J0219J3104R657K096o216j0054
$$ y = [-276543, -289308, -292153, -287142, -283275, -287487, -295540, -298764, -297910, -301679, -311187, -314583, -300423, -271040, -240005, -220271, -216155, -222701, -230956, -236683, -244433, -260508, -283048, -303098, -314284, -316537, -311640, -301752, -292257, -288489, -287572, -280472, -265246, -251608, -247901, -249554, -246888, -240591, -241740, -256466, -276534, -287494, -283263, -270598, -260578, -257965, -259160, -258558, -254095, -246211, -234462, -218111, -199208, -182648, -172696, -169686, -169025, -163547, -149772, -132867, -122078, -120131, -121705, -123680, -129515, -139029, -142489, -134243, -126348, -136709, -165463, -194100, -207411, -205361, -193452, -174365, -153022, -138251, -132652, -128510, -119139, -107394, -98798, -94186, -94150, -102485, -118649, -133726, -140374, -140397, -136383, -123705, -99393, -72431, -55000, -47532, -42206, -37974, -41352, -52881, -62807, -62267, -52048, -38944, -29287, -27191, -33407, -43461]
64774d3461o565J274Q187J1290J0752h924C502J8955K0101Q461p903j2275j198
64761B9643J1069J2851Q142M837K120k555m714r05K766L04l080k65L157m422k1682
64746C7266D269b2053n404a2220I728J1297n945B592C39J2116J4787N352m998
64733B7596j0524C021a2946j2307m895k753r372j6529j5376q037l365n045q909
64720i9534j0532j1076j3923j7556j5249l775J0559J8790J9907J7961J0804p113
64708a00737k8747l5145k0246k893k282j1678j1376L01P686N567N430J2003J3784
64695a68333L749q190j2906j6545k5255k9363j8123m4Q369P844J2455K3531K6244
64682a96567J4503J908J017N601K947o574j2971j2395q477k731M812Q113N01j1667
$$ y = [-43461, -50026, -48752, -40565, -29275, -18523, -8924, 3502, 22457, 42558, 51019, 43116, 30841, 29643, 40712, 53563, 61705, 66542, 68662, 66107, 61393, 60488, 63254, 63558, 60478, 60213, 63370, 58948, 37266, 4269, -22053, -27457, -12220, 9728, 21025, 15080, 2592, 339, 12455, 27242, 32594, 27596, 17072, 3021, -12946, -25253, -30148, -32901, -42273, -58802, -74178, -82215, -85580, -90625, -99534, -110066, -121142, -135065, -152621, -167870, -171645, -161086, -142296, -122389, -104428, -93624, -100737, -129484, -164629, -184875, -187768, -190050, -201728, -213104, -212803, -205117, -199550, -194120, -182117, -168333, -164584, -172774, -185680, -202225, -227480, -256843, -274966, -275010, -266641, -258797, -246342, -222811, -196567, -182064, -180156, -179139, -173538, -170591, -177165, -190136, -202531, -211008, -213739, -208927, -200814, -200313, -211980]
64668b11980j2589J645J5506J4033J724o745p217o412o036k10J0231J3712L818
64655a90520r959j4621j0287o705p615p249j231O410Q336J856q677j4766j0209
64642b65237K301J2530J3780J0283R696J1473R038J858k603l69K601p74q091j0421
64628b13935l931N087P107l25r761j1662m597M036P362N354M90p194j6158j9741
64614b57868j4184p065q483j4823j1622N862K4828L1485K6266J7386Q197j062
64602b01083o130l719j79n052j6472k1506j2156N731K0771K6843K3875J4351K882
64589a71844m835o678n791n609n858n472n954q328r137l978N656J2890J2921O864
64575a95153j541q793j0324j629J5181K8809K7967J2818o218k0076k7176k8847
$$ y = [-211980, -224569, -222924, -207418, -193385, -191661, -198406, -205623, -212035, -218071, -218281, -208050, -194338, -190520, -200479, -215100, -225387, -232092, -239707, -246956, -248187, -241777, -233441, -231585, -240262, -255028, -265237, -262936, -250406, -236626, -226343, -216647, -205174, -196136, -194278, -196881, -197250, -194649, -195423, -203514, -213935, -217866, -212779, -205672, -205997, -215758, -227420, -232017, -227981, -220619, -215265, -214775, -221969, -238127, -257868, -272052, -279117, -287600, -302423, -314045, -308183, -283355, -251870, -225604, -208218, -200021, -201083, -207213, -210932, -211111, -216163, -232635, -254141, -266297, -260566, -239795, -212952, -189077, -174726, -171844, -176679, -183357, -189148, -194757, -200615, -206087, -212041, -220369, -229506, -233484, -227828, -214938, -202017, -195153, -196694, -205487, -215811, -217440, -202259, -173450, -145483, -132665, -138883, -158959, -186135, -214982]
64563b14982k5029j6741p536R97J0721K0229K1493R180r491k0759j9111j0693
64551b61722l380lr74o033j1044r229Q87J2687J9144J9630J7381J4466J1637R334
64537a87219O372J022m806o936o338r633j8694k5245k0786p497N979J5391K1203
64524b37187K1745J4373K701m678m002K25K393J708J75j080j985k703l298k801
64510b14414l38N50p212k3343l3641k3142M227K7620L2607K4725J7367J4872J2734
64497a67388P227k057j4046k3941k3242r096R367K0389K2319K0248J3868j189
64485a47541k0461l0167k3729j0720m299n706o705k787K746N704N881M628K171
64472b30985j125k854L45R232J9120K2514J7596J2891J7808K7869K7024R162j0275
$$ y = [-214982, -240011, -256752, -264288, -263291, -252570, -232341, -210848, -201668, -211159, -231918, -251029, -261722, -265102, -265105, -266079, -272112, -283156, -292385, -291498, -278811, -259667, -240037, -222656, -208190, -196553, -187219, -180847, -179825, -184631, -191567, -197905, -207538, -226232, -251477, -272263, -279760, -273781, -258390, -237187, -215442, -201069, -198368, -203046, -207048, -206823, -204430, -202722, -202547, -203627, -205612, -208315, -211613, -214414, -214752, -214202, -221414, -244757, -278398, -301540, -297313, -269693, -237086, -212361, -194994, -180122, -167388, -160161, -162218, -176264, -200205, -223447, -232543, -223176, -202787, -180468, -160220, -146352, -147541, -168002, -198169, -221898, -232618, -236917, -242623, -249328, -252115, -249369, -243665, -237784, -233156, -230985, -232110, -234964, -234619, -225387, -206267, -183753, -166157, -153266, -135458, -107589, -80565, -71403, -81678]
64459h1678j2705j300L824o244j8783k0484j6346j8667k5866k4470r576P667J4281
64446b10347Q581k898j3705j8676j3546m9J1614J1866L016l389q59M865M815q20
64432b19532l255K706J1022J1333K048o663m357P198J5907J3478M054k705l716
64419a72482l760o442r364r265o883l826R90P351R975N097j559j696Q03p389k7020
64404b25470l7609k1416R947K6220J5309l200n027R534K0879J6992N372N83P643
64391a80243J8125J8695M095j5696k3485j3056L534J0393N246k619o840p606l559
64378a93016Q377K2668K4987Q949j2900k1609j2435K272Q557L778n107j0897j1847
64365a88223j0279p671k146Q054J9277K3789J8344Q788L150J567k941j3298k1852
$$ y = [-81678, -94383, -95683, -91859, -98103, -116886, -137370, -153716, -172383, -198249, -222719, -232295, -224628, -210347, -201766, -204664, -218369, -237045, -250591, -250640, -239026, -227160, -224144, -227533, -228392, -223527, -218712, -219532, -222787, -220081, -209059, -197726, -195678, -202341, -206698, -199500, -183593, -170115, -166061, -168766, -172482, -176242, -182684, -192048, -201313, -208196, -212022, -211032, -203681, -193706, -188609, -190168, -191864, -191061, -198450, -225470, -263079, -284495, -274548, -248328, -233019, -236219, -241246, -231712, -210833, -193841, -188469, -187886, -180243, -162118, -143423, -139328, -155024, -178509, -191565, -188031, -177638, -172392, -175011, -181851, -189457, -193016, -184639, -161971, -136984, -128035, -140935, -162544, -174979, -172707, -164150, -160372, -165479, -176376, -188223, -198502, -206173, -208319, -200265, -180988, -157199, -138855, -130067, -126917, -125350, -128291, -141589, -163441]
64352a63441j8150k154J3528J5800L820j1467j8421j3384j055Q892O487j0247
64340a89792k9118l2187j5360M967J0387J358o925n373J634P950J3584J8435J8068
64327b02372J1380N751Q115J4873J6474R731Q08l226k304k439p798j3857j0653
64314a75517M173J8545J8407N739l718j461M257K835l954p563n578j839J058K386
64300a42230L26n411j1120j3868j4915j4693j0455l847l230j0805j4683l928J4084
64287b34775K2604J7752R963N971K582j839k823M38K003n23j812J441M781L406
64273a70831j647o852q705k369J3139K7287K6339J1944K56j242l295j4961k7396
64260a58333k7965j9849j4677j2999n820Q091J9393K1544J6288O401o867j8613
$$ y = [-163441, -181591, -183745, -170217, -154417, -150597, -162064, -180485, -193869, -194924, -186032, -179545, -189792, -218910, -251097, -266457, -261490, -251103, -249745, -256670, -262043, -260409, -252459, -238875, -220440, -202372, -190992, -185241, -177126, -162253, -145779, -136048, -135240, -138466, -140770, -143209, -151007, -164864, -175517, -171344, -152799, -134392, -128653, -132371, -133832, -129575, -126740, -130694, -138257, -143835, -145674, -144616, -142230, -141904, -147315, -158435, -172303, -187218, -201911, -212366, -216213, -219443, -230248, -244931, -248859, -234775, -212171, -194419, -184456, -178485, -175903, -177742, -180565, -180127, -178124, -178647, -180459, -179018, -174237, -170831, -172478, -179330, -188035, -190404, -177265, -149978, -123639, -111695, -111439, -112681, -115976, -130937, -158333, -186298, -206147, -220824, -233823, -239643, -231552, -212159, -190615, -174327, -167926, -174793, -193406]
64248a93406k1758j5978q545m704k632J287P315J3164J5816J2838N727O24J696
64235a88556N955Q785J0699J2775J0034j482j4270j6850j1036r976j7345k0541
64223b31808r633P161J4254P916k782r192r851o606l66Q795J9546K7067K4499
64210a61000J1210j621j520Q196J0924l71j3041j3586o443m384q410r405m607
64197a94058O08M816J1171J6275J1862K92m254M707J5868J6246Q528M366P299
64184i6274J1099J0849P235J911m153q416q464n547k675r33r42m764j1635j5068
64170a27777j0184j312L856M986O746Q563O040J465J945N704J825j1884k1774
64157a31801j6657m083J025l076o661n672m728m699k00Q427J1556L641p911j2502
$$ y = [-193406, -215164, -231142, -239687, -244391, -247023, -245736, -238421, -225257, -209441, -196603, -190876, -190252, -188556, -182601, -173816, -163117, -150342, -140308, -141790, -156060, -172910, -183946, -193922, -211267, -231808, -241441, -234280, -220026, -212110, -214892, -224084, -233935, -240541, -240907, -232112, -212566, -185499, -161000, -149790, -151411, -152931, -144735, -133811, -134182, -147223, -160809, -167252, -171636, -180046, -189451, -194058, -193450, -188634, -177463, -161188, -149326, -149034, -153288, -148581, -132713, -116467, -107939, -103573, -96274, -85175, -74326, -67091, -65180, -69333, -77749, -86213, -91760, -94435, -95368, -96310, -101074, -112709, -127777, -137961, -139273, -135417, -130431, -123685, -115122, -109082, -107617, -105672, -99968, -98143, -110027, -131801, -148458, -152541, -151516, -154592, -161253, -166925, -171653, -176352, -176552, -168125, -156569, -152928, -160839, -173341]
64143a73341q761k239L652Q158Q543K149p229j0476k214J3271K5679K7161J7983
64130i7664N095m665r838j2551j3462j1509p517m016j499J071K228k36l203p33
64116a58499N375N118n353j6056j6173q441k684k2O442J7199K3256J9068J0195
64103a20575N092M978M400k109j4954k6952k6475r219J2864K1602J3243J930j01
64090a36276K399k076j3535k0834j7179p316P10M826Q443J4148J9638J9301J0637
64077a17114m21l458M939J5891J7088N058j3570l0136l9461l9746l2300k1741
64065b54971j2931o899j590L990Q706J1624J2931J3077J3160J4936J7582J5712
64053a64673M755j1659k3410k4152j7138r864n573j474O596J9229L1952L7626
$$ y = [-173341, -182102, -184341, -180689, -172531, -163988, -161839, -169068, -179544, -181758, -168487, -142808, -115647, -97664, -92569, -97234, -107072, -119623, -133085, -144594, -152111, -156127, -157626, -156555, -154327, -154563, -157766, -158499, -153124, -148006, -153359, -169415, -185588, -194029, -196713, -196735, -190293, -173094, -149838, -130770, -120575, -115483, -110505, -106105, -108214, -123168, -150120, -176595, -185814, -172950, -151348, -138105, -136175, -136276, -133877, -135953, -149488, -170322, -187501, -194817, -194107, -189281, -180838, -166690, -147052, -127751, -117114, -117535, -120993, -116054, -100163, -83075, -78017, -91587, -121723, -161184, -200930, -233230, -254971, -267902, -274801, -276391, -272401, -263695, -252071, -239140, -226063, -212903, -197967, -180385, -164673, -159918, -171577, -194987, -219139, -236277, -246141, -251714, -253188, -246592, -227363, -195411, -157785]
64041a57785L1919J7651K789o733j1513j5398j9037j8895j2955n303k561n810
64029b03631q962o841k256j549m960o436k878K196N827J0435J7513K1357J4931
64016a65254k43j4848k1114j7630p065O001J6037J9851J8894J5901J1276N719
64004a32475K804L765K881n314j6335k0287j4822o518r10P67l446j3928k1713
63991b25531j5001L061J4703J1060L883O072J1743P364n601j2994q592Q34R378
63978a99621J7706K4032K1714J0029j590m382Q20P915J2388J1951P041K937M461
63965h4599O624r86j6787k3668r927J3709K6697K2817J1814J058j1754k6443l3010
63952a24455k3442m685P369M780o333j4911j5131p656L770J3553J5023N157r988
$$ y = [-157785, -125866, -108215, -105426, -112159, -123672, -139070, -158107, -177002, -189957, -195260, -197821, -203631, -212593, -219434, -221690, -223239, -228199, -234635, -237513, -235317, -229490, -219055, -201542, -180185, -165254, -165497, -180345, -201459, -219089, -226154, -220153, -204116, -184265, -165371, -149470, -138194, -132475, -129671, -125906, -123025, -128339, -144674, -164961, -179783, -186301, -187211, -186444, -189890, -203818, -225531, -240532, -237471, -222768, -211708, -207825, -201753, -190010, -182646, -188247, -201241, -209833, -208999, -199621, -181915, -157883, -136169, -126140, -127730, -132112, -131292, -123377, -110989, -99038, -91997, -89060, -84599, -77975, -78961, -95748, -119416, -129343, -115634, -88937, -66120, -54306, -53248, -65002, -91445, -124455, -147897, -152582, -145213, -140433, -146766, -161677, -176808, -184464, -180694, -167141, -152118, -146961, -156949]
63939a56949j7936j1292L718J2941Q917k342r510q075k730j43k314o204p155k433
63925b01507O321J3306J2522K969r689j6731j2703k36J0469R073m910j9571k0675
63912b31362n581J4252K5294K4393J7784J0470J499r586j6709j2671P27J2655
63900a68835J4496P851n9n232q200r240o911j140N650J1089J4103J3583Q769K211
63886a21865k00N454J5988K2384J7129J807j2113j2587J28J1603P952q136k0059
63873i2515j6120j309J0586J1566L381q224j7902k1073j5398l839N679N538n464
63860a45094j9883k6029j7394P73J6072K0851J7608J2642Q580N223L452L793L302
63847a16104j340q056j0390m782N397J3108J3164N279o023j4098j3940m231J2595
$$ y = [-156949, -174885, -186177, -182459, -169518, -160601, -162943, -172453, -180528, -183258, -183401, -185715, -191919, -199074, -201507, -195186, -181880, -169358, -166389, -176078, -192809, -205512, -205748, -195279, -186206, -191116, -210687, -231362, -236943, -222691, -197397, -173004, -155220, -144750, -143251, -152837, -169546, -182217, -181490, -168835, -154339, -146488, -146547, -151779, -159979, -169219, -176130, -177270, -171620, -160531, -146428, -132845, -124076, -121865, -122065, -116611, -100623, -78239, -61110, -59303, -71416, -84003, -83875, -72272, -64320, -72456, -92515, -108635, -109944, -99358, -87792, -84411, -92635, -110537, -131610, -147008, -150847, -145168, -139630, -145094, -164977, -191006, -208400, -207627, -191555, -170704, -153096, -140454, -131874, -126651, -123199, -119406, -116104, -117444, -125500, -135890, -140672, -135275, -122167, -109003, -103724, -109747, -123845, -137785, -142016, -129421]
63834a29421K9729L6931K7706P530r922j7230j8793j9541j6408p696k546r197
63822a28858j8205j1935Q711K1759J3423l033o505L809J0689L615j0478j9431
63810a36439j8432r690J906J0253J1152O751L078J928m08n016o207O26J0183J1462
63796a18853R87j1629j3791m462M197J269r403j4300q147n37j594p010m297Q614
63782a78956J9310J6874N284k717r69M743M836l485j3140j3915l716P274P246
63769a51331k053n993M078J7963J8821N471n355j84J4566K1404J3126k84n224
63756g4995K26O716O120n78p709j3194j9239k6460l1136k9126j9898n941Q725
63743b06489J8229J7242P250k333l505K112Q595J5828K6509L4529K6960J938k3875
$$ y = [-129421, -99692, -62761, -35055, -27525, -37447, -54677, -73470, -93011, -109419, -117115, -119661, -128858, -147063, -158998, -150287, -128528, -115105, -118138, -124643, -120834, -110145, -106530, -117008, -136439, -154871, -164561, -162655, -152402, -141250, -134499, -131421, -129493, -129901, -134917, -141124, -140498, -130315, -118853, -117866, -129495, -143286, -147748, -143551, -142282, -151685, -165985, -174132, -174669, -176263, -183273, -187570, -178956, -159646, -142772, -137488, -140205, -141174, -136431, -131595, -135080, -148220, -162135, -165851, -158577, -151331, -153384, -159377, -155299, -137336, -118515, -113044, -118399, -118583, -104017, -82613, -69487, -69771, -74995, -74769, -68053, -61933, -62511, -70220, -83414, -102653, -129113, -160249, -189375, -209273, -215214, -206489, -188260, -171018, -163768, -166101, -169606, -167494, -158899, -143071, -116562, -82033, -55073, -53135, -77010]
63730g7010l2377k3022q518K326Q783J0089M942j034J435J1262J5199M676j2258
63717i5507k0630j5242l840J829m822j9604k8050j7675O606K5764K8906K3782
63705a18483K0222J4619J368j0857j0021j822k168j0790j1196J228J0664O806
63693a10430P60L995P886j51j2574j2249k85N608j442r430q700n017o181r013
63679a57223p793o076j0846j9985k3500j5389K20J3025J4177K759j2671k1043
63667b44345j8546r354K255J4774K4249K4456J6463J0988J4790J9872J3882j755
63655a32271j2677j0552l541m896j6239k6155k3455q641P586J5479J4838J2154
63643a88370J0527N699n831j7768j8188l879J3503J8999J0693J052J469R104J2377
$$ y = [-77010, -109387, -132409, -140927, -138601, -129818, -119729, -114787, -115821, -114386, -103124, -87925, -83249, -95507, -116137, -131379, -135219, -133390, -138212, -157816, -185866, -203541, -196935, -171171, -142265, -118483, -98261, -83642, -82274, -93131, -103152, -104974, -107142, -117932, -129128, -127900, -117236, -110430, -109670, -105675, -97789, -97940, -110514, -122763, -123048, -117440, -118882, -128312, -137012, -142029, -148210, -157223, -165016, -171092, -181938, -201923, -225423, -240812, -240592, -227567, -213390, -210631, -223302, -244345, -262891, -272245, -269990, -255216, -230967, -206511, -190048, -179060, -164270, -144398, -130516, -132271, -144948, -155500, -159041, -163937, -180176, -206331, -229786, -238427, -230841, -215362, -200524, -188370, -177843, -172144, -177975, -195743, -213931, -217810, -204307, -185308, -174615, -173563, -172094, -162990, -150613]
63630a50613O947L38rL493N150O178J0330J2939N113j0212j7421q356N512Q215
63616a22396m06q072q480o120m885k765P99J635j507l025J417P715Q446J826p946
63601a43764j6229k0310j8531j1110j495N481P167N026M105R787K1829L1257K7220
63588i9567R052j1206k0549j7256r808o147o493n577j09N828L957p144j6161j0529
63574a91709N670J3399K607j3125j3508K251J6019J5491P945P328J6119K4635
63562a06878K3471J2520M9m941j473J972k556j2015j6540j3281r337r860j0759
63549a49628o453J793R346J3696J2146J657j2458j5586j676J3529R715r792k0632
63536a54343r532R914J8390J4984J1022R837N430k957p806n481j567j389k797
$$ y = [-150613, -143666, -143328, -143337, -139844, -134694, -128516, -118186, -105247, -100134, -110346, -127767, -136123, -130611, -122396, -122802, -130874, -139354, -145474, -150359, -153124, -152325, -150690, -152197, -155222, -153805, -146090, -137644, -135818, -143764, -159993, -180303, -198834, -209944, -211439, -205958, -198791, -193765, -189660, -179873, -158044, -126787, -99567, -90515, -101721, -122270, -139526, -149334, -155481, -161974, -167551, -167660, -161832, -157875, -165019, -181180, -191709, -186039, -172640, -170033, -183158, -196666, -194415, -178396, -162905, -154960, -147632, -131513, -106878, -83407, -70887, -70838, -75779, -77252, -75280, -77836, -89851, -106391, -119672, -129009, -138869, -149628, -156081, -154288, -144942, -131246, -119100, -117443, -129901, -145487, -147163, -133634, -123919, -133711, -154343, -163875, -153961, -135571, -120587, -109565, -99728, -94298, -97255, -105061, -110542, -112109, -113498, -116295]
63523a16295k090j149l623p427o535L31P092P705L552J176L512O214M077j254
63509a04714l431n66K114J60l778m633k651k125m209n434l106J501N278N695J892
63494a18007l346l990K405Q944N726p562k0702k5388k2698j6695q199R37M679
63481b03896J176r52O815J9196K3397J7629J2801J4370J3799L611q287q319L954
63468a04706J5711J7262J0231O31p319r434k376R717J5812J0166l34n275l229
63455e3143m69j382o389j6018k8535l4325k2253M486K6017K5034M811j6253k4136
63442a42555j8124m310J1251K2401K3497J4642L085l903n945p171r143r403o482
63429a32160k977k254l842m087j152K665M669O170J0626J7657K1707J7888O968
$$ y = [-116295, -118385, -119534, -123157, -130584, -137119, -136788, -129696, -121991, -118439, -117263, -113751, -107537, -103460, -104714, -108145, -108711, -106597, -106437, -110215, -114848, -117499, -119624, -123833, -129267, -132373, -130872, -125594, -119899, -118007, -121353, -125343, -122938, -113994, -108268, -115830, -136532, -161920, -184618, -201313, -209512, -208575, -203896, -202720, -203672, -196857, -177661, -154264, -136635, -123834, -109464, -95665, -92054, -100341, -108660, -104706, -88995, -71733, -61502, -60871, -68190, -77624, -80000, -70283, -54471, -44305, -44639, -49914, -53143, -53612, -54994, -61383, -77401, -105936, -140261, -162514, -158028, -132011, -106977, -102166, -118419, -142555, -160679, -164989, -153738, -131337, -107840, -93198, -90113, -94016, -99961, -107132, -116275, -125678, -132160, -135137, -137391, -141233, -145320, -146472, -143807, -139138, -132968, -122342, -104685, -82978, -65090, -58122]
63416e8122o430j7836k3527k0671j0502P47P699J0634J1107O522m434j3844j1897
63403a30554k734k057j4169k1981r221J4897K5662J5023R17K315J6004K4067J6670
63390f5161K90j2494j4676q488k996p000j9416k7479j9325J582J9153K2456J6189
63377a17365J1655J2030J0975L743n091o125M422J8966K2913P105k1281m2025
63365a00078m0261k1658n375j820l072K577J3593J9126J5529J0185R420J0915
63353i0919J0276P756M462j893j1781j8546j4597j261J2619K0524K2000J8006
63341d3354Q681l295j1899j2812p330p76J150m502j5040k2575k0814j1648k340
63328a46554K967N202N414L795L594Q844J6188J6123O428k596k125K084r54r087
$$ y = [-58122, -64552, -82388, -105915, -126586, -137088, -136341, -128642, -118008, -106901, -100379, -104813, -118657, -130554, -133288, -135345, -149514, -171495, -180716, -165819, -140157, -125134, -124217, -121902, -105898, -81831, -65161, -64871, -77365, -92041, -100529, -103525, -110525, -129941, -157420, -176745, -175163, -156010, -133554, -117365, -105710, -93680, -82705, -78962, -84053, -90178, -85756, -66790, -43877, -36772, -58053, -100078, -140339, -161997, -167372, -169192, -172264, -169687, -156094, -136968, -121439, -111254, -101834, -90919, -80643, -72887, -68425, -70318, -82099, -100645, -115242, -116503, -103884, -83360, -61360, -43354, -34673, -37968, -49867, -62679, -70009, -70785, -69635, -74137, -89177, -111752, -132566, -144214, -146554, -143587, -138385, -132971, -129176, -125582, -116738, -100550, -84427, -77999, -80595, -82720, -80636, -81590, -90677]
63314i0677r019K941J2816O946r193j7789j1474j338o74p022o215O983J9426J5349
63300h8940k336j4683j1374l678p099j8847k2897j3942l715j891k933J737Q423
63287a82175P625R7l980L76Q472J5408K0921K3758J9845R073k859j1882j7986
63274a13307j8171o559J2548K1117P416j5774k4574j3187K099P499P063R810J4025
63261a09995J2279L714p037j6695k0824j1172J3386L6987L9993K2134K227n771
63249d0774n623n631m682J708J0499J4871J3395P917k522j7072k6446k1311o380
63236h2051L750L755K832P731J0649J653j3440j8154p276N792O548k958r840r191
63222a00200q299j1433r808N733K6425L0799J0822j5394k3254r349P732J1677
$$ y = [-90677, -99696, -96755, -83939, -76993, -86186, -103975, -115449, -116787, -117461, -124483, -130698, -123715, -104289, -88940, -91276, -105959, -117333, -121011, -128110, -146957, -169854, -183796, -187511, -189402, -192335, -190598, -182175, -174550, -174453, -178433, -178057, -169585, -154177, -133256, -109498, -89653, -80580, -83439, -95321, -113307, -131478, -138037, -125489, -104372, -96956, -112730, -137304, -150491, -148392, -140893, -133830, -124020, -109995, -97716, -94002, -101039, -117734, -138558, -149730, -136344, -99357, -59364, -37230, -35003, -40774, -46397, -52028, -56710, -55002, -44503, -29632, -16237, -8320, -10842, -27914, -54360, -75671, -82051, -78301, -74546, -71714, -63983, -53334, -51681, -65121, -83275, -90551, -84759, -78211, -81169, -91009, -100200, -108499, -119932, -129740, -124007, -97582, -66783, -55961, -71355, -94609, -103958, -96226, -84549]
63210h4549M866p06p43j069o225j1991j0558m21J1239J6130J3588R828Q601O073
63196d5937k236j2429j5499r119j061L97n172j2986j9246k1733j8586j0579j944
63183a76130M745J1719K0114K4223J7627L623p009r074p872r447j1916r922k945
63170a52264N181J1651J5131J3633P256J524K252P383R572O953M624L534l763
63157f7333k0312l4221l0467j1294M687M873m163q583m271L276R507J3987J6505
63144a27809J6782J6600J6776J3694M471o104j0094p017l421k241J69N523R579
63131g3092R011N582O31p584j7245k0731j4635o077k800k379J556P431Q863O267
63117a05202N390N836J539o747j0237o401m442j1108j9531j9307j0853j504P044
$$ y = [-84549, -79683, -80389, -81132, -82201, -88426, -100417, -110975, -111396, -100157, -84027, -70439, -60611, -52010, -45937, -48173, -60602, -76101, -85220, -86281, -85884, -91056, -104042, -123288, -145021, -163607, -174186, -176130, -171385, -159666, -139552, -115329, -97702, -94079, -101088, -110162, -118034, -127481, -139397, -149319, -152264, -147083, -135432, -120301, -106668, -99412, -97888, -95636, -88253, -78681, -71728, -67104, -63570, -67333, -87645, -121866, -152333, -163627, -158940, -154067, -158230, -166813, -171084, -167808, -158301, -144314, -127809, -111027, -94427, -77651, -63957, -59486, -65590, -75684, -82701, -86122, -88363, -88194, -82671, -73092, -64081, -58499, -57868, -65452, -82697, -103428, -118063, -124140, -126940, -129319, -127763, -120332, -111469, -105202, -99812, -93976, -92437, -99184, -109421, -115822, -120264, -131372, -150903, -170210, -181063, -182567, -175523]
63104a75523J7094K3784J7839J558q669j942J2135J5453M235q372j0895o048k709
63091a22060k900j887L232J0642J7197J9707J4859L791m514j709P176P136p737
63078e7067k5699l2376k7047j7348n153J1395K5878K7090J5706N592M517M275
63066g0237l829j3905j5479j1258j2710k0704k2812j1177P138K1198K8673L1731
63054i3371K7696J2455r171k4412k5051j4114N86J4481K5179K8163J9521K859
63042c5179j1359j5783j3013j0335r759o896Q65R305J2532J0494Q666J1149J6195
63029c3118a4926b261Jj3936k1540k0248j5878j6901k4421k9806k3877p228J0187
63016a65908J8896J7511J0911L587l488j0218j4027j1265k624M658K986o317j2871
$$ y = [-175523, -158429, -134645, -116806, -115248, -123917, -125859, -113724, -98271, -94036, -102408, -113303, -119351, -122060, -124960, -126847, -123615, -112973, -95776, -76069, -61210, -57419, -61933, -63642, -56466, -49330, -57067, -82766, -115142, -142189, -159537, -164690, -153295, -127417, -100327, -84621, -79029, -74512, -70237, -74066, -87971, -103450, -114708, -127418, -148122, -170934, -182111, -174973, -153775, -125102, -93371, -65675, -53220, -62391, -86803, -111854, -125968, -125382, -110901, -85722, -57559, -38038, -35179, -46538, -62321, -75334, -85669, -95428, -102324, -101459, -92154, -79622, -69128, -60462, -49313, -33118, -14926, -2261, -2260, -16196, -37736, -57984, -73862, -90763, -115184, -144990, -168867, -176095, -165908, -147012, -129501, -118590, -115003, -118491, -128709, -142736, -154001, -156625, -151967, -148981, -155298, -168169]
63003a68169q978Q41N926L333k95m27n70l677n850m913p808j9167k7544j6706
62989b54004R519K7474K2991Q172K448Q398J5467J7581J4965O061q193j6245p136
62976a52502J0770J6415L409j1908j3248l076O705J1425J3163J2256Q266M519
62964i3806M101M663K785P2k55O77m3j431j67M215R150J1684R235J283p770j1863
62948f7470j1533j3344j8591j9545j1282n77K896j043n016l441M750J6615K3268
62935a04313J4802n730k0101j4885K134J3620J3936R314M014j428l113J827O434
62922h3489J747q615j3523j1394r312p818j324P215Q200L414N984J8552K6943
62909f3420K1006P398m346j4032k1762k1286j2428p310j2835j7815r516O355J4848
$$ y = [-168169, -177147, -176306, -170380, -167047, -167342, -167769, -168339, -172016, -177866, -182779, -190587, -209754, -237298, -254004, -244485, -217011, -194020, -185848, -183400, -175002, -159535, -141954, -126989, -120928, -129121, -145366, -152502, -141732, -125317, -121908, -133816, -147064, -150140, -143435, -132010, -118847, -106591, -98325, -93806, -89705, -85042, -82257, -82185, -82440, -81763, -81806, -83237, -83404, -79189, -70039, -58355, -49120, -47837, -55607, -67470, -79003, -92347, -110938, -130483, -141765, -142342, -139446, -140489, -145505, -148946, -144196, -127581, -104313, -89511, -95241, -115342, -130227, -128093, -114473, -100537, -91223, -87209, -88637, -91750, -89923, -83489, -81742, -90357, -103880, -115274, -124586, -132404, -133728, -126513, -118313, -114899, -108915, -90363, -63420, -42414, -35016, -39362, -53394, -75156, -96442, -108870, -116180, -129015, -146830, -156346, -149991, -135143]
62896a35143J3567J2085J4535J5361J0352J930n210o968j285P464J0076M136j896
62883f0996k000j882p451j2959j0714m447j361J316Q485J2545K153j7667k9137
62870a24115k4098r931M433J4643J5364M390p436n671O979J3992J0459Q973J6445
62857g5573K1737J3917j292j2029j5624j4972j0006j651M278M813M120M358J823
62844g6101j856L763K0877b0246C390G48b5476l4797k8990j3961K702J0039L278
62831h7205q324j3303j3616j7572k1937j5177K828J8530K3662K3400K2582J6597
62819f9535K604j0025r165N006K0664K6786a3166N508j1777k5614l3740l6983
62807a15772l5863k9370j7317j715J4175K5915K8200J9441O393m22K042N856K093
$$ y = [-135143, -121576, -109491, -94956, -79595, -69243, -67313, -72523, -79491, -80776, -73312, -63236, -59100, -60996, -62996, -64878, -72329, -85288, -96002, -100449, -101810, -100494, -92009, -79464, -77311, -94978, -124115, -148213, -158144, -153711, -139068, -123704, -119314, -126750, -132421, -125442, -111450, -100991, -92018, -75573, -53836, -39919, -41211, -53240, -68864, -83836, -93842, -95493, -91215, -86402, -82282, -77924, -76101, -77957, -74194, -53317, -20246, 3390, 748, -25476, -60273, -89263, -103224, -100522, -90483, -87205, -95529, -108832, -122448, -140020, -161957, -177134, -174306, -155776, -132114, -108714, -86132, -69535, -66931, -76956, -86121, -81115, -60451, -33665, -13166, -7658, -19435, -45049, -78789, -115772, -151635, -181005, -198322, -200037, -185862, -159947, -131747, -112306, -105913, -106335, -104293, -98437, -96344]
62794i6344p877j3671p981M604J2247R234K508K162P519Q523J130o440o178j026
62780i1590K835O731J3495J7071R956k317p134m428o508j6014j8538m405J3874
62767h6972J6453J684j3486j5415p130o28k635r220j1098l787P016J1871R239
62754a04108O122O509N619j193j0429j6397j9066j9501j3037M104K3748L0633
62742a06996J9397K33j3445j7254j4339p516K847J4997K3357K1436Q120r343k0825
62729i9331k2526j8416j2740n975L64J787j474r42Q815J9924K0600J1728M687
62716i3499M074K926l762j1067j3237j1740r138k569R874K1733K4433J7955R238
62703e4779K503k596n223l020J791K537l043q771q384m392l753o484n140K589
$$ y = [-96344, -104221, -117892, -125873, -121269, -109022, -99788, -97280, -95118, -87599, -79076, -77946, -84386, -90564, -91590, -88755, -82024, -68529, -51458, -41502, -43819, -50953, -55381, -61889, -77903, -96441, -100846, -86972, -70519, -68835, -82321, -97736, -104866, -105494, -108129, -117349, -128447, -132234, -125218, -113347, -104108, -97986, -91477, -85858, -87051, -97480, -113877, -132943, -152444, -165481, -161377, -137629, -106996, -87599, -87366, -100811, -118065, -132404, -139920, -137073, -122076, -98719, -77283, -69163, -78506, -99331, -121857, -140273, -153013, -158988, -158624, -156837, -158311, -159253, -150438, -130514, -109914, -98186, -93499, -89425, -86499, -90261, -101328, -114565, -126305, -135443, -138012, -128138, -106405, -81972, -64017, -54779, -52276, -54872, -60095, -63115, -61324, -58787, -61830, -70601, -78985, -83377, -87130, -93614, -98754, -96165]
62689i6165P476J328q168m938J2523K6335K2532R439L546M940K38j3223k1468
62676e5605j4740j071O664O476L159j977q496j1053n994N33k27p251j2232j1800
62662a13614r650q315o355k771K380J0555K1334K7825K2871R807j19j809j381
62649d9242n834j3792j8706j6701r337k085q77o892j4446j6885j3542p684n69
62636a76592O971J0095N030k468k378N493J1372J0542R084J1683J3283Q312M99
62623h9074l073k153j423k636m060m066p99P525J7354J9021O898j2080k4562k3471
62609a16599j1867K213J1144J1461O204J399j243m074n510p5J0446J4680O635
62596g5186m637p534l032Q22K331M047L475k326p238l713K669o45j3093k0074
$$ y = [-96165, -88689, -87361, -95529, -100467, -87944, -61609, -39077, -29638, -26092, -21152, -20914, -34137, -55605, -70345, -71416, -64752, -58276, -55117, -57094, -65590, -76643, -82637, -82104, -82331, -89582, -101814, -113614, -123264, -131579, -137934, -140705, -138325, -127770, -106436, -78611, -55740, -45933, -46052, -47861, -49242, -55076, -68868, -87574, -104275, -113612, -115697, -116574, -123466, -137912, -154797, -168339, -176023, -176592, -169621, -159526, -154496, -156964, -159342, -153849, -142477, -131935, -122851, -111168, -97885, -89573, -89074, -92147, -94300, -95723, -98359, -102419, -106485, -107284, -99759, -82405, -63384, -56486, -68566, -93128, -116599, -128466, -126253, -115109, -103648, -97444, -96045, -97288, -101362, -106872, -106947, -96501, -81821, -75186, -79823, -87357, -90389, -89567, -87236, -83189, -79714, -82040, -89278, -92991, -90322, -90967, -104060, -124134]
62582a24134j3466p25R033J6108K2933K6241K2425J3305K361p833j2071n502N993
62569d5332P882n082k1149k6868k1553j1324Q92J1382J1899J049q011l638O177
62556a03676N116o328j2494q436p196j6749k5356j9687n925J26k697p31J1894
62543a92139K4166K5442K0821K1585K7127K6030J3073l642j3664j5053j1757o402
62531h4413m9N346Q819J1694J3141Q367l540j3628j2097j635N258J931n998r976
62517g6780p515p31P612J4208J6014J2926O491k967j3104j5823n425R616J3100
62504d2378J932r207q166q21pp526j5010j6276j0825j51J1338J5705R605O28j294
62489g2453L487O097R34r762k0103k3719j6077K91J5295K0850J7755R446m061
$$ y = [-124134, -137600, -138325, -129292, -113184, -90251, -64010, -41585, -28280, -25919, -33752, -45823, -51325, -45332, -37450, -42532, -63681, -90549, -112102, -123426, -122534, -111152, -99253, -98204, -106215, -109853, -103676, -98560, -104888, -117382, -125818, -133014, -149763, -175119, -194806, -200731, -200605, -203302, -204033, -192139, -167973, -142531, -121710, -100125, -72998, -46968, -33895, -37537, -51201, -66254, -78011, -84413, -84462, -79116, -70297, -58603, -45462, -37095, -40635, -54263, -66360, -67995, -62737, -60806, -66804, -76780, -84295, -85026, -77414, -63206, -47192, -34266, -27775, -30742, -43846, -59669, -65094, -55478, -42378, -40446, -49653, -57819, -58640, -58647, -66173, -81183, -97459, -108284, -108435, -97097, -81392, -71787, -71159, -72453, -68966, -62869, -61935, -71697, -91800, -115519, -131596, -131305, -116010, -95160, -77405, -67959, -72020]
62476g2020j9155k3512r494J1837K2249J8987J3358R114j430j6973j9967r8K6139
62463f0965b8838J2694j1716k0684j3694l397J912K962J387m316j2776j6690j1919
62450a05075n679p623j4526j4138n216j216q829j5359p334Q890J7786J7772J8814
62437a21733K2091J8279N050q142j3432j0508k19J4456K2040J2416n703j2478
62425g7883m247K756j144o865o476o276j0173q015N816J7158J1281l996j0306
62412i8370m819J299K654J641l252j4560k4287k0176k313J8085L2650L6793K3288
62399e1367q192l8292m3078k3143j962N526O225R013J0205N572J041K136M848
62386a21468N373P797J3748J5149O623m063p046l588L76M811R693P638m634j4189
$$ y = [-72020, -91175, -114687, -124181, -112344, -90095, -71108, -57750, -48636, -50066, -67039, -87006, -87104, -60965, -28838, -16144, -27860, -48544, -62238, -65635, -63723, -60761, -59374, -63690, -76466, -93156, -105075, -110754, -118377, -132903, -147041, -152257, -153473, -162302, -177661, -184995, -176105, -158319, -140547, -121733, -99642, -81363, -76313, -84455, -97887, -108395, -108614, -94158, -72118, -59702, -65405, -77883, -82130, -79374, -80518, -87383, -93859, -100135, -110308, -118323, -112507, -95349, -84068, -88064, -98370, -103189, -101890, -99236, -97595, -100847, -115407, -139694, -159870, -162183, -144098, -111448, -74655, -51367, -59559, -97851, -140929, -164072, -166034, -160508, -154283, -145270, -135065, -129493, -128452, -126316, -121468, -116095, -108298, -94550, -79401, -72778, -76841, -83887, -87475, -87099, -82288, -72595, -64957, -69591, -83780]
62372h3780n905J4174K3579J1676q844k0235j8595j1543o763p448j2345j5723
62360a41752j1583p51R592J4156J2846O536l338r853l769J3903K9102K9848J8952
62347c6111O700l127j2350j8186j3983m15J2207J4897P736m288j6812k5359k5597
62334a14688j8731j2192j0533r353k710P031J2358J1259Q473O895M064j956q415
62321a28498j1292r207k973N306J2289J6187J9132K2255J9877O205j1564j6612
62309g8895l462J3022J6123P169j244m458o723p637j479R713J5060R894J531l365
62295c4751o748r761o105O827J8532a4644O863P6O04k57q365j8485k2898k0353
62281g7459j4037p201l218l810m703N05R005Q798m157j5685r666R054J8955R474
$$ y = [-83780, -89685, -75511, -51932, -40256, -49100, -69335, -87930, -99473, -106236, -113684, -126029, -141752, -153335, -154086, -144494, -130338, -117492, -110956, -114294, -124147, -127916, -114013, -84911, -55063, -36111, -29411, -32538, -44888, -63074, -77057, -77472, -65265, -50368, -42632, -46920, -63732, -89091, -114688, -133419, -145611, -156144, -165497, -168207, -161176, -148818, -137559, -129086, -122191, -118127, -120083, -128498, -139790, -148997, -151970, -146664, -134375, -118188, -99056, -76801, -56924, -50719, -62283, -78895, -82357, -69335, -53212, -46043, -47287, -51745, -58468, -66105, -67584, -57871, -42811, -32917, -31386, -34751, -41499, -51260, -57365, -50538, -32006, -14644, -7781, -7705, -7101, -7358, -15723, -34208, -57106, -77459, -91496, -98697, -101915, -105725, -110428, -109923, -100918, -92120, -96277, -111962, -121628, -112574, -93619, -84145]
62267h4145o448j1458n780k176n460p778l008M439P928P963Q457Q870N712o44
62253h3528n340m511J445Q780J2191P925j725q635o926M51N835N422O40n711r824
62238h3511o577L982J1599N958p727j2777l658N159q95j5998k2218j3028J478
62225a38213J0575J4021J6306J8380J8098J3135J306j6591l1981l2379j4572R312
62213a32603K2768K0029Q087k836p093m540J218N201M790K069J284M127Q220R521
62199e9758N563k332r347j1468j0021r343r699o730L07N574N958P290J4021J8019
62185f1966Q552q515j4506l466Q849P835J65P08Q695J0864L717k544j964r8j1
62170d3685M989J7120B207J2205B656b6791l0882k1499j0490j930K603J770k317
$$ y = [-84145, -90593, -102051, -107831, -110007, -115467, -123245, -126253, -121814, -113886, -105923, -97466, -88596, -82884, -83528, -88868, -93379, -91934, -83154, -70963, -63038, -64763, -73398, -80324, -79873, -74038, -68616, -67976, -73687, -83511, -90088, -86106, -74507, -68549, -76276, -89053, -92711, -87552, -88447, -104445, -126663, -139691, -138213, -127638, -113617, -97311, -78931, -60833, -47698, -46392, -62983, -94964, -127343, -141915, -132603, -109835, -89806, -81719, -84555, -91648, -96188, -94970, -89769, -84979, -82910, -81626, -77499, -69279, -59758, -54195, -56527, -65874, -77342, -87363, -96706, -106405, -113135, -112828, -107254, -101296, -94006, -79985, -61966, -53414, -61929, -76435, -79901, -71052, -63217, -63052, -62344, -53649, -42785, -39068, -41612, -43576, -43674, -43685, -38696, -21576, 2207, 14412, 2656, -26791, -57673, -79172, -89662, -91592, -88989, -87219, -89536]
62157h9536m410k028K878Q564J4692J8129J3715J685j0838j8541k2976k5799k3065
62144a37530j2295o21K268k058k111P302J7813J9811J5514J3938J6692J6186P681
62131c7410l482r266r277r850j4612j9453j7550p942J886K630o871j6859j5786
62118a63842k227J4350K4226K5082J8726O421q321j7132j3937l216M918O875O881
62105a01196P364O016L481N566J3911K1186K0293a0323e018j316p394j0809j0299
62092c4836r833j2412j2866m595Q491J4955J0571K507j776k550k965k892q26K625
62078d6402N933P987O612p02j2552k2695k4732j6524j377J2417J5916Q925L045
62065f4149Q267J7871J5720r34j6276j6820p060J337N431P232L496q025j7458
$$ y = [-89536, -93946, -95974, -93096, -84532, -69840, -51711, -37996, -36311, -47149, -65690, -88666, -114465, -137530, -149825, -150446, -148178, -150236, -152347, -145045, -127232, -107421, -91907, -77969, -61277, -45091, -37410, -40892, -50158, -59435, -69285, -83897, -103350, -120900, -128842, -126956, -124326, -131197, -148056, -163842, -166069, -151719, -127493, -102411, -83685, -77264, -85585, -102717, -116654, -119870, -114952, -108077, -101196, -93832, -87816, -84335, -78769, -64858, -43672, -23379, -10323, -5018, -6334, -13728, -24537, -34836, -44669, -57081, -69947, -74542, -66051, -51096, -40525, -38018, -39794, -42344, -45309, -48201, -49027, -46402, -40469, -32482, -25870, -26572, -39124, -61819, -86551, -103075, -104452, -92035, -76119, -67194, -64149, -55882, -38011, -22291, -23225, -39501, -56321, -63381, -62044, -56613, -49381, -45885, -53910, -71368]
62052g1368j2094M167J3919J0509O137J0886J6352J0126k300l457f666A6220J8902
62039C5122M043n176l174Q52j263o188o876m101m674b397j7689j8818j3488m422
62025e6814N847J5310a4411F282J1899m689a1666m1713m5819l4458j3517N754
62013a41419J4804J3985J1332J4085K0721K3097J6695N468m896j3799k2043k6090
62001h8060k2779j7176j7574k2654k1010n064K0237M3147N3382c2645a2995q385
61989b1380k0975j2886L558J3440J2363L304r023j5816p481J1479K0661Q227j0356
61976b4885j1259N735a1202E600P376J585k501C295h862p587J29M002N336A409
61961A2293Q012J254m795F406a0978k1890j8157r329n077p914r612l881L703L013
$$ y = [-71368, -83462, -79295, -65376, -54867, -48730, -37844, -21492, -11366, -13666, -17123, -6666, 16220, 35122, 39165, 33989, 30815, 31667, 30404, 24216, 17340, 13239, 8565, -2397, -20086, -38904, -52392, -56814, -50967, -35657, -14411, 6282, 18181, 13492, -11666, -53379, -99198, -133656, -147173, -141419, -126615, -112630, -101298, -87213, -66492, -43395, -26700, -21232, -26128, -39927, -61970, -88060, -110839, -128015, -145589, -168243, -189253, -194317, -174080, -130933, -77551, -32645, -12995, -21380, -42355, -55241, -51683, -38243, -25880, -22576, -31599, -47415, -54896, -43417, -22756, -14529, -24885, -36144, -30409, -11202, 5600, 12976, 14561, 12060, 3295, -8862, -16449, -16320, -12318, -6982, 1409, 12293, 20305, 21559, 16764, 6406, -10978, -32868, -51025, -60354, -65431, -73345, -82957, -86838, -83135, -80122]
61947h0122o704j5117j2851k198N743L659m208p877l647K613M271K478L533R453
61933a00974J4147R509n245k0631k4575j4553p51N502M834O697J4059J8533J3166
61920h0282K995k451j905r53j148J750R097J5446J4916P509j781p232n783P05
61906d9117O455O884J633q559k3478l7839l9592k2610J174J2134N637m980q733
61893a60991q353p702j142J4598K7690K3743O833m411l81J0836J8069J9054J5853
61880d6304Q826j82o386q604j1273j6048j7789j3485q722r209j0809n051Q228
61867a36808K0040K2785J7035Q985M818N940P202K613m924m726O653J7429J4437
61854a8521J66j1913j4707j0712j694J2564a9489E967J2236k244G350a289n717
$$ y = [-80122, -86826, -101943, -114794, -116992, -111249, -107590, -111798, -119675, -123322, -120709, -116438, -113960, -110427, -100974, -86827, -77318, -82563, -103194, -127769, -142322, -143073, -137571, -132737, -126040, -111981, -93448, -80282, -77287, -79738, -81643, -82596, -83744, -81994, -72897, -57451, -42535, -35026, -36807, -44039, -49822, -49117, -42662, -35778, -34145, -42704, -66182, -104021, -143613, -166223, -165049, -152915, -147278, -152258, -160991, -169344, -177046, -178188, -163590, -135900, -112157, -105324, -109735, -110116, -99280, -81211, -62157, -46304, -37478, -37660, -44046, -52650, -63923, -79971, -97760, -111245, -119967, -129176, -139985, -145036, -136808, -116768, -93983, -76948, -67963, -63145, -57205, -50003, -47390, -52314, -57040, -50387, -32958, -18521, -18355, -30268, -44975, -55687, -57381, -44817, -19489, 5967, 18203, 15959, 7350, -1289, -7006]
61841g006J070A716K444a2480l2101k6001l524J4188J6198R003R17o876j2743
61828e3419j0730N34J3047J8138J5170h038c143H05M466J393g94j6453j8447j4929
61814e0623j2499j0564k649R138J3168O385J517Q347J8017c343A742a806o105
61801g911r415j4420j3695o703l716r686j5582j2401m324j36K61J662K295k169
61787i5940o855j812J2111K2231K1202J5510J2773J0014J831o992p038N79M498
61774a7888r70q738j0282o711l949k532J293O832P981J535q463j6233k0337k1724
61760a00186j8937r747K888J1214J1419Q673R551J1584O463n867j3819r645k029
61747i8438n016j7512k4180j7251o868m860p617l446R018J9618K1707J8995J6942
$$ y = [-7006, -5936, 1716, 4160, -12480, -44581, -70582, -74106, -59918, -43720, -34717, -33800, -40676, -53419, -64149, -63615, -50568, -32430, -17260, -8038, -3143, 805, 5271, 6664, -794, -17247, -35694, -50623, -63122, -73686, -76335, -67197, -54029, -47644, -46127, -37780, -19763, -3343, 1742, -1806, -7911, -17326, -31746, -45441, -52144, -55860, -65546, -81128, -93529, -97853, -97989, -97728, -96066, -93771, -95940, -102795, -104607, -92496, -70265, -49063, -33553, -20780, -10766, -8935, -15927, -22965, -22386, -17888, -18858, -27596, -37878, -44589, -48538, -51070, -49777, -42945, -34964, -33429, -41892, -58125, -78462, -100186, -119123, -128870, -125982, -114768, -103349, -94676, -85125, -73541, -67078, -72945, -86764, -96409, -98438, -103454, -120966, -145146, -162397, -169265, -174125, -181742, -185188, -176170, -156552, -134845, -115850, -98908]
61734i8908J5519J3046J0774R877Q178L425k904q092j2457j8252k5114k8451k2668
61721a56027o602J2873K3969K0317Q482J514M273R500R952Q717J2591J9475a1205
61707a553m049j4165k1416k8435l1316k4355j0466J370R137J8966L0113K8845
61695d7324O631k1901l1970j9104m271n548j6186j7843o215O605R959M491l257
61682a45933o437J154J9992L8763M1154K2588m004k1227k2541j4073n683k030
61670i8277Q4O082J4140J4544K688j1537j4803p867k558k940j480M768P863M427
61656h4866M333J4204K2812J5760j735j0783m830L820M028n08j638lq10l046j229
61641d4491M380O373J04r385j3271j0113p257r614j1156l285J0067J4402M225
$$ y = [-98908, -83389, -70343, -59569, -49692, -41514, -38089, -40993, -49085, -61542, -79794, -104908, -133359, -156027, -162629, -149756, -125787, -105470, -96988, -95474, -91201, -81701, -71749, -63032, -50441, -30966, -11205, -1553, -5602, -19767, -41183, -69618, -100934, -125289, -135755, -134385, -125248, -106282, -76169, -47324, -40693, -62594, -94564, -113668, -117939, -123487, -139673, -157516, -163731, -157126, -147167, -142676, -145933, -152370, -151216, -131224, -92461, -51307, -28719, -32723, -53950, -76491, -90564, -96247, -98277, -98193, -92111, -77971, -63427, -60739, -72276, -87079, -94946, -97504, -100444, -101924, -97156, -89293, -84866, -80533, -66329, -43517, -27757, -29492, -40275, -45105, -41285, -37257, -37765, -39403, -39406, -40216, -43262, -44491, -40111, -33738, -33634, -43019, -56290, -66403, -73660, -83274, -94430, -97715, -87648, -73246, -69021]
61628f9021q452j1044p069o112m803P274K5178K9183J1973r377j6105j0124m070
61615g2569n84M727P619k78j3088j3907K72J1852P904q92K186J2718J0632r515
61601e2923k8579k7306r865M576O937N145P747J0840O252l271n530M314J5888
61588f5775J7041J0208P922J3784B22Q676C506i328j0796n978l420l321n985j0830
61574d9658j1936m444M817M043m771n969O425J8326J6692R141g165I549J3085
61561B2634l684f5k1629j5165o711K850J2037J3852N597m250o512l096j815m260
61547b9167n726l850o24K372N026N599J355p273j5725j8553j2700M63J4347K0370
61533d4086J4698J326j2282k1142k3785k0053j0096M946K1740L3790b1311a962
$$ y = [-69021, -77473, -88517, -95586, -101698, -106501, -99227, -74049, -44866, -32893, -42270, -58375, -68499, -72569, -73153, -68426, -60807, -61085, -74173, -88080, -87808, -75956, -68052, -68944, -66758, -54040, -43408, -52923, -81502, -108808, -118673, -114097, -107160, -102015, -94268, -83428, -77176, -80447, -85977, -81663, -65775, -48734, -38526, -30604, -16820, 222, 8898, 3506, -9328, -20124, -26102, -29522, -32843, -38828, -49658, -61594, -66038, -61221, -57178, -61949, -67918, -61493, -43167, -26475, -17334, -7165, 9549, 22634, 18950, -65, -21694, -36859, -43570, -40720, -28683, -14831, -9234, -13484, -19996, -23092, -24907, -29167, -34893, -38743, -39367, -36995, -31969, -26370, -25015, -32288, -48013, -66566, -79266, -78803, -64456, -44086, -29388, -28062, -40344, -61486, -85271, -105324, -115420, -110474, -88734, -54944, -21311, -1962]
61520c592j8345k5365k3587j5064k746O849Q733P174J0237J6110J4119J826r148
61507c2799r239l606k094m635m710q73L523P043Q708M684n183j2218r437l026
61493f3862l337q115o878o49l321j9759l4773l1460j2797L555P742O445R354J4343
61479a43512J0791m346j9172j8978l446J3102J8636J4872J0127P391M553J513
61467a08469P52L083P663J4038K0370K2915a8684f22A3767M418F834a2939j0662
61454b3601N904g486j226j3139j4719j1959j3729j7821j7168j0829k372N503Q888
61441i6057K098j3563k5428k1201k993J5693K4927K5253K1240J4422M735m390
61429e5264o833j463L593o46j0849j3126j702J1227J1634L608K538J1614J7714
$$ y = [-3592, -21937, -47302, -70889, -85953, -88699, -81850, -73117, -65943, -55706, -39596, -25477, -23651, -32799, -42038, -45644, -47738, -52373, -57083, -57956, -54433, -47390, -38682, -33998, -39181, -51399, -60836, -63862, -67199, -75314, -82192, -82841, -86162, -105921, -140694, -172154, -184951, -181396, -173654, -167209, -157855, -143512, -132721, -137067, -156239, -175217, -178663, -165561, -146925, -132053, -121926, -114535, -109982, -108469, -107717, -104634, -96971, -82933, -62563, -39648, -18684, -622, 13767, 18185, 6834, -12939, -23601, -17697, -7486, -8712, -21851, -36570, -48529, -62258, -80079, -97247, -108076, -110448, -104945, -96057, -93959, -107522, -132950, -154151, -157144, -141451, -116524, -91271, -70031, -55609, -50874, -55264, -62097, -63560, -59967, -60613, -71462, -84588, -86290, -75063, -63429, -59821, -57283, -45669, -27955]
61416b7955J1223k220j3072j9679k3655k3310j8504j4541j4365j2700m584N313
61404a58049Q642N200K531N497J0770J0922K305r582j3242m124P264P733J006
61391a23127L700J9256K9425J9453k79r419n406k093o028r281n543J97J113k403
61377i0435p032j2043j6396j6321j0135j784L908P172J1772J8585K2483J6437
61365g3789R5j5857j7611l208J3257J5834K934j3466k1319j6946l674J1198J9006
61352a03546J5613O148Q3Q72L529K272k572n664k541N549J1748J0397M533K665
61338e0914N928M132r894k6848l0013j5793K822J3090J4662J3574J2178R547O400
61325e1129M062O94o759j6851k2636j7699l123J1939J7560J1445l89j0465j5059
$$ y = [-27955, -16732, -18952, -32024, -51703, -75358, -98668, -117172, -131713, -146078, -158778, -163362, -158049, -149407, -144207, -141676, -136179, -125409, -114487, -112182, -121764, -135006, -139130, -131866, -124133, -123127, -119427, -100171, -70746, -51293, -51572, -60991, -66397, -68490, -74518, -83799, -89342, -89145, -88032, -90435, -97467, -109510, -125906, -142227, -152362, -154146, -150238, -143066, -131294, -112709, -90226, -73789, -73694, -89551, -107162, -110370, -97113, -81279, -78345, -91811, -113130, -130076, -133750, -122552, -103546, -87933, -81785, -81702, -80830, -77301, -75029, -77601, -83265, -85806, -80257, -68509, -58112, -53579, -50914, -44986, -40854, -50748, -77596, -107609, -123402, -120580, -107490, -92828, -79254, -67076, -57529, -51129, -47067, -46373, -53132, -69983, -92619, -110318, -113441, -101502, -83942, -72497, -72886, -83351, -98410]
61312i8410j3240n738K979O285L106N47M399J0097Q446j867j2797j6725j3021
61299a25939n942l80J460K622Q427J7334J9075Q230m563m321P025J1344k223k3583
61285i1434l4536k7867j0141P672J8093K0760K2233K8429c1670g98A1041e13k5460
61272b5973k5337j5776m063K609K76o092n403N649J6848J8189J2797Q367K368
61259a5541j2165k9071l1598j5260L819R075K504l248l325j608R63P441J5348
61246g2666J6532Q689r38n800o479l971N159K0684f706B1333R715j1575g110l1439
61232c8549k3271l368J6319K0888R633k859n300j137J039q15m411q019p613J882
61218d5581J5829a0221c206q483j2462q882r799j3524r332O87K634o168j2344
$$ y = [-98410, -111650, -117388, -114409, -108124, -105018, -104471, -100072, -89975, -81529, -83396, -96193, -112918, -125939, -131881, -132261, -130801, -128179, -119752, -102418, -83343, -75113, -79676, -83997, -76972, -65628, -67851, -91434, -125970, -153837, -163978, -156306, -138213, -117453, -95220, -66791, -31670, -798, 11041, -513, -25973, -51310, -67086, -71149, -68540, -68264, -74356, -79759, -74110, -57262, -39073, -26276, -17909, -15541, -27706, -56777, -88375, -103635, -99816, -90741, -88237, -91485, -94810, -96418, -95455, -88014, -72666, -56134, -47445, -48383, -54183, -60662, -64633, -59474, -38790, -6706, 21333, 31048, 19473, -7110, -38549, -61820, -65188, -48869, -27981, -18348, -21207, -26507, -27644, -26605, -27420, -31831, -39850, -47463, -45581, -29752, -10221, -3206, -11689, -24151, -33033, -42832, -56356, -65688, -65001, -62367, -68535, -80879]
61205h0879p913o63K131N413J3803K0039J5709L812q284j9348k8650k9073j7316
61192a31219l913q13l910l04J0299J4900P920l08O34P148Q962L996q4L573J2834
61177g0285J8196J1930k925j3425r476N000J6917J8660a1926d821K86q090j5380
61164b8005j6410q930L781J4445J5851O207q030j6765j5471q985n966j0740k0480
61151i9498k8135k7561j7890m439N268P393M134J089K809R673J7675K1997K1799
61138h5686K0279J9157J5831Q374M39l083l237m742p408o073j23L260j462j0208
61124e4682j4498j1020k641O388J2014J0856M392j70R22O68r098k2330k3054p469
61110a09722Q105P356n619j3971j0515k581K934Q485J8132K9226c2659H62K3556
$$ y = [-80879, -88792, -89455, -87324, -81911, -68108, -48069, -32360, -28548, -36832, -56180, -84830, -113903, -131219, -135132, -135945, -139855, -140159, -129860, -114960, -107040, -107348, -106714, -99566, -90604, -86608, -86692, -83119, -70285, -52089, -40159, -43084, -56509, -65985, -60985, -44068, -25408, -11926, -4821, -4535, -12625, -28005, -44415, -53345, -49564, -35119, -19268, -13061, -21091, -37856, -53327, -62312, -68278, -79018, -99498, -127633, -155194, -173084, -177523, -172255, -164862, -160728, -159639, -156830, -147157, -129482, -107485, -85686, -65407, -46250, -30419, -22045, -21606, -24689, -27926, -32668, -40076, -46149, -46272, -43012, -44474, -54682, -69180, -80200, -82841, -76453, -64439, -53583, -49191, -49361, -48439, -47771, -56869, -79199, -102253, -109722, -101617, -94261, -99880, -113851, -124366, -126947, -124013, -115528, -97396, -68170, -32659, 862, 24418]
61097B4418Q680n370A3734d931k3526k6598k1212p653M547R328J1191J4650J5204
61084b9000Q370K11j121R72k615j0581j2830p274l143n770q922n867P76M744M529
61069f7521J927j594l399n57M376M429j201l976J878J0038J0717L701l907r418
61055e4507j6528k6111l1435k4877p003J2412K2374K0058J1872M635j327p128
61043i7565p780K024J5659J8449O434q012j3338j2132j1312r035j423M882k91
61030a13440j3224j7818o425R485J2759m43j7700k3064j1108R883K7253L5189
61018a08653L4654K4957L933k1154l3032k3012l875M834k82p291q311o659o135
61005a50026m601K20P453J6944K8428L5934L1259J4982k980j4501j8105j3973
$$ y = [24418, 33098, 27728, 13734, -4931, -28457, -55055, -76267, -83920, -79373, -70045, -58854, -44204, -29000, -20630, -20419, -21540, -20568, -23183, -33764, -46594, -53868, -57011, -62781, -71703, -77570, -76794, -72050, -67521, -65594, -67188, -70587, -71144, -66768, -62339, -63540, -67516, -65638, -55600, -44883, -41182, -45089, -54507, -71035, -97146, -128581, -153458, -160461, -148049, -125675, -105617, -93745, -89110, -90437, -97565, -105345, -103321, -87662, -69213, -62779, -70791, -84129, -96261, -107573, -116608, -118031, -113149, -113440, -126664, -144482, -150907, -141422, -128663, -129106, -146806, -169870, -180978, -171095, -143842, -108653, -73999, -49042, -45109, -66263, -99295, -122307, -126182, -121348, -121630, -128921, -137232, -143891, -150026, -154627, -154407, -146954, -130010, -101582, -65648, -34389, -19407, -22387, -36888, -54993, -68966]
60993f8966m107K572k744j3921j4424j271Q418J937j0741j3704q587p434j0348
60980a43320o793M312J2096J1685R864J0291O707l702j2289j1773p664q213j0197
60967a48996m671P376J5307J4037J0178J1375J5791J5390O388o157j3356j1106
60955h8444l583K426N836J0266J4687J1696o20j1484r961r26R77q205j7662j8913
60941a13910j6038j5154j4052q796k379P46K107L894K814k292k914Q565K5140
60928a32269L2835K9055K2140J5417M867p647j2411o108L432R646J3485a2900
60915c829r50o358o656j1746k1630j9698J743K3210K1582K236j0023n763K093
60902c5789L155J770K340L27n971q796l819J360m91m171p89P719J1281N609l701
$$ y = [-68966, -73073, -70501, -73245, -87166, -101590, -102861, -94443, -92506, -103247, -116951, -125538, -132972, -143320, -150113, -145801, -133705, -122020, -112156, -101865, -95158, -98860, -111149, -122922, -130586, -138799, -148996, -153667, -146291, -130984, -116947, -106769, -95394, -79603, -64213, -57825, -63982, -77338, -88444, -92027, -89601, -83765, -73499, -58812, -47116, -47736, -59220, -69181, -70107, -69130, -77335, -94997, -113910, -129948, -145102, -159154, -167950, -170329, -169583, -167476, -163582, -160768, -163060, -165974, -157409, -132269, -99434, -70379, -48239, -32822, -27955, -35602, -48013, -54121, -50689, -41043, -27558, -12900, -3829, -4779, -11137, -17793, -29539, -51169, -70867, -69124, -45914, -24332, -22096, -32119, -37882, -35789, -32634, -30864, -28524, -28197, -34168, -42964, -46783, -45423, -45914, -50085, -50874, -43155, -31874, -26265, -29966]
60887b9966r604j0690r770q966p635m442j49L606Q131J5962K3501h639a085n814
60873f899o601M48J126o868j1993q219l323m405o970m625j68P64P0L141Q737J0045
60857c5740L741o571j3681j0877L147J9807a4983a355n849j9499k1697j5638o649
60844g0687O30K852J352K289Q509J3812J0199j071j0722j2879j0464r187j0329
$$ y = [-29966, -39570, -50260, -60030, -68996, -76631, -81073, -81222, -77616, -69485, -53523, -30022, -8639, -1085, -6899, -13500, -13052, -11926, -18794, -30787, -39006, -42329, -46734, -53704, -58329, -58497, -57733, -57663, -54522, -45785, -35740, -31999, -38570, -52251, -63128, -59981, -40174, -14983, -1355, -7204, -26703, -48400, -64038, -70687, -70057, -67205, -65853, -63564, -55055, -41243, -31044, -32115, -42837, -55716, -66180, -75367, -85696]
$$ [...]
##END NTUPLES=NMR SPECTRUM
##END=
