##TITLE=coffee_type TOCA01-ROVE100D_50-50%
COFFEE_meoh_noesyp64 COFFEE_meoh {C:\Bruker\TOPSPIN} Administrator 3
##JCAMPDX= 6.0         $$ Bruker NMR JCAMP-DX V2.0
##DATA TYPE= NMR SPECTRUM
##DATA CLASS= NTUPLES
##ORIGIN= Bruker BioSpin GmbH
##OWNER= Administrator
$$ 1.72 TOPSPIN		Version 2.1
$$ 2012-05-18 15:46:29.964 -0700  Administrator@X
$$ Compression mode = diff/dup
##.OBSERVE FREQUENCY= 400.13188235
##.OBSERVE NUCLEUS= ^1H
##.ACQUISITION MODE= SIMULTANEOUS (DQD)
##.ACQUISITION SCHEME= undefined
##.AVERAGES= 64
##.DIGITISER RES= 22
##SPECTROMETER/DATA SYSTEM= spect
##.PULSE SEQUENCE= noesygpps1d.comp
##.SOLVENT NAME= COFFEE_meoh
##.SHIFT REFERENCE= INTERNAL, COFFEE_meoh, 1, 14.98061
##AUDIT TRAIL= $$ (NUMBER, WHEN, WHO, WHERE, PROCESS, VERSION, WHAT)
$$ ##TITLE= Audit trail, TOPSPIN		Version 2.1
$$ ##JCAMPDX= 5.01
$$ ##ORIGIN= Bruker BioSpin GmbH
$$ ##OWNER= Administrator
$$ $$ C:\Bruker\TOPSPIN/data/Administrator/nmr/12-COFFEE-2402/52/pdata/1/auditp.txt
$$ ##AUDIT TRAIL=  $$ (NUMBER, WHEN, WHO, WHERE, PROCESS, VERSION, WHAT)
(   1,<2012-02-24 19:53:37.562 -0500>,<Administrator>,<TOPSPIN>,<go>,<TOPSPIN 2.1>,
      <created by zg
	started at 2012-02-24 19:42:07.453 -0500,
	POWCHK enabled, PULCHK disabled,
       configuration hash MD5:
       B0 76 FB 9C 50 81 44 7D 18 B3 26 32 4E 60 AD 96
       data hash MD5: 64K
       FB F1 B9 F9 F5 9A E3 C3 94 20 62 3A 03 37 2D 1E>)
(   2,<2012-02-24 19:53:40.422 -0500>,<Administrator>,<TOPSPIN>,<proc1d>,<TOPSPIN 2.1>,
      <Start of raw data processing
       efp LB = 0.3 FT_mod = 6 PKNL = 1 PHC0 = 0 PHC1 = 0 SI = 128K 
       data hash MD5: 128K
       26 3D 71 66 19 75 A3 74 FD 67 B5 4E 50 57 6B 0A>)
(   3,<2012-02-24 19:53:41.687 -0500>,<Administrator>,<TOPSPIN>,<proc1d>,<TOPSPIN 2.1>,
      <pk PHC0 = 18.05603 PHC1 = 0 
       data hash MD5: 128K
       C6 5C 3D 0C 79 02 54 63 45 CC 87 A2 F6 23 95 BC>)
(   4,<2012-02-24 19:53:41.969 -0500>,<Administrator>,<TOPSPIN>,<proc1d>,<TOPSPIN 2.1>,
      <abs ABSG = 1 
       data hash MD5: 128K
       F5 FD D8 5C 7D 17 C2 1A AB D1 A6 AE A1 1D A0 98>)
(   5,<2012-02-24 19:53:42.047 -0500>,<Administrator>,<TOPSPIN>,<proc1d>,<TOPSPIN 2.1>,
      <abs ABSG = 2 
       data hash MD5: 128K
       6E A7 5B 5B 32 84 3D 75 26 CC DA F5 0C 6D 39 D0>)
(   6,<2012-02-24 19:53:42.094 -0500>,<Administrator>,<TOPSPIN>,<proc1d>,<TOPSPIN 2.1>,
      <abs ABSG = 3 
       data hash MD5: 128K
       C2 09 B5 03 B6 02 C4 B9 C6 6A 92 88 7E 80 87 D8>)
(   7,<2012-02-24 19:53:42.172 -0500>,<Administrator>,<TOPSPIN>,<proc1d>,<TOPSPIN 2.1>,
      <abs ABSG = 4 
       data hash MD5: 128K
       C5 1A 9B B9 54 3B 14 10 DB F6 5C 9D 1D 59 DA 82>)
(   8,<2012-02-24 19:53:42.219 -0500>,<Administrator>,<TOPSPIN>,<proc1d>,<TOPSPIN 2.1>,
      <abs ABSG = 5 
       data hash MD5: 128K
       B6 62 EF DA D2 2E BF 40 CE 9C 34 36 8A 6D 31 2B>)
(   9,<2012-02-24 19:53:42.344 -0500>,<Administrator>,<TOPSPIN>,<audit>,<TOPSPIN 2.1>,
      <user comment:
       ICON-NMR User ID: Administrator
$$ [...]
150 150 150 150 150 150 150 150
##$TP07= 0
##$TPNAME0= <>
##$TPNAME1= <>
##$TPNAME2= <>
##$TPNAME3= <>
##$TPNAME4= <>
##$TPNAME5= <>
##$TPNAME6= <>
##$TPNAME7= <>
##$TPOAL= (0..7)
0.5 0.5 0.5 0.5 0.5 0.5 0.5 0.5
##$TPOFFS= (0..7)
0 0 0 0 0 0 0 0
##$TUNHIN= 0
##$TUNHOUT= 0
##$TUNXOUT= 0
##$USERA1= <user>
##$USERA2= <user>
##$USERA3= <user>
##$USERA4= <user>
##$USERA5= <user>
##$V9= 5
##$VALIST= <valist>
##$VCLIST= <CCCCCCCCCCCCCCC>
##$VD= 0
##$VDLIST= <DDDDDDDDDDDDDDD>
##$VPLIST= <PPPPPPPPPPPPPPP>
##$VTLIST= <TTTTTTTTTTTTTTT>
##$WBST= 1024
##$WBSW= 4
##$XGAIN= (0..3)
0 0 0 0
##$XL= 0
##$YL= 0
##$YMAX_a= 13269657
##$YMIN_a= -6210501
##$ZGOPTNS= <>
##$ZL1= 120
##$ZL2= 120
##$ZL3= 120
##$ZL4= 120
##$ABSF1= 14.98061
##$ABSF2= -5.57192
##$ABSG= 5
##$ABSL= 3
##$ALPHA= 0
##$AQORDER= 0
##$ASSFAC= 0
##$ASSFACI= 0
##$ASSFACX= 0
##$ASSWID= 0
##$AUNMP= <proc_prof1d_extract>
##$AXLEFT= 0
##$AXNAME= <>
##$AXNUC= <1H>
##$AXRIGHT= 0
##$AXTYPE= 0
##$AXUNIT= <>
##$AZFE= 0.1
##$AZFW= 0.1
##$BCFW= 0
##$BC_mod= 0
##$BYTORDP= 0
##$COROFFS= 0
##$CY= 15
##$DATMOD= 1
##$DC= 0
##$DFILT= <>
##$DTYPP= 0
##$F1P= 0
##$F2P= 0
##$FCOR= 0.5
##$FTSIZE= 131072
##$FT_mod= 6
##$GAMMA= 0
##$GB= 0
##$INTBC= 1
##$INTSCL= 1
##$ISEN= 128
##$LB= 0.3
##$LEV0= 0
##$LPBIN= 0
##$MAXI= 10000
##$MC2= 0
##$MEAN= 0
##$ME_mod= 0
##$MI= 0
##$NCOEF= 0
##$NC_proc= -3
##$NLEV= 6
##$NOISF1= 0
##$NOISF2= 0
##$NSP= 0
##$NTH_PI= 0
##$NZP= 0
##$OFFSET= 14.98061
##$PC= 1
##$PHC0= 18.05603
##$PHC1= 0
##$PH_mod= 1
##$PKNL= yes
##$PPARMOD= 0
##$PPDIAG= 0
##$PPIPTYP= 0
##$PPMPNUM= 2147483647
##$PPRESOL= 1
##$PSCAL= 4
##$PSIGN= 0
##$PYNMP= <proc.py>
##$REVERSE= no
##$SF= 400.13
##$SI= 131072
##$SIGF1= 0
##$SIGF2= 0
##$SINO= 400
##$SIOLD= 131072
##$SPECTYP= <>
##$SREGLST= <1H.CDCl3>
##$SSB= 0
##$STSI= 131072
##$STSR= 0
##$SW_p= 8223.68421052632
##$SYMM= 0
##$S_DEV= 0
##$TDeff= 65536
##$TDoff= 0
##$TI= <>
##$TILT= no
##$TM1= 0
##$TM2= 0
##$TOPLEV= 0
##$USERP1= <user>
##$USERP2= <user>
##$USERP3= <user>
##$USERP4= <user>
##$USERP5= <user>
##$WDW= 1
##$XDIM= 131072
##$YMAX_p= 487556815
##$YMIN_p= -316104729
##$CURPLOT= <Network HP LaserJet P1505>
##$CURPRIN= <$Network HP LaserJet P1505>
##$DFORMAT= <normdp>
##$LAYOUT= <+/1D_H.xwp>
##$LFORMAT= <normlp>
##$PFORMAT= <normpl>
##$SURQMSG= 1
$$ End of Bruker specific parameters
$$ ---------------------------------
##NTUPLES= NMR SPECTRUM
##VAR_NAME=  FREQUENCY,     SPECTRUM/REAL,   SPECTRUM/IMAG
##SYMBOL=    X,             R,               I
##VAR_TYPE=  INDEPENDENT,   DEPENDENT,       DEPENDENT
##VAR_FORM=  AFFN,          ASDF,            ASDF
##VAR_DIM=   131072,        131072,          131072
##UNITS=     HZ,            ARBITRARY UNITS, ARBITRARY UNITS
##FACTOR=    0.0627417313425165, 1,          1
##FIRST=     8223.62146879498, 4308,         -89040
##LAST=      0,             7163,            -88317
##MIN=       0,             -316104729,      0
##MAX=       8223.62146879498, 487556815,    0
$$ Real data points
##PAGE= N=1
##DATA TABLE= (X++(R..R)), XYDATA
$$ [...]
$$ plain form
60709 1271737 1276540 1280210 1283546 1286945 1290063 1292574 1294702 1296888 1299423 1302265 1304739 1305738 1304736 1302286
60695 1302286 1299094 1295255 1290951 1287014 1283899 1280921 1277582 1274876 1274009 1274444 1274588 1274011 1273612 1273826 1273953 1273061
60679 1273061 1270417 1265249 1257361 1248020 1239117 1231354 1224037 1216438 1208507 1200410 1192156 1183460 1173471 1161289
60665 1161289 1147482 1134232 1122888 1112275 1100760 1089163 1079907 1073744 1069076 1064321 1059347 1054700
60653 1054700 1051087 1049693 1051379 1055254 1059227 1062048 1063623 1063549 1060920 1055766 1049101 1041200 1031358 1019809
60639 1019809 1008310 997959 987601 975485 961760 948299 936394 925402 913762 900922 888090
60628 888090 877089 868740 862638 858252 855304 853031 850312 847106 844660 843497 842343 840000 837135 835105
60614 835105 834223 834446 836402 840079 843811 846619 850458 857743 867533 876777 884790 893576 903949 914498
$$ packed form
60709A271737M803L670L336L399L118K511K128K186K535K842K474R99j002k450
60695A302286l192l839m304l937l115k978l339k706q67M35J44n77l99K14J27q92
60679A273061k644n168p888r341q903p763p317p599p931q097q254q696r989j2182
60665A161289j3807j3250j1344j0613j1515j1597r256o163m668m755m974m647
60653A054700l613j394J686L875L973K821J575p4k629n154o665p901r842j1549
60639A019809j1499j0351j0358j2116j3725j3461j1905j0992j1640j2840j2832
60628H88090j1001q349o102m386k948k273k719l206k446j163j154k343k865k030
60614H35105q82K23J956L677L732K808L839P285R790R244Q013Q786J0373J0549
$$ plain form
60600 914498 924950 937423 953024 969657 984732 998158 1011263 1024561 1038297 1053728 1071969
60589 1071969 1092149 1112207 1131190 1149774 1168791 1188020 1206421 1223282 1239244 1255955 1274129
60578 1274129 1292259 1308057 1320810 1331425 1340736 1349141 1357288 1365166 1370695 1371390 1367560 1361778 1354806
60565 1354806 1344504 1329693 1312817 1297253 1283664 1270461 1256423 1241292 1225017 1208232 1192855
60554 1192855 1180732 1171836 1164645 1157891 1151364 1145673 1141873 1140754 1141984 1144611 1148689 1155431 1165368 1177455
60540 1177455 1190484 1204210 1218604 1233203 1247985 1263533 1279485 1293958 1305452 1314279 1321255 1326242
60528 1326242 1329068 1330819 1332946 1335786 1339001 1342675 1347004 1351634 1356259 1361125 1366067 1369820 1371243 1370489
60514 1370489 1368243 1364613 1359509 1353088 1344963 1334226 1321436 1309365 1300265 1293145 1285244 1275550 1265445
$$ packed form
60600I14498J0452J2473J5601J6633J5075J3426J3105J3298J3736J5431J8241
60589A071969K0180K0058J8983J8584J9017J9229J8401J6861J5962J6711J8174
60578A274129J8130J5798J2753J0615R311Q405Q147P878N529O95l830n782o972
60565A354806j0302j4811j6876j5564j3589j3203j4038j5131j6275j6785j5377
60554A192855j2123q896p191o754o527n691l800j119J230K627M078O742R937J2087
60540A177455J3029J3726J4394J4599J4782J5548J5952J4473J1494Q827O976M987
60528A326242K826J751K127K840L215L674M329M630M625M866M942L753J423p54
60514A370489k246l630n104o421q125j0737j2790j2071r100p120p901r694j0105
$$ plain form
60501 1265445 1256409 1248727 1242297 1237364 1234315 1233576 1235531 1239857 1245368 1251300 1258243 1267013 1277345 1288700
60487 1288700 1301656 1317238 1335359 1355208 1376898 1401579 1430194 1463130 1500785 1543358 1590365
60476 1590365 1641404 1697228 1759072 1827343 1902017 1983984 2074655 2174114 2280522 2390981 2501833
60465 2501833 2608361 2705546 2789376 2856634 2903878 2928446 2931186 2917245 2893514 2865675 2837635
60454 2837635 2812625 2793690 2782914 2780251 2783272 2788607 2794144 2799698 2805500 2810920 2815368 2819698 2825763
60441 2825763 2835093 2849039 2869589 2898637 2936555 2982796 3037965 3104115 3182887 3274520 3379075
60430 3379075 3497617 3631680 3782126 3948602 4129238 4320697 4519542 4724274 4935732
60421 4935732 5155520 5385017 5626445 5884317 6165242 6476664 6825992 7220095 7664381
$$ packed form
60501A265445r036p682o430m933l049p39J955M326N511N932O943Q770J0332J1355
60487A288700J2956J5582J8121J9849K1690K4681K8615L2936L7655M2573M7007
60476A590365N1039N5824O1844O8271P4674Q1967R0671R9459J06408J10459J10852
60465B501833J06528R7185Q3830O7258M7244K4568K740j3941k3731k7839k8040
60454B837635k5010j8935j0776k663L021N335N537N554N802N420M448M330O065
60441B825763R330J3946K0550K9048L7918M6241N5169O6150P8772R1633J04555
60430C379075J18542J34063J50446J66476J80636J91459J98845K04732K11458
60421D935732K19788K29497K41428K57872K80925L11422L49328L94103M44286
$$ plain form
60412 7664381 8161587 8710727 9305747 9933265 10570059 11182379 11729066 12168301 12464996
60403 12464996 12595271 12547481 12322627 11935665 11415236 10798850 10125058 9427288 8731663
60394 8731663 8057241 7416867 6818486 6266772 5764074 5310445 4903848 4541050 4218392
60385 4218392 3931850 3677048 3449787 3246739 3065635 2904871 2762881 2637653 2526674
60376 2526674 2427278 2337032 2253990 2176926 2105314 2038776 1976593 1918144 1863565 1813147 1766008
60365 1766008 1720388 1675713 1633452 1595264 1560955 1528978 1498339 1469233 1442347 1418365 1397704
60354 1397704 1379926 1363792 1348583 1334882 1323319 1313222 1303603 1294930 1288594 1284838 1282509 1280921
60342 1280921 1280673 1282314 1285272 1288619 1292183 1296528 1302264 1309617 1318207 1327197 1336083 1345304 1355527 1366527
$$ packed form
60412G664381M97206N49140N95020O27518O36794O12320N46687M39235K96695
60403A2464996J30275m7790k24854l86962n20429o16386o73792o97770o95625
60394H731663o74422o40374n98381n51714n02698m53629m06597l62798l22658
60385D218392k86542k54802k27261k03048j81104j60764j41990j25228j10979
60376B526674r9396r0246q3042p7064p1612o6538o2183n8449n4579n0418m7139
60365A766008m5620m4675m2261l8188l4309l1977l0639k9106k6886k3982k0661
60354A397704j7778j6134j5209j3701j1563j0097r619q673o336l756k329j588
60342A280921k48J641K958L347L564M345N736P353Q590Q990Q886R221J0223J1000
$$ plain form
60328 1366527 1377457 1388081 1398833 1409603 1419457 1427867 1435378 1442514 1448563 1452023 1452046 1449209 1444952
60315 1444952 1440323 1435071 1428075 1418904 1408697 1399067 1390455 1382138 1373587 1365069 1357058 1349956 1344416 1340962
60301 1340962 1338941 1336616 1332745 1327644 1322406 1317585 1313024 1308455 1303724 1298525 1292456 1285591 1278923 1273935
60287 1273935 1271418 1270759 1270810 1271323 1272802 1274821 1275676 1274468 1272588 1272042 1273028 1274378 1275849 1278396 1282390 1287250
60271 1287250 1292970 1300405 1309458 1318416 1325946 1332753 1340461 1349666 1359881 1370663 1381917 1393424 1404623
60258 1404623 1414437 1421029 1422548 1418890 1412184 1404825 1397367 1388937 1379163 1368845 1359117 1350768 1344269 1339596
60244 1339596 1335940 1332277 1328421 1325120 1323054 1322123 1321768 1321592 1321504 1321536 1321639 1321553 1320942 1319937 1319450 1320546 1323260
60227 1323260 1326368 1328610 1330046 1331983 1335602 1340949 1347351 1354558 1363151 1373848 1386764 1401559 1418164
$$ packed form
60328A366527J0930J0624J0752J0770R854Q410P511P136O049L460K3k837m257
60315A444952m629n252o996r171j0207r630q612q317q551q518q011p102n540l454
60301A340962k021k325l871n101n238m821m561m569m731n199o069o865o668m988
60287A273935k517o59N1N13J479K019Q55j208j880n46R86J350J471K547L994M860
60271A287250N720P435R053Q958P530O807P708R205J0215J0782J1254J1507J1199
60258A404623R814O592J519l658o706p359p458q430r774j0318r728q349o499m673
60244A339596l656l663l856l301k066r31l55j76q8L2J03q6o11j005m87J096K714
60227A323260L108K242J436J937L619N347O402P207Q593J0697J2916J4795J6605
$$ plain form
60214 1418164 1437053 1458647 1482478 1507033 1530609 1552434 1572847 1592344 1610804 1628011 1644612
60203 1644612 1661805 1680057 1698879 1718075 1738491 1761109 1786023 1812895 1841882 1873496 1908026
60192 1908026 1945885 1988149 2035934 2089344 2147794 2211277 2280527 2355929 2437082 2523669 2616124
60181 2616124 2715058 2820492 2931958 3049032 3171451 3298820 3430430 3565261 3702106 3839719
60171 3839719 3976838 4112070 4243842 4370385 4489509 4598647 4695834 4780925 4855165 4919202
60161 4919202 4972113 5012790 5041511 5059572 5068250 5069199 5065215 5059329 5053378 5048521 5046788 5050785 5061857
60148 5061857 5079918 5105270 5139310 5183025 5235998 5297570 5368013 5447932 5537362 5636205 5744805
60137 5744805 5863205 5990065 6122726 6257834 6391504 6519605 6638689 6746371 6840464 6918511
$$ packed form
60214A418164J8889K1594K3831K4555K3576K1825K0413J9497J8460J7207J6601
60203A644612J7193J8252J8822J9196K0416K2618K4914K6872K8987L1614L4530
60192A908026L7859M2264M7785N3410N8450O3483O9250P5402Q1153Q6587R2455
60181B616124R8934J05434J11466J17074J22419J27369J31610J34831J36845J37613
60171C839719J37119J35232J31772J26543J19124J09138R7187Q5091P4240O4037
60161D919202N2911M0677K8721J8061Q678R49l984n886n951m857j733L997J1072
60148E061857J8061K5352L4040M3715N2973O1572P0443P9919Q9430R8843J08600
60137E744805J18400J26860J32661J35108J33670J28101J19084J07682R4093P8047
$$ plain form
60127 6918511 6978946 7022025 7048453 7057415 7047214 7018008 6972747 6914997 6846976 6770493 6688904
60116 6688904 6606737 6527492 6452917 6384569 6324870 6275930 6238277 6211868 6198000 6199200 6217316
60105 6217316 6252561 6304221 6371069 6450694 6539477 6633738 6730050 6823975 6909552 6981117 7035377
60094 7035377 7071378 7089361 7090453 7076644 7049857 7011259 6962361 6906433 6848027 6791391 6740017
60083 6740017 6697044 6664983 6645449 6640282 6652550 6685154 6738600 6811503 6903342 7015590 7150184
60072 7150184 7308326 7491016 7699349 7933703 8193764 8479870 8793071 9132878 9495673
60063 9495673 9876096 10269365 10671312 11076558 11477515 11865315 12231481 12568993 12872262
60054 12872262 13136398 13356808 13529663 13652375 13723010 13739600 13700805 13607202 13461199 13265879
$$ packed form
60127F918511O0435M3079K6428Q962j0201k9206m5261n7750o8021p6483q1589
60116F688904q2167p9245p4575o8348n9699m8940l7653k6409j3868J200J8116
60105F217316L5245N1660O6848P9625Q8783R4261R6312R3925Q5577P1565N4260
60094G035377L6001J7983J092j3809k6787l8598m8898n5928n8406n6636n1374
60083F740017m2973l2061j9534n167J2268L2604N3446P2903R1839J12248J34594
60072G150184J58142J82690K08333K34354K60061K86106L13201L39807L62795
60063I495673L80423L93269M01947M05246M00957L87800L66166L37512L03269
60054A2872262K64136K20410J72855J22712P0635J6590l8795r3603j46003j95320
$$ plain form
60044 13265879 13025061 12744773 12433706 12101693 11758107 11411610 11070257 10741112 10430210
60035 10430210 10143138 9885072 9659831 9469336 9314136 9194039 9108321 9056140 9036986 9050083
60025 9050083 9093270 9163076 9255688 9366648 9489547 9616414 9740038 9854779 9954577 10031763
60015 10031763 10079463 10094793 10078753 10033494 9960833 9863081 9743907 9607692 9458123 9297397
60005 9297397 9126564 8946814 8760616 8571313 8381593 8192857 8006351 7824225 7649051
59996 7649051 7482940 7327817 7186131 7060548 6952985 6864380 6795195 6745800 6716584 6708079
59986 6708079 6720605 6753324 6803929 6869906 6949942 7043485 7148797 7261908 7377726 7491853
59976 7491853 7601068 7702264 7791538 7864730 7918727 7951883 7963367 7952788 7920526 7867532 7794247
$$ packed form
60044A3265879k40818k80288l11067l32013l43586l46497l41353l29145l10902
60035A0430210k87072k58066k25241j90495j55200j20097q5718n2181j9154J3097
60025I050083M3187O9806R2612J10960J22899J26867J23624J14741R9798P7186
60015A0031763M7700J5330j6040m5259p2661r7752j19174j36215j49569j60726
60005I297397j70833j79750j86198j89303j89720j88736j86506j82126j75174
59996G649051j66111j55123j41686j25583j07563q8605o9185m9395k9216q505
59986F708079J2526L2719N0605O5977Q0036R3543J05312J13111J15818J14127
59976G491853J09215J01196Q9274P3192N3997L3156J1484j0579l2262n2994p3285
$$ plain form
59965 7794247 7700432 7586798 7456164 7312189 7157737 6995782 6831456 6671647 6522345 6387289
59955 6387289 6268853 6168620 6086813 6022744 5976591 5949696 5942556 5953709 5981443 6025834 6088312
59944 6088312 6169771 6269554 6385690 6515693 6657853 6812106 6978816 7156060 7338593 7519701
59934 7519701 7693395 7854743 7999453 8124086 8226068 8303038 8352924 8375135 8370719 8340683
59924 8340683 8285073 8204558 8102184 7982765 7851233 7712300 7570936 7431958 7299242 7175842
59914 7175842 7064490 6967416 6886161 6822184 6777292 6752983 6749595 6766262 6801102 6851416 6914770
59903 6914770 6990458 7079203 7180954 7293741 7414854 7541921 7672311 7802725 7930239 8052698
59893 8052698 8167456 8271307 8362931 8444238 8517824 8584038 8641972 8692423 8738224 8782376 8827695
$$ packed form
59965G794247r3815j13634j30634j43975j54452j61955j64326j59809j49302j35056
59955F387289j18436j00233q1807o4069m6153k6895p140J1153K7734M4391O2478
59944F088312Q1459R9783J16136J30003J42160J54253J66710J77244J82533J81108
59934G519701J73694J61348J44710J24633J01982P6970M9886K2211m416l0036
59924H340683n5610q0515j02374j19419j31532j38933j41364j38978j32716j23400
59914G175842j11352r7074q1255o3977m4892k4309l388J6667L4840N0314O3354
59903F914770P5688Q8745J01751J12787J21113J27067J30390J30414J27514J22459
59893H052698J14758J03851R1624Q1307P3586O6214N7934N0451M5801M4152M5319
$$ plain form
59882 8827695 8877969 8937737 9010831 9100474 9210651 9345881 9509398 9702598 9926305 10181452
59872 10181452 10468434 10786713 11134931 11510225 11907304 12319041 12737716 13154319 13556543
59863 13556543 13928936 14255799 14523554 14720724 14837687 14868214 14811434 14671962 14458302 14181100
59853 14181100 13852179 13484268 13090833 12685204 12279103 11881955 11501673 11145411 10818831
59844 10818831 10525037 10265178 10040075 9850691 9697291 9579140 9495265 9444910 9427121 9440376
59834 9440376 9482810 9552585 9648044 9767540 9908668 10067192 10236810 10410007 10578658 10733984
59824 10733984 10867310 10971725 11042294 11074142 11061968 11003193 10900924 10761982 10592149 10394662
59814 10394662 10172799 9931567 9675841 9408152 9129358 8840999 8546565 8251103 7960112
$$ packed form
59882H827695N0274N9768P3094Q9643J10177J35230J63517J93200K23707K55147
59872A0181452K86982L18279L48218L75294L97079M11737M18675M16603M02224
59863A3556543L72393L26863K67755J97170J16963L0527n6780j39472k13660k77202
59853A4181100l28921l67911l93435m05629m06101l97148l80282l56262l26580
59844A0818831k93794k59859k25103j89384j53400j18151q3875n0355j7789J3255
59834I440376M2434O9775R5459J19496J41128J58524J69618J73197J68651J55326
59824A0733984J33326J04415P0569L1848j2174n8775j02269j38942j69833j97487
59814A0394662k21863k41232k55726k67689k78794k88359k94434k95462k90991
$$ plain form
59805 7960112 7678503 7410216 7158611 6926654 6716138 6527332 6360272 6215960 6095191
59796 6095191 5996439 5916215 5851695 5801964 5766462 5743265 5729390 5722325 5721387 5728452 5747223 5780590
59784 5780590 5828360 5888377 5959781 6043870 6141333 6249808 6364696 6481034 6593426 6694911
59774 6694911 6777391 6833628 6858907 6851599 6813221 6748101 6662248 6561767 6451528 6334509 6211995
59763 6211995 6084561 5953039 5818728 5683253 5548938 5419191 5297721 5187204 5089199 5005413
59753 5005413 4938158 4889051 4857549 4841021 4836039 4839617 4849974 4866750 4890486 4921562 4959407 5002430
59741 5002430 5048337 5094451 5137887 5175547 5204299 5222096 5229620 5230484 5229022 5227806 5227638 5229484 5235551
59728 5235551 5248544 5270841 5304674 5352408 5416165 5497451 5597304 5716439 5855073 6013101 6190880
$$ packed form
59805G960112k81609k68287k51605k31957k10516j88806j67060j44312j20769
59796F095191r8752q0224o4520m9731l5502k3197j3875p065r38P065J8771L3367
59784E780590M7770O0017P1404Q4089R7463J08475J14888J16338J12392J01485
59774F694911Q2480N6237K5279p308l8378o5120q5853j00481j10239j17019j22514
59763F211995j27434j31522j34311j35475j34315j29747j21470j10517r8005q3786
59753E005413o7255m9107l1502j6528m982L578J0357J6776K3736L1076L7845M3023
59741E002430M5907M6114M3436L7660K8752J7797P524Q64j462j216j68J846O067
59728E235551J2993K2297L3833M7734O3757Q1286R9853J19135J38634J58028J77779
$$ plain form
59717 6190880 6389744 6611466 6857228 7127286 7421684 7740994 8085496 8452566 8834321
59708 8834321 9217447 9584415 9914045 10182250 10366170 10451362 10436700 10333095 10158495 9933655
59698 9933655 9679268 9413018 9147611 8891799 8652789 8436733 8247361 8085616 7950961
59689 7950961 7842501 7759283 7700763 7667135 7658520 7673875 7711373 7769564 7847626 7945136 8062581
59678 8062581 8201468 8362637 8544961 8747129 8970304 9217474 9490490 9789588 10115773
59669 10115773 10471594 10859001 11278295 11730064 12216585 12740275 13301992 13901875 14540594
59660 14540594 15218206 15932236 16677880 17449495 18240644 19042699 19844463 20633888 21400575
59651 21400575 22137501 22841555 23513307 24156657 24778423 25387165 25991262 26597659 27211929
$$ packed form
59717F190880J98864K21722K45762K70058K94398L19310L44502L67070L81755
59708H834321L83126L66968L29630K68205J83920Q5192j4662j03605j74600k24840
59698I933655k54387k66250k65407k55812k39010k16056j89372j61745j34655
59689G950961j08460q3218n8520l3628q615J5355L7498N8191P8062R7510J17445
59678H062581J38887J61169J82324K02168K23175K47170K73016K99098L26185
59669A0115773L55821L87407M19294M51769M86521N23690N61717N99883O38719
59660A4540594O77612P14030P45644P71615P91149Q02055Q01764P89425P66687
59651B1400575P36926P04054O71752O43350O21766O08742O04097O06397O14270
$$ plain form
59642 27211929 27837800 28474899 29117081 29754090 30374641 30966800 31516181 32006389 32422663
59633 32422663 32754706 32996524 33145954 33205879 33185008 33096214 32954333 32775658 32578006 32379487
59623 32379487 32196741 32044257 31934404 31877388 31881537 31954146 32101645 32328692 32637751 33030088
59613 33030088 33506701 34067823 34711616 35433107 36223085 37066937 37944331 38829790 39692782
59604 39692782 40497187 41201906 41763750 42141739 42301891 42222126 41895927 41332708 40555160
59595 40555160 39595901 38494342 37292737 36031868 34748495 33474749 32237189 31055156
59587 31055156 29940463 28898558 27928374 27020265 26155587 25310293 24460364 23586195 22675905
59578 22675905 21727820 20750377 19758676 18770075 17801182 16865844 15973549 15129595 14337250
$$ packed form
59642B7211929O25871O37099O42182O37009O20551N92159N49381M90208M16274
59633C2422663L32043K41818J49430N9925k0871q8794j41881j78675j97652j98519
59623C2379487j82746j52484j09853n7016M149P2609J47499K27047L09059L92337
59613C3030088M76613N61122O43793P21491P89978Q43852Q77394Q85459Q62992
59604C9692782Q04405P04719N61844L77989J60152p9765l26199n63219p77548
59595D0555160r59259j101559j201605j260869j283373j273746j237560j182033
59587C1055156j114693j041905r70184r08109q64678q45294q49929q74169r10290
59578B2675905r48085r77443r91701r88601r68893r35338q92295q43954p92345
$$ plain form
59569 14337250 13599248 12917026 12289871 11715873 11193003 10718389 10287442 9895050 9537543
59560 9537543 9212885 8919497 8655639 8419349 8207956 8018002 7846469 7691791 7552736
59551 7552736 7426607 7309466 7198017 7090466 6985561 6881737 6777430 6671499 6562925
59542 6562925 6450601 6334066 6214463 6094239 5975445 5858378 5742435 5628353 5518848
59533 5518848 5416513 5321732 5233530 5151853 5077835 5012056 4953914 4902814 4858715 4821296 4789857
59522 4789857 4764560 4746624 4736742 4734188 4738023 4748236 4765183 4788789 4818807 4854906 4895922 4939923
59510 4939923 4985798 5034139 5086115 5142264 5202784 5268025 5338035 5412547 5492055 5578005 5671356
59499 5671356 5772003 5880395 5998527 6128153 6268957 6419854 6581625 6757042 6948681
$$ packed form
59569A4337250p38002o82222o27155n73998n22870m74614m30947l92392l57507
59560I537543l24658k93388k63858k36290k11393j89954j71533j54678j39055
59551G552736j26129j17141j11449j07551j04905j03824j04307j05931j08574
59542F562925j12324j16535j19603j20224j18794j17067j15943j14082j09505
59533E518848j02335r4781q8202q1677p4018o5779n8142n1100m4099l7419l1439
59522D789857k5297j7936r882k554L835J0213J6947K3606L0018L6099M1016M4001
59510D939923M5875M8341N1976N6149O0520O5241P0010P4512P9508Q5950R3351
59499E671356J00647J08392J18132J29626J40804J50897J61771J75417J91639
$$ plain form
59490 6948681 7157535 7383298 7624925 7881127 8151338 8436138 8735803 9048374 9369773
59481 9369773 9695700 10022713 10347354 10664975 10969954 11257145 11523105 11765812 11983052
59472 11983052 12171266 12326470 12446409 12531660 12585038 12610548 12612571 12595077 12561516 12516150 12465267
59461 12465267 12416175 12375224 12347750 12339388 12355653 12399984 12473650 12577392 12710924 12869795 13044308
59450 13044308 13222460 13392709 13543466 13662159 13736707 13757346 13716491 13608501 13431149 13186624
59440 13186624 12880242 12519250 12113636 11676410 11221186 10759673 10301710 9856020 9429445
59431 9429445 9026528 8651015 8306776 7996250 7719355 7475005 7262223 7078686 6920327
59422 6920327 6784604 6672791 6586905 6525614 6485508 6465262 6465888 6487625 6529487 6591856 6676716
$$ packed form
59490F948681K08854K25763K41627K56202K70211K84800K99665L12571L21399
59481I369773L25927L27013L24641L17621L04979K87191K65960K42707K17240
59472A1983052J88214J55204J19939Q5251N3378K5510K023j7494l3561m5366n0883
59461A2465267m9092m0951k7474q362J6265M4331P3666J03742J33532J58871J74513
59450A3044308J78152J70249J50757J18693P4548K0639m0855j07990j77352k44525
59440A3186624l06382l60992m05614m37226m55224m61513m57963m45690m26575
59431I429445m02917l75513l44239l10526k76895k44350k12782j83537j58359
59422F920327j35723j11813q5886o1291m0106k0246O26K1737M1862O2369Q4860
$$ plain form
59411 6676716 6784613 6913319 7060117 7223842 7404262 7600819 7812327 8036482 8269140
59402 8269140 8504792 8737598 8961083 9167360 9348180 9496648 9606724 9671751 9685615 9645883
59392 9645883 9554502 9415396 9232795 9011976 8759802 8483557 8189953 7885426 7576331 7268389
59382 7268389 6966426 6674538 6395709 6131375 5882062 5648187 5429685 5225790 5036394
59373 5036394 4862967 4706749 4566622 4440241 4326678 4226292 4138506 4061690 3995046 3938653
59363 3938653 3891617 3852074 3819355 3794373 3777579 3768024 3764658 3767043 3774623 3786916 3804602 3828979
59351 3828979 3860331 3898449 3944265 3998186 4056234 4110567 4155576 4192243 4225870 4261564 4302998
59340 4302998 4353267 4414546 4487630 4573065 4671662 4782502 4901438 5023277 5145284 5268059
$$ packed form
59411F676716J07897J28706J46798J63725J80420J96557K11508K24155K32658
59402H269140K35652K32806K23485K06277J80820J48468J10076O5027J3864l9732
59392I645883r1381j39106j82601k20819k52174k76245k93604l04527l09095l07942
59382G268389l01963k91888k78829k64334k49313k33875k18502k03895j89396
59373E036394j73427j56218j40127j26381j13563j00386q7786p6816o6644n6393
59363C938653m7036l9543l2719k4982j6794r555l366K385P580J2293J7686K4377
59351C828979L1352L8118M5816N3921N8048N4333M5009L6667L3627L5694M1434
59340D302998N0269O1279P3084Q5435R8597J10840J18936J21839J22007J22775
$$ plain form
59330 5268059 5394354 5528499 5675826 5840384 6022907 6222249 6438909 6676147 6937568
59321 6937568 7224545 7536285 7871752 8231143 8615788 9027030 9465659 9932737 10430492
59312 10430492 10961347 11525773 12121594 12745071 13390969 14050684 14711542 15359608 15983316
59303 15983316 16574140 17124972 17629857 18085790 18493704 18856856 19178384 19460398 19704515
59294 19704515 19912041 20083175 20216328 20308686 20357276 20359014 20309737 20204163 20037768 19809084
59284 19809084 19520369 19176594 18783970 18348835 17877401 17376676 16855470 16323372 15788031
59275 15788031 15254269 14726625 14211736 13716874 13246676 12802636 12385384 11995990 11635163
59266 11635163 11302767 10998562 10722463 10473831 10251364 10053737 9879500 9726438 9592084
$$ packed form
59330E268059J26295J34145J47327J64558J82523J99342K16660K37238K61421
59321F937568K86977L11740L35467L59391L84645M11242M38629M67078M97755
59312A0430492N30855N64426N95821O23477O45898O59715O60858O48066O23708
59303A5983316N90824N50832N04885M55933M07914L63152L21528K82014K44117
59294A9704515K07526J71134J33153R2358M8590J738m9277j05574j66395k28684
59284A9809084k88715l43775l92624m35135m71434n00725n21206n32098n35341
59275A5788031n33762n27644n14889m94862m70198m44040m17252l89394l60827
59266A1635163l32396l04205k76099k48632k22467j97627j74237j53062j34354
$$ plain form
59257 9592084 9474822 9373318 9284670 9204196 9127351 9051083 8973390 8892725 8808161 8719186 8625065
59246 8625065 8525199 8420259 8312006 8201783 8090076 7977798 7867088 7760415 7659401 7564672
59236 7564672 7476368 7394941 7321857 7259006 7206665 7162957 7126822 7100919 7089719 7094882 7114526
59225 7114526 7147233 7194523 7258467 7338784 7433690 7542477 7665887 7804660 7958716 8127205
59215 8127205 8308485 8500306 8700431 8906672 9116224 9325643 9531519 9730100 9915896
59206 9915896 10081711 10220923 10329388 10404966 10445922 10450317 10416740 10345682 10240408 10105663
59196 10105663 9944275 9755374 9537395 9292891 9029383 8755967 8480537 8209646 7948345
59187 7948345 7699204 7463124 7241719 7037456 6851259 6682000 6528989 6392954 6273850
$$ packed form
59257I592084j17262j01504q8648q0474p6845p6268p7693q0665q4564q8975r4121
59246H625065r9866j04940j08253j10223j11707j12278j10710j06673j01014r4729
59236G564672q8304q1427p3084o2851n2341m3708l6135k5903j1200N163J9644
59225G114526L2707M7290O3944Q0317R4906J08787J23410J38773J54056J68489
59215H127205J81280J91821K00125K06241K09552K09419K05876J98581J85796
59206I915896J65815J39212J08465P5578M0956M395l3577p1058j05274j34745
59196A0105663j61388j88901k17979k44504k63508k73416k75430k70891k61301
59187G948345k49141k36080k21405k04263j86197j69259j53011j36035j19104
$$ plain form
59178 6273850 6170100 6081459 6010435 5959017 5925671 5907650 5904895 5919504 5952501 6003611 6073850
59167 6073850 6165967 6282114 6422766 6588139 6779125 6996454 7240250 7511003 7810097 8138765
59157 8138765 8496813 8882246 9291297 9718304 10155553 10593102 11018510 11417203 11774030
59148 11774030 12075154 12309076 12466828 12542187 12532238 12437964 12264465 12020499 11717485 11368710
59138 11368710 10988959 10593354 10195054 9804019 9428411 9076209 8753777 8462963 8201229
59129 8201229 7964894 7751100 7556736 7377537 7209348 7049482 6896591 6750489 6612486
59120 6612486 6484562 6367597 6261459 6167061 6086759 6022055 5972242 5935910 5912350 5900808 5899997
59109 5899997 5909323 5929181 5959061 5996792 6040705 6091007 6147654 6208122 6268695 6326934 6381609
$$ packed form
59178F273850j03750q8641p1024n1418l3346j8021k755J4609L2997N1110P0239
59167F073850R2117J16147J40652J65373J90986K17329K43796K70753K99094L28668
59157H138765L58048L85433M09051M27007M37249M37549M25408L98693L56827
59148A1774030L01124K33922J57752P5359r949r4274j73499k43966l03014l48775
59138A1368710l79751l95605l98300l91035l75608l52202l22432k90814k61734
59129H201229k36335k13794j94364j79199j68189j59866j52891j46102j38003
59120F612486j27924j16965j06138r4398q0302o4704m9813l6332k3560j1542q11
59109E899997R326J9858K9880L7731M3913N0302N6647O0468O0573N8239N4675
$$ plain form
59098 6381609 6431372 6474990 6511930 6541170 6560179 6566489 6559693 6540776 6510299 6468607 6417057 6357634
59086 6357634 6291948 6221928 6150846 6082264 6018339 5960225 5909316 5866719 5832196 5805137 5786024
59075 5786024 5775397 5772052 5774209 5782373 5799073 5825444 5859721 5899668 5945101 5997250 6056765 6123556
59063 6123556 6198250 6282791 6379160 6487569 6606211 6732995 6867330 7009879 7161080 7320814
59053 7320814 7489331 7666885 7851903 8040768 8230252 8419078 8606218 8788843 8963309
59044 8963309 9127439 9280563 9421779 9549505 9662564 9760730 9844223 9913237 9967537 10005748
59034 10005748 10025050 10021691 9991186 9928059 9826787 9684240 9500755 9278539 9020259 8730127
59024 8730127 8415196 8084160 7745079 7404573 7067896 6738660 6419425 6113480 5824911
$$ packed form
59098F381609M9763M3618L6940K9240J9009O310o796j8917l0477m1692n1550n9423
59086F357634o5686p0020p1082o8582o3925n8114n0909m2597l4523k7059j9113
59075E786024j0627l345K157Q164J6700K6371L4277L9947M5433N2149N9515O6791
59063F123556P4694Q4541R6369J08409J18642J26784J34335J42549J51201J59734
59053G320814J68517J77554J85018J88865J89484J88826J87140J82625J74466
59044H963309J64130J53124J41216J27726J13059R8166Q3493O9014N4300L8211
59034A0005748J9302l359l0505o3127j01272j42547j83485k22216k58280k90132
59024H730127l14931l31036l39081l40506l36677l29236l19235l05945k88569
$$ plain form
59015 5824911 5555794 5304683 5069388 4850108 4648168 4462885 4291899 4133995 3989347
59006 3989347 3857246 3735731 3623580 3520705 3426247 3338057 3254670 3176455 3104262 3037982
58996 3037982 2976807 2919862 2866257 2815453 2767938 2724759 2686177 2651381 2619519 2590252 2563350
58985 2563350 2538655 2516503 2497322 2480742 2465986 2453218 2443743 2438762 2438730 2444028 2455268 2472350
58973 2472350 2493778 2517486 2542329 2568584 2597129 2628284 2661558 2696717 2734859 2777791 2826100
58962 2826100 2878389 2932709 2988189 3044949 3103153 3162783 3223873 3286299 3349274 3411066 3468777
58951 3468777 3518411 3556037 3579349 3587827 3581634 3561407 3529191 3488253 3441419 3390369 3336650 3282049
58939 3282049 3227481 3172797 3118264 3065089 3013946 2964399 2916440 2871204 2829416 2790613 2754792
$$ packed form
59015E824911k69117k51111k35295k19280k01940j85283j70986j57904j44648
59006C989347j32101j21515j12151j02875r4458q8190q3387p8215p2193o6280
58996C037982o1175n6945n3605n0804m7515m3179l8582l4796l1862k9267k6902
58985B563350k4695k2152j9181j6580j4756j2768r475m981l2N298J1240J7082
58973B472350K1428K3708K4843K6255K8545L1155L3274L5159L8142M2932M8309
58962B826100N2289N4320N5480N6760N8204N9630O1090O2426O2975O1792N7711
58951C468777M9634L7626K3312Q478o193k0227l2216m0938m6834n1050n3719n4601
58939C282049n4568n4684n4533n3175n1143m9547m7959m5236m1788l8803l5821
$$ plain form
58928 2754792 2723327 2697114 2675195 2656357 2640793 2629003 2620373 2614126 2610504 2609708 2610818 2612912 2616086
58915 2616086 2620368 2625055 2630277 2637598 2647862 2660244 2674856 2694197 2719914 2750018 2781683 2815152
58903 2815152 2852129 2891661 2930726 2968258 3005804 3044459 3083792 3123743 3165244 3208816 3254490
58892 3254490 3303172 3356380 3414693 3477908 3546361 3620659 3700713 3786558 3879221 3979015 4083907
58881 4083907 4191695 4303159 4420953 4546115 4677826 4815907 4961222 5114248 5275728
58872 5275728 5448255 5634609 5834626 6045934 6267454 6499834 6742961 6995719 7258039
58863 7258039 7530443 7811668 8099792 8396306 8706544 9035609 9386135 9760263 10161013
58854 10161013 10590820 11051010 11543614 12071641 12636741 13238364 13875680 14548257 15253976
$$ packed form
58928B754792l1465k6213k1919j8838j5564j1790q630o247l622p96J110K094L174
58915B616086M282M687N222P321J0264J2382J4612J9341K5717L0104L1665L3469
58903B815152L6977L9532L9065L7532L7546L8655L9333L9951M1501M3572M5674
58892C254490M8682N3208N8313O3215O8453P4298Q0054Q5845R2663R9794J04892
58881D083907J07788J11464J17794J25162J31711J38081J45315J53026J61480
58872E275728J72527J86354K00017K11308K21520K32380K43127K52758K62320
58863G258039K72404K81225K88124K96514L10238L29065L50526L74128M00750
58854A0161013M29807M60190M92604N28027N65100O01623O37316O72577P05719
$$ plain form
58845 15253976 15987726 16742389 17509129 18276145 19028677 19750492 20423852 21028518 21543518
58836 21543518 21950776 22235741 22385603 22390649 22248796 21966817 21556754 21033531 20416211 19727602
58826 19727602 18989840 18221273 17438002 16655574 15887130 15141442 14424232 13740006 13091502
58817 13091502 12479211 11903053 11363537 10860272 10390704 9951506 9540350 9155649 8795878
58808 8795878 8459755 8145964 7852309 7576639 7318833 7080071 6859649 6654522 6462613
58799 6462613 6284382 6120181 5968259 5826743 5695665 5575469 5465181 5363701 5271543 5189777
58789 5189777 5118378 5056957 5005882 4965178 4933398 4909202 4893456 4888365 4894912 4912153 4938669 4973846
58777 4973846 5018048 5072221 5137173 5213007 5299530 5397049 5506076 5626521 5758270 5902374
$$ packed form
58845A5253976P33750P54663P66740P67016P52532P21815O73360O04666N15000
58836B1543518M07258K84965J49862N046j41853k81979m10063n23223o17320o88609
58826A9727602p37762p68567p83271p82428p68444p45688p17210o84226o48504
58817A3091502o12291n76158n39516n03265m69568m39198m11156l84701l59771
58808H795878l36123l13791k93655k75670k57806k38762k20422k05127j91909
58799F462613j78231j64201j51922j41516j31078j20196j10288j01480r2158q1766
58789E189777p1399o1421n1075m0704l1780k4196j5746n091O547J7241K6516L5177
58777D973846M4202N4173O4952P5834Q6523R7519J09027J20445J31749J44104
$$ plain form
58767 5902374 6060501 6233244 6420215 6621583 6838043 7069297 7314155 7572204 7843833
58758 7843833 8128782 8426715 8739559 9071361 9425251 9802201 10203124 10630291 11085987
58749 11085987 11571454 12087914 12637142 13220110 13835878 14481851 15153669 15844568 16545956
58740 16545956 17248214 17939040 18601201 19213996 19757318 20213035 20563682 20793514 20892209
58731 20892209 20856020 20685783 20386832 19971156 19456118 18859290 18196367 17484264 16742496
58722 16742496 15989149 15237137 14495508 13772052 13073207 12403514 11766846 11166683 10604160
58713 10604160 10077575 9584757 9124218 8693620 8289758 7911207 7558729 7232025 6928373
58704 6928373 6645357 6382175 6137000 5905914 5686275 5478608 5283502 5099312 4924926
$$ packed form
58767E902374J58127J72743J86971K01368K16460K31254K44858K58049K71629
58758G843833K84949K97933L12844L31802L53890L76950M00923M27167M55696
58749A1085987M85467N16460N49228N82968O15768O45973O71818O90899P01388
58740A6545956P02258O90826O62161O12795N43322M55717L50647K29832R8695
58731B0892209l6189j70237k98951m15676n15038n96828o62923p12103p41768
58722A6742496p53347p52012p41629p23456o98845o69693o36668o00163n62523
58713A0604160n26585m92818m60539m30598m03862l78551l52478l26704l03652
58704F928373k83016k63182k45175k31086k19639k07667j95106j84190j74386
$$ plain form
58695 4924926 4762257 4613486 4477796 4353099 4239113 4136484 4044494 3962026 3889440 3827454
58685 3827454 3775364 3732107 3697777 3672442 3654800 3643558 3638692 3639867 3645104 3652486 3661551 3671519
58673 3671519 3679889 3684511 3685462 3683239 3676637 3663916 3644365 3617172 3580614 3534086 3479283 3417688
58661 3417688 3348645 3271623 3188630 3102650 3015390 2928209 2843219 2761369 2681156 2601444 2524168
58650 2524168 2452397 2387233 2328479 2276749 2232840 2196243 2166017 2141884 2122971 2107120 2092982
58639 2092982 2081099 2071281 2060521 2045014 2022565 1991984 1952597 1906150 1856805 1807315 1757305
58628 1757305 1706923 1659315 1617287 1580313 1547403 1520138 1499833 1484251 1470431 1458679 1450599
58617 1450599 1445405 1441744 1441134 1445587 1453013 1458792 1461174 1462002 1462985 1464432 1466808 1470262 1473061 1473271 1471679
$$ packed form
58695D924926j62669j48771j35690j24697j13986j02629r1990q2468p2586o1986
58685C827454n2090m3257l4330k5335j7642j1242m866J175N237P382R065R968
58673C671519Q370M622R51k223o602j2721j9551k7193l6558m6528n4803o1595
58661C417688o9043p7022q2993q5980q7260q7181q4990q1850q0213p9712p7276
58650B524168p1771o5164n8754n1730m3909l6597l0226k4133j8913j5851j4138
58639B092982j1883r818j0760j5507k2449l0581l9387m6447m9345m9490n0010
58628A757305n0382m7608m2028l6974l2910k7265k0305j5582j3820j1752q080
58617A450599n194l661o10M453P426N779K382Q28R83J447K376L454K799K10j592
$$ plain form
58602 1471679 1470723 1471281 1472576 1473972 1474448 1471621 1464057 1453516 1442544 1431170 1418519 1406035 1396043
58589 1396043 1388322 1381115 1374511 1370030 1368029 1368403 1372666 1382322 1396224 1412364 1431095 1453740 1479403
58576 1479403 1506356 1535266 1567741 1602765 1637957 1673424 1711163 1751727 1794812 1841907 1894639
58565 1894639 1951468 2009758 2070441 2136899 2209922 2287612 2369813 2458696 2555078 2657853 2767155
58554 2767155 2884688 3011144 3146600 3293087 3453054 3625381 3806560 3995670 4194320
58545 4194320 4401466 4612006 4820753 5023786 5215096 5385636 5527106 5634004 5701596 5725377
58535 5725377 5704081 5640874 5540830 5409440 5253696 5081491 4898735 4708988 4516283 4325998
58525 4325998 4142507 3968060 3804190 3652209 3512384 3384569 3269457 3167337 3076466 2995067
$$ packed form
58602A471679r56N58J295J396M76k827p564j0541j0972j1374j2651j2484r992
58589A396043p721p207o604m481k001L74M263R656J3902J6140J8731K2645K5663
58576A479403K6953K8910L2475L5024L5192L5467L7739M0564M3085M7095N2732
58565A894639N6829N8290O0683O6458P3023P7690Q2201Q8883R6382J02775J09302
58554B767155J17533J26456J35456J46487J59967J72327J81179J89110J98650
58545D194320K07146K10540K08747K03033J91310J70540J41470J06898O7592K3781
58535E725377k1296o3207j00044j31390j55744j72205j82756j89747j92705j90285
58525D325998j83491j74447j63870j51981j39825j27815j15112j02120r0871q1399
$$ plain form
58515 2995067 2923945 2864396 2814454 2770393 2731227 2698460 2672019 2649968 2631852 2618767 2610157
58504 2610157 2604140 2600997 2602804 2609221 2616681 2621756 2622012 2613584 2591655 2554164 2502445 2438375 2364000
58491 2364000 2283655 2202613 2123101 2044583 1967816 1895182 1827228 1762813 1702939 1650472 1605383
58480 1605383 1564054 1524250 1487402 1455099 1426617 1400819 1377534 1356206 1336018 1317830 1303246
58469 1303246 1291525 1280180 1268518 1257595 1247126 1236189 1226627 1221569 1220270 1218492 1214509 1210850
58457 1210850 1209613 1210171 1212204 1216807 1223574 1230414 1237345 1246876 1259771 1274071 1288856 1304983 1321325
58444 1321325 1334452 1343158 1349391 1353857 1354877 1352658 1350315 1349241 1347620 1344986 1343965 1345757 1348067 1349407
58430 1349407 1351563 1355892 1361139 1366927 1375500 1387533 1399645 1408386 1413623 1416016 1414385 1407815 1397439
$$ packed form
58515B995067p1122n9549m9942m4061l9166l2767k6441k2051j8116j3085q610
58504B610157o017l143J807O417P460N075K56q428k1929l7491n1719o4070p4375
58491B364000q0345q1042p9512p8518p6767p2634o7954o4415n9874n2467m5089
58480A605383m1329l9804l6848l2303k8482k5798k3285k1328k0188j8188j4584
58469A303246j1721j1345j1662j0923j0469j0937r562n058j299j778l983l659
58457A210850j237N58K033M603O767O840O931R531J2895J4300J4785J6127J6342
58444A321325J3127Q706O233M466J020k219k343j074j621k634j021J792K310J340
58430A349407K156M329N247N788Q573J2033J2112Q741N237K393j631o570j0376
$$ plain form
58417 1397439 1384086 1366746 1345082 1320908 1295708 1269288 1241921 1215046 1188959 1162756 1137326
58406 1137326 1115165 1096630 1079806 1064433 1051978 1041440 1029731 1017153 1007727 1002754 998965 994558
58394 994558 991845 991748 990972 987715 985592 988544 995691 1004264 1013921 1025150 1036800 1048221 1060841 1075093
58380 1075093 1088821 1100987 1113746 1128680 1144258 1159216 1174978 1192447 1209597 1224348 1236527
58369 1236527 1245222 1247942 1244469 1237943 1230127 1219373 1205098 1190111 1176302 1162231 1147356 1134360
58357 1134360 1124696 1116036 1106939 1099966 1097314 1097346 1098416 1102133 1109852 1119755 1130423 1143597 1160346 1178131
58343 1178131 1194543 1210412 1226509 1241038 1253177 1265149 1277702 1287333 1291107 1290784 1289392 1287275
58331 1287275 1284214 1281613 1279879 1277249 1273627 1271682 1272025 1271686 1269571 1268551 1269566 1268797 1263723 1256955 1251064
$$ packed form
58417A397439j3353j7340k1664k4174k5200k6420k7367k6875k6087k6203k5430
58406A137326k2161j8535j6824j5373j2455j0538j1709j2578r426m973l789m407
58394I94558k713r7p76l257k123K952P147Q573R657J1229J1650J1421J2620J4252
58380A075093J3728J2166J2759J4934J5578J4958J5762J7469J7150J4751J2179
58369A236527Q695K720l473o526p816j0754j4275j4987j3809j4071j4875j2996
58357A134360r664q660r097o973k652L2J070L717P719R903J0668J3174J6749J7785
58343A178131J6412J5869J6097J4529J2139J1972J2553R631L774l23j392k117
58331A287275l061k601j734k630l622j945L43l39k115j020J015p69n074o768n891
$$ plain form
58316 1251064 1244862 1238055 1234054 1234322 1235219 1234408 1235134 1240083 1246480 1251827 1259122 1271341 1285646 1298223
58302 1298223 1310426 1325147 1341442 1357590 1375135 1395027 1414112 1430251 1446640 1466273 1486676
58291 1486676 1505006 1523790 1546384 1571085 1594843 1618387 1642386 1663002 1676885 1686596 1695849 1703481
58279 1703481 1707332 1709723 1713549 1717068 1718009 1718828 1722560 1727669 1732303 1739319 1751693 1767392 1784317 1805645
58265 1805645 1834369 1866871 1897802 1927091 1956544 1984161 2007997 2031235 2057270 2083830 2107755
58254 2107755 2131127 2156793 2182512 2205592 2228637 2254516 2280359 2302714 2323850 2346810 2369236
58243 2369236 2388336 2406762 2427266 2447056 2464048 2482992 2508487 2537553 2566055 2596375 2631426
58232 2631426 2667424 2700647 2735456 2777451 2824420 2872058 2922574 2979417 3039593 3099580 3162623
$$ packed form
58316A251064o202o807m001K68Q97q11P26M949O397N347P295J2219J4305J2577
58302A298223J2203J4721J6295J6148J7545J9892J9085J6139J6389J9633K0403
58291A486676J8330J8784K2594K4701K3758K3544K3999K0616J3883R711R253P632
58279A703481L851K391L826L519R41Q19L732N109M634P016J2374J5699J6925K1328
58265A805645K8724L2502L0931K9289K9453K7617K3836K3238K6035K6560K3925
58254B107755K3372K5666K5719K3080K3045K5879K5843K2355K1136K2960K2426
58243B369236J9100J8426K0504J9790J6992J8944K5495K9066K8502L0320L5051
58232B631426L5998L3223L4809M1995M6969M7638N0516N6843O0176N9987O3043
$$ plain form
58221 3162623 3231813 3302748 3371940 3445371 3529247 3619399 3709796 3804217 3908797 4020158 4132197
58210 4132197 4247817 4372333 4501630 4628319 4753139 4878665 4998773 5106886 5208270
58201 5208270 5311916 5417000 5519893 5627262 5748606 5882558 6024221 6179045 6355262
58192 6355262 6549633 6755430 6977362 7223293 7488249 7762627 8049433 8357181 8682941
58183 8682941 9019749 9374103 9758332 10171770 10607073 11068505 11565640 12095677 12650896
58174 12650896 13236816 13863520 14526018 15213500 15931179 16692448 17497304 18340612 19234021
58165 19234021 20196365 21229778 22329206 23507368 24784351 26159745 27621548 29175120
58157 29175120 30835803 32601083 34460045 36423809 38517196 40748563 43119234 45653756
$$ packed form
58221C162623O9190P0935O9192P3431Q3876R0152R0397R4421J04580J11361J12039
58210D132197J15620J24516J29297J26689J24820J25526J20108J08113J01384
58201E208270J03646J05084J02893J07369J21344J33952J41663J54824J76217
58192F355262J94371K05797K21932K45931K64956K74378K86806L07748L25760
58183H682941L36808L54354L84229M13438M35303M61432M97135N30037N55219
58174A2650896N85920O26704O62498O87482P17679P61269Q04856Q43308Q93409
58165A9234021R62344J033413J099428J178162J276983J375394J461803J553572
58157B9175120J660683J765280J858962J963764K093387K231367K370671K534522
$$ plain form
58149 45653756 48387574 51335231 54507773 57952564 61738780 65916500 70533467 75680926
58141 75680926 81478009 88025225 95423418 103820457 113377241 124197327 136345514 149912306
58133 149912306 165001088 181718956 200328360 221424510 245859856 274475483 307876692
58126 307876692 346037089 387321585 427462501 459992227 478755738 480895926 467887581
58119 467887581 444010463 413928294 381224355 348203150 316204852 285915483 257656536
58112 257656536 231634064 208015193 186867641 168136784 151697328 137382845 124978085
58105 124978085 114241405 104950304 96907135 89917115 83797385 78407418 73650323 69451848
58097 69451848 65756657 62535725 59776597 57465113 55581205 54105378 53026848 52353325
$$ packed form
58149D5653756K733818K947657L172542L444791L786216M177720M616967N147459
58141G5680926N797083O547216P398193Q397039R556784J0820086J2148187J3566792
58133A49912306J5088782J6717868J8609404K1096150K4435346K8615627L3401209
58126C07876692L8160397M1284496M0140916L2529726J8763511K140188j3008345
58119D67887581k3877118l0082169l2703939l3021205l1998298l0289369k8258947
58112B57656536k6022472k3618871k1147552j8730857j6439456j4314483j2404760
58105A24978085j0736680r291101q043169o990020o119730n389967m757095m198475
58097F9451848l695191l220932k759128k311484j883908j475827j078530o73523
$$ plain form
58089 52353325 52110083 52321911 53007312 54195774 55917796 58161278 60897928 64197432
58081 64197432 68201398 72784394 77199103 80232622 80894152 78995525 75092449 69985117
58073 69985117 64338490 58620407 53144811 48073003 43444873 39267358 35555549 32297031
58065 32297031 29438198 26927872 24738056 22833595 21161819 19684817 18388207 17247859
58057 17247859 16219536 15271248 14397024 13590140 12830305 12105842 11422489 10781294 10170914
58048 10170914 9588869 9047358 8550417 8086426 7649671 7248593 6886356 6553163 6243760
58039 6243760 5962961 5707788 5463338 5223095 4995836 4786523 4587759 4395870 4217914
58030 4217914 4055946 3900442 3745980 3598592 3461633 3328902 3197404 3072720 2956253
$$ packed form
58089E2353325k43242K11828O85401J188462J722022K243482K736650L299504
58081F4197432M003966M582996M414709L033519O61530j898627l903076n107332
58073F9985117n646627n718083n475596n071808m628130m177515l711809l258518
58065C2297031k858833k510326k189816j904461j671776j477002j296610j140348
58057A7247859j028323r48288q74224q06884p59835p24463o83353o41195o10380
58048A0170914n82045n41511m96941m63991m36755m01078l62237l33193l09403
58039F243760k80799k55173k44450k40243k27259k09313j98764j91889j77956
58030D217914j61968j55504j54462j47388j36959j32731j31498j24684j16467
$$ plain form
58021 2956253 2841026 2725476 2617800 2521278 2428514 2335404 2247735 2168711 2092775 2017281 1947997
58010 1947997 1887523 1829965 1772255 1719278 1672814 1626750 1578280 1532842 1493117 1454017 1413223
57999 1413223 1375688 1342886 1308582 1270332 1234525 1204821 1176017 1144659 1115412 1091276 1067415
57988 1067415 1040548 1015177 994773 975707 955496 938379 927072 917242 905534 895027 887622 879143
57976 879143 867358 857084 851905 848195 842478 837440 835474 833310 828258 823207 820652 818082 813726 810502
57962 810502 810093 809675 808554 811206 819402 828018 833165 838003 846156 855817 864915 875860 890513 906363
57948 906363 922056 940909 964685 989652 1012966 1037408 1065948 1097325 1130768 1169030 1212679
57937 1212679 1257078 1299092 1341224 1385482 1428986 1469222 1507259 1541628 1565319 1573560 1569108 1555805
$$ packed form
58021B956253j15227j15550j07676r6522r2764r3110q7669p9024p5936p5494o9284
58010A947997o0474n7558n7710n2977m6464m6064m8470m5438l9725l9100m0794
57999A413223l7535l2802l4304l8250l5807k9704k8804l1358k9247k4136k3861
57988A067415k6867k5371k0404j9066k0211j7117j1307r830j1708j0507p405q479
57976H79143j1785j0274n179l710n717n038j966k164n052n051k555k570m356l224
57962H10502m09m18j121K652Q196Q616N147M838Q153R661R098J0945J4653J5850
57948I06363J5693J8853K3776K4967K3314K4442K8540L1377L3443L8262M3649
57937A212679M4399M2014M2132M4258M3504M0236L8037L4369K3691Q241m452j3303
$$ plain form
57925 1555805 1532933 1500261 1462461 1423544 1382436 1338764 1297328 1261922 1230128 1199194 1171707
57914 1171707 1150468 1133164 1117532 1106819 1104640 1109095 1117254 1130851 1151996 1177715 1204405 1233817
57902 1233817 1269181 1309185 1351138 1396407 1447040 1499925 1549187 1591446 1624309 1643260 1645147
57891 1645147 1632003 1607187 1571103 1525003 1475058 1427484 1382693 1339107 1299444 1268117 1245285
57880 1245285 1228721 1219013 1217924 1223963 1234572 1250658 1274307 1303913 1335837 1368839 1402524 1433339
57868 1433339 1456263 1468690 1469108 1454497 1423351 1379375 1328149 1271918 1211115 1148480 1087457 1028415
57856 1028415 970413 914851 863749 816394 771283 729364 691909 657697 626003 599755 581436
57845 581436 568157 555145 542094 531654 523532 514850 505105 496333 489219 482943 477976 475269 473485
$$ packed form
57925A555805k2872l2672l7800l8917m1108m3672m1436l5406l1794l0934k7487
57914A171707k1239j7304j5632j0713k179M455Q159J3597K1145K5719K6690K9412
57902A233817L5364M0004M1953M5269N0633N2885M9262M2259L2863J8951J887
57891A645147j3144k4816l6084m6100m9945m7574m4791m3586l9663l1327k2832
57880A245285j6564r708j089O039J0609J6086K3649K9606L1924L3002L3685L0815
57868A433339K2924J2427M18j4611l1146m3976n1226n6231o0803o2635o1023n9042
57856A028415n8002n5562n1102m7355m5111m1919l7455l4212l1694k6248j8319
57845E81436j3279j3012j3051j0440q122q682r745q772p114o276m967k707j784
$$ plain form
57832 473485 470582 467294 465951 466859 468801 471711 475748 479171 480369 480763 482566 485006 485704 484270 481469
57817 481469 476559 468839 460411 453950 448879 442795 435402 428100 421189 414601 409910 408395 408418 407695 406735
57802 406735 407177 408534 409787 412332 417844 424788 430659 436134 443256 450892 455959 458267 460385 463276
57788 463276 465551 466519 466748 465996 463458 459512 454734 448282 439900 432203 427965 426402 424993 423456 422705
57773 422705 421568 418342 414471 412801 412977 412285 410428 409615 410258 410231 408525 406377 404640 402864 400847 398401
57757 398401 393897 385789 375277 364895 355093 344946 335469 329055 325810 323372 320298 317098 314160
57744 314160 311220 308728 307440 307072 307395 309884 315862 323973 332029 340510 351600 365762 382176 401659
57730 401659 425995 454795 485993 519107 555291 594721 636558 680952 728188 776323 822294
$$ packed form
57832D73485k903l288j343R08J942K910M037L423J198L94J803K440O98j434k801
57817D81469m910p720q428o461n071o084p393p302o911o588m691j515K3p23r60
57802D06735M42J357J253K545N512O944N871N475P122P636N067K308K118K891
57788D63276K275R68K29p52k538l946m778o452q382p697m238j563j409j537p51
57773D22705j137l226l871j670J76o92j857q13O43k7j706k148j737j776k017k446
57757C98401m504q108j0512j0382r802j0147r477o414l245k438l074l200k938
57744C14160k940k492j288l68L23K489N978Q111Q056Q481J1090J4162J6414J9483
57730D01659K4336K8800L1198L3114L6184L9430M1837M4394M7236M8135M5971
$$ plain form
57719 822294 864788 903240 934707 954867 961892 956804 940767 914995 882678 847699 811408 773272
57707 773272 734145 696039 659260 622921 587867 555990 527100 499726 474679 454300 438251
57696 438251 423646 409702 398821 392477 389236 387696 388364 391665 396652 402698 410289 419351 428715 437764
57682 437764 446754 455089 461034 463385 462112 457697 451469 445807 442005 438656 434150 429640 427120 425942
57668 425942 424353 423415 425738 430892 435834 439761 444857 452026 459598 466799 475056 485051 495628 506379
57654 506379 518281 531049 542957 554214 567557 584400 603111 622126 642068 663675 686259
57643 686259 709630 735353 764774 797500 832724 870234 909424 949302 990304 1034302 1082108
57632 1082108 1132516 1184240 1237181 1291640 1348141 1408257 1473854 1545544 1623656 1710277 1807991
$$ packed form
57719H22294M2494L8452L1467K0160P025n088j6037k5772l2317l4979l6291l8136
57707G73272l9127l8106l6779l6339l5054l1877k8890k7374k5047k0379j6049
57696D38251j4605j3944j0881o344l241j540O68L301M987O046P591R062R364R049
57682D37764Q990Q335N945K351j273m415o228n662l802l349m506m510k520j178
57668D25942j589r38K323N154M942L927N096P169P572P201Q257R995J0577J0751
57654E06379J1902J2768J1908J1257J3343J6843J8711J9015J9942K1607K2584
57643F86259K3371K5723K9421L2726L5224L7510L9190L9878M1002M3998M7806
57632A082108N0408N1724N2941N4459N6501O0116O5597P1690P8112Q6621R7714
$$ plain form
57621 1807991 1916782 2034778 2161985 2300810 2453037 2619109 2800298 2998276 3211804
57612 3211804 3436535 3668732 3906598 4147389 4385769 4615554 4830574 5023423 5185638
57603 5185638 5309055 5384227 5398471 5340648 5210448 5020780 4790187 4535382 4270413 4007263
57593 4007263 3753474 3511563 3283245 3072373 2882307 2712960 2562431 2429509 2312901
57584 2312901 2210262 2119928 2041839 1975181 1917071 1865180 1819934 1782641 1753168 1730806 1715498
57573 1715498 1706813 1703519 1705512 1714299 1730235 1751276 1775970 1805740 1842682 1886950 1937941 1996233
57561 1996233 2062534 2136307 2217265 2306935 2407102 2517768 2637913 2766972 2904273 3048042
57551 3048042 3195958 3345355 3491950 3629766 3753142 3857386 3936970 3985330 3997983 3974442
$$ packed form
57621A807991J08791J17996J27207J38825J52227J66072J81189J97978K13528
57612C211804K24731K32197K37866K40791K38380K29785K15020J92849J62215
57603E185638J23417P5172J4244n7823j30200j89668k30593k54805k64969k63150
57593D007263k53789k41911k28318k10872j90066j69347j50529j32922j16608
57584B312901j02639r0334p8089o6658n8110n1891m5246l7293k9473k2362j5308
57573A715498q685l294J993Q787J5936K1041K4694K9770L6942M4268N0991N8292
57561A996233O6301P3773Q0958Q9670J00167J10666J20145J29059J37301J43769
57551C048042J47916J49397J46595J37816J23376J04244P9584M8360J2653k3541
$$ plain form
57541 3974442 3916406 3826203 3708126 3568939 3415166 3251262 3081517 2911502 2745783 2585798
57531 2585798 2431632 2284264 2144639 2012481 1888053 1773439 1669999 1575908 1488289 1406598
57521 1406598 1331918 1264040 1201556 1144074 1092133 1045127 1001162 959182 920031 885296 855727
57510 855727 830453 807246 784151 761315 740451 722156 704954 687658 671400 658282 648777 641238
57498 641238 633419 624197 614621 607467 604729 605519 607495 609959 613956 619877 627349 637384 651705 669375
57484 669375 686969 703114 720137 740082 761957 784518 808962 836685 866633 897247 929260
57473 929260 964454 1003214 1045224 1091004 1140865 1193906 1249954 1310936 1378401 1451269 1528063
57462 1528063 1609771 1698260 1793188 1892846 1996894 2105804 2218191 2330660 2439597 2541254
$$ packed form
57541C974442n8036r0203j18077j39187j53773j63904j69745j70015j65719j59985
57531B585798j54166j47368j39625j32158j24428j14614j03440r4091q7619q1691
57521A406598p4680o7878o2484n7482n1941m7006m3965m1980l9151l4735k9569
57510H55727k5274k3207k3095k2836k0864j8295j7202j7296j6258j3118r505p539
57498F41238p819r222r576p154k738P90J976K464L997N921P472J0035J4321J7670
57484F69375J7594J6145J7023J9945K1875K2561K4444K7723K9948L0614L2013
57473I29260L5194L8760M2010M5780M9861N3041N6048O0982O7465P2868P6794
57462A528063Q1708Q8489R4928R9658J04048J08910J12387J12469J08937J01657
$$ plain form
57452 2541254 2630890 2703728 2756315 2785651 2788301 2762476 2710439 2637099 2546850 2443234 2330496
57441 2330496 2213153 2094211 1975549 1859707 1749818 1647864 1554125 1467967 1388374 1314551
57431 1314551 1247038 1187405 1136017 1091331 1052289 1019798 994361 973953 956084 940691 929064
57420 929064 921174 916170 914459 916911 922677 929991 938731 950203 964817 981978 1002041 1026377 1055539
57407 1055539 1088993 1126673 1169392 1217859 1272681 1335117 1406380 1486121 1572744 1665001 1762209
57396 1762209 1863241 1966378 2069768 2170646 2264139 2343919 2404300 2441494 2453589 2440214
57386 2440214 2401944 2339537 2254442 2150429 2033573 1909718 1782585 1654706 1528722 1406770
57376 1406770 1289860 1178887 1075081 978524 887640 801417 720989 647881 581950 522096 467508
$$ packed form
57452B541254Q9636P2838N2587K9336K650k5825n2037p3340r0249j03616j12738
57441B330496j17343j18942j18662j15842j09889j01954r3739q6158p9593p3823
57431A314551o7513n9633n1388m4686l9042l2491k5437k0408j7869j5393j1627
57420I29064p890n004j711K452N766P314Q740J1472J4614J7161K0063K4336K9162
57407A055539L3454L7680M2719M8467N4822O2436P1263P9741Q6623R2257R7208
57396A762209J01032J03137J03390J00878R3493P9780O0381L7194J2095j3375
57386B440214l8270o2407q5095j04013j16856j23855j27133j27879j25984j21952
57376A406770j16910j10973j03806r6557r0884q6223q0428p3108o5931n9854n4588
$$ plain form
57365 467508 416927 368365 321278 277673 239405 205601 174268 144988 118342 94045 71572
57354 71572 51277 33033 15124 -3516 -21324 -36542 -50229 -64465 -78750 -90937 -100903 -110536
57342 -110536 -120516 -129683 -137408 -144233 -150335 -155552 -160860 -167699 -175780 -183376 -189644 -194965 -199389 -202680
57328 -202680 -205622 -209287 -213206 -216188 -218787 -222882 -228760 -234525 -238697 -241770 -245061 -249450 -255357 -262647
57314 -262647 -270519 -278527 -287327 -297214 -306660 -313857 -319282 -325112 -332470 -340718 -348926 -356372 -362104 -365776
57300 -365776 -368653 -372275 -376511 -380380 -384056 -388275 -392425 -395209 -396892 -398980 -401963 -405064 -407860 -410402
57286 -410402 -412261 -413218 -414448 -417192 -420815 -424023 -427279 -431846 -437061 -441006 -443432 -445580 -447440 -447865 -447423
57271 -447423 -448395 -451521 -455142 -457955 -460326 -462411 -463390 -463290 -463414 -464046 -463682 -461396 -458233 -455396 -452758 -450087
$$ packed form
57365D67508n0581m8562m7087m3605l8268l3804l1333k9280k6646k4297k2473
57354G1572k0295j8244A5124c516j7808j5218j3687j4236j4285j2187r966r633
57342a10536r980r167p725o825o102n217n308o839q081p596o268n321m424l291
57328b02680k942l665l919k982k599m095n878n765m172l073l291m389n907p290
57314b62647p872q008q800r887r446p197n425n830p358q248q208p446n732l672
57300c65776k877l622m236l869l676m219m150k784j683k088k983l101k796k542
57286d10402j859r57j230k744l623l208l256m567n215l945k426k148j860m25M42
57271d47423r72l126l621k813k371k085r79J00j24o32L64K286L163K837K638K671
$$ plain form
57255 -450087 -448084 -447054 -445781 -442903 -438649 -434320 -430680 -427454 -423955 -419758 -415000 -410071 -404823 -398554
57241 -398554 -391170 -383575 -376191 -367954 -357761 -346063 -333812 -320634 -305300 -287294 -266753 -243752
57229 -243752 -218813 -193053 -166452 -137251 -104532 -70072 -35803 -974 36147 75237 115033 155923
57217 155923 198532 240962 280690 318369 356421 394385 428969 458468 483597 503860 516592
57206 516592 520385 516521 506392 490218 468957 444690 418386 389750 359850 331321 305318 280838
57194 280838 257706 237523 220769 205556 190373 175821 162571 149923 137584 126922 119159 113851
57182 113851 109957 106910 104211 101789 101232 104672 111877 120325 128600 137712 148515 160041 171232 182429
57168 182429 194295 206944 220826 236879 255280 275494 297665 322281 348515 374978 402239
$$ packed form
57255d50087K003J030J273K878M254M329L640L226L499M197M758M929N248O269
57241c98554P384P595P384Q237J0193J1698J2251J3178J5334J8006K0541K3001
57229b43752K4939K5760K6601K9201L2719L4460L4269i74C6147L9090L9796M0890
57217A55923M2609M2430L9728L7679L8052L7964L4584K9499K5129K0263J2732
57206E16592L793l864j0129j6174k1261k4267k6304k8636k9900k8529k6003k4480
57194B80838k3132k0183j6754j5213j5183j4552j3250j2648j2339j0662p763n308
57182A13851l894l047k699k422n57L440P205Q448Q275R112J0803J1526J1191J1197
57168A82429J1866J2649J3882J6053J8401K0214K2171K4616K6234K6463K7261
$$ plain form
57157 402239 432409 466014 501492 538077 576844 618464 662048 706730 752432 798869 845893
57146 845893 894899 947701 1003908 1061689 1120919 1182918 1247228 1311737 1376168 1442074 1508773
57135 1508773 1572557 1631038 1685509 1738088 1789399 1840049 1891561 1944565 1998510 2054140 2113839
57124 2113839 2178637 2247238 2318658 2393200 2470102 2546881 2621804 2694631 2764603 2830547 2893245
57113 2893245 2954485 3013235 3066078 3111888 3152432 3187739 3215174 3234567 3250261 3266117 3281975
57102 3281975 3296827 3311950 3328595 3345610 3361499 3376248 3389497 3399714 3406833 3413051 3419792 3426800
57090 3426800 3435151 3447697 3465121 3484906 3505154 3525276 3541395 3545524 3531684 3499202 3448183 3376302
57078 3376302 3282732 3170838 3043447 2898762 2734128 2550806 2351893 2138060 1907852 1659537
$$ packed form
57157D02239L0170L3605L5478L6585L8767M1620M3584M4682M5702M6437M7024
57146H45893M9006N2802N6207N7781N9230O1999O4310O4509O4431O5906O6699
57135A508773O3784N8481N4471N2579N1311N0650N1512N3004N3945N5630N9699
57124B113839O4798O8601P1420P4542P6902P6779P4923P2827O9972O5944O2698
57113B893245O1240N8750N2843M5810M0544L5307K7435J9393J5694J5856J5858
57102C281975J4852J5123J6645J7015J5889J4749J3249J0217P119O218O741P008
57090C426800Q351J2546J7424J9785K0248K0122J6119M129j3840l2482n1019p1881
57078C376302r3570j11894j27391j44685j64634j83322j98913k13833k30208k48315
$$ plain form
57068 1659537 1390323 1096263 774919 425645 46120 -368176 -820303 -1311795 -1847569 -2436349
57058 -2436349 -3084807 -3795943 -4574820 -5430781 -6372370 -7405830 -8541164 -9794534 -11182723
57049 -11182723 -12721004 -14428576 -16330044 -18449697 -20811332 -23446203 -26394422 -29697302
57041 -29697302 -33397645 -37550870 -42227678 -47504611 -53463960 -60206495 -67851864 -76521560
57033 -76521560 -86329982 -97381458 -109736249 -123359403 -138137052 -153984462 -170920501
57026 -170920501 -188964562 -207888395 -227022778 -245302056 -261583088 -275113862 -285884744
57019 -285884744 -294563904 -301959733 -308373667 -313367393 -316104729 -315898853 -312485931 -305920231
57011 -305920231 -296350256 -283926089 -268856117 -251496515 -232385192 -212198778 -191653715
$$ packed form
57068A659537k69214k94060l21344l49274D6120c68176m52127m91492n35774n88780
57058b436349o48458p11136p78877q55961r41589j033460j135334j253370j388189
57049a1182723j538281j707572j901468k119653k361635k634871k948219l302880
57041b9697302l700343m153225m676808n276933n959349o742535p645369q669696
57033g6521560r808422j1051476j2354791j3623154j4777649j5847410j6936039
57026a70920501j8044061j8923833j9134383j8279278j6281032j3530774j0770882
57019b85884744q679160p395829o413934m993726k737336K05876L412922O565700
57011c05920231R569975J2424167J5069972J7359602J9111323K0186414K0545063
$$ plain form
57004 -191653715 -171401868 -151969339 -133742174 -116968801 -101766771 -88146178 -76047707
56997 -76047707 -65372771 -55998195 -47789338 -40615695 -34357175 -28900669 -24141219 -19989298
56989 -19989298 -16370553 -13216579 -10461331 -8047010 -5926907 -4060812 -2413010 -955932
56980 330162 1464010 2466712 3358289 4155397 4873200 5524946 6118634 6657979 7147676
56971 7147676 7594475 8003396 8377226 8720148 9037398 9330597 9597461 9837003 10051189
56962 10051189 10240937 10404717 10542443 10657176 10751812 10827411 10885612 10929068 10958101 10969967
56952 10969967 10962432 10935118 10886664 10814185 10716903 10597154 10456361 10292893 10105080 9893108
56942 9893108 9656280 9391824 9099260 8784211 8456061 8123631 7794523 7476217 7175280
$$ packed form
57004a91653715K0251847J9432529J8227165J6773373J5202030J3620593J2098471
56997g6047707J0674936R374576Q208857P173643O258520N456506M759450M151921
56989a9989298L618745L153974K755248K414321K120103J866095J647802i55932
56980C30162J133848J002702Q91577P97108P17803O51746N93688N39345M89697
56971G147676M46799M08921L73830L42922L17250K93199K66864K39542K14186
56962A0051189J89748J63780J37726J14733R4636P5599N8201M3456K9033J1866
56952A0969967p535k7314m8454p2479r7282j19749j40793j63468j87813k11972
56942I893108k36828k64456k92564l15049l28150l32430l29108l18306l00937
$$ plain form
56933 7175280 6896782 6646369 6431658 6259870 6135553 6062122 6042584 6072800 6131159 6177283
56923 6177283 6166061 6068276 5882104 5627842 5332692 5018664 4699943 4385596 4081524 3791197
56913 3791197 3517230 3262719 3030162 2819805 2630465 2461551 2312919 2183259 2070245
56904 2070245 1972215 1888417 1817708 1758260 1708494 1667369 1634165 1609006 1592929 1585808 1584237 1582517
56892 1582517 1575724 1561379 1539358 1511680 1481638 1451420 1420730 1388806 1356973 1327629 1301483
56881 1301483 1277591 1255678 1236534 1220344 1206524 1195163 1187016 1182015 1179428 1179664 1184421 1194644
56869 1194644 1209122 1224914 1238104 1244581 1241551 1228662 1207207 1178959 1146489 1113315 1081909 1052199
56857 1052199 1023445 996670 973412 952938 933062 913412 895643 880486 866769 853594 841509
$$ packed form
56933G175280k78498k50413k14711j71788j24317p3431j9538L0216N8359M6124
56923F177283j1222r7785j86172k54262k95150l14028l18721l14347l04072k90327
56913C791197k73967k54511k32557k10357j89340j68914j48632j29660j13014
56904B070245r8030q3798p0709n9448m9766m1125l3204k5159j6077p121j571j720
56892A582517o793j4345k2021k7678l0042l0218l0690l1924l1833k9344k6146
56881A301483k3892k1913j9144j6190j3820j1361q147n001k587K36M757J0223
56869A194644J4478J5792J3190O477l030j2889k1455k8248l2470l3174l1406k9710
56857A052199k8754k6775k3258k0474j9876j9650j7769j5157j3717j3175j2085
$$ plain form
56846 841509 831161 822528 815785 811309 808518 806207 804320 803851 804802 805819 806303 807369 810256 814938 820727
56831 820727 827137 833773 840312 846949 854107 861658 869004 875592 880539 882297 879733 873004 862482 847896
56817 847896 830040 812163 797602 786633 777711 771036 768307 769299 771597 774143 778586 786556 797998
56804 797998 812918 832419 856880 885052 916120 950888 989666 1030310 1069121 1102271 1125769
56793 1125769 1136337 1134120 1123296 1108390 1090875 1070583 1049275 1030857 1018201 1011199 1008155 1008324
56781 1008324 1012827 1023466 1040913 1064222 1092274 1125313 1164712 1211919 1268364 1335178 1410542
56770 1410542 1486677 1551169 1592810 1606476 1593377 1558707 1509687 1453931 1397407 1343358 1293203
56759 1293203 1247968 1208644 1175955 1150318 1131848 1120308 1115388 1117003 1125058 1139447 1160960 1191664
$$ packed form
56846H41509j0348q633o743m476k791k311j887m69R51J017M84J066K887M682N789
56831H20727O410O636O539O637P158P551P346O588M947J758k564o729j0522j4586
56817H47896j7856j7877j4561j0969q922o675k729R92K298K546M443P970J1442
56804G97998J4920J9501K4461K8172L1068L4768L8778M0644L8811L3150K3498
56793A125769J0568k217j0824j4906j7515k0292k1308j8418j2656p002l044J69
56781A008324M503J0639J7447K3309K8052L3039L9399M7207N6445O6814P5364
56770A410542P6135O4492M1641J3666j3099l4670m9020n5756n6524n4049n0155
56759A293203m5235l9324l2689k5637j8470j1540m920J615Q055J4389K1513L0704
$$ plain form
56747 1191664 1233118 1283990 1339779 1394134 1439620 1468539 1475613 1460799 1428638 1384892 1334459
56736 1334459 1281566 1229586 1180071 1133346 1090349 1052679 1020944 994679 973984 959459 950261
56725 950261 944185 940559 941490 949386 964515 985441 1010038 1034791 1054556 1064777 1063774 1052419 1032489
56712 1032489 1006110 975647 942891 908721 874279 841799 813350 789061 767417 747150 728390
56701 728390 712037 698416 686693 675632 664817 654671 645188 635585 625783 617074 610088 603071 593915
56688 593915 583340 574129 567516 562287 557397 553303 550257 547374 544161 541260 538890 536080 532210 527875
56674 527875 523484 518529 513017 508117 504380 500688 496006 490978 486762 483420 480393 477525 474783 472089
56660 472089 470179 470252 471728 471759 468401 463272 459636 458657 458907 458793 457933 456509 454769 453218 452317 451916 451555
$$ packed form
56747A191664M1454N0872N5789N4355M5486K8919P074j4814l2161m3746n0433
56736A334459n2893n1980m9515m6725m2997l7670l1735k6265k0695j4525r198
56725I50261o076l626R31P896J5129K0926K4597K4753J9765J0221j003j1355j9930
56712A032489k6379l0463l2756l4170l4442l2480k8449k4289k1644k0267j8760
56701G28390j6353j3621j1723j1061j0815j0146r483r603r802q709o986p017r156
56688E93915j0575r211o613n229m890m094l046k883l213k901k370k810l870m335
56674E27875m391m955n512m900l737l692m682n028m216l342l027k868k742k694
56660D72089j910P3J476L1l358n129l636r79K50j14q60j424j740j551r01m01l61
$$ plain form
56643 451555 451151 450814 450368 449710 449372 450115 452109 454857 457686 460171 462589 466114 471927 479840 488550 497438
56627 497438 507187 518155 529212 538996 547634 556313 565662 575360 584993 594607 604439 614491 624283
56614 624283 632937 639852 645214 649442 652322 653468 653519 653811 654707 655354 655395 655842 657632 660233 662307 663131
56598 663131 662815 661705 660063 657897 654854 650700 645960 641489 637415 633158 628410 623299 617768 611855
56584 611855 606459 602610 599943 597122 593780 590682 587856 584190 579271 574149 569746 565914 562636 560692
56570 560692 560347 560675 560973 561662 563065 564442 565060 565132 564982 564322 563044 561720 560644 559376 557793 556475
56554 556475 555586 554696 554240 555552 558517 560683 559935 556918 553787 551676 550541 550304 550754 551151 551146 551502 552895
56537 552895 554706 556073 557421 559847 563523 567689 571831 575928 579756 582689 584135 583988 582945 582321 582848
$$ packed form
56643D51555m04l37m46o58l38P43J994K748K829K485K418L525N813P913Q710Q888
56627D97438R749J0968J1057R784Q638Q679R349R698R633R614R832J0052R792
56614F24283Q654O915N362M228K880J146N1K92Q96O47M1M47J790K601K074Q24
56598F63131l16j110j642k166l043m154m740m471m074m257m748n111n531n913
56584F11855n396l849k667k821l342l098k826l666m919n122m403l832l278j944
56570E60692l45L28K98O89J403J377O18P2j50o60j278j324j076j268j583j318
56554E56475q89q90m56J312K965K166p48l017l131k111j135k37M50L97nL56J393
56537E52895J811J367J348K426L676M166M142M097L828K933J446j47j043o24N27
$$ plain form
56522 582848 583726 583795 583439 584121 586063 587934 588947 589529 589661 588560 586780 586682 589658 594436 599202 603804
56506 603804 608680 613261 617002 620784 625653 630979 635145 637596 639369 642266 647914 656562 666285 674570
56492 674570 681095 687586 694734 701309 706770 712320 718269 722790 724856 726157 728209 729702 728898 726798
56478 726798 725541 725016 723401 719868 714584 707221 697809 688117 679900 672402 663704 653810 644321 635691
56464 635691 626992 617992 609568 602269 596062 591038 586843 582124 576121 570061 565288 560856 554897 547668
56450 547668 541152 536130 531755 527793 525170 524079 523182 521033 517318 512829 509095 507524 507887 508237 507230
56435 507230 505608 504504 503563 502096 500720 500191 499847 498968 498443 499172 499997 499356 497943 497576 498293 498844 499164
56418 499164 500037 501083 501410 501583 502548 503387 502730 501806 503240 507100 510952 513826 517278 522250 527577 532224
$$ packed form
56522E82848Q78O9l56O82J942J871J013N82J32j101j780r8K976M778M766M602
56506F03804M876M581L741L782M869N326M166K451J773K897N648Q648R723Q285
56492F74570O525O491P148O575N461N550N949M521K066J301K052J493q04k100
56478G26798j257n25j615l533n284p363r412r692q217p498q698r894r489q630
56464F35691q699r000q424p299o207n024m195m719o003o060m773m432n959p229
56450E47668o516n022m375l962k623j091q97k149l715m489l734j571L63L50j007
56435E07230j622j104r41j467j376n29l44q79n25P29Q25o41j413l67P17N51L20
56418D99164Q73J046L27J73R65Q39o57r24J434L860L852K874L452M972N327M647
$$ plain form
56402 532224 536598 540853 544046 545932 547902 551205 555498 559770 563662 567511 571912 577168 582448 585970
56388 585970 587109 587524 588999 591123 592600 593777 595887 598722 601201 603519 606542 609812 612356 614687
56374 614687 617607 619872 619820 618725 619506 622317 624317 623738 621314 617784 613079 608318 605465 604307 602473
56359 602473 599055 595600 592882 589462 584351 578628 573445 568688 564357 560873 557273 551560 543904 537163
56345 537163 533183 530682 527808 524605 521724 518792 515432 512362 510358 509497 510014 512268 515287 517102 517167
56330 517167 516738 516548 516067 515395 515484 515869 514720 512119 510811 512395 515050 516460 516883 517671 518661 518858 518413
56313 518413 518257 518835 520386 523385 527547 531374 533698 534895 536048 537896 540981 545557 550840 555459 558948
56298 558948 561728 563769 564864 566073 568884 572838 575956 577697 579384 581581 583453 584989 587276 589949
$$ packed form
56402E32224M374M255L193J886J970L303M293M272L892L849M401N256N280L522
56388E85970J139M15J475K124J477J177K110K835K479K318L023L270K544K331
56374F14687K920K265n2j095P81K811K000n79k424l530m705m761k853j158j834
56359F02473l418l455k718l420n111n723n183m757m331l484l600n713p656o741
56345E37163l980k501k874l203k881k932l360l070k004q61N17K254L019J815O5
56330E17167m29j90m81o72Q9L85j149k601j308J584K655J410M23P88R90J97m45
56313E18413j56N78J551K999M162L827K324J197J153J848L085M576N283M619L489
56298E58948K780K041J095J209K811L954L118J741J687K197J872J536K287K673
$$ plain form
56284 589949 591056 590368 590332 592699 596547 600684 605509 611284 616988 622314 628487 635609 641513 645003 648162
56269 648162 653511 660670 667691 674169 681020 688289 695039 700864 706274 712093 719028 727035 734928 741776
56255 741776 748712 757734 768769 779988 791092 803809 818671 833936 848487 863180 878251 891925
56243 891925 902892 911944 919979 926662 932151 937755 943650 948272 951229 954361 958499 961618 961838 960102
56229 960102 958514 958152 959839 964545 971544 978610 985559 995053 1008382 1023190 1037214 1051471 1067553
56216 1067553 1084598 1101637 1120608 1144180 1172150 1202385 1233792 1266393 1300225 1336297 1376868
56205 1376868 1422848 1472613 1525101 1581915 1644497 1711588 1781903 1857225 1940338 2031688 2130329
56194 2130329 2236184 2348799 2465696 2584744 2706824 2833715 2964558 3096442 3226887
$$ packed form
56284E89949J107o88l6K367L848M137M825N775N704N326O173P122N904L490L159
56269F48162N349P159P021O478O851P269O750N825N410N819O935Q007P893O848
56255G41776O936R022J1035J1219J1104J2717J4862J5265J4551J4693J5071J3674
56243H91925J0967R052Q035O683N489N604N895M622K957L132M138L119K20j736
56229I60102j588l62J687M706O999P066O949R494J3329J4808J4024J4257J6082
56216A067553J7045J7039J8971K3572K7970L0235L1407L2601L3832L6072M0571
56205A376868M5980M9765N2488N6814O2582O7091P0315P5322Q3113R1350R8641
56194B130329J05855J12615J16897J19048J22080J26891J30843J31884J30445
$$ plain form
56185 3226887 3353644 3473621 3584300 3684856 3773926 3847904 3903482 3940383 3959960 3963115 3951441
56174 3951441 3928098 3895202 3852351 3799877 3741295 3680155 3616772 3550551 3482950 3415225 3345732
56163 3345732 3272831 3198431 3125144 3051829 2975496 2896130 2816059 2735809 2654098 2570990 2487797
56152 2487797 2404754 2321846 2241010 2164525 2091982 2021638 1953819 1890300 1831380 1776297 1725406
56141 1725406 1679162 1636142 1594989 1557184 1524860 1496845 1469917 1443172 1418253 1395988 1375648
56130 1375648 1356922 1340063 1324655 1310449 1298424 1288842 1279581 1268904 1258514 1251266 1247143 1244126
56118 1244126 1241576 1239995 1238867 1237707 1237978 1241053 1245468 1249015 1252360 1257777 1265632 1274987 1286308 1300634
56104 1300634 1317304 1335270 1355346 1378372 1402643 1425968 1448740 1472258 1495866 1518670 1542112
$$ packed form
56185C226887J26757J19977J10679J00556Q9070P3978N5578L6901J9577L155j1674
56174C951441k3343l2896m2851n2474n8582o1140o3383o6221o7601o7725o9493
56163C345732p2901p4400p3287p3315p6333p9366q0071q0250q1711q3108q3193
56152B487797q3043q2908q0836p6485p2543p0344o7819o3519n8920n5083n0891
56141A725406m6244m3020m1153l7805l2324k8015k6928k6745k4919k2265k0340
56130A375648j8726j6859j5408j4206j2025r582r261j0677j0390p248m123l017
56118A244126k550j581j128j160K71L075M415L547L345N417P855R355J1321J4326
56104A300634J6670J7966K0076K3026K4271K3325K2772K3518K3608K2804K3442
$$ plain form
56093 1542112 1567655 1593872 1619036 1644437 1671731 1699315 1725205 1751373 1781163 1814429 1849268
56082 1849268 1886348 1927065 1969590 2011649 2055553 2105690 2162863 2226370 2300014 2390108 2498213
56071 2498213 2621278 2758435 2912140 3082713 3266989 3462383 3666952 3874805 4076402
56062 4076402 4264655 4437541 4595100 4738069 4869046 4990140 5098508 5187564 5252360 5290416
56052 5290416 5298808 5275864 5226113 5159051 5082149 4997921 4906670 4807379 4696046 4567701 4421074
56041 4421074 4258869 4084734 3903517 3722847 3549805 3386727 3233992 3095068 2973999
56032 2973999 2869563 2777165 2695338 2625284 2565378 2511867 2464106 2423507 2388169 2354078 2320896
56021 2320896 2291158 2264710 2239562 2216933 2199352 2184752 2168823 2152431 2140313 2133143 2127386 2122255
$$ packed form
56093A542112K5543K6217K5164K5401K7294K7584K5890K6168K9790L3266L4839
56082A849268L7080M0717M2525M2059M3904N0137N7173O3507P3644R0094J08105
56071B498213J23065J37157J53705J70573J84276J95394K04569K07853K01597
56062D076402J88253J72886J57559J42969J30977J21094J08368Q9056O4796L8056
56052E290416Q392k2944m9751o7062p6902q4228r1251r9291j11333j28345j46627
56041D421074j62205j74135j81217j80670j73042j63078j52735j38924j21069
56032B973999j04436r2398q1827p0054n9906n3511m7761m0599l5338l4091l3182
56021B320896k9738k6448k5148k2629j7581j4600j5929j6392j2118p170n757n131
$$ plain form
56009 2122255 2120060 2120363 2120853 2123565 2132931 2147760 2162483 2176397 2194285 2217568 2242344 2266801 2293358
55996 2293358 2322714 2352754 2383891 2418529 2454917 2488696 2520788 2556440 2596402 2636739 2677438
55985 2677438 2722980 2773835 2825592 2877156 2931638 2988583 3043819 3097860 3155920 3218834 3282479
55974 3282479 3346780 3416259 3490984 3566373 3643018 3727125 3820000 3916576 4015387 4120167 4230555
55963 4230555 4341558 4453663 4573181 4701366 4833938 4972359 5123880 5288940 5460601
55954 5460601 5638481 5830777 6040204 6260809 6491392 6738700 7003857 7279047 7561694
55945 7561694 7858943 8174281 8503232 8846275 9212163 9604196 10017137 10451648 10916904
55936 10916904 11414646 11936375 12481237 13060331 13677807 14324626 14997309 15705896 16456964
$$ packed form
56009B122255k195L03M90K712R366J4829J4723J3914J7888K3283K4776K4457K6557
55996B293358K9356L0040L1137L4638L6388L3779L2092L5652L9962M0337M0699
55985B677438M5542N0855N1757N1564N4482N6945N5236N4041N8060O2914O3645
55974C282479O4301O9479P4725P5389P6645Q4107R2875R6576R8811J04780J10388
55963D230555J11003J12105J19518J28185J32572J38421J51521J65060J71661
55954E460601J77880J92296K09427K20605K30583K47308K65157K75190K82647
55945G561694K97249L15338L28951L43043L65888L92033M12941M34511M65256
55936A0916904M97742N21729N44862N79094O17476O46819O72683P08587P51068
$$ plain form
55927 16456964 17246762 18078459 18968038 19925244 20946962 22036927 23212137 24481036 25835464
55918 25835464 27273199 28807577 30445569 32178967 34008180 35952833 38029119 40241208
55910 40241208 42605537 45157211 47921630 50909363 54152419 57715647 61660676 66035101
55902 66035101 70914127 76415780 82657436 89737233 97773962 106914399 117277646 128947073
55894 128947073 142046798 156774639 173352533 192048029 213295311 237687156 265764205
55887 265764205 297866854 334077214 373723702 414273093 450696739 476705697 487556815
55880 487556815 482266853 463487594 435554689 402582201 367677147 332947268 299675127
55873 299675127 268527127 239840438 213830808 190603823 170109675 152186142 136625218
$$ packed form
55927A6456964P89798Q31697Q89579R57206J021718J089965J175210J268899J354428
55918B5835464J437735J534378J637992J733398J829213J944653K076286K212089
55910D0241208K364329K551674K764419K987733L243056L563228L945029M374425
55902F6035101M879026N501653O241656P079797Q036729R140437J0363247J1669427
55894A28947073J3099725J4727841J6577894J8695496K1247282K4391845K8077049
55887B65764205L2102649L6210360L9646488M0549391L6423646K6008958J0851118
55880D87556815n289962j8779259k7932905l2972488l4905054l4729879l3272141
55873B99675127l1148000k8686689k6009630k3226985k0494148j7923533j5560924
$$ plain form
55866 136625218 123176143 111545343 101451359 92664880 84980915 78194351 72133464
55859 72133464 66687366 61775371 57316228 53246970 49540303 46175761 43113355 40313697
55851 40313697 37760226 35440333 33323611 31377196 29584999 27935121 26405479 24978187
55843 24978187 23652660 22429356 21294388 20232833 19242401 18321231 17456643 16638658 15871127
55834 15871127 15157287 14487099 13850145 13248081 12682904 12145499 11627349 11131845 10662981
55825 10662981 10214432 9780922 9369284 8986760 8628266 8285875 7961058 7656901 7367696
55816 7367696 7087233 6819180 6568972 6333184 6106431 5891133 5690988 5502119 5319728
55807 5319728 5146393 4984973 4830158 4675488 4521884 4371141 4218241 4058962 3898609
$$ packed form
55866A36625218j3449075j1630800j0093984q786479p683965o786564o060887
55859G2133464n446098m911995m459143m069258l706667l364542l062406k799658
55851D0313697k553471k319893k116722j946415j792197j649878j529642j427292
55843B4978187j325527j223304j134968j061555r90432r21170q64588q17985p67531
55834A5871127p13840o70188o36954o02064n65177n37405n18150m95504m68864
55825A0662981m48549m33510m11638l82524l58494l42391l24817l04157k89205
55816G367696k80463k68053k50208k35788k26753k15298k00145j88869j82391
55807E319728j73335j61420j54815j54670j53604j50743j52900j59279j60353
$$ plain form
55798 3898609 3744455 3595460 3447800 3304604 3171645 3048523 2932337 2825365 2731247 2647848
55788 2647848 2571107 2501883 2442457 2390758 2344371 2305477 2275202 2247429 2214577 2175502 2132292
55777 2132292 2084320 2031526 1978759 1930444 1885081 1840542 1799968 1766655 1738043 1710822 1687060
55766 1687060 1668996 1652556 1632565 1609997 1587699 1563427 1533778 1500804 1467862 1432793 1392128
55755 1392128 1348580 1307556 1269291 1231031 1193954 1161302 1132338 1104584 1079617 1060410 1045222
55744 1045222 1030317 1016619 1007664 1002831 998505 994409 993212 995045 997385 999155 1000615 1000767 998922 996878
55730 996878 995696 992790 986070 978086 971825 965603 956722 946963 939468 933288 926396 921115 920872 924139
55716 924139 927378 931646 940132 950893 958094 959451 957022 951723 942368 929400 914623 897755 877502
$$ packed form
55798C898609j54154j48995j47660j43196j32959j23122j16186j06972r4118q3399
55788B647848p6741o9224n9426n1699m6387l8894l0275k7773l2852l9075m3210
55777B132292m7972n2794n2767m8315m5363m4539m0574l3313k8612k7221k3762
55766A687060j8064j6440j9991k2568k2298k4272k9649l2974l2942l5069m0665
55755A392128m3548m1024l8265l8260l7077l2652k8964k7754k4967j9207j5188
55744A045222j4905j3698q955m833m326m096j197J833K340J770J460J52j845k044
55730I96878j182k906o720p984o261o222q881r759p495o180o892n281k43L267
55716I24139L239M268Q486J0761P201J357k429n299r355j2968j4777j6868k0253
$$ plain form
55703 877502 855110 832856 810418 786779 763868 743889 724934 703987 682511 664057 647965
55692 647965 630636 611689 593535 575926 556362 535390 516293 499766 483678 467896 454601
55681 454601 443872 433356 422511 413238 406442 401637 399323 399843 400570 398433 394690 393053 393669 393397
55667 393397 391579 390794 391670 391393 388016 382471 375874 368390 361201 356148 352953 349668 345861 342528 339301
55652 339301 335031 330839 329228 330218 331378 331398 330740 329512 327930 328101 331764 336839 339683 340162 340820 341807
55636 341807 340800 337724 335347 335003 335599 337016 340576 345722 350008 353120 357439 363990 371067 377503 384203
55621 384203 391802 399724 408083 417761 428085 436984 443572 448143 449959 448058 444059 440932 438939 435895
55607 435895 431360 427348 424793 422670 420903 420851 422509 424324 426259 430020 435903 442371 449096 457434 467571
$$ packed form
55703H77502k2392k2254k2438k3639k2911j9979j8955k0947k1476j8454j6092
55692F47965j7329j8947j8154j7609j9564k0972j9097j6527j6088j5782j3295
55681D54601j0729j0516j0845r273o796m805k314N20P27k137l743j637O16k72
55667C93397j818p85Q76k77l377n545o597p484p189n053l195l285l807l333l227
55652C39301m270m192j611R90J160K0o58j228j582J71L663N075K844M79O58R87
55636C41807j007l076k377l44N96J417L560N146M286L112M319O551P077O436O700
55621C84203P599P922Q359R678J0324Q899O588M571J816j901l999l127j993l044
55607D35895m535m012k555k123j767n2J658J815J935L761N883O468O725Q338J0137
$$ plain form
55592 467571 478232 489549 503154 518986 534921 549854 564128 576724 585332 589677 591640 591603 587875
55579 587875 580297 571132 561709 551305 540098 529971 521518 513407 505656 500391 498222 496849 494481
55566 494481 491796 489267 485324 478580 469435 458389 445160 430540 416597 403951 391121 377406
55554 377406 363956 351276 338402 325559 314762 306461 298334 288974 280355 274795 271482 267728 262205
55541 262205 255627 249507 245133 242501 239827 235539 230676 227445 225644 223040 219302 216638 216046 215954 215327
55526 215327 215201 216069 216530 215795 215129 215614 216776 218412 221375 225656 230028 234557 240880 249106 256962 262959
55510 262959 267838 272188 275726 280032 288528 301926 316613 329397 340983 352884 363899 372108 377611
55497 377611 380665 379486 372769 362571 351856 340689 327428 312378 297723 284730 273253 263161
$$ packed form
55592D67571J0661J1317J3605J5832J5935J4933J4274J2596Q608M345J963l7l728
55579E87875p578r165r423j0404j1207j0127q453q111p751n265k169j373k368
55566D94481k685k529l943o744r145j1046j3229j4620j3943j2646j2830j3715
55554C77406j3450j2680j2874j2843j0797q301q127r360q619n560l313l754n523
55541B62205o578o120m374k632k674m288m863l231j801k604l738k664n92r2o27
55526B15327j26Q68M61p35o66M85J162J636K963M281M372M529O323Q226P856N997
55510B62959M879M350L538M306Q496J3398J4687J2784J1586J1901J1015Q209N503
55497C77611L054j179o717j0198j0715j1167j3261j5050j4655j2993j1477j0092
$$ plain form
55485 263161 254296 245786 237068 228852 221789 215290 208998 204027 201075 198622 194792 190006 186102 183740
55471 183740 182334 181635 181758 182271 182754 183767 186069 189367 192810 196029 198907 201138 202968 205617 210184
55456 210184 216686 224523 232962 240932 247626 253802 261218 270490 280766 291514 302718 313149 320769
55443 320769 325488 329227 332460 333060 329613 323302 315205 304420 290837 277294 266430 256996 245742
55430 245742 231868 217576 205225 195790 189160 184043 178195 170363 161574 153614 147112 141914 137997
55417 137997 134832 131108 126400 122180 120093 120210 121677 123684 125003 124153 121071 117244 113465 109213 104863
55402 104863 102216 101682 101271 99702 98174 97568 96517 94227 92625 93294 94553 94258 93371 93796 94540 93261
55386 93261 90250 87654 85888 83990 82572 82972 83970 82814 79631 77700 78819 81104 82022 81301 80081
$$ packed form
55485B63161q865q510q718q216p063o499o292m971k952k453l830m786l904k362
55471A83740j406o99J23N13M83J013K302L298L443L219K878K231J830K649M567
55456B10184O502P837Q439P970O694O176P416R272J0276J0748J1204J0431P620
55443C20769M719L739L233O00l447o311q097j0785j3583j3543j0864r434j1254
55430B45742j3874j4292j2351r435o630n117n848p832q789p960o502n198l917
55417A37997l165l724m708m220k087J17J467K007J319q50l082l827l779m252m350
55402A04863k647n34m11j569j528o06j051k290j602O69J259k95q87M25P44j279
55386I3261l011k596j766j898j418M00R98j156l183j931J119K285R18p21j220
$$ plain form
55371 80081 79249 79525 81582 85125 88737 91120 91849 91063 89382 87901 87358 87560 88417 90800 95169 99982
55355 99982 102864 103058 101626 99809 98309 97601 97648 97686 97297 97107 97564 98009 98061 98767 100915 103264 104096 103605
55337 103605 103141 103013 102780 102879 103937 105072 104749 102971 100914 98864 96262 93391 91299 90327 90227 91290
55321 91290 93684 96180 97183 96715 95897 95023 93779 92764 92864 93489 93236 92115 91338 91110 90333 88391 85654
55304 85654 82455 79162 77042 77229 78817 79498 78138 75528 72958 71456 72013 74817 78341 80604 81222
55289 81222 81021 80229 78568 76673 75644 75433 75139 74585 74117 73406 72089 71036 71272 72218 72805 73611 75753
55272 75753 78317 79252 78521 77998 78456 79050 79663 81096 82709 82521 80309 78316 78153 79013 79498 79234 78080
55255 78080 75802 73198 71689 71189 70211 68594 68050 69277 70647 70698 70137 70383 71865 74652 78942 83818
$$ packed form
55371H0081q32K76K057L543L612K383P29p86j681j481n43K02Q57K383M369M813
55355I9982K882J94j432j817j500p08M7L8l89j90M57M45N2P06K148K349Q32m91
55337A03605m64j28k33R9J058J135l23j778k057k050k602k871k092r72j00J063
55321I1290K394K496J003m68q18q74j244j015J00O25k53j121p77k28p77j942k737
55304H5654l199l293k120J87J588O81j360k610k570j502N57K804L524K263O18
55289H1222k01p92j661j895j029k11k94n54m68p11j317j053K36R46N87Q06K142
55272G5753K564R35p31n23M58N94O13J433J613j88k212j993j63Q60M85k64j154
55255G8080k278k604j509n00r78j617n44J227J370N1n61K46J482K787M290M876
$$ plain form
55239 83818 87160 87974 87503 87210 87129 87000 87255 87794 87436 85837 84429 84214 84094 82792 80976 79865 78955
55222 78955 76987 74283 72304 71332 70177 68058 65473 63263 61815 61236 61588 62960 65544 69201 72723
55207 72723 74418 74023 73301 74044 76217 78751 81188 83452 84725 83987 81578 79147 77958 78006 78768 79951
55191 79951 81180 81681 80830 78945 77133 76295 76395 76699 76467 75272 73028 70364 68794 69565 72080 74337
55175 74337 75345 76148 77876 79914 80892 80476 79042 76644 73765 72113 72881 74763 75488 74826 74209 73912
55159 73912 72980 71877 72639 75692 78708 79606 78867 77925 77032 76017 75624 76552 77950 78200 76825 74862 73805
55142 73805 74663 77337 80443 82339 82772 82919 83715 84963 86183 87192 87657 87182 86254 85866 85828 84695 81872
55125 81872 78572 76077 74255 72611 71632 72071 73660 75388 76495 76670 75952 74914 74276 74005 73636 73672 75418
$$ packed form
55239H3818L342Q14m71k93q1j29K55N39l58j599j408k15j20j302j816j111r10
55222G8955j968k704j979r72j155k119k585k210j448n79L52J372K584L657L522
55207G2723J695l95p22P43K173K534K437K264J273p38k409k431j189M8P62J183
55191G9951J229N01q51j885j812q38J00L04k32j195k244k664j570P71K515K257
55175G4337J008Q03J728K038R78m16j434k398k879j652P68J882P25o62o17k97
55159G3912r32j103P62L053L016Q98p39r42q93j015l93R28J398K50j375j963j057
55142G3805Q58K674L106J896M33J47P96J248J220J009M65m75r28l88l8j133k823
55125H1872l300k495j822j644r79M39J589J728J107J75p18j038o38k71l69L6J746
$$ plain form
55108 75418 78864 81916 82574 80986 78616 76309 74073 72175 71496 72868 76307 80559 83457 83486 81091
55093 81091 77874 74844 72492 72056 74772 79600 83492 84572 83665 82249 80681 79184 78680 79308 79460 77678
55077 77678 74525 71606 69817 69486 70958 73742 76151 77086 77258 77629 77764 77075 76632 78114 81544 85495
55061 85495 89136 92763 96584 100201 103192 105488 107402 109738 113259 117460 120673 121968 122083 121859 120906
55046 120906 118751 116074 113655 111176 108449 106699 106998 108243 108438 107421 106583 106339 105746 104491 103441
55031 103441 102978 102367 101216 100300 100531 102032 104484 107389 109779 110685 110379 110335 111528 113395 114803 115504
55015 115504 116220 117604 119468 120910 121144 120275 119172 118460 117881 116883 115562 114655 114724 115613 116616 117081 117029
54998 117029 117172 118033 119162 119703 119461 118701 117140 114369 111367 110249 111881 114766 116933 117959 118469 118712
$$ packed form
55108G5418L446L052O58j588k370k307k236j898o79J372L439M252K898K9k395
55093H1091l217l030k352m36K716M828L892J080r07j416j568j497n04O28J52j782
55077G7678l153k919j789l31J472K784K409R35J72L71J35o89m43J482L430L951
55061H5495L641L627L821L617K991K296J914K336L521M201L213J295J15k24r53
55046A20906k155k677k419k479k727j750K99J245J95j017q38k44n93j255j050
55031A03441m63o11j151r16K31J501K452K905K390R06l06m4J193J867J408P01
55015A15504P16J384J864J442K34q69j103p12n79r98j321r07O9Q89J003M65n2
54998A17029J43Q61J129N41k42p60j561k771l002j118J632K885K167J026N10K43
$$ plain form
54982 118712 118501 117788 116492 114461 112269 111237 112023 113945 116292 119172 122337 124485 124866 124541 124711 124765
54966 124765 123404 120944 118929 117981 117578 117672 119039 121975 125807 129688 133033 135329 136472 137130 138032 139145
54950 139145 140222 141577 143447 145180 146131 146964 149005 152506 156358 159109 159595 157330 153391 150280 149662
54935 149662 150648 151280 151059 150878 151166 151556 151791 151422 149176 144378 138810 135404 135059 136165 137110 137561 137389
54918 137389 136286 134910 134657 135644 136288 135548 134276 133773 134182 134954 135833 136644 137097 137526 139000 142067 146018
54901 146018 149933 153706 157507 160999 163803 166304 169333 173327 178209 183775 189855 196279 202857 209340
54887 209340 215442 221272 227574 235126 243975 253694 264194 275712 288087 300657 312870 324522 335447
54874 335447 345342 353621 359065 360149 356441 349322 340575 330694 319385 307169 295263 284034 272735
$$ packed form
54982A18712k11p13j296k031k192j032P86J922K347K880L165K148L81l25J70N4
54966A24765j361k460k015r48m03R4J367K936L832L881L345K296J143O58R02J113
54950A39145J077J355J870J733R51Q33K041L501L852K751M86k265l939l111o18
54935A49662R86O32k21j81K88L90K35l69k246m798n568l406l45J106R45M51j72
54918A37389j103j376k53R87O44p40j272n03M09P72Q79Q11M53M29J474L067L951
54901A46018L915L773L801L492K804K501L029L994M882N566O080O424O578O483
54887B09340O102N830O302P552Q849R719J0500J1518J2375J2570J2213J1652J0925
54874C35447R895Q279N444J084l708p119q747r881j1309j2216j1906j1229j1299
$$ plain form
54861 272735 260826 248632 236763 225782 216391 208991 203051 197756 193110 189634 187295 185837 185765 187683
54847 187683 190858 193941 197108 201844 208349 214713 219374 223174 228300 236163 246833 259525 272951
54834 272951 285849 297769 308936 319349 328585 336168 341052 341103 334811 323793 311872 301099 290198
54821 290198 277599 264234 252205 242197 233714 226702 221204 215929 208945 199937 190762 183650 179497
54808 179497 177778 177377 177421 177633 177954 177963 177197 176028 175425 175526 175311 174047 172165 170193 167842 164949 162354
54791 162354 160749 159360 156951 153645 150596 148174 145758 143329 142041 142742 144780 146705 147601 147274 145580
54776 145580 142268 137628 132940 129784 128660 128457 127582 125540 123147 121422 120748 120910 121263 120894 119469 118065
54760 118065 118315 120404 122676 123642 123573 123609 124143 124881 125848 127365 129299 131194 133058 135378 138497 142489
$$ packed form
54861B72735j1909j2194j1869j0981r391p400n940n295m646l476k339j458p2J918
54847A87683L175L083L167M736O505O364M661L800N126P863J0670J2692J3426
54834B72951J2898J1920J1167J0413R236P583M884N1o292j1018j1921j0773j0901
54821B90198j2599j3365j2029j0008q483p012n498n275o984r008r175p112m153
54808A79497j719m01M4K12L21Rp66j169o03J01k15j264j882j972k351k893k595
54791A62354j605j389k409l306l049k422k416k429j288P01K038J925Q96l27j694
54776A45580l312m640m688l156j124k03q75k042k393j725o74J62L53l69j425j404
54760A18065K50K089K272R66o9L6N34P38R67J517J934J895J864K320L119L992
$$ plain form
54744 142489 147454 153291 159232 164124 167288 168836 169340 169591 170549 173083 177633 184244 192749 202671 213236
54729 213236 223964 235154 247510 261367 276534 292768 309977 327880 345679 362144 376024
54718 376024 386440 392967 395341 393261 386897 377585 367561 358602 350899 343344 334802 325277 316124 309107
54704 309107 304910 302513 300291 297648 295205 293669 293285 294415 297746 303485 310878 318880 326888 334657
54690 334657 342250 350472 360635 373087 386345 398326 408195 416527 424086 431207 438033 444452 449701
54677 449701 452708 453043 451065 447017 440552 431340 419619 405795 389981 372474 354331 336800 320247
54664 320247 304300 289088 275493 263770 252771 241407 230354 221244 214357 208281 201994 196064
54652 196064 191352 187625 184237 181210 178772 176601 174458 172919 172502 172629 172492 172364 172878 173543 173394 172795
$$ packed form
54744A42489M965N837N941M892L164J548N04K51R58K534M550O611Q505R922J0565
54729B13236J0728J1190J2356J3857J5167J6234J7209J7903J7799J6465J3880
54718C76024J0416O527K374k080o364r312j0024q959p703p555q542r525r153p017
54704C09107m197k397k222k643k443j536l84J130L331N739P393Q002Q008P769
54690C34657P593Q222J0163J2452J3258J1981R869Q332P559P121O826O419N249
54677D49701L007L35j978m048o465r212j1721j3824j5814j7507j8143j7531j6553
54664C20247j5947j5212j3595j1723j0999j1364j1053r110o887o076o287n930
54652A96064m712l727l388l027k438k171k143j539m17J27j37j28N14O65j49n99
$$ plain form
54636 172795 173068 174420 175783 176887 178868 182236 185594 187244 187093 186211 185313 184529 184090 184401 185593 187408
54620 187408 189472 191548 193690 195993 197948 198520 197630 197064 198899 203194 208401 213742 219731 226325 232329
54605 232329 237217 242079 247873 253891 258789 262167 264347 265596 266451 267959 270706 274212 278050 282894
54591 282894 289690 298330 307810 317260 326392 335596 346076 359201 375246 393377 413014 434154 455992
54578 455992 476480 493990 508283 519069 524870 524453 518371 507966 493762 476125 456649 437425
54566 437425 419295 401933 385156 369053 353270 337505 322589 310078 300811 294468 290166 286793
54554 286793 283242 279119 274882 270891 267004 263550 261436 260378 258297 253864 248578 244797 242706 240979
54540 240979 239500 239202 239620 238927 236509 233488 230472 226802 222565 219333 217908 216785 213953 209171 203687
$$ packed form
54636A72795K73J352J363J104J981L368L358J650j51q82q98p84m39L11J192J815
54620A87408K064K076K142K303J955N72q90n66J835M295N207N341N989O594O004
54605B32329M888M862N794O018M898L378K180J249Q55J508K747L506L838M844
54591B82894O796Q640R480R450R132R204J0480J3125J6045J8131J9637K1140K1838
54578D55992K0488J7510J4293J0786N801m17o082j0405j4204j7637j9476j9224
54566D37425j8130j7362j6777j6103j5783j5765j4916j2511r267o343m302l373
54554B86793l551m123m237l991l887l454k114j058k081m433n286l781k091j727
54540B40979j479k98M18o93k418l021l016l670m237l232j425j123k832m782n484
$$ plain form
54525 203687 198692 194853 192490 191282 190291 188903 187378 186140 185132 184128 183082 181955 180836 180329 180972
54510 180972 182095 182194 180765 178836 177396 176346 175521 175605 177120 179316 181068 182265 183449 184542 185033 185256
54494 185256 186481 189470 193471 196892 198645 198849 198529 198822 200278 202714 205546 208208 210568 213232 217293
54479 217293 223283 230346 236892 242150 246797 252035 258500 266160 274797 284299 294608 305329 315215 322347
54465 322347 325489 325335 323884 322390 320354 316551 310415 302163 292215 281156 270082 260342 252556 245940
54451 245940 238992 231166 223753 218609 215994 214421 212814 211768 211935 212228 211046 208731 207225 207345 207951
54436 207951 208025 208038 208615 209225 209092 208432 207910 207744 208218 210199 213926 217812 219733 219488 219044 220344 223626
54419 223626 227868 232023 235605 238655 241463 244055 245981 246965 247676 249313 252324 256004 259471 262449 264850
$$ packed form
54525B03687m995l839k363j208r91j388j525j238j008j004j046j127j119n07O43
54510A80972J123R9j429j929j440j050q25Q4J515K196J752J197J184J093M91K23
54494A85256J225K989M001L421J753K04l20K93J456K436K832K662K360K664M061
54479B17293N990P063O546N258M647N238O465P660Q637R502J0309J0721R886P132
54465C22347L142j54j451j494k036l803o136q252r948j1059j1074r740p786o616
54451B45940o948p826p413n144k615j573j607j046J67K93j182k315j506J20O06
54436B07951P4J3N77O10j33o60n22j66M74J981L727L886J921k45m44J300L282
54419B23626M242M155L582L050K808K592J926R84P11J637L011L680L467K978K401
$$ plain form
54404 264850 266106 265482 262962 259413 255891 253125 251597 251613 252899 254315 254454 252726 249782 246864 244827
54389 244827 243719 242987 241961 240346 238486 237054 236320 235800 234768 232954 230629 228185 225903 223982 222391
54374 222391 220677 218369 215791 214087 213986 214667 214389 212476 210199 209267 209765 210339 210296 210518 211851 213528
54358 213528 214027 212874 210635 207685 204244 201424 200781 202498 205110 207330 209182 211219 213949 218393 225626
54343 225626 234916 243601 249880 254627 259424 264159 268012 271643 276418 281953 286287 288386 288943 288811 288243
54328 288243 287733 288009 288845 289185 288721 288072 287080 284325 279048 272533 266882 263132 261046 259877 258783 257165
54312 257165 255173 253427 251881 249557 245716 240815 236065 232589 231134 231847 233839 235521 235845 234999 233877
54297 233877 233358 234125 236535 240326 244716 248865 252044 253766 254428 255362 257335 259361 260080 260008 260917 263078
$$ packed form
54404B64850J256o24k520l549l522k766j528J6J286J416J39j728k944k918k037
54389B44827j108p32j026j615j860j432p34n20j032j814k325k444k282j921j591
54374B22391j714k308k578j704j01O81k78j913k277r32M98N74m3K22J333J677
54358B13528M99j153k239k950l441k820o43J717K612K220J852K037K730M444P233
54343B25626R290Q685O279M747M797M735L853L631M775N535M334K099N57j32n68
54328B88243n10K76Q36L40m64o49r92k755n277o515n651l750k086j169j094j618
54312B57165j992j746j546k324l841m901m750l476j455P13J992J682L24q46j122
54297B33877n19P67K410L791M390M149L179J722O62R34J973K026P19p2R09K161
$$ plain form
54281 263078 264908 265788 267351 270879 274886 276778 276061 274454 273270 272040 269674 265956 261630 257585 254062
54266 254062 250439 245891 240430 235077 230882 228047 225932 223487 219744 214679 209710 206458 204738 202571
54252 202571 198526 193184 187888 183073 178518 174375 170952 167946 164774 161463 158609 156636 155450 154538
54238 154538 153267 151577 150409 150637 151402 150598 147569 144247 142882 143607 145054 146271 146732 145384 141409
54223 141409 135863 131146 128577 127425 126483 125626 125400 125698 125441 123624 120615 118258 118305 120730 124027 127099
54207 127099 129973 132578 134113 134376 134630 135959 137550 137796 136635 135545 135491 136082 136663 137228 138066 139327
54191 139327 140993 142736 143921 144388 144925 146217 147638 147925 146908 145657 144951 144464 143512 141852 139669 137455
54175 137455 135990 135854 136787 137816 137968 136774 134657 133168 134039 137191 140393 141798 142001 142485 142994 142188
$$ packed form
54281B63078J830Q80J563L528M007J892p17j607j184j230k366l718m326m045l523
54266B54062l623m548n461n353m195k835k115k445l743n065m969l252j720k167
54252B02571m045n342n296m815m555m143l423l006l172l311k854j973j186r12
54238A54538j271j690j168K28P65q04l029l322j365P25J447J217M61j348l975
54223A41409n546m717k569j152r42q57k26K98k57j817l009k357M7K425L297L072
54207A27099K874K605J535K63K54J329J591K46j161j090n4N91N81N65Q38J261
54191A39327J666J743J185M67N37J292J421K87j017j251p06m87r52j660k183k214
54175A37455j465j36R33J029J52j194k117j489Q71L152L202J405K03M84N09q06
$$ plain form
54159 142188 140300 138918 138107 136078 132354 129163 128380 128767 127762 124886 121735 119319 117119 114696 112781
54144 112781 112334 113370 115037 116477 117354 117816 118060 117982 117436 116767 116653 117232 117864 117943 117530 116908 116083 115055
54126 115055 114130 113535 113123 112846 113087 114049 115180 115707 115460 114752 113811 112857 112490 113301 115113 116994 117993 117641
54108 117641 116009 113755 111911 111136 111127 111120 110841 110646 110863 111378 111823 111807 111088 109882 108941 108879 109547 110530 112063
54089 112063 114680 117791 119447 118217 115035 112597 112886 115575 118770 120951 122060 123007 124409 125962 126910
54074 126910 126918 126317 125611 125038 124610 124302 124094 124062 124537 125853 127691 129001 128955 127845 126752 126480 127123 128371
54056 128371 129565 129637 127872 125042 123061 122940 123522 122793 120140 116792 114296 113172 112947 112880 112562 112237 112661
54039 112661 114319 116750 118936 120364 121412 122663 124152 125327 125604 125023 124404 124559 125210 125182 124056 123022
$$ packed form
54159A42188j888j382q11k029l724l191p83L87j005k876l151k416k200k423j915
54144A12781m47J036J667J440Q77M62K44p8n46o69j14N79O32P9m13o22q25j028
54126A15055r25n95m12k77K41R62J131N27k47p08r41r54l67Q11J812J881R99l52
54108A17641j632k254j844p75rpk79j95K17N15M45j6p19j206r41o2O68R83J533
54089A12063K617L111J656j230l182k438K89K689L195K181J109R47J402J553R48
54074A26910Qo01p06n73m28l08k08l2M75J316J838J310m6j110j093k72O43J248
54056A28371J194P2j765k830j981j21N82p29k653l348k496j124k25o7l18l25M24
54039A12661J658K431K186J428J048J251J489J175K77n81o19J55O51k8j126j034
$$ plain form
54023 123022 123423 124929 126116 126442 126697 127722 129841 133334 137981 142021 143214 141752 140738 142792 147142
54008 147142 150923 152374 151629 149487 146978 145696 146855 149728 152102 152554 151616 150730 150785 151759 153022 153801
53992 153801 153849 153829 154624 156292 158032 159057 159145 158577 158003 158168 159268 160737 162140 164005 167193 171724 176835
53975 176835 181990 187145 192192 196821 200926 204622 208045 211670 216490 223023 230377 237160 243272 249883
53961 249883 257606 265592 272639 278348 282891 286462 289368 292148 295172 298458 301981 305718 309184 311398
53947 311398 311560 309597 306105 302140 298810 296472 294357 291457 287650 283398 278727 273464 268197 263781
53933 263781 259853 255144 249565 244649 241384 238811 235634 232055 228935 225990 222182 217445 212839 209196
53919 209196 206666 205426 205700 206913 207879 208151 208348 208851 208944 207908 206356 205635 206074 206583 206120 204955 204138
$$ packed form
54023A23022M01J506J187L26K55J025K119L493M647M040J193j462j014K054M350
54008A47142L781J451p45k142k509j282J159K873K374M52r38q86N5R74J263P79
53992A53801M8k0P95J668J740J025Q8n68n74J65J100J469J403J865L188M531N111
53975A76835N155N155N047M629M105L696L423L625M820O533P354O783O112O611
53961B49883P723P986P047N709M543L571K906K780L024L286L523L737L466K214
53947C11398J62j963l492l965l330k338k115k900l807m252m671n263n267m416
53933B63781l928m709n579m916l265k573l177l579l120k945l808m737m606l643
53919B09196k530j240K74J213R66K72J97N03R3j036j552p21M39N09m63j165q17
$$ plain form
53902 204138 204104 204315 204053 203077 201539 199830 198707 198965 200605 202682 204347 205639 206876 207783 208057 208471
53886 208471 210486 214612 219798 224683 228977 233442 238872 245161 251160 255622 258723 262329 268044 275191
53872 275191 281528 285940 289463 293639 298847 304573 310284 315306 318599 319525 318663 317449 317201 318552 321334
53857 321334 324735 328113 331762 336372 341723 346845 351684 357340 364052 370136 374084 376853 380808 386937
53843 386937 394333 402046 410012 418192 426029 432986 438644 442235 443237 442728 442930 444744 446649 446791 445355
53828 445355 443865 442690 440460 435993 429813 423387 417533 411982 405976 398808 390047 379900 369349 359476
53814 359476 350485 341816 333310 325788 320035 315564 310962 305385 299185 293002 286851 280405 273821 267829
53800 267829 263068 259607 257130 255296 253719 251702 248378 243580 238465 234646 232396 230189 226458 221374
$$ packed form
53902B04138l4K11k62r76j538j709j123K58J640K077J665J292J237R07K74M14
53886B08471K015M126N186M885M294M465N430O289N999M462L101L606N715P147
53872B75191O337M412L523M176N208N726N711N022L293R26q62j214k48J351K782
53857C21334L401L378L649M610N351N122M839N656O712O084L948K769L955O129
53843C86937P396P713P966Q180P837O957N658L591J002n09K02J814J905J42j436
53828D45355j490j175k230m467o180o426n854n551o006p168q761j0147j0551r873
53814C59476q991q669q506p522n753m471m602n577o200o183o151o446o584n992
53800B67829m761l461k477j834j577k017l324m798n115l819k250k207l731n084
$$ plain form
53786 221374 216350 212241 208895 206192 204454 203697 203380 203082 202711 201939 200396 198719 198322 199533 200900 201117
53770 201117 200809 201433 203047 204335 204557 204345 204518 205075 205497 205344 204374 202754 201405 201616 203892 207450 211092
53753 211092 214326 217445 220727 223900 226512 228768 231676 236103 241789 247625 252978 258230 263885 269652
53739 269652 274850 279331 283620 288350 293881 300164 306638 312567 317853 323167 328883 334214 337902 339658
53725 339658 340505 341788 344013 346321 346939 344730 340737 337583 336790 337261 337061 335962 335223 335508 336342 337308
53709 337308 338301 338537 336791 333072 328794 324774 320228 314469 308430 303546 299990 297123 294999 294166 294288
53694 294288 294222 293522 292886 292886 293026 292274 289985 286282 282135 279096 278117 278300 277557 274904 271531 269111 267768
53677 267768 266436 264673 263041 261931 261180 261015 262136 264226 265411 264277 261844 260317 260085 259188 255950
$$ packed form
53786B21374n024m109l346k703j738p57l17k98l71p72j543j677l97J211J367K17
53770B01117l08O24J614J288K22k12J73N57M22j53r70j620j349K11K276L558L642
53753B11092L234L119L282L173K612K256K908M427N686N836N353N252N655N767
53739B69652N198M481M289M730N531O283O474N929N286N314N716N331L688J756
53725C39658Q47J283K225K308O18k209l993l154p93M71k00j099p39K85Q34R66
53709C37308R93K36j746l719m278m020m546n759o039m884l556k867k124q33J22
53694B94288o6p00o36%J40p52k289l703m147l039r79J83p43k653l373k420j343
53677B67768j332j763j632j110p51j65J121K090J185j134k433j527k32q97l238
$$ plain form
53662 255950 250908 245789 241721 239307 239273 241620 244504 245482 244160 242566 242600 243985 245204 245544 245454 245442 245593
53645 245593 246066 247255 249200 251351 253158 254619 256025 257381 258371 258911 259581 261314 264583 268923 273438
53630 273438 277716 282005 286510 290980 295289 299885 305086 310259 314608 318720 324236 331528 338702 343755
53616 343755 346963 349865 352416 352777 350219 346748 344951 345311 346614 348175 350312 353032 355578 357416 358703
53601 358703 359643 360223 360796 362077 364196 366348 367592 367516 366094 363686 361373 360488 361350 363100 365008 367054
53585 367054 368792 368765 366118 362107 358922 357356 356649 356255 356485 357365 358053 357887 357170 356559 356353 356812 358399
53568 358399 361096 363972 366113 367687 369511 371792 374077 376349 379392 383744 388921 394126 399331 405075
53554 405075 411402 417713 423665 429536 435404 440594 444563 448014 452505 458964 467065 475955 485066 494155
$$ packed form
53662B55950n042n119m068k414l4K347K884R78j322j594L4J385J219L40r0j2J51
53645B45593M73J189J945K151J807J461J406J356R90N40O70J733L269M340M515
53630B73438M278M289M505M470M309M596N201N173M349M112N516P292P174N053
53616C43755L208K902K551L61k558l471j797L60J303J561K137K720K546J838J287
53601C58703R40N80N73J281K119K152J244p6j422k408k313q85Q62J750J908K046
53585C67054J738k7k647m011l185j566p07l94K30Q80O88j66p17o11k06M59J587
53568C58399K697K876K141J574J824K281K285K272L043M352N177N205N205N744
53554D05075O327O311N952N871N868N190L969L451M491O459Q101Q890R111R089
$$ plain form
53540 494155 503055 511574 519448 526409 532648 539001 546119 553495 560050 565752 571949 579751 588810 598081
53526 598081 607066 615722 623676 630348 635762 640771 646538 653974 663190 673007 681391 686989 690104 691865
53512 691865 692897 693402 694144 696359 700511 705628 710002 712303 712243 710678 709021 708124 707618 706625 704872 702754
53496 702754 700620 698585 696881 695662 694432 692431 689760 687476 686258 685593 684753 684023 684261 685400 686223
53481 686223 685830 684707 683900 683533 683009 682718 684640 690518 699787 710011 719219 727260 735008 743191 752093
53466 752093 761653 771446 781173 791391 803148 816720 831490 847381 865462 886501 909749 933960
53454 933960 958965 985423 1013537 1042913 1073293 1104699 1137186 1171078 1206886 1244329 1282161
53443 1282161 1319935 1359162 1401464 1446146 1491151 1536090 1582678 1632020 1683092 1734328 1785404
$$ packed form
53540D94155Q900Q519P874O961O239O353P118P376O555N702O197P802R059R271
53526E98081Q985Q656P954O672N414N009N767P436R216R817Q384N598L115J761
53512F91865J032N05P42K215M152N117M374K301o0j565j657q97n06r93j753k118
53496G02754k134k035j704j219j230k001k671k284j218o65q40p30K38J139Q23
53481F86223l93j123q07l67n24k91J922N878R269J0224R208Q041P748Q183Q902
53466G52093R560R793R727J0218J1757J3572J4770J5891J8081K1039K3248K4211
53454I33960K5005K6458K8114K9376L0380L1406L2487L3892L5808L7443L7832
53443A282161L7774L9227M2302M4682M5005M4939M6588M9342N1072N1236N1076
$$ plain form
53432 1785404 1836927 1889452 1943318 1998444 2053778 2107873 2160540 2213111 2266591 2320526 2374152
53421 2374152 2427660 2481507 2535336 2588459 2640859 2692869 2744209 2793930 2841009 2884598 2924335
53410 2924335 2961000 2996315 3031313 3065134 3095921 3122564 3145309 3165352 3184336 3203525 3222592
53399 3222592 3239601 3252945 3262884 3270473 3275558 3276890 3273853 3266927 3256548 3242692 3225676 3206156
53387 3206156 3183867 3157433 3126075 3090806 3053246 3013961 2972792 2930276 2887597 2845097 2801833
53376 2801833 2756892 2710482 2663419 2616263 2569480 2523802 2479504 2435667 2391062 2345929 2302133
53365 2302133 2261437 2224295 2190441 2159683 2131701 2106092 2083440 2065542 2053495 2045987 2040661 2036984
53353 2036984 2036697 2041503 2051384 2065292 2082429 2102496 2125650 2152667 2184447 2220937 2261071 2304055
$$ packed form
53432A785404N1523N2525N3866N5126N5334N4095N2667N2571N3480N3935N3626
53421B374152N3508N3847N3829N3123N2400N2010N1340M9721M7079M3589L9737
53410B924335L6665L5315L4998L3821L0787K6643K2745K0043J8984J9189J9067
53399C222592J7009J3344R939P589N085J332l037o926j0379j3856j7016j9520
53387C206156k2289k6434l1358l5269l7560l9285m1169m2516m2679m2500m3264
53376B801833m4941m6410m7063m7156m6783m5678m4298m3837m4605m5133m3796
53365B302133m0696l7142l3854l0758k7982k5609k2652j7898j2047p508n326l677
53353B036984k87M806R881J3908J7137K0067K3154K7017L1780L6490M0134M2984
$$ plain form
53341 2304055 2350082 2399632 2452783 2509476 2569584 2632354 2696621 2762158 2830139 2901747 2977053
53330 2977053 3055846 3138767 3226703 3319556 3416413 3516580 3619655 3724978 3831895 3940501
53320 3940501 4051376 4164613 4279747 4396530 4515033 4634791 4754317 4871764 4985970
53311 4985970 5096806 5204644 5309403 5410173 5505922 5596343 5681413 5760250 5831385 5894670
53301 5894670 5951969 6005134 6053728 6095446 6128362 6152154 6167635 6175895 6177510 6171763 6156847 6131494
53289 6131494 6096013 6050955 5995303 5927163 5846142 5754023 5653255 5545837 5433556 5317896
53279 5317896 5199199 5077048 4952047 4826467 4702614 4581284 4462183 4345016 4229568
53270 4229568 4115523 4002957 3892550 3784709 3678986 3574970 3473197 3374517 3279112 3186970
$$ packed form
53341B304055M6027M9550N3151N6693O0108O2770O4267O5537O7981P1608P5306
53330B977053P8793Q2921Q7936R2853R6857J00167J03075J05323J06917J08606
53320C940501J10875J13237J15134J16783J18503J19758J19526J17447J14206
53311D985970J10836J07838J04759J00770R5749R0421Q5070P8837P1135O3285
53301E894670N7299N3165M8594M1718L2916K3792J5481Q260J615n747j4916k5353
53289F131494l5481m5058n5652o8140q1021r2119j00768j07418j12281j15660
53279E317896j18697j22151j25001j25580j23853j21330j19101j17167j15448
53270D229568j14045j12566j10407j07841j05723j04016j01773r8680r5405r2142
$$ plain form
53260 3186970 3099005 3016755 2941143 2872257 2810076 2754354 2703806 2656585 2612010 2571030 2534606
53249 2534606 2502456 2473872 2448946 2428068 2410824 2396353 2384570 2375955 2370183 2366006 2362810 2361414
53237 2361414 2362858 2367058 2373193 2380712 2389312 2398577 2408601 2420687 2436413 2456010 2478490 2503339
53225 2503339 2531139 2562358 2596529 2633133 2672455 2714910 2760208 2807852 2857808 2909732 2961990
53214 2961990 3012487 3060484 3106652 3151389 3194144 3234731 3274219 3313611 3352148 3387908 3420004
53203 3420004 3449314 3476777 3501617 3521922 3536778 3547274 3555211 3561199 3564271 3563060 3556906 3545777
53191 3545777 3529580 3507886 3480277 3446746 3407654 3363272 3313479 3258178 3198121 3135046 3070538
53180 3070538 3004833 2937155 2867196 2795891 2724818 2655508 2589396 2527391 2468796 2411337 2353278
$$ packed form
53260C186970q7965q2250p5612o8886o2181n5722n0548m7221m4575m0980l6424
53249B534606l2150k8584k4926k0878j7244j4471j1783q615n772m177l196j396
53237B361414J444M200O135P519Q600R265J0024J2086J5726J9597K2480K4849
53225B503339K7800L1219L4171L6604L9322M2455M5298M7644M9956N1924N2258
53214B961990N0497M7997M6168M4737M2755M0587L9488L9392L8537L5760L2096
53203C420004K9310K7463K4840K0305J4856J0496P937N988L072j211o154j1129
53191C545777j6197k1694k7609l3531l9092m4382m9793n5301o0057o3075o4508
53180C070538o5705o7678o9959p1305p1073o9310o6112o2005n8595n7459n8059
$$ plain form
53169 2353278 2295272 2239190 2185286 2131675 2076853 2021585 1967635 1915525 1864525 1814232 1764813
53158 1764813 1715862 1666513 1617257 1570532 1528526 1490889 1455451 1420613 1386149 1352251 1319242
53147 1319242 1288205 1260273 1234662 1208664 1180446 1150889 1121812 1093548 1065550 1038429 1013483
53136 1013483 990438 967545 944166 921684 901206 881781 861758 840854 819902 799356 779090
53125 779090 759209 740097 721762 703779 685769 667549 649089 630718 613121 596828 582015
53114 582015 568863 557443 546911 535653 522918 509789 497849 487387 477574 467890 458492 449506
53102 449506 440917 433020 426236 420396 414807 408945 402659 395940 389092 382849 377618 372773 367443 361809
53088 361809 356802 352536 348003 342546 336843 332029 328441 325684 323494 321973 321078 320225 318580 315884 312992
$$ packed form
53169B353278n8006n6082n3904n3611n4822n5268n3950n2110n1000n0293m9419
53158A764813m8951m9349m9256m6725m2006l7637l5438l4838l4464l3898l3009
53147A319242l1037k7932k5611k5998k8218k9557k9077k8264k7998k7121k4946
53136A013483k3045k2893k3379k2482k0478j9425k0023k0904k0952k0546k0266
53125G79090j9881j9112j8335j7983j8010j8220j8460j8371j7597j6293j4813
53114E82015j3152j1420j0532j1258j2735j3129j1940j0462r813r684r398q986
53102D49506q589p897o784n840n589n862o286o719o848o243n231m845n330n634
53088C61809n007m266m533n457n703m814l588k757k190j521q95q53j645k696k892
$$ plain form
53073 312992 311290 311288 312011 312066 310999 309293 307487 305984 305390 306044 307161 307275 305833 303711 301855 300071
53057 300071 297682 294880 292828 292447 293521 295075 296422 297669 299166 300666 301398 301158 300842 301435 302705
53042 302705 303426 302888 301658 300766 300520 300413 300008 299833 301224 305023 310313 314901 317398 318451 319635 321709
53026 321709 324583 328324 333006 337759 341185 343015 344393 346091 347253 346377 343009 338095 333168 329490
53012 329490 327293 325275 321454 315245 308414 303304 300289 297673 294051 289962 286780 284484 281303 275748
52998 275748 268498 261815 257232 254322 251803 249183 246844 245018 243425 241733 239659 236667 232393 227624
52984 227624 224173 223255 224254 225353 225180 223719 221949 220875 220600 220108 218146 214524 210445 207423 206025
52969 206025 205665 205306 204163 201979 198983 195666 192580 190225 188903 188490 188455 188365 188292 188440 188520 187885 186392
$$ packed form
53073C12992j702kP23N5j067j706j806j503n94O54J117J14j442k122j856j784
53057C00071k389k802k052l81J074J554J347J247J497J500P32k40l16N93J270
53042C02705P21n38j230q92k46j07m05j75J391L799N290M588K497J053J184K074
53026C21709K874L741M682M753L426J830J378J698J162q76l368m914m927l678
53012C29490k197k018l821o209o831n110l015k616l622m089l182k296l181n555
52998B75748p250o683m583k910k519k620k339j826j593j692k074k992m274m769
52984B27624l451r18R99J099j73j461j770j074k75m92j962l622m079l022j398
52969B06025l60l59j143k184k996l317l086k355j322m13l5r0p3J48Q0o35j493
$$ plain form
52952 186392 184831 184323 185323 187100 188085 187062 184367 181757 180742 181189 181955 182560 183501 185009 186358 186742
52936 186742 186226 185389 184449 183296 182145 181663 182224 183302 183854 183441 182872 183461 185567 188177 190060 190905 191058
52919 191058 190670 189725 188596 187839 187531 187481 188023 189856 192879 195757 196943 195915 193385 190701 189014 188682
52903 188682 189346 190761 193241 196893 200811 203777 205666 207470 209937 212886 215780 218232 219888 220684 221449
52888 221449 223567 227675 233188 239225 245411 251573 257275 262061 265879 269199 272973 278146 284540 290448
52874 290448 294301 296565 298912 301501 302490 300658 297193 294096 291990 290385 289085 287998 286111 282033
52860 282033 275729 268982 263991 261653 260896 259383 255450 249906 245500 244056 244491 244087 241292 236742 232073
52845 232073 228447 225944 223621 220322 215981 212056 210246 210952 213259 216015 218418 219969 220558 220572 220463
$$ packed form
52952A86392j561n08J000J777R85j023k695k610j015M47P66O05R41J508J349L84
52936A86742n16q37r40j153j151m82N61J078N52m13n69N89K106K610J883Q45J53
52919A91058l88r45j129p57l08n0N42J833L023K878J186j028k530k684j687l32
52903A88682O64J415K480L652L918K966J889J804K467K949K894K452J656P96P65
52888B21449K118M108N513O037O186O162N702M786L818L320L774N173O394N908
52874B90448L853K264K347K589R89j832l465l097k106j605j300j087j887m078
52860B82033o304o747m991k338p57j513l933n544m406j444M35m04k795m550m669
52845B32073l626k503k323l299m341l925j810P06K307K756K403J551N89J4j09
$$ plain form
52830 220463 220267 219715 218599 216828 214638 213020 213264 215403 217616 217947 216396 214656 214041 214386 214887 215287
52814 215287 216028 217531 219425 220494 219755 217723 216122 216092 217273 218906 220904 223108 224419 223938 222585
52799 222585 222300 223661 225309 225895 225588 225404 225817 226432 226552 225795 224481 223513 223534 224243 224935 225610 227002 229544
52781 229544 232936 236920 241883 248265 255551 262096 266049 266657 264939 263041 262663 264031 266305 268585 270352
52766 270352 271389 271734 271584 271087 270547 270930 273414 277924 282717 286054 287787 288742 289270 289410 289884 291548
52750 291548 293844 294959 293758 290757 287035 283018 278495 273132 266840 260248 254742 251265 249066 246579
52736 246579 243522 241044 239572 237787 234400 229865 225369 220926 215697 209909 205238 203004 202723 202766 201995
52721 201995 200333 197973 194654 190136 185185 181384 179494 178444 176602 173914 172024 172137 173517 174415 173917
$$ packed form
52830B20463j96n52j116j771k190j618K44K139K213L31j551j740o15L45N01M00
52814B15287P41J503J894J069p39k032j601l0J181J633J998K204J311m81j353
52799B22585k85J361J648N86l07j84M13O15J20p57j314r68K1P09O92O75J392K542
52781B29544L392L984M963O382P286O545L953O08j718j898l78J368K274K280J767
52766B70352J037L45j50m97n40L83K484M510M793L337J733R55N28J40M74J664
52750B91548K296J115j201l001l722m017m523n363o292o592n506l477k199k487
52736B46579l057k478j472j785l387m535m496m443n229n788m671k234k81M3p71
52721B01995j662k360l319m518m951l801j890j050j842k688j890J13J380Q98m98
$$ plain form
52706 173917 172401 170553 168600 166440 164099 161889 160161 158930 157787 156394 155059 154529 155092 156066 156319
52691 156319 155178 152772 149661 146292 142817 139436 136765 135555 135906 136966 137641 137403 136317 134721 133264
52676 133264 132817 133730 135317 136565 137121 137061 135992 133355 129696 126809 126173 127580 129528 130683 130904 131214
52660 131214 132820 135756 138465 139175 137839 136355 136717 139156 142034 143254 141909 138951 136250 134786 134038
52645 134038 133351 133167 134050 135145 134975 133649 132823 133224 133564 132543 130724 129665 130068 131585 133608 135364
52629 135364 135909 135063 133913 133654 134357 135656 137946 141759 146267 149680 151187 151607 152097 153270 155649 159840
52613 159840 165585 171488 176356 180396 184444 188428 191416 193095 194506 196987 200673 204342 206637 207211
52599 207211 206651 205446 203296 199552 194268 188585 183946 181026 179617 179388 180308 182035 183266 182414 179133
$$ packed form
52706A73917j516j848j953k160k341k210j728j231j143j393j335n30N63R74K53
52691A56319j141k406l111l369l475l381k671j210L51J060O75k38j086j596j457
52676A33264m47R13J587J248N56o0j069k637l659k887o36J407J948J155K21L10
52660A31214J606K936K709P10j336j484L62K439K878J220j345k958k701j464p48
52645A34038o87j84Q83J095j70j326q26M01L40j021j819j059M03J517K023J756
52629A35364N45q46j150k59P03J299K290L813M508L413J507M20M90J173K379M191
52613A59840N745N903M868M040M048L984K988J679J411K481L686L669K295N74
52599B07211n60j205k150l744n284n683m639k920j409k29R20J727J231q52l281
$$ plain form
52584 179133 174709 170648 167237 163848 160217 156740 153719 151065 148832 147338 146521 145741 144640 143692 143462
52569 143462 143695 143740 143707 144601 147160 150927 154659 157432 159180 160308 160995 160969 159880 157776 155175 152706
52553 152706 150765 149489 148906 148979 149462 149828 149650 149195 149399 150867 152994 154559 155101 155158 155137 154796 154207 154247
52535 154247 155336 156404 156191 155187 155158 156911 159753 163111 167334 172361 176725 178820 178665 177682 177114 177227
52519 177227 177795 178666 179766 180886 181678 181905 181760 181715 181855 181675 180993 180736 182030 184590 186891 187996 188336
52502 188336 188495 188241 187298 186189 185580 185453 185683 186939 190053 194592 198782 200922 200561 198463 195911 194066
52486 194066 193550 194303 195732 196932 197086 196107 194828 194146 194089 194183 194498 195442 196690 197464 198011 199528 202176
52469 202176 204424 205157 205161 205516 205745 204912 203622 203183 203359 202753 201273 200408 200806 201275 200824 200225 200650 201806
$$ packed form
52584A79133m424m061l411l389l631l477l021k654k233j494q17p80j101r48k30
52569A43462K33M5l3Q94K559L767L732K773J748J128O87k6j089k104k601k469
52553A52706j941j276n83P3M83L66j78m55K04J468K127J565N42N7k1l41n89M0
52535A54247J089J068k13j004k9J753K842L358M223N027M364K095j55r83n68J13
52519A77227N68Q71J100J120P92K27j45m5J40j80o82k57J294K560K301J105L40
52502A88336J59k54r43j109o09j27K30J256L114M539M190K140l61k098k552j845
52486A94066n16P53J429J200J54r79j279o82n7R4L15R44J248P74N47J517K648
52469B02176K248P33ML55K29q33j290m39J76o06j480q65L98M69m51n99M25J156
$$ plain form
52451 201806 202427 201942 200660 198766 196101 192976 190528 190056 192050 195679 199166 201089 201660 202407 204330
52436 204330 206658 207723 206713 204226 201439 199251 198051 197726 197767 197762 197911 198872 201018 204116 207644 211042
52420 211042 213470 213910 212177 209777 209060 211203 215368 219938 224070 227577 229960 230646 230165 230057 231101
52405 231101 232216 231688 229077 225529 222593 221131 220963 220976 219864 217386 214811 213516 213312 212762 211129 209279
52389 209279 208422 208677 209340 210133 211503 213665 215883 217029 216751 215905 215829 217266 219957 222900 224830 224749 222586
52372 222586 219531 217383 217305 219194 222028 224519 225579 224873 223152 221680 221166 221657 223382 226767 231183
52357 231183 234591 235289 233673 231599 230488 230762 232521 235520 238584 240321 240832 241855 244634 248315 250940
52342 250940 251625 251251 251352 252878 255982 260428 265892 271857 277410 281461 283414 283617 283054 282648 282971 284318
$$ packed form
52451B01806O21m85j282j894k665l125k448m72J994L629L487J923N71P47J923
52436B04330K328J065j010k487k787k188j200l25M1nJ49R61K146L098L528L398
52420B11042K428M40j733k400p17K143M165M570M132L507K383O86m81j08J044
52405B31101J115n28k611l548k936j462j68J3j112k478k575j295k04n50j633j850
52389B09279q57K55O63P93J370K162K218J146k78q46p6J437K691K943J930q1k163
52372B22586l055k148p8J889K834K491J060p06j721j472n14M91J725L385M416
52357B31183L408O98j616k074j111K74J759K999L064J737N11J023K779L681K625
52342B50940O85l74J01J526L104M446N464N965N553M051J953K03n63m06L23J347
$$ plain form
52326 284318 286653 289478 292042 293761 294328 293715 292463 291758 292636 294972 297624 299644 300953 301885 302715 303891
52310 303891 306121 309612 313499 316671 319121 321834 325154 327886 328664 327885 327449 328425 329776 329934 328972 328328
52294 328328 328806 330048 332043 335705 341164 346508 349461 350044 350595 353163 357629 362330 365841 368004 369810
52279 369810 372470 376244 380113 382936 384826 386891 389688 392561 394696 396269 398254 401353 405399 409602
52265 409602 413177 415902 418284 421181 425142 429991 434891 438851 441532 443766 446938 451515 456425 460269
52251 460269 462993 465978 470564 476805 483685 490334 497003 504778 514111 523702 531651 537858 544331 552418
52237 552418 560681 566705 570458 574389 580320 587801 595886 605048 616255 629000 641409 652123 661344
52224 661344 670001 678489 686507 693941 701592 710685 721566 733255 744671 755908 767724 780092 792082
$$ packed form
52326B84318K335K825K564J719N67o13j252p05Q78K336K652K020J309R32Q30J176
52310C03891K230L491L887L172K450K713L320K732P78p79m36R76J351J58r62o44
52294C28328M78J242J995L662N459N344K953N83N51K568M466M701L511K163J806
52279C69810K660L774L869K823J890K065K797K873K135J573J985L099M046M203
52265D09602L575K725K382K897L961M849M900L960K681K234L172M577M910L844
52251D60269K724K985M586O241O880O649O669P775R333R591P949O207O473Q087
52237E52418Q263O024L753L931N931P481Q085R162J1207J2745J2409J0714R221
52224F61344Q657Q488Q018P434P651R093J0881J1689J1416J1237J1816J2368J1990
$$ plain form
52211 792082 803136 813587 823758 833411 842316 850575 858075 864486 870324 877218 886202 896093 904305
52198 904305 909254 911570 913203 915801 919710 923981 927310 929293 930789 932900 935866 939176 942460 945784
52184 945784 949133 952056 954063 955207 956166 957727 960207 963420 967149 971304 975477 978861 981262 983987
52170 983987 988874 996288 1004827 1013216 1021632 1030755 1040424 1050138 1060324 1071903 1084572 1096500 1106159
52157 1106159 1113984 1121793 1130866 1140956 1151039 1160607 1169962 1179300 1187931 1194772 1199606 1203484 1207695
52144 1207695 1212567 1217408 1221334 1223887 1225011 1224862 1223672 1221564 1218373 1213785 1207844 1201323 1195421 1190888
52130 1190888 1187507 1184702 1182634 1182114 1183130 1183992 1182698 1178994 1174419 1170415 1167150 1164234 1161616 1159234
52116 1159234 1156465 1152727 1148338 1144204 1140676 1137205 1133126 1128462 1123908 1120228 1117681 1115842 1113939 1111335
$$ packed form
52211G92082J1054J0451J0171R653Q905Q259P500O411N838O894Q984R891Q212
52198I04305M949K316J633K598L909M271L329J983J496K111K966L310L284L324
52184I45784L349K923K007J144R59J561K480L213L729M155M173L384K401K725
52170I83987M887P414Q539Q389Q416R123R669R714J0186J1579J2669J1928R659
52157A106159P825P809R073J0090J0083R568R355R338Q631O841M834L878M211
52144A207695M872M841L926K553J124j49j190k108l191m588n941o521n902m533
52130A190888l381k805k068n20J016Q62j294l704m575m004l265k916k618k382
52116A159234k769l738m389m134l528l471m079m664m554l680k547j839j903k604
$$ plain form
52102 1111335 1107732 1103174 1098118 1093367 1089526 1086457 1083537 1080326 1076602 1071962 1066118 1059685 1053931 1049375
52088 1049375 1045130 1039954 1033418 1025722 1017041 1007778 999117 992569 988880 987677 987927 988310 987368 984019 978294
52073 978294 971443 965104 960240 956687 953613 950444 947220 943992 940307 935855 931383 928028 925589 922380
52059 922380 917222 910834 904686 899262 894176 889353 885134 881728 879471 879244 881375 884287 885516 884446
52045 884446 883071 883597 886206 889717 893606 898460 904729 911945 919226 926099 932762 939851 948002 957373
52031 957373 967623 978405 989706 1001547 1013683 1026058 1039402 1054757 1072181 1090365 1107875
52020 1107875 1124566 1141419 1159134 1177229 1194522 1210180 1224220 1237347 1250468 1264100 1277976
52009 1277976 1291286 1303479 1314779 1325835 1337023 1348116 1358387 1366831 1372562 1375383 1376018 1375651 1375310
$$ packed form
52102A111335l603m558n056m751l841l069k920l211l724m640n844o433n754m556
52088A049375m245n176o536p696q681r263q661o548l689j203K50L83r42l349n725
52073I78294o851o339m864l553l074l169l224l228l685m452m472l355k439l209
52059I22380n158o388o148n424n086m823m219l406k257k27K131K912J229j070
52045H84446j375N26K609L511L889M854O269P216P281O873O663P089Q151R371
52031I57373J0250J0782J1301J1841J2136J2375J3344J5355J7424J8184J7510
52020A107875J6691J6853J7715J8095J7293J5658J4040J3127J3121J3632J3876
52009A277976J3310J2193J1300J1056J1188J1093J0271Q444N731K821O35l67l41
$$ plain form
51996 1375310 1375595 1376468 1377033 1376082 1373506 1370808 1369490 1369144 1367976 1365162 1361698 1358645 1355607 1351721 1347390
51981 1347390 1343854 1341165 1337750 1332546 1326863 1323227 1322504 1323041 1322931 1322204 1321938 1321764 1319849 1315578 1310891
51966 1310891 1308031 1306970 1306159 1305007 1304267 1304340 1304679 1304835 1304844 1304498 1303430 1302049 1301111 1300092 1297299 1292130 1285947
51949 1285947 1280020 1273842 1266497 1258640 1251770 1245962 1239575 1231184 1220906 1209668 1197779 1184539 1169176
51936 1169176 1152017 1134446 1117389 1100199 1081751 1062277 1043034 1024220 1004611 983541 961765
51925 961765 939733 916512 891562 866431 843325 822732 803601 785128 767046 748769 729675
51914 729675 710081 690788 671857 652863 634112 616546 600560 585847 572179 559389 546745
51903 546745 533433 519781 507175 496697 488328 481187 473965 465644 456588 448472 442221 436624 430034
$$ packed form
51996A375310K85Q73N65r51k576k698j318l46j168k814l464l053l038l886m331
51981A347390l536k689l415n204n683l636p23N37j10p27k66j74j915m271m687
51966A310891k860j061q11j152p40P3L39J56Rl46j068j381r38j019k793n169o183
51949A285947n927o178p345p857o870n808o387q391j0278j1238j1889j3240j5363
51936A169176j7159j7571j7057j7190j8448j9474j9243j8814j9609k1070k1776
51925I61765k2032k3221k4950k5131k3106k0593j9131j8473j8082j8277j9094
51914G29675j9594j9293j8931j8994j8751j7566j5986j4713j3668j2790j2644
51903E46745j3312j3652j2606j0478q369p141p222q321r056q116o251n597o590
$$ plain form
51890 430034 422742 416271 410892 405593 400287 396116 393330 390575 386894 382899 379333 375849 372060 368658
51876 368658 366498 365252 363704 360911 356769 352175 348835 347850 348046 346797 343150 339073 336834 336164 335085
51861 335085 332778 330313 328814 328094 327247 325880 324476 323789 323987 324383 324206 323458 322570 321357 319141 315953
51845 315953 312716 309952 307315 304736 302933 302102 301248 299794 298906 299877 301753 302056 299800 296611 294684
51830 294684 294579 295276 295514 294695 293078 291570 291045 291586 292541 293381 294169 295148 296256 297299 298400 299887 301723
51813 301723 303283 303981 304043 304350 305353 306454 306715 305863 304211 302041 299796 298604 299487 301860 303797 304170
51797 304170 303729 303682 304220 305188 307225 310943 315341 318373 319236 319161 319642 320637 320986 320087 318627 317891 318747 321189
51779 321189 324351 326790 327165 325206 322113 319653 318729 319038 320067 321753 323877 325661 326764 327994 330043
$$ packed form
51890D30034p292o471n379n299n306m171k786k755l681l995l566l484l789l402
51876C68658k160j246j548k793m142m594l340r85J96j249l647m077k239o70j079
51861C35085k307k465j499p20q47j367j404o87J98L96j77p48q88j213k216l188
51845C15953l237k764k637k579j803q31q54j454q88R71J876L03k256l189j927
51830B94684j05O97K38q19j617j508n25N41R55Q40P88R79J108J043J101J487J836
51813C01723J560O98O2L07J003J101K61q52j652k170k245j192Q83K373J937L73
51797C04170m41m7N38R68K037L718M398L032Q63p5M81R95L49q99j460p36Q56K442
51779C21189L162K439L75j959l093k460r24L09J029J686K124J784J103J230K049
$$ plain form
51764 330043 332122 333166 333937 336174 339595 341717 341305 340086 339927 340078 338979 337439 337820 340620 343940
51749 343940 346243 347785 349125 349992 350273 350755 352059 353750 355123 356172 357285 358700 360669 363542 367228
51734 367228 371184 375243 379790 384825 389778 394782 401239 410232 421039 432098 442801 453123 461854
51721 461854 466749 466779 463047 456927 448414 437291 425167 414930 408019 403156 398064 391651 384213 376412
51707 376412 368949 362899 359291 358063 357941 357575 356444 354654 352406 350021 348075 347051 346825 346659 345661
51692 345661 343381 340246 337379 335515 333991 331305 326864 321727 317390 314416 312583 311729 311731 312008 311828 311051
51676 311051 310069 309081 307893 306287 304088 301046 297288 293895 292339 293095 295182 297170 298300 298600 298474
51661 298474 298428 298782 299318 299473 299108 298864 299477 300852 302010 301926 300470 298666 298065 299500 302361 305285 307658
$$ packed form
51764C30043K079J044P71K237L421K122m12j219j59J51j099j540L81K800L320
51749C43940K303J542J340Q67K81M82J304J691J373J049J113J415J969K873L686
51734C67228L956M059M547N035M953N004O457Q993J0807J1059J0703J0322Q731
51721D61854M895L0l732o120q513j1123j2124j0237o911m863n092o413p438p801
51707C76412p463o050l608j228j22l66j131j790k248k385j946j024k26j66r98
51692C45661k280l135k867j864j524k686m441n137m337k974j833q54KK77j80p77
51676C11051r82r88j188j606k199l042l758l393j556P56K087J988J130L00j26
51661B98474m6L54N36J55l65k44O13J375J158q4j456j804o01J435K861K924K373
$$ plain form
51644 307658 310124 313512 317699 322039 326664 332566 340094 347844 353630 356426 356868 355989 354262 352142 350609
51629 350609 350042 348919 344872 337446 328997 322377 318421 316134 314516 313274 312227 311091 309848 308550
51615 308550 306750 303848 300019 296000 291914 287165 281769 276818 273102 270170 267537 266050 266788 268851
51601 268851 269634 267654 264072 260881 258589 256668 255481 256185 258678 261003 261524 260682 259820 259082 257717 256062
51585 256062 255744 257568 260278 262032 262454 262598 263418 264948 266690 268207 269376 270463 271877 273569 274954
51570 274954 275771 276688 278522 280971 282782 283317 283486 284883 288184 292640 297047 300997 305002 309425 313700
51555 313700 317030 319656 322785 327176 332503 338391 345269 353491 362222 370089 376651 382376 387369 391094
51541 391094 393438 395072 396439 397224 397342 397709 399171 401132 402164 402017 402102 403600 405814 407201 407789 409644
$$ packed form
51644C07658K466L388M187M340M625N902P528P750N786K796M42q79j727k120j533
51629C50609n67j123m047p426q449o620l956k287j618j242j047j136j243j298
51615C08550j800k902l829m019m086m749n396m951l716k932k633j487P38K063
51601B68851P83j980l582l191k292j921j187P04K493K325N21q42q62p38j365j655
51585B56062l18J824K710J754M22J44Q20J530J742J517J169J087J414J692J385
51570B74954Q17R17J834K449J811N35J69J397L301M456M407L950M005M423M275
51555C13700L330K626L129M391N327N888O878Q222Q731P867O562N725M993L725
51541C91094K344J634J367P85J18L67J462J961J032j47Q5J498K214J387N88J855
$$ plain form
51525 409644 414569 422021 429882 436800 442996 449055 455003 460702 466103 470602 473048 473142 472255 472003 472424
51510 472424 472379 471351 469875 468339 466380 463699 460585 457304 453481 448493 442116 434700 427091 420404 415283
51495 415283 411110 406425 400482 394103 388783 385239 383017 381191 379067 376427 373381 370094 366583 362854
51481 362854 359199 356160 354178 353322 353221 353163 352533 351550 351396 353106 356292 359397 361261 362050 362605 363418 364500
51464 364500 365830 367514 369615 372058 374699 377376 379863 381773 382587 382129 381178 381155 382602 384186 383903 381357
51448 381357 378253 376624 377127 379136 381651 383689 384441 383895 383189 383815 386404 390421 394959 399590 404561
51433 404561 410325 416854 423489 429799 436541 445172 455971 467087 476051 482105 486506 490552 493967 495521
51419 495521 494736 492473 489959 487696 485280 481809 476284 468133 457915 447338 437996 430029 422467 414873
$$ packed form
51525D09644M925P452P861O918O196O059N948N699N401M499K446R4q87k52M21
51510D72424m5j028j476j536j959k681l114l281l823m988o377p416p609o687n121
51495D15283m173m685n943o379n320l544k222j826k124k640l046l287l511l729
51481C62854l655l039j982q56j01n8o30r83j54J710L186L105J864P89N55Q13J082
51464C64500J330J684K101K443K641K677K487J910Q14m58r51k3J447J584k83k546
51448C81357l104j629N03K009K515K038P52n46p06O26K589M017M538M631M971
51433D04561N764O529O635O310O742Q631J0799J1116Q964O054M401M046L415J554
51419D95521p85k263k514k263k416l471n525q151j0218j0577r342p967p562p594
$$ plain form
51405 414873 407915 402119 396854 391257 385624 380962 377350 373680 369245 364915 362393 362595 364916 367834
51391 367834 370201 372191 374940 379005 383413 386618 388207 388960 389309 388550 385866 381406 375813 369132 360847
51376 360847 350971 340696 331756 325068 319995 315044 309512 304232 300426 298151 296408 294597 292963 291469
51362 291469 289130 285095 279934 275209 271909 269740 267813 265617 263260 261056 259089 257201 255324 253657
51348 253657 252425 251653 251366 251750 252784 253965 254828 255483 256199 256753 256882 257154 258449 260478 261737 261198 259342
51331 259342 257253 255543 254476 254264 254566 254324 252865 250850 249599 249756 250987 252551 253782 254475 255295 257283
51315 257283 260509 263648 265402 265778 265420 264461 262974 261947 262534 264590 267093 269862 273547 277803 280976
51300 280976 282313 283261 285557 288865 291485 292874 294050 295499 296062 294519 291318 287869 284722 281426 277868
$$ packed form
51405D14873o958n796n265n597n633m662l612l670m435m330k522K02K321K918
51391C67834K367J990K749M065M408L205J589P53L49p59k684m460n593o681q285
51376C60847r876j0275q940o688n073m951n532n280l806k275j743j811j634j494
51362B91469k339m035n161m725l300k169j927k196k357k204j967j888j877j667
51348B53657j232p72k87L84J034J181Q63O55P16N54J29K72J295K029J259n39j856
51331B59342k089j710j067k12L02k42j459k015j251J57J231J564J231O93Q20J988
51315B57283L226L139J754L76l58r59j487j027N87K056K503K769L685M256L173
51300B80976J337R48K296L308K620J389J176J449N63j543l201l449l147l296l558
$$ plain form
51285 277868 274492 270959 265825 258446 250477 244337 240362 236607 231632 226438 222923 221108 218924 214826
51271 214826 209862 206632 206347 207397 207025 204145 200109 196809 194723 193129 191527 190047 188797 187664 186756
51256 186756 186387 186580 187111 188001 189318 190691 191783 193125 195431 198096 199530 199297 198784 199246 200288 201011
51240 201011 201615 202816 204429 205641 206257 206681 206979 206776 205851 204041 200918 196440 191749 188450 187034 186591
51224 186591 186035 185125 184486 185094 187445 190672 192930 193302 192866 192996 193139 191541 188058 184799 183621 184077
51208 184077 184526 184394 184503 185628 187510 189268 190214 190142 189099 187194 184700 182081 179618 177158 174784 173610
51192 173610 174939 178252 181037 181425 180207 179392 179652 180446 181856 184387 187075 187743 185724 182907 181441
51177 181441 181683 183023 185251 187979 189888 189992 189115 188835 189304 189330 188499 187945 188769 190700 192849 195095 197981
$$ packed form
51285B77868l376l533n134p379p969o140l975l755m975n194l515j815k184m098
51271B14826m964l230k85J050l72k880m036l300k086j594j602j480j250j133r08
51256A86756l69J93N31Q90J317J373J092J342K306K665J434k33n13M62J042P23
51240B01011O04J201J613J212O16M24K98k03r25j810l123m478m691l299j416m43
51224A86591n56r10o39O08K351L227K258L72m36J30J43j598l483l259j178M56
51208A84077M49j32J09J125J882J758R46p2j043j905k494k619k463k460k374j174
51192A73610J329L313K785L88j218q15K60P94J410K531K688O68k019k817j466
51177A81441K42J340K228K728J909J04q77k80M69K6q31n54Q24J931K149K246K886
$$ plain form
51160 197981 201452 204405 205768 205744 205562 205967 206448 206326 206145 207225 209832 212644 214353 215164 216226 218109
51144 218109 220373 222281 223360 223527 223160 222948 223187 223388 222966 222096 221437 221230 221282 221690 222798 224252 224890
51127 224890 224139 223079 223405 225428 227723 228930 229405 230727 233846 238058 241681 243270 242330 239461 236207
51112 236207 234314 234528 236092 237609 238301 238121 236962 234369 230161 224868 219306 214084 209665 206473 204526
51097 204526 203164 201563 199485 197193 194806 192291 190257 190030 192209 195328 196839 195671 193196 191298
51083 191298 190215 189048 187802 187672 189242 191538 193253 194079 194440 194741 195356 196571 197867 197976 196399 194273
51067 194273 192983 192441 191611 190260 189189 188996 189499 190256 190821 190711 189964 189654 191078 194478 199040 203753
51051 203753 207559 209389 209261 208973 210444 213577 216980 220371 224537 229022 231852 232147 231352 231114 231479 231979
$$ packed form
51160A97981L471K953J363k4j82M05M81j22j81J080K607K812J709Q11J062J883
51144B18109K264J908J079J67l67k12K39K01m22q70o59k07N2M08J108J454O38
51127B24890p51j060L26K023K295J207M75J322L119M212L623J589r40k869l254
51112B36207j893K14J564J517O92j80j159k593m208n293n562n222m419l192j947
51097B04526j362j601k078k292k387k515k034k27K179L119J511j168k475j898
51083A91298j083j167j246j30J570K296J715Q26L61L01O15J215J296J09j577k126
51067A94273j290n42q30j351j071j93N03P57N65j10p47l10J424L400M562M713
51051B03753L806J830j28k88J471L133L403L391M166M485K830K95p95k38L65N00
$$ plain form
51035 231979 233018 234988 237147 238573 239417 240266 241135 242122 244105 247576 251428 253974 254658 253861 251900 249430
51019 249430 248029 248793 250586 251077 249501 247271 245914 245451 244889 243432 241135 239059 238569 239875 241451
51004 241451 241681 240658 239564 238790 237897 237100 237389 239022 240975 241962 241140 238034 233103 228382 226149 226537
50988 226537 227617 228048 228413 229584 231267 232943 234914 237331 239132 239257 238373 238266 239764 242186 244558
50973 244558 246477 247845 248655 249217 250046 251229 252187 252163 250877 248783 246767 245461 244781 244398 244632 246475
50957 246475 250559 256471 263177 269665 275167 279438 283143 287258 291690 295135 296819 297672 299046 300957
50943 300957 302514 303582 304904 306743 308642 310624 313576 318012 323338 328910 335077 342463 350664 358508
50929 358508 365606 373025 382175 393251 404994 415984 426136 436806 449326 463567 478249 492533
$$ packed form
51035B31979J039J970K159J426Q44Q49Q69R87J983L471L852K546O84p97j961k470
51019B49430j401P64J793M91j576k230j357m63n62j457k297k076m90J306J576
51004B41451K30j023j094p74q93p97K89J633J953R87q22l106m931m721k233L88
50988B26537J080M31L65J171J683J676J971K417J801J25q84j07J498K422K372
50973B44558J919J368Q10N62Q29J183R58k4j286k094k016j306o80l83K34J843
50957B46475M084N912O706O488N502M271L705M115M432L445J684Q53J374J911
50943C00957J557J068J322J839J899J982K952M436N326N572O167P386Q201P844
50929C58508P098P419R150J1076J1743J0990J0152J0670J2520J4241J4682J4284
$$ plain form
50917 492533 506766 521532 536633 551545 566583 582974 601857 623704 648627 676434 706067
50906 706067 735759 764593 793820 825942 862288 901838 942512 983180 1024132 1065996 1108791
50895 1108791 1152177 1196191 1241244 1287168 1332451 1374807 1412699 1446101 1475571 1500922 1521388
50884 1521388 1537021 1549179 1559293 1567653 1573839 1577960 1580951 1583852 1587317 1591591 1596380 1600721 1603513
50871 1603513 1604304 1603307 1600677 1596147 1589255 1579341 1565273 1545886 1521119 1492311 1460938 1427308 1390887
50858 1390887 1351619 1310445 1268544 1226596 1184957 1144205 1105045 1067579 1030959 994231 957773
50847 957773 923738 894660 871382 852454 835673 820144 806682 796272 788398 781195 773246 764936
50835 764936 757652 751922 746999 742434 739136 738186 739151 740623 742323 745545 751121 757776 763213 766472 768676
$$ packed form
50917D92533J4233J4766J5101J4912J5038J6391J8883K1847K4923K7807K9633
50906G06067K9692K8834K9227L2122L6346L9550M0674M0668M0952M1864M2795
50895A108791M3386M4014M5053M5924M5283M2356L7892L3402K9470K5351K0466
50884A521388J5633J2158J0114Q360O186M121K991K901L465M274M789M341K792
50871A603513P91r97k630m530o892r914j4068j9387k4767k8808l1373l3630l6421
50858A390887l9268m1174m1901m1948m1639m0752l9160l7466l6620l6728l6458
50847I57773l4035k9078k3278j8928j6781j5529j3462j0410p874p203p949q310
50835G64936p284n730m923m565l298r50R65J472J700L222N576O655N437L259K204
$$ plain form
50820 768676 771624 776121 781624 787137 792354 798019 805191 814146 824174 834373 844412 854584 865507
50807 865507 877828 891688 906314 920639 934624 949600 966952 986975 1009369 1034400 1062795
50796 1062795 1094650 1129162 1165598 1204211 1246181 1292960 1345653 1404614 1469435 1539346 1613616
50785 1613616 1691551 1772607 1856860 1945133 2038068 2135088 2234689 2335569 2436947 2537734 2636093
50774 2636093 2730161 2818795 2901146 2975826 3041067 3095904 3140937 3177616 3206728 3227822 3240423
50763 3240423 3245847 3247385 3248461 3250855 3254960 3261301 3270928 3284239 3300009 3315906 3329609 3339278 3343428
50750 3343428 3340884 3330752 3312182 3284259 3246371 3198636 3141768 3076616 3004135 2925928 2844637
50739 2844637 2763475 2685165 2611354 2543170 2482032 2429305 2384957 2347248 2314546 2287182 2266795
$$ packed form
50820G68676K948M497N503N513N217N665P172Q955J0028J0199J0039J0172J0923
50807H65507J2321J3860J4626J4325J3985J4976J7352K0023K2394K5031K8395
50796A062795L1855L4512L6436L8613M1970M6779N2693N8961O4821O9911P4270
50785A613616P7935Q1056Q4253Q8273R2935R7020R9601J00880J01378J00787R8359
50774B636093R4068Q8634Q2351P4680O5241N4837M5033L6679K9112K1094J2601
50763C240423N424J538J076K394M105O341R627J3311J5770J5897J3703R669M150
50750C343428k544j0132j8570k7923l7888m7735n6868o5152p2481p8207q1291
50739B844637q1162p8310p3811o8184o1138n2727m4348l7709l2702k7364k0387
$$ plain form
50728 2266795 2253924 2247212 2245320 2248710 2258809 2275883 2298581 2325409 2355873 2389935 2426739 2464112
50716 2464112 2499184 2529567 2554255 2573468 2587565 2596161 2598439 2594069 2583567 2567900 2548013 2524476
50704 2524476 2497038 2464578 2426090 2381926 2333720 2282869 2229484 2173085 2113973 2053581 1993728
50693 1993728 1935945 1881415 1831184 1786162 1746843 1712954 1683544 1657908 1636630 1621312 1612916
50682 1612916 1610585 1612463 1617391 1625401 1636903 1652200 1671801 1696361 1726009 1760300 1799191 1843507
50670 1843507 1894030 1950507 2012019 2077864 2147533 2220123 2294345 2368866 2442072 2511812 2576298
50659 2576298 2635323 2689864 2740313 2785693 2824586 2855861 2878272 2890410 2891991 2884752 2871452 2854339
50647 2854339 2835031 2815202 2796348 2779079 2763435 2749985 2740065 2734992 2735495 2741658 2752616 2766393
$$ packed form
50728B266795j2871o712j892L390J0099J7074K2698K6828L0464L4062L6804L7373
50716B464112L5072L0383K4688J9213J4097Q596K278m370j0502j5667j9887k3537
50704B524476k7438l2460l8488m4164m8206n0851n3385n6399n9112o0392n9853
50693A993728n7783n4530n0231m5022l9319l3889k9410k5636k1278j5318q396
50682A612916k331J878M928Q010J1502J5297J9601K4560K9648L4291L8891M4316
50670A843507N0523N6477O1512O5845O9669P2590P4222P4521P3206O9740O4486
50659B576298N9025N4541N0449M5380L8893L1275K2411J2138J581p239j3300j7113
50647B854339j9308j9829j8854j7269j5644j3450r920n073N03O163J0958J3777
$$ plain form
50635 2766393 2780760 2794336 2806285 2815147 2818916 2816537 2808681 2796890 2782666 2767477 2752626 2738520
50623 2738520 2724659 2710825 2697786 2686552 2677653 2671607 2669420 2672029 2679780 2692922 2712091 2737797
50611 2737797 2770111 2809499 2857360 2915156 2983593 3063178 3154484 3256650 3366334 3479538 3594106
50600 3594106 3709211 3822903 3931824 4033278 4125959 4208480 4278945 4336693 4383227 4420678
50590 4420678 4450222 4472308 4487113 4494087 4492142 4481170 4462540 4437671 4407357 4373190 4338152 4304410
50578 4304410 4271835 4240283 4212348 4191768 4179430 4172849 4169665 4169912 4174549 4183364 4195052 4207996
50566 4207996 4220130 4229051 4233440 4233982 4232070 4227738 4219370 4205329 4185580 4161920 4136898 4112523 4089944
50553 4089944 4070273 4055161 4045974 4042650 4044053 4049389 4058471 4070572 4083885 4096573 4107752 4116904
$$ packed form
50635B766393J4367J3576J1949Q862L769k379p856j1791j4224j5189j4851j4106
50623B738520j3861j3834j3039j1234q899o046k187K609P751J3142J9169K5706
50611B737797L2314L9388M7861N7796O8437P9585R1306J02166J09684J13204J14568
50600C594106J15105J13692J08921J01454R2681Q2521P0465N7748M6534L7451
50590D420678K9544K2086J4805O974j945j0972j8630k4869l0314l4167l5038l3742
50578D304410l2575l1552k7935k0580j2338o581l184K47M637Q815J1688J2944
50566D207996J2134Q921M389N42j912m332q368j4041j9749k3660k5022k4375k2579
50553D089944j9671j5112r187l324J403N336R082J2101J3313J2688J1179R152
$$ plain form
50541 4116904 4122602 4122272 4113239 4094005 4064640 4025778 3976995 3916579 3843479 3759191 3666890 3568933
50529 3568933 3466310 3360513 3254518 3151146 3051372 2955063 2862773 2776008 2696074 2623329
50519 2623329 2557391 2497598 2443424 2394766 2351679 2313825 2280628 2252004 2228120 2208297 2191040
50508 2191040 2175617 2162768 2153358 2147377 2144978 2147460 2155941 2169666 2186878 2206919 2230345 2257359
50496 2257359 2287686 2322010 2362167 2409457 2463718 2524378 2591517 2665615 2747064 2836330 2933762
50485 2933762 3038718 3149454 3264204 3381735 3500377 3617381 3730063 3837428 3940053
50476 3940053 4038641 4133291 4224167 4312278 4399217 4486184 4573461 4660999 4749377 4839627 4931800
50465 4931800 5024282 5115482 5206291 5300147 5400381 5507827 5621014 5737912 5857021 5977325
$$ packed form
50541D116904N698l30r033j9234k9365l8862m8783o0416p3100q4288r2301r7957
50529C568933j02623j05797j05995j03372r9774r6309r2290q6765p9934p2745
50519B623329o5938n9793n4174m8658m3087l7854l3197k8624k3884j9823j7257
50508B191040j5423j2849r410n981k399K482Q481J3725J7212K0041K3426K7014
50496B257359L0327L4324M0157M7290N4261O0660O7139P4098Q1449Q9266R7432
50485B933762J04956J10736J14750J17531J18642J17004J12682J07365J02625
50476C940053R8588R4650R0876Q8111Q6939Q6967Q7277Q7538Q8378R0250R2173
50465D931800R2482R1200R0809R3856J00234J07446J13187J16898J19109J20304
$$ plain form
50455 5977325 6097754 6216536 6330823 6437187 6532686 6615113 6682073 6730436 6757264 6760995 6741346
50444 6741346 6698511 6633203 6547351 6443903 6325628 6194663 6053825 5908159 5764526 5629148
50434 5629148 5505507 5394629 5297095 5214334 5148054 5099146 5067543 5052427 5051675 5061258 5076064
50423 5076064 5091422 5103150 5106195 5094452 5062711 5008361 4930945 4830989 4710182 4572114 4421611
50412 4421611 4263099 4099963 3935071 3770843 3608804 3450008 3296219 3149811 3012019
50403 3012019 2882047 2758731 2642731 2536267 2440681 2354984 2276945 2205053 2139170 2079880
50393 2079880 2027801 1983243 1945806 1914079 1886206 1861160 1839337 1821736 1808659 1799416 1793213 1790149
50381 1790149 1791291 1797734 1809403 1824738 1841786 1859708 1879115 1900996 1925817 1953859 1985730 2021824
$$ packed form
50455E977325J20429J18782J14287J06364R5499Q2427O6960M8363K6828L731j9649
50444F741346m2835o5308q5852j03448j18275j30965j40838j45666j43633j35378
50434E629148j23641j10878r7534q2761o6280m8908l1603j5116p52R583J4806
50423E076064J5358J1728L045j1743l1741n4350p7416r9956j20807j38068j50503
50412D421611j58512j63136j64892j64228j62039j58796j53789j46408j37792
50403C012019j29972j23316j16000j06464r5586q5697p8039p1892o5883n9290
50393B079880n2079m4558l7437l1727k7873k5046k1823j7601j3077r243o203l064
50381A790149J142O443J1669J5335J7048J7922J9407K1881K4821K8042L1871L6094
$$ plain form
50369 2021824 2061426 2103113 2146155 2191117 2239138 2291056 2347117 2406756 2468491 2530698 2592903
50358 2592903 2655920 2720418 2785829 2851152 2916514 2983362 3053042 3125454 3199135 3272617 3345875
50347 3345875 3420484 3498123 3578702 3660115 3739904 3816936 3891393 3963569 4032950 4098103 4157052
50336 4157052 4207920 4249626 4281968 4304829 4317312 4317729 4304241 4275434 4230704 4170579 4096651 4010946
50324 4010946 3915378 3811934 3703111 3591789 3480698 3372319 3269250 3174138 3088847 3013788
50314 3013788 2948466 2892881 2848229 2815772 2794952 2782979 2776634 2774172 2774960 2777445 2778152 2772925 2758830
50301 2758830 2734888 2701534 2659586 2609410 2550966 2484947 2413693 2340283 2266556 2192661 2118691
50290 2118691 2045908 1975935 1909464 1846433 1786897 1731101 1679191 1631427 1588193 1549235 1513425
$$ packed form
50369B021824L9602M1687M3042M4962M8021N1918N6061N9639O1735O2207O2205
50358B592903O3017O4498O5411O5323O5362O6848O9680P2412P3681P3482P3258
50347C345875P4609P7639Q0579Q1413P9789P7032P4457P2176O9381O5153N8949
50336D157052N0868M1706L2342K2861J2483M17j3488k8807m4730o0125p3928q5705
50324D010946r5568j03444j08823j11322j11091j08379j03069r5112q5291p5059
50314C013788o5322n5585m4652l2457k0820j1973o345k462P88K485P07n227j4095
50301B758830k3942l3354m1948n0176n8444o6019p1254p3410p3727p3895p3970
50290B118691p2783o9973o6471o3031n9536n5796n1910m7764m3234l8958l5810
$$ plain form
50279 1513425 1480092 1449985 1424039 1401667 1381308 1362397 1345605 1331321 1319148 1309022 1301607
50268 1301607 1297244 1295654 1297089 1302487 1311712 1322741 1333684 1344914 1357972 1372808 1387504 1400842
50256 1400842 1413982 1429056 1446943 1467003 1488369 1510552 1532944 1554637 1575173 1595055 1615151
50245 1615151 1635837 1657095 1679124 1702134 1725520 1747890 1768282 1786805 1803645 1817937 1828250
50234 1828250 1834020 1835920 1834929 1831603 1826257 1819235 1810758 1800817 1789298 1775975 1760404 1742167 1721214
50221 1721214 1697667 1671451 1642529 1611501 1579515 1547579 1516305 1486179 1457518 1430151 1403721
50210 1403721 1378413 1354884 1333330 1313140 1293525 1273980 1254143 1234032 1214674 1197753 1184048
50199 1184048 1172677 1162296 1152578 1144058 1136931 1130649 1124571 1118576 1113117 1108842 1105925 1103660 1101120
$$ packed form
50279A513425l3333l0107k5946k2372k0359j8911j6792j4284j2173j0126p415
50268A301607m363j590J435N398R225J1029J0943J1230J3058J4836J4696J3338
50256A400842J3140J5074J7887K0060K1366K2183K2392K1693K0536J9882K0096
50245A615151K0686K1258K2029K3010K3386K2370K0392J8523J6840J4292J0313
50234A828250N770J900r91l326n346p022q477r941j1519j3323j5571j8237k0953
50221A721214k3547k6216k8922l1028l1986l1936l1274l0126k8661k7367k6430
50210A403721k5308k3529k1554k0190j9615j9545j9837k0111j9358j6921j3705
50199A184048j1371j0381r718q520p127o282o078n995n459m275k917k265k540
$$ plain form
50186 1101120 1098414 1096694 1096658 1097737 1099298 1101884 1106320 1112002 1117143 1120618 1122621 1123491 1122978 1121109 1118879
50171 1118879 1117337 1116427 1115373 1113845 1112041 1109681 1105814 1099996 1093099 1086336 1079735 1072256 1063406 1054022
50157 1054022 1045232 1037380 1030387 1024417 1019315 1014027 1007716 1001252 996348 993286 990849 988701 988264 990492
50143 990492 994156 997390 999835 1001969 1003329 1002989 1001389 1000127 1000033 1000728 1001897 1003654 1005590 1006905 1007747
50128 1007747 1009228 1011625 1013742 1014558 1014466 1014304 1014017 1012998 1011068 1008502 1005647 1002962 1000789 998589 995125
50113 995125 990013 984547 980393 977991 976774 976322 976574 977361 978451 979877 981807 984495 988718 995560 1005046
50098 1005046 1015587 1025553 1034852 1044171 1053353 1061677 1069381 1077508 1086217 1094470 1101729 1108955 1117493 1127741
50084 1127741 1139378 1152245 1166422 1181782 1197891 1214189 1230187 1245739 1261158 1276792 1292620
$$ packed form
50186A101120k706j720l6J079J561K586M436N682N141L475K003Q70n13j869k230
50171A118879j542r10j054j528j804k360l867n818o897o763o601p479q850r384
50157A054022q790p852o993n970n102n288o311o464m904l062k437k148m37K228
50143I90492L664L234K445K134J360l40j600j262r4O95J169J757J936J315Q42
50128A007747J481K397K117Q16r2j62k87j019j930k566k855k685k173k200l464
50113I95125n112n466m154k402j217m52K52P87J090J426J930K688M223O842R486
50098A005046J0541R966R299R319R182Q324P704Q127Q709Q253P259P226Q538J0248
50084A127741J1637J2867J4177J5360J6109J6298J5998J5552J5419J5634J5828
$$ plain form
50073 1292620 1308676 1325602 1344104 1363943 1384220 1404727 1426386 1450356 1477418 1508186 1542820
50062 1542820 1580202 1618425 1656761 1696596 1740047 1788511 1842983 1904715 1974509 2051993 2136586
50051 2136586 2228828 2329896 2440237 2559597 2688016 2825350 2969448 3115524 3257622 3390356
50041 3390356 3509607 3612828 3699546 3771339 3831002 3881660 3926329 3967472 4006375 4042705 4074258
50030 4074258 4096713 4104270 4091837 4057185 4000705 3923231 3825155 3708188 3577110 3438650 3298469
50019 3298469 3159619 3023799 2893313 2771299 2660178 2560425 2471172 2391672 2321620 2260114
50009 2260114 2205366 2156075 2112387 2074594 2041391 2010627 1981608 1955421 1932755 1912680 1893997
49998 1893997 1876588 1860518 1844873 1828673 1812498 1798057 1786262 1776555 1767995 1760248 1753529 1748244
$$ packed form
50073A292620J6056J6926J8502J9839K0277K0507K1659K3970K7062L0768L4634
50062A542820L7382L8223L8336L9835M3451M8464N4472O1732O9794P7484Q4593
50051B136586R2242J01068J10341J19360J28419J37334J44098J46076J42098J32734
50041C390356J19251J03221Q6718P1793N9663N0658M4669M1143L8903L6330L1553
50030D074258K2455P557j2433l4652n6480p7474r8076j16967j31078j38460j40181
50019C298469j38850j35820j30486j22014j11121r9753q9253p9500p0052o1506
50009B260114n4748m9291m3688l7793l3203l0764k9019k6187k2666k0075j8683
49998A893997j7409j6070j5645j6200j6175j4441j1795r707q560p747o719n285
$$ plain form
49986 1748244 1744716 1742808 1741883 1741559 1742283 1744593 1748154 1752241 1756956 1763043 1770553 1778755 1787600 1798291
49972 1798291 1811700 1826787 1841285 1853758 1864685 1875792 1888676 1903786 1920378 1937520 1955201
49961 1955201 1974205 1994877 2016475 2037992 2059313 2081367 2105528 2133031 2164401 2199037 2235701
49950 2235701 2273926 2314667 2359205 2407771 2459883 2515771 2576672 2643617 2716596 2795333 2880599
49939 2880599 2974455 3079271 3196539 3326423 3468329 3622105 3788847 3970417 4167885 4380150
49929 4380150 4603724 4833551 5063945 5289098 5503311 5701666 5881308 6042318 6187047
49920 6187047 6318310 6438167 6548086 6649295 6742081 6824510 6891888 6937394 6953511 6934079
49910 6934079 6876232 6780755 6650425 6488415 6298661 6086810 5859235 5620757 5374317 5123066
$$ packed form
49986A748244l528j908r25l24P24K310L561M087M715O087P510Q202Q845J0691
49972A798291J3409J5087J4498J2473J0927J1107J2884J5110J6592J7142J7681
49961A955201J9004K0672K1598K1517K1321K2054K4161K7503L1370L4636L6664
49950B235701L8225M0741M4538M8566N2112N5888O0901O6945P2979P8737Q5266
49939B880599R3856J04816J17268J29884J41906J53776J66742J81570J97468K12265
49929D380150K23574K29827K30394K25153K14213J98355J79642J61010J44729
49920F187047J31263J19857J09919J01209R2786Q2429O7378M5506J6117j9432
49910F934079n7847r5477j30330j62010j89754k11851k27575k38478k46440k51251
$$ plain form
49900 5123066 4871611 4624406 4383811 4150737 3926715 3714245 3515263 3330251 3158955
49891 3158955 3001143 2856292 2723191 2600426 2487267 2383796 2290214 2206041 2129959 2060403
49881 2060403 1996268 1936921 1881641 1829545 1780226 1733897 1690445 1648849 1608227 1569073 1532597
49870 1532597 1498910 1466748 1435137 1404532 1376014 1350047 1326402 1304756 1284970 1267153 1251651
49859 1251651 1238541 1227026 1216059 1205911 1198323 1194374 1192703 1190660 1186999 1182814 1179987 1179384 1180499
$$ packed form
49900E123066k51455k47205k40595k33074k24022k12470j98982j85012j71296
49891C158955j57812j44851j33101j22765j13159j03471r3582q4173p6082o9556
49881B060403o4135n9347n5280n2096m9319m6329m3452m1596m0622l9154l6476
49870A532597l3687l2162l1611l0605k8518k5967k3645k1646j9786j7817j5502
49859A251651j3110j1515j0967j0148p588l949j671k043l661m185k827o03J115
$$ [...]
##END NTUPLES=NMR SPECTRUM
##END=
