##TITLE=coffee_type TOCA01-ROVE100D_60-40%
COFFEE_meoh_noesyp64 COFFEE_meoh {C:\Bruker\TOPSPIN} Administrator 10
##JCAMPDX= 6.0         $$ Bruker NMR JCAMP-DX V2.0
##DATA TYPE= NMR SPECTRUM
##DATA CLASS= NTUPLES
##ORIGIN= Bruker BioSpin GmbH
##OWNER= Administrator
$$ 1.72 TOPSPIN		Version 2.1
$$ 2012-05-18 15:48:09.526 -0700  Administrator@X
$$ Compression mode = diff/dup
##.OBSERVE FREQUENCY= 400.13188235
##.OBSERVE NUCLEUS= ^1H
##.ACQUISITION MODE= SIMULTANEOUS (DQD)
##.ACQUISITION SCHEME= undefined
##.AVERAGES= 64
##.DIGITISER RES= 22
##SPECTROMETER/DATA SYSTEM= spect
##.PULSE SEQUENCE= noesygpps1d.comp
##.SOLVENT NAME= COFFEE_meoh
##.SHIFT REFERENCE= INTERNAL, COFFEE_meoh, 1, 14.98061
##AUDIT TRAIL= $$ (NUMBER, WHEN, WHO, WHERE, PROCESS, VERSION, WHAT)
$$ ##TITLE= Audit trail, TOPSPIN		Version 2.1
$$ ##JCAMPDX= 5.01
$$ ##ORIGIN= Bruker BioSpin GmbH
$$ ##OWNER= Administrator
$$ $$ C:\Bruker\TOPSPIN/data/Administrator/nmr/12-COFFEE-2402/122/pdata/1/auditp.txt
$$ ##AUDIT TRAIL=  $$ (NUMBER, WHEN, WHO, WHERE, PROCESS, VERSION, WHAT)
(   1,<2012-02-24 22:36:09.125 -0500>,<Administrator>,<TOPSPIN>,<go>,<TOPSPIN 2.1>,
      <created by zg
	started at 2012-02-24 22:24:38.687 -0500,
	POWCHK enabled, PULCHK disabled,
       configuration hash MD5:
       B0 76 FB 9C 50 81 44 7D 18 B3 26 32 4E 60 AD 96
       data hash MD5: 64K
       74 C5 02 70 BB 03 5B E4 C6 73 39 33 2D 13 A9 BD>)
(   2,<2012-02-24 22:36:11.922 -0500>,<Administrator>,<TOPSPIN>,<proc1d>,<TOPSPIN 2.1>,
      <Start of raw data processing
       efp LB = 0.3 FT_mod = 6 PKNL = 1 PHC0 = 0 PHC1 = 0 SI = 128K 
       data hash MD5: 128K
       D4 D7 1B 68 1D 10 0A 20 48 9D 35 B9 7F 1F 4B 7F>)
(   3,<2012-02-24 22:36:13.234 -0500>,<Administrator>,<TOPSPIN>,<proc1d>,<TOPSPIN 2.1>,
      <pk PHC0 = 22.24731 PHC1 = 0 
       data hash MD5: 128K
       1E 8C A6 1D E9 AF 39 B3 9A AB F8 15 38 D8 D4 3C>)
(   4,<2012-02-24 22:36:13.547 -0500>,<Administrator>,<TOPSPIN>,<proc1d>,<TOPSPIN 2.1>,
      <abs ABSG = 1 
       data hash MD5: 128K
       23 6A CC CD A2 51 E6 40 40 FF 47 75 31 CA 0F 12>)
(   5,<2012-02-24 22:36:13.625 -0500>,<Administrator>,<TOPSPIN>,<proc1d>,<TOPSPIN 2.1>,
      <abs ABSG = 2 
       data hash MD5: 128K
       F0 9D 44 F3 DA 73 BC 8C EF AF B5 9D ED 0F 4C 2B>)
(   6,<2012-02-24 22:36:13.687 -0500>,<Administrator>,<TOPSPIN>,<proc1d>,<TOPSPIN 2.1>,
      <abs ABSG = 3 
       data hash MD5: 128K
       C3 E8 CB AD 90 5B 5A 82 61 7D 23 2B 31 D4 11 75>)
(   7,<2012-02-24 22:36:13.750 -0500>,<Administrator>,<TOPSPIN>,<proc1d>,<TOPSPIN 2.1>,
      <abs ABSG = 4 
       data hash MD5: 128K
       19 B1 BD AB 42 E3 A3 F4 2B 30 D3 B2 94 DF 03 4D>)
(   8,<2012-02-24 22:36:13.906 -0500>,<Administrator>,<TOPSPIN>,<proc1d>,<TOPSPIN 2.1>,
      <abs ABSG = 5 
       data hash MD5: 128K
       3B 7B C0 EE C3 35 06 21 CF C3 F4 49 A2 48 44 D9>)
(   9,<2012-02-24 22:36:14.109 -0500>,<Administrator>,<TOPSPIN>,<audit>,<TOPSPIN 2.1>,
      <user comment:
       ICON-NMR User ID: Administrator
$$ [...]
150 150 150 150 150 150 150 150
##$TP07= 0
##$TPNAME0= <>
##$TPNAME1= <>
##$TPNAME2= <>
##$TPNAME3= <>
##$TPNAME4= <>
##$TPNAME5= <>
##$TPNAME6= <>
##$TPNAME7= <>
##$TPOAL= (0..7)
0.5 0.5 0.5 0.5 0.5 0.5 0.5 0.5
##$TPOFFS= (0..7)
0 0 0 0 0 0 0 0
##$TUNHIN= 0
##$TUNHOUT= 0
##$TUNXOUT= 0
##$USERA1= <user>
##$USERA2= <user>
##$USERA3= <user>
##$USERA4= <user>
##$USERA5= <user>
##$V9= 5
##$VALIST= <valist>
##$VCLIST= <CCCCCCCCCCCCCCC>
##$VD= 0
##$VDLIST= <DDDDDDDDDDDDDDD>
##$VPLIST= <PPPPPPPPPPPPPPP>
##$VTLIST= <TTTTTTTTTTTTTTT>
##$WBST= 1024
##$WBSW= 4
##$XGAIN= (0..3)
0 0 0 0
##$XL= 0
##$YL= 0
##$YMAX_a= 13695499
##$YMIN_a= -6285603
##$ZGOPTNS= <>
##$ZL1= 120
##$ZL2= 120
##$ZL3= 120
##$ZL4= 120
##$ABSF1= 14.98061
##$ABSF2= -5.57192
##$ABSG= 5
##$ABSL= 3
##$ALPHA= 0
##$AQORDER= 0
##$ASSFAC= 0
##$ASSFACI= 0
##$ASSFACX= 0
##$ASSWID= 0
##$AUNMP= <proc_prof1d_extract>
##$AXLEFT= 0
##$AXNAME= <>
##$AXNUC= <1H>
##$AXRIGHT= 0
##$AXTYPE= 0
##$AXUNIT= <>
##$AZFE= 0.1
##$AZFW= 0.1
##$BCFW= 0
##$BC_mod= 0
##$BYTORDP= 0
##$COROFFS= 0
##$CY= 15
##$DATMOD= 1
##$DC= 0
##$DFILT= <>
##$DTYPP= 0
##$F1P= 0
##$F2P= 0
##$FCOR= 0.5
##$FTSIZE= 131072
##$FT_mod= 6
##$GAMMA= 0
##$GB= 0
##$INTBC= 1
##$INTSCL= 1
##$ISEN= 128
##$LB= 0.3
##$LEV0= 0
##$LPBIN= 0
##$MAXI= 10000
##$MC2= 0
##$MEAN= 0
##$ME_mod= 0
##$MI= 0
##$NCOEF= 0
##$NC_proc= -3
##$NLEV= 6
##$NOISF1= 0
##$NOISF2= 0
##$NSP= 0
##$NTH_PI= 0
##$NZP= 0
##$OFFSET= 14.98061
##$PC= 1
##$PHC0= 22.24731
##$PHC1= 0
##$PH_mod= 1
##$PKNL= yes
##$PPARMOD= 0
##$PPDIAG= 0
##$PPIPTYP= 0
##$PPMPNUM= 2147483647
##$PPRESOL= 1
##$PSCAL= 4
##$PSIGN= 0
##$PYNMP= <proc.py>
##$REVERSE= no
##$SF= 400.13
##$SI= 131072
##$SIGF1= 0
##$SIGF2= 0
##$SINO= 400
##$SIOLD= 131072
##$SPECTYP= <>
##$SREGLST= <1H.CDCl3>
##$SSB= 0
##$STSI= 131072
##$STSR= 0
##$SW_p= 8223.68421052632
##$SYMM= 0
##$S_DEV= 0
##$TDeff= 65536
##$TDoff= 0
##$TI= <>
##$TILT= no
##$TM1= 0
##$TM2= 0
##$TOPLEV= 0
##$USERP1= <user>
##$USERP2= <user>
##$USERP3= <user>
##$USERP4= <user>
##$USERP5= <user>
##$WDW= 1
##$XDIM= 131072
##$YMAX_p= 482609090
##$YMIN_p= -361316947
##$CURPLOT= <Network HP LaserJet P1505>
##$CURPRIN= <$Network HP LaserJet P1505>
##$DFORMAT= <normdp>
##$LAYOUT= <+/1D_H.xwp>
##$LFORMAT= <normlp>
##$PFORMAT= <normpl>
##$SURQMSG= 1
$$ End of Bruker specific parameters
$$ ---------------------------------
##NTUPLES= NMR SPECTRUM
##VAR_NAME=  FREQUENCY,     SPECTRUM/REAL,   SPECTRUM/IMAG
##SYMBOL=    X,             R,               I
##VAR_TYPE=  INDEPENDENT,   DEPENDENT,       DEPENDENT
##VAR_FORM=  AFFN,          ASDF,            ASDF
##VAR_DIM=   131072,        131072,          131072
##UNITS=     HZ,            ARBITRARY UNITS, ARBITRARY UNITS
##FACTOR=    0.0627417313425165, 1,          1
##FIRST=     8223.62146879498, -143,         -84997
##LAST=      0,             2688,            -84407
##MIN=       0,             -361316947,      0
##MAX=       8223.62146879498, 482609090,    0
$$ Real data points
##PAGE= N=1
##DATA TABLE= (X++(R..R)), XYDATA
$$ [...]
66845 4250181 4275837 4301504 4326973 4351595 4375262 4398371 4421237 4443864 4466090 4487645 4508032
66834 4508032 4526580 4542921 4557584 4571867 4586626 4601102 4613412 4622498 4629304 4635737 4642648 4649158
66822 4649158 4653794 4655935 4656175 4655530 4654352 4652073 4648049 4642448 4635878 4628115 4617932 4604661 4589513 4574664
66808 4574664 4561074 4547732 4533042 4516347 4497874 4477713 4455610 4431876 4407894 4385111 4363430
66797 4363430 4341046 4316073 4288074 4257981 4227166 4196994 4168485 4141302 4113371 4082631 4049316
66786 4049316 4015600 3982900 3950600 3917571 3883565 3848506 3811806 3773526 3735219 3698272 3662073
66775 3662073 3625206 3587970 3552106 3518107 3484378 3449468 3413786 3378462 3343650 3308840 3274064
66764 3274064 3239706 3205331 3169705 3132252 3094032 3056903 3021827 2988181 2954748 2921102 2887745
66753 2887745 2855108 2822989 2791098 2759519 2728233 2696756 2664781 2632712 2600980 2569273 2537238
66742 2537238 2505531 2475258 2446538 2418488 2390468 2362353 2333714 2303930 2273368 2243353 2214520
66731 2214520 2186094 2157270 2128414 2100327 2073112 2046511 2020736 1996219 1972925 1950556 1929090
66720 1929090 1908465 1888008 1866731 1844134 1820435 1796413 1773388 1752809 1735050 1718746 1701847
66709 1701847 1683321 1663564 1643494 1623775 1604650 1585919 1567107 1548080 1529433 1511899 1495514
66698 1495514 1479675 1463781 1447433 1430367 1412815 1395729 1379995 1365399 1350922 1335964 1320770
66687 1320770 1305731 1291014 1276956 1264043 1252107 1240110 1227195 1213650 1200462 1188172 1176426
66676 1176426 1164489 1151958 1139137 1126841 1115583 1104892 1093803 1082185 1071068 1061253 1052047 1042107
66664 1042107 1031361 1021216 1012632 1004685 995607 984886 973718 963472 954264 945182 935464 925162
66652 925162 914935 905530 897466 890941 885918 882181 879114 875419 869563 860969 850709 840619 831750
66639 831750 823896 816399 808860 801021 792622 783693 774687 766028 757799 750011 742825 736327 730484 725536
66625 725536 721884 719152 715889 710874 704436 697816 691451 684734 677445 670484 664776 660078 655405 650269
66611 650269 645055 640354 636285 632384 627906 622344 615878 609316 603492 598805 595177 592091 588497 583241
66597 583241 576069 568153 561201 556038 552194 548729 545078 541196 537297 533653 530401 527395 524392 521477
66583 521477 519125 517640 516648 515261 512765 509097 504726 500226 495934 491890 488013 484305 480912 478050
66569 478050 475878 474338 472953 470836 467219 462180 456727 451940 448109 444826 441689 438466 434699 429880
66555 429880 424441 420050 418219 418627 419358 418759 416567 413230 408963 404014 399278 395762 393404 391065 387889
66540 387889 384269 381234 379223 377802 376413 375004 373861 373144 372751 372403 371577 369527 365873 361418 357932
66525 357932 356612 356787 356535 354578 351205 347461 344106 341556 340134 339824 340152 340787 341956 343692 345017
66510 345017 344545 341873 337858 333640 329950 327227 325627 324793 324167 323636 323323 322821 321417 319190 317037 315329
66494 315329 313430 310952 308558 306884 305559 304068 302725 301742 300123 296954 293396 291789 292591 293608 292696
66479 292696 290077 287359 285313 283444 281102 278227 275343 273355 272974 273844 274625 274250 272721 270385 267172
66464 267172 263160 259237 256354 254432 252746 251096 249879 249198 248649 247897 246885 245573 244092 242929 242335
66449 242335 241814 240991 240636 241740 243585 244019 242131 239611 238841 240332 242649 244175 244206 242822 240564 238160
66433 238160 235997 233909 231788 230111 229472 229796 230413 230681 230161 228509 225770 222716 220370 219175 218814 218762
66417 218762 218668 218384 217966 217585 217100 215906 213549 210405 207387 205053 203338 202112 201529 201749 202613 203760
66401 203760 204933 206091 207280 208397 209088 209024 208218 206864 204968 202621 200655 200190 201148 201932 201273 199889
66385 199889 199551 200940 203209 205265 206377 205714 202663 198042 194048 192385 192864 194073 194782 194375 192640
66370 192640 189832 186771 184459 183570 184135 185330 185844 185231 184858 186486 189705 191866 191136 188638 186793 186451
66354 186451 186702 186806 187015 187573 188014 187584 185832 182945 180058 178752 179318 179811 177942 173885 170079 168207
66338 168207 167568 166725 165446 164273 163336 162688 163099 165232 168220 170082 169714 167813 165797 164431 163589 162773
66322 162773 161602 160118 158828 158292 158676 159815 161485 163263 164379 164309 163470 162729 162168 160931 158493 155410
66306 155410 152499 149955 147776 146388 146037 145957 145146 143924 143696 144985 146597 147198 146952 146933 147489 148036 148152
66289 148152 148011 147753 147193 146373 145792 145835 146376 147089 147697 147680 146353 143762 141182 140132 140956 142736 144461
66272 144461 145832 146951 147769 148106 147888 147174 146117 145069 144501 144639 145302 146225 147264 148087 148081 147102 146151 146422
66254 146422 147439 146989 143685 139113 136432 136871 138601 139275 138655 137998 137714 136808 134497 131412 128962 128057
66238 128057 128605 129725 130351 130109 129761 130342 131760 132741 132297 130773 129303 128810 129725 131958 134619 136311
66222 136311 136321 135254 134106 133061 131687 129899 128035 126271 124689 123770 124068 125408 127016 128451 129729
66207 129729 130497 129899 127575 124229 120924 118309 116741 116408 116835 116898 116073 115370 116280 118883 121613 122888
66191 122888 122576 121873 122187 124081 126814 128887 129433 129021 128625 128029 126136 123058 120814 121144 123210 124464
66175 124464 123571 121611 120412 120590 121532 122549 123497 124574 125967 127563 128822 129116 128328 126918 125353 123800
66159 123800 122367 121116 119676 117524 115067 113758 114431 115953 116366 115227 114023 114327 116245 118760 120885
66144 120885 122216 122848 123088 123076 122680 121963 121449 121423 121263 120267 118935 118449 118839 118853 117987 117440 118276 119682 120118
66125 120118 119496 118964 118929 118545 117189 115306 113580 112221 111515 112239 114811 118397 121497 123391 124609 125927
66109 125927 127191 127371 125826 123343 121689 122045 124043 126323 127736 127924 127116 125745 124186 122667 121460
66094 121460 121018 121493 122095 121603 119855 118133 117610 118020 118508 119059 120035 120698 119625 116829 114322 113949 115365
66077 115365 116620 116242 114208 111425 108949 107574 107659 109172 111876 115189 117834 118236 115859 112093 109347
66062 109347 109112 110952 113196 114374 114107 112961 111751 111002 110857 111141 111335 110813 109515 108348 108425 109840
66046 109840 111604 112964 114328 116465 119107 120984 121383 121140 121702 123436 125296 126195 126216 126245 126824 127841
66030 127841 129139 130795 132767 134816 136900 139060 140760 141049 139750 137909 136633 135992 135525 135127 134788
66015 134788 134138 133146 132803 133991 135931 136759 135584 132986 129653 125716 121596 118309 116503 115942 116283 117533
65999 117533 119499 121650 123776 125920 127468 127472 126393 126306 128521 131884 134279 134934 134312 132703 130325 128311
65983 128311 128040 129458 131116 132017 132546 133494 134971 136439 137161 136618 135041 133557 133151 133635 134311 135482
65967 135482 138239 142611 146917 149449 150040 149608 148947 148657 149583 152288 156128 159614 161873 163355 164959
65952 164959 166885 168678 170187 172051 175000 178855 182498 184839 185619 185365 185003 185558 187613 190639 193201
65937 193201 194299 194220 193754 193120 192232 191493 191306 191056 189754 187734 186541 186715 186846 185558 183574 182868 184239
65920 184239 186615 188453 189051 188603 187754 187091 186589 185540 183423 180612 177770 174981 172290 170762 171801
65905 171801 175190 178791 180612 180377 178753 176105 172845 170147 169080 169279 169445 169085 168844 169156 169511 169251
65889 169251 168292 166836 165133 163831 163776 164949 166201 166587 166410 166343 166103 164792 162325 159709 157973 157426
65873 157426 157910 159055 160183 160563 160102 159498 159455 159941 160296 159967 159184 158964 160266 162925 165710 167687 169178
65856 169178 170940 172813 173895 173941 173810 174406 175755 177250 178370 179064 179826 181379 183903 186615 188553 189610
65840 189610 190320 190965 191597 192634 194380 196044 196350 195246 193960 193204 192564 191870 191694 191879 191072 188723 186276
65823 186276 185155 184749 183863 183133 184151 186662 188596 188877 188453 188149 187140 184360 180347 176782 174771 174136
65807 174136 173927 173163 171498 169596 168587 168931 169994 170730 170465 169171 167499 166515 166778 167578 167655 166681 165471
65790 165471 164641 163768 162069 159322 155928 152567 149995 148529 147436 145354 141745 137645 134693 133640 133935
65775 133935 134463 134593 134676 135482 136950 137814 136997 135051 133413 132494 131496 130172 129563 130593 132896 135495 137787
65758 137787 139417 140153 140536 141692 143693 144940 144155 142308 141436 142021 142728 142491 141604 140699 139788 138691 137585
65741 137585 136736 136266 136426 137555 139481 141475 143077 144515 146042 147313 147858 147837 147810 147891 147571 146533 145329
65724 145329 145004 146043 147980 150180 152782 156373 160647 164006 165073 164406 164148 165850 168943 171396 171654
65709 171654 169924 167821 166815 166852 166501 164653 161831 159489 158201 157094 155067 151886 147861 143229 138530
65694 138530 135054 133971 134944 136352 137015 137051 136792 135799 133633 130993 129005 127535 125335 122067 119082 117608
65678 117608 116987 115633 113191 110794 109441 109053 109083 109067 108410 106484 103415 100181 97585 95611 94113 93479
65662 93479 94028 95083 95320 94166 92564 92218 93975 96819 98635 98292 96785 95927 96197 96701 97044 97968 99778
65645 99778 101319 101383 100287 99117 98110 96889 95852 96043 97701 99935 101980 103907 105919 107674 108559
65630 108559 108227 106835 105235 104729 105902 107738 108618 108189 107417 106854 105872 103886 101345 99085 97586 97348
65614 97348 99003 102215 105236 106550 106482 106321 106405 106163 105707 106024 107422 108925 109596 109557 109174 108131 106077
65597 106077 103652 101967 101211 100485 99083 97374 96246 96064 96395 96584 96358 95889 95412 94928 94481 94567 95831
65580 95831 98093 100035 100336 99005 97248 96199 96283 97597 100106 103153 105458 106090 105192 103513 101703 100406
65564 100406 100414 101957 104098 105595 106333 107308 109176 111446 113202 114107 114510 114912 115430 115529 114366 111847 109160
65547 109160 107669 107344 106967 105849 104516 103587 102902 102129 101353 100629 99707 98758 98529 99172 99692 99309 98555 98189
65529 98189 97866 97055 96548 97513 99332 99859 97983 94668 91333 88451 86099 84590 83924 83493 82983 82877 83602
65512 83602 84869 86264 87763 89246 90325 91153 92638 95211 98047 100109 101227 101477 100353 97603 94330
65497 94330 92172 91579 91767 92035 92200 91922 90736 88789 86732 84845 83105 82068 82625 84575 86327 86444
65481 86444 84945 82774 80741 79453 79614 81642 85113 88956 92107 93958 94584 94739 95187 95745 95460 94016
65465 94016 92529 92410 93695 94954 94758 92959 90718 89547 90138 91872 93601 94901 96144 97332 97651
65450 97651 96709 95498 95227 95602 95232 93678 92138 91973 93278 95121 96462 96619 95549 94089 93373 93646
65434 93646 94130 94300 94624 95613 96879 97825 98640 99746 100705 100655 99646 98520 97559 96379 95328 95767 98331
65417 98331 101855 104773 106884 108857 110645 111482 111225 110586 110014 109237 108071 106770 105370 103597 101837 101297
65401 101297 102445 103968 104139 102849 101517 101398 102862 105957 110418 114929 117591 117741 116535 115267 113966
65386 113966 112285 110823 110437 110772 110774 110501 111082 112719 114003 113860 113026 112716 112604 111358 108835 106548 105750
65369 105750 105949 105699 104177 101591 98528 95576 93416 92666 93348 94759 96054 96915 97562 98234 98885 99435
65353 99435 100032 100813 101494 101543 100832 99849 99164 98946 99145 99885 101409 103752 106600 109343 111243 111911 111868 112310
65335 112310 113932 116170 117906 118699 118926 119057 119375 120263 122086 124681 127509 130446 133880 137789 141182
65320 141182 142852 142563 141295 140479 141048 142922 145221 147127 148630 150334 152620 155312 158109 161030 164362
65305 164362 168520 173996 181117 189821 199923 211458 224194 236881 247673 255512 260562 263202 263422
65292 263422 261544 258591 255207 250777 244474 236751 228979 221770 214478 206338 197444 188553 180482 173709
65278 173709 168060 162768 157348 152471 149416 148446 148185 146880 144060 140764 138359 137292 136855 135984 134283
65263 134283 132242 130474 128888 126804 123748 119975 116237 113183 110907 108991 107119 105594 104989 105309 105985
65248 105985 106767 107969 109525 110551 110434 109737 109267 108788 107577 105821 104316 102953 100741 97509 94447
65233 94447 92555 91505 90480 89270 87934 86239 84233 82834 83020 84620 86498 87608 87420 85748 82990
65218 82990 80402 79309 79818 80805 81310 81631 82818 85345 88403 90404 90282 88515 86822 86512 87106 86844
65202 86844 84640 81232 78206 76254 74829 73463 72747 73577 75775 78070 79479 80151 80727 81493 82525 84069
65186 84069 86161 88198 89549 90376 91234 92081 92373 91992 91295 90353 89092 88274 89327 92666 96943 100479
65170 100479 102837 104529 105850 106649 106703 105605 102645 97559 91273 85448 81501 80269 81926 85422 88459
65155 88459 89096 87473 85321 83881 83037 82351 81983 82280 83153 84212 85050 85138 83999 81835 79601 78178 77813
65138 77813 78508 80334 82930 85223 86320 86431 86334 86153 85382 84069 83176 83356 84006 84030 83228 82362 82021 82004
65120 82004 81921 81906 82400 83478 84583 84873 83879 82085 80867 81303 82857 83771 83133 82001 81884 82637 82804 81809
65102 81809 80686 80476 81024 81839 83218 85656 88737 91446 93356 94748 95735 96011 95521 94753 94119 93414 92179
65085 92179 90464 89117 89277 91401 94704 97704 99456 100065 100099 100020 100360 101708 103866 105464 105254 103669
65069 103669 102319 101982 101813 100735 98943 97688 98026 100033 102764 104589 103992 100687 96077 92338 90858
65054 90858 91446 92879 94064 94766 95401 96298 97325 98183 98830 99454 100262 101461 103238 105498 107854 110194
65038 110194 112890 115998 118519 119235 118310 117416 118079 120498 124122 128570 133430 137856 141270 144311 148307
65023 148307 153788 160118 166598 173156 179669 185402 189905 193956 198622 203336 206006 205603 203855 203390 204569
65008 204569 205230 203585 200172 196446 192585 187795 182192 177010 172837 168732 163515 157195 150672 144662
64994 144662 139486 135430 132472 129711 125773 120101 113592 107874 104134 102637 102872 103785 104190 103531 102384
64979 102384 101802 101955 101768 100188 97489 94873 93040 91758 90719 90049 89765 89476 89076 89135 90014 91024 91136
64962 91136 90280 89285 88727 88487 88345 88327 88373 88257 88038 88191 89097 90692 92591 94221 94902 94363 93248 92592
64944 92592 92559 92128 90361 87763 86074 86677 89140 91354 91422 89636 88154 88292 88700 87162 83845 81477
64928 81477 82058 84599 86680 87222 86893 86567 86427 86286 85932 85271 84700 85134 87090 89929 92441 93896 94049
64911 94049 92674 90030 87503 86603 87070 86862 84563 81216 79332 80357 83479 86572 88017 87812 87277 87660
64895 87660 88913 89871 89559 88105 86463 85645 86329 88695 92188 95523 97281 96728 94239 91105 88836 88212
64879 88212 88827 89704 90464 91559 93313 95183 96293 96302 95301 93242 90210 87168 85524 85535 85779 84793 82882
64862 82882 81653 81939 82915 83383 83180 82888 82749 82515 82177 82132 82571 83252 84014 84994 86043 86432 85671 84369
64844 84369 83679 83901 84151 83549 82224 80845 79637 78432 77457 77345 78270 79682 81152 82839 84677 85809
64828 85809 85689 85355 86509 89291 92056 93608 94538 95736 96763 96815 96500 97134 98511 98856 97227 94755
64812 94755 93130 92895 93755 95432 97432 98723 98692 98027 97915 98691 99905 101230 102350 102283 100012 96026 92293
64795 92293 90237 89280 87896 85558 83085 81285 79946 78406 76677 75616 75998 77721 80061 82469 84835
64780 84835 87088 88908 89941 90063 89424 88548 88341 89515 91776 93980 95320 95990 96414 96300 95018 92723
64764 92723 90618 90004 91215 93310 94706 94451 93090 92025 91872 91963 91682 91529 92226 93387 93976 93690 92941
64747 92941 91707 89462 86392 83691 82380 82437 83271 84279 84799 84337 83330 83019 84084 85906 87617 89314
64731 89314 91636 94462 96696 97350 96488 95082 94151 93978 94124 94205 94444 95147 95905 95975 95477 95464 96515 97893
64713 97893 98478 98001 96965 95893 95243 95611 97302 99748 101810 102739 102709 102558 103087 104324 105385 105439 104810
64696 104810 104554 104908 104976 104280 103699 104164 105154 105351 104323 102804 101757 101800 103006 104383 104158 101669 98641
64679 98641 97450 98356 99639 100199 100592 101440 102347 102931 103716 105228 107043 108339 108731 108198 106929 105679 105417
64662 105417 106156 106862 106958 107049 107678 108434 108933 109586 110383 109928 107154 103420 101397 101923 103273 103677 103399 103944
64644 103944 106052 108976 111289 112046 111384 110146 108972 107925 107023 106408 105630 103658 100527 98339 99347
64629 99347 103228 107349 109623 109965 109039 107074 104429 102070 100589 99464 98027 96664 96392 97586 99644
64614 99644 101675 103168 104163 104950 105512 105397 104531 103788 104022 104785 105040 105067 106308 109004 111485 112517 113008
64597 113008 114244 115585 115372 113485 111464 110407 110061 109905 109806 109497 108566 107289 106594 106901 107704 108514 109394
64580 109394 110274 110473 109463 107722 106340 105945 106179 106091 105024 103298 102008 101989 103085 104631 106248 107809
64564 107809 109148 110460 112524 115666 118746 120255 120306 120435 121324 121995 121586 120631 119837 118687 116421 113655
64548 113655 111828 111323 111157 110432 109153 107596 105883 104484 104332 105824 108090 109800 110545 111036 112050 113645
64532 113645 115491 117466 119488 120987 121173 119993 118427 117578 117756 118593 119607 120349 120546 120636 121624 123711
64516 123711 125503 125532 124210 123125 122583 121325 118961 117136 117324 118641 119007 117743 115805 113920 111846
64501 111846 109468 107559 107103 108385 110832 113389 115194 116423 118219 121119 123702 123655 120369 115850 112878
64486 112878 112730 114720 117259 118966 119276 118479 117174 115649 114018 112831 112927 114386 116073 116653 115937 114931
64470 114931 114679 115314 116184 116602 116405 115909 115529 115502 115886 116549 117090 117114 116722 116465 116508 116216 115027 113437 112457
64451 112457 112175 111668 110548 109850 110845 113369 115911 117209 117303 117107 117378 118146 118834 118778 117771 116200 114652
64434 114652 113460 112620 111964 111271 110408 109609 109427 110058 110740 110283 108324 105800 104025 103604 104401 106090 108193
64417 108193 109819 110122 109247 108381 108655 110314 112956 116057 118992 121223 122947 125098 128065 130877 132403
64402 132403 132962 133741 134772 134718 132951 130644 129141 128153 126562 124438 123190 123696 125136 125932 125413 124234
64386 124234 123315 122712 121797 120534 120005 121088 123015 124242 124684 125867 128466 131043 132082 132180 132917 134374
64370 134374 135286 135246 135109 135197 134755 133677 133384 135110 138232 141222 143641 146357 150067 154434 158602 162056
64354 162056 164807 167065 168939 170472 171953 173883 176384 178926 181174 183879 188154 193767 198907 201990
64340 201990 203105 203311 203161 202549 201602 200876 200541 199851 197836 194454 190814 188020 185875 183211 179704 176663
64324 176663 175333 174850 172969 168852 164163 161194 160688 161736 162798 162382 159661 155320 151354 149426 149708
64309 149708 151474 153929 155963 156264 154769 153271 153363 154371 154558 153862 153786 154737 155383 155149 155590 158130 161691
64292 161691 163950 164264 163966 164102 164251 163756 162991 162952 164305 167277 171909 177768 183668 188289 191264 193444
64276 193444 195945 199039 202070 204450 206593 209633 214139 219400 224280 228616 233351 239313 246454 254601
64262 254601 264379 276645 291137 306364 321164 335929 351976 369973 389288 408689 427246 444460
64250 444460 459687 471576 478243 478376 472396 462260 449796 435400 418770 400627 382909 367079
64238 367079 352911 339420 326458 314717 304426 294983 286034 278175 272094 267533 263699 260340 257697
64225 257697 255634 253710 252214 252056 253139 253792 252699 250692 249533 249455 249323 249020 249913 252484 255096 256028
64209 256028 255490 254546 253194 250917 248233 245927 243232 238653 232612 227471 224552 222800 221062 219944 220183
64194 220183 220479 218722 215037 212103 212273 215259 218778 220746 220616 219200 217694 216861 217003 218361 221095
64179 221095 224684 227877 229751 230710 232167 235345 240456 246626 252323 256263 258445 260211 262995 267233
64165 267233 272642 279059 286328 293626 299659 303750 306357 308417 310553 313058 316368 321145 327691 335245
64151 335245 342135 347122 350678 354520 359652 365353 370471 375190 380794 387934 396061 404758 414852 427533
64137 427533 442694 458799 474496 489955 506338 524247 543083 561791 579680 596272 610830
64126 610830 622432 630208 633125 630024 620558 605873 587650 566694 543338 518992 495964 475321
64114 475321 456003 436692 417745 400643 386334 374791 365503 357623 350354 343958 339691 337738 335999
64101 335999 332291 327379 324368 325020 327938 330582 331864 332332 332899 334116 336052 338215 339987 341584 344316
64086 344316 349474 357020 365482 373087 379263 385463 394137 406117 419146 429933 437764 445028 453868
64073 453868 463464 471375 476577 479932 482197 482972 481794 479127 475624 471025 464496 455827 445656 434554
64059 434554 422586 410200 399043 390983 386150 382563 378132 372640 367348 363118 359682 356603 354082
64046 354082 352498 351723 351333 351390 352645 355837 360721 365946 370375 374660 380848 389913 400208 409207 416357
64031 416357 423212 430972 439215 447229 455228 463555 471782 479615 487884 497379 506969 514023 516931 516507
64017 516507 514726 512645 509848 505529 499727 493508 488042 483468 478748 472723 465338 457758 451330 446431
64003 446431 442273 437835 433037 428873 426315 425381 425644 427202 430403 434716 438849 442289 445924 450628 456010
63988 456010 461298 466898 474085 483397 494113 505290 516519 527689 538780 550223 562793 576716
63976 576716 591198 605158 618232 630882 643726 656893 669734 680992 689624 695805 700938 706370
63964 706370 712256 717879 722760 727027 731012 735308 741187 749940 761245 772965 783528 794039 807006
63951 807006 823221 841150 859492 878774 899550 920396 939196 955841 972078 988839 1005208
63940 1005208 1020303 1034809 1049998 1066263 1083436 1101794 1121888 1143755 1167014 1191507 1217286
63929 1217286 1244356 1273087 1304709 1340694 1381588 1426841 1475648 1527540 1582324 1640213 1702246
63918 1702246 1769994 1844332 1924668 2009784 2099449 2194854 2297290 2406740 2522204 2643288
63908 2643288 2770865 2906082 3049474 3201637 3364167 3539069 3727467 3929831 4147450
63899 4147450 4382902 4639091 4918816 5225473 5563225 5936098 6347834 6803162 7308421
63890 7308421 7870268 8494249 9184772 9945137 10776332 11675907 12638492 13656789 14721698
63881 14721698 15822687 16949136 18090360 19232665 20356427 21437023 22448327 23364831
63873 23364831 24162565 24821712 25329922 25681787 25874152 25902738 25763457 25455426 24982053
63864 24982053 24351160 23576185 22676931 21677548 20603095 19477536 18323071 17159015 16000867
63855 16000867 14861520 13753773 12690966 11684940 10743935 9872408 9071939 8341780 7679247
63846 7679247 7080595 6541760 6058176 5624223 5233614 4880824 4562188 4275405 4017930
63837 4017930 3785960 3575132 3381938 3204188 3040242 2888335 2746780 2614236 2489337
63828 2489337 2370449 2256430 2147531 2044910 1948931 1858260 1770948 1686374 1605908 1531546
63818 1531546 1463826 1401138 1341109 1282649 1226524 1174105 1125968 1081784 1040996 1003093 967504
63807 967504 933870 902459 873785 847709 823350 800085 778168 758059 739553 722021 705288
63796 705288 689731 675532 662348 649878 638407 628551 620652 614488 609349 604373 599168 594291 590676
63783 590676 588227 585379 580605 574101 567323 560901 553803 544784 533947 522386 510828 499188 487226
63770 487226 475040 462980 451466 440759 430526 419786 407766 394808 382090 370613 360813 352842
63758 352842 346386 340256 333123 325131 318102 313538 310864 308214 304545 300211 295644 290467 284289 277727
63744 277727 272009 267697 264222 260612 256369 251650 247028 243322 241245 240711 240542 239400 237227 235283 234446
63729 234446 233935 232367 229720 227416 226410 225998 224844 222496 219514 216815 215513 216745 220603 225283 228189
63714 228189 228146 226097 223692 221837 220696 220201 220021 219505 218300 216884 216073 216146 216761 217521 218175 218327 217543
63697 217543 215975 214630 214672 216409 219124 221900 224482 227112 229618 231156 231332 231330 233223 237899 244150 250063
63681 250063 254871 259062 263211 267508 272247 277915 284390 290573 295278 298433 301272 305443 312004 321064
63667 321064 332168 344857 358760 373236 387391 400783 413743 426509 438223 447396 453375 456750
63655 456750 458294 458098 455879 451498 444940 436415 426826 417501 408968 400573 391867 383736 377316 372149
63641 372149 366450 359247 351430 344485 338879 334101 329782 326241 323913 322536 321103 318766 315883 313904
63627 313904 314104 316606 320701 325602 330490 334473 337419 340654 345900 353324 361371 368795 376206 385172
63613 385172 396269 408501 420446 431542 442287 453372 464607 474668 481894 485353 485153 482067
63601 482067 477117 471192 464523 456545 446649 435018 422485 409895 398072 387951 379877 373000 366308
63588 366308 360254 356268 354537 353456 351819 350463 350922 353250 356171 358962 362225 366908 373303 380943
63574 380943 389024 396978 404930 413411 422433 431384 440247 450356 463223 478908 496271 514635 534518
63561 534518 556799 581872 609568 639166 669224 698133 725495 752899 782876 816755 853435
63550 853435 890268 925120 957325 986550 1011419 1030173 1042553 1049938 1053349 1052461 1047336 1040098 1033580
63537 1033580 1028592 1023557 1016755 1007897 997463 985468 971474 955373 937737 919480 901201 882744
63525 882744 863505 843419 823524 805282 789441 775717 763355 751779 740935 731237 722953 715602
63513 715602 708500 702048 697733 696333 696939 698456 701347 706828 714848 724117 734002 745324 759154 775777
63499 775777 794972 816460 839809 864527 890534 918227 948099 980591 1015893 1053175 1090306
63488 1090306 1125196 1157235 1186616 1212608 1233702 1249416 1260701 1268451 1272875 1274749 1276008 1278252
63476 1278252 1281382 1284318 1286307 1286904 1285309 1280531 1271999 1259572 1243188 1222697 1197716 1167606 1132149
63463 1132149 1092399 1050254 1007098 963519 920428 879435 841672 807063 775198 746124 719715
63452 719715 695137 671837 650591 632713 618351 606099 594230 582054 570353 560649 553836 549426
63440 549426 546404 544447 543469 542280 539170 534267 530095 529046 531225 535293 540228 545326 549711 553218
63426 553218 557177 563179 571520 581752 594007 608551 624512 640285 654877 667831 678404 686149
63414 686149 691833 696274 698509 696680 690723 682494 673054 661621 647911 633911 622100 612847 604699
63401 604699 596592 588741 581812 576252 572428 570644 570763 572000 573131 573022 571393 569208 567821 567580 567799
63386 567799 568263 570004 574061 580167 587399 595676 605737 617910 631846 647592 665982 687536 711558
63373 711558 736911 763344 791528 821898 854143 887977 923906 962716 1004373 1047832 1092016
63362 1092016 1136690 1182235 1228875 1276262 1323425 1368628 1409284 1442613 1467021 1483009 1492504
63351 1492504 1497059 1496720 1490853 1479899 1465866 1450981 1436297 1421778 1406938 1390682 1371118 1346751
63339 1346751 1317931 1286237 1252458 1216311 1178309 1140522 1104789 1071243 1039539 1010531 985510
63328 985510 964379 945905 929538 915858 905295 897477 891930 888543 887310 888410 892520 900171 910676
63315 910676 922521 934961 948556 964137 982130 1002895 1026660 1052755 1080003 1108453 1139775
63304 1139775 1175163 1213517 1252633 1291673 1331516 1372883 1414966 1455839 1493372 1525640 1551200
63293 1551200 1569469 1580601 1584894 1582675 1574933 1563543 1550337 1536067 1520675 1504406 1487988 1471516
63281 1471516 1453838 1433593 1410502 1384985 1356864 1325502 1291329 1256197 1221723 1188050 1154855
63270 1154855 1122812 1093135 1066025 1040413 1015176 990107 965967 944080 925533 910212 896956
63259 896956 885131 875329 867710 860476 851464 840918 831198 823759 817902 812674 808296 805087 802381 799507
63245 799507 796770 794494 791972 788383 784238 780961 779375 779233 779709 779693 778176 775254 772389 770839 770056
63230 770056 768398 765158 761140 757407 754243 751360 748453 745432 742526 740149 738330 736512 734358 732574
63216 732574 732267 733547 735286 736340 736582 736655 737105 737917 738760 739603 740989 743381 746200 748088 748487 748439 749331
63199 749331 751266 753314 754967 756531 758232 759865 761506 763889 767786 773385 780413 788439 796869 805032
63185 805032 812610 819957 827890 837065 847240 857116 865424 872596 880835 891850 904926 918135 931192
63172 931192 945902 963564 983137 1002618 1021434 1040559 1060770 1081658 1102217 1121734 1140134
63161 1140134 1158100 1176828 1197056 1218031 1237873 1255216 1270214 1283714 1295859 1306110 1314423
63150 1314423 1321671 1328543 1334580 1338849 1341166 1341832 1340249 1334809 1324660 1310876 1295212 1278217 1259340
63137 1259340 1238565 1217030 1196067 1176518 1159124 1144731 1133599 1125080 1118446 1113774 1111741 1112913
63125 1112913 1117471 1125182 1135155 1146014 1156873 1168143 1181091 1196764 1215497 1237032 1260477 1284322
63113 1284322 1307157 1328531 1348795 1368188 1386577 1404073 1421125 1437635 1452517 1464674 1474148
63102 1474148 1481735 1487583 1490646 1489566 1483760 1473643 1460153 1444092 1425631 1404385 1380275 1354265
63090 1354265 1327795 1301439 1274748 1247651 1221309 1197038 1174930 1154340 1135305 1118541 1104171
63079 1104171 1091498 1080255 1071060 1064185 1058757 1053858 1049802 1047504 1046958 1047204 1047656 1048678 1050737 1053622
63065 1053622 1056770 1060010 1063747 1068487 1074233 1080284 1085867 1091069 1096783 1103432 1110086 1115294 1118534 1120329
63051 1120329 1121353 1122128 1123445 1126189 1130502 1135562 1140245 1143641 1145243 1145468 1145864 1147778 1150620 1152461 1152660
63036 1152660 1152807 1154527 1157429 1160105 1162140 1163947 1165426 1166434 1168284 1173068 1181024 1189885 1197496 1204174
63022 1204174 1211769 1221209 1231872 1242940 1254438 1266852 1280375 1294697 1309348 1324167 1339515 1355853
63010 1355853 1373043 1390331 1407222 1424059 1441412 1459131 1476513 1493353 1510413 1528681 1548362
62999 1548362 1568689 1588666 1607960 1627172 1647273 1668749 1691403 1715064 1740300 1768232 1799579
62988 1799579 1833930 1869905 1906026 1941648 1977246 2013752 2051536 2090147 2129036 2168175 2207747
62977 2207747 2247533 2287074 2326405 2366165 2406812 2447921 2488408 2527284 2564085 2598709 2631037
62966 2631037 2660748 2687304 2709773 2726474 2735214 2734564 2725147 2709113 2688008 2661588 2629185 2591605
62954 2591605 2550821 2508114 2463728 2418669 2375694 2337538 2304476 2274473 2245766 2218820 2195756
62943 2195756 2178436 2167434 2162522 2163399 2169531 2179562 2191607 2204477 2218342 2233844 2250967 2269245
62931 2269245 2288773 2310199 2333606 2358016 2382183 2405421 2427555 2448505 2468011 2485265 2498726
62920 2498726 2506884 2509341 2506620 2498825 2485175 2464911 2437770 2403371 2361339 2312698 2260042 2205272
62908 2205272 2147924 2086895 2023216 1959835 1898909 1840513 1783914 1728998 1676325 1626725 1580923
62897 1580923 1538687 1498429 1458738 1420398 1385821 1356154 1329931 1304888 1280020 1255492 1231786
62886 1231786 1209868 1191231 1176484 1164122 1151601 1137541 1122351 1107098 1092582 1079255 1067121
62875 1067121 1055480 1043444 1030938 1018683 1006973 994999 981899 968212 955654 945253 936196
62864 936196 926962 917418 909169 903694 900590 897949 894041 888346 881477 874702 869270 865452 862244 858478
62850 858478 854076 849764 845885 842198 838659 835556 832886 830422 828417 827470 827632 828365 829384 830695 831857
62835 831857 832263 832332 833257 835127 836398 835848 834135 832778 832435 832828 833521 833958 833457 832029 830741 830576 831391
62818 831391 832555 833973 835819 837890 839931 842014 844016 845465 846601 848652 852045 855136 855894 854231
62804 854231 851542 848584 845262 842054 840002 839216 838642 837425 835462 832725 829251 825840 823539 822313 821292
62789 821292 820382 820503 822093 824567 827389 830382 832816 833640 833184 833333 835249 837989 840044 841149 841825 842228
62773 842228 842465 843158 844629 846154 847032 847788 849276 851056 851752 850732 848476 845579 842508 840241 839997 841872
62757 841872 844383 845623 844535 841220 836771 832960 831248 831503 831904 830561 827290 823713 821782 822208 824151
62742 824151 826251 827918 829683 832464 836848 843128 851494 861683 872521 882468 890962 899134 909062 922230
62728 922230 938595 956916 975950 995451 1016210 1039285 1065284 1094247 1125935 1160073 1196508
62717 1196508 1235418 1277427 1323337 1373459 1427087 1482837 1539789 1598295 1659309 1722869 1787639
62706 1787639 1852015 1915089 1976067 2033261 2084350 2127491 2161673 2186259 2200862 2205511 2200257 2184639
62694 2184639 2158197 2121549 2076312 2023989 1965651 1902652 1836705 1768990 1700040 1630876 1563490
62683 1563490 1499628 1439634 1382838 1328517 1276148 1225513 1177144 1132158 1091088 1053329 1018208
62672 1018208 986042 957556 932777 911085 891974 875138 860240 847244 836566 828262 821449 815251
62660 815251 809907 806166 803927 802348 801053 800292 799985 799693 799754 801598 806540 814737 825402 837462 850020
62645 850020 862960 877364 894698 915331 938509 963869 991988 1022972 1055595 1088936 1124236
62634 1124236 1163879 1208609 1256927 1307422 1360495 1417154 1476974 1538197 1599323 1659515 1717639
62623 1717639 1772095 1821900 1866844 1905982 1936844 1957114 1966498 1965976 1955770 1935331 1905162 1867127
62611 1867127 1822579 1771573 1714638 1654133 1592761 1531445 1469756 1407889 1347133 1288610 1232657
62600 1232657 1179443 1129403 1082852 1039701 999666 962484 928194 897483 871244 849085 828732
62589 828732 807819 786132 765319 746669 730029 714670 700147 686279 673264 661809 652229 643467
62577 643467 634146 624639 616767 611158 606291 600728 594975 590278 586786 583891 581304 578631 574908 569988
62563 569988 565717 564087 564542 564632 563328 562179 562942 565425 568264 570790 573419 576745 580866 585366 589760
62548 589760 594253 599910 607572 616809 626677 637316 649710 663798 678089 691623 705264 720466
62536 720466 737719 756845 777779 800029 822214 843453 864819 888438 915347 945136 977287
62525 977287 1011597 1047325 1083067 1117800 1151287 1183208 1212474 1237615 1257411 1271207 1279091 1281565
62513 1281565 1278536 1269055 1252904 1232048 1209278 1185480 1159413 1130152 1098400 1065312 1031614 998399
62501 998399 967165 938184 910189 882654 857086 834903 815313 796716 779038 762950 747656
62490 747656 731462 714283 697783 683120 670098 658467 648360 639261 630086 620636 611745 603804
62478 603804 596436 589663 583894 578635 572974 567706 565055 565499 566790 567235 568214 571935 578131 584788 591087
62463 591087 597826 605600 614307 624072 635014 646290 656822 666984 678479 692670 710013 730658
62451 730658 754303 779792 806225 834237 864804 897121 929357 961399 994840 1029873 1064199
62440 1064199 1095739 1124608 1151364 1175046 1194413 1209704 1221315 1227645 1226268 1217012 1202190 1183785
62428 1183785 1162004 1136849 1109577 1081774 1053954 1025895 997777 970259 943783 918400 894152
62417 894152 871300 850308 831755 815991 802663 790917 780257 770825 762570 754744 746856 739714
62405 739714 734637 731715 729788 728264 728013 729899 733243 736576 739410 742400 746081 750457 755751 762453
62391 762453 770301 778058 784805 790805 796690 802496 808054 813656 819535 825075 829464 832963 836573 840195
62377 840195 841803 838982 831147 820096 808439 797601 787225 776349 764788 753112 741652 730335
62365 730335 719598 710545 703651 698097 693118 689402 688147 689154 690916 692592 694767 698136 702400 706923
62351 706923 711724 717288 723807 731100 739081 748044 758567 771156 785702 801289 816792 831641 845714
62338 845714 858833 870960 882724 894930 907443 919274 929883 939588 948367 955137 958904 960127
62326 960127 960305 960518 960934 961489 962443 964154 966713 969979 973944 979087 986268 996141 1008786 1024110 1042312
62311 1042312 1063519 1087291 1113352 1142771 1177466 1218269 1264348 1314818 1369981 1430470 1496208
62300 1496208 1567034 1643371 1724984 1809614 1894217 1977414 2059398 2139285 2213828 2279270 2333600
62289 2333600 2376509 2407997 2427828 2435876 2432317 2417599 2392605 2358516 2316066 2265350 2206960 2143100
62277 2143100 2076815 2010146 1943660 1877796 1813790 1752857 1695264 1640996 1590821 1545641 1504859
62266 1504859 1466542 1429584 1394754 1362952 1333355 1304518 1276926 1253032 1234461 1220218 1208186
62255 1208186 1197450 1188340 1180924 1174638 1169376 1165856 1164534 1164747 1165297 1165435 1164949 1163786 1162230 1161194 1161449
62240 1161449 1162194 1161068 1156196 1148100 1139106 1131070 1124300 1118547 1113931 1110255 1106267 1100756 1094313 1089189
62226 1089189 1087298 1088952 1093506 1100291 1108482 1116853 1124535 1131951 1140511 1151323 1164398 1178974 1194358
62213 1194358 1210576 1228462 1249184 1273448 1301121 1331625 1364733 1400987 1441376 1486513 1536087
62202 1536087 1589286 1645861 1706511 1771996 1842128 1915980 1992767 2071946 2152608 2233265 2312040
62191 2312040 2386324 2452478 2506996 2548478 2577791 2595973 2602753 2597541 2580999 2554718 2519886 2477217
62179 2477217 2427979 2374121 2317212 2257861 2196487 2134272 2073150 2014979 1960846 1911080 1865869
62168 1865869 1825647 1790599 1760077 1733219 1710262 1692417 1679948 1671100 1663612 1656727 1650924 1646277
62156 1646277 1642218 1638755 1636706 1636534 1637897 1640622 1645106 1651260 1657975 1664482 1671652 1680996 1692617 1705058
62142 1705058 1717106 1728957 1741477 1755253 1770915 1789615 1812164 1837765 1864544 1891707 1920589
62131 1920589 1953092 1989613 2029087 2070685 2114493 2160436 2207367 2253695 2298400 2340949 2380617
62120 2380617 2416454 2447869 2474951 2498356 2519271 2539326 2560049 2582245 2606146 2632216 2661628
62109 2661628 2695709 2734907 2778398 2824884 2873894 2926019 2981487 3038590 3093992 3144780 3189862
62098 3189862 3229393 3263393 3291349 3312785 3327762 3336930 3341350 3342130 3340052 3335496 3328645 3319526 3308124
62085 3308124 3295081 3282285 3271939 3264760 3259813 3256443 3255544 3258382 3265026 3274757 3287309 3302636 3319956
62072 3319956 3338235 3357508 3378741 3402414 3428094 3455338 3484167 3514717 3547306 3582662 3621031
62061 3621031 3661101 3701127 3741338 3783903 3829956 3877919 3925555 3972536 4019943 4068309 4117568
62050 4117568 4168236 4220856 4274268 4326063 4375355 4423945 4474056 4525826 4577920 4629911 4682904
62039 4682904 4737999 4795341 4854990 4917670 4983822 5052445 5121961 5192260 5265107 5342250 5423797
62028 5423797 5508878 5597289 5689758 5786866 5888408 5993682 6101661 6210687 6318605 6423641
62018 6423641 6525038 6622900 6717887 6811155 6903950 6996516 7087366 7173954 7254273 7327865 7395410
62007 7395410 7457556 7514286 7565363 7611024 7651794 7687578 7717434 7740472 7756472 7765267 7766174 7758908
61995 7758908 7744772 7725922 7703289 7675941 7642636 7603204 7558233 7508244 7453824 7395980 7335765
61984 7335765 7273936 7211404 7149607 7089953 7033192 6979700 6929864 6883689 6840599 6800436 6764302
61973 6764302 6733477 6707544 6684371 6662046 6640231 6619611 6600824 6584045 6568756 6553450 6536258
61962 6536258 6516471 6495101 6473485 6451793 6429397 6406228 6382856 6359315 6334683 6308063 6279493
61951 6279493 6249709 6219560 6189828 6161095 6133404 6106437 6080314 6055700 6032625 6009662 5985101
61940 5985101 5958769 5931820 5904597 5875515 5842415 5804395 5761788 5714836 5663048 5605693 5542439
61929 5542439 5473569 5400056 5323429 5245199 5166395 5087855 5010753 4936349 4865170 4796820 4730749
61918 4730749 4666908 4605538 4546609 4489854 4435340 4383812 4336180 4292446 4251244 4210786 4170364
61907 4170364 4130685 4092699 4056628 4022389 3990309 3960686 3932964 3906172 3880135 3855565 3832951
61896 3832951 3812164 3793354 3777411 3764993 3755581 3748164 3742671 3740309 3742557 3750065 3762398 3778648
61884 3778648 3798343 3821857 3849743 3881707 3916772 3954681 3996586 4043724 4095629 4150238 4205730
61873 4205730 4261803 4319153 4378304 4439166 4501278 4564015 4626684 4688945 4751328 4815201 4882082
61862 4882082 4953093 5029316 5112720 5206404 5313492 5435587 5572448 5723412 5889257 6072720
61852 6072720 6277345 6505955 6760236 7041513 7351470 7691909 8064030 8468375 8905555
61843 8905555 9376719 9883163 10425729 11004636 11619165 12266351 12939035 13624371 14303345
61834 14303345 14951079 15537821 16030992 16398353 16612238 16654390 16520071 16219249 15773820
61825 15773820 15212483 14565912 13863438 13130909 12389607 11656435 10944644 10264108 9621354
61816 9621354 9020219 8462803 7949627 7479319 7049294 6657278 6301834 5981329 5693103
61807 5693103 5433976 5201099 4992038 4804676 4637557 4489872 4360729 4248884 4153620 4075104
61797 4075104 4012961 3964927 3927958 3900635 3883439 3876554 3878458 3887175 3901855 3922055 3945943 3970417
61785 3970417 3993105 4013281 4030473 4043088 4049174 4048070 4040417 4026894 4008147 3986153 3964543 3946612
61773 3946612 3933440 3924550 3919880 3920287 3926378 3937737 3953141 3970642 3987428 4000703 4009266 4013593 4013955
61760 4013955 4009085 3997197 3977850 3952341 3922751 3891250 3859922 3830360 3803289 3779177 3759447
61749 3759447 3746705 3743400 3750247 3766108 3789533 3820479 3860497 3911248 3973048 4044982 4126104 4216076
61737 4216076 4315005 4423532 4543167 4675684 4821750 4980817 5152789 5339157 5541911 5761950
61727 5761950 5999515 6255869 6533678 6835740 7164176 7521016 7909022 8331821 8793915
61718 8793915 9300817 9858559 10472462 11146469 11883794 12687922 13562568 14510615 15533008
61709 15533008 16628002 17790540 19011459 20276173 21562415 22837318 24055700 25161765
61701 25161765 26094667 26796139 27218114 27329603 27122342 26613209 25841019 24858150 23720969
61692 23720969 22483014 21191663 19886731 18599925 17354960 16168026 15048525 14000760
61684 14000760 13026525 12126681 11300479 10544485 9853540 9222749 8647725 8123338 7643955
61675 7643955 7205375 6805345 6441662 6110962 5809879 5536105 5287333 5060307 4852030
61666 4852030 4660938 4485701 4323779 4172658 4031799 3901498 3780043 3663788 3550295
61657 3550295 3439859 3333604 3231622 3133654 3040107 2951325 2866782 2786083 2710076 2639920 2575463
61646 2575463 2515523 2459524 2407854 2360592 2316704 2274810 2234270 2195287 2158298 2123486 2090541
61635 2090541 2058647 2026846 1994775 1963116 1933105 1905360 1879202 1853264 1826669 1799397 1771696
61624 1771696 1743844 1716678 1691581 1669172 1648400 1627701 1606819 1586688 1567727 1549304 1531036
61613 1531036 1513424 1496796 1480613 1464534 1449354 1436026 1424419 1414010 1405156 1398393 1392676 1385820
61601 1385820 1377184 1368852 1363413 1361243 1360583 1359654 1357925 1355839 1354450 1355337 1359832 1367748 1377295 1386609 1395021
61586 1395021 1402728 1409852 1416378 1422558 1428677 1434566 1439938 1445035 1450218 1454887 1457656 1457891 1456473 1454705
61572 1454705 1453131 1451910 1451645 1452997 1455844 1459687 1464759 1471793 1480450 1488714 1494191 1495630 1492977 1486554
61558 1486554 1476713 1464094 1449627 1434110 1417882 1400941 1383456 1366300 1351015 1338833 1329460 1321122
61546 1321122 1312189 1302744 1294189 1287223 1280558 1272152 1261699 1251420 1243922 1239443 1235740 1230740 1224798
61533 1224798 1220063 1218134 1218823 1220925 1223593 1226955 1231822 1238739 1246995 1254792 1261005 1266857 1275262 1288241
61519 1288241 1305339 1324698 1345121 1366622 1389402 1413045 1437005 1461585 1488092 1517897 1551299
61508 1551299 1587417 1625145 1664007 1703897 1744351 1784620 1824372 1863740 1902507 1939798 1974902
61497 1974902 2007947 2039440 2069558 2098405 2126510 2154361 2181484 2206807 2230114 2252509 2275022
61486 2275022 2297121 2317086 2333650 2346859 2357420 2365639 2371076 2372978 2370860 2364903 2355884 2344755
61474 2344755 2332300 2319256 2306564 2295171 2285668 2278500 2274549 2274988 2280356 2290266 2304373 2323221 2347620
61461 2347620 2377528 2412217 2451499 2496256 2547711 2606604 2673099 2746972 2827950 2916525 3014619
61450 3014619 3124836 3248631 3385601 3534902 3696971 3873360 4065201 4272382 4494246
61441 4494246 4730520 4981145 5245152 5519810 5800749 6082447 6358041 6618669 6853952
61432 6853952 7054074 7211721 7322337 7383746 7396636 7364879 7293914 7188615 7053626 6895466
61422 6895466 6722556 6542427 6359952 6178800 6003290 5837721 5684723 5545260 5419605
61413 5419605 5307507 5208210 5121449 5048013 4988475 4941983 4907199 4883723 4871433 4869060 4874866
61402 4874866 4888419 4910285 4940036 4976067 5017530 5065060 5118996 5177871 5239213 5301277 5363747
61391 5363747 5427521 5493933 5563367 5634239 5704020 5771660 5838541 5906756 5976806 6046998 6114551
61380 6114551 6177257 6234650 6287690 6336867 6380813 6417547 6446950 6471021 6491481 6508054 6519409
61369 6519409 6524925 6524952 6520042 6510578 6496740 6478296 6454700 6425840 6392567 6356206 6317662 6277174
61357 6277174 6234900 6191695 6149292 6109475 6072910 6039152 6008008 5980429 5957541 5939151 5923686
61346 5923686 5909277 5894598 5879317 5864251 5850283 5836426 5819969 5799666 5777890 5758270 5742183
61335 5742183 5729374 5721217 5720949 5730854 5751547 5784248 5831412 5894562 5973721 6069730 6184930 6320521
61323 6320521 6475441 6649217 6843854 7060990 7298643 7552699 7820427 8100454 8389880
61314 8389880 8683048 8972631 9250306 9506699 9732217 9918370 10058208 10146750 10182344 10167129
61304 10167129 10105204 10000682 9857883 9681963 9477957 9250077 9003008 8742697 8474386
61295 8474386 8200980 7925080 7651606 7386326 7132300 6889745 6658966 6441301 6237282
61286 6237282 6046012 5866720 5699362 5543532 5398491 5264555 5142903 5033780 4936472 4851290
61276 4851290 4779823 4722698 4678647 4646339 4625575 4615946 4615914 4624347 4641657 4668183 4702275 4741040
61264 4741040 4782390 4825512 4870043 4915691 4962179 5008639 5053266 5094259 5130943 5163684 5193031
61253 5193031 5219350 5242854 5263567 5281381 5296305 5308334 5317165 5322749 5326165 5328937 5330964 5329801
61241 5329801 5322530 5307784 5285454 5255267 5216681 5169995 5116689 5058596 4997240 4934067 4870702
61230 4870702 4808452 4747599 4687575 4628295 4571287 4519087 4473238 4433281 4397900 4366554 4339490
61219 4339490 4316737 4297914 4282715 4270804 4261323 4253215 4245827 4238593 4230640 4221814 4213773 4208685 4206754
61206 4206754 4206340 4206731 4209468 4216419 4227935 4243792 4264817 4292228 4325779 4363678 4404490 4448572
61194 4448572 4497565 4552794 4614246 4681096 4753266 4832167 4919436 5015172 5117944 5225977 5337138
61183 5337138 5447532 5551194 5641675 5713462 5761929 5783190 5774717 5735585 5665863 5566638 5441077
61172 5441077 5294629 5133607 4963967 4791480 4621690 4458527 4303385 4156277 4017545
61163 4017545 3887883 3767061 3653379 3544527 3439161 3338159 3244421 3160835 3088136 3024984
61153 3024984 2969625 2920628 2876382 2835511 2798090 2765115 2736488 2711012 2688816 2671948 2661584
61142 2661584 2656332 2654656 2657382 2665983 2679486 2695187 2711894 2730640 2752355 2776403 2801248 2825035
61130 2825035 2845535 2860952 2870956 2875913 2875330 2868394 2855864 2839801 2821137 2798874 2772052 2741209
61118 2741209 2707391 2670914 2631872 2590956 2549044 2506370 2462454 2416343 2366930 2313992 2259240
61107 2259240 2205484 2154264 2105014 2056796 2009846 1964737 1921090 1878250 1836751 1797951 1762250
61096 1762250 1728574 1695879 1664586 1636257 1612149 1592274 1575587 1560909 1547720 1536152 1526210
61085 1526210 1517026 1506987 1494697 1479792 1462794 1444365 1425051 1405778 1387956 1372493 1359075
61074 1359075 1347231 1337916 1332868 1332143 1333551 1335289 1338021 1343342 1351189 1360342 1370797 1383735 1399019
61061 1399019 1414568 1428833 1442402 1456177 1469172 1479454 1486740 1492834 1499586 1507342 1515493 1523773
61049 1523773 1532581 1542228 1552117 1560835 1567275 1571670 1575203 1578470 1580730 1580830 1578286 1573015 1564529 1552233
61035 1552233 1536536 1519061 1501650 1485529 1471243 1458556 1446091 1431836 1414863 1396439 1378919
61024 1378919 1363604 1350127 1337615 1325559 1313445 1300523 1286684 1273116 1261465 1252533 1246159 1241785
61012 1241785 1238420 1234532 1229097 1222848 1217671 1214605 1213032 1211824 1210533 1209450 1209281 1210840 1214267 1218495
60998 1218495 1222433 1226729 1233157 1241953 1251115 1259033 1266608 1275810 1287129 1299567 1312353 1325548 1339410
60985 1339410 1354298 1370816 1389071 1408048 1426525 1444431 1462678 1481985 1502453 1523792 1545365
60974 1545365 1566630 1588253 1612193 1639885 1670920 1704211 1739625 1777508 1817576 1859525 1903936
60963 1903936 1951167 1999950 2048644 2097488 2148097 2200966 2254873 2308659 2362398 2417152 2474750
60952 2474750 2537217 2604908 2675696 2747740 2822614 2903863 2992842 3088228 3189554 3298829 3418113
60941 3418113 3547590 3686834 3836231 3996470 4168215 4352931 4552555 4767725 4997688
60932 4997688 5242204 5502076 5777672 6068972 6377708 6707899 7063871 7449218 7867450
60923 7867450 8321434 8812324 9341836 9916056 10544788 11237969 12006817 12868420 13843670
60914 13843670 14948790 16193801 17591422 19162290 20930129 22920956 25172631 27735927
60906 27735927 30657349 33969659 37704949 41880495 46401518 50940142 54953353 57914116
60898 57914116 59601131 60196866 60124374 59807434 59560355 59598298 60007951 60630945 61016441
60889 61016441 60592549 58973495 56153453 52445956 48269310 43973697 39793172 35868405
60881 35868405 32271365 29022294 26112024 23521935 21229472 19206953 17425785 15862000
60873 15862000 14494498 13300157 12254012 11332431 10513720 9778312 9111853 8506756 7958101
60864 7958101 7459273 7003429 6586865 6207745 5862798 5547887 5260440 4998232 4756553
60855 4756553 4529368 4313058 4106932 3910830 3724702 3550036 3388895 3241234 3105047
60846 3105047 2979113 2863547 2757605 2659048 2566192 2478988 2397743 2322226 2252303 2188075 2129082
60835 2129082 2074483 2023987 1977319 1932900 1888701 1844749 1803275 1765905 1731997 1700109 1669707
60824 1669707 1640662 1612267 1583732 1555007 1526393 1497855 1469253 1440733 1412394 1383880 1354701
60813 1354701 1324815 1294750 1265414 1237721 1212120 1188565 1167205 1148736 1133545 1120874 1109602
60802 1109602 1099629 1091683 1085910 1081526 1077940 1075484 1074918 1076815 1081525 1089075 1098871 1109823 1120899 1131559
60788 1131559 1141978 1153134 1166206 1181471 1198194 1215725 1233859 1251762 1267894 1281920 1295402
60777 1295402 1309212 1321540 1330268 1336350 1342555 1349423 1354885 1357727 1358856 1358855 1356899 1352958 1348668 1344760
60763 1344760 1339669 1332144 1323368 1314789 1305363 1292974 1277635 1261413 1245666 1230043 1213967 1197729
60751 1197729 1182243 1168695 1158149 1150467 1143881 1136622 1128778 1121753 1116250 1111734 1107613 1104006 1101394
60738 1101394 1100285 1101231 1104624 1110472 1118580 1128509 1139156 1149243 1158851 1169723 1183319 1199323 1216695
60725 1216695 1234984 1253359 1269548 1281773 1291330 1301294 1312599 1323211 1331359 1337647 1343291 1348130
60713 1348130 1351682 1354914 1359458 1365641 1372539 1379587 1386921 1394191 1400231 1404313 1407100 1409926 1413431 1417159
60699 1417159 1420249 1422178 1422764 1421755 1418809 1414126 1408897 1404679 1402160 1400742 1399496 1398261 1397489 1397186 1396423
60684 1396423 1394100 1390014 1384950 1379848 1375120 1370645 1366029 1360751 1354393 1346958 1338750 1329887 1320448 1311366
60670 1311366 1304438 1300631 1298712 1296382 1292529 1287613 1282146 1276011 1269300 1262533 1255682 1248112 1240081 1233205
60656 1233205 1228644 1225652 1222700 1219281 1215783 1212292 1208582 1204844 1201475 1198362 1195186 1192182 1189839 1187972
60642 1187972 1185664 1181993 1176497 1169361 1161614 1154489 1147880 1139957 1129075 1115689 1101678 1088273 1075435
60629 1075435 1062755 1049909 1036481 1022275 1007851 994127 981645 970630 961192 952917 944957 937275
60617 937275 931089 927157 924489 921861 919698 919087 919787 920998 923389 928343 935439 942793 949855 957754 966666
60602 966666 975157 982790 991229 1001666 1012999 1023777 1034376 1045917 1058446 1071579 1085803 1101507
60590 1101507 1117550 1132176 1144953 1156652 1167814 1178614 1189658 1201686 1214578 1227612 1240569
60579 1240569 1253881 1267793 1282008 1296029 1309500 1322540 1336014 1350876 1366904 1382694 1397258
60568 1397258 1410838 1423682 1434948 1443482 1448817 1450783 1449113 1444321 1437963 1430990 1422654 1412060 1399849
60555 1399849 1387123 1373632 1358596 1342662 1327421 1313456 1300576 1289650 1282257 1278351 1276060 1274312
60543 1274312 1274164 1277028 1283005 1291620 1302776 1315848 1328785 1339311 1346676 1351533 1354537 1355869 1355829 1355104
60529 1355104 1354306 1353594 1352811 1351921 1351432 1352409 1355825 1361849 1369904 1379246 1389155 1398783 1407471 1415211 1422237
60514 1422237 1428217 1432448 1434832 1435898 1435767 1434022 1430940 1427905 1425839 1423891 1420510 1415467 1409874 1404341
60500 1404341 1398086 1390232 1381413 1373546 1368114 1364950 1362725 1360536 1358940 1359490 1363268 1369932 1378244 1387442
60486 1387442 1398069 1411586 1429324 1451785 1478545 1508567 1540800 1575153 1613180 1657390 1709299
60475 1709299 1768289 1832776 1902432 1978705 2063107 2155499 2253976 2355480 2455889 2550070 2632846
60464 2632846 2700404 2750848 2783634 2798799 2796851 2779636 2751437 2718716 2687753 2662141 2642860
60453 2642860 2630542 2626597 2631841 2645054 2663614 2684886 2706510 2726484 2744188 2760915 2778371 2797065
60441 2797065 2817121 2840257 2869545 2907150 2953309 3007800 3071498 3146196 3233623 3335016 3451153
60430 3451153 3582481 3729397 3892218 4070274 4261178 4461926 4671171 4890136 5121449
60421 5121449 5368038 5633523 5922907 6242072 6596561 6990917 7428593 7911466 8438453
60412 8438453 9003399 9592562 10182604 10740721 11228204 11606978 11846430 11927435 11842845 11596815
60402 11596815 11205270 10695995 10104834 9468164 8816317 8171549 7549207 6959310 6408163
60393 6408163 5900139 5438025 5021428 4646289 4307613 4002454 3729426 3486254 3269511
60384 3269511 3076252 2904185 2750504 2612372 2488624 2379160 2282341 2194712 2113785 2039417
60374 2039417 1971738 1909416 1851053 1796818 1747394 1702268 1660262 1620887 1583971 1548731 1514517
60363 1514517 1481968 1452150 1424842 1398882 1374106 1351722 1332500 1315543 1299311 1283408 1268951
60352 1268951 1257345 1248886 1242555 1237166 1232569 1229453 1228057 1227551 1226803 1225217 1222715 1219665 1217261 1217299 1220764
60337 1220764 1226763 1233361 1239274 1244432 1249205 1253767 1258358 1263693 1270652 1279281 1288131 1295022 1298834 1300309
60323 1300309 1300718 1300214 1298299 1295569 1293622 1292958 1292033 1289042 1283918 1278045 1272614 1267792 1263027 1257677 1251726
60308 1251726 1246152 1242080 1239407 1236925 1233961 1231021 1228562 1226257 1224120 1223217 1224255 1226184 1227306 1227244 1226879
60293 1226879 1226781 1226725 1226496 1226228 1226096 1226432 1227949 1230956 1234506 1237153 1238680 1240491 1244214 1250306 1257896 1265559
60277 1265559 1272355 1278480 1284812 1291786 1299142 1306877 1315465 1324583 1332651 1338747 1344337 1351854 1361910 1373057
60263 1373057 1383950 1394344 1403988 1412062 1418201 1422953 1426565 1428054 1426127 1420512 1411958 1401423 1389760
60250 1389760 1377773 1366079 1354878 1343980 1332980 1321618 1310421 1300965 1294766 1291560 1289105 1285229
60238 1285229 1280101 1276260 1276344 1280770 1287572 1294351 1300131 1305180 1309599 1313050 1315912 1319559 1324775 1330682
60224 1330682 1336078 1341118 1346723 1352964 1359439 1366920 1377025 1389987 1404102 1417918 1431781 1446555
60212 1446555 1461922 1477005 1491871 1507307 1523402 1539512 1555672 1573022 1592442 1613370 1634533
60201 1634533 1655595 1677624 1702084 1729849 1761288 1796713 1836180 1879103 1924828 1973720 2027074
60190 2027074 2085577 2148455 2214611 2284194 2358485 2438665 2525416 2619446 2721466 2831491 2948770
60179 2948770 3072630 3202981 3339908 3483078 3631405 3782823 3934478 4083800 4229482
60170 4229482 4370892 4506537 4633786 4750292 4854952 4947211 5026070 5090262 5138912 5171535
60160 5171535 5188006 5189404 5178799 5160448 5137924 5113275 5087931 5063693 5042477 5025583 5013984
60149 5013984 5009481 5014865 5032418 5062485 5104059 5156744 5221611 5300018 5392132 5496902 5612942
60138 5612942 5738920 5873262 6013988 6158775 6304800 6448540 6585947 6712873 6825438
60129 6825438 6920582 6996740 7053759 7091724 7109990 7107678 7084807 7042544 6982706 6907842 6821839
60118 6821839 6729760 6636561 6545970 6460487 6382209 6313573 6257431 6216319 6191586 6183532 6192594 6219978
60106 6219978 6266590 6331486 6411795 6503949 6604520 6710041 6816658 6920195 7016403 7101419
60096 7101419 7172479 7228245 7268339 7292824 7302396 7298552 7282919 7256701 7221634 7181446 7141550 7107018
60084 7107018 7081153 7065952 7063297 7075406 7104560 7152723 7221412 7311922 7425751 7564539 7729408
60073 7729408 7920743 8138984 8385178 8660156 8963654 9295070 9654731 10043103 10458383
60064 10458383 10895735 11349188 11813395 12282863 12750160 13205912 13640698 14046573 14416842
60055 14416842 14745005 15024579 15250076 15417811 15525464 15571068 15553015 15471075 15326894 15123577
60045 15123577 14865809 14560868 14218570 13849285 13462342 13066815 12672792 12290346 11927354
60036 11927354 11589281 11280824 11006634 10770423 10574387 10419587 10306010 10232274 10196266 10196251
60026 10196251 10230509 10295797 10386970 10498047 10622654 10753372 10881896 11000409 11102158 11180814
60016 11180814 11230626 11248041 11232550 11185617 11109455 11006936 10881512 10736385 10574199 10397773
60006 10397773 10210315 10014511 9812126 9604876 9394964 9184513 8975473 8770606 8573524
59997 8573524 8387065 8212497 8051067 7905434 7778588 7671999 7585895 7520837 7477828 7457082
59987 7457082 7457700 7478762 7519921 7580775 7660039 7755459 7864190 7983217 8109422 8239015 8366828
59976 8366828 8486773 8593480 8683290 8753533 8801556 8824998 8822569 8793905 8739043 8658735 8555030
59965 8555030 8430834 8289010 8132603 7965912 7794493 7623683 7457474 7299058 7151946
59956 7151946 7019845 6905364 6809352 6731840 6673294 6634488 6615478 6615672 6635154 6675051 6736008
59945 6736008 6817026 6916655 7034732 7171908 7327777 7500388 7687161 7884951 8089154 8293961
59935 8293961 8493807 8683818 8858861 9013323 9142256 9242319 9311888 9351123 9361399 9343329
59925 9343329 9295678 9217961 9113937 8990429 8852460 8701934 8541896 8379527 8223032 8077214
59915 8077214 7943861 7824974 7723465 7641551 7580435 7541197 7524461 7529646 7555930 7603318 7671343
59904 7671343 7757378 7857849 7970681 8095014 8229007 8369624 8514249 8660621 8805287 8944051
59894 8944051 9074305 9195282 9305756 9403305 9486642 9557342 9618430 9672404 9721561 9769373 9820310
59883 9820310 9878339 9946142 10025925 10121087 10237172 10380715 10556499 10766184 11010116 11289690
59873 11289690 11606682 11960621 12348341 12766114 13210479 13676081 14153603 14630425 15092538
59864 15092538 15525431 15914105 16243300 16497930 16664025 16731093 16695156 16559840 16334581 16032167
59854 16032167 15667351 15255760 14812351 14350500 13882398 13419433 12971665 12547459 12153880
59845 12153880 11796606 11478729 11200334 10960306 10758652 10596741 10475653 10394888 10352560 10346222
59835 10346222 10373348 10431327 10517378 10628733 10762821 10916593 11084855 11259204 11429162 11584410
59825 11584410 11715655 11813871 11870237 11877704 11832368 11733134 11580874 11378508 11131405 10846946
59815 10846946 10533518 10199640 9853052 9499914 9145165 8793961 8452036 8124048 7812236
59806 7812236 7517738 7242821 6990533 6762016 6555402 6368164 6199912 6051983 5924607
59797 5924607 5815393 5720737 5637952 5565594 5502282 5446083 5395097 5348096 5304443 5263937 5227118
59786 5227118 5195284 5169671 5150655 5138107 5132260 5133527 5141120 5152199 5162798 5169576 5170461 5163645 5146532
59773 5146532 5116415 5072599 5017452 4954951 4888316 4819474 4750328 4683302 4620187 4561216 4505965
59762 4505965 4454824 4409150 4370411 4339680 4317668 4304833 4301753 4309727 4330390 4364114 4409048 4462254
59750 4462254 4521404 4584982 4651576 4720130 4790806 4864664 4942212 5022550 5103503 5181680 5252580
59739 5252580 5311879 5357526 5390583 5413996 5430750 5442994 5452398 5461009 5471769 5488030 5512519 5547060
59727 5547060 5593295 5653072 5727912 5818946 5927910 6057444 6209705 6385471 6585446 6811484
59717 6811484 7065253 7346372 7653558 7987400 8350247 8742703 9160773 9595682 10034128
59708 10034128 10457425 10841487 11159520 11386790 11506080 11512453 11414876 11232721 10989367 10707511
59698 10707511 10407397 10105549 9813538 9538995 9288443 9067927 8880565 8725456 8600513
59689 8600513 8505394 8440632 8405172 8396600 8413319 8455023 8521286 8611190 8724424 8861541 9022856
59678 9022856 9208075 9417315 9651624 9912064 10199041 10513284 10857118 11233908 11646105
59669 11646105 12094338 12578854 13101390 13664884 14271314 14920620 15612124 16346116 17122886
59660 17122886 17940310 18793057 19673846 20574402 21485198 22395369 23293651 24169436 25013778
59651 25013778 25821132 26591074 27328062 28039466 28734265 29422697 30114679 30816836 31531213
59642 31531213 32256749 32990344 33725186 34448869 35144572 35794226 36380514 36887511 37301907
59633 37301907 37614937 37823417 37929477 37940090 37866651 37724278 37531044 37307298 37074316 36851973
59623 36851973 36657198 36504512 36407335 36377954 36426436 36560307 36785260 37105617 37524211 38042436
59613 38042436 38660450 39376448 40184937 41075253 42031125 43030742 44046394 45043827 45982371
59604 45982371 46816814 47500653 47989492 48244272 48235448 47948313 47386885 46573307 45543197
59595 45543197 44340079 43010895 41602183 40156824 38712079 37298599 35939234 34648171
59587 34648171 33431882 32290722 31218275 30199019 29208772 28220078 27209223 26160931
59579 26160931 25070559 23944800 22799901 21656659 20534779 19449916 18413549 17433709
59571 17433709 16515395 15660743 14869111 14137749 13463512 12844260 12278000 11761083 11288809
59562 11288809 10858069 10467645 10115218 9795900 9505047 9240935 9003032 8788849 8594477
59553 8594477 8417402 8256688 8110618 7975972 7849589 7728965 7611263 7493383 7373470
59544 7373470 7251121 7125889 6996789 6863590 6727451 6589894 6452106 6315541 6182176
59535 6182176 6053674 5931005 5815123 5707230 5607983 5517230 5434968 5362071 5299664 5248035
59525 5248035 5206314 5173039 5147279 5129546 5121154 5122128 5130427 5144174 5163900 5191089 5224888 5262154
59513 5262154 5301055 5342759 5388883 5438878 5491113 5545280 5602424 5663383 5728504 5798506 5874601
59502 5874601 5958013 6050193 6153043 6267979 6395025 6533700 6684572 6849118 7028327 7222619
59492 7222619 7433277 7662775 7912991 8183593 8472695 8778686 9100869 9438535 9789903
59483 9789903 10151875 10520370 10890764 11258388 11618870 11967992 12301321 12614415 12903694
59474 12903694 13166980 13402834 13609409 13784205 13925050 14031288 14104448 14148503 14169515 14174249
59464 14174249 14168491 14156801 14144027 14136521 14141380 14164773 14211321 14284447 14386251 14516597 14672375
59453 14672375 14847358 15032217 15214962 15382298 15521209 15619490 15665474 15648551 15560855 15398670
59443 15398670 15162358 14855478 14484279 14057659 13586960 13085333 12566796 12045090 11532328
59434 11532328 11037879 10568051 10126806 9716888 9340324 8998028 8689519 8413669 8169762
59425 8169762 7957553 7776399 7624872 7501295 7404139 7331885 7283207 7257601 7255391 7276885 7322079
59414 7322079 7391188 7484510 7601216 7739208 7897077 8075550 8275929 8497334 8736290 8988649
59404 8988649 9250653 9517926 9784408 10042855 10285961 10506554 10696962 10848651 10953001
59395 10953001 11003068 10995101 10928496 10804561 10626026 10397975 10128345 9826596 9501841 9162183
59385 9162183 8814793 8465613 8119257 7779957 7452300 7140286 6845885 6569233 6310037
59376 6310037 6068254 5843861 5636896 5447658 5276157 5121447 4982070 4856977 4745462
59367 4745462 4646611 4559552 4483974 4419642 4365718 4321260 4286062 4260236 4243399 4235012 4234869 4242303
59355 4242303 4255595 4273570 4297244 4328518 4367664 4413606 4465850 4523683 4583336 4638684 4686149
59344 4686149 4727628 4768021 4811502 4860890 4918538 4986129 5064671 5155814 5261688 5381834 5511422
59333 5511422 5644510 5778930 5917121 6063237 6221054 6393960 6584833 6795501 7027375
59324 7027375 7282508 7563103 7870415 8205636 8571687 8972504 9410253 9884722 10395893
59315 10395893 10945714 11536459 12168222 12838501 13542919 14274884 15024785 15780513 16528903
59306 16528903 17256642 17950863 18600654 19198917 19742706 20231809 20667185 21050458 21383970
59297 21383970 21670551 21912863 22112444 22268789 22379155 22439610 22446536 22397061 22288208 22116465
59287 22116465 21879066 21575965 21210608 20789181 20319551 19810435 19270352 18706485 18124559
59278 18124559 17529853 16927827 16323675 15722206 15129058 14551535 13996972 13469867 12971277
59269 12971277 12501296 12061521 11654708 11282667 10945243 10641089 10368694 10126536 9913027
59260 9913027 9726953 9567774 9435002 9327069 9241046 9173435 9120978 9080765 9050120 9026669
59250 9026669 9008048 8991171 8972409 8949229 8921161 8888176 8848448 8799088 8739160 8670616 8595821
59239 8595821 8515538 8430173 8341648 8252627 8164602 8078050 7994195 7915612 7845436 7786845 7742673
59228 7742673 7714238 7700735 7701005 7715882 7747835 7798486 7867614 7954482 8058801 8180127 8317500
59217 8317500 8470217 8638097 8820525 9015795 9221548 9435109 9653144 9871628 10086463
59208 10086463 10293736 10489296 10668650 10827331 10961129 11066401 11140939 11184170 11195572 11173189
59198 11173189 11114769 11020170 10891497 10731395 10543034 10331953 10105928 9871905 9634024 9394997
59188 9394997 9157900 8925631 8699938 8482371 8275538 8082401 7904676 7742566 7595498
59179 7595498 7462709 7344098 7241392 7157712 7095092 7053007 7030137 7026921 7045441 7087420 7153482
59168 7153482 7244100 7360216 7503016 7674028 7875522 8110041 8379245 8683380 9021613 9392328
59158 9392328 9793048 10220259 10669021 11132233 11600111 12060323 12498415 12898382 13243935
59149 13243935 13520356 13715800 13821597 13832505 13747262 13568707 13303264 12960818 12554870 12101575
59139 12101575 11617510 11117968 10616563 10124888 9651778 9203385 8784087 8396426 8040068
59130 8040068 7712262 7410397 7133622 6881798 6654026 6448946 6265391 6101967 5956939
59121 5956939 5829381 5719443 5626538 5548380 5482986 5430467 5391305 5363780 5345040 5334385 5333638
59110 5333638 5344138 5364836 5393464 5428170 5467866 5512496 5563563 5623125 5691441 5766282 5845006
59099 5845006 5926625 6011349 6098811 6187282 6274160 6356748 6432893 6501289 6561008 6610641 6648277
59088 6648277 6672551 6683400 6681721 6668633 6645277 6612984 6573286 6527852 6478502 6427187 6375836
59077 6375836 6326193 6279683 6237249 6199504 6167216 6141647 6124207 6115826 6116792 6127159 6147310 6178245
59065 6178245 6221163 6276442 6343016 6419280 6504797 6600831 6709096 6830502 6965301 7113773
59055 7113773 7276072 7451544 7638673 7835765 8041746 8256575 8480848 8714482 8955688
59046 8955688 9201607 9449848 9698658 9945568 10186919 10419217 10639993 10846519 11034121
59037 11034121 11196358 11326326 11417333 11463095 11458305 11399130 11283142 11109684 10881160 10603576
59027 10603576 10285042 9933828 9557910 9165390 8764237 8361624 7963852 7576402 7203598
59018 7203598 6848597 6513887 6200989 5909255 5636170 5379915 5141028 4920645 4717926
59009 4717926 4530410 4356356 4195450 4047443 3911215 3785209 3667921 3558151 3455462
59000 3455462 3360176 3272238 3190516 3113922 3042643 2977176 2916707 2859833 2806688 2758899 2717083
58989 2717083 2679392 2643003 2606503 2570683 2537504 2508393 2483032 2459791 2437536 2416670 2398150
58978 2398150 2382259 2369066 2359421 2354427 2354248 2358218 2365649 2375683 2386996 2398931 2412525 2429124
58966 2429124 2448192 2467798 2487136 2507275 2529311 2552879 2576607 2598959 2618626 2635181 2649504
58955 2649504 2662606 2673975 2682028 2686131 2687075 2685647 2682015 2676623 2670474 2664248 2658257 2653376 2650645 2649533
58941 2649533 2647907 2644238 2638735 2631792 2622643 2610451 2595740 2579857 2563709 2547831 2532978 2519823
58929 2519823 2508504 2499144 2492298 2488210 2486177 2485468 2486589 2490903 2499061 2510369 2523624 2538030 2553257
58916 2553257 2569070 2585352 2602539 2621786 2644242 2669990 2698129 2728227 2761212 2798201 2838794
58905 2838794 2881361 2924809 2969210 3014703 3060813 3107164 3153995 3201533 3249529 3297976 3347920
58894 3347920 3400992 3458207 3519413 3583887 3651420 3722945 3799979 3883310 3972333 4065845 4163182
58883 4163182 4264495 4370376 4481695 4599421 4724239 4856665 4997691 5148474 5308980
58874 5308980 5477979 5655331 5843366 6044802 6260084 6488120 6728962 6984012 7253922
58865 7253922 7538248 7837571 8154576 8492659 8854602 9242790 9659429 10106058 10583707
58856 10583707 11093789 11638048 12217821 12834497 13490430 14187658 14925295 15699414 16505574
58847 16505574 17339600 18195157 19061897 19926595 20774286 21587138 22343691 23021067 23597843
58838 23597843 24054667 24374174 24543035 24554757 24410070 24115297 23681673 23125895 22469397
58829 22469397 21735361 20945560 20119063 19272658 18421470 17578880 16755912 15960985 15200300
58820 15200300 14478188 13796979 13157015 12557373 11996440 11471750 10980171 10519246 10087919
58811 10087919 9685151 9308370 8954555 8622523 8312806 8025254 7757988 7508888 7276922
58802 7276922 7061743 6862989 6680164 6512298 6357699 6215068 6084763 5967728 5863073
58793 5863073 5768163 5681422 5603709 5536639 5480887 5436625 5404037 5382476 5370309 5366597 5372219 5388595
58781 5388595 5416075 5454213 5502780 5561801 5631159 5710765 5800737 5901198 6012505 6135712 6271945
58770 6271945 6421254 6583130 6758247 6948496 7154986 7377209 7614596 7867879 8138528
58761 8138528 8427982 8737802 9069385 9423205 9799583 10200720 10630703 11093027 11589342
58752 11589342 12120924 12689748 13297273 13943469 14627701 15348979 16104357 16888292 17694232
58743 17694232 18514902 19339457 20151488 20931330 21659407 22316082 22879656 23327237 23638830
58734 23638830 23800975 23807809 23660306 23364946 22932723 22379010 21723161 20986339 20188832 19349597
58724 19349597 18487279 17619240 16759086 15916750 15101137 14320304 13578420 12875160 12209631
58715 12209631 11582943 10995661 10445234 9928259 9443627 8991255 8569168 8174129 7804188
58706 7804188 7458463 7135329 6832832 6550045 6286071 6038518 5805035 5585709 5381887
58697 5381887 5193039 5016729 4851368 4697233 4555065 4425329 4308431 4203959 4109980 4024560
58687 4024560 3947500 3879117 3818162 3762907 3713627 3671771 3636904 3606629 3579427 3555322 3533515
58676 3533515 3511549 3487488 3461180 3432734 3401270 3365921 3326837 3284566 3239479 3192282 3144164
58665 3144164 3095756 3046506 2995317 2941435 2884903 2826696 2768040 2708987 2648224 2585083 2520933
58654 2520933 2457564 2395213 2333706 2274619 2220175 2170286 2122803 2076737 2033279 1993392 1956324
58643 1956324 1921171 1888270 1858136 1830200 1803318 1776656 1749609 1721768 1693421 1665397 1638023
58632 1638023 1610891 1583760 1557082 1531640 1508293 1487812 1470110 1453949 1438385 1424271 1413317
58621 1413317 1406023 1401693 1400075 1401472 1405359 1410510 1416659 1424474 1433533 1441756 1447461 1451026 1454124 1458325
58607 1458325 1464651 1473256 1482864 1491294 1497115 1500437 1502088 1502684 1502429 1500954 1497329 1490992 1482787 1474454
58593 1474454 1467262 1461694 1457889 1455427 1453307 1451542 1452318 1457906 1467596 1478397 1488890 1500668 1515658
58580 1515658 1533866 1554492 1577569 1603333 1631298 1661328 1694845 1733553 1777133 1823311 1870343
58569 1870343 1918871 1971100 2028605 2091412 2159186 2232680 2313298 2401556 2497072 2600193 2712360
58558 2712360 2834333 2965458 3105704 3257115 3421855 3599787 3789514 3990920 4204881
58549 4204881 4430939 4666891 4910225 5158097 5405944 5647533 5876082 6083796 6260940
58540 6260940 6397690 6487586 6528024 6518020 6457833 6351228 6205908 6030559 5832508 5618458
58530 5618458 5395585 5170507 4947811 4730233 4519720 4318120 4127600 3950616 3788820
58521 3788820 3642119 3509595 3391031 3286525 3195099 3115130 3045875 2987026 2936823 2892344
58511 2892344 2851950 2815965 2784687 2757199 2732624 2711190 2693429 2679260 2668290 2660136 2654048 2648751
58499 2648751 2642495 2632504 2614847 2586178 2545859 2495761 2438525 2376846 2313530 2250498 2187999 2126079
58487 2126079 2066250 2010242 1957877 1907943 1860516 1816362 1774665 1733710 1693630 1656165 1621823
58476 1621823 1589589 1559310 1531775 1506251 1480646 1454705 1430605 1409655 1390733 1372732 1356234
58465 1356234 1341746 1328324 1315056 1302171 1289849 1277737 1266346 1256965 1249237 1240673 1229718 1217836
58453 1217836 1207589 1200028 1194663 1190592 1187057 1184177 1183505 1186417 1191920 1197764 1203599 1210805 1219249 1226933
58439 1226933 1233373 1240548 1249678 1259767 1270381 1283075 1298631 1315498 1332707 1352053 1375469 1401997
58427 1401997 1428888 1453843 1474809 1489616 1497712 1500804 1500337 1495834 1486747 1473986 1458259 1438916
58415 1438916 1415924 1390943 1364887 1336515 1305305 1273742 1244721 1218416 1193855 1171883 1154154
58404 1154154 1140276 1128171 1116508 1105102 1093829 1082911 1073513 1066594 1061841 1058674 1057147 1056885 1056684
58391 1056684 1056428 1057904 1062260 1068143 1073797 1079482 1086207 1093516 1100341 1106946 1114343 1122792 1132305 1143636
58377 1143636 1157413 1173322 1191161 1211401 1233626 1255923 1276888 1296591 1314358 1327590 1334476
58366 1334476 1336233 1335027 1331342 1325105 1317641 1310375 1302811 1293688 1283120 1272087 1261095 1250898 1243245
58353 1243245 1239306 1238464 1239867 1243661 1249453 1255470 1260953 1267702 1277510 1289687 1302737 1316663 1331632
58340 1331632 1346108 1358423 1368724 1377353 1382772 1383272 1379612 1374100 1368159 1362373 1357534 1353921 1350761
58327 1350761 1347821 1346057 1345407 1343794 1339927 1335171 1330939 1326189 1319330 1310728 1301521 1291873 1282237 1274387
58313 1274387 1269372 1266455 1265662 1268963 1276967 1287005 1296605 1306482 1318065 1330891 1344700 1361144 1380768
58300 1380768 1401186 1420925 1441902 1465074 1487115 1505221 1522030 1541579 1563208 1583972 1604408
58289 1604408 1626805 1649680 1669213 1685110 1700220 1715090 1727332 1735885 1741809 1745390 1746272 1745882 1746100
58276 1746100 1746211 1744714 1743343 1745737 1752821 1762807 1774867 1789426 1805824 1823067 1842013 1863735 1887001
58263 1887001 1910454 1935567 1963956 1993604 2021618 2048993 2078629 2110335 2141975 2173940 2208013
58252 2208013 2243103 2276487 2308098 2339454 2369775 2397424 2423625 2450302 2475835 2497574 2516874
58241 2516874 2536921 2557343 2576236 2595844 2620633 2650875 2683530 2718336 2757451 2800160 2843651
58230 2843651 2888306 2936736 2988433 3040962 3095550 3155711 3221134 3288641 3358333 3432906 3511752
58219 3511752 3591962 3674575 3763689 3859885 3960603 4066320 4179890 4300211 4422936 4547128
58209 4547128 4674861 4804598 4931401 5053391 5172009 5286852 5396936 5506098 5620180
58200 5620180 5739666 5862035 5990129 6130633 6285602 6453541 6637643 6844188 7073460
58191 7073460 7321035 7587494 7877829 8191719 8523631 8872248 9240357 9625861 10022825
58182 10022825 10431461 10857237 11300539 11757893 12233433 12738388 13279084 13856047 14474018
58173 14474018 15140544 15854635 16609372 17406017 18252901 19150655 20092415 21078663 22117081
58164 22117081 23207299 24341566 25521996 26761762 28068574 29443529 30896827 32446545
58156 32446545 34100954 35861569 37744977 39780795 41986109 44363908 46928264 49706188
58148 49706188 52711787 55946105 59429150 63207985 67332711 71857766 76874096 82509395
58140 82509395 88893057 96156071 104464505 114002355 124907279 137264322 151163700 166713018
58132 166713018 184018184 203281290 224975361 249826045 278525771 311423052 348232691
58125 348232691 387445571 425543928 457060335 476343463 480193287 469273399 447200618
58118 447200618 418375706 386392407 353684100 321786497 291583865 263501042 237727764
58111 237727764 214352838 193352231 174587535 157895248 143143248 130187832 118843445
58104 118843445 108928515 100293035 92779593 86211217 80448559 75419562 71072784 67344297
58096 67344297 64187896 61587603 59512679 57903924 56732758 56034322 55857567 56222857
58088 56222857 57144113 58628279 60616301 62996796 65736913 68904868 72406552 75683641
58080 75683641 77806634 77984722 76020057 72310561 67507830 62203464 56824541 51651000
58072 51651000 46842659 42466598 38537788 35048327 31970996 29260168 26866318 24749414
58064 24749414 22878155 21224414 19762832 18470660 17323401 16292968 15353370 14487209
58056 14487209 13685070 12940093 12245199 11594736 10985897 10416968 9885044 9386645 8919828
58047 8919828 8484057 8078091 7699611 7346781 7018273 6711204 6420819 6142900 5875228
58038 5875228 5616765 5367605 5130129 4907875 4702281 4512345 4337588 4178470 4032778
58029 4032778 3894552 3758517 3623880 3492604 3366121 3245014 3129606 3019124 2911894
58020 2911894 2807638 2707866 2613148 2522190 2434624 2352322 2276579 2206235 2139877 2077588 2019094
58009 2019094 1962617 1907248 1854261 1804422 1756258 1708796 1663791 1623165 1586204 1551292 1518498
57998 1518498 1488224 1458941 1428637 1397440 1366888 1337663 1309727 1283514 1259240 1235919 1212549
57987 1212549 1189422 1167122 1145408 1124321 1105166 1088954 1074860 1061492 1048754 1037354 1027352
57976 1027352 1018315 1010223 1003424 998230 994744 992209 988583 982222 974008 966163 959027 950991 941725 933090
57962 933090 926407 921201 917204 915116 914689 914702 915730 920170 928322 937250 944990 953082 963160 973796
57948 973796 983047 991783 1001985 1013544 1025072 1036246 1047165 1056897 1064966 1073078 1083290 1095417
57936 1095417 1107950 1120263 1132042 1141708 1147336 1148272 1144322 1134409 1117507 1094004 1064948 1031290
57924 1031290 995200 960584 930506 905013 882750 863369 847123 833723 823234 816590 813667 812393
57912 812393 811481 812419 816838 823499 829936 835734 841967 848712 855518 863424 874135 887720 903020 919555
57898 919555 937100 953998 967932 977924 984083 986131 983872 978338 970735 961009 949044 936264 924134
57885 924134 912026 898669 885009 873508 865263 860008 858372 861619 869059 877991 886629 895395 905054
57872 905054 915126 924471 932071 936898 937960 934704 926803 913932 896487 875778 852522 826001 796044
57859 796044 764963 735952 710084 686502 664989 646494 631323 618575 607535 598194 590291 583153
57847 583153 576758 572032 570023 571359 576088 583083 589997 594866 597646 599641 602005 605539 610902 617754
57833 617754 624414 629628 634168 639529 645719 651558 656475 660732 664388 667307 669619 671112 670780 668029
57819 668029 663436 657260 648457 636798 624850 615835 610074 605280 599710 593309 586451 579657 574284 571593
57805 571593 571211 571924 573580 576698 580911 585556 591202 598597 606655 613588 619524 625772 631839 635785 637479
57790 637479 638940 641078 642561 642487 641812 641212 639666 636306 631941 627617 623200 618516 614568 612297 611037
57775 611037 609286 606432 602969 599469 595928 591897 587087 582017 577712 574287 570490 565491 560388 556718
57761 556718 554179 551202 547061 541678 534116 523497 511163 499692 489697 479731 469340 459820 451592
57748 451592 443386 434818 427441 422211 418039 414017 411065 409998 409755 409037 408181 408007 408286 408938 411415 417215
57732 417215 425991 436604 449082 463961 480594 497898 516292 537109 560126 583081 603775 621696
57720 621696 637676 652918 668242 683279 696125 704490 707370 705353 699461 690354 678603 665114
57708 665114 650911 636617 622308 607885 593621 580145 567719 555867 544147 533095 523850 516890
57696 516890 511719 507693 504543 502077 500042 498343 497031 496190 496281 498218 502358 507768 513366 519428 526874
57681 526874 535202 542413 547107 549650 551240 552970 555926 560855 567153 573143 577957 582437 587853 594493
57667 594493 601967 610204 619617 630548 642784 655543 668257 681628 697291 715802 735712 755472
57655 755472 775313 796000 816784 836480 856025 877817 902552 928706 955109 982049 1009630
57644 1009630 1037315 1065703 1096879 1132183 1171228 1213604 1259733 1309350 1361054 1414260 1470053
57633 1470053 1529273 1591385 1656021 1723946 1795645 1870816 1950418 2037476 2134521 2241732 2358848
57622 2358848 2487427 2629863 2787517 2961107 3151443 3358232 3579328 3812527 4056865
57613 4056865 4310738 4569927 4828884 5082527 5325069 5548440 5744340 5907780 6037088
57604 6037088 6130423 6182713 6185001 6126521 6000195 5809273 5568506 5297315 5012035 4724627
57594 4724627 4445373 4182555 3939723 3716411 3512212 3328304 3164986 3020070 2890609
57585 2890609 2774849 2672056 2581837 2504028 2438109 2382378 2334685 2294207 2261583 2237375 2221427
57574 2221427 2213735 2214660 2223894 2240151 2262272 2290182 2324670 2366712 2416993 2475771 2543367 2620881
57562 2620881 2709601 2809255 2917945 3034636 3160668 3297649 3444862 3600130 3762172 3930162
57552 3930162 4101216 4269933 4430165 4575685 4699328 4793380 4851539 4870010 4847244 4784184
57542 4784184 4684753 4554854 4400539 4227763 4043063 3852788 3661475 3472013 3287062 3109008
57532 3109008 2938826 2776455 2622384 2477780 2343418 2219715 2107216 2005357 1911236 1821752
57522 1821752 1737019 1659631 1590449 1527346 1468582 1414937 1367332 1324458 1284391 1247121 1213761
57511 1213761 1184199 1157119 1131830 1108723 1088249 1070552 1055825 1043993 1034003 1024266 1014044 1004104
57499 1004104 995885 990209 986763 984791 984190 985683 989800 996156 1004208 1014119 1026150 1039588 1053310
57486 1053310 1067266 1082604 1100348 1120716 1143548 1168581 1195419 1224040 1255194 1289499 1326480
57475 1326480 1365478 1407124 1452800 1502917 1556937 1614861 1677407 1744972 1817947 1897881 1986565
57464 1986565 2083800 2187768 2297892 2415461 2540793 2671484 2804280 2936981 3067245 3190739
57454 3190739 3301685 3394332 3463096 3502787 3510686 3488161 3439156 3367317 3275506 3167519 3048745
57443 3048745 2924555 2798502 2672304 2547234 2425270 2308815 2199555 2098184 2005511 1922926
57433 1922926 1850828 1787260 1729550 1677071 1630967 1591292 1556186 1524291 1496295 1473314 1455114
57422 1455114 1440833 1430252 1423363 1419634 1418708 1421110 1427398 1437331 1450632 1467908 1490042 1517299 1549713
57409 1549713 1587802 1632289 1683660 1742474 1809521 1885232 1969649 2063179 2166320 2277997 2395158
57398 2395158 2514785 2635297 2754982 2869814 2973936 3061888 3129549 3173443 3190355 3177969
57388 3177969 3135800 3065957 2973144 2863070 2740183 2607244 2467219 2324519 2183743 2047907
57378 2047907 1918421 1795916 1680428 1571597 1469524 1374928 1287938 1207505 1132674 1063599
57368 1063599 1000623 943192 890458 842035 797264 754729 713846 676236 643981 616681 591555
57357 591555 566544 542257 520578 502170 485730 469335 452228 435394 420419 407951 397519
57346 397519 388480 380360 372362 363716 354902 347530 342476 338893 335563 332263 329252 326247 322637 318139
57332 318139 312895 307710 304301 304027 305864 307070 306665 306721 309146 312700 314767 314917 314980 316368 319061 322754
57316 322754 327327 332340 337380 342745 348704 354519 359399 363966 369516 376248 383639 392193 403180 416544
57302 416544 430480 443387 455099 465964 475805 484332 492030 500126 509726 520611 530770 537911 542087
57289 542087 546057 552305 560511 568895 576970 585479 594430 603174 612212 623012 635696 648457 659821
57276 659821 670338 681530 694115 707776 721914 736129 750344 764677 778994 792856 806357
57265 806357 820628 836763 854540 872931 891533 910660 930273 949779 968775 987196 1004858
57254 1004858 1021609 1037831 1054150 1070834 1088008 1106026 1124973 1144298 1163595 1183090 1202656
57243 1202656 1221208 1238212 1254973 1273008 1291703 1309085 1324558 1339509 1355500 1373373 1393846
57232 1393846 1417373 1443218 1469989 1497214 1525372 1554623 1584772 1616221 1649433 1683481 1716671
57221 1716671 1748681 1780690 1813285 1845801 1877948 1910489 1943797 1977095 2009701 2041886 2073955
57210 2073955 2105528 2136216 2165998 2194323 2219688 2240683 2257029 2269512 2279562 2288819 2298121 2306744
57198 2306744 2313432 2318244 2322605 2327600 2333023 2338098 2342287 2345515 2348472 2352541 2358630 2366551 2376394 2389681
57184 2389681 2407583 2428580 2449811 2470604 2492762 2517246 2542520 2566653 2589368 2611438 2633556
57173 2633556 2656467 2680959 2707130 2734619 2763865 2796115 2832150 2872182 2916780 2966166 3018476
57162 3018476 3070723 3122091 3174634 3230093 3287734 3346148 3405509 3466901 3530662 3596543 3664485
57151 3664485 3734103 3804115 3873254 3941452 4009696 4079235 4151202 4226328 4304550 4385097 4466817
57140 4466817 4548145 4627559 4705121 4782951 4863053 4945352 5029158 5115445 5205524 5298133 5390335
57129 5390335 5481084 5571433 5661270 5748575 5832456 5914501 5996496 6078990 6162507 6247555 6332607
57118 6332607 6414501 6491905 6566316 6638881 6708632 6774878 6838948 6902306 6965067 7027515 7090835
57107 7090835 7154960 7217685 7277173 7333328 7385653 7432193 7472263 7508181 7542697 7576561 7609932
57096 7609932 7643976 7679357 7715076 7750589 7787351 7826903 7869518 7916451 7971521 8038359 8117279
57085 8117279 8205864 8300420 8395055 8481297 8550777 8597461 8616862 8605594 8563253 8492415 8395038
57074 8395038 8270749 8119736 7944693 7748201 7530528 7291194 7029449 6741055 6417393
57065 6417393 6049973 5633424 5162759 4631255 4033149 3364865 2621224 1794256 878353
57055 -127755 -1227789 -2432979 -3757068 -5210469 -6803723 -8553094 -10478381 -12599088
57047 -12599088 -14937973 -17525655 -20397330 -23587974 -27135129 -31083396 -35482919 -40388856
57039 -40388856 -45868556 -52006786 -58901522 -66661448 -75412907 -85302249 -96481693 -109086632
57031 -109086632 -123207143 -138848558 -155915095 -174272189 -193840571 -214548461 -236070757
57024 -236070757 -257598672 -277996101 -296340630 -312375038 -326409529 -338752104 -349197716
57017 -349197716 -356996594 -361244087 -361316947 -357051396 -348631297 -336364608 -320556801 -301561156
57009 -301561156 -279911144 -256374298 -231864962 -207291139 -183436911 -160907143 -140108702
57002 -140108702 -121256311 -104407596 -89514315 -76464893 -65111378 -55289442 -46832831
56995 -46832831 -39578071 -33365133 -28043080 -23477662 -19552385 -16165353 -13229563 -10675000
56987 -10675000 -8445958 -6495395 -4782866 -3275247 -1945144 -768134 276975 1206846
56979 1206846 2035510 2777248 3445593 4050499 4598849 5097126 5551547 5966300 6343735
56970 6343735 6685854 6993786 7266631 7503333 7705793 7878583 8025658 8148789 8248827
56961 8248827 8326831 8384005 8421992 8443210 8449528 8440503 8414004 8368515 8304031 8221279 8121720 8008526
56949 8008526 7886219 7758820 7628964 7498743 7370214 7244514 7120939 6997020 6869047
56940 6869047 6732702 6584420 6423095 6250636 6071145 5890187 5714951 5553975 5415343
56931 5415343 5304710 5225426 5179992 5168725 5183559 5202100 5190960 5120061 4977570 4772791 4526102
56920 4526102 4256852 3978575 3700449 3429231 3169553 2924180 2694660 2481386 2283516
56911 2283516 2099979 1930802 1777045 1639461 1517752 1411070 1318648 1239740 1173195 1117404
56901 1117404 1070768 1032361 1002141 980286 966346 959128 957021 957636 957105 950777 935490 911212 880386
56888 880386 846153 811186 777202 744511 712265 679833 647937 618016 590774 566053 544035
56877 544035 525775 512340 503982 500434 501436 506578 515057 526194 539919 555907 572057 584476
56865 584476 589520 585753 573950 555999 534447 512351 492063 473818 456480 439949 425802 415060
56853 415060 406504 398269 390256 383687 378776 374256 369158 363732 358414 353091 347787 342983 338628 333745
56839 333745 327801 321847 317396 314421 311171 305993 298947 291679 285937 282211 279738 277983 277973 281703 290142
56824 290142 302364 316820 332688 349364 365183 377647 385099 387723 386950 384446 381837 380753 382394
56811 382394 386853 393181 400391 408480 418370 430922 446262 464211 485080 509669 538604 572073
56799 572073 610154 652639 697856 741671 778221 802231 811263 806493 791852 772289 751917 732800
56787 732800 715051 698271 683176 671749 665765 665503 670357 680356 696453 719372 749055 785623
56775 785623 830089 883532 945867 1015699 1090201 1163733 1226845 1268687 1282188 1267635 1231539
56764 1231539 1182373 1126962 1069574 1013072 960217 913657 874732 842839 816737 796475 783542
56753 783542 779037 782440 792607 809439 834029 867430 909729 959778 1014604 1068532 1113517 1141527
56741 1141527 1147649 1131718 1097676 1051491 999101 945191 892938 844221 799839 759784 723872
56730 723872 692475 666464 646184 630827 619432 612434 611530 617674 629754 645659 664113 684662
56718 684662 705949 724729 736913 739485 731602 714396 689989 660568 628202 595123 563357 533734
56706 533734 505835 479507 455950 436575 421213 408340 396857 386757 378250 371282 365867 361770
56694 361770 357763 352403 345830 339735 335136 331218 326777 321661 316280 310797 305576 301389 298226 294799
56680 294799 290240 285558 282343 280559 278684 275643 271669 267634 264496 263089 263465 264429 264468 263121 261046
56665 261046 259066 257670 257032 256848 256497 255830 255250 254568 252681 249275 245927 244244 243565 241980 239182 236696
56649 236696 235366 234335 232862 231591 231194 230949 229627 227096 224199 221499 218908 216479 214879 214803 216052
56634 216052 217413 217684 216775 215449 213991 211782 208406 204410 200389 196108 191469 187685 186315 187474 190119
56619 190119 193842 199076 205536 211890 217410 222864 229207 236154 242600 247822 251843 255109 258178 261378
56605 261378 264542 267514 270849 275353 280682 285113 287015 286191 283677 280897 279234 279591 281668 283971 285090
56590 285090 284909 284325 284009 283707 282682 280610 278097 276325 276021 276579 276224 273093 266505 257676 249287 243810
56574 243810 241740 241571 241702 241898 242706 244096 245405 246288 247047 248259 250575 254530 259826 265090 269052 271761
56558 271761 274044 276050 277236 277634 278139 279315 280681 281354 280888 279419 277514 276046 275723 276628 278452 280982
56542 280982 283909 286409 287648 287785 288040 289700 293332 298658 304768 310626 315780 320378 324281 326787 327697
56527 327697 327953 328391 328575 327860 327013 327457 329213 330967 332199 333956 337243 341701 346177 349744 351921 352761
56511 352761 353099 354011 355827 358257 361495 366259 372490 378845 383993 387857 391251 394804 398700 403174 408732
56496 408732 415707 423620 431303 438063 444600 452061 460120 466987 471751 475520 479480 483010 484929 485615
56482 485615 486276 486793 485968 483538 480282 476264 470726 463978 457846 453744 451265 448921 445340 439777 432528
56467 432528 424990 418308 411962 404641 396394 388742 382770 378208 374302 370377 365723 360230 355051 351265
56453 351265 348104 344041 339481 336480 335621 335112 333428 330987 328489 325422 321313 317021 313567 310702 307695
56438 307695 304702 302432 300985 299720 297836 294873 291342 288946 289238 291867 295017 297585 299808 301803
56424 301803 303021 303407 303641 303813 303228 301942 301037 300962 301150 301776 304125 308423 312930 316257 319075 322473
56408 322473 326033 328828 331126 333780 336925 340539 345326 351712 358710 365009 370657 376521 382587 387946
56394 387946 392187 395934 400141 405345 411213 416429 419589 420680 421092 421846 422630 422941 423149 423772 424580 425235
56378 425235 426137 427942 430716 434026 437285 439597 439924 437883 433931 428772 423350 419252 417767 418245 418694
56363 418694 418379 418506 419741 420533 418870 414662 409433 404547 400554 397473 394815 391847 388490 385458 383156
56348 383156 381092 378587 375394 371451 366897 362478 359029 356494 354356 352810 352314 352288 351877 351784 353413 356154
56332 356154 357693 357372 357026 357808 358526 358186 358025 359583 362353 364685 365664 365060 362969 360529 359483 359931
56316 359931 359938 358306 356203 355127 355007 355356 356571 358766 360931 362565 364708 368123 371904 374889 377025
56301 377025 378451 379038 379751 382388 386798 390456 392158 393934 397797 402870 407488 411820 416320 419896 422011
56286 422011 424539 428858 432976 434448 434718 437540 444084 452374 460756 469217 477853 486663 496571 508423
56272 508423 521138 532653 542260 550488 557508 563407 569131 575345 581238 586274 592002 600039 609340 617723
56258 617723 625291 633971 644313 655055 665451 675879 686453 696984 707999 720073 732595 744795
56246 744795 757328 771026 784794 796580 805883 813601 820056 824868 828175 830424 831812 833198 836353
56233 836353 841675 847133 851360 856170 863673 872427 879224 883643 888102 894291 902355 912783 926119 941084
56219 941084 955733 970434 987466 1007926 1031347 1057931 1088650 1123096 1159327 1195990 1233172
56208 1233172 1271820 1313857 1361802 1416277 1474934 1535842 1600545 1671481 1748133 1828875 1915355
56197 1915355 2011344 2117722 2232035 2352680 2480187 2614401 2753736 2897584 3046422 3198932
56187 3198932 3351562 3501347 3646809 3785798 3914758 4030347 4129830 4210195 4269354 4308178
56177 4308178 4329031 4332490 4317902 4286810 4243098 4189734 4127879 4059156 3986120 3910296 3832011
56166 3832011 3752212 3672186 3591595 3508991 3424065 3337254 3247839 3154959 3059925 2964763 2869040
56155 2869040 2770982 2671297 2572872 2477037 2383172 2291625 2203762 2119254 2036666 1956800 1882228
56144 1882228 1813326 1747946 1685235 1626618 1572737 1522670 1476634 1436163 1400855 1367862 1335504
56133 1335504 1304894 1277426 1253120 1231827 1213645 1197770 1183100 1169964 1159095 1149424 1139448 1130162
56121 1130162 1123659 1119475 1115539 1112100 1111183 1112555 1114131 1116355 1122214 1132448 1144314 1155674 1167076
56108 1167076 1179459 1193051 1208761 1227463 1247698 1267104 1285929 1305992 1326914 1347155 1368084
56097 1368084 1392601 1419849 1445724 1468643 1490475 1511882 1531544 1550216 1570626 1592736 1614001
56086 1614001 1634958 1659630 1689519 1722085 1756098 1793355 1833999 1875557 1918484 1967713 2026804
56075 2026804 2095249 2173374 2265069 2373517 2498604 2640543 2801382 2980576 3173202 3374579
56065 3374579 3582231 3791178 3991973 4176493 4342546 4491212 4623767 4742895 4851862
56056 4851862 4949168 5027271 5078998 5102390 5098380 5068415 5016703 4950679 4876257 4794954 4706218
56045 4706218 4608527 4497261 4366460 4215100 4048449 3872639 3692315 3513927 3345408 3190523
56035 3190523 3048264 2918982 2805726 2708353 2622444 2545941 2480851 2426387 2376855 2328964 2285033
56024 2285033 2246282 2209370 2172740 2139976 2113219 2089239 2065762 2045812 2031942 2021798 2013154
56013 2013154 2007710 2006113 2004886 2002307 2001951 2006605 2014068 2022529 2034326 2050636 2068237 2085347 2104800
56000 2104800 2127721 2150404 2171448 2195496 2225487 2257681 2288893 2322051 2359662 2398438 2435718
55989 2435718 2475012 2519766 2567546 2615479 2665382 2718497 2771441 2822547 2875990 2934630 2995245
55978 2995245 3055697 3119833 3190182 3263160 3336889 3416062 3503191 3592941 3681400 3773023 3871749
55967 3871749 3973379 4073826 4177059 4287561 4402874 4521059 4647447 4786241 4933513
55958 4933513 5086429 5251041 5432674 5626977 5829107 6043361 6275083 6521804 6781455
55949 6781455 7060226 7362481 7681584 8010516 8352609 8712077 9083807 9463408 9857661
55940 9857661 10273783 10708064 11156789 11628522 12133579 12671455 13241078 13852577 14515045
55931 14515045 15222724 15967084 16752367 17585440 18461523 19374911 20332825 21343319 22400819
55922 22400819 23499395 24648829 25862031 27139534 28483041 29910220 31438310 33068024
55914 33068024 34802682 36667282 38688282 40871743 43223218 45770071 48539322 51533597
55906 51533597 54757779 58252202 62074635 66275467 70925554 76147505 82086577 88875571
55898 88875571 96660345 105621418 115921795 127668135 140976732 156042664 173094568
55891 173094568 192342917 214051203 238587616 266291628 297330302 331702754 368988666
55884 368988666 407412162 442905917 469673270 482609090 479837577 463252183 436905281
55877 436905281 404964549 370681414 336320355 303332742 272506571 244193010 218541039
55870 218541039 195573696 175170726 157122945 141226582 127292541 115104656 104435893
55863 104435893 95093967 86907866 79690893 73264965 67510471 62355598 57730232 53563441
55855 53563441 49808952 46433756 43387657 40612620 38072746 35748074 33608883 31622672
55847 31622672 29777525 28072918 26494463 25020374 23644938 22372921 21197306 20103404
55839 20103404 19088280 18155559 17296377 16494142 15742619 15041620 14380857 13746202 13137211
55830 13137211 12561801 12018174 11497732 11000711 10532857 10090879 9666636 9261893 8884243
55821 8884243 8531931 8196698 7877979 7580600 7301873 7034452 6778974 6541131 6319234
55812 6319234 6107084 5906042 5721932 5552722 5391097 5236378 5092049 4954039 4813196
55803 4813196 4667354 4519990 4369350 4210301 4045442 3883527 3728051 3577140 3432932
55794 3432932 3300838 3180718 3068371 2964573 2873652 2794651 2722854 2658396 2604324 2557632
55784 2557632 2511146 2462960 2415468 2366707 2311708 2251463 2191992 2135347 2079526 2026231 1980399
55773 1980399 1942557 1909097 1879158 1853924 1830354 1803249 1772674 1742330 1712002 1678762 1644013
55762 1644013 1611597 1580197 1545149 1506707 1469079 1432480 1393779 1354052 1317835 1285435 1253236
55751 1253236 1221074 1192118 1166135 1140011 1114501 1093424 1076696 1061115 1047376 1039172 1035778 1032679
55739 1032679 1029240 1028701 1030929 1032366 1032994 1035973 1040191 1040487 1035818 1030174 1024697 1015908 1002825 989086
55725 989086 976675 963698 949655 936967 926076 914758 903396 895456 891781 889811 889074 891631 896153
55712 896153 897443 893268 886261 877807 865472 848098 828388 808776 789219 770367 754365 741215
55700 741215 728507 715705 704589 694859 683823 671158 659496 649462 638474 625254 611223 596669
55688 596669 579744 559992 538908 516656 492356 467836 446737 429534 413687 398830 387207
55677 387207 378914 371481 364643 360692 359606 358618 357199 357652 360142 361861 361812 361616 361063 357857 352510 348340
55661 348340 345678 341287 334624 329247 326435 322716 315890 308663 304084 301746 300668 301694 304773 307650
55647 307650 309352 311541 314938 318113 321225 326904 335705 344483 350995 356371 361485 364733 365186 364279 362648
55632 362648 358919 353327 348941 347587 347911 348988 352280 358441 365689 372877 380778 388920 394770 397597
55618 397597 399681 402358 404368 405314 406735 408284 406899 401586 395271 390143 385015 379023 374048 371502
55604 371502 370436 370639 373691 379006 382936 384089 385708 390511 397147 404093 412842 424257 435562 444228
55590 444228 451501 459185 466220 471465 476516 482444 486706 486680 483610 479887 474950 467101 457061 446642
55576 446642 435963 424934 415386 408779 403592 397581 390870 384538 378235 371505 365248 359557 352267 342109
55562 342109 331140 321652 312904 303345 293726 285324 277242 268133 258697 249988 241319 232343 225031 220815
55548 220815 217772 213422 208386 204478 201110 196641 191731 188370 186780 185922 185707 186140 185665 183120 180174
55533 180174 179219 179829 179716 178181 176364 175019 174302 174807 176750 178918 180123 180698 181117 180697 179395 179314 182359
55516 182359 187692 193263 198466 203671 208889 214688 222629 232893 243260 252342 261817 273364 285584
55503 285584 296451 306712 317918 328777 336404 339905 340008 336632 329693 321095 312879 304305 293564
55490 293564 281540 271120 263405 257190 251565 246460 241199 234963 228359 222424 216636 209981 203333 198609
55476 198609 196142 194911 194667 195728 197298 198096 198154 198138 197547 195492 192676 190773 190491 191833 195243 200636
55460 200636 206272 210537 213949 217573 220551 221366 220466 219437 218434 216681 214676 213569 213046 212045 210923
55445 210923 210729 210902 209861 207266 203703 198900 192376 185058 178033 170521 161387 151821 143954 137454 130295
55430 130295 122513 116287 112227 108324 103022 97123 92171 88889 87559 88065 89102 88881 87016 84588 82474
55415 82474 80806 79723 79170 78250 76214 73764 71960 70371 67814 64375 61193 58821 57372 57492 59416
55400 59416 61710 62772 62912 63137 62764 60525 57441 56137 57356 59275 60152 59675 57917 55112 52556 51817
55384 51817 52868 54566 56712 59817 63138 64972 64968 64358 63862 63061 61722 60109 58078 55445 52927 51046
55368 51046 48702 44818 40901 39630 41116 42937 43805 44677 45986 46519 45909 45901 47837 50597 52231 52383
55352 52383 52062 52085 52720 54113 56330 59291 62843 66505 69363 70896 71586 71985 71724 70438 69079 69091 70577
55335 70577 72347 73412 73415 72204 70123 68189 66997 66104 65315 65369 66249 66340 64859 63590 64185 65248 64452
55318 64452 62303 61053 60929 60322 59090 58674 59183 59239 58595 58175 57597 55476 52351 50558 50864 51721 52090
55301 52090 52445 52803 52454 52028 53092 55219 56199 55683 55802 57376 58425 57554 56026 55042 53558 50507 47035
55284 47035 44733 43381 42055 40936 40506 40298 39850 39746 40523 41520 41703 40670 38407 35333 32945 32816
55268 32816 34418 35612 35810 36718 39295 41939 42799 42059 40964 40205 40310 41849 44123 45305 44893 44396
55252 44396 44634 44353 42756 41414 41941 43489 44372 44653 45234 45705 45255 44714 45598 47628 49155 49735 50572
55235 50572 52542 55249 58029 60585 62388 62508 60454 56849 53215 51099 50923 51425 50853 49089 48037
55220 48037 49548 53501 58075 61212 61654 59551 56486 54164 52759 51182 48940 46622 44470 41898 38890
55205 38890 36650 36217 37462 39848 42917 45540 46036 43988 40966 38711 37520 36987 37214 38411 40088
55190 40088 41494 42347 42781 43172 44124 45720 46832 46401 45419 46046 48562 50869 51444 50906 50041 48354 45814
55173 45814 44116 44555 46018 46668 46509 46707 47418 48007 48678 50221 52458 54260 54945 54664 53777 52774 52420
55156 52420 53095 54229 55009 55180 54608 52844 50003 47494 46924 48534 51253 53888 55733 56551 56548 56123 55382
55139 55382 54405 53891 54524 55470 54738 51632 47850 45475 44822 44894 44975 45041 45369 46414 48361 50381 51268 51246
55121 51246 51979 54193 56530 57514 57495 57666 58249 58709 58876 58769 58035 56575 55145 54549 54768 55429 56294 56731
55103 56731 55666 52864 49476 46683 44657 43386 43275 44161 44848 44616 44215 44522 45219 45749 46517 48100 50167
55086 50167 52164 54146 55978 56737 55942 54486 53343 52329 51042 49911 49160 47909 45659 43687 43498
55071 43498 44806 46393 48101 50414 52858 54540 55830 57865 60687 63270 65205 66986 68836 70477
55057 70477 71895 73201 73878 73274 71733 70234 69043 67686 66109 64988 64926 65927 67474 68663 68740 68009
55041 68009 67626 68027 68408 68394 69006 70957 73066 73722 73010 71996 70769 68936 67474 68203 71398 75471 79087
55024 79087 82182 84784 86221 86096 85153 84736 85763 88203 91005 92702 92705 91875 91425 91600 91898 91980 91659 90582
55006 90582 88804 87213 86609 86785 87210 87914 88848 89183 88487 87993 89338 92267 94796 95500 94639 93170 91725
54989 91725 90570 89658 88744 88052 88403 89963 91436 91591 91155 91921 94207 96541 97876 98829 100277 101804
54973 101804 102226 101173 99611 98864 99299 100059 100157 99639 99268 99231 99004 98489 98250 98271 97557 95674 93790 93542
54955 93542 95581 99648 105007 110159 113323 114161 114125 114357 114372 113572 112610 111983 110651 107731 104581 103453 104718
54938 104718 106912 108898 110471 111392 111414 110882 110069 108413 105632 102939 101790 102115 103127 105000 108013 110800
54922 110800 111460 110067 108312 107044 106003 105629 107006 109862 112448 113607 113490 112347 110382 108886 109600
54907 109600 112525 115894 118613 121233 124251 127173 129827 133044 137222 141399 144573 147033 149724 153006
54893 153006 156577 160058 163390 167124 172356 179816 189097 199294 210050 221296 232599 243857 256177
54880 256177 270707 286733 302107 315377 326326 334693 339720 341027 338823 333272 324655 313951 302253
54867 302253 289891 277088 264818 253663 242452 229710 216039 203408 192573 183131 175709 171663
54855 171663 170373 169157 166606 164113 163382 164202 165569 167382 169897 172690 175245 177944 181752 187440 195268
54840 195268 204787 214911 225117 236393 249982 265337 280510 294285 306460 316236 322168 323878
54828 323878 322231 317620 309664 298806 286464 273206 258490 242674 227582 214552 203437 193960
54816 193960 186317 179836 172800 164486 155984 148359 141497 135450 131303 129734 130004 131107 132660 134032
54802 134032 134197 133270 132762 133430 134209 134048 133368 132808 132026 130747 129624 129023 128262 127096 126565 127169 127557 126318
54784 126318 123941 121654 119322 115932 111459 107026 103743 102268 102698 103938 103909 101408 97287 93286 90490
54769 90490 89369 90035 91524 91968 90600 88851 88589 90083 92367 94613 96295 97065 97370 98294 100078 101865
54753 101865 103626 106926 112654 119221 124215 126785 127311 126082 123842 122619 124264 128639 134390 140828
54739 140828 147821 154739 160988 167111 174132 182222 191018 200607 211153 222267 233878 246980 262250
54726 262250 278582 294183 308546 322218 335278 347272 357932 366620 371646 371608 367069 359795 350776
54713 350776 340184 328732 317663 307615 298606 290743 283850 276876 268935 260635 253314 247365 242403
54700 242403 238572 236502 236326 237924 241648 247618 254863 262550 271589 283513 298021 313155 327757
54687 327757 342331 357507 373182 389265 405867 422340 437216 449436 458871 465546 469108 468994
54675 468994 464473 454877 440650 423736 405893 387061 366596 345526 326065 309064 293590 278996
54663 278996 265777 254084 243059 232253 222415 214097 206501 198416 189647 181095 174000 169368 167321
54650 167321 166748 166206 165357 164739 164244 162922 160606 158549 157783 157726 157131 155772 154463 153912 154229 155303 157067
54633 157067 159347 161781 163868 165071 165150 164490 163950 164242 165497 167263 168677 168880 167691 165975 165070 165815
54617 165815 168103 171181 174274 177133 180128 183592 187142 190162 192965 196649 201576 206839 211669 216483
54603 216483 221960 227944 234036 240375 246848 252321 255834 258087 260596 263752 266777 269222 271476 274051
54589 274051 277352 281896 287822 294572 302064 311696 324877 340707 356447 370373 383187 396760 412513
54576 412513 430806 450457 468484 481479 487851 488304 484251 476585 465836 452470 436771 419103
54564 419103 400303 381268 362441 344429 328546 315578 304443 293421 282490 272997 265326 258630
54552 258630 252944 249549 248608 248241 246997 245846 246523 248891 251115 251683 250161 246579 241185 234600 227375
54537 227375 219535 211095 202813 195804 190470 186214 182176 178067 174318 171429 169112 166267 162196 157612
54523 157612 153972 151979 151259 151257 151658 152124 152493 153215 154593 155615 154673 151744 148781 147389 147121 146682 145898
54506 145898 145565 145852 145947 145308 144609 145163 147554 150915 153675 155077 155773 156824 158492 160382 162212 163752
54490 163752 164463 164127 163650 164241 165886 167511 168575 169468 170382 171123 172284 175335 180949 188082 195149 201301
54474 201301 206428 211099 217000 226082 238247 250743 260763 268038 274112 279915 285127 289280 292136
54461 292136 293106 291443 287220 281367 274655 267300 259515 251638 243480 234370 224401 215098 208036 202908
54447 202908 197756 191382 184886 180251 177999 177074 176712 177087 177876 177623 175519 172887 171802 172777 174803 177001
54431 177001 179031 180333 180437 179937 179911 180399 180657 180818 181898 184018 186058 187464 189052 191500 194241 196485
54415 196485 198227 199540 199940 199270 198427 198427 199392 201039 203369 206166 208568 209939 210635 211196 211324 210415 208706
54398 208706 207224 206851 207859 209952 212195 213393 213122 212147 211419 211014 210388 209194 207355 204697 201089 196840
54382 196840 192639 189194 186910 185621 184665 183650 183018 183324 184155 184535 184276 183962 183700 183077 182421 182663 183616
54365 183616 183863 183007 182557 183593 184911 184793 183567 182914 183285 183456 182393 180392 178571 178094 179571 182332
54349 182332 184559 185061 184633 184947 186598 189091 192209 196207 200950 206013 211577 218172 225491 232424 238359
54334 238359 243627 248624 253310 257562 261230 263740 264419 263424 261672 259740 257414 254429 250925 247026 242568
54319 242568 237575 232551 228072 224334 221211 218414 215654 213041 211251 210718 210600 209142 205371 200158 195458
54304 195458 192726 192121 192849 193934 194744 195078 195037 194945 195256 196243 197733 199364 200977 202342 202781 201834 200392
54287 200392 200234 202074 205021 208393 212937 219248 225947 230886 233693 235854 238419 240954 242669 243320 242803
54272 242803 241092 238880 237083 235311 231926 226296 219962 214772 210660 206252 201074 196015 191842 188303
54258 188303 184827 181358 178231 175722 173836 172160 169809 166034 161134 156505 153482 152248 151813 150715
54244 150715 147669 142217 135383 129495 126551 126554 127832 129072 130431 132318 133801 133165 129971 125774 122560
54229 122560 120938 120095 119000 117242 115007 112759 111021 110208 110483 111668 113167 114099 113829 112463 110646
54214 110646 108807 106891 104933 103540 103402 104434 105742 106574 107120 108129 109783 111339 112176 112898 114792
54199 114792 118132 121719 124337 125867 126482 125660 123060 119912 118286 118922 120756 122553 123919 124557 123843
54184 123843 121863 119984 119557 120399 121128 120661 119089 117400 116641 116921 117070 115864 113750 112665 113758 116044
54168 116044 117806 118604 119127 119654 119667 118884 117847 117287 117305 117322 116620 114917 112488 109731 106753 103714 101307
54151 101307 100270 100466 101061 101711 102726 103880 104039 102515 100025 97617 95333 92743 90345 89466 90787
54136 90787 93544 96262 97877 98260 98049 98126 99190 101625 105216 108573 109449 106724 102044 98422 97105 96882
54120 96882 96553 96503 97205 97691 96821 95162 94345 95020 96490 97903 98830 99053 98679 98190 97763 96960 95687 94800
54102 94800 94998 95783 96365 96910 97860 98702 98517 97282 95561 93493 91256 89960 90551 92238 93539 94617
54086 94617 96804 99752 101038 99303 96302 94845 95772 97826 99577 100440 100400 99842 99552 100140 101348 102234
54070 102234 102051 100778 98948 97209 96024 95681 96397 98105 100046 101042 100626 99579 98889 98448 97404 95670
54054 95670 94342 94458 95751 96871 96704 95453 94460 94780 95945 96596 96358 96306 97151 97915 97237 95367 93904
54037 93904 93918 95227 97162 99127 100578 101244 101248 100488 98475 95568 93644 94225 96412 98042 98661 99727 101959
54020 101959 104212 105394 105881 106322 106468 106185 106499 108420 111388 113874 115090 115313 114979 114418 114202 114864 116159
54003 116159 117255 117740 118002 118557 119441 120431 121478 122652 123765 124550 125352 127382 131743 138097 144589 149227
53987 149227 151262 151439 151424 152843 155991 159297 160829 160739 161299 163996 167624 170092 171258 172777 175776 179942
53971 179942 184537 189015 192802 195690 198559 202793 208902 216376 224539 232633 239485 244380 248151 252183
53957 252183 256432 259657 261640 263707 266788 270202 272931 275018 277164 279757 282700 285572 287652 288376
53943 288376 287844 286265 283191 278285 272636 268000 264700 261541 257899 254408 251324 247777 243326 238860
53929 238860 235238 232232 229605 227934 227413 226906 225233 222544 219515 216133 212347 209067 207145 205854 203576
53914 203576 199869 195934 193181 192174 192800 194585 196607 197620 196643 193653 189912 187327 186755 186998 186219
53899 186219 184369 183194 183692 184935 185950 187335 189909 192922 195077 196657 199182 203077 206998 209599
53885 209599 211098 212863 216060 220756 225894 230087 232806 234782 237087 240192 244141 249151 255412 262547
53871 262547 269803 276658 282887 288169 292005 293994 294218 293593 293738 295858 299451 302624 303968 303728 303126
53856 303126 303265 304921 308477 313511 319033 324662 330978 338343 346076 353340 360214 367299 374889 383152
53842 383152 392402 402376 411692 418891 423766 427005 428901 429199 428046 426305 424773 423558 422274 420640
53828 420640 418698 416401 413077 407865 401193 395180 391453 388821 384368 376827 367483 357742 347706 337656
53814 337656 328876 321736 314715 306853 299658 294690 290468 284060 275128 266187 259072 253235 247639 242317
53800 242317 237486 232805 228339 224957 222887 220787 217101 211848 206453 202178 199160 196758 194545 192919
53786 192919 192547 193051 192726 190181 185978 182071 179923 179721 180907 182477 183137 182339 181222 181470 183171 184838
53770 184838 185619 186363 187966 189732 190129 188645 186212 184102 182941 182687 183102 184079 185491 186840 187472 187424
53754 187424 187724 189300 191829 194213 196003 197675 199569 201316 202489 203209 203821 204562 205831 208427 212982
53739 212982 219211 225937 232016 237281 242558 248609 255213 261659 268022 275205 283440 291421 297516 301379
53725 301379 303947 306466 310096 315710 323005 330170 335547 339510 343663 348181 351094 350735 348045 345813
53711 345813 345870 347476 348280 346487 342070 336223 330070 324193 318975 314568 310337 305187 298963 292965 288504
53696 288504 285419 282550 279111 274937 269928 264071 257894 252161 247227 243076 239714 237067 234857 232956
53682 232956 231478 230193 228526 226590 225308 224856 223954 221704 219275 218521 219648 221454 223240 225044 226502
53667 226502 227094 227235 227559 227366 225489 222730 221597 223173 225790 227361 227660 227773 228612 230697 234240 238580
53651 238580 242384 245078 247325 249563 251017 250864 249619 248555 248319 248808 249966 251944 254697 257847 260794
53636 260794 262780 263304 262917 263393 266653 273346 282205 290645 296410 299254 300975 303421 306686 309656 311779
53621 311779 313529 315530 318159 321730 326124 330458 334033 337323 341007 344380 346002 345814 345300 345565 346486
53606 346486 347599 348418 347953 345616 342811 341991 343691 346061 347670 349042 350767 351937 351654 350766 350869 352495
53590 352495 355084 357663 358880 357640 354638 352127 351252 350799 349316 347112 345060 342930 340443 338842 339764
53575 339764 343188 347788 352480 356401 358390 358101 357002 356733 357072 356986 357048 359064 363533 369053 374162 378471
53559 378471 382124 385460 389028 392833 395933 398031 400848 406198 413062 418543 421783 424928 429795 435538
53545 435538 440542 444976 450141 456449 463389 470946 479779 490034 500769 510672 519076 526312 533260 540523
53531 540523 548175 556320 565349 575064 584099 591264 597322 604289 612811 621212 627512 631545 634693 638330
53517 638330 643020 648617 654519 659969 664473 667906 670425 672707 675945 680723 685928 689647 691312 692103
53503 692103 693037 693577 692588 689797 685819 681540 678071 676587 677238 678611 679005 678103 676874 676049 675358 674287
53487 674287 673157 673222 675594 679870 683964 685853 685609 685221 686344 688950 692308 696247 700680 704799 707892
53472 707892 710672 714803 721179 729410 738805 748995 759592 770109 780465 791022 802148 814423
53460 814423 829149 847597 869435 892870 916748 941575 967888 994680 1020514 1045517 1071042
53449 1071042 1097840 1125855 1155553 1187819 1222253 1257129 1291848 1328235 1368426 1412377 1458516
53438 1458516 1505969 1554736 1604159 1652970 1701146 1750444 1802408 1856618 1911322 1965242 2018350
53427 2018350 2071352 2124791 2178390 2231173 2282627 2333594 2385322 2437678 2489188 2539104 2588433
53416 2588433 2638546 2689655 2741198 2792590 2842673 2889300 2930897 2968267 3003885 3039398 3074538
53405 3074538 3108168 3139427 3167867 3193405 3216349 3236817 3254178 3267822 3278473 3287692 3295668 3300390
53393 3300390 3299715 3293722 3284346 3273006 3259388 3242460 3221976 3198509 3172360 3142937 3109431 3071944
53381 3071944 3031704 2990167 2948086 2905481 2862160 2818006 2773020 2727414 2681607 2635831 2589836
53370 2589836 2543305 2496592 2450828 2407284 2366674 2328940 2293488 2259767 2227914 2198816 2173319
53359 2173319 2151372 2132137 2114975 2100253 2089284 2083504 2083512 2088720 2098091 2111152 2127954 2148022 2170141
53346 2170141 2193773 2220185 2251329 2287762 2328440 2372467 2420152 2472024 2527552 2585366 2644330
53335 2644330 2704055 2764763 2827277 2892928 2962868 3037279 3115618 3197662 3283941 3374900 3470008
53324 3470008 3568226 3669247 3773622 3881369 3991052 4100884 4210469 4320737 4432244 4544339
53314 4544339 4656171 4767625 4878827 4989393 5098721 5206299 5310987 5410653 5503699 5590677
53304 5590677 5673114 5750573 5820094 5879243 5928809 5971637 6009388 6041470 6066944 6086078 6099363
53293 6099363 6105906 6103946 6092828 6073365 6045878 6008899 5960550 5900529 5829679 5748150 5655479 5552740
53281 5552740 5443233 5330305 5215382 5098788 4981443 4864544 4748061 4630830 4512220
53272 4512220 4393105 4275205 4160011 4048133 3939140 3832130 3726876 3624124 3524482 3427668
53262 3427668 3333495 3242899 3157017 3075876 2999161 2927731 2862780 2803603 2747906 2694682 2645342
53251 2645342 2601436 2562672 2527957 2497043 2469961 2445803 2423471 2403260 2386575 2374272 2366086
53240 2366086 2361445 2359867 2360634 2362883 2366249 2370960 2377370 2385773 2396422 2409182 2423416 2438891 2456643
53227 2456643 2478198 2503902 2532750 2563907 2597573 2634081 2672976 2713622 2756215 2801491 2849579
53216 2849579 2899600 2950241 3000258 3048601 3094738 3139138 3183012 3227163 3271059 3313118 3351807
53205 3351807 3386464 3417220 3444374 3467975 3487987 3504790 3519161 3531597 3541758 3548831 3552229 3551593
53193 3551593 3546262 3535525 3519528 3499287 3475357 3447041 3413318 3373984 3329271 3279057 3223485
53182 3223485 3163916 3102100 3038505 2972674 2905145 2837577 2770630 2703248 2634888 2567131 2501968
53171 2501968 2439474 2378532 2319173 2262603 2209134 2157384 2105749 2053730 2001719 1950267 1899631
53160 1899631 1849402 1798668 1747288 1696865 1649621 1606370 1566335 1528745 1493561 1460656 1429416
53149 1429416 1399438 1370665 1342635 1314680 1287211 1261678 1238640 1216820 1194762 1172458 1150466
53138 1150466 1128279 1104803 1080030 1055080 1030672 1006659 983241 961604 942724 925989 909553
53127 909553 892009 873388 854538 835817 816642 796384 775311 754295 733730 713336 693164
53116 693164 674294 658026 644502 632419 620035 606370 591648 576851 562842 549821 537530
53105 537530 525863 515019 505142 496058 487338 478448 468997 459187 449858 441629 434194 427059 420774 416501
53091 416501 414197 412207 409093 404947 400322 394864 388073 380805 374710 370312 366735 363224 359777 356132
53077 356132 351512 346148 341969 340599 341117 340937 338812 335956 334089 333387 332928 332361 332206 332746 333419 333413 332397
53060 332397 330507 328031 325297 322670 320571 319455 319538 320324 320805 320659 320953 322852 325688 327292 326487 324485
53044 324485 323479 324602 327607 331513 334897 336412 336061 335472 336131 337860 339807 342212 345899 350420 353959
53029 353959 355179 354266 352282 350368 349330 348945 347894 345420 342837 342032 342674 342382 339675 335183 329790
53014 329790 323493 316715 310800 306013 300567 293082 284869 278382 274378 271923 270199 268615 265894 261031
53000 261031 255177 250919 249439 249593 249819 249692 249364 248797 248042 247260 245980 243270 239219 235330 232688 230420
52984 230420 226898 222081 217623 214734 212880 211046 209537 209572 211156 212270 210842 207212 203895 202854 203612
52969 203612 204162 203088 200403 196897 193403 190589 188967 188877 190370 192820 194766 194799 192969 190749 189176
52954 189176 187533 184537 180392 176871 175380 175567 175859 174949 172748 170276 168723 168409 168770 169367 170477 172371
52938 172371 174506 175998 176670 177110 177931 179474 181934 185156 188425 191049 193060 194828 196154 196325 195019
52923 195019 192709 190248 188478 187924 188251 188262 187143 185493 184352 183524 181948 179784 178813 180216 183027 185497
52907 185497 187263 189189 191577 193626 194746 195613 197481 200788 204707 208042 210338 212112 214148 216850
52893 216850 220336 224730 229929 235308 240215 244804 249935 256208 263505 271402 279420 286703 292133 295221
52879 295221 296533 296889 296514 295296 293475 291495 289366 286742 283591 280299 277002 273229 268457 262870 257410
52864 257410 253094 250259 248349 246374 243632 240187 236763 234176 232663 231598 229954 227382 224795 223643
52850 223643 224504 226644 228945 230735 231530 230687 228169 225384 224234 225048 226176 226048 224976 224305 224420 224522
52834 224522 224093 223425 222637 221268 219370 218036 218092 218953 219607 220115 221154 222513 223286 223447 223980 225212 226213
52817 226213 226324 226234 226832 227777 228048 227332 226037 224324 222045 219635 218338 219332 222682 226919 229619 229138
52801 229138 226318 223949 223840 224844 224538 222426 220379 220040 221046 222202 223340 225161 227736 230115 231555
52786 231555 232555 234291 237132 240097 242110 243542 245914 249893 254246 257344 259276 261647 265342 269250
52772 269250 271521 271685 271236 272224 275296 279050 281488 282269 283218 286211 290858 294866 296614 296673 296679 297268 297520
52755 297520 296126 292893 289159 286699 285954 285420 283114 278640 273450 269081 265654 262286 258516 254798 251702
52740 251702 249018 245896 241937 237925 235132 233785 232573 229950 225628 220442 215101 209700 204377 199762
52726 199762 196492 194630 193714 193136 192306 190744 188302 185414 183038 182044 182283 182333 180753 177710 174696 172417
52710 172417 169900 166413 163240 162134 162433 161360 157512 152669 149570 148911 149241 148959 147502 145169 142822
52695 142822 141592 142004 143156 143191 140863 136586 132091 129187 128566 129482 130529 130938 131079 131640 132503 132727 131623
52678 131623 129641 127947 127067 126183 124025 120351 116241 112999 111267 111157 112405 113993 114523 113750 113156 114073
52662 114073 115748 116364 115637 115134 116005 117693 119171 120249 121196 122147 123462 125697 128525 130458 130467 129292
52646 129292 128400 128186 127975 127315 126406 125447 124308 122915 121513 120655 121156 123621 127482 130935 132517 132585 132736
52629 132736 133894 135593 137033 138197 139762 142217 145228 147807 149231 149899 150939 152801 154792 156360
52615 156360 158284 161751 166602 171344 174953 177840 180826 183816 185851 186079 184343 181125 177204 173312
52601 173312 169892 167180 165321 164129 162838 160572 157255 153765 150993 148988 147129 144789 141509 136907
52587 136907 131116 125386 121663 121018 122601 124549 125837 126833 128085 129279 129795 129687 129347 128424 126039 122279
52571 122279 118750 117128 117586 119135 121079 123468 126201 128427 129244 128682 127633 126863 126450 126175 126077 126252
52555 126252 126413 126230 126106 126917 128680 130161 130350 129683 129171 128852 128212 127785 128937 131773 134468 135280 134420
52538 134420 133359 133053 133601 134962 137055 139323 141040 142057 142859 143974 145679 148008 150522 152200 152185
52523 152185 150821 149672 150299 153048 156909 160436 162748 163775 163760 163031 162439 163329 166223 169753 171861 172128
52507 172128 171959 172333 172564 171828 170858 171145 173056 175558 177431 178103 177775 177404 178108 180009 182089 183641 185108
52490 185108 186878 188239 188595 188860 190213 192062 192806 192312 191891 191894 191175 189380 188027 188410 189800 190757 191127
52473 191127 191656 192448 192987 193184 193412 193831 194593 196298 199189 202093 203272 202526 201617 202322 204634 207187 208808
52456 208808 209213 208565 207051 205029 203267 202680 203663 205613 207224 207456 206338 204843 203918 203676 203669 203888 205047
52439 205047 207480 210042 210953 209994 209062 209917 211936 212989 212138 210450 209298 209058 209704 211391 213638 214871
52423 214871 213791 210921 208075 206580 206533 207288 207857 207176 205032 202806 202437 204399 207236 209281 210262 211021
52407 211021 212310 214317 216978 220186 223664 226840 228947 229404 228379 226983 226582 227737 229907 232023 233104
52392 233104 232617 230999 229805 230535 232912 234957 235209 234301 233920 234860 236783 239210 241664 243180 242910 241374
52376 241374 240119 239934 240263 240550 241025 241605 241182 239075 236517 235412 235825 235868 234243 231905 230725 231167 231898
52359 231898 231463 229829 228182 227442 227294 226865 226224 226631 229059 232973 236959 240126 242258 243139 242766 242163
52343 242163 242826 244982 247276 248676 249868 252109 255353 258417 260614 262127 262844 261992 259528 257138 256890
52328 256890 258978 261540 262970 263802 265838 269813 274597 278712 281873 284738 287680 290470 292906 295181
52314 295181 297584 300156 302723 305113 307448 310221 313750 317338 319520 319591 318422 317204 315970 314212 312501
52299 312501 312255 313843 316170 318489 321570 326391 332462 338211 342614 345792 348304 350484 352475 354543
52285 354543 357113 360361 363639 365671 365919 365560 366426 368971 372038 374597 376755 378872 380813 382622 385026
52270 385026 388524 392583 396327 399365 401420 401948 401124 400573 402116 405929 410643 414994 418718 422084 425443
52255 425443 429202 433612 438495 443564 448995 455284 462599 470535 478511 486401 494948 505363 517974 531316
52241 531316 543375 553736 563532 573206 581854 589488 598377 610672 625681 640997 655640 670439
52229 670439 685742 700457 713437 724532 734289 743971 755779 771341 789451 806650 820713 832523
52217 832523 843897 854812 863938 871273 878903 888960 901532 914846 927197 938357 949102 959841
52205 959841 970238 980100 989745 999052 1006897 1012273 1015527 1017794 1019674 1021263 1022971 1025273 1027856 1029992
52191 1029992 1031694 1033663 1036220 1039052 1041848 1044347 1046069 1046884 1047544 1048630 1049347 1048621 1047181 1047157 1049630
52176 1049630 1053941 1059346 1065782 1072835 1079726 1086882 1095951 1107383 1119404 1130259 1140236 1150553 1161420
52163 1161420 1172367 1183468 1194950 1206221 1216513 1226112 1235978 1246420 1256882 1266693 1275442 1283015
52151 1283015 1289813 1296522 1303138 1308697 1312356 1314162 1314399 1313045 1310431 1307522 1304845 1301936 1298611 1295788
52137 1295788 1293984 1291897 1287780 1281698 1275145 1268929 1262733 1256477 1250640 1245246 1239817 1234596 1230694 1228617
52123 1228617 1227452 1225847 1223233 1219916 1216613 1214075 1212630 1211881 1211173 1210259 1209147 1207540 1205006 1201534 1197347
52108 1197347 1192485 1187276 1182858 1180128 1178253 1175363 1170927 1166349 1162807 1159548 1155036 1149032 1142723 1137143
52094 1137143 1132198 1127063 1121038 1114075 1106847 1100177 1094202 1088289 1081978 1075730 1070392 1066167 1062458 1058606
52080 1058606 1054418 1050023 1045590 1041219 1036831 1032103 1026659 1020464 1013952 1007766 1002408 997929 993715 988663
52066 988663 982072 974636 968198 964160 962306 961424 960755 960188 959311 957264 953804 949642 945321 940621 935674
52051 935674 931776 930053 929884 929840 929803 930912 933648 937359 941732 947310 954156 961285 967930 974249 980356
52036 980356 986030 992046 1000343 1011727 1024464 1036407 1047611 1059699 1073591 1089436 1107850 1129242
52024 1129242 1152026 1173451 1192614 1211168 1230622 1250443 1269535 1288254 1307716 1327721 1346628
52013 1346628 1363319 1378472 1393613 1409263 1424343 1437374 1447977 1456894 1464748 1471465 1477076 1482268
52001 1482268 1487417 1491594 1493446 1492836 1490828 1488341 1485667 1483099 1480945 1478760 1475572 1471153 1466260 1461379
51987 1461379 1456107 1450164 1444117 1438520 1433073 1427354 1421873 1417611 1414806 1412903 1411492 1410566 1409842 1408578
51973 1408578 1406441 1404175 1402971 1403179 1403934 1404170 1403802 1403695 1404588 1406407 1408635 1410889 1412914 1414422 1415380 1416156
51957 1416156 1416873 1416859 1415296 1412382 1409281 1406828 1404765 1402372 1399382 1395902 1391599 1385315 1375776 1362875
51943 1362875 1348126 1333387 1319041 1303912 1287047 1268760 1249450 1228526 1205648 1182310 1160551
51932 1160551 1140160 1118715 1094714 1069320 1044454 1020450 996470 972176 947915 923897 900239
51921 900239 877401 855623 834164 811950 788846 765616 742863 720719 699370 679041 659470
51910 659470 640248 621725 604788 589645 575653 562533 550713 539921 528401 514660 499628
51899 499628 486041 475743 468466 463112 458996 455326 450661 444207 437250 432060 429156 426577 422175 415802
51885 415802 408698 401490 393872 386090 379635 375868 374322 372886 369743 364930 359944 355980 352826 349510
51871 349510 345745 342305 340023 338792 337734 336069 333611 330568 327077 323004 318277 313443 309476 306626
51857 306626 303845 300147 296448 295027 296900 300608 303924 305737 305757 303680 299900 296294 294770 295313 296544
51842 296544 297824 299439 300952 300968 298895 295632 292099 288326 284504 281629 280236 279464 278306 277004 276225
51827 276225 275603 274261 272311 270628 269331 267765 266088 265626 267053 269112 269870 268786 266923 265534 265130
51812 265130 265759 267287 269117 270257 270185 269503 269393 270581 273025 276329 279952 283165 285395 286680 287334 287228
51796 287228 286040 284361 283827 285671 289615 294428 298893 301884 302478 301020 299427 299369 300405 300905 300464 300231
51780 300231 300973 302172 303286 304608 306325 307746 308192 307913 307533 307290 307444 308648 311067 313637 315080 315402
51764 315402 315673 316663 318421 320960 324354 328030 330825 332048 331985 331064 329124 325959 322258 319413 318385
51749 318385 319145 321176 324036 327218 329901 331461 332158 332776 333479 333530 332383 330645 329609 330277 333190 338570
51733 338570 345764 352792 357551 359807 361305 363584 366255 367880 367982 367604 368104 370116 373713 378939 385619
51718 385619 392856 399320 404459 409124 414581 421040 427722 434263 441219 448813 455997 461428 464841 466754
51704 466754 467241 465810 462307 457165 450907 444071 437452 431676 426542 421419 416211 411378 407287 404120
51690 404120 402100 400954 399567 397215 394879 394131 394745 394734 392969 390422 388487 387314 386446 385911 385821 385716
51674 385716 385049 383825 382235 380269 378117 376225 374522 372306 369351 366417 364176 362395 360581 358636
51660 358636 356380 353388 350000 347587 346986 347342 347261 346467 345612 345163 345275 346068 347202 347761 347315 346444 345548
51643 345548 344061 341807 340185 340607 342417 343723 343866 343744 344130 345263 347905 352986 359856 366306 370953
51628 370953 374516 378252 382221 385821 389185 392987 397151 400586 402366 402806 403157 404175 405106 404382 401254
51613 401254 396260 389944 381998 372378 362555 354491 348507 343126 337105 330784 325294 321103 317626 313859
51599 313859 309301 304498 300577 298020 296198 294436 292987 292355 292202 291840 291368 291353 291595 291243 290031 288434
51583 288434 286650 284510 282442 281484 282086 283709 285704 287694 289038 289058 288220 287993 288987 289968 289333 286891
51567 286891 283765 281120 279490 278821 278743 279187 280831 284311 288810 292280 293547 293498 293819 295273 297658 300579
51551 300579 303456 305499 306633 308121 311353 316208 321396 326259 331440 337668 344672 351666 358405 365205
51537 365205 372028 378141 383081 387715 393584 400848 407498 411226 411773 410692 409221 407497 405784 405042 405659
51522 405659 406627 406814 406375 406225 406715 407725 409573 412866 417488 422491 426976 430661 433771 436935 441051
51507 441051 446635 453205 459594 464843 468599 471042 472918 475320 478677 481910 483260 482243 480467 480231
51493 480231 482447 485954 488615 488992 487135 483969 480078 475239 469143 462250 455661 450189 445762 441689
51479 441689 437410 433037 429179 426235 423907 421638 419350 417363 415645 413771 411801 410558 410600 411348 411663
51464 411663 410950 409249 406748 403927 401969 402158 404596 407906 410374 411228 410937 410700 411586 413680 415852 416601
51448 416601 415255 412309 408767 405481 403018 401697 401534 402290 403658 405280 406659 407393 407510 407465 407850 409288
51432 409288 412312 416911 422134 426549 429257 430374 430736 431534 434120 439417 447092 455547 463134 469412 475226
51417 475226 481777 489544 497704 504555 508938 511490 514083 517850 522179 525849 528482 530377 531559 531907
51403 531907 531885 532102 532090 530495 526652 521122 514479 506712 498342 490959 485480 480573 474058 465509 456281
51388 456281 447274 438182 429098 421271 415550 411311 407808 405524 405001 405069 403777 400925 398482 398329 400603
51373 400603 404507 409628 415705 421688 425924 427396 426488 424472 422387 420445 418363 416035 413564 410662
51359 410662 406559 400763 393579 385544 376819 367694 359281 352740 347888 343426 338625 333979 329836 325314
51345 325314 319253 311812 304467 298600 294565 291946 290282 289404 289308 289703 289686 288109 284556 279884 275617 272733
51329 272733 271051 269641 267777 265630 264174 264322 266073 268463 270240 270521 269058 266290 263082 260008 256907
51314 256907 253464 250073 247584 246152 245075 244019 243647 244483 245767 246255 245809 245273 244886 243935 242399 241921
51298 241921 244072 248011 251032 251641 251187 251960 254515 257701 260682 263700 266884 269693 272058 274999 279314
51283 279314 284307 288611 291752 294122 295908 296950 297260 296732 294647 290473 285069 280123 276430 273623 271324
51268 271324 269369 266991 263131 257874 252362 247093 241661 236482 233057 231624 230118 226696 221977 217337
51254 217337 212396 206206 200019 196391 195645 195472 194475 193926 195068 196603 196476 194901 193861 194108 194406 193685
51238 193685 192498 191908 192106 192793 194106 196226 198444 199516 199099 198192 197900 198214 198346 197909 197275 196983 197330
51221 197330 198512 200517 202703 204078 204385 204456 205028 205631 205268 203931 202592 201668 200368 197971 195072 192816
51205 192816 191293 189509 186898 184022 181491 178979 176014 173305 172290 173229 174550 174529 173204 172169 172720
51190 172720 174536 175954 175335 172541 169393 168263 169698 171743 172123 170743 169509 170010 172161 174804 176711
51175 176711 177079 176053 174895 174861 175778 176597 177254 178744 181131 182915 183120 182784 183415 185000 186638 188235
51159 188235 190133 191698 191815 190671 189616 189179 188468 186860 185163 184613 185549 187453 189637 191523 192965
51144 192965 194674 197664 201877 206007 209125 211863 215311 219277 222396 223830 224157 224566 225728 227555 229542
51129 229542 231141 232075 232539 232870 232965 232252 230489 228363 226905 226327 225783 224500 222876 222160 223070 225020 226684
51112 226684 227061 225922 223553 220389 216943 213879 211906 211352 211840 212637 213462 214581 215962 216882 216986 217266
51096 217266 218980 221638 223138 222258 220074 218373 217510 216612 215208 213624 212075 210405 208728 207490 206698
51081 206698 205692 203835 201005 197319 192876 188032 183589 180550 179709 181281 184560 188064 190437 191305 190970
51066 190970 189587 187318 185176 184701 186229 188108 188390 187035 185675 185291 184978 183431 180915 178947 178248
51051 178248 178015 177448 177142 178283 180960 184117 186911 189301 191337 192818 193920 195390 197635 200170 202408
51036 202408 204544 207130 210076 212506 213531 213032 211916 211613 212867 214930 216527 217618 219484 222840 226730
51021 226730 229675 231111 231285 230735 230601 232277 235667 238702 239951 240909 244017 248811 252154 252539 252255 254252
51005 254252 258259 261369 261739 260338 259111 258604 257816 255799 252755 249653 247245 245715 244883 244256 243048
50990 243048 240894 238662 237719 238097 238249 237136 235597 234782 234208 232700 230569 229271 229032 228409 226484 224206
50974 224206 223086 223570 225136 227136 229114 230929 232874 235144 237218 238605 240110 243184 247860 252539
50960 252539 256190 259448 262906 265673 266754 266896 267867 270305 273345 276059 278420 280997 284397 288826 293781
50945 293781 298339 302048 305101 307404 308373 308319 309187 312878 319238 326603 333868 341016 348009 354498 360775
50930 360775 367879 376372 385794 395662 406238 417743 429433 440177 449903 459932 471700 485379
50918 485379 500016 515091 531612 551179 573965 598281 622432 646422 671423 698253 727302
50907 727302 759402 795546 835571 878107 922071 967511 1014772 1063854 1115057 1169313 1226966
50896 1226966 1286608 1345890 1403144 1457597 1508556 1555490 1598841 1639581 1677593 1711349 1739590
50885 1739590 1762591 1781299 1796072 1807007 1814866 1820509 1823753 1823890 1821409 1818207 1815772 1814033 1812329
50872 1812329 1810564 1808653 1805347 1798489 1786482 1769210 1747681 1723064 1695780 1665247 1630642 1591965
50860 1591965 1550112 1505939 1459912 1412721 1365347 1318119 1270598 1223010 1176957 1133906 1093683
50849 1093683 1055377 1019047 985441 954617 926080 900009 877144 857606 840905 826842 815219
50838 815219 805007 795266 786822 781417 779002 777556 776007 775731 778277 782965 787809 791718 794781 797233
50824 797233 799296 801492 804226 807469 811397 816711 823614 831194 838576 846042 854267 863184 872532 882910
50810 882910 895180 909153 923780 938457 953360 968851 985389 1003829 1024994 1049000 1075475
50799 1075475 1104181 1134891 1167215 1201277 1238256 1279617 1326266 1379027 1439096 1506830 1580569
50788 1580569 1658023 1738821 1824634 1916898 2015518 2119790 2229329 2343720 2462115 2583454
50778 2583454 2706405 2829008 2949210 3065734 3177447 3281787 3375072 3454913 3521506 3576154
50768 3576154 3619514 3651826 3673901 3687098 3692966 3693581 3691451 3688170 3683765 3678297 3673652 3672583 3676065
50755 3676065 3682468 3689116 3693542 3693155 3685076 3667239 3639216 3601393 3553790 3496138 3428628 3351943
50743 3351943 3266893 3174843 3078318 2980276 2882556 2785722 2690680 2599779 2515876 2440854 2375454
50732 2375454 2319824 2273402 2234814 2203109 2179204 2165118 2161551 2166993 2179561 2198826 2225213 2258290
50720 2258290 2296431 2337754 2380547 2422940 2463080 2499998 2533776 2564395 2590521 2609701 2619864
50709 2619864 2620618 2613055 2598510 2577825 2551789 2521488 2487532 2449269 2405611 2356646 2303767 2248275
50697 2248275 2190878 2132685 2075553 2020753 1968134 1917413 1869632 1826435 1788356 1754785 1725441
50686 1725441 1700953 1681923 1668120 1658880 1653902 1653563 1658630 1669688 1686700 1709234 1737088 1770346
50674 1770346 1808909 1852654 1902141 1958194 2020300 2086420 2155247 2227773 2305505 2387798 2472159
50663 2472159 2556610 2640093 2720683 2795291 2861962 2921280 2974708 3022253 3062379 3093542 3114983
50652 3114983 3126397 3127526 3118319 3099470 3073063 3042619 3011869 2983183 2957378 2934941 2916638 2902727
50640 2902727 2892323 2884213 2877930 2873646 2871386 2870668 2870366 2868266 2861227 2846851 2825279 2798773 2769214
50627 2769214 2736509 2699885 2660366 2621279 2586277 2557345 2534824 2518624 2508707 2504701 2505991 2512485
50615 2512485 2524886 2544171 2571303 2607504 2653973 2710866 2777116 2851685 2934604 3026312 3126414
50604 3126414 3233512 3345726 3460656 3575320 3686961 3793784 3894255 3986038 4066641 4135233
50594 4135233 4193039 4241744 4282017 4313662 4336506 4350730 4356713 4354915 4345866 4330239 4308957 4283065
50582 4283065 4253356 4220484 4185789 4151683 4120733 4094596 4074142 4060041 4052455 4050493 4052966 4059732
50570 4059732 4071476 4087957 4107050 4125773 4141921 4154744 4164485 4171242 4173989 4170891 4160992 4145235
50558 4145235 4125343 4102316 4077071 4052001 4030363 4013859 4002026 3994391 3992025 3996344 4007256 4023124
50546 4023124 4041727 4060487 4076595 4088074 4094573 4096330 4092352 4080117 4057034 4021815 3974708 3916960
50534 3916960 3850077 3775020 3691799 3599973 3499934 3393794 3284899 3176187 3069008 2963765
50524 2963765 2861606 2764779 2674954 2591761 2513783 2440682 2373556 2313354 2259849 2212408 2170970
50513 2170970 2135787 2106583 2082438 2062571 2047264 2038023 2036469 2042749 2055227 2071994 2092328 2116440
50501 2116440 2144597 2177192 2214845 2257206 2302124 2347448 2393615 2443079 2497144 2554850 2615440
50490 2615440 2680496 2752592 2832664 2919528 3011476 3107558 3207540 3311043 3416618 3521739 3624176
50479 3624176 3723248 3819084 3911019 3998026 4080907 4162519 4245064 4328157 4410343 4491499 4572759
50468 4572759 4654814 4737579 4821342 4907345 4997039 5091150 5189458 5291382 5396913 5506830 5621550
50457 5621550 5739986 5860223 5980962 6100937 6216964 6324224 6419099 6500230 6566050 6612908
50447 6612908 6637176 6638095 6617031 6574784 6511426 6428282 6328236 6214027 6087829 5952842 5813965
50436 5813965 5676212 5543376 5418691 5305943 5208968 5130064 5069281 5025320 4996986 4983655
50426 4983655 4984229 4995722 5013163 5030905 5043658 5046465 5034696 5004672 4953896 4880578 4783905 4665526
50414 4665526 4530076 4383222 4229190 4070350 3908443 3745408 3583345 3424396 3270442
50405 3270442 3122583 2981430 2848324 2725462 2614042 2512942 2420122 2334778 2257169 2187035
50395 2187035 2123453 2066108 2015522 1971968 1934982 1903863 1877808 1855759 1837055 1822204 1812102
50384 1812102 1806508 1804237 1804916 1809550 1819034 1832849 1849537 1867982 1888077 1910639 1936832 1967194
50372 1967194 2001087 2037304 2075162 2114749 2156485 2200903 2248492 2299104 2351778 2405739 2461277
50361 2461277 2518978 2578595 2639477 2701642 2765328 2829777 2893695 2956881 3020239 3084210 3148495
50350 3148495 3213563 3281125 3352423 3426894 3503030 3579677 3655938 3730672 3802896 3872377 3939244
50339 3939244 4003219 4063412 4118376 4166128 4204539 4232087 4248074 4252158 4244130 4224027 4191728 4146360
50327 4146360 4086840 4013179 3926644 3828781 3721471 3608202 3493919 3382615 3275769 3173917
50317 3173917 3078868 2993255 2918422 2854153 2800482 2758507 2728885 2710251 2699797 2695132 2694998 2698149
50305 2698149 2702052 2703175 2698650 2687272 2668581 2641380 2603937 2555806 2498823 2435959 2369514 2300744
50293 2300744 2230708 2160681 2091624 2023785 1957189 1892487 1831056 1774006 1721131 1671111 1623105
50282 1623105 1577989 1537660 1503074 1473358 1446858 1422705 1401086 1382317 1366017 1351194 1337044
50271 1337044 1323764 1312646 1305215 1302028 1302297 1304711 1308608 1314313 1322413 1332835 1344748 1357317 1370421
50258 1370421 1384630 1400722 1419346 1440705 1464024 1487567 1509967 1531739 1554829 1580381 1607550
50247 1607550 1634891 1662183 1690189 1719005 1747426 1773940 1797900 1819709 1840124 1859271 1876241
50236 1876241 1889730 1899019 1903989 1904452 1900456 1893265 1884780 1875434 1863876 1849473 1833870 1818732 1802958
50223 1802958 1783678 1759429 1730892 1699132 1664990 1630137 1596820 1566038 1537148 1509425 1482789
50212 1482789 1456928 1431248 1406033 1382304 1360045 1337953 1315481 1293671 1273139 1252671 1231085
50201 1231085 1209521 1190504 1175137 1162284 1150225 1138296 1127103 1117806 1111068 1106318 1102274 1098415
50189 1098415 1095385 1093604 1092294 1090566 1088943 1088930 1091303 1095372 1099707 1103060 1104896 1105713 1106697 1108593 1110928
50174 1110928 1112733 1113804 1114792 1116072 1117067 1116844 1115091 1112243 1108685 1104150 1098150 1090883 1083174 1075414 1067147
50159 1067147 1058100 1048976 1040579 1032703 1024786 1017205 1010853 1005731 1001126 997158 994865 994516 995005 995240 995178
50144 995178 995175 995318 995786 996994 998961 1001308 1004023 1007289 1010442 1012303 1012834 1013209 1013868 1013819 1012441 1010569 1009083
50127 1009083 1007826 1006768 1006651 1007259 1006424 1002395 996178 989975 984088 977049 968327 959219 951143 944407 938675
50112 938675 933458 928150 922465 916849 911808 907309 903527 901416 901375 901985 901549 900593 901404 905141 910716 916475
50096 916475 921602 925715 928457 929993 930975 931617 931622 931274 931773 934080 937973 942400 946279 948993 950799 952840
50080 952840 956194 960925 966477 972556 978894 984694 989503 994354 1000684 1008151 1015012 1020865 1027585 1036882
50066 1036882 1048223 1059872 1070868 1081054 1090164 1098187 1106143 1115297 1125615 1135792 1144894 1153410
50054 1153410 1162626 1173367 1185405 1197696 1209082 1219077 1228259 1237926 1249209 1262405 1277135 1293213
50042 1293213 1311153 1331441 1353470 1375900 1398324 1421927 1448081 1477092 1509014 1544914 1586084
50031 1586084 1632261 1681922 1734499 1791424 1854929 1926725 2008022 2099607 2201125 2310949 2427559
50020 2427559 2550998 2682359 2821541 2965375 3107994 3243368 3367898 3480582 3581081
50011 3581081 3668655 3743348 3807100 3862583 3911615 3955658 3996679 4035463 4069097 4091905 4099198
50000 4099198 4088882 4059554 4009276 3937248 3845364 3737104 3616005 3485980 3351856 3218211
49990 3218211 3088132 2963721 2846888 2738698 2638765 2546395 2461882 2385867 2318083 2257644
49980 2257644 2203932 2156086 2112191 2070339 2030459 1994072 1962216 1934434 1909670 1887172 1866317
49969 1866317 1846346 1826618 1806821 1786977 1767670 1750094 1735231 1722821 1711560 1700302 1688794
49958 1688794 1677500 1667163 1658433 1651420 1645644 1640721 1636783 1633851 1631314 1628884 1627766 1629795 1635282
49945 1635282 1642633 1650377 1658723 1668580 1679749 1691000 1701774 1713115 1726595 1742582 1759782 1776502
49933 1776502 1792214 1807871 1824865 1843967 1865176 1887987 1911429 1934326 1956323 1978718 2003829
49922 2003829 2033242 2066788 2103183 2141458 2181798 2225293 2272978 2325266 2382516 2446099 2518298
49911 2518298 2600729 2693293 2795254 2907038 3030345 3166780 3317128 3481733 3660342 3851046
49901 3851046 4049965 4252398 4453794 4649548 4834861 5005826 5160655 5299713 5424818
49892 5424818 5538686 5644111 5742643 5834095 5917523 5991699 6053550 6096918 6114719 6102781 6060576
49881 6060576 5988342 5885399 5752345 5593472 5415367 5223509 5021332 4811974 4599245 4386708
49871 4386708 4177053 3972635 3775596 3587058 3407090 3235871 3074165 2922362 2780080
49862 2780080 2647286 2524972 2413919 2313475 2222297 2139689 2065307 1997946 1935686 1877170
49852 1877170 1822122 1770786 1723455 1680223 1640415 1602509 1565488 1530035 1497441 1467440 1438235
49841 1438235 1408820 1380121 1353370 1328362 1304033 1280135 1257468 1236745 1217899 1200426 1183989
49830 1183989 1168657 1154828 1142878 1132744 1123922 1115939 1108719 1102551 1097907 1095253 1094654 1095475 1096800
49817 1096800 1098297 1100492 1104182 1109712 1116772 1124561 1132215 1139388 1146491 1154260 1163261 1173969 1186895
49804 1186895 1202148 1219206 1237636 1257761 1279953 1303695 1328228 1353926 1382069 1413394 1447978
49793 1447978 1486491 1530198 1579555 1634162 1694583 1762826 1840191 1925875 2018747 2119335 2228856
49782 2228856 2347207 2473365 2606927 2747235 2890881 3031719 3163992 3284531 3391728
49773 3391728 3483841 3559555 3619815 3668109 3708717 3744760 3777509 3806769 3831335 3849043 3856679
49762 3856679 3850165 3825102 3777550 3705153 3608284 3490090 3354993 3207317 3051768 2894465
49752 2894465 2741717 2597175 2461263 2333857 2216188 2109211 2011570 1920969 1837066 1761396
49742 1761396 1694592 1635281 1581852 1533845 1491156 1453027 1418476 1386882 1357654 1330089 1304176
49731 1304176 1280879 1260921 1243640 1227515 1211538 1195687 1180406 1166040 1152611 1139867 1127581
49720 1127581 1115796 1104541 1093417 1082043 1070897 1060967 1052162 1042838 1031643 1019545 1009308 1002981
49708 1002981 1000298 999423 998641 997259 995349 993062 990187 986338 981610 976979 973738 972414 972413 972852 973606 975245
49692 975245 977974 981041 983536 985624 988562 993383 999823 1006661 1012824 1017959 1022226 1025921 1029292 1032471
49678 1032471 1035521 1038539 1041520 1044123 1045932 1047212 1049015 1052081 1055888 1059283 1061874 1064244 1066820 1069268
49664 1069268 1071224 1072987 1075001 1076997 1078255 1078670 1079110 1080469 1082603 1084438 1085156 1085063 1085163 1085985 1087115 1087977
49648 1087977 1088769 1090300 1092866 1095616 1097210 1097134 1096243 1095975 1097125 1099489 1102546 1105975 1109252 1111302 1111287 1109733
49632 1109733 1108156 1107448 1107211 1106766 1106071 1105253 1104032 1102279 1100659 1099894 1099699 1099170 1098114 1097147 1096478 1095409
49616 1095409 1093344 1090809 1089035 1088731 1089427 1089906 1089231 1087536 1085871 1085187 1085459 1085854 1085619 1084639 1083360 1082402
49600 1082402 1082097 1082194 1082140 1081750 1081424 1081680 1082844 1085264 1089179 1093848 1097430 1098429 1097125 1095080 1093584 1093019
49584 1093019 1093204 1093510 1092979 1091280 1089535 1089383 1091221 1094030 1096804 1099274 1101283 1102504 1103179 1104299 1106595
49569 1106595 1109751 1112950 1115694 1117964 1120192 1123302 1128123 1134310 1140293 1144771 1148062 1151807 1157588 1165851
49555 1165851 1175722 1185713 1194960 1203954 1213847 1225089 1237119 1249221 1261182 1273283 1286266 1301109
49543 1301109 1317992 1335691 1352982 1370631 1390689 1413623 1437491 1460564 1483506 1508074 1534727
49532 1534727 1562545 1590602 1618335 1645297 1671804 1699431 1729652 1762283 1796233 1831357 1868329
49521 1868329 1906891 1945696 1984162 2023293 2064279 2107246 2151781 2197792 2245385 2294697 2346417
49510 2346417 2401736 2460976 2522741 2585164 2647721 2711176 2776100 2842404 2910355 2980977 3054657
49499 3054657 3129899 3204323 3276972 3348972 3421776 3495360 3568499 3640129 3709583 3775788 3837330
49488 3837330 3893698 3945766 3994648 4040508 4082761 4120767 4153700 4180192 4199042 4210400 4215859
49477 4215859 4217275 4215669 4211030 4202735 4190179 4173473 4153813 4133075 4112948 4094339 4077428 4062191
49465 4062191 4048951 4038297 4030325 4024202 4019064 4015357 4014611 4017737 4024208 4033196 4044745 4059338 4077040
49452 4077040 4097683 4121202 4146911 4173125 4198602 4224031 4250984 4279490 4307672 4333765 4357342
49441 4357342 4378324 4395843 4408601 4415703 4416682 4411230 4399176 4380219 4353512 4318245 4274932 4225391
49429 4225391 4170926 4111229 4045659 3975010 3901099 3824935 3746211 3664667 3581262 3497607 3414736
49418 3414736 3332752 3251554 3171486 3093195 3017118 2943486 2872795 2805884 2743237 2684446 2628671
49407 2628671 2575432 2524562 2475659 2428276 2382695 2339892 2300551 2264434 2230842 2199259 2169505
49396 2169505 2141743 2116503 2094200 2074475 2056442 2039744 2024835 2012086 2001137 1991282 1981951 1972685
49384 1972685 1963432 1955151 1949290 1946077 1944020 1941731 1939540 1938560 1938895 1939783 1941055 1943318 1946917 1951819 1958411
49369 1958411 1967282 1978070 1989536 2001085 2013348 2027034 2042065 2058224 2075788 2094970 2115513
49358 2115513 2137375 2161200 2187375 2215031 2242660 2269325 2294707 2318374 2339893 2359735 2379304
49347 2379304 2399816 2421366 2443278 2465130 2487401 2511130 2536941 2564410 2592603 2621123 2650226
49336 2650226 2679927 2709667 2739151 2768775 2798664 2827921 2855653 2882293 2908977 2935890 2962264
49325 2962264 2987836 3013153 3038212 3061981 3083908 3105029 3126836 3149617 3172650 3195489 3218265
49314 3218265 3240982 3263350 3285406 3307731 3330935 3355251 3380546 3406351 3432069 3457742 3484615
49303 3484615 3514266 3546854 3580636 3613687 3645985 3679479 3716162 3756359 3798980 3843128 3889086
49292 3889086 3937715 3989338 4043625 4100336 4159528 4220906 4283582 4347012 4411940 4479980 4552127
49281 4552127 4627793 4705189 4782729 4860447 4940281 5024476 5113412 5205387 5298939 5394766 5494680
49270 5494680 5599058 5706298 5814728 5923991 6034309 6145265 6256002 6366140 6475884
49261 6475884 6585270 6693630 6799659 6901882 6999135 7090827 7176721 7256575 7330063 7396786
49251 7396786 7456023 7506751 7548369 7581176 7605498 7620685 7625900 7621966 7611337 7595908 7575769 7550551
49239 7550551 7521033 7488770 7455014 7420803 7387226 7354538 7321641 7287755 7254335 7224158 7198565
49228 7198565 7176759 7157832 7142253 7130907 7123752 7120141 7119905 7123487 7131415 7144196 7162360 7186023
49216 7186023 7214291 7245323 7277059 7308098 7338181 7367708 7396467 7423023 7445823 7464631 7479998
49205 7479998 7491276 7496153 7492525 7479984 7458942 7429223 7390478 7343343 7289010 7227706 7158631 7081620
49193 7081620 6998079 6909965 6818447 6724020 6627496 6530178 6432998 6335833 6238018 6139513 6041433
49182 6041433 5945284 5851835 5761021 5672863 5587916 5506558 5428345 5352659 5279758 5210644 5145887
49171 5145887 5084961 5026790 4970534 4915890 4863051 4812487 4764490 4718939 4675874 4636194 4601173
49160 4601173 4570992 4544175 4518872 4494490 4471903 4452377 4436584 4424368 4415071 4408174 4403883 4402925
49148 4402925 4405502 4410539 4416285 4421584 4426443 4431642 4438195 4446983 4458269 4471396 4485274 4499253 4513410
49135 4513410 4528142 4543961 4561561 4581327 4602459 4623174 4642323 4660508 4679151 4698803 4718907
49124 4718907 4738995 4759272 4779759 4799473 4817023 4831908 4845014 4857932 4871858 4886943 4902390
49113 4902390 4917211 4931062 4944369 4957604 4970559 4982523 4993169 5003137 5013619 5025392 5038311
49102 5038311 5051742 5065345 5079347 5094164 5110032 5127041 5145256 5164633 5185050 5206607 5229745
49091 5229745 5254873 5282041 5311128 5341987 5374004 5405882 5436564 5466356 5496480 5527450 5558604
49080 5558604 5589414 5620406 5652182 5684066 5714455 5742260 5767385 5790058 5810390 5828664 5845578
49069 5845578 5862151 5879654 5899227 5920823 5942583 5962138 5978932 5994740 6011613 6029664 6047091
49058 6047091 6061784 6072579 6079513 6083629 6086389 6088755 6090807 6092502 6094545 6097906 6102565 6107397 6111514
49045 6111514 6115305 6119840 6125486 6131484 6136758 6140913 6144450 6148099 6152015 6155660 6158616 6161424 6165319 6171018
49031 6171018 6177955 6184875 6191016 6196521 6201890 6207339 6212672 6217602 6222162 6226858 6232292 6238503 6244811 6250467
49017 6250467 6255202 6258897 6261096 6261402 6260175 6258127 6255125 6250238 6243272 6235548 6228407 6221362 6212407 6200019
49003 6200019 6184342 6166653 6148265 6129800 6110880 6090485 6068125 6044620 6021170 5997820 5973648
48992 5973648 5948415 5923021 5897944 5872187 5844483 5814827 5784058 5752512 5720093 5687405 5655739
48981 5655739 5625756 5596930 5568618 5541061 5514922 5490208 5466196 5442457 5419685 5399241 5381800
48970 5381800 5366568 5352079 5337736 5324228 5312412 5302314 5293532 5286064 5280121 5275459 5271524 5268095
48958 5268095 5265104 5261964 5257948 5253460 5250271 5250098 5253287 5258942 5265720 5272201 5277198 5280633 5283978 5289217
48944 5289217 5297202 5307253 5318374 5330462 5344116 5359469 5375538 5390923 5405124 5419039 5433974
48933 5433974 5450218 5466739 5482342 5496942 5511607 5527439 5544510 5561801 5578079 5592760 5606085
48922 5606085 5618564 5630468 5641670 5651537 5658843 5662320 5661779 5658518 5654189 5649478 5644299 5638935 5634026
48909 5634026 5629354 5623618 5615905 5606709 5596945 5586621 5575416 5564124 5554304 5546260 5538411 5529263 5519345
48896 5519345 5510437 5503321 5497328 5492123 5488814 5488581 5490812 5493653 5496374 5500353 5507330 5517453 5529682 5543690
48882 5543690 5560457 5580849 5604274 5629267 5655161 5682837 5713693 5748077 5784936 5823042 5862322
$$ [...]
##END NTUPLES=NMR SPECTRUM
##END=
