##TITLE=coffee_type TOCA01-ROVE100D_70-30%
COFFEE_meoh_noesyp64 COFFEE_meoh {C:\Bruker\TOPSPIN} Administrator 7
##JCAMPDX= 6.0         $$ Bruker NMR JCAMP-DX V2.0
##DATA TYPE= NMR SPECTRUM
##DATA CLASS= NTUPLES
##ORIGIN= Bruker BioSpin GmbH
##OWNER= Administrator
$$ 1.72 TOPSPIN		Version 2.1
$$ 2012-05-18 15:47:18.229 -0700  Administrator@X
$$ Compression mode = diff/dup
##.OBSERVE FREQUENCY= 400.13188235
##.OBSERVE NUCLEUS= ^1H
##.ACQUISITION MODE= SIMULTANEOUS (DQD)
##.ACQUISITION SCHEME= undefined
##.AVERAGES= 64
##.DIGITISER RES= 22
##SPECTROMETER/DATA SYSTEM= spect
##.PULSE SEQUENCE= noesygpps1d.comp
##.SOLVENT NAME= COFFEE_meoh
##.SHIFT REFERENCE= INTERNAL, COFFEE_meoh, 1, 14.98061
##AUDIT TRAIL= $$ (NUMBER, WHEN, WHO, WHERE, PROCESS, VERSION, WHAT)
$$ ##TITLE= Audit trail, TOPSPIN		Version 2.1
$$ ##JCAMPDX= 5.01
$$ ##ORIGIN= Bruker BioSpin GmbH
$$ ##OWNER= Administrator
$$ $$ C:\Bruker\TOPSPIN/data/Administrator/nmr/12-COFFEE-2402/92/pdata/1/auditp.txt
$$ ##AUDIT TRAIL=  $$ (NUMBER, WHEN, WHO, WHERE, PROCESS, VERSION, WHAT)
(   1,<2012-02-24 21:26:29.687 -0500>,<Administrator>,<TOPSPIN>,<go>,<TOPSPIN 2.1>,
      <created by zg
	started at 2012-02-24 21:14:59.344 -0500,
	POWCHK enabled, PULCHK disabled,
       configuration hash MD5:
       B0 76 FB 9C 50 81 44 7D 18 B3 26 32 4E 60 AD 96
       data hash MD5: 64K
       D7 13 FB B2 86 60 6B C4 8C A3 F8 D3 7E C8 E7 B8>)
(   2,<2012-02-24 21:26:32.422 -0500>,<Administrator>,<TOPSPIN>,<proc1d>,<TOPSPIN 2.1>,
      <Start of raw data processing
       efp LB = 0.3 FT_mod = 6 PKNL = 1 PHC0 = 0 PHC1 = 0 SI = 128K 
       data hash MD5: 128K
       95 EE 93 1E 88 B2 4E 47 CC B4 7A D5 6F CF 6D 8B>)
(   3,<2012-02-24 21:26:33.719 -0500>,<Administrator>,<TOPSPIN>,<proc1d>,<TOPSPIN 2.1>,
      <pk PHC0 = 25.09277 PHC1 = 0 
       data hash MD5: 128K
       DE 44 8D 14 0B 56 01 B4 E4 3E B6 2F F2 3A 90 F3>)
(   4,<2012-02-24 21:26:33.953 -0500>,<Administrator>,<TOPSPIN>,<proc1d>,<TOPSPIN 2.1>,
      <abs ABSG = 1 
       data hash MD5: 128K
       E1 82 BF 8D A1 BB 4D 28 96 61 F9 1D C6 E4 41 6A>)
(   5,<2012-02-24 21:26:34.031 -0500>,<Administrator>,<TOPSPIN>,<proc1d>,<TOPSPIN 2.1>,
      <abs ABSG = 2 
       data hash MD5: 128K
       BB A6 64 CB 67 48 CA 6C BB 0F 2F A5 95 3A 2D 5E>)
(   6,<2012-02-24 21:26:34.109 -0500>,<Administrator>,<TOPSPIN>,<proc1d>,<TOPSPIN 2.1>,
      <abs ABSG = 3 
       data hash MD5: 128K
       A8 BA CF ED AE C3 1F 3B FD 72 43 89 B1 93 89 4C>)
(   7,<2012-02-24 21:26:34.344 -0500>,<Administrator>,<TOPSPIN>,<proc1d>,<TOPSPIN 2.1>,
      <abs ABSG = 4 
       data hash MD5: 128K
       A0 9C 72 F1 3D 52 8E A6 A7 2F A0 39 E8 2C 2F 24>)
(   8,<2012-02-24 21:26:34.391 -0500>,<Administrator>,<TOPSPIN>,<proc1d>,<TOPSPIN 2.1>,
      <abs ABSG = 5 
       data hash MD5: 128K
       C9 84 3F 30 10 2B 36 D2 CF 1C 57 BB EF F0 1F F2>)
(   9,<2012-02-24 21:26:34.516 -0500>,<Administrator>,<TOPSPIN>,<audit>,<TOPSPIN 2.1>,
      <user comment:
       ICON-NMR User ID: Administrator
$$ [...]
150 150 150 150 150 150 150 150
##$TP07= 0
##$TPNAME0= <>
##$TPNAME1= <>
##$TPNAME2= <>
##$TPNAME3= <>
##$TPNAME4= <>
##$TPNAME5= <>
##$TPNAME6= <>
##$TPNAME7= <>
##$TPOAL= (0..7)
0.5 0.5 0.5 0.5 0.5 0.5 0.5 0.5
##$TPOFFS= (0..7)
0 0 0 0 0 0 0 0
##$TUNHIN= 0
##$TUNHOUT= 0
##$TUNXOUT= 0
##$USERA1= <user>
##$USERA2= <user>
##$USERA3= <user>
##$USERA4= <user>
##$USERA5= <user>
##$V9= 5
##$VALIST= <valist>
##$VCLIST= <CCCCCCCCCCCCCCC>
##$VD= 0
##$VDLIST= <DDDDDDDDDDDDDDD>
##$VPLIST= <PPPPPPPPPPPPPPP>
##$VTLIST= <TTTTTTTTTTTTTTT>
##$WBST= 1024
##$WBSW= 4
##$XGAIN= (0..3)
0 0 0 0
##$XL= 0
##$YL= 0
##$YMAX_a= 14387971
##$YMIN_a= -6690557
##$ZGOPTNS= <>
##$ZL1= 120
##$ZL2= 120
##$ZL3= 120
##$ZL4= 120
##$ABSF1= 14.98061
##$ABSF2= -5.57192
##$ABSG= 5
##$ABSL= 3
##$ALPHA= 0
##$AQORDER= 0
##$ASSFAC= 0
##$ASSFACI= 0
##$ASSFACX= 0
##$ASSWID= 0
##$AUNMP= <proc_prof1d_extract>
##$AXLEFT= 0
##$AXNAME= <>
##$AXNUC= <1H>
##$AXRIGHT= 0
##$AXTYPE= 0
##$AXUNIT= <>
##$AZFE= 0.1
##$AZFW= 0.1
##$BCFW= 0
##$BC_mod= 0
##$BYTORDP= 0
##$COROFFS= 0
##$CY= 15
##$DATMOD= 1
##$DC= 0
##$DFILT= <>
##$DTYPP= 0
##$F1P= 0
##$F2P= 0
##$FCOR= 0.5
##$FTSIZE= 131072
##$FT_mod= 6
##$GAMMA= 0
##$GB= 0
##$INTBC= 1
##$INTSCL= 1
##$ISEN= 128
##$LB= 0.3
##$LEV0= 0
##$LPBIN= 0
##$MAXI= 10000
##$MC2= 0
##$MEAN= 0
##$ME_mod= 0
##$MI= 0
##$NCOEF= 0
##$NC_proc= -3
##$NLEV= 6
##$NOISF1= 0
##$NOISF2= 0
##$NSP= 0
##$NTH_PI= 0
##$NZP= 0
##$OFFSET= 14.98061
##$PC= 1
##$PHC0= 25.09277
##$PHC1= 0
##$PH_mod= 1
##$PKNL= yes
##$PPARMOD= 0
##$PPDIAG= 0
##$PPIPTYP= 0
##$PPMPNUM= 2147483647
##$PPRESOL= 1
##$PSCAL= 4
##$PSIGN= 0
##$PYNMP= <proc.py>
##$REVERSE= no
##$SF= 400.13
##$SI= 131072
##$SIGF1= 0
##$SIGF2= 0
##$SINO= 400
##$SIOLD= 131072
##$SPECTYP= <>
##$SREGLST= <1H.CDCl3>
##$SSB= 0
##$STSI= 131072
##$STSR= 0
##$SW_p= 8223.68421052632
##$SYMM= 0
##$S_DEV= 0
##$TDeff= 65536
##$TDoff= 0
##$TI= <>
##$TILT= no
##$TM1= 0
##$TM2= 0
##$TOPLEV= 0
##$USERP1= <user>
##$USERP2= <user>
##$USERP3= <user>
##$USERP4= <user>
##$USERP5= <user>
##$WDW= 1
##$XDIM= 131072
##$YMAX_p= 509429540
##$YMIN_p= -244414784
##$CURPLOT= <Network HP LaserJet P1505>
##$CURPRIN= <$Network HP LaserJet P1505>
##$DFORMAT= <normdp>
##$LAYOUT= <+/1D_H.xwp>
##$LFORMAT= <normlp>
##$PFORMAT= <normpl>
##$SURQMSG= 1
$$ End of Bruker specific parameters
$$ ---------------------------------
##NTUPLES= NMR SPECTRUM
##VAR_NAME=  FREQUENCY,     SPECTRUM/REAL,   SPECTRUM/IMAG
##SYMBOL=    X,             R,               I
##VAR_TYPE=  INDEPENDENT,   DEPENDENT,       DEPENDENT
##VAR_FORM=  AFFN,          ASDF,            ASDF
##VAR_DIM=   131072,        131072,          131072
##UNITS=     HZ,            ARBITRARY UNITS, ARBITRARY UNITS
##FACTOR=    0.0627417313425165, 1,          1
##FIRST=     8223.62146879498, 669,          -95875
##LAST=      0,             5837,            -96958
##MIN=       0,             -244414784,      0
##MAX=       8223.62146879498, 509429540,    0
$$ Real data points
##PAGE= N=1
##DATA TABLE= (X++(R..R)), XYDATA
$$ [...]
62932B495694K6080K7523K8329K8746K8263K6246K3600K2202K2262K1701J8749
62921B769395J3847Q214K072m554j0619j5414k0349k7497l6585m5170n1842n7499
62909B523999o3070o7639o9824o9829o9072o8436o7729o6276o3353n8669n3117
62898A806985m8481m5584m3347m0452l7182l4521l2167k9060k5512k3085k2175
62887A425419k1380j9709j7880j6796j6213j5859j6351j7748j8404j6950j4559
62876A233570j3538j4153j4615j4018j3370j3428j3326j2226j0976j0907j1810
62865A091203j2218j1384j0152r796j0564j1398j0987r059o591m717l726l438
62853I87173m002n501p057p382o387n287m984n214n484n755n733m656k567q71
$$ y = [2495694, 2521774, 2549297, 2577626, 2606372, 2634635, 2660881, 2684481, 2706683, 2728945, 2750646, 2769395, 2783242, 2791456, 2793528, 2788974, 2778355, 2762941, 2742592, 2715095, 2678510, 2633340, 2581498, 2523999, 2460929, 2393290, 2323466, 2253637, 2184565, 2116129, 2048400, 1982124, 1918771, 1860102, 1806985, 1758504, 1712920, 1669573, 1629121, 1591939, 1557418, 1525251, 1496191, 1470679, 1447594, 1425419, 1404039, 1384330, 1366450, 1349654, 1333441, 1317582, 1301231, 1283483, 1265079, 1248129, 1233570, 1220032, 1205879, 1191264, 1177246, 1163876, 1150448, 1137122, 1124896, 1113920, 1103013, 1091203, 1078985, 1067601, 1057449, 1047653, 1037089, 1025691, 1014704, 1005645, 999054, 994337, 990611, 987173, 983171, 977670, 970613, 963231, 956844, 951557, 946573, 941359, 935875, 930120, 924387, 919731, 917164, 916293]
62839I16293o31j056o93M36J059P70O08J367K392K556J692M70o40j679k562k785
62823I17597j958l41J391K752L571L741L364L046L463M434N028M871M586M492
62809I60037L852K232P98Q57J646J202q16k731l331l081k502j221N72J315j2k238
62793I56579l386k857j365L50J640J676K95j419k401k919l731m648n037n022n026
62778I22729m665l397j870j296j729k213k475l179m498n564n608m730l491k489
62764H75525k317l109m130m571m570m688m631l617j898p75r26j691k168k155j756
62749H32523r24K08J223K022L075M681O393P354P110O188N907P271R722J1548
62735I04301J1909J1814J2507J3803J4911J6054J7923K0131K1720K2989K5252
$$ y = [916293, 915662, 914606, 913913, 914349, 915408, 916178, 916786, 918153, 920545, 923101, 924793, 925263, 924623, 922944, 920382, 917597, 915639, 915298, 916689, 919441, 923012, 926753, 930117, 933163, 936626, 941060, 946088, 950959, 955545, 960037, 963889, 966121, 966919, 967776, 969422, 970624, 969808, 967077, 963746, 960665, 958163, 956942, 957514, 958829, 958817, 956579, 953193, 950336, 948971, 949321, 950961, 952637, 952932, 951513, 949112, 946193, 942462, 937814, 932777, 927755, 922729, 918064, 914667, 912797, 911501, 909772, 907559, 905084, 901905, 897407, 891843, 886235, 881505, 878014, 875525, 873208, 870099, 865969, 861398, 856828, 852140, 847509, 843892, 841994, 841219, 840293, 838602, 836434, 834279, 832523, 831599, 831807, 833030, 835052, 838127, 842808, 849201, 856555, 863665, 869853, 875760, 883031, 892753, 904301, 916210, 928024, 940531, 954334, 969245, 985299, 1003222, 1023353, 1045073, 1068062, 1093314]
62724A093314K8833L2626L5751L8317M0511M2359M4494M7845N2247N6619O0688
62713A573604O5171O9917P3497P5247P6336P7887P9161P8549P5445P0361O3872
62702B379047N6257M7600L7678K6212J3559N22j2621k6124l9564n1590o1190o8386
62690B301400p3540p7064p9893q2813q4992q4573q1329p7219p3684p0016o5452
62679A450825o1106n8278n6099n2591m7387m1901l7376l4024l1603k9548k6969
62668I73943k3614k0415j8098j5961j3141j0369r059r174r359q780p447n244k138
62655H21144P83K165K305K941M939P507R793J2009J4593J7382J9955K1961K2938
62642I60415K2835K2867K4792K8965L3912L8158M1620M4991M8649N2570N6567
$$ y = [1093314, 1122147, 1154773, 1190524, 1228841, 1269352, 1311711, 1356205, 1404050, 1456297, 1512916, 1573604, 1638775, 1708692, 1782189, 1857436, 1933772, 2011659, 2090820, 2169369, 2244814, 2315175, 2379047, 2435304, 2482904, 2520582, 2546794, 2560353, 2560875, 2548254, 2522130, 2482566, 2430976, 2369786, 2301400, 2227860, 2150796, 2070903, 1988090, 1903098, 1818525, 1737196, 1659977, 1586293, 1516277, 1450825, 1389719, 1331441, 1275342, 1222751, 1175364, 1133463, 1096087, 1062063, 1030460, 1000912, 973943, 950329, 929914, 911816, 895855, 882714, 872345, 863286, 854112, 844753, 835973, 828526, 823282, 821144, 821927, 824092, 826397, 829338, 834277, 841784, 851577, 863586, 878179, 895561, 915516, 937477, 960415, 983250, 1006117, 1030909, 1059874, 1093786, 1131944, 1173564, 1218555, 1267204, 1319774, 1376341]
62631A376341O0134O2609O3825O4246O4388O4573O4983O5096O3270N7951M9518
62620B056934L9905L0200J9672P631m984j6609k6875l6582m6233n5202o2149o6031
62608A839677o7176o7372o8269o9518o9371o7225o4449o2211n9757n5876n1017
62597A137436m6674m3247l9892l6132l2481k9383k6689k4287k2347k0812j9368
62586G96124j8138j7636j7793j7666j6458j4379j2195j0454r264q429p578o603
62574F39531o085o717q151r015q524p358o482n658m113k222j453k343l453k946
62560E65011p77J207J342m5r49K21K900M942N041M299M790O762Q263P822O530
62545F17359O615Q525J0540J1182J0991J1532J3392J5738J7566J8910K0742K3717
$$ y = [1376341, 1436475, 1499084, 1562909, 1627155, 1691543, 1756116, 1821099, 1886195, 1949465, 2007416, 2056934, 2096839, 2127039, 2146711, 2154342, 2149358, 2132749, 2105874, 2069292, 2023059, 1967857, 1905708, 1839677, 1772501, 1705129, 1636860, 1567342, 1497971, 1430746, 1366297, 1304086, 1244329, 1188453, 1137436, 1090762, 1047515, 1007623, 971491, 939010, 909627, 882938, 858651, 836304, 815492, 796124, 777986, 760350, 742557, 724891, 708433, 694054, 681859, 671405, 662141, 653712, 646134, 639531, 633446, 626729, 618578, 609563, 601039, 593681, 587199, 581541, 577428, 575206, 573753, 571410, 567957, 565011, 564234, 565441, 566783, 566738, 565789, 566010, 568910, 573852, 578893, 583192, 587982, 594744, 603007, 610829, 617359, 623974, 632499, 643039, 654221, 665212, 676744, 690136, 705874, 723440, 742350, 763092, 786809]
62533G86809K7143K9465L0049L0140L1544L4535L7731L9919M1082M1525M0985
62522A170927L9267L6981L4791L2285K8365K2651J5875Q916J998n027j2024j8423
62510A356582k3597k7344l0018l2118l3737l4669l4985l5086l5003l4217l2584
62499A003224l0915k9964k9212k7446k4449k1458j9732j9283j9192j8741j7875
62488G44957j6901j5998j5050j3760j2035j0227q842q035p516p009o507o078n628
62475F11371n083m589m251l673k024J055M644P020P289O325N779O205O772O870
62461F43710P211Q777J1195J2989J3486J3712J5071J7590K0052K1697K3120K5281
62449H33891K8084L0595L2399L3973L5581L6704L7018L7097L7293L6578L3787
$$ y = [786809, 813952, 843417, 873466, 903606, 935150, 969685, 1007416, 1047335, 1088417, 1129942, 1170927, 1210194, 1247175, 1281966, 1314251, 1342616, 1365267, 1381142, 1390058, 1392056, 1387029, 1375005, 1356582, 1332985, 1305641, 1275623, 1243505, 1209768, 1175099, 1140114, 1105028, 1070025, 1035808, 1003224, 972309, 942345, 913133, 885687, 861238, 839780, 820048, 800765, 781573, 762832, 744957, 728056, 712058, 697008, 683248, 671213, 660986, 652144, 644109, 636593, 629584, 623077, 616999, 611371, 606288, 601699, 597448, 593775, 591751, 592806, 597450, 604470, 611759, 618084, 623863, 630068, 636840, 643710, 650921, 659698, 670893, 683882, 697368, 711080, 726151, 743741, 763793, 785490, 808610, 833891, 861975, 892570, 924969, 958942, 994523, 1031227, 1068245, 1105342, 1142635, 1179213, 1213000]
62438A213000K9535K5491K1792J6861J0173L385k278p985j5090k2133k6287k7394
62426A219070k8354l1102l4117l4830l3077l0774k9029k7142k4408k1553j9773
62415I04911j9101j8463j7161j5602j4416j3378j1654q893n706l026j355n60j56
62402G75440L23R17J236J066Q61J280K404L827N324O776P680P573O971O932P579
62387H36189Q011P920Q052Q646Q587O995M575K418L74k197m876o730q026r999
62373H59939j2970j5828j7416j7622j7004j6106j5119j3760j1594q920o811n814
62361G00975n225m375l685l481k702l23K640M251M473N086O876Q798J0115J1520
62347G34943J3465J5027J5242J4428J3418J2615J2349J2953J3806J3507J1755
$$ y = [1213000, 1242535, 1268026, 1289818, 1306679, 1316852, 1320237, 1317959, 1309974, 1294884, 1272751, 1246464, 1219070, 1190716, 1159614, 1125497, 1090667, 1057590, 1026816, 997787, 970645, 946237, 924684, 904911, 885810, 867347, 850186, 834584, 820168, 806790, 795136, 786243, 780537, 777511, 776156, 775596, 775440, 775763, 776680, 777916, 778982, 779843, 781123, 783527, 787354, 792678, 799454, 807134, 814707, 821678, 828610, 836189, 844200, 852120, 860172, 868818, 877405, 884400, 888975, 891393, 891767, 889570, 884694, 877964, 869938, 859939, 846969, 831141, 813725, 796103, 779099, 762993, 747874, 734114, 722520, 713600, 706789, 700975, 695750, 691375, 687690, 684209, 681507, 681184, 683824, 688075, 692548, 697634, 704510, 713308, 723423, 734943, 748408, 763435, 778677, 793105, 806523, 819138, 831487, 844440, 858246, 871753, 883508]
62336H83508R933R063Q354O770M893L934L747L182J898O04j72m83l49K77J068
62321I36227J669K322L497N140P049R623J3378J7838K1805K4762K7257K9929L2849
62308A133345L5960L9485M3603M8142N2842N7747O3168O9303P5735Q1340Q4992
62297A785662Q6559Q6815Q6124Q3602P8051O9439N8873M7356L5148K2383R765
62286B449777j749j1903k1503l1538m1748n0481n6429o0226o3496o6526o8016
62275A976162o7287o5406o3502o1166n7526n2945m8423m4104l9764l6195l4496
62264A405348l4094l3055l0559k7656k5227k2629j9044j4990j1576r052p026n363
62252A165077l933k100L41K106J590q41k890l093k538l174n177o890p099o345
$$ y = [883508, 893441, 902504, 910858, 917628, 922521, 926455, 930202, 933384, 935282, 935886, 935714, 935231, 934882, 935159, 936227, 937896, 940218, 943715, 948855, 955904, 965527, 978905, 996743, 1018548, 1043310, 1070567, 1100496, 1133345, 1169305, 1208790, 1252393, 1300535, 1353377, 1411124, 1474292, 1543595, 1619330, 1700670, 1785662, 1872221, 1959036, 2045160, 2128762, 2206813, 2276252, 2335125, 2382481, 2417629, 2440012, 2449777, 2448028, 2436125, 2414622, 2383084, 2341336, 2290855, 2234426, 2174200, 2110704, 2044178, 1976162, 1908875, 1843469, 1779967, 1718801, 1661275, 1608330, 1559907, 1515803, 1476039, 1439844, 1405348, 1371254, 1338199, 1307640, 1279984, 1254757, 1232128, 1213084, 1198094, 1186518, 1177466, 1170440, 1165077, 1161144, 1159044, 1159385, 1161491, 1163081, 1162240, 1159350, 1156257, 1153719, 1150545, 1145368, 1138478, 1131379, 1125034]
62238A125034n949o434p263p596o966n561m135l391l149k540j215J03Q27J662
62224A073427L724O694Q917R472R243R585J0743J2124J3409J4682J5874J6911
62212A204805J8231K0516K3923K8008L2412L7041M1586M5351M7919M9839N2377
62201A602008N6381O1440O6311P0285P3828P7480Q0524Q1430P9601P5760P0335
62190B395383O2490N1489L8352K5123J2785Q48j1073k2320l2068m0432m8086n5129
62178B377362o0767o4071o4792o3473o1041n8273n5563n2813m9496m5116m0008
62167A761949l5406l2162k9453k5658k0601j6048j3409j1922r887p001m344k563
62155A553495j247L3J302K751M498N545M431J563l22R10M249P006Q242R392J1778
$$ y = [1125034, 1119085, 1112651, 1105388, 1097792, 1090826, 1085265, 1081130, 1077739, 1074590, 1072050, 1070835, 1070938, 1071765, 1073427, 1077151, 1083845, 1092762, 1102234, 1111477, 1121062, 1131805, 1143929, 1157338, 1172020, 1187894, 1204805, 1223036, 1243552, 1267475, 1295483, 1327895, 1364936, 1406522, 1451873, 1499792, 1549631, 1602008, 1658389, 1719829, 1786140, 1856425, 1930253, 2007733, 2088257, 2169687, 2249288, 2325048, 2395383, 2457873, 2509362, 2547714, 2572837, 2585622, 2586470, 2575397, 2553077, 2521009, 2480577, 2432491, 2377362, 2316595, 2252524, 2187732, 2124259, 2063218, 2004945, 1949382, 1896569, 1847073, 1801957, 1761949, 1726543, 1694381, 1664928, 1639270, 1618669, 1602621, 1589212, 1577290, 1567403, 1560402, 1556058, 1553495, 1552248, 1552281, 1553583, 1556334, 1560832, 1566377, 1570808, 1572371, 1572049, 1572959, 1577208, 1584214, 1592456, 1601848, 1613626]
62140A613626J4909J7644J9786K1836K3873K5604K7133K8915L0957L2758L4156
62129A891197L5725L8081M1079M3946M5865M6255M4774M1659L7969L4970L2895
62118B334415L0648K7100K2691J9228J8009J8524J9450K0653K3405K8414L4408
62107B596945L9390M2820M5573M7909M8770M7470M4905M2137L8660L3299K6359
62096C054237J9516J3620P944J932l652p960j1455j5045j8514k0818k1640k1601
62084B976564k0972j9202j6002j2153q719n875l060o4K598M565O372Q932J2339
62071B925323J5604J7739J8889K0143K2425K5711K9184L1894L3444L4349L5668
62060C210373L8017M0941M3453M5091M6291M7876N0298N3174N5411N6205N6173
$$ y = [1613626, 1628535, 1646179, 1665965, 1687801, 1711674, 1737278, 1764411, 1793326, 1824283, 1857041, 1891197, 1926922, 1965003, 2006082, 2050028, 2095893, 2142148, 2186922, 2228581, 2266550, 2301520, 2334415, 2365063, 2392163, 2414854, 2434082, 2452091, 2470615, 2490065, 2510718, 2534123, 2562537, 2596945, 2636335, 2679155, 2724728, 2772637, 2821407, 2868877, 2913782, 2955919, 2994579, 3027878, 3054237, 3073753, 3087373, 3095317, 3097249, 3093597, 3085637, 3074182, 3059137, 3040623, 3019805, 2998165, 2976564, 2955592, 2936390, 2920388, 2908235, 2899516, 2893641, 2890581, 2890517, 2893115, 2897680, 2904052, 2912984, 2925323, 2940927, 2958666, 2977555, 2997698, 3020123, 3045834, 3075018, 3106912, 3140356, 3174705, 3210373, 3248390, 3289331, 3332784, 3377875, 3424166, 3472042, 3522340, 3575514, 3630925, 3687130, 3743303]
62049C743303N6813N8414N9276N8004N5798N5100N6258N7281N7011N6771N8111
62038D372140O0541O2643O4269O6246O8641P0738P2504P4771P8025Q1945Q6199
62027E158662R0827R5751J00372J03769J05070J04043J01786J00358J00887J02408
62017F163933J03347J03639J04306J05086J04014R9824R3634Q7693Q3244Q0278
62007G128998P8466P7346P6063P3896P0991O7727O3536N7301M9077M0401L2401
61996G816203K4462J5608O472j316p436j3295j9997k7153l4108m1002m7653n2623
61984G618162n4790n5158n5617n6286n5696n3390n0671m8533m6449m3788m1007
61973G056777l8597l5970l2263k7568k2746j8676j6044j4961j4410j3184j1721
$$ y = [3743303, 3800116, 3858530, 3917806, 3975810, 4031608, 4086708, 4142966, 4200247, 4257258, 4314029, 4372140, 4432681, 4495324, 4559593, 4625839, 4694480, 4765218, 4837722, 4912493, 4990518, 5072463, 5158662, 5249489, 5345240, 5445612, 5549381, 5654451, 5758494, 5860280, 5960638, 6061525, 6163933, 6267280, 6370919, 6475225, 6580311, 6684325, 6784149, 6877783, 6965476, 7048720, 7128998, 7207464, 7284810, 7360873, 7434769, 7505760, 7573487, 7637023, 7694324, 7743401, 7783802, 7816203, 7840665, 7856273, 7862745, 7861429, 7853993, 7840698, 7820701, 7793548, 7759440, 7718438, 7670785, 7618162, 7563372, 7508214, 7452597, 7396311, 7340615, 7287225, 7236554, 7188021, 7141572, 7097784, 7056777, 7018180, 6982210, 6949947, 6922379, 6899633, 6880957, 6864913, 6849952, 6835542, 6822358, 6810637]
61962F810637j1651j2944j3178j0720p145m986m438m095l797m365n134m179j277
61949F722728J446K283J722Q89j06j412k353k291j843k300m229p401j1798j7930
61935F677405k6061l5417m4428n1972n8441o5143p2495p9390q4702q8613r1667
61924E979076r3257r2376q9426q5912q2514p8858p5165p2469p0694o8169o3941
61913E106295n9416n6559n5276n3803n1247m8561m6910m6078m4911m2871m0515
61902D560148l8380l5994l2576k8556k5436k3720k1999j8929j5377j3269j2759
61891D293153j2025r834o669l043J604P362J2635J5947J8229K1854K7489L3180
61879D399882L6787L8485M0250M3353M6983M9461N0399N1182N3306N6739O0245
$$ y = [6810637, 6798986, 6786042, 6772864, 6762144, 6754999, 6750013, 6745575, 6741480, 6737683, 6733318, 6728184, 6724005, 6722728, 6724174, 6726457, 6728179, 6729068, 6728962, 6727550, 6725197, 6722906, 6721063, 6718763, 6714534, 6707133, 6695335, 6677405, 6651344, 6615927, 6571499, 6519527, 6461086, 6395943, 6323448, 6244058, 6159356, 6070743, 5979076, 5885819, 5793443, 5704017, 5618105, 5535591, 5456733, 5381568, 5309099, 5238405, 5170236, 5106295, 5046879, 4990320, 4935044, 4881241, 4829994, 4781433, 4734523, 4688445, 4643534, 4600663, 4560148, 4521768, 4485774, 4453198, 4424642, 4399206, 4375486, 4353487, 4334558, 4319181, 4305912, 4293153, 4281128, 4271294, 4264625, 4261582, 4263186, 4270548, 4283183, 4299130, 4317359, 4339213, 4366702, 4399882, 4436669, 4475154, 4515404, 4558757, 4605740, 4655201, 4705600, 4756782, 4810088, 4866827, 4927072]
61868D927072O2890O4649O5995O7752P1148P7016Q4713R2685J00540J09836J22351
61857E846647J38237J56504J76780J99638K25292K52824K81266L10860L42567
61848G930615L76410M11182M46264M82926N22754N65169O07718O48866O88803
61839A2680707P26822P58986P79005P79836P53425O91053N87139M43284K67860
61830A8468117P2540j29139l21590m89862o24859p25183p93620q33299q47502
61821A3775603q40826q18508p84966p43550o96914o47030n95496n44201m95028
61812G609084m48861m05835l66513l31439k99650k69296k40134k13666j90311
61803D843379j68388j46735j26387j08486r2336p7028o3261n1753m1269l0204
$$ y = [4927072, 4989962, 5054611, 5120606, 5188358, 5259506, 5336522, 5421235, 5513920, 5614460, 5724296, 5846647, 5984884, 6141388, 6318168, 6517806, 6743098, 6995922, 7277188, 7588048, 7930615, 8307025, 8718207, 9164471, 9647397, 10170151, 10735320, 11343038, 11991904, 12680707, 13407529, 14166515, 14945520, 15725356, 16478781, 17169834, 17756973, 18200257, 18468117, 18540657, 18411518, 18089928, 17600066, 16975207, 16250024, 15456404, 14623105, 13775603, 12934777, 12116269, 11331303, 10587753, 9890839, 9243809, 8648313, 8104112, 7609084, 7160223, 6754388, 6387875, 6056436, 5756786, 5487490, 5247356, 5033690, 4843379, 4674991, 4528256, 4401869, 4293383, 4201047, 4124019, 4060758, 4009005, 3967736, 3937532]
61793C937532j9100r592j701N748J2602J7316J9175J8806J6671J2861Q287M094
61781D022699j22n695j2115j6648j7570j6246j5151j4831j3818j0726n591M00
61769C894586N815R779J2308J3740J3833J1916P863K427l581r840j6111k1694
61757C921041k5661k7490k7406k6189k4368k1408j6160q531j07P626J5267K4674
61745C791288L6340M8709O0262P1173Q2416R4092J05397J15950J26528J38450
61735D670605J52413J67820J83306J98117K12957K29280K47879K68513K90856
61726F621746L15261L42558L73398M08035M46488M88787N35032N85276O39422
61717A0756003O97476P59851Q27025Q98852R74642J054013J136826J221572J304005
$$ y = [3937532, 3918432, 3908840, 3907139, 3912887, 3925489, 3942805, 3961980, 3980786, 3997457, 4010318, 4018605, 4022699, 4022577, 4016882, 4004767, 3988119, 3970549, 3954303, 3939152, 3924321, 3910503, 3899777, 3894186, 3894586, 3900401, 3910180, 3922488, 3936228, 3950061, 3961977, 3969840, 3972267, 3968686, 3958846, 3942735, 3921041, 3895380, 3867890, 3840484, 3814295, 3789927, 3768519, 3752359, 3743828, 3743721, 3751347, 3766614, 3791288, 3827628, 3876337, 3936599, 4007772, 4090188, 4184280, 4289677, 4405627, 4532155, 4670605, 4823018, 4990838, 5174144, 5372261, 5585218, 5814498, 6062377, 6330890, 6621746, 6937007, 7279565, 7652963, 8060998, 8507486, 8996273, 9531305, 10116581, 10756003, 11453479, 12213330, 13040355, 13939207, 14913849, 15967862, 17104688, 18326260, 19630265]
61708A9630265J377555J434492J465873J460700J406054J289175J101153Q41445
61700C0006712N21306J63276k03805n51369q56092j102770j285591j407085j474719
61691B3809863j497563j484866j445339j385852j311167j225779j135269j044661
61683A3279367r56322q71032p90438p16597o49529n87431n29708m77908m32931
61674G267471l93213l56633l22951k93183k67488k44876k24394k05556j87989
61665D771188j71481j56280j42820j31397j22443j16526j13483j11847j09790
61656C595121j06546j02571r8474r4255q9596q4548p9649p5282p1109o6526o1742
61645B664823n7795n5126n2732m9449m5592m2448m0535l9355l8580l8257l7800
$$ y = [19630265, 21007820, 22442312, 23908185, 25368885, 26774939, 28064114, 29165267, 30006712, 30528018, 30691294, 30487489, 29936120, 29080028, 27977258, 26691667, 25284582, 23809863, 22312300, 20827434, 19382095, 17996243, 16685076, 15459297, 14324028, 13279367, 12323045, 11452013, 10661575, 9944978, 9295449, 8708018, 8178310, 7700402, 7267471, 6874258, 6517625, 6194674, 5901491, 5634003, 5389127, 5164733, 4959177, 4771188, 4599707, 4443427, 4300607, 4169210, 4046767, 3930241, 3816758, 3704911, 3595121, 3488575, 3386004, 3287530, 3193275, 3103679, 3019131, 2939482, 2864200, 2793091, 2726565, 2664823, 2607028, 2551902, 2499170, 2449721, 2404129, 2361681, 2321146, 2281791, 2243211, 2204954, 2167154]
61634B167154l6004l2474k8157k4349k1879k1225k2236k3611k3910k3341k3407
61623A886561k4501k5247k4729k3799k3399k2963k1789k0591k0198j9726j7703
61612A641916j4554j2263j1639j1495j0655r533r282j0220j1626j2496j2259j1069
61600A504825r559q160o798n421m331l567k528p45J299K821L752M549N467O695
61586A488299Q571J0666J1220Q931N106K616K660L844M616M947N108M468K868
61573A563920K013L828P596J0298J0057Q264P703R280J1262J1436R213N553J518
61560A661941k462o202r536j2539j5298j7217j7377j6137j5461j6703j8720j9373
61548A494916j8452j7623j7641j7263j5387j2790j0913j0027r475q815p858o314
$$ y = [2167154, 2131150, 2098676, 2070519, 2046170, 2024291, 2003066, 1980830, 1957219, 1933309, 1909968, 1886561, 1862060, 1836813, 1812084, 1788285, 1764886, 1741923, 1720134, 1699543, 1679345, 1659619, 1641916, 1627362, 1615099, 1603460, 1591965, 1581310, 1571777, 1562495, 1552275, 1540649, 1528153, 1515894, 1504825, 1495266, 1487106, 1480308, 1474887, 1470556, 1466989, 1464461, 1463716, 1465015, 1467836, 1471588, 1476137, 1481604, 1488299, 1496870, 1507536, 1518756, 1527687, 1532793, 1535409, 1538069, 1541913, 1546529, 1551476, 1556584, 1561052, 1563920, 1565933, 1569761, 1577357, 1587655, 1597712, 1605976, 1613679, 1622959, 1634221, 1645657, 1654870, 1660423, 1661941, 1659479, 1653277, 1643741, 1631202, 1615904, 1598687, 1581310, 1565173, 1549712, 1533009, 1514289, 1494916, 1476464, 1458841, 1441200, 1423937, 1408550, 1395760, 1384847, 1374820, 1365345, 1356530, 1348672, 1342358]
61536A342358m355k867k268j656pK372M487O194P967R742J1166J2667J4899J7348
61522A418047J8836J9355K0032K1265K2316K3124K4855K8046L1503L3964L5809
61511A697152L8251M1624M5290M8441N0202M9850M7835M5813M4689M3343M0369
61500B192859L6294L2808L0341K8004K5655K4386K4591K4991K4197K2340K0504
61489B486970J9226J8166J6747J4663J1974R057O347L946J571j167m469q076j1143
61476B563812j2786j3087j3085j3270j2713j0326o537k829N0K619N813J0281J6083
61463B514025K2239K7198L0892L5571M3212N2739O1531O9230P7770Q7832R7826
61452C120065J07046J17267J29962J43972J57571J71065J85727K01577K18052
$$ y = [1342358, 1338003, 1335136, 1332868, 1331212, 1331205, 1333577, 1338064, 1344258, 1352225, 1361967, 1373133, 1385800, 1400699, 1418047, 1436883, 1456238, 1476270, 1497535, 1519851, 1542975, 1567830, 1595876, 1627379, 1661343, 1697152, 1735403, 1777027, 1822317, 1870758, 1920960, 1970810, 2018645, 2064458, 2109147, 2152490, 2192859, 2229153, 2261961, 2292302, 2320306, 2345961, 2370347, 2394938, 2419929, 2444126, 2466466, 2486970, 2506196, 2524362, 2541109, 2555772, 2567746, 2576803, 2583150, 2587096, 2588667, 2587500, 2583031, 2574955, 2563812, 2551026, 2537939, 2524854, 2511584, 2498871, 2488545, 2482008, 2479179, 2479229, 2481848, 2487661, 2497942, 2514025, 2536264, 2563462, 2594354, 2629925, 2673137, 2725876, 2787407, 2856637, 2934407, 3022239, 3120065, 3227111, 3344378, 3474340, 3618312, 3775883, 3946948, 4132675, 4334252, 4552304]
61443D552304K35599K54472K72837K88148L00119L10299L18589L21731L15625
61434G169723K98016K68997K30205J83969J32603P8306K3821k7510p3286j13012
61424H171832j46716j73232j91104k00604k03415k00701j92982j81730j69232
61415F512116j56438j42385j26284j09037r2191p6443o1877m8641l6703k5609
61405E636508j5203o039J569Q427J5737K3705L1531L8656M5426N2231N8388O2452
61393E953388O3878O3949O4599O6454O8655P0448P2065P3899P5698P7096P7971
61382F728100P7789P5411P0254O3036N4863M6479L8845L3107K8987K4423J8125
61371G259419J1447O321K365k286q144j4115j9528k4515k8830l2203l5572m0090
$$ y = [4552304, 4787903, 5042375, 5315212, 5603360, 5903479, 6213778, 6532367, 6854098, 7169723, 7467739, 7736736, 7966941, 8150910, 8283513, 8361819, 8385640, 8358130, 8284844, 8171832, 8025116, 7851884, 7660780, 7460176, 7256761, 7056060, 6863078, 6681348, 6512116, 6355678, 6213293, 6087009, 5977972, 5885781, 5809338, 5747461, 5698820, 5662117, 5636508, 5621305, 5615266, 5616835, 5625262, 5640999, 5664704, 5696235, 5734891, 5780317, 5832548, 5890936, 5953388, 6017266, 6081215, 6145814, 6212268, 6280923, 6351371, 6423436, 6497335, 6573033, 6650129, 6728100, 6805889, 6881300, 6951554, 7014590, 7069453, 7115932, 7154777, 7187884, 7216871, 7241294, 7259419, 7270866, 7277187, 7279552, 7277266, 7269122, 7255007, 7235479, 7210964, 7182134, 7149931, 7114359, 7074269]
61359G074269m5035m8702n1059n3397n5388n4904n1268m6325m1588l6478l0400
61348F559725k4550k0341j7616j5694j4839j5433j6845j8169j9159j9604j8959
61337F358516j7291j5222j2192o278L145J4182K5202L7317N2516P0553Q9648J09340
61325F709436J30597J53428J76279J97921K18694K39718K61717K84379L05809
61316H677978L22800L32563L34191L27902L13241K88893K54031K09265J56654
61307A1217518R9463M1442j4605o7474j16591j61037k00018k33526k61729k84342
61297A0019101l01205l12734l19118l19934l15433l07249k96831k84151k69106
61288G293340k53139k37905k23185k07779j91955j77122j63479j49781j35350
$$ y = [7074269, 7029234, 6980532, 6929473, 6876076, 6820688, 6765784, 6714516, 6668191, 6626603, 6590125, 6559725, 6535175, 6514834, 6497218, 6481524, 6466685, 6451252, 6434407, 6416238, 6397079, 6377475, 6358516, 6341225, 6326003, 6313811, 6307533, 6310678, 6324860, 6350062, 6387379, 6439895, 6510448, 6600096, 6709436, 6840033, 6993461, 7169740, 7367661, 7586355, 7826073, 8087790, 8372169, 8677978, 9000778, 9333341, 9667532, 9995434, 10308675, 10597568, 10851599, 11060864, 11217518, 11316981, 11358423, 11343818, 11276344, 11159753, 10998716, 10798698, 10565172, 10303443, 10019101, 9717896, 9405162, 9086044, 8766110, 8450677, 8143428, 7846597, 7562446, 7293340, 7040201, 6802296, 6579111, 6371332, 6179377, 6002255, 5838776, 5688995, 5553645]
61279E553645j20525j05115q8364p0948n5157m2242l0891j9210o989M851J5946
61268E035001K6434L5843M3235M8363N1939N4690N6556N6862N5242N2296M9191
61257E565652M6422M3356L9385L5058L1330K8079K4432K0413J7080J4830J2723
61246E878760R941O787L500r45p764j6542k5486l3450m0788m8103n4794n9545
61234E611571o2108o3985o6778p0061p1670p0506o8170o6826o5973o2827n5968
61223D886699m7133l8858l1814k5567k0633j7900j6547j4481j1106q042o606o111
61211D641901n571n566o894q341p682m544n57L381Q133J4218K0467K5769L0662
61198D705376L5917M0781M4222M7196N2034N9934P0305Q2181R4811J07165J18319
$$ y = [5553645, 5433120, 5328005, 5239641, 5168693, 5113536, 5071294, 5040403, 5021193, 5014204, 5019055, 5035001, 5061435, 5097278, 5140513, 5188876, 5240815, 5295505, 5352061, 5408923, 5464165, 5516461, 5565652, 5612074, 5655430, 5694815, 5729873, 5761203, 5789282, 5813714, 5834127, 5851207, 5866037, 5878760, 5888701, 5895488, 5898988, 5898043, 5890279, 5873737, 5848251, 5814801, 5774013, 5725910, 5671116, 5611571, 5549463, 5485478, 5418700, 5348639, 5276969, 5206463, 5138293, 5071467, 5005494, 4942667, 4886699, 4839566, 4800708, 4768894, 4743327, 4722694, 4704794, 4688247, 4673766, 4662660, 4654618, 4648012, 4641901, 4636330, 4630764, 4623870, 4615529, 4607847, 4603303, 4602746, 4606127, 4614260, 4628478, 4648945, 4674714, 4705376, 4741293, 4782074, 4826296, 4873492, 4925526, 4985460, 5055765, 5137946, 5232757, 5339922, 5458241]
61187E458241J28285J37030J42850J43229J37308J25964J09432Q6759N7990K5013
61177F552101j0419m7617q5024j19118j46718j67195j81318j89231j90964j87800
61167E226697j81575j73327j63755j54147j45566j37890j30859j25154j20959
61158C893465j16369j09044r9142q9051q0379p2727o5319n8255n1899m6178m0834
61147C064268l5520k9635k2845j5777r434l993J137O347J1560J6609K1104K4304
61135C028125K5847K6170K5414K2631J7115R923K801l774j0199j6009k0292k3564
61123C084188k7466l2478l7354m0982m3438m5173m6588m8480n1388n4310n5615
61112B600916n5464n5682n6743n6797n4485n1184m9179m8833m8798m8073m6603
$$ y = [5458241, 5586526, 5723556, 5866406, 6009635, 6146943, 6272907, 6382339, 6469098, 6527088, 6552101, 6541682, 6494065, 6409041, 6289923, 6143205, 5976010, 5794692, 5605461, 5414497, 5226697, 5045122, 4871795, 4708040, 4553893, 4408327, 4270437, 4139578, 4014424, 3893465, 3777096, 3668052, 3568910, 3479859, 3399480, 3326753, 3261434, 3203179, 3151280, 3105102, 3064268, 3028748, 2999113, 2976268, 2960491, 2951057, 2947064, 2948201, 2954548, 2966108, 2982717, 3003821, 3028125, 3053972, 3080142, 3105556, 3128187, 3145302, 3155225, 3158026, 3154252, 3144053, 3128044, 3107752, 3084188, 3056722, 3024244, 2986890, 2945908, 2902470, 2857297, 2810709, 2762229, 2710841, 2656531, 2600916, 2545452, 2489770, 2433027, 2376230, 2321745, 2270561, 2221382, 2172549, 2123751, 2075678, 2029075]
61101B029075m4532m2144m0168l9038l8022l5880l2303k8134k4309k1168j8657
61090A664720j6663j5147j4201j3937j4254j5022j6448j8696k1021k1960k0877
61079A476494j8768j7016j5704j3806j0750p137l845r62K008N129P672R063R913
61066A422291J1509J4046J6085J6305J5323J4870J5368J5360J3609J0845Q816
61055A574427Q174Q086P683P089O834O833O530N799N134M842M720M598M473L568
61041A658790L17n539j1490j4529j4609j4332j5177j5995j5561j4570j4161j4335
61029A508809j5019j6831j9392k0647j9636j8316j8602j9251j8134j6192j6074
61018A310715j7584j7655j4958j1457r062p409n750m470l598k025N21K477K687
$$ y = [2029075, 1984543, 1942399, 1902231, 1863193, 1825171, 1789291, 1756988, 1728854, 1704545, 1683377, 1664720, 1648057, 1632910, 1618709, 1604772, 1590518, 1575496, 1559048, 1540352, 1519331, 1497371, 1476494, 1457726, 1440710, 1425006, 1411200, 1400450, 1393313, 1389468, 1388506, 1390514, 1395643, 1403315, 1412378, 1422291, 1433800, 1447846, 1463931, 1480236, 1495559, 1510429, 1525797, 1541157, 1554766, 1565611, 1574427, 1582601, 1590687, 1598370, 1605459, 1612293, 1619126, 1625656, 1631455, 1636589, 1641431, 1646151, 1650749, 1655222, 1658790, 1659107, 1653568, 1642078, 1627549, 1612940, 1598608, 1583431, 1567436, 1551875, 1537305, 1523144, 1508809, 1493790, 1476959, 1457567, 1436920, 1417284, 1398968, 1380366, 1361115, 1342981, 1326789, 1310715, 1293131, 1275476, 1260518, 1249061, 1239999, 1232590, 1226840, 1222370, 1218772, 1216747, 1217268, 1219745, 1222432]
61005A222432K155K403L403M262M787N355O195P566R612J1410J1456R911R011
60992A309958J0120J1754J1795J0616J0420J2032J3972J4632J4168J3953J4919
60981A448339J6734J8276J8802J8670J8801J9605K0774K2012K3454K5319K7683
60970A678469L0492L3318L5258L5762L5405L5346L6189L7815L9802M1378M1720
60959B080954M1162M1258M2627M3800M3684M3957M6983N2164N6901O0680O5516
60948B619686P2369P9874Q7116R5040J04349J14336J24738J36512J49748J62921
60938C746689J75402J88816K04655K22078K39224K55399K71115K87319L05294
60929E895991L26071L49620L75958M06743M43661M85517N29659N76470O29609
$$ y = [1222432, 1224587, 1226990, 1230393, 1234655, 1239442, 1244797, 1250992, 1258558, 1268170, 1279580, 1291036, 1300947, 1309958, 1320078, 1331832, 1343627, 1354243, 1364663, 1376695, 1390667, 1405299, 1419467, 1433420, 1448339, 1465073, 1483349, 1502151, 1520821, 1539622, 1559227, 1580001, 1602013, 1625467, 1650786, 1678469, 1708961, 1742279, 1777537, 1813299, 1848704, 1884050, 1920239, 1958054, 1997856, 2039234, 2080954, 2122116, 2163374, 2206001, 2249801, 2293485, 2337442, 2384425, 2436589, 2493490, 2554170, 2619686, 2692055, 2771929, 2859045, 2954085, 3058434, 3172770, 3297508, 3434020, 3583768, 3746689, 3922091, 4110907, 4315562, 4537640, 4776864, 5032263, 5303378, 5590697, 5895991, 6222062, 6571682, 6947640, 7354383, 7798044, 8283561, 8813220, 9389690, 10019299]
60920A0019299O91676P62860Q44011R37097J042188J158542J289525J441608J617936
60911A9804742J819684K055243K339002K677085L063579L491499L939151M314106
60903D3504091M424717M069140L207693K051326R51354J82453j77279j92192L4442
60894E8055745L70736O04116M74097j69077j225973k389289l339371l914340m128640
60885D4338004m081928l875660l587868l275250k971161k685379k415140k156987
60877A9288631j909475j672647j450384j250454j079038r36708q20454p26475
60869I442996o49837n84847n28077m78861m35868l96009l57992l23896k95300
60860E392309k70479k47279k26394k09630j96811j86473j77869j70383j62452
$$ y = [10019299, 10710975, 11473835, 12317846, 13254943, 14297131, 15455673, 16745198, 18186806, 19804742, 21624426, 23679669, 26018671, 28695756, 31759335, 35250834, 39189985, 43504091, 47928808, 51997948, 55205641, 57256967, 58208321, 58390774, 58213495, 58021303, 58055745, 58426481, 59030597, 59504694, 59335617, 58109644, 55720355, 52380984, 48466644, 44338004, 40256076, 36380416, 32792548, 29517298, 26546137, 23860758, 21445618, 19288631, 17379156, 15706509, 14256125, 13005671, 11926633, 10989925, 10169471, 9442996, 8793159, 8208312, 7680235, 7201374, 6765506, 6369497, 6011505, 5687609, 5392309, 5121830, 4874551, 4648157, 4438527, 4241716, 4055243, 3877374, 3706991, 3544539]
60851C544539j52981j42833j33392j24719j16339j08494j01194r3359q4467p6012
60841B410749o9869o6042o3133o0171n6860n2931m8455m4091m0181l6404l2940
60830A839672l0805l0188k9697k8205k6402k5502k5457k5476k5366k5422k5779
60819A541373k6672k8416l0479l1608l1496l1116l0823k9630k7197k4953k4021
60808A224962k3440k1749j9081j6402j3856j1241r014p430n761l626j915j038
60796A090409M29L633P231R211R988J1522J4075J6061J6838J7475J8673J9883
60784A235428K0751K1647K2354K1868K0117J8554J8238J8352J7334J4829J1857
60773A441329R461P748O043L803J321n10j240j361j718k774m588o831q767r989
$$ y = [3544539, 3391558, 3248725, 3115333, 2990614, 2874275, 2765781, 2664587, 2571228, 2486761, 2410749, 2340880, 2274838, 2211705, 2151534, 2094674, 2041743, 1993288, 1949197, 1909016, 1872612, 1839672, 1808867, 1778679, 1748982, 1720777, 1694375, 1668873, 1643416, 1617940, 1592574, 1567152, 1541373, 1514701, 1486285, 1455806, 1424198, 1392702, 1361586, 1330763, 1301133, 1273936, 1248983, 1224962, 1201522, 1179773, 1160692, 1144290, 1130434, 1119193, 1110179, 1102749, 1096988, 1093362, 1091447, 1090409, 1090838, 1094471, 1101702, 1110913, 1120901, 1132423, 1146498, 1162559, 1179397, 1196872, 1215545, 1235428, 1256179, 1277826, 1300180, 1322048, 1342165, 1360719, 1378957, 1397309, 1414643, 1429472, 1441329, 1450790, 1458538, 1464581, 1468384, 1469705, 1469195, 1467955, 1466594, 1464876, 1462102, 1457514, 1450683, 1441916, 1431927]
60759A431927j1383j4284j8204k0708k0360j8446j6791j5355j3503j2225j2803
60748A257865j4054j3367j0400p524o368o005n102l776k324m2L316O123O664N675
60734A210681N709P999J1096J2778J2462J1415J1023J1365J1498J0925J0324J0611
60722A337886J1522J1706J0272P797N644M536M128L841L745M418O004P834R193
60709A428526J0115J0991J1674J1678J1116J0583J0153R356Q245P366O499M723
60697A541025K183M37J98J66q40k008k212k214l291m641m378k636j420j535j863
60682A516971j967l062n682q267r188q681p817o893n870n270n502o167o897p936
60668A427772r157r575q891q454r543j1501j2786j2980j2454j0987q410o044n588
$$ y = [1431927, 1420544, 1406260, 1388056, 1367348, 1346988, 1328542, 1311751, 1296396, 1282893, 1270668, 1257865, 1243811, 1230444, 1220044, 1212520, 1206152, 1200147, 1195045, 1191269, 1188945, 1188903, 1192219, 1198342, 1205006, 1210681, 1216390, 1224389, 1235485, 1248263, 1260725, 1272140, 1283163, 1294528, 1306026, 1316951, 1327275, 1337886, 1349408, 1361114, 1371386, 1379183, 1384827, 1389363, 1393491, 1397332, 1401077, 1405495, 1411499, 1419333, 1428526, 1438641, 1449632, 1461306, 1472984, 1484100, 1494683, 1504836, 1514192, 1522437, 1529803, 1536302, 1541025, 1543208, 1543645, 1543843, 1544009, 1543169, 1541161, 1538949, 1536735, 1533444, 1528803, 1524425, 1521789, 1520369, 1518834, 1516971, 1515004, 1511942, 1506260, 1497993, 1488805, 1480124, 1472307, 1465414, 1459544, 1454274, 1448772, 1442605, 1435708, 1427772, 1418615, 1409040, 1400149, 1391695, 1382152, 1370651, 1357865, 1344885, 1332431, 1321444, 1313034, 1306990, 1301402]
60655A301402o639p072n997m599l794k926j495n07q50j629j423l85K19j39j134
60640A263032k699m804o514o728o012o275q448j1610j4601j7041j8379j7483j4413
60627A128025j1434j0871j2350j3482j2917j1547j0747j0652j0571j0186r746
60616A003522r440q938p538m946j986j41J02J6J161L502N751P243Q477J0001J1770
60601A018556J3602J5256J5977J5146J3539J2736J2861J2261J0134Q213Q574J0726
60589A167581J2296J2252J1997J3120J5280J6913J7253J6919J6682J6450J5769
60578A332512J4936J4875J5808J6736J6775J6314J6086J5685J4199J1966J0230
60567A496122R005O901L511L35j529l072n588q476j0346j1369j2810j4753j5973
$$ y = [1301402, 1294763, 1287691, 1281694, 1277095, 1273301, 1270375, 1268880, 1268373, 1267523, 1265894, 1264471, 1264086, 1264305, 1264166, 1263032, 1260333, 1255529, 1249015, 1242287, 1236275, 1230000, 1221552, 1209942, 1195341, 1178300, 1159921, 1142438, 1128025, 1116591, 1105720, 1093370, 1079888, 1066971, 1055424, 1044677, 1034025, 1023454, 1013268, 1003522, 994082, 985144, 977606, 972660, 970674, 970533, 970635, 970651, 971812, 975314, 981065, 988308, 996785, 1006786, 1018556, 1032158, 1047414, 1063391, 1078537, 1092076, 1104812, 1117673, 1129934, 1140068, 1148281, 1156855, 1167581, 1179877, 1192129, 1204126, 1217246, 1232526, 1249439, 1266692, 1283611, 1300293, 1316743, 1332512, 1347448, 1362323, 1378131, 1394867, 1411642, 1427956, 1444042, 1459727, 1473926, 1485892, 1496122, 1505127, 1512028, 1515539, 1515874, 1514345, 1511273, 1505685, 1497209, 1486863, 1475494, 1462684, 1447931, 1431958]
60554A431958j5895j5258j4772j4343j3721j2757j0947p999m883l069k279m61
60542A315574L373P409R223Q874Q593R687J1002J0609Q098M683J745q4o61J3J661
60527A399799L704N634P200Q124Q258Q243R273J1326J2395J0582O694L379J775
60514A496386N12j758m474o593q254r884j0892j0632r741r192q804q074p686q555
60500A392359r820r589p589n369l828k275l07J114J362J740M136Q595J3088J5649
60486A399266J6343J7171K0081K4921K9652L2865L5536L9496M4826N0061N4805
60475A765023O0525O8246P6743Q3911Q8941R2144R3034Q9777Q0854O6784M9917
60464B615899L2548J5584o82j4902k4806k9372k9829k7785k3313j6037p192J055
$$ y = [1431958, 1416063, 1400805, 1386033, 1371690, 1357969, 1345212, 1334265, 1326266, 1321383, 1318314, 1316035, 1315574, 1318947, 1326356, 1335579, 1344453, 1353046, 1362733, 1373735, 1384344, 1392442, 1397125, 1398870, 1398786, 1398125, 1398138, 1399799, 1403503, 1409137, 1416337, 1424461, 1432719, 1440962, 1450235, 1461561, 1473956, 1484538, 1491232, 1494611, 1496386, 1496898, 1495140, 1490666, 1484073, 1475819, 1465935, 1455043, 1444411, 1434670, 1425478, 1416674, 1408600, 1400914, 1392359, 1382539, 1372950, 1365361, 1359992, 1356164, 1353889, 1353582, 1354696, 1356058, 1357798, 1361934, 1370529, 1383617, 1399266, 1415609, 1432780, 1452861, 1477782, 1507434, 1540299, 1575835, 1615331, 1660157, 1710218, 1765023, 1825548, 1893794, 1970537, 2054448, 2143389, 2235533, 2328567, 2418344, 2499198, 2565982, 2615899, 2648447, 2664031, 2663349, 2648447, 2623641, 2594269, 2564440, 2536655, 2513342, 2497305, 2490113, 2491168]
60452B491168P975J4277J9945K3855K5784K7015K8386K9448L0221L2107L5897
60441B766078M0343M4074M8026N4505O4508P7068R0938J05818J22169J40554J60897
60430C714978J81940K01889K20083K37389K54576K71348K87619L04759L24625
60421E999206L48306L76809M11698M53179M97669N38277N67020N75437N54558
60412A0322159M97516M03425K77827J29496l1483j92694l39580m59542n46313
60403A0060811o00318o25818o28391o13741n87012n52481n13758m73634m33407
60394E032251l93076l52938l14558k79647k48605k20817j95965j74081j54686
60385B697878j36881j20476j06280r4891q5661p7207o8870o1277n5377n1097m7386
$$ y = [2491168, 2499143, 2513420, 2533365, 2557220, 2583004, 2610019, 2638405, 2667853, 2698074, 2730181, 2766078, 2806421, 2850495, 2898521, 2953026, 3017534, 3094602, 3185540, 3291358, 3413527, 3554081, 3714978, 3896918, 4098807, 4318890, 4556279, 4810855, 5082203, 5369822, 5674581, 5999206, 6347512, 6724321, 7136019, 7589198, 8086867, 8625144, 9192164, 9767601, 10322159, 10819675, 11223100, 11500927, 11630423, 11598940, 11406246, 11066666, 10607124, 10060811, 9460493, 8834675, 8206284, 7592543, 7005531, 6453050, 5939292, 5465658, 5032251, 4639175, 4286237, 3971679, 3692032, 3443427, 3222610, 3026645, 2852564, 2697878, 2560997, 2440521, 2334241, 2239350, 2153689, 2076482, 2007612, 1946335, 1890958, 1839861, 1792475]
60374A792475m3687m0781l9509l9005l7317l3947l0578k8669k7401k5074k1843
60363A424664j9665j9632k0514k0270j8159j4985j1947r656p980o516n151m080
60351A266109l157j713M34K325K929K606K600L233L694L660L934N082O519P457
60337A305712P909Q140Q035P783Q253R760J1021J0462Q262O167N454N827O213
60324A408998N831M504K606P97n94j823l119m172m636m751m918n051m981n014
60310A383677n371n486m654l118j760r36m19J5N91J696L000L024P77k518m620
60295A363898m959m729m645m214l297k606k217j229N78K114K698L041L855M663
60281A352951M876M957N647O866Q027Q689Q492P367O080N489N141L993K680L138
$$ y = [1792475, 1748788, 1708007, 1668498, 1629493, 1592176, 1558229, 1527651, 1498982, 1471581, 1446507, 1424664, 1404999, 1385367, 1364853, 1344583, 1326424, 1311439, 1299492, 1289836, 1281856, 1275340, 1270189, 1266109, 1262952, 1261239, 1261673, 1263998, 1266927, 1269533, 1272133, 1275366, 1279060, 1282720, 1286654, 1291736, 1298255, 1305712, 1313621, 1321761, 1329796, 1337579, 1345832, 1355592, 1366613, 1377075, 1385337, 1391504, 1396958, 1402785, 1408998, 1414829, 1419333, 1421939, 1422736, 1422142, 1420319, 1417200, 1413028, 1408392, 1403641, 1398723, 1393672, 1388691, 1383677, 1378306, 1372820, 1368166, 1365048, 1363288, 1362352, 1361933, 1361948, 1362539, 1364235, 1367235, 1370259, 1371036, 1368518, 1363898, 1358939, 1354210, 1349565, 1345351, 1342054, 1339448, 1337231, 1336002, 1336580, 1338694, 1341392, 1344433, 1348288, 1352951, 1357827, 1362784, 1368431, 1375297, 1383324, 1392013, 1400505, 1407872, 1413952, 1419441, 1424582, 1428575, 1431255, 1434393]
60267A434393N474P321P368P235Q369R220P721M801K919K227Q46j871m755p122
60253A484146r298j1048j1715j1884j2772j3959j3749j1806r419p063l958m33
60241A367042J571J213P1j72L81J066K107L703N043N412N164M744L882K733K604
60226A406564M425P371J0004J1828J2850J2670J1324J0179J0621J2350J4096J5487
60214A539769J6907J7970J7784J6686J6253J7123J8055J7974J7897J9658K3074
60203A739150K5789K6338K6271K8243L2553L7002M0110M2970M7152N2232N6805
60192B154615O0861O5462P0554P5119P9419Q5157R2865J00833J07519J13587J20625
60181C126616J28972J37837J46576J54712J61440J66203J69306J71135J71232
$$ y = [1434393, 1439867, 1447188, 1454556, 1461791, 1470160, 1479380, 1487101, 1491902, 1494821, 1497048, 1497894, 1496023, 1491268, 1484146, 1474848, 1463800, 1452085, 1440201, 1427429, 1413470, 1399721, 1387915, 1378496, 1371433, 1367475, 1367042, 1368613, 1369826, 1369897, 1369725, 1370106, 1371172, 1373279, 1376982, 1382025, 1387437, 1392601, 1397345, 1401227, 1403960, 1406564, 1410989, 1418360, 1428364, 1440192, 1453042, 1465712, 1477036, 1487215, 1497836, 1510186, 1524282, 1539769, 1556676, 1574646, 1592430, 1609116, 1625369, 1642492, 1660547, 1678521, 1696418, 1716076, 1739150, 1764939, 1791277, 1817548, 1845791, 1878344, 1915346, 1955456, 1998426, 2045578, 2097810, 2154615, 2215476, 2280938, 2351492, 2426611, 2506030, 2591187, 2684052, 2784885, 2892404, 3005991, 3126616, 3255588, 3393425, 3540001, 3694713, 3856153, 4022356, 4191662, 4362797, 4534029]
60172D534029J68862J63957J56717J46935J34653J20958J06944R2213P5611N7317
60162E758196L9128K2531P738n117j5015k1223k4656k6854k7827k6073k0872j3390
60150E646566m794N670J9325L5269N0612O3879P6573R0564J05306J18946J30971
60139F338887J42039J51831J58924J62570J62906J59404J50968J37936J22285
60130G687750J05207Q5932O3727L9706J5756p199k8944m8973o6826q2621r6223
60119G667292j06336j11410j11094j06232r7848q6725p3462n8348m1524k3636
60109F850677n656J2280L0976N0427O8769Q3887R5356J03881J09251J10074J05442
60098G615364R5970Q3175O8404N2433L5660J8557K057j2632k4698l3897l9899
$$ y = [4534029, 4702891, 4866848, 5023565, 5170500, 5305153, 5426111, 5533055, 5625268, 5700879, 5758196, 5797324, 5819855, 5827593, 5822476, 5807461, 5786238, 5761582, 5734728, 5706901, 5680828, 5659956, 5646566, 5641772, 5647442, 5666767, 5702036, 5752648, 5816527, 5893100, 5983664, 6088970, 6207916, 6338887, 6480926, 6632757, 6791681, 6954251, 7117157, 7276561, 7427529, 7565465, 7687750, 7792957, 7878889, 7942616, 7982322, 7998078, 7990879, 7961935, 7912962, 7846136, 7763515, 7667292, 7560956, 7449546, 7338452, 7232220, 7134372, 7047647, 6974185, 6915837, 6874313, 6850677, 6845021, 6857301, 6888277, 6938704, 7007473, 7091360, 7186716, 7290597, 7399848, 7509922, 7615364, 7711334, 7794509, 7862913, 7915346, 7951006, 7969563, 7971620, 7958988, 7934290, 7900393, 7860494]
60087G860494m1938l9371l2281k1345p385Q913K7348M8243P1662R6684J22258
60076H093282J48671J77150K07962K39950K72139L04556L37129L69039L99744
60067A0549622M29356M57262M81464N00105N12587N18376N15964N04087M83104
60058A4951927M54051M17180L72487L20936K63986K02456J36779O7855l117p4938
60048A7109602j45852k13343k75232l30030l75796m10072m31973m42914m44029
60039A4040361m34522m14084l85347l51735l14071k71811k26505j81240j37024
60030A1324022r2589m7968n639L2320O5738R4151J15414J27603J30802J25951
60020A1869805J13351R3261O6917L6256L536k8654n8467q6241j13334j39156j61112
$$ y = [7860494, 7818556, 7779185, 7746904, 7725559, 7718174, 7727087, 7754435, 7802678, 7874340, 7971024, 8093282, 8241953, 8419103, 8627065, 8867015, 9139154, 9443710, 9780839, 10149878, 10549622, 10978978, 11436240, 11917704, 12417809, 12930396, 13448772, 13964736, 14468823, 14951927, 15405978, 15823158, 16195645, 16516581, 16780567, 16983023, 17119802, 17187657, 17184540, 17109602, 16963750, 16750407, 16475175, 16145145, 15769349, 15359277, 14927304, 14484390, 14040361, 13605839, 13191755, 12806408, 12454673, 12140602, 11868791, 11642286, 11461046, 11324022, 11231433, 11183465, 11177826, 11210146, 11275884, 11370035, 11485449, 11613052, 11743854, 11869805, 11983156, 12076417, 12143334, 12179590, 12183126, 12154472, 12096005, 12009764, 11896430, 11757274, 11596162]
60009A1596162j78150j92335k05818k17985k27025k32772k36137k36879k33825
60000I635236k26763k16479k03421j87677j69934j51016j30717j08422q4758o1312
59990H094737l8752j6375O281K8585M9875P0373R0485J09677J26458J39205J46823
59979H807372J48946J45694J37165J23330J04627Q2264N7547L1109L236k5457
59969I615833n4328q3276j11985j38724j60907j77089j87586j92895j92620j86667
59959H129756j76497j64047j49803j32883j12911r0754o7505m3851k0592J402
59949G172315K2502M4464O8218R2218J14237J34414J54859J76231J96215K12074
59939H387747K23269K30416K32730K28079K15465J96217J72620J46120J17064
$$ y = [11596162, 11418012, 11225677, 11019859, 10801874, 10574849, 10342077, 10105940, 9869061, 9635236, 9408473, 9191994, 8988573, 8800896, 8630962, 8479946, 8349229, 8240807, 8156049, 8094737, 8055985, 8039610, 8045891, 8074476, 8124351, 8194724, 8285209, 8394886, 8521344, 8660549, 8807372, 8956318, 9102012, 9239177, 9362507, 9467134, 9549398, 9606945, 9638054, 9641290, 9615833, 9561505, 9478229, 9366244, 9227520, 9066613, 8889524, 8701938, 8509043, 8316423, 8129756, 7953259, 7789212, 7639409, 7506526, 7393615, 7302861, 7235356, 7191505, 7170913, 7172315, 7194817, 7239281, 7307499, 7399717, 7513954, 7648368, 7803227, 7979458, 8175673, 8387747, 8611016, 8841432, 9074162, 9302241, 9517706, 9713923, 9886543, 10032663, 10149727]
59930A0149727Q5410N1420J6020j9328n3397q5696j15776j42255j63199j77598
59920I545328j85801j88440j85480j76727j62696j44550j23401j00060p5289m9929
59910H152955k4625L93K5090M9178P1963R2831J11772J29050J44249J56085J63497
59899I072438J66667J66613J64021J58886J51052J40658J28173J14359J00251
59890A0363118Q6919P5304O6326O0811N8917O0166O4506P3060Q7200J07092J31752
59879A1235171J60317J92468K27679K64936L03521L43353L84130M24439M61956
59870A3997970M94188N18839N33745N36866N26261M99950M55936L92802L10813
59861A8267370K12972J04920o699j16210k19226l11436l88440m47625m89469n15882
$$ y = [10149727, 10235137, 10286557, 10302577, 10283249, 10229852, 10144156, 10028380, 9886125, 9722926, 9545328, 9359527, 9171087, 8985607, 8808880, 8646184, 8501634, 8378233, 8278173, 8202884, 8152955, 8128330, 8128723, 8153813, 8202991, 8274954, 8367785, 8479557, 8608607, 8752856, 8908941, 9072438, 9239105, 9405718, 9569739, 9728625, 9879677, 10020335, 10148508, 10262867, 10363118, 10450037, 10525341, 10591667, 10652478, 10711395, 10771561, 10836067, 10909127, 10996327, 11103419, 11235171, 11395488, 11587956, 11815635, 12080571, 12384092, 12727445, 13111575, 13536014, 13997970, 14492158, 15010997, 15544742, 16081608, 16607869, 17107819, 17563755, 17956557, 18267370, 18480342, 18585262, 18578563, 18462353, 18243127, 17931691, 17543251, 17095626, 16606157, 16090275]
59851A6090275n27592n24411n07803m81663m49807m13655l73062l28692k82617
59842A2200973k36822j91936j47530j03158n8914j5299K7028O7185J03898J35769
59832A1781194J62009J82670J97635K05481K03920J91570J68847J36782R5545
59823A3325653M5030j3159p5026j36047j93333k45589k91582l29697l59149l80576
59813A1346525l94893m02233m02685l97240l86995l71973l51853l27645l01475
59804H009533k74897k48473k22828j98624j75396j51964j28460j06673q8023p2605
59794F341590o0575n2611m8116m4548l9738l3538k6171j6772n158O653J6719K5742
59782F063477L5146M3518M7337M4838L6826K4074O483j4747l6314n5152p0240
$$ y = [16090275, 15562683, 15038272, 14530469, 14048806, 13598999, 13185344, 12812282, 12483590, 12200973, 11964151, 11772215, 11624685, 11521527, 11462613, 11447314, 11474342, 11541527, 11645425, 11781194, 11943203, 12125873, 12323508, 12528989, 12732909, 12924479, 13093326, 13230108, 13325653, 13370683, 13357524, 13282498, 13146451, 12953118, 12707529, 12415947, 12086250, 11727101, 11346525, 10951632, 10549399, 10146714, 9749474, 9362479, 8990506, 8638653, 8311008, 8009533, 7734636, 7486163, 7263335, 7064711, 6889315, 6737351, 6608891, 6502218, 6414195, 6341590, 6281015, 6228404, 6180288, 6135740, 6096002, 6062464, 6036293, 6019521, 6014363, 6021016, 6037735, 6063477, 6098623, 6142141, 6189478, 6234316, 6271142, 6295216, 6301699, 6286952, 6250638, 6195486, 6125246]
59771F125246q1794r0167r5855r9229r9851r7351r3123q9510q6837q2838p5587
59760E133104o5605n4346m2044k8054j2367M069J9827L3311M3491N0969N7541
59749E139896O4253P0579P5749P9811Q2863Q4112Q2331P6632O6749N3474L9240
59738E915689K7156J8850J3889J1432J1367J3539J7309K2643L0591M1891N6046
59727F180402P2488R1574J13516J37239J61383J85887K11561K38637K66756K96063
59717G955506L27181L60147L93939M26956M57052M80642M91989M83948M50131
59708A1827491L87332K96832J84515O0618o1163j66986k48043l03115l35631l49041
59698A1292809l45991l30300l06701k78089k45133k09000j72443j37393j03380
$$ y = [6125246, 6043452, 5953285, 5857430, 5758201, 5658350, 5560999, 5467876, 5378366, 5291529, 5208691, 5133104, 5067499, 5013153, 4971109, 4943055, 4930688, 4934757, 4954584, 4987895, 5031386, 5082355, 5139896, 5204149, 5274728, 5350477, 5430288, 5513151, 5597263, 5679594, 5756226, 5822975, 5876449, 5915689, 5942845, 5961695, 5975584, 5987016, 5998383, 6011922, 6029231, 6051874, 6082465, 6124356, 6180402, 6252890, 6344464, 6457980, 6595219, 6756602, 6942489, 7154050, 7392687, 7659443, 7955506, 8282687, 8642834, 9036773, 9463729, 9920781, 10401423, 10893412, 11377360, 11827491, 12214823, 12511655, 12696170, 12756788, 12695625, 12528639, 12280596, 11977481, 11641850, 11292809, 10946818, 10616518, 10309817, 10031728, 9786595, 9577595, 9405152, 9267759, 9164379]
59689I164379o9447l6116m466K5373N3712Q0562J06470J32834J60353J88289K16193
59678A0018136K45023K75409L06176L36098L66184L98700M34669M73517N14365
59669A3368277N56411N98826O41668O86349P33907P83237Q31943Q78182R20517
59660A9999317R56890R85058J003448J010457J003896R82926R50080R10125Q67540
59651B8669737Q26506P92178P69260P58965P59116P67404P82869Q03750Q25549
59642C5755334Q41871Q46322Q33483P99832P44760O70121N78448M72340L55805
59633D1898316K35017J17000Q075q6383j61851k15362k45952k53954k40179k06169
59623D0848558j54627q8812j1319P6372J73205K77599L87256M99782O13321P26131
$$ y = [9164379, 9094932, 9058816, 9054350, 9079723, 9133435, 9213997, 9320467, 9453301, 9613654, 9801943, 10018136, 10263159, 10538568, 10844744, 11180842, 11547026, 11945726, 12380395, 12853912, 13368277, 13924688, 14523514, 15165182, 15851531, 16585438, 17368675, 18200618, 19078800, 19999317, 20956207, 21941265, 22944713, 23955170, 24959066, 25941992, 26892072, 27802197, 28669737, 29496243, 30288421, 31057681, 31816646, 32575762, 33343166, 34126035, 34929785, 35755334, 36597205, 37443527, 38277010, 39076842, 39821602, 40491723, 41070171, 41542511, 41898316, 42133333, 42250333, 42258408, 42172025, 42010174, 41794812, 41548860, 41294906, 41054727, 40848558, 40693931, 40605119, 40593800, 40670172, 40843377, 41120976, 41508232, 42008014, 42621335, 43347466]
59613D3347466Q35523R37504J027402J099991J148582J164703J139519J065564
59605E1766254R37426P52636N14140K32328p6222l92661o98861r78276j216746
59596E0840018j404453j537612j618065j651190j643791j603157j537305j455404
59588C8389041j367490j283624j213399j165493j145853j154766j185526j226405
59580B8646485j264501j289118j293864j277493j242862j194351j135977j071250
59572A8877069j003341r34487q65750p98031p32664o70565o11683n56090n04835
59563A2199623m58807m17404l79173l43231l09421k77798k48828k23313k01243
59554I340405j81542j63814j49356j39235j32484j27719j25436j26776j30699
$$ y = [43347466, 44182989, 45120493, 46147895, 47247886, 48396468, 49561171, 50700690, 51766254, 52703680, 53456316, 53970456, 54202784, 54126562, 53733901, 53035040, 52056764, 50840018, 49435565, 47897953, 46279888, 44628698, 42984907, 41381750, 39844445, 38389041, 37021551, 35737927, 34524528, 33359035, 32213182, 31058416, 29872890, 28646485, 27381984, 26092866, 24799002, 23521509, 22278647, 21084296, 19948319, 18877069, 17873728, 16939241, 16073491, 15275460, 14542796, 13872231, 13260548, 12704458, 12199623, 11740816, 11323412, 10944239, 10601008, 10291587, 10013789, 9764961, 9541648, 9340405, 9158863, 8995049, 8845693, 8706458, 8573974, 8446255, 8320819, 8194043, 8063344]
59545H063344j34663j37929j41960j47343j52334j54988j55037j52988j48952
59536F737150j43117j36137j28251j19102j08877r8537q8395p7682o6222n5282
59526E715548m5878l7171k7653j7243p292J168Q401J5450K3083L1023L7999M2887
59514E740322M5962M8529N1404N4473N7743O1782O6839P2557P8958Q6608R5371
59503F460548J04157J12757J22792J35660J50414J64996J79076J94231K11554
59494G836185K30495K50156K70518K91786L13538L34982L55453L74172L90141
59485A0647426M02922M12977M20534M24342M22263M13101L97394L76602L52346
59476A4269907L26360K99871K72207K40860K04319J64699J26553R2994O4209L9877
$$ y = [8063344, 7928681, 7790752, 7648792, 7501449, 7349115, 7194127, 7039090, 6886102, 6737150, 6594033, 6457896, 6329645, 6210543, 6101666, 6003129, 5914734, 5837052, 5770830, 5715548, 5669670, 5632499, 5604846, 5587603, 5580311, 5581479, 5589880, 5605330, 5628413, 5659436, 5697435, 5740322, 5786284, 5834813, 5886217, 5940690, 5998433, 6060215, 6127054, 6199611, 6278569, 6365177, 6460548, 6564705, 6677462, 6800254, 6935914, 7086328, 7251324, 7430400, 7624631, 7836185, 8066680, 8316836, 8587354, 8879140, 9192678, 9527660, 9883113, 10257285, 10647426, 11050348, 11463325, 11883859, 12308201, 12730464, 13143565, 13540959, 13917561, 14269907, 14596267, 14896138, 15168345, 15409205, 15613524, 15778223, 15904776, 15997770, 16061979, 16101856]
59466A6101856K1458J0898Q049J0971J8671L2190N2592P8708J07382J35207J59285
59455A6737267J76536J83203J75787J52597J14230O2508o75p3185j51738k32064
59445A7144466l10293l83879m50904n08807n54104n83626n96315n94174n81065
59436A2581299n60065n32262m98553m61625m24610l88047l50079l10185k70934
59427H784939k35088k02495j71135j40120j10013q1033n2693k5034J263K6104
59417G794695N0282P4459R8769J23346J48256J72819J95944K17407K38075K58459
59407I372511K77398K92568L02129L05715L03635K95122K77806K49464K10040
59398A1886388J61225J04540M1182k6174r3165j56207k14029k66039l10491l45453
$$ y = [16101856, 16123314, 16134212, 16142261, 16153232, 16171903, 16204093, 16256685, 16335393, 16442775, 16577982, 16737267, 16913803, 17097006, 17272793, 17425390, 17539620, 17602128, 17601453, 17528268, 17376530, 17144466, 16834173, 16450294, 15999390, 15490583, 14936479, 14352853, 13756538, 13162364, 12581299, 12021234, 11488972, 10990419, 10528794, 10104184, 9716137, 9366058, 9055873, 8784939, 8549851, 8347356, 8176221, 8036101, 7926088, 7845055, 7792362, 7767328, 7768591, 7794695, 7844977, 7919436, 8018205, 8141551, 8289807, 8462626, 8658570, 8875977, 9114052, 9372511, 9649909, 9942477, 10244606, 10550321, 10853956, 11149078, 11426884, 11676348, 11886388, 12047613, 12152153, 12193335, 12167161, 12073996, 11917789, 11703760, 11437721, 11127230, 10781777]
59388A0781777l70654l87257l96440l98987l95530l86380l71827l53207l32750
59379G388745l11776k90238k68557k48134k29111k09649j89010j69456j53057
59370E319757j38352j22585j05902r0690p7743o5853n4545m4413l5045k5301j5566
59359D543762p252k23O894J3983J9719K4539L0542L8364M6767N5346O4285P1047
59347D907773P1279O4861N7940N6726O1591O9167P7796Q8287J01122J15749J31737
59336E804028J48111J62171J71328J76302J81095J89756K03962K23213K46167
59327G506133K71773K99842L30459L62977L96461M31219M68539N08462N49381
59318A1125246N90572O33327O78205P22608P62624P96056Q21625Q36294Q35878
$$ y = [10781777, 10411123, 10023866, 9627426, 9228439, 8832909, 8446529, 8074702, 7721495, 7388745, 7076969, 6786731, 6518174, 6270040, 6040929, 5831280, 5642270, 5472814, 5319757, 5181405, 5058820, 4952918, 4862228, 4784485, 4718632, 4664087, 4619674, 4584629, 4559328, 4543762, 4536510, 4536287, 4543181, 4557164, 4576883, 4601422, 4631964, 4670328, 4717095, 4772441, 4836726, 4907773, 4979052, 5043913, 5101853, 5158579, 5220170, 5289337, 5367133, 5455420, 5556542, 5672291, 5804028, 5952139, 6114310, 6285638, 6461940, 6643035, 6832791, 7036753, 7259966, 7506133, 7777906, 8077748, 8408207, 8771184, 9167645, 9598864, 10067403, 10575865, 11125246, 11715818, 12349145, 13027350, 13749958, 14512582, 15308638, 16130263, 16966557, 17802435]
59309A7802435Q18657P86861P44220O93195O35016N71487N05978M42526L83711
59300B3384086L29230K76898K25043J73409J21621O7971J0442n1719j18008j87328
59290B4231645k57744l26157l89309m45123m92881n32743n65547n92472o14110
59281B0015559o30273o40982o47060o49185o47031o39914o27696o10452n87986
59272A4334980n60516n29545m97268m65101m33118m00619l67014l32456k97885
59263A0451458k64277k32029k01297j72617j46259j21270r6328p1688m9093k9567
59253I067033j2457K977J6256K6471L3449L7528L8912L7542L2931K4218J1583
59242I316443k557j5312k6511l8415n1834o4450p3695p9439q2633q3132q0403
$$ y = [17802435, 18621092, 19407953, 20152173, 20845368, 21480384, 22051871, 22557849, 23000375, 23384086, 23713316, 23990214, 24215257, 24388666, 24510287, 24578258, 24588700, 24536981, 24418973, 24231645, 23973901, 23647744, 23258435, 22813312, 22320431, 21787688, 21222141, 20629669, 20015559, 19385286, 18744304, 18097244, 17448059, 16801028, 16161114, 15533418, 14922966, 14334980, 13774464, 13244919, 12747651, 12282550, 11849432, 11448813, 11081799, 10749343, 10451458, 10187181, 9955152, 9753855, 9581238, 9434979, 9313709, 9217381, 9145693, 9096600, 9067033, 9054576, 9057553, 9073809, 9100280, 9133729, 9171257, 9210169, 9247711, 9280642, 9304860, 9316443, 9313886, 9298574, 9272063, 9233648, 9181814, 9117364, 9043669, 8964230, 8881597, 8798465, 8718062]
59231H718062p4889o7055n6143m1510k4271o117J2658L2526N2919P2717R1891
59220H710788J11271J30984J50327J68733J85648J99972K10932K18926K24313
59211A0311894K25905K22100K13089K00379J84249J63370J37285J07914P7991
59202A1844176M8766J9631j0659m2695p5711j07523j35268j56674j71282j80813
59192A1031948j87993j94276j98831k00432j99984j99738j99945j97885j91072
59183I261792j80022j67032j53480j39300j23955j06614q6401o3712m0505j7989
59173H182782N267L1513O0777R1121J21586J53282J87571K24373K62625L01417
59163I622314L40309L78935M16393M50847M79882N01379N13501N13596M98172
$$ y = [8718062, 8643173, 8576118, 8519975, 8478465, 8454194, 8448077, 8460735, 8493261, 8546180, 8618897, 8710788, 8822059, 8953043, 9103370, 9272103, 9457751, 9657723, 9868655, 10087581, 10311894, 10537799, 10759899, 10972988, 11173367, 11357616, 11520986, 11658271, 11766185, 11844176, 11892942, 11912573, 11901914, 11859219, 11783508, 11675985, 11540717, 11384043, 11212761, 11031948, 10843955, 10649679, 10450848, 10250416, 10050432, 9850694, 9650749, 9452864, 9261792, 9081770, 8914738, 8761258, 8621958, 8498003, 8391389, 8304988, 8241276, 8200771, 8182782, 8188049, 8219562, 8280339, 8371460, 8493046, 8646328, 8833899, 9058272, 9320897, 9622314, 9962623, 10341558, 10757951, 11208798, 11688680, 12190059, 12703560, 13217156, 13715328]
59154A3715328M64774M13492L46084K64294J69871O5733m3670j52962k56496l49119
59144A4637329m27209m88940n33510n60769n71838n69316n56187n34933n07710
59135I886917m76517m42899m08256l74538l43509l15255k88575k63172k39995
59126F734201k19268j99826j80940j62967j45552j27272j08217r0972p7371o5845
59116E355971n3594m0105k6915j5145m902L833J1441J8983K7083L5175M2846N0787
59104E405458N9365O7667P5049Q2187Q9424R5777J00975J06461J12565J16789
59094F311717J17137J15234J13511J10980J04848R5064Q3877P1742N7067L9940
59084G221117K2931P954n121j6465k5546l2774l9538m5926n0325n1699n0577m7563
$$ y = [13715328, 14180102, 14593594, 14939678, 15203972, 15373843, 15439576, 15395906, 15242944, 14986448, 14637329, 14210120, 13721180, 13187670, 12626901, 12055063, 11485747, 10929560, 10394627, 9886917, 9410400, 8967501, 8559245, 8184707, 7841198, 7525943, 7237368, 6974196, 6734201, 6514933, 6315107, 6134167, 5971200, 5825648, 5698376, 5590159, 5499187, 5421816, 5355971, 5302377, 5262272, 5235357, 5220212, 5215310, 5219143, 5230584, 5249567, 5276650, 5311825, 5354671, 5405458, 5464823, 5532490, 5607539, 5689726, 5779150, 5874927, 5975902, 6082363, 6194928, 6311717, 6428854, 6544088, 6657599, 6768579, 6873427, 6968491, 7052368, 7124110, 7181177, 7221117, 7244048, 7252002, 7246881, 7230416, 7204870, 7172096, 7132558, 7086632, 7036307, 6984608, 6934031, 6886468]
59072F886468m2651l6229k9054k0993j1139P24J4087K8777M4556O0195P4699Q8992
59060G058432J04459J20377J34957J48439J62799J78642J94813K10929K27712
59051H541559K44734K60373K74240K87255K99146L08412L14962L19961L22527
59042A1173169L19386L08626K90937K66245K32176J87410J34014P4504R035o2283
59032A2933219j36192k07646k73131l30775l78561m14788m39783m55322m62559
59023I834462m61848m54142m41234m24649m05266l83826l61113l37745l14326
59014F250313k91552k69907k49632k31082k14560j99667j85463j71393j57550
59005D279507j44206j31816j21258j12991j06167r9558r3069q7168q1263p4311
$$ y = [6886468, 6843817, 6807588, 6778534, 6757541, 6746402, 6747126, 6761213, 6789990, 6834546, 6894741, 6969440, 7058432, 7162891, 7283268, 7418225, 7566664, 7729463, 7908105, 8102918, 8313847, 8541559, 8786293, 9046666, 9320906, 9608161, 9907307, 10215719, 10530681, 10850642, 11173169, 11492555, 11801181, 12092118, 12358363, 12590539, 12777949, 12911963, 12986467, 12995502, 12933219, 12797027, 12589381, 12316250, 11985475, 11606914, 11192126, 10752343, 10297021, 9834462, 9372614, 8918472, 8477238, 8052589, 7647323, 7263497, 6902384, 6564639, 6250313, 5958761, 5688854, 5439222, 5208140, 4993580, 4793913, 4608450, 4437057, 4279507, 4135301, 4003485, 3882227, 3769236, 3663069, 3563511, 3470442, 3383274, 3302011, 3227700]
58995C227700o6869o0709n6371n2799m9508m7131m5428m2858l8950l5199l2624
58984B699254l0173k6704k3021k0421j8409j5272j0432m983j74L817P656J1716
58972B572854J5151J6531J5996J6119J9329K4841K9599L2137L3738L5810L8008
58961B850113L9376L9581L8304L4969K9774K3734J7246R855J755n934j2769j9093
58949C046911k4232k6341k4881k1622j8360j5311j2529j1119j1708j3125j3943
58938B853740j4207j4598j4970j4892j4654j4589j4162j2645j0137p169l999q99
58926B716819J629L456N046O693Q248R650J0986J1990J2545J3478J5633J8290
58914B834463K0078K1368K3937K8141L2406L5767L8881M1949M3863M4343M4917
$$ y = [3227700, 3160831, 3100122, 3043751, 2990952, 2941444, 2894313, 2848885, 2806027, 2767077, 2731878, 2699254, 2669081, 2642377, 2619356, 2598935, 2580526, 2565254, 2554822, 2549839, 2549665, 2553482, 2561138, 2572854, 2588005, 2604536, 2620532, 2636651, 2655980, 2680821, 2710420, 2742557, 2776295, 2812105, 2850113, 2889489, 2929070, 2967374, 3002343, 3032117, 3055851, 3073097, 3082952, 3084707, 3078773, 3066004, 3046911, 3022679, 2996338, 2971457, 2949835, 2931475, 2916164, 2903635, 2892516, 2880808, 2867683, 2853740, 2839533, 2824935, 2809965, 2795073, 2780419, 2765830, 2751668, 2739023, 2728886, 2721717, 2717718, 2716819, 2718448, 2721904, 2726950, 2733643, 2741891, 2751541, 2762527, 2774517, 2787062, 2800540, 2816173, 2834463, 2854541, 2875909, 2899846, 2927987, 2960393, 2996160, 3035041, 3076990, 3120853, 3165196, 3210113]
58903C210113M6727M8979N0640N2072N3921N5911N7752N9863O2387O4874O7614
58892C830853P1775P7546Q3815R0165R7271J04659J10470J14625J19878J28119
58882D829176J37707J46227J54027J63095J74065J86364J99967K14859K29687
58873F435174K42975K55221K68304K83240K99599L16508L33348L50351L69146
58864I153866L91798M18668M48391M80296N15122N52793N91582O30568O70809
58855A3853893P12972P55757P98027Q40154Q81611R19348R50419R73949R88276
58846B1674406R88245R67965R24780Q58127P66361O47976N05136L43362J68371
58837B7844729j4271j97069l71108n29019o66115p79539q68314r33576r76762
$$ y = [3210113, 3256840, 3305819, 3356459, 3408531, 3462452, 3518363, 3576115, 3635978, 3698365, 3763239, 3830853, 3902628, 3980174, 4063989, 4154154, 4251425, 4356084, 4466554, 4581179, 4701057, 4829176, 4966883, 5113110, 5267137, 5430232, 5604297, 5790661, 5990628, 6205487, 6435174, 6678149, 6933370, 7201674, 7484914, 7784513, 8101021, 8434369, 8784720, 9153866, 9545664, 9964332, 10412723, 10893019, 11408141, 11960934, 12552516, 13183084, 13853893, 14566865, 15322622, 16120649, 16960803, 17842414, 18761762, 19712181, 20686130, 21674406, 22662651, 23630616, 24555396, 25413523, 26179884, 26827860, 27332996, 27676358, 27844729, 27830458, 27633389, 27262281, 26733262, 26067147, 25287608, 24419294, 23485718, 22508956]
58828B2508956r98184r99178r84354r59184r25918q84489q36814p87209p38448
58819A4395178o90200o42006n95438n52403n13176m77134m44084m14005l86501
58810I680231l61130l37694l15800k94766k74179k54225k35576k18954k04208
58801G183699j89642j73452j56291j40997j28988j18505j07477r6195q5526p4393
58791E912233o1519m8342l7360k8254j8264o134O757J9191L1551M4177N6354O7701
58779E938091P8906R0566J02563J14947J28243J42514J57122J71662J86353K01440
58769G312407K16990K33199K50238K68090K87081L07895L30433L53429L76259
58760I936021M00268M27184M56972M88538N21745N57422N95994O37275O80889
$$ y = [22508956, 21510772, 20511594, 19527240, 18568056, 17642138, 16757649, 15920835, 15133626, 14395178, 13704978, 13062972, 12467534, 11915131, 11401955, 10924821, 10480737, 10066732, 9680231, 9319101, 8981407, 8665607, 8370841, 8096662, 7842437, 7606861, 7387907, 7183699, 6994057, 6820605, 6664314, 6523317, 6394329, 6275824, 6168347, 6072152, 5986626, 5912233, 5850714, 5802372, 5765012, 5736758, 5718494, 5712360, 5719117, 5738308, 5769859, 5814036, 5870390, 5938091, 6016997, 6107563, 6210126, 6325073, 6453316, 6595830, 6752952, 6924614, 7110967, 7312407, 7529397, 7762596, 8012834, 8280924, 8568005, 8875900, 9206333, 9559762, 9936021, 10336289, 10763473, 11220445, 11708983, 12230728, 12788150, 13384144, 14021419, 14702308]
58751A4702308P25685P69411Q10248Q47833Q81572R08895R26418R31611R21609
58742B2425590Q91683Q37217P56870O52178N24786L76269K10411L3853j45452
58733B6563405l19369m80145o22044p42378q39865r12927r61278r88059r97861
58724A9699479r92898r73301r40972r00827q57728q13739p68695p22109o74438
58715A2054772o27547n83901n44520n08297m74102m42396m13623l86452l59535
58706G714399l33838l11250k91747k73940k57244k41449k25357k08425j92742
58697E378407j80469j70031j57878j43574j30010j18675j08003r6829q6318p7536
58687D109084o9746o2086n4808m7890m0503l2640k5514j9774j5112j1944j1404
$$ y = [14702308, 15427993, 16197404, 17007652, 17855485, 18737057, 19645952, 20572370, 21503981, 22425590, 23317273, 24154490, 24911360, 25563538, 26088324, 26464593, 26675004, 26708857, 26563405, 26244036, 25763891, 25141847, 24399469, 23559604, 22646677, 21685399, 20697340, 19699479, 18706581, 17733280, 16792308, 15891481, 15033753, 14220014, 13451319, 12729210, 12054772, 11427225, 10843324, 10298804, 9790507, 9316405, 8874009, 8460386, 8073934, 7714399, 7380561, 7069311, 6777564, 6503624, 6246380, 6004931, 5779574, 5571149, 5378407, 5197938, 5027907, 4870029, 4726455, 4596445, 4477770, 4369767, 4272938, 4186620, 4109084, 4039338, 3977252, 3922444, 3874554, 3834051, 3801411, 3775897, 3756123, 3741011, 3729067, 3717663]
58676C717663j3109j5107j6815k0029k6035l3489m0067m4764m7888n0230n2839
58665C357291n6194n9138o0253o0516o2573o6824p0400p1064p0074o9657o9466
58654B641132o7537o3688n9872n7433n5575n2864m9054m4890m0728l6290l1816
58643B081385k8678k7978k8885k9518k9506l0210l2136l3817l4170l4148l4696
58632A737643l4748l2920k9900k7239k4944k2131j8991j6142j3019r054n560m142
58620A498853l964k868q04J37j190l692n684o102m658k319q68n46O99L974P058
58605A478026P402N803M529L557J909J018K848N557N154J225k804m889n978o329
58591A497028m292L45N222Q603J0864J2296J2601J3045J5913K1020K5652K8649
$$ y = [3717663, 3704554, 3689447, 3672632, 3652603, 3626568, 3593079, 3553012, 3508248, 3460360, 3410130, 3357291, 3301097, 3241959, 3181706, 3121190, 3058617, 2991793, 2921393, 2850329, 2780255, 2710598, 2641132, 2573595, 2509907, 2450035, 2392602, 2337027, 2284163, 2235109, 2190219, 2149491, 2113201, 2081385, 2052707, 2024729, 1995844, 1966326, 1936820, 1906610, 1874474, 1840657, 1806487, 1772339, 1737643, 1702895, 1669975, 1640075, 1612836, 1587892, 1565761, 1546770, 1530628, 1517609, 1508555, 1502995, 1498853, 1494889, 1492021, 1491217, 1491354, 1490164, 1486472, 1480788, 1474686, 1470028, 1467709, 1466841, 1466295, 1466994, 1470968, 1478026, 1485428, 1491231, 1495760, 1499317, 1501226, 1502244, 1505092, 1510649, 1515803, 1517028, 1514224, 1509335, 1503357, 1497028, 1492736, 1493081, 1498303, 1506906, 1517770, 1530066, 1542667, 1555712, 1571625, 1592645, 1618297, 1646946]
58579A646946L1499L4844L7278L8500M0451M4167M8379N2418N7578O4358P1048
58568B167466P6474Q1649Q7583R3771R9960J07180J16085J26270J37691J50516
58558C244645J63450J74877J85856J99030K14279K28708K41203K53233K64528
58549E169809K72011K74236K72873K67977K55618K32276J98521J56339J06265
58540G205925M9574r571o6654j19262j65429k02430k29263k47754k59232k62865
58530E693039k59141k51858k44081k34784k21918k06430j90546j74510j57741
58521C752030j41299j26506j12797r9238q6580p5691o5644n5505m6364l9607l4680
58510B868119l0431k6931k4161k0767j6103j1896j0065j0322j1541j3697j6970
$$ y = [1646946, 1678445, 1713289, 1750567, 1789067, 1829518, 1873685, 1922064, 1974482, 2032060, 2096418, 2167466, 2243940, 2325589, 2413172, 2506943, 2606903, 2714083, 2830168, 2956438, 3094129, 3244645, 3408095, 3582972, 3768828, 3967858, 4182137, 4410845, 4652048, 4905281, 5169809, 5441820, 5716056, 5988929, 6256906, 6512524, 6744800, 6943321, 7099660, 7205925, 7255499, 7245928, 7179274, 7060012, 6894583, 6692153, 6462890, 6215136, 5955904, 5693039, 5433898, 5182040, 4937959, 4703175, 4481257, 4274827, 4084281, 3909771, 3752030, 3610731, 3484225, 3371428, 3272190, 3185610, 3109919, 3044275, 2988770, 2942406, 2902799, 2868119, 2837688, 2810757, 2786596, 2765829, 2749726, 2737830, 2727765, 2717443, 2705902, 2692205, 2675235]
58499B675235k0872k5766l3148m2729n1385n6791n9990o2693o4499o4723o4474
58488B128165o4519o3361n9910n5935n3267n0632m6168m1266l8702l8104l6375
58477A579926l2083k6962k3314k1867k1838k1672k0101j7501j5444j4389j3180
58466A351575j1438j0403j0574j0631r917r682j0428j0337q027m851k756j787
58454A250744j187q98n39Q79K763K830P87n09O71K323K533K977N875R910J2186
58439A291345J2466J2620J3305J3789J3851J3609J2522J0464Q587P667O958N877
58427A423060N000M262K319j050m214o444q866j1568j2980j3511j6215k1762k6336
58414A311695k7031k5802k5270k4254k0930j7230j6084j6660j6068j4049j2494
$$ y = [2675235, 2654363, 2628597, 2595449, 2552720, 2501335, 2444544, 2384554, 2321861, 2257362, 2192639, 2128165, 2063646, 2000285, 1940375, 1884440, 1831173, 1780541, 1734373, 1693107, 1654405, 1616301, 1579926, 1547843, 1520881, 1497567, 1475700, 1453862, 1432190, 1412089, 1394588, 1379144, 1364755, 1351575, 1340137, 1329734, 1319160, 1308529, 1298612, 1288930, 1278502, 1268165, 1260138, 1255287, 1252531, 1250744, 1249557, 1248659, 1248120, 1248999, 1251762, 1254592, 1255379, 1254870, 1255541, 1257864, 1260397, 1263374, 1269249, 1279159, 1291345, 1303811, 1316431, 1329736, 1343525, 1357376, 1370985, 1383507, 1393971, 1402558, 1410225, 1417183, 1423060, 1428060, 1432322, 1434641, 1433591, 1429377, 1422933, 1414067, 1402499, 1389519, 1376008, 1359793, 1338031, 1311695, 1284664, 1258862, 1233592, 1209338, 1188408, 1171178, 1155094, 1138434, 1122366, 1108317, 1095823]
58403A095823j1936j1554j1097j0273p948m318j818j521j037J551M318M794M015
58390A048999M258N197N365N201N695O226O368P435R637J0546R274R029J2399
58377A145629J6976J9146J9267J9461J9257J7248J4523J2449R452L781k802p671
58365A286716j1215j4619j6575j5960j4996j5831j6633j5021j2487j1266r835
58354A132278n998j605M81J511M240P703R370J0047J1800J3319J2316J0346J0335
58341A216143J1488J1290J0193R433O880M88o466r136q194p787q558q252p212
58328A210310p362p521n455l093l959o829p647o246n436m943k277J472K721J564
58314A155299J347K967M787O952J0411J3021J2274J0552J2010J5593J6880J5533
$$ y = [1095823, 1083887, 1072333, 1061236, 1050963, 1043015, 1038697, 1036879, 1035358, 1034321, 1035872, 1040190, 1044984, 1048999, 1053257, 1058454, 1063819, 1069020, 1074715, 1080941, 1087309, 1094744, 1104381, 1114927, 1124201, 1133230, 1145629, 1162605, 1181751, 1201018, 1220479, 1239736, 1256984, 1271507, 1283956, 1293408, 1297189, 1294387, 1286716, 1275501, 1260882, 1244307, 1228347, 1213351, 1197520, 1180887, 1165866, 1153379, 1142113, 1132278, 1126280, 1124675, 1125156, 1126667, 1130907, 1138610, 1147980, 1158027, 1169827, 1183146, 1195462, 1205808, 1216143, 1227631, 1238921, 1249114, 1258547, 1265427, 1265915, 1259449, 1250313, 1242119, 1234332, 1225774, 1217522, 1210310, 1202948, 1195427, 1189972, 1186879, 1182920, 1176091, 1168444, 1162198, 1156762, 1151819, 1149542, 1151014, 1153735, 1155299, 1156646, 1159613, 1164400, 1171352, 1181763, 1194784, 1207058, 1217610, 1229620, 1245213, 1262093, 1277626]
58302A277626J4966J5927J6355J6414J7805J9284J8628J7500J8452J9175J6191
58291A468323J2182J2415J5609J6054J3496J2862J4789J4658J1189Q225P278N642
58279A612722K698J286J932K102J703L258O432Q543J0164J4075J9094K1531K2044
58266A727584K4222K7058K6309K2784K1616K3400K3765K1969K2133K5401K8160
58255A994401K8828K9410L0020K8609K6113K5104K3822J8784J2504J0878J3541
58244B242014J4826J3551J3453J4580J3307J0783J2342J8142K2994K5573K9151
58233B430716L3402L4519L3410L4748L8235L9868M1076M6613N4236N7084N5813
58222B899720N7430O2499O5118O5381O9609P7782Q3237Q5694R1767J01418J07023
$$ y = [1277626, 1292592, 1308519, 1324874, 1341288, 1359093, 1378377, 1397005, 1414505, 1432957, 1452132, 1468323, 1480505, 1492920, 1508529, 1524583, 1538079, 1550941, 1565730, 1580388, 1591577, 1599802, 1607080, 1612722, 1615420, 1616706, 1618638, 1620740, 1622443, 1625701, 1632133, 1640676, 1650840, 1664915, 1684009, 1705540, 1727584, 1751806, 1778864, 1805173, 1827957, 1849573, 1872973, 1896738, 1918707, 1940840, 1966241, 1994401, 2023229, 2052639, 2082659, 2111268, 2137381, 2162485, 2186307, 2205091, 2217595, 2228473, 2242014, 2256840, 2270391, 2283844, 2298424, 2311731, 2322514, 2334856, 2352998, 2375992, 2401565, 2430716, 2464118, 2498637, 2532047, 2566795, 2605030, 2644898, 2685974, 2732587, 2786823, 2843907, 2899720, 2957150, 3019649, 3084767, 3150148, 3219757, 3297539, 3380776, 3466470, 3558237, 3659655, 3766678]
58211C766678J07516J09997J15203J15161J08179J02537J01922J00579R6458R5721
58201D819951J00173J03502J04121J08881J20012J31199J40310J52833J69258
58192E950240J82855J93411K08984K30259K47972K59801K74607K95690L15517
58183H159336L31641L51960L79090M05456M28805M56195M87853N14248N34371
58174A2048955N59518N93898O29683O66133P14006P75314Q38805R01051R70973
58165A8698336J047752J117345J177888J245046J324909J406199J486714J580699
58157B9084888J691348J804005J916466K046633K199632K358491K519158K702256
58149D6322877K917948L154517L415582L731220M117580M565563N084217N708945
$$ y = [3766678, 3874194, 3984191, 4099394, 4214555, 4322734, 4425271, 4527193, 4627772, 4724230, 4819951, 4920124, 5023626, 5127747, 5236628, 5356640, 5487839, 5628149, 5780982, 5950240, 6133095, 6326506, 6535490, 6765749, 7013721, 7273522, 7548129, 7843819, 8159336, 8490977, 8842937, 9222027, 9627483, 10056288, 10512483, 11000336, 11514584, 12048955, 12608473, 13202371, 13832054, 14498187, 15212193, 15987507, 16826312, 17727363, 18698336, 19746088, 20863433, 22041321, 23286367, 24611276, 26017475, 27504189, 29084888, 30776236, 32580241, 34496707, 36543340, 38742972, 41101463, 43620621, 46322877, 49240825, 52395342, 55810924, 59542144, 63659724, 68225287, 73309504, 79018449]
58141G9018449O448308P272998Q179289R209455J0385965J1684587J3093928J4630754
58133A59923733J6283935J8061720K0151912K2907085K6560366L1015860L5890988
58126C30795599M0414796M2990480M1201159L3087409J8977438J962659j3770220
58119D95659320k5288536l1930717l4631064l4754120l3451198l1521937k9410250
58112B74671498k7262267k5082540k2866118k0616020j8338250j6083299j3953529
58105A30469475j2033366j0340709q861053p586702o500379n558944m722293l976870
58097G0889159l315670k719411k171464j667640j194157p11751j77332M22174
58089E9353908J059888J689571K278643K808716L205737L264182K716116J464007
$$ y = [79018449, 85466757, 92739755, 100919044, 110128499, 120514464, 132199051, 145292979, 159923733, 176207668, 194269388, 214421300, 237328385, 263888751, 294904611, 330795599, 371210395, 414200875, 455402034, 488489443, 507466881, 509429540, 495659320, 470370784, 438440067, 403809003, 369054883, 335603685, 304081748, 274671498, 247409231, 222326691, 199460573, 178844553, 160506303, 144423004, 130469475, 118436109, 108095400, 99234347, 91647645, 85147266, 79588322, 74866029, 70889159, 67573489, 64854078, 62682614, 61014974, 59820817, 59109066, 58931734, 59353908, 60413796, 62103367, 64382010, 67190726, 70396463, 73660645, 76376761, 77840768]
58081G7840768k52652j978125l343128m234704m717358m886675m824792m616373
58073D8986961m332833m008694l660026l309074k971788k644205k323822k027365
58065B3709154j770204j546658j347818j180802j053192r54731q71221q02089
58057A4182439p49402p04270o59065o19371n89751n60908n24635m88517m61901
58048H824619m39473m12214l83176l59015l36663l11677k89879k77794k70070
58039E744658k58149k43139k29452k14420j95066j76898j65372j56305j44565
58030C961292j34269j30583j29235j24086j17791j15350j14086j09318j03333
58021B883241r9817r6088q9272q3576q2901q2847p8295p2382o9824o7913o2530
$$ y = [77840768, 77588116, 75609991, 72266863, 68032159, 63314801, 58428126, 53603334, 48986961, 44654128, 40645434, 36985408, 33676334, 30704546, 28060341, 25736519, 23709154, 21938950, 20392292, 19044474, 17863672, 16810480, 15855749, 14984528, 14182439, 13433037, 12728767, 12069702, 11450331, 10860580, 10299672, 9775037, 9286520, 8824619, 8385146, 7972932, 7589756, 7230741, 6894078, 6582401, 6292522, 6014728, 5744658, 5486509, 5243370, 5013918, 4799498, 4604432, 4427534, 4262162, 4105857, 3961292, 3827023, 3696440, 3567205, 3443119, 3325328, 3209978, 3095892, 2986574, 2883241, 2783424, 2687336, 2598064, 2514488, 2431587, 2348740, 2270445, 2198063, 2128239, 2060326, 1997796]
58010A997796n6624n4442n3258m9072m4630m3792m3719m0549l7256l7893l9483
57999A497078l7362l3420l1510k9998k6293k3433k4520k5750k2689j8569j8657
57988A204877k1114k1046j9177j8851j8692j5788j2344j1915j2603j0814q068
57977A034465p423p074m139r59q55j560M18K662J003k766m104l333l386l275n44
57962I99130K859L728L673N745Q067P305N512O896J0379J1898J1674J2797J4729
57949A104392J4556J2900J2691J3690J3658J3221J4508J6755J7966J8927K1055
57938A274319K2718K2092K0884K0865J9841J5597J0335O426J551o624j4879j9268
57926A373857k1828k6366l1136l2167l0658l0363l0495k7975k4154k2421k1362
$$ y = [1997796, 1941172, 1886730, 1833472, 1784400, 1739770, 1695978, 1652259, 1611710, 1574454, 1536561, 1497078, 1459716, 1426296, 1394786, 1364788, 1338495, 1315062, 1290542, 1264792, 1242103, 1223534, 1204877, 1183763, 1162717, 1143540, 1124689, 1105997, 1090209, 1077865, 1065950, 1053347, 1042533, 1034465, 1027042, 1019968, 1015829, 1014870, 1014015, 1012455, 1012873, 1015535, 1016538, 1013772, 1009668, 1006335, 1002949, 999674, 999130, 1001989, 1005717, 1009390, 1015135, 1023202, 1030507, 1036019, 1042915, 1053294, 1065192, 1076866, 1089663, 1104392, 1118948, 1131848, 1144539, 1158229, 1171887, 1185108, 1199616, 1216371, 1234337, 1253264, 1274319, 1297037, 1319129, 1340013, 1360878, 1380719, 1396316, 1406651, 1413077, 1414628, 1408004, 1393125, 1373857, 1352029, 1325663, 1294527, 1262360, 1231702, 1201339, 1170844, 1142869, 1118715, 1096294, 1074932]
57915A074932j7165j0879o545l948kM279N316M301N953J0556J3861J4626J5900
57902A111185J8804K1063K1978K3447K5635K6411K5140K2764J8723J1965M093
57891A331208k789r629j7426k2864k2451j8956j7738j8350j6192j1105p284n282
57879A161142j321N071R650J0695J1284J2956J2897R218L855j553q071j6104k3730
57866A185989k9872l5396m0114m2398m2470m2370m2143l9782l5469l1930k9940
57855G74105k7367k3378j9907j8076j6536j4180j1497q756n698l180k300k027
57843F21203o09J236J637J238K099L719L998L410M189N916O122M945M853N926
57829F69882N720L838K411J884N37j548k343j942k784n375p635q806j0136j1495
$$ y = [1074932, 1057767, 1046888, 1040343, 1036395, 1036393, 1040672, 1045988, 1050289, 1056242, 1066798, 1080659, 1095285, 1111185, 1129989, 1151052, 1173030, 1196477, 1222112, 1248523, 1273663, 1296427, 1315150, 1327115, 1331208, 1328419, 1318790, 1301364, 1278500, 1256049, 1237093, 1219355, 1201005, 1184813, 1173708, 1166424, 1161142, 1159821, 1164892, 1174542, 1185237, 1196521, 1209477, 1222374, 1231592, 1235447, 1233894, 1225823, 1209719, 1185989, 1156117, 1120721, 1080607, 1038209, 995739, 953369, 911226, 871444, 835975, 804045, 774105, 746738, 723360, 703453, 685377, 668841, 654661, 643164, 634408, 628710, 625530, 623230, 621203, 620594, 621830, 623467, 624705, 626804, 630523, 634521, 637931, 642120, 648036, 654158, 659103, 663956, 669882, 675602, 679440, 681851, 683735, 684272, 682724, 680381, 678439, 675655, 670280, 662645, 653839, 643703, 632208]
57815F32208j1222r546q339p361m818j542l20r65n56J211J783J157K426N853P644
57800F07613O201M747N631O558N092K947K874M296M703L200N74k236m186m465
57786F43549l782l670m214m446m671n741o467n032k787k867m919n163k221J017
57772E88586K195K194K015Q00j561l232l297k983l193l638m928q150j1871j3116
57758E39821j1939j1355j2230j2265j0746r861j0067q788n433l284m194n527m763
57745D29369l281k967k642p81J340K088K442L898N816P235R028J1961J4779J6329
57731D94614J7542J9455K1299K2264K3099K4438K5509K5816K5960K5783K4080
57720G49859K1179J9068J7868J5109R682L439k350q798j6068k1727k4479k6282
$$ y = [632208, 620986, 611440, 603101, 595740, 590922, 589380, 589060, 588095, 587539, 588750, 590533, 591690, 594116, 599969, 607613, 613814, 618561, 624192, 630750, 635842, 638789, 641663, 645959, 650662, 653862, 654436, 652200, 648014, 643549, 639767, 636097, 631883, 627437, 622766, 617025, 610558, 605526, 602739, 599872, 594953, 589790, 587569, 588586, 590781, 592975, 594990, 595790, 594229, 590997, 587700, 584717, 581524, 577886, 572958, 564808, 552937, 539821, 527882, 516527, 504297, 492032, 481286, 471425, 461358, 452570, 447137, 443853, 439659, 434132, 429369, 426088, 423121, 420479, 419698, 421038, 423126, 425568, 429466, 435282, 442517, 451545, 463506, 478285, 494614, 512156, 531611, 552910, 575174, 598273, 622711, 648220, 674036, 699996, 725779, 749859, 771038, 790106, 807974, 823083, 832765, 836204, 833854, 825056, 808988, 787261, 762782, 736500]
57708G36500k8529k9369k7098k3360k0436j8056j5290j2949j1674j0139p543n461
57696E26596m999m581k799q42J96J651M477O771O864O264O715O893N102K817K249
57681E63374K494J541K31O98K349K852K050J698K206K591K988M393O453P843Q350
57666F12111Q608Q609Q407R138J1441J3977J5473J6797J9050K1126K1584K1403
57654G87724K2406K4192K5241K5899K7545K9672L0627L0582L1267L3190L5531
57643A103876L8311M2292M7021N1207N4765N8608O2740O6532P0464P5589Q1462
57632A752867Q6695R1465R7663J06326J16534J26994J37468J48530J60918J75170
57622C000630J91119K07812K24358K40357K55144K67491K76421K81301K80653
$$ y = [736500, 707971, 678602, 651504, 628144, 607708, 589652, 574362, 561413, 549739, 539600, 532057, 526596, 521597, 517016, 514217, 513375, 513571, 515222, 519699, 526470, 533334, 539598, 546313, 553206, 558308, 561125, 563374, 565868, 567409, 567640, 568338, 570687, 573539, 575589, 577287, 579493, 582084, 585072, 589465, 595918, 603761, 612111, 620719, 629328, 637735, 646873, 658314, 672291, 687764, 704561, 723611, 744737, 766321, 787724, 810130, 834322, 859563, 885462, 913007, 942679, 973306, 1003888, 1035155, 1068345, 1103876, 1142187, 1184479, 1231500, 1282707, 1337472, 1396080, 1458820, 1525352, 1595816, 1671405, 1752867, 1839562, 1931027, 2028690, 2135016, 2251550, 2378544, 2516012, 2664542, 2825460, 3000630, 3191749, 3399561, 3623919, 3864276, 4119420, 4386911, 4663332, 4944633, 5225286]
57613E225286K72250K55124K30215J98595J60915J19549P9116M3081J0643k2102
57603F572672n9381j04270j56922k11946k59383k90912l04871l04632k94247k77271
57593D308837k57347k36932k16034j94039j71891j50989j31389j12859r6372q2706
57583B658279p0698n8739m6812l5522k4530j3704m350K693Q991J6606K5402L4002
57571B491618M2207N0620N9172O7773P7133Q7323R7064J06265J17300J31519J46328
57560C474322J58397J68228J78594J89601J98243K02032K00179J91769J75463
57551E136828J50970J18740P8826L2202j7384o5168j08544j46620j77789k00372
57541D801689k15122k24473k29419k29261k24133k15557k04703j92156j79181
$$ y = [5225286, 5497536, 5752660, 5982875, 6181470, 6342385, 6461934, 6541050, 6584131, 6594774, 6572672, 6513291, 6409021, 6252099, 6040153, 5780770, 5489858, 5184987, 4880355, 4586108, 4308837, 4051490, 3814558, 3598524, 3404485, 3232594, 3081605, 2950216, 2837357, 2740985, 2658279, 2587581, 2528842, 2482030, 2446508, 2421978, 2408274, 2403924, 2406617, 2415608, 2432214, 2457616, 2491618, 2533825, 2584445, 2643617, 2711390, 2788523, 2875846, 2972910, 3079175, 3196475, 3327994, 3474322, 3632719, 3800947, 3979541, 4169142, 4367385, 4569417, 4769596, 4961365, 5136828, 5287798, 5406538, 5485364, 5517566, 5500182, 5435014, 5326470, 5179850, 5002061, 4801689, 4586567, 4362094, 4132675, 3903414, 3679281, 3463724, 3259021, 3066865, 2887684]
57532B887684j67195j56066j44689j33011j21874j11415j01360r2361q5186p9085
57522A695442p2716o6192o0560n5895n1574m7634m4158m0183l5175l0611k8084
57511A162660k6757k4772k2190k0280j8845j6808j4659j3655j3012j0603o390
57500I74689k725j140q73n27P11L324P111J0704J2986J4538J6287J7774J8478
57487A071337J9629K2436K5633K7301K8208L0667L4902L9223M3162M7577N2212
57476A442287N6029N9634O4542P0339P5424Q0301Q7139R6131J05257J13752J22714
57465B373549J31962J39272J43539J46067J47928J48186J45232J37800J24336
57456C637871J03632P6588M5486J1682k3940n8492q7956j10777j28230j41056
$$ y = [2887684, 2720489, 2564423, 2419734, 2286723, 2164849, 2053434, 1952074, 1859713, 1774527, 1695442, 1622726, 1556534, 1495974, 1440079, 1388505, 1340871, 1296713, 1256530, 1221355, 1190744, 1162660, 1135903, 1111131, 1088941, 1068661, 1049816, 1033008, 1018349, 1004694, 991682, 981079, 974689, 971964, 970824, 969951, 969424, 970135, 973459, 980570, 991274, 1004260, 1018798, 1035085, 1052859, 1071337, 1090966, 1113402, 1139035, 1166336, 1194544, 1225211, 1260113, 1299336, 1342498, 1390075, 1442287, 1498316, 1557950, 1622492, 1692831, 1768255, 1848556, 1935695, 2031826, 2137083, 2250835, 2373549, 2505511, 2644783, 2788322, 2934389, 3082317, 3230503, 3375735, 3513535, 3637871, 3741503, 3818091, 3863577, 3875259, 3851319, 3792827, 3704871, 3594094, 3465864, 3324808]
57446C324808j48417j50447j49155j46044j41076j34382j26780j18261j08242
57437B102004r7538q7778p8785o9060n9036n0954m5173l9459l2579k5759j9897
57426A495986j4176q272l156J232O424J2448J7211K0006K3021K7888L3336L7785
57414A649733M1944M7142N3219N9678O7029P5327Q3065Q9210R4906J01819J09934
57403B473006J17995J24799J29301J30835J29863J26915J20353J07165Q6427N9945
57393C606604K9088o155m3954p9445j08666j31634j49839j62922j69892j71799
57383B611386j70906j68155j63188j55918j46694j35926j24796j15205j07735
57374A322863j00754r2616q3774p5760o9273o4192o0176n6271n1202m5100l9836
$$ y = [3324808, 3176391, 3025944, 2876789, 2730745, 2589669, 2455287, 2328507, 2210246, 2102004, 2004466, 1916688, 1837903, 1768843, 1709807, 1658853, 1613680, 1574221, 1541642, 1515883, 1495986, 1481810, 1473538, 1470382, 1471614, 1478038, 1490486, 1507697, 1527703, 1550724, 1578612, 1611948, 1649733, 1691677, 1738819, 1792038, 1851716, 1918745, 1994072, 2077137, 2166347, 2261253, 2363072, 2473006, 2591001, 2715800, 2845101, 2975936, 3105799, 3232714, 3353067, 3460232, 3546659, 3606604, 3635692, 3629537, 3585583, 3506138, 3397472, 3265838, 3115999, 2953077, 2783185, 2611386, 2440480, 2272325, 2109137, 1953219, 1806525, 1670599, 1545803, 1430598, 1322863, 1222109, 1129493, 1045719, 969959, 900686, 836494, 776318, 720047, 668845, 623745, 583909]
57363E83909l6741l5030l3310l1291k9230k7004k4637k2611k0885j8830j6653
57352B87687j5459j5365j5134j4326j4028j4700j5118j4381j3294j2673j2018
57341A31191j0950j0227j0096r380p447n559m949n065n028n122n464m725k018
57328D5161J105K233Q81j552l695m821m587l465k813l395m439m864m660m364B501
57312b072n805p296p522o164m861m979n683n310l785k710l495n935q141p922n105
57297h6785k218j661k655k705j612j521l028m069l389k394k336k168p08J172K054
57282a14023J953J384J48j591k616k259j357n80M90J827K378K008K012K676K494
57267a05056J080N58K371M792N492M733M088L730L065K668L471N018O259P223
$$ y = [583909, 547168, 512138, 478828, 447537, 418307, 391303, 366666, 344055, 323170, 304340, 287687, 272228, 256863, 241729, 227403, 213375, 198675, 183557, 169176, 155882, 143209, 131191, 120241, 110014, 99918, 90538, 83091, 77532, 72583, 67518, 62490, 57368, 51904, 47179, 45161, 46266, 48499, 49380, 47828, 44133, 39312, 34725, 31260, 28447, 25052, 20613, 15749, 11089, 6725, 2501, -2072, -7877, -15173, -22695, -28859, -33720, -38699, -44382, -49692, -53477, -56187, -59682, -65617, -73758, -81680, -86785, -89003, -90664, -93319, -96024, -97636, -99157, -102185, -106254, -109643, -112037, -114373, -116541, -117249, -116077, -114023, -112070, -110686, -110538, -112129, -114745, -117004, -118361, -118941, -118451, -116624, -114246, -112238, -110226, -107550, -105056, -103976, -103418, -101047, -96255, -90763, -86030, -81942, -78212, -75147, -72479, -69008, -63990, -57731, -50508]
57253e0508Q444R659J0377J0870B91J1879J2342J3648J5512J6139J4744J3002
57241I7557J2803J3884J4863J5362J5930J7025J8835K1059K2531K2494K2330K4077
57229C18750K7203K9286L0005L1521L4475L6970L8475M1085M5305M8161M7538
57218G28774M5102M2760L9521L4472K9607K6566K3277J7063Q914J541m713j1013
57206I81871j7021k1830k6170l0903l4841l6688l7448l8348l8275l5985l2926
57195F31436l0972k9220k5955k2044j9375j7542j5102j2584j1168j0029q027o433
57183D22985o794p549o138l170j187n51J05N51m03j794j494K84J603K243L342
57168D02033M255L124M02j303r93l30q09j991k626j744R97M594P096P907Q557
$$ y = [-50508, -42064, -32405, -22028, -11158, 291, 12170, 24512, 38160, 53672, 69811, 84555, 97557, 110360, 124244, 139107, 154469, 170399, 187424, 206259, 227318, 249849, 272343, 294673, 318750, 345953, 375239, 405244, 436765, 471240, 508210, 546685, 587770, 633075, 681236, 728774, 773876, 816636, 856157, 890629, 920236, 946802, 970079, 987142, 996056, 997597, 992884, 981871, 964850, 943020, 916850, 885947, 851106, 814418, 776970, 738622, 700347, 664362, 631436, 600464, 571244, 545289, 523245, 503870, 486328, 471226, 458642, 447474, 437445, 429418, 422985, 416191, 408642, 402504, 399334, 398147, 397596, 397701, 398252, 397849, 396055, 394561, 394845, 396448, 398691, 402033, 406288, 409412, 409814, 408511, 407518, 407188, 406379, 404388, 401762, 400018, 401015, 405609, 412705, 420612, 429169]
57153D29169J0009J1095J1036J1158J2132J2043R743P602Q056R791J0448J0817
57141E53099J3082J7060K1507K7120L4766M2706M9053N4881O1439O6621O8123
57130A009457O7884O9216P1501P2104P1548P2393P4667P6938Q0095Q5303Q9885
57119A840991R0215Q7386Q5194Q3912Q1238P7925P6907P7706P7330P6218P7762
57108B732784Q2040Q5418Q6458Q7097Q7771Q6506Q3245Q0411P8693P6662P4823
57097C641908P5712P9662Q4425Q8827R2803R4311R0751Q3241P5522O9069O3126
57086D539357N8313N5459N2042M4791L5000K6328J8455Q124m522j6250k6692l8677
57074D751728n3224o9214q7060j07786j29708j50859j72646j96153k17736k34382
$$ y = [429169, 439178, 450273, 461309, 472467, 484599, 496642, 506385, 513987, 522043, 531834, 542282, 553099, 566181, 583241, 604748, 631868, 666634, 709340, 758393, 813274, 874713, 941334, 1009457, 1077341, 1146557, 1218058, 1290162, 1361710, 1434103, 1508770, 1585708, 1665803, 1751106, 1840991, 1931206, 2018592, 2103786, 2187698, 2268936, 2346861, 2423768, 2501474, 2578804, 2655022, 2732784, 2814824, 2900242, 2986700, 3073797, 3161568, 3248074, 3331319, 3411730, 3490423, 3567085, 3641908, 3717620, 3797282, 3881707, 3970534, 4063337, 4157648, 4248399, 4331640, 4407162, 4476231, 4539357, 4597670, 4653129, 4705171, 4749962, 4784962, 4811290, 4829745, 4837869, 4833347, 4817097, 4790405, 4751728, 4698504, 4629290, 4542230, 4434444, 4304736, 4153877, 3981231, 3785078, 3567342, 3332960]
57064C332960k50333k71741k98252l27296l62936m11348m70621D06001a97283
57054h79858p72260q68893r75391j098177j237141j389158j558402j751512j965996
57045a2496788k195831k444432k718889l017006l335454l684327m076225m508698
57037c8477650m977659n498279o088448o743736p455588q228833r033497r773269
57029i6276959j0395997j1027755j1848658j2745397j3209051j2765130j1518361
57022a79787308j0136627r237481q861643q571352p948284o902279n576920m111710
57014b41133604k529323p51857J351916L898795O882779J0087437J3115905J5547774
57006a93530178J7118417J7795621J7717694J7071607J6019098J4698262J3241496
$$ y = [3332960, 3082627, 2810886, 2512634, 2185338, 1822402, 1411054, 940433, 406001, -197283, -879858, -1652118, -2521011, -3496402, -4594579, -5831720, -7220878, -8779280, -10530792, -12496788, -14692619, -17137051, -19855940, -22872946, -26208400, -29892727, -33968952, -38477650, -43455309, -48953588, -55042036, -61785772, -69241360, -77470193, -86503690, -96276959, -106672956, -117700711, -129549369, -142294766, -155503817, -168268947, -179787308, -189923935, -199161416, -208023059, -216594411, -224542695, -231444974, -237021894, -241133604, -243662927, -244414784, -243062868, -239164073, -232281294, -222193857, -209077952, -193530178, -176411761, -158616140, -140898446, -123826839, -107807741, -93109479, -79867983]
56999g9867983J1762235J0333341Q994117P772618O689669N748970M939089M245754
56991a9382190L655030L149578K713293K339027K024123J760547J536566h58609
56982C25884J048215R29097Q24394P34653O57235N87643N25569M73336M29651
56973F535677L90661L55679L26119L00208K74584K49951K29558K12982J96577
56964I071996J79269J62906J47699J32043J16288J02361R0242P8725O8559O0915
56954A0211003N3820M3892L0386J3956o624l2325o0030q5295j07482j28093j45956
56943I787252j59219j70871j86809k08519k32107k53699k70651k77916k69463
56934G757998k45157k11713j75161j36559r7633o7288n8841q0494j28422j87832
$$ y = [-79867983, -68105748, -57772407, -48778290, -41005672, -34316003, -28567033, -23627944, -19382190, -15727160, -12577582, -9864289, -7525262, -5501139, -3740592, -2204026, -858609, 325884, 1374099, 2303196, 3127590, 3862243, 4519478, 5107121, 5632690, 6106026, 6535677, 6926338, 7282017, 7608136, 7908344, 8182928, 8432879, 8662437, 8875419, 9071996, 9251265, 9414171, 9561870, 9693913, 9810201, 9912562, 10002804, 10081529, 10150088, 10211003, 10264823, 10308715, 10339101, 10353057, 10346433, 10314108, 10254078, 10168783, 10061301, 9933208, 9787252, 9628033, 9457162, 9270353, 9061834, 8829727, 8576028, 8305377, 8027461, 7757998, 7512841, 7301128, 7125967, 6989408, 6891775, 6824487, 6765646, 6685152, 6556730, 6368898]
56924F368898k40905k76353k93428k97664k94272k86164k75439k63319k49216
56915C892138k32350k13991j96237j79410j62650j46219j31064j17065j03859
56906B409293r2308q3099p5063o7103o0420n6304n3162m8448m2212l5851k9000
56895A766323k1235j5598j6271k2947l1138l7922m3741m8577n0455m8827m6002
56884A383610m3875m1882l9274l6812l4910l2415k8489k3930j9461j4535q853
56873A059174l443R18N044R865J4462J6384J3533N624n343j5974k3756k8693l2142
56860A015653l4516l5162l4004l2033l0175k8810k8163k7981k7068k4404k0664
56849F92673j7631j6150j5572j4931j3779j2140j0538r666r369q603p013n671
$$ y = [6368898, 6127993, 5851640, 5558212, 5260548, 4966276, 4680112, 4404673, 4141354, 3892138, 3659788, 3445797, 3249560, 3070150, 2907500, 2761281, 2630217, 2513152, 2409293, 2316985, 2233886, 2158823, 2091720, 2031300, 1974996, 1921834, 1873386, 1831174, 1795323, 1766323, 1745088, 1729490, 1713219, 1690272, 1659134, 1621212, 1577471, 1528894, 1478439, 1429612, 1383610, 1339735, 1297853, 1258579, 1221767, 1186857, 1154442, 1125953, 1102023, 1082562, 1068027, 1059174, 1055731, 1056649, 1061693, 1071558, 1086020, 1102404, 1115937, 1121561, 1116218, 1100244, 1076488, 1047795, 1015653, 981137, 945975, 911971, 879938, 849763, 820953, 792790, 764809, 737741, 713337, 692673, 675042, 658892, 643320, 628389, 614610, 602470, 591932, 582266, 572897, 564294, 557281, 551610]
56837E51610n422n681n767o092o795o675n025l184k428j581J227N561R400J1847
56823E30995J3028J2420R796O989O112O493N937M486M220N544O575O499O814Q584
56809F34492J0891J2800J4749J7136J9385K1253K3526K6613K9954L3417L7712
56798H81928M2552M5646M4332L7416K5350J0094m776j5365k0126k0651j9439j7610
56786I89351j5061j1673p655l280J105N251R412J4278K0284K7324L5033M3161
56774A107530N1840O1490P1469P8192P5819O0602L4752N317k0669l9695n1704
56763A434943n8230o0627n9353n4665m7924m1208l5260k9053k2068j5502j0142
56752A000911m554L016J2087K1008K9491L8133M5990N0427M8994M0269K3965K214
$$ y = [551610, 546188, 540507, 534740, 528648, 521853, 515178, 510153, 506969, 504541, 502960, 504187, 509748, 519148, 530995, 544023, 556443, 566239, 573228, 579340, 585833, 591770, 596256, 600476, 606020, 612595, 619094, 625908, 634492, 645383, 658183, 672932, 690068, 709453, 730706, 754232, 780845, 810799, 844216, 881928, 924480, 970126, 1014458, 1051874, 1077224, 1087318, 1082542, 1067177, 1047051, 1026400, 1006961, 989351, 974290, 962617, 954962, 951682, 952787, 958038, 967450, 981728, 1002012, 1029336, 1064369, 1107530, 1159370, 1220860, 1292329, 1370521, 1446340, 1506942, 1541694, 1547011, 1526342, 1486647, 1434943, 1376713, 1316086, 1256733, 1202068, 1154144, 1112936, 1077676, 1048623, 1026555, 1011053, 1000911, 996357, 999373, 1011460, 1032468, 1061959, 1100092, 1146082, 1196509, 1245503, 1285772, 1309737, 1311951]
56740A311951j9921l7331m8274n3804n4999n2560m8222m3931l9692l4254k7744
56729H51219k1782j7100j2948q684m248P63O657J2458J6938K0467K3868K5765
56717H93373K3228J5268L873q275j9264k7435l1764l3170l3585l3632l2722l1141
56705F84754k9830k8320k5235k1045j7870j6301j4798j2657j1046j0367r080o354
56693D81851l810l269m360n458n591m552k638j144j640l942n976o343n611m652
56679D22865l398j993j386j820k172j807j649k399l094k632j552j178j907l283
56665C92595m838n967n895m628l263k618k364j981j646j545j315p55k86o7M30
56650C55857J348J875J418N84L44Q41J492J719J291N73N24J692L243L844L468
$$ y = [1311951, 1292030, 1254699, 1206425, 1152621, 1097622, 1045062, 996840, 952909, 913217, 878963, 851219, 829437, 812337, 799389, 790705, 786457, 787220, 793877, 806335, 823273, 843740, 867608, 893373, 916601, 931869, 935742, 927467, 908203, 880768, 849004, 815834, 782249, 748617, 715895, 684754, 654924, 626604, 601369, 580324, 562454, 546153, 531355, 518698, 507652, 497285, 488205, 481851, 478041, 474772, 470412, 464954, 459363, 454811, 452173, 451029, 449389, 445447, 439471, 433128, 427517, 422865, 419467, 417474, 416088, 414268, 412096, 410289, 408640, 406241, 403147, 400515, 398963, 397785, 395878, 392595, 387757, 381790, 375895, 371267, 368004, 365386, 363022, 361041, 359395, 357850, 356535, 355780, 355494, 355427, 355857, 357205, 359080, 360498, 361082, 361426, 362267, 363759, 365478, 366769, 367342, 367866, 369558, 372801, 376645, 380113]
56635C80113L221L491L693L893N129P565R783J0597J0354R812Q915P416N627L934
56621D73543K308Q79J16o2l74r48r40J38J496K034J528M89m22o46j64J23p31k352
56603D76015l474l720l899m485m955m908m751m852m999m937m687m222l689l771
56589D14666m844n971n916n004m665n294n906n834n271m182k277j15J260J873
56575C62520K513K994K451J371J447L156N292O919P955P776N627K682J330J815
56561D15848J960Q79L53J464K551K047R30N74L41o66j352m95O60J25j506j797
56545D21916m1J991K619J908P25l93j287j960k412k297j193M50J443J380J189
56530D24038J568J865J284K35l71l44J01J035K338L232L071K135J097M28O47K136
$$ y = [380113, 383334, 386825, 390518, 394411, 399540, 407105, 416888, 427485, 437839, 447651, 456566, 463982, 469609, 473543, 475851, 476730, 476846, 476784, 476410, 475462, 474522, 474660, 476156, 478190, 479718, 480207, 479785, 479139, 478975, 479098, 478367, 476015, 472541, 468821, 464922, 460437, 455482, 450574, 445823, 440971, 435972, 431035, 426348, 422126, 418437, 414666, 409822, 403851, 397935, 392931, 388266, 382972, 377066, 371232, 365961, 361779, 359502, 359387, 360647, 362520, 365033, 368027, 370478, 371849, 373296, 376452, 381744, 388663, 396618, 404394, 410021, 412703, 414033, 415848, 417808, 418687, 419040, 420504, 423055, 425102, 426032, 426606, 426947, 426281, 424929, 424434, 425094, 425219, 423713, 421916, 421875, 423866, 426485, 428393, 429118, 428725, 427438, 425478, 423066, 420769, 419576, 420026, 421469, 422849, 424038, 425606, 427471, 428755, 428990, 428619, 428275, 428376, 429411, 431749, 434981, 438052, 440187, 441284, 441712, 442359, 444495]
56514D44495M166N004L761J375n73j179p9K690N987P949P800O585N611N225N368
56499E04185O049O696O394N383N047N877O696O627O269O215N802M405K627J255
56485E79527K35l70K59K216L930L815K031k62k343l799m080l336k805l537n333
56470E66148p426r157r691q488o596o116p570r212r502q762p727o292m654l982
56456D60973m702n611n733n611n749n548m846m744n523n561l911k152k006k673
56442C96603k504j835k038k898l097k512k095j978j447l64P53J659K225K013J051
56427C83536K92L57P38J025J650K509K358R00j27O57K262L273M180N840P232O885
56411D23567N418M439L947L008K095K399L415L536K745K559L455M354M531M355
$$ y = [444495, 448661, 453665, 457426, 458801, 458228, 457049, 456970, 459660, 465647, 473596, 481396, 487981, 493592, 498817, 504185, 510234, 516930, 523324, 528707, 533754, 539631, 546327, 552954, 559223, 565438, 571240, 575645, 578272, 579527, 579762, 579392, 579651, 581867, 585797, 589612, 591643, 591381, 589038, 585239, 581159, 577823, 575018, 571481, 566148, 558722, 549565, 539874, 531386, 524790, 518674, 511104, 501892, 492390, 483628, 475901, 469609, 464955, 460973, 456271, 450660, 444927, 439316, 433567, 428019, 423173, 418429, 412906, 407345, 403434, 401282, 399276, 396603, 394099, 392264, 390226, 387328, 384231, 381719, 379624, 377646, 376199, 375835, 376588, 378247, 380472, 382485, 383536, 383828, 384185, 384923, 385948, 387598, 390107, 392465, 393365, 393238, 393895, 396157, 399430, 403610, 409450, 416682, 423567, 428985, 433424, 437371, 440379, 442474, 444873, 448288, 451824, 454569, 457128, 460583, 464937, 469468, 473823]
56397D73823M023L192J989J030N04K60N57J612K768L216L092K849K210Q97k11
56382E01811k3J260K595L503L923L462K088P89L28J50k55J4J669L161K258p59
56366E25974l307l783k986k283j866j295p12r52k636n117o576n942m601m922o990
56351D72006q425p884o755o468o258m995l355k476k019j327j091j959k849k442
56337D13703j275n75j67P63J862K348K523K977L300L040K748K675J834p4j409
56322D34273r45R6J45k60p5l8j059k062j724q19m89J46K097M002M318M272N586
56305D47464O873N827L585L222M772N602N110N117N755M903K151j30l83N20J587
56290E01975K723L036J225j587k370m81J296J016K86J397L881N565N491M494L848
$$ y = [473823, 477846, 481038, 483027, 484057, 484561, 484821, 485378, 486990, 489758, 492974, 496066, 498915, 501125, 502022, 501811, 501788, 503048, 505643, 509146, 513069, 516531, 518619, 519408, 519736, 519886, 519631, 519645, 521314, 524475, 526733, 525974, 522667, 518884, 515898, 513615, 511749, 510454, 509742, 508790, 506154, 501037, 494461, 488519, 483918, 478996, 472006, 463581, 455697, 448942, 442474, 436216, 431221, 427866, 425390, 423371, 422044, 420953, 418994, 416145, 413703, 412428, 411853, 411686, 412449, 414311, 416659, 419182, 422159, 425459, 428499, 431247, 433922, 435756, 435682, 434273, 433328, 433424, 433569, 433309, 433234, 433196, 432137, 430075, 428351, 427532, 427043, 427189, 429286, 433288, 437606, 441878, 447464, 454337, 460164, 463749, 466971, 471743, 477345, 482455, 487572, 493327, 498230, 500381, 500251, 499868, 500388, 501975, 504698, 507734, 508959, 507372, 505002, 504521, 505817, 506833, 507119, 508516, 512397, 517962, 523453, 527947, 531795]
56275E31795M282N604O813P206P327Q095R439J0632J1458J1929J1642J0545R544
56262F46311R155Q692P972Q329J0237J1741J1326J0572J1449J2672J1789R581
56250G69826R010J0601J2158J2464J2161J1328R376P134O137O027N275M094L818
56237H79409M042L290K058K083L155L766M312O243Q510Q667P296P482R808J1813
56223I61934J2695J4520J8034K1137K2592K3795K5831K7992L0201L3498L7198
56212A229427L8906L8700L9919M4445N0275N5282O0228O6172P1869P5971P9751
56201A850945Q5475R3523J02633J11693J20140J27876J35529J43675J51589J58121
56191C081199J63622J69059J73534J74935J72797J68171J60812J49266J33759
$$ y = [531795, 536077, 541681, 548494, 555700, 563027, 571122, 580561, 591193, 602651, 614580, 626222, 636767, 646311, 655466, 664158, 672130, 680459, 690696, 702437, 713763, 724335, 735784, 748456, 760245, 769826, 778836, 789437, 801595, 814059, 826220, 837548, 846924, 854058, 860195, 866222, 871497, 875591, 879409, 883451, 886741, 888799, 890882, 894037, 897803, 902115, 908358, 916868, 925535, 932831, 940313, 950121, 961934, 974629, 989149, 1007183, 1028320, 1050912, 1074707, 1100538, 1128530, 1158731, 1192229, 1229427, 1268333, 1307033, 1346952, 1391397, 1441672, 1496954, 1557182, 1623354, 1695223, 1771194, 1850945, 1936420, 2029943, 2132576, 2244269, 2364409, 2492285, 2627814, 2771489, 2923078, 3081199, 3244821, 3413880, 3587414, 3762349, 3935146, 4103317, 4264129, 4413395, 4547154]
56182D547154J16208R7288P6200N3391L0673Q637j3042l2835m8149n9237o8952
56171D707336p8292q5460q9775r2989r5993r7711r8162r9293j01795j04254j06251
56160C657361j09124j12706j14722j14518j14077j14177j12844j09095j05151
56151B650947j03273j02894j02119r9740r4988q7829q0203p4444p0070o4806n8702
56140A711879n3939n0500m5902l9781l4855l2536l1215k9640k8216k6299k2309
56129A316687j7378j4761j4614j3682j1150j0051j1317j1435q329n041m711n825
56117A188393n309k956j23K877N766P490Q463J0717J4254J6376J6039J5526J6321
56104A293834J6990J6691J6935J8098J8043J6035J4345J4223J4111J3386J3804
$$ y = [4547154, 4663362, 4760650, 4836850, 4890241, 4920914, 4929551, 4916509, 4883674, 4835525, 4776288, 4707336, 4629044, 4543584, 4453809, 4360820, 4264827, 4167116, 4068954, 3969661, 3867866, 3763612, 3657361, 3548237, 3435531, 3320809, 3206291, 3092214, 2978037, 2865193, 2756098, 2650947, 2547674, 2444780, 2342661, 2242921, 2147933, 2060104, 1979901, 1905457, 1835387, 1770581, 1711879, 1657940, 1607440, 1561538, 1521757, 1486902, 1454366, 1423151, 1393511, 1365295, 1338996, 1316687, 1299309, 1284548, 1269934, 1256252, 1245102, 1235051, 1223734, 1212299, 1203970, 1198929, 1194218, 1188393, 1183084, 1180128, 1180005, 1182882, 1188648, 1196138, 1204601, 1215318, 1229572, 1245948, 1261987, 1277513, 1293834, 1310824, 1327515, 1344450, 1362548, 1380591, 1396626, 1410971, 1425194, 1439305, 1452691, 1466495]
56093A466495J5453J5738J4256J4261J7111J9869K0830K2666K7355L2479L5716
56082A702229L8718M3572M9421N5564O3777P4607Q5550R5697J08042J24151J41046
56071B582374J56329J71621J87402J99088K02241J97667J87818J72728J53633
56062D210901J36009J24093J15636J06037R4059P9594O0126L4463O901j6970l5961
56051D914888n1325o2644p0149p7943r0378j07271j25896j44672j61655j72888
56041C850067j76231j73995j68553j58841j44292j28459j14871j02838r0831q0245
56031B510911p2204o4592n5962m8708m4601m1235l6436l2044k9627k6892k2289
56020B036321j8504j7319j5686j1325p451p196p998o308l375j571M84M158O726
$$ y = [1466495, 1481948, 1497686, 1511942, 1526203, 1543314, 1563183, 1584013, 1606679, 1634034, 1666513, 1702229, 1740947, 1784519, 1833940, 1889504, 1953281, 2027888, 2113438, 2209135, 2317177, 2441328, 2582374, 2738703, 2910324, 3097726, 3296814, 3499055, 3696722, 3884540, 4057268, 4210901, 4346910, 4471003, 4586639, 4692676, 4786735, 4866329, 4926455, 4960918, 4967819, 4950849, 4914888, 4863563, 4800919, 4730770, 4652827, 4562449, 4455178, 4329282, 4184610, 4022955, 3850067, 3673836, 3499841, 3331288, 3172447, 3028155, 2899696, 2784825, 2681987, 2591156, 2510911, 2438707, 2374115, 2318153, 2269445, 2224844, 2183609, 2147173, 2115129, 2085502, 2058610, 2036321, 2017817, 2000498, 1984812, 1973487, 1966036, 1958840, 1950842, 1944534, 1941159, 1939588, 1940072, 1944230, 1950956]
56007A950956O117N243O857Q688Q481Q841J2098J5468J6636J8719K4139K8922
55995B111165K9112K7699K9017L1406L1663L1699L4329L7297L7738L7816L9912
55984B478853M1432M0359M0414M4498M8939N0552N2964N9079O4134O3910O3121
55973C048255O7384P3373P5550P6296Q0411Q5664Q8017R0317R6522J03171J05931
55962C990891J08665J16521J25979J31405J35403J42905J51237J56234J61852
55953E221092J73213J86401J95746K04723K18769K34127K45010K55022K70066
55944G204169K87000L01092L17106L40698L66603L87969M09212M36420M63880
55935A0514149M84465N04552N33649N68181O01111O38226O88199P45698Q01457
$$ y = [1950956, 1957073, 1962316, 1969173, 1977861, 1986342, 1995183, 2007281, 2022749, 2039385, 2058104, 2082243, 2111165, 2140277, 2167976, 2196993, 2228399, 2260062, 2291761, 2326090, 2363387, 2401125, 2438941, 2478853, 2520285, 2560644, 2601058, 2645556, 2694495, 2745047, 2798011, 2857090, 2921224, 2985134, 3048255, 3115639, 3189012, 3264562, 3340858, 3421269, 3506933, 3594950, 3685267, 3781789, 3884960, 3990891, 4099556, 4216077, 4342056, 4473461, 4608864, 4751769, 4903006, 5059240, 5221092, 5394305, 5580706, 5776452, 5981175, 6199944, 6434071, 6679081, 6934103, 7204169, 7491169, 7792261, 8109367, 8450065, 8816668, 9204637, 9613849, 10050269, 10514149, 10998614, 11503166, 12036815, 12604996, 13206107, 13844333, 14532532, 15278230, 16079687]
55926A6079687Q59442R26222R93722J051907J108432J175833J249805J321068
55918B4766118J397063J489217J590414J689384J795545J924187K069402K218656
55910C8939986K381162K573535K792135L030754L310405L658279M074077M553147
55902F5313480N122496N810997O602848P466519Q410245R462006J0622734J1897245
55894A30708570J3340637J5008467J6901517J9041412K1546041K4515839K7901018
55887B68963501L1598490L5484712L8903945M0041428L6396114K6601265J1979288
55880D89968743l930115j7537974k7010678l2379626l4563254l4567975l3249694
55873C06729427l1262345k8993086k6602755k4162996k1725250j9312224j6948343
$$ y = [16079687, 16939129, 17865351, 18859073, 19910980, 21019412, 22195245, 23445050, 24766118, 26163181, 27652398, 29242812, 30932196, 32727741, 34651928, 36721330, 38939986, 41321148, 43894683, 46686818, 49717572, 53027977, 56686256, 60760333, 65313480, 70435976, 76246973, 82849821, 90316340, 98726585, 108188591, 118811325, 130708570, 144049207, 159057674, 175959191, 195000603, 216546644, 241062483, 268963501, 300561991, 336046703, 374950648, 414992076, 451388190, 477989455, 489968743, 486038628, 468500654, 441489976, 409110350, 374547096, 339979121, 306729427, 275467082, 246473996, 219871241, 195708245, 173982995, 154670771, 137722428]
55866A37722428j4710487j2694807j0940183r430070q152062p103143o248484
55859F8443192n528051m904170m366123l896721l473511l097500k784083k527522
55851C7865511k304029k104399j934338j788110j650792j522656j414700j323632
55843B3822855j235689j150749j078667j016080r50258q82414q24620p76806p28275
55834A5179297o79092o38917o06919n72895n36530n06614m82877m56675m28040
55825A0270738m04798l86424l65456l43228l27928l18667l07144k93315k83984
55816G239794k77728k66716k52016k41872k35893k25808k10969j98783j90530
55807E139479j80857j70639j66287j66630j63997j58033j55371j55811j52014
$$ y = [137722428, 123011941, 110317134, 99376951, 89946881, 81794819, 74691676, 68443192, 62915141, 58010971, 53644848, 49748127, 46274616, 43177116, 40393033, 37865511, 35561482, 33457083, 31522745, 29734635, 28083843, 26561187, 25146487, 23822855, 22587166, 21436417, 20357750, 19341670, 18391412, 17508998, 16684378, 15907572, 15179297, 14500205, 13861288, 13254369, 12681474, 12144944, 11638330, 11155453, 10698778, 10270738, 9865940, 9479516, 9114060, 8770832, 8442904, 8124237, 7817093, 7523778, 7239794, 6962066, 6695350, 6443334, 6201462, 5965569, 5739761, 5528792, 5330009, 5139479, 4958622, 4787983, 4621696, 4455066, 4291069, 4133036, 3977665, 3821854, 3669840]
55798C669840j42994j35064j29128j19542j06182r5479q8687q0669p0815o3800
55788B637480n9091n1247m1418l7253m0402m4823m8069n3205n8833n8654n2635
55777B091850m7839m6401m3079l6463l2145l2422l2741l0807l0030l1522l1695
55766A696706l0050l0751l4291l6072l5171l6044l9541m0917l8916l8279m0677
55755A295997m1343l7511l2506k8867k4844k0191j7984j8167j6403j1773q538
55744A037870q070o305j598K175L071M429P790R404P112M162K946J003l280o872
55730A053837p482p413q837j0094r695r246r591q602n353k192m79J398M002N275
55716I85528M709M457M724K818j679n673q025j1146j5508j7859j6908j5742j6424
$$ y = [3669840, 3526846, 3391782, 3262654, 3143112, 3036930, 2941451, 2852764, 2772095, 2701280, 2637480, 2578389, 2527142, 2485724, 2448471, 2408069, 2363246, 2315177, 2261972, 2203139, 2144485, 2091850, 2044011, 1997610, 1954531, 1918068, 1885923, 1853501, 1820760, 1789953, 1759923, 1728401, 1696706, 1666656, 1635905, 1601614, 1565542, 1530371, 1494327, 1454786, 1413869, 1374953, 1336674, 1295997, 1254654, 1217143, 1184637, 1155770, 1130926, 1110735, 1092751, 1074584, 1058181, 1046408, 1037870, 1029800, 1023495, 1021897, 1024072, 1027143, 1031572, 1039362, 1048766, 1055878, 1060040, 1062986, 1063989, 1060709, 1053837, 1046355, 1038942, 1030105, 1020011, 1010316, 1001070, 991479, 982877, 977524, 975332, 974853, 976251, 980253, 985528, 990237, 994694, 999418, 1002236, 1000557, 994884, 986859, 975713, 960205, 942346, 925438, 909696, 893272]
55703H93272j6977j5829j4455j3610j1669q787p935r695j0780r706r128j0295
55691G54406j0314p566n165n959q250r416j0037j1615j3588j5117j6726j8196
55679F22457j8005j6489j6032j6821j6191j3569j1934j2666j3200j1680r787r031
55667D57052q271o981o923q525r493q855q480q821p579m614l463n548p323o129
55653C56047m393m747n147k721R32K289J199J96N47J797L463M735M425K987K569
55638C64178L650M111K974K064K485K730J987J993L589M723M050L476M755O495
55624D13260O764O027N357M308K539J075L83l29p07O78K781K257j181l605k871
55609D36736j729k542l117r20K361L929M320N275O092N636N474P534J0613J2317
$$ y = [893272, 876295, 860466, 846011, 832401, 820732, 811945, 804010, 794315, 783535, 773829, 764701, 754406, 744092, 736526, 731361, 725402, 717152, 707736, 697699, 686084, 672496, 657379, 640653, 622457, 604452, 587963, 571931, 555110, 538919, 525350, 513416, 500750, 487550, 475870, 466083, 457052, 448781, 441800, 434877, 426352, 416859, 408004, 399524, 390703, 383124, 378510, 375047, 369499, 362176, 356047, 351654, 346907, 341760, 339039, 339971, 342260, 343459, 343655, 344202, 345999, 349462, 354197, 358622, 361609, 364178, 367828, 371939, 374913, 376977, 379462, 382192, 384179, 386172, 389761, 394484, 398534, 402010, 406765, 413260, 420024, 426051, 431408, 435716, 438255, 439330, 439713, 439384, 438677, 439355, 442136, 444393, 443212, 439607, 436736, 435007, 432465, 429348, 428428, 430789, 434718, 439038, 444313, 450405, 456041, 461515, 469049, 479662, 491979]
55595D91979J2642J2818J2632J1586J0742J0830J0352P959M725J887j331n311
55583E81510p947p761o884q064j0584j1906j1517j0513r102p166n782n709n778
55570D72797m986m634o340r424j2160j4026j4964j4434j2893j2195j2816j2836
55558C41089j1373j0359j1057j1622j0382q702q053p204n141l960n563p827p545
55545B32301n233l669l538l729m232n394n793m100j810j145j538j035K84J151
55531A92520J863L178L908K715R54O99J222N58p48p02L90P34O23J772L634L788
55515B17108J888J70M8R16K171L891N529O231O314O460O175N018M348N323O295
55500B77885N002K566K025L346L319N67k526l622l314l255l709m223n028o551
$$ y = [491979, 504621, 517439, 530071, 541657, 552399, 563229, 573581, 581540, 586265, 588152, 586821, 581510, 573563, 565802, 558918, 550854, 540270, 528364, 516847, 506334, 497232, 490066, 484284, 478575, 472797, 467811, 463177, 456837, 447413, 435253, 421227, 406263, 391829, 378936, 366741, 353925, 341089, 329716, 319357, 308300, 296678, 286296, 277594, 269541, 262337, 257196, 253236, 247673, 239846, 232301, 227068, 223399, 219861, 216132, 211900, 206506, 200713, 196613, 194803, 193658, 192120, 191085, 191369, 192520, 194383, 197561, 201469, 204184, 205138, 205837, 207059, 207617, 206869, 206167, 206557, 207291, 207914, 209686, 213320, 217108, 218996, 219166, 219214, 220130, 222301, 226192, 231721, 237952, 244266, 250726, 256901, 261919, 266267, 271590, 277885, 282887, 285453, 287478, 290824, 294143, 294710, 292184, 288562, 285248, 281993, 278284, 274061, 269033, 262482]
55486B62482q374r483r088p219m913l461k953k368j537j525k323k026K07K231
55472B09650J954O17O98K086K969L211M010N034M936M205M622N963O156M755L715
55457B64581M269N452O205O867P879Q751Q861Q050O247L660J318kj080l177n968
55442C21913q100r401j0785j2208j2598j1885j1280j1248j0905r770q706q516
55430A96511q750q469p478o417o074o588p135o706n421m394m007l446k395j834
55416A17397k243k483j737j189k137l661l956l165k890l429l346j745M44J679
55402H7539J384L43o5O16J162K48j289j424k27n8j795l369l233k731l199l203
55386G0699j045J964L276K691J734Q64l11j214j071n09m02l37R8Kq52p42R50J621
$$ y = [262482, 254108, 244625, 235537, 228318, 223405, 219944, 216991, 214623, 213086, 211561, 209238, 207212, 207419, 209650, 211604, 212221, 212919, 215005, 217974, 221185, 225195, 230229, 235165, 239370, 243992, 249955, 256111, 260866, 264581, 268850, 274302, 280507, 287374, 295253, 304004, 312865, 320915, 327162, 330822, 332140, 332138, 331058, 327881, 321913, 313813, 304412, 293627, 281419, 268821, 256936, 245656, 234408, 223503, 213733, 205027, 196511, 187761, 179292, 171814, 165397, 159323, 152735, 145600, 138894, 133473, 129079, 125072, 121626, 119231, 117397, 115154, 112671, 110934, 109745, 107608, 103947, 99991, 96826, 93936, 90507, 87161, 85416, 85860, 87539, 88923, 89266, 89201, 89817, 90979, 91227, 89938, 88514, 88287, 88229, 86434, 83065, 79832, 77101, 73902, 70699, 69654, 71618, 74894, 77585, 79319, 80183, 79872, 78658, 77587, 77078, 76676, 76339, 76437, 76439, 75587, 74845, 75795, 77416]
55368G7416p23l479k865K84J918Q84k96j19L54N96J490K775K876J796J307J862
55352H6076K000J139L72K04p9n84o80o56j193j435n0K056K770K177K101K529J775
55335I8522O2n01K04l6j591k050m93O95k84j919k200j459q10j57O23O49k31o11
55317H8413J66P68J57p32q75q38j281j581j261j172j868k333j709q41q29j270
55301G2914j136l26N58R64L17j492l061k524l20R10Pj094o15K63m06j970k154
55284F0835n32R69Q34l22r09k19J052J719J395P74N01K14n99j329j022r9J13m63
55266F2912m47Q00K180K386J367l6r56r45n13q50k055k335m88J629J298r85k210
55249F0752j337k90j84K55J647K225P03j474k399k197j687n41J451K845K254N46
$$ y = [77416, 76693, 73214, 70349, 70633, 72551, 73435, 73139, 73020, 73374, 73970, 75460, 78235, 81111, 82907, 84214, 86076, 88076, 89215, 89587, 89791, 89712, 89128, 88448, 87792, 86599, 85164, 85114, 87170, 89940, 92117, 94218, 96747, 98522, 98584, 98083, 98287, 98251, 96660, 94610, 94117, 94812, 94528, 92609, 90409, 88950, 88140, 87983, 88606, 89255, 89024, 88413, 88579, 89347, 89504, 88772, 87897, 87059, 85778, 84197, 82936, 81764, 79896, 77563, 75854, 75013, 74184, 72914, 71778, 71452, 72010, 72974, 73291, 71799, 68738, 66214, 65894, 66804, 66811, 65717, 65102, 65365, 64959, 62989, 60835, 60303, 61272, 62106, 61784, 60875, 60656, 61708, 63427, 64822, 65596, 66097, 66311, 65712, 64383, 63361, 63262, 63375, 62912, 62465, 63265, 65445, 67831, 69198, 69162, 68206, 67261, 66748, 65898, 63843, 61508, 61020, 62649, 63947, 62962, 60752, 59415, 59125, 58941, 59196, 60843, 63068, 63771, 62297, 59898, 57701, 56014, 55473, 56924, 59769, 62023, 62569]
55233F2569l87j71J62nn33j230j706j234J99J439J690J683K291K924K541J565
55217G1797J404K261K716J559o60k255k273j406r47j023o04M71P79m78j675q72
55201F8794J191K170J622J115J138M64j029j633p00N2o86j822j918j392j155q34
55185F5377Q7P49K45n52j80J089J709J167M96O00J194J505J296R98R64P64l98
55168G7110k197k897j416Q90J799J081K73O4k18o64m18M70P88J41n33p44r25q57
55150G1747K38J561J086j085k080k93K141K507J286Q26J658K196J465K65j57M25
55134H3786J037L60j726l408k692m5J939J758M29n68j073j327j028l01j80j113
55118G5848k098k108j250L8J703L378M195L855K770R60j706m114m628l515k608
$$ y = [62569, 62182, 62011, 62173, 62168, 61635, 60405, 58699, 57465, 57664, 59103, 60793, 62476, 64767, 67691, 70232, 71797, 73201, 75462, 78178, 79737, 79077, 76822, 74549, 73143, 72196, 71173, 70569, 71040, 71819, 71341, 69666, 68794, 69985, 72155, 73777, 74892, 76030, 76494, 75465, 73832, 73132, 73184, 72498, 70676, 68758, 67366, 66211, 65377, 65464, 66213, 66458, 65906, 65726, 66815, 68524, 69691, 70187, 70787, 71981, 73486, 74782, 75780, 76744, 77508, 77110, 74913, 72016, 70600, 71490, 73289, 74370, 74643, 74707, 74489, 73825, 73407, 73877, 74665, 74806, 74273, 73529, 72604, 71747, 71985, 73546, 74632, 73547, 71467, 71174, 73315, 75822, 77108, 77934, 79592, 81788, 83253, 83518, 83361, 83786, 84823, 85183, 83457, 80049, 77357, 77312, 79251, 81009, 81438, 80870, 79797, 78470, 77442, 77141, 76961, 75848, 73750, 71642, 70392, 70430, 72133, 75511, 79706, 83561, 86331, 87291, 85585, 81471, 76843, 73328, 70720]
55103G0720k277j105R49J813P36k36L62J178Q33M22J158J832R71m13o88n93j647
55086G4015k965k429l34P61k80j833j929m47J162J437J95j099p85Q45J825J290
55070F9429N58Q24J556K061K824L981M212K706P47k1M65J621L357M933M659K521
55054A06433J132K085L212J722j538l580l613l197l017k273r94l96q33j189m22
55039I3532J465L682M888L978J615j3k2K8j049j987j402k87j5L35K103L916L366
55022A14133Q65q86p63JL84N57O63P72J554L113L782K250j9p22j92l64j209j065
55004A22854o8j38j551k400j837j154j204j120k59P23J357K038K705K579J643
54989A24168Q04K84n54j600j811q81K95R83J202J041O73O74J058O22j182k588
$$ y = [70720, 68443, 67338, 68287, 70100, 70836, 70600, 70962, 72140, 72973, 73395, 74553, 76385, 77356, 76943, 76255, 75662, 74015, 71050, 68621, 68287, 69048, 68768, 66935, 65006, 64559, 65721, 67158, 67353, 66254, 65469, 66314, 68139, 69429, 69987, 70811, 72367, 74428, 77252, 81233, 85445, 88151, 88898, 88877, 89342, 90963, 94320, 99253, 103912, 106433, 107565, 109650, 112862, 114584, 113046, 109466, 105853, 102656, 99639, 97366, 96372, 95976, 95143, 93954, 93532, 94997, 98679, 103567, 107545, 109160, 109147, 109125, 109153, 108104, 106117, 104715, 104428, 104413, 104748, 106851, 110767, 114133, 114998, 114112, 113349, 113350, 113734, 114291, 114954, 115726, 117280, 120393, 124175, 126425, 126406, 125684, 125492, 125128, 123919, 122854, 122786, 122648, 121097, 118697, 116860, 115706, 114502, 113382, 113123, 113846, 115203, 117241, 119946, 122525, 124168, 124972, 125256, 124702, 123102, 121291, 120410, 120705, 121688, 122890, 123931, 124604, 125278, 126336, 126958, 125776, 123188]
54973A23188j689M69J229J85p38o93o80j000o56L91Q66N39N82J163J025M5j40
54956A24086J192K643K974K709K610K358J553M87o88k062k874k105m67L2j026
54941A31422j887j402l69M04J286K178J833kj518j185K58J125R19J49p46j379
54925A31086j370r74q24o81L29J926K578J665L21l32l15J88J289K377K356J556
54909A41175J675L081L917K857J085L44N69P49Q92J786L507N349O618O921O383
54894A86908N968O686Q094Q745Q415Q493R744J1145J1683J1832J2377J3012J3110
54881C16212J2765J2239J1250R555P372M749J398k401n930r264j3024j6493j7666
54868C10762j6014j3589j2472j2441j2181j1357j0256q648o437m631m215m592
$$ y = [123188, 121499, 121968, 123197, 123382, 122644, 121951, 121271, 120271, 119615, 120006, 120872, 121411, 121993, 123156, 124181, 124226, 124086, 125278, 127921, 130895, 133604, 136214, 138572, 140125, 140612, 139924, 137862, 134988, 132883, 132416, 132448, 131422, 129535, 128133, 127764, 128168, 129454, 131632, 133465, 133463, 131945, 130760, 131018, 132143, 133062, 133211, 132465, 131086, 129716, 128742, 127918, 127237, 127566, 129492, 132070, 133735, 134056, 133724, 133409, 133597, 134886, 137263, 139619, 141175, 142850, 145931, 149848, 152705, 153790, 154134, 154703, 155452, 156344, 158130, 161637, 166986, 173604, 180525, 186908, 192876, 199562, 207656, 216401, 224816, 233309, 243053, 254198, 265881, 277713, 290090, 303102, 316212, 328977, 341216, 352466, 362021, 369393, 374142, 375540, 373139, 367209, 357945, 344921, 328428, 310762, 294748, 281159, 268687, 256246, 244065, 232708, 222452, 213804, 207367, 202736, 198521, 193929]
54856A93929m223k543m48Q69J019O43Q12J896L139L819M493O103Q296R979J1271
54841B39054J3167J5337J6171J5273J3982J2987J1370Q616N649K996k30m463q543
54828C41366j1417j3406j4798j4919j3757j2788j2800j2456j0549q222p347p822
54816B01085q065p357o146m848l615k741k253j645q29n14j002j570j682j734j921
54801A55163j689r61n99q28p68l08p36k406l571k912j541j047j195j122j247k152
54785A32081k968k778k345k646k963k293j327j074p92N46J959K008J445J793K143
54770A22789L55l024m948l998j805j50Q19J217P71J88R33K780L574K370J000J443
54754A24314L184M372M284L433K266J071O16J635L696N269N052L143J042N11K092
$$ y = [193929, 189706, 187163, 186715, 187584, 188603, 189246, 190058, 191954, 195093, 198912, 203405, 209508, 217804, 227783, 239054, 252221, 267558, 283729, 299002, 312984, 325971, 337341, 345957, 351606, 354602, 354372, 349909, 341366, 329949, 316543, 301745, 286826, 273069, 260281, 247481, 235025, 224476, 216254, 208907, 201085, 193020, 185663, 179517, 174669, 171054, 168313, 166060, 164415, 163586, 163072, 162070, 160500, 158818, 157084, 155163, 153474, 152513, 151914, 151086, 150318, 150010, 149274, 146868, 143297, 140385, 138844, 137797, 136602, 135480, 134233, 132081, 129113, 126335, 123990, 121344, 118381, 116088, 114761, 113687, 112895, 113441, 115400, 117408, 118853, 120646, 122789, 123144, 120120, 115172, 111174, 109369, 109219, 110038, 111255, 112026, 112214, 113147, 115927, 119501, 121871, 122871, 124314, 127498, 131870, 136154, 139587, 141853, 142924, 143540, 145175, 148871, 154140, 159192, 162335, 163377, 163888, 165980]
54739A65980M698O863Q173R210J0440J1769J2884J3496J3497J3324J3818J5196
54727B99348J6654J7452J7683J7367J5682J2018P158K309k267o585r627j0294
54715C76898r226q209q001p982p739p443o892n749m777n192o614p179n968l984
54701B81943k225l15K272N007P180Q950J0596J1650J1709J1485J2103J3751J5714
54688C89820J7325J8166J7807J6227J4276J2817J1342Q297L188k371o376q897
54676D91621j1891j6464k1176k3641k3201k1210j9102j7311j5868j4839j3837
54665B93081j2220j0225q974q862q890q274p608p633p755o850m998l281k314j874
54651A93323j668j621j509j151p57o28p40r99j398j513o84P16J043n81k686l032
$$ y = [165980, 170678, 177541, 185714, 194924, 205364, 217133, 230017, 243513, 257010, 270334, 284152, 299348, 316002, 333454, 351137, 368504, 384186, 396204, 403362, 405671, 403404, 396819, 387192, 376898, 367672, 359463, 351462, 343480, 335741, 328298, 321406, 315657, 310880, 305688, 299074, 291895, 285927, 281943, 279718, 279403, 281675, 286682, 293862, 302812, 313408, 325058, 336767, 348252, 360355, 374106, 389820, 407145, 425311, 443118, 459345, 473621, 486438, 497780, 506077, 509265, 506894, 500518, 491621, 479730, 463266, 442090, 418449, 395248, 374038, 354936, 337625, 321757, 306918, 293081, 280861, 270636, 261662, 252800, 243910, 235636, 228028, 220395, 212640, 205790, 200792, 197511, 195197, 193323, 191655, 190034, 188525, 187374, 186617, 185989, 185249, 184250, 182852, 181339, 180655, 181371, 182414, 181833, 179147, 176115]
54635A76115j238J127K584K750J780L3j627k265j773q34o5L74O26J102K206L622
54619A84517M411M237L821L694L507L195L639N161O467O438N922O272P054O930
54605B55265O062N673N837N608N078N152N426M501K650J982L305M904N279N249
54591C21971O153P579Q299Q361Q792R976J1577J3551J5938J8006J8777J8410J8037
54578D85427J8049J7334J4623R994M611p05n993j1326j6178j9903k2315k3323
54566D50295k2661k0746j9180j9028j9001j6912j3033j0092r485r502q321o707
54554B75627o130n955m654k576j203m89P46K259K499J216k03j081k119l560m590
54539B49787m976n422n904n319l422j609j143j880l181m647n551n017l471k462
$$ y = [176115, 174877, 176004, 178588, 181338, 183118, 183151, 181524, 179259, 177486, 176652, 176587, 176961, 177587, 178689, 180895, 184517, 188928, 193165, 196986, 200680, 204187, 207382, 211021, 216182, 222649, 229087, 235009, 241281, 248335, 255265, 261327, 267000, 272837, 278445, 283523, 288675, 294101, 298602, 301252, 303234, 306539, 311443, 316722, 321971, 328124, 335703, 344002, 352363, 361155, 371131, 382708, 396259, 412197, 430203, 448980, 467390, 485427, 503476, 520810, 535433, 545427, 550038, 549333, 543340, 532014, 515836, 495933, 473618, 450295, 427634, 406888, 387708, 368680, 349679, 332767, 319734, 309642, 300157, 290655, 282334, 275627, 269497, 263542, 258888, 256312, 255109, 254620, 255366, 257625, 260124, 261340, 261137, 260056, 257937, 254377, 249787, 244811, 239389, 233485, 228166, 224744, 223135, 221992, 220112, 216931, 212284, 206733, 201716, 198245, 195783]
54525A95783k528k605k153k273l700n119m796k950j244n59l94l5O48J281J200
54510A70556n5j980l168k645q23J092K178K092J047p4k87L48O41j17r93m31J832
54493A69213M352N381M448K579J199Q66J164J678K414L092K910J827J231K333
54479B04687M398N747O092O569P696Q726R065R053R070R032Q852Q443P217M741
54465C09388J820k22j406k867m738n900o092o663q429j0196j0333q815o908n611
54451B33028n141n282n554n496n088m495l512k048r37j092j895j714k43J017Q94
54436A92442p2p88q51k89P01J418J224P44J185K340K772K219J976K474K422J232
54420B11149J91J94K09n44p11J086L644M553L271J191n08j496j573q68l20o58
$$ y = [195783, 193255, 190650, 188497, 186224, 182524, 177405, 172609, 169659, 168415, 167856, 167462, 167427, 168075, 169356, 170556, 170501, 168521, 165353, 162708, 161885, 162977, 165155, 167247, 168294, 168220, 167933, 168281, 168922, 168805, 167812, 167381, 169213, 173565, 178946, 183394, 185973, 187172, 188038, 189202, 190880, 193294, 196386, 199296, 201123, 202354, 204687, 209085, 214832, 220924, 227493, 235189, 243915, 252980, 262033, 271103, 280135, 288987, 297430, 304647, 309388, 311208, 310986, 309580, 306713, 301975, 296075, 289983, 283320, 274891, 264695, 254362, 245547, 238639, 233028, 227887, 222605, 217051, 211555, 206467, 201972, 198460, 196412, 195475, 194383, 192488, 190774, 190531, 191548, 192442, 192370, 191582, 190731, 190442, 191143, 192561, 193785, 194529, 195714, 198054, 200826, 203045, 205021, 207495, 209917, 211149, 211340, 211534, 211743, 211199, 210488, 211574, 215218, 219771, 223042, 224233, 223725, 222229, 220656, 219788, 219468, 218810]
54404B18810j369j678j720j683q44J096K599J944l30k148k532k074j282k47M13
54389B08955j01j376k222k367k502k846k994l044l415l611k682j018j75n52p40
54374A79310K59J490J541N47l08o41j167k297l323l306k352j505j269q17P23K585
54358A69470L034J873R17J408K251J840O32M51J826L540M514M786M693M421M323
54343B09979M650M953M755M631N342O163N625M079L670N137O359N268K876J769
54329B75256K462K987J906kj519k858m717o334n986l510j103r79k853m521m440
54314B43789l018j615j264k335m369n897n365k916m98L38O6%K80J23n04p47l66
54297B15702k30q75j506j046L15J260J036M12O90J995L114L181K942L702N337
$$ y = [218810, 217441, 215763, 214043, 212360, 211516, 212612, 215211, 217155, 216825, 214677, 212145, 210071, 208789, 208542, 208955, 208854, 207478, 205256, 202889, 200387, 197541, 194547, 191503, 188088, 184477, 181795, 180777, 180602, 180050, 179310, 179569, 181059, 182600, 183147, 182839, 182198, 181031, 178734, 175411, 172105, 169753, 168248, 166979, 166162, 166885, 169470, 172504, 174377, 175294, 176702, 178953, 180793, 181425, 181876, 183702, 187242, 191756, 196542, 201235, 205656, 209979, 214629, 219582, 224337, 228968, 234310, 240473, 246098, 250177, 253847, 258984, 265343, 270611, 273487, 275256, 277718, 280705, 282611, 282609, 281090, 278232, 273515, 267181, 261195, 257685, 256582, 255603, 252750, 248229, 243789, 240771, 239156, 237892, 235557, 231188, 225291, 219926, 217010, 216512, 216850, 216916, 216916, 217196, 217319, 216815, 216068, 215702, 215472, 214597, 213091, 212045, 212360, 213620, 214656, 215068, 215758, 217753, 220867, 224048, 226990, 230692, 236029]
54282B36029O388O109N306M720L710J525q77j600l02J170J025m28j481j408j276
54267B58610k287m008m979m798m533m823m817l841l026l853n838p179p315p097
54253A90216o781n832m700m626n288m841l015j824k247k571j517o45j668l383
54239A41278l685k956k857l049k028l02J88m95l71Q93J261l18k312l074k737j917
54223A17519n63R63J475P15QL02Q54P12J44l07q37j475j415l24P60R32Q46J552
54205A21861K806L622L827L826L452K232N87l64j22P58J437J394N16p82j660j628
54189A41762j041n70m22m77o88q50m24Q29K192K681K125J095n0j257k018j390
54173A41497Q05L209M015K821J065M30J105J848J605N62m79j161j636j968k024
$$ y = [236029, 242417, 248526, 253832, 258552, 262262, 263787, 262910, 261310, 261008, 262178, 263203, 262775, 261294, 259886, 258610, 256323, 252315, 247336, 242538, 238005, 233182, 228365, 224524, 221498, 217645, 211807, 204628, 197313, 190216, 183435, 177603, 172903, 168277, 162989, 158148, 155133, 153309, 151062, 148491, 146974, 146329, 144661, 141278, 137593, 134637, 131780, 128731, 126703, 126401, 126589, 126094, 125723, 126616, 127877, 127559, 125247, 122173, 119436, 117519, 116956, 117919, 119394, 120109, 120117, 120419, 121273, 121985, 122129, 121822, 120985, 119510, 118095, 117771, 118531, 119463, 120309, 121861, 124667, 128289, 132116, 135942, 139394, 141626, 142213, 141849, 141727, 142485, 143922, 145316, 145832, 145050, 143390, 141762, 140721, 140151, 139729, 139252, 138564, 137714, 137290, 138119, 140311, 142992, 145117, 146212, 146162, 144905, 142887, 141497, 142302, 145511, 149526, 152347, 153412, 153842, 154947, 156795, 158400, 158962, 158483, 157322, 155686, 153718, 151694]
54158A51694j750j207n40j78p02j965k890k724k057j814j795j278o33r51k120
54143A29090k762k364j973k232k132p20J127J798J152M41M71R27J257J285R61
54128A26326L59j45k48k42n15o73O3J577K694K501J236k46j440k261k698k750
54112A23538k503k021j276m56qj03k21L31J496K320J857N0k246l828l797k158
54096A10975q8Q32J77p93p22O2Q3r54j524l70J734L120L427L536L791L512K370
54079A29168J058J76o15j631k167j395N5M80p01k031j777j45J012N36p85j553
54063A19685j562j579j794j434lJ834K927K673J231p84k450k952k373j729j887
54048A09803k564k769j939l57J262K273K404J861J115O19O84J475K491K414M04
$$ y = [151694, 149944, 148737, 148197, 148019, 147317, 145352, 142462, 139738, 137681, 135867, 134072, 132794, 132161, 131210, 129090, 126328, 123964, 121991, 119759, 117627, 116907, 118034, 119832, 120984, 121425, 121896, 122823, 124080, 125365, 126326, 126685, 126540, 126292, 126050, 125535, 124862, 124925, 126502, 129196, 131697, 132933, 132687, 131247, 128986, 126288, 123538, 121035, 119014, 117738, 117282, 117274, 117171, 116950, 117281, 118777, 121097, 122954, 123004, 120758, 116930, 113133, 110975, 110887, 111719, 111896, 111103, 110381, 110443, 110526, 109572, 108048, 107678, 109412, 112532, 115959, 119495, 123286, 126798, 129168, 130226, 130402, 129787, 128156, 125989, 124594, 124649, 125129, 124428, 122397, 120620, 120475, 121487, 122023, 121238, 119685, 118123, 116544, 114750, 113316, 113313, 115147, 118074, 120747, 121978, 121194, 118744, 115792, 113419, 111690, 109803, 107239, 104470, 102531, 102174, 103436, 105709, 108113, 109974, 111089, 111708, 112392, 113867, 116358, 118772, 119176]
54033A19176k368l498k109J64J383J502J599J983K147K015J944J862J394P14L12
54018A28220J52j76o29q75j103j730k442k331j088N60J676J921J583J294J545
54003A26577K225K895L607M780N870N341K854N25O63K770M314M083L247L071L183
53988A76005K627J460M53j13o49j455k053j493N49K949L980L266K180K043K731
53973A92480L601M666N946O647O230N443N208N243M943M732N138N594N629O148
53959B67648P567P934N394J726N67K417M307M411L925L890L381J895P02M17k61
53944C15920j908k839k003j219k474m739n494m175k159o47l27j928n081p476p077
53929B66374m611k403j485j356j741k769l862m132l686l298l194l264l805m844
$$ y = [119176, 116808, 113310, 111201, 111365, 112748, 114250, 115849, 117832, 119979, 121994, 123938, 125800, 127194, 127908, 128220, 128372, 128196, 127567, 126692, 125589, 123859, 121417, 119086, 117998, 118558, 120234, 122155, 123738, 125032, 126577, 128802, 131697, 135304, 140084, 145954, 151295, 154149, 154674, 155337, 158107, 162421, 166504, 169751, 172822, 176005, 178632, 180092, 180545, 180432, 179783, 178328, 176275, 174782, 175331, 178280, 182260, 185526, 187706, 189749, 192480, 196081, 200747, 206693, 213340, 219570, 225013, 230221, 235464, 240407, 245139, 250277, 255871, 261500, 267648, 275215, 283149, 288543, 290269, 290836, 293253, 297560, 301971, 305896, 309786, 313167, 315062, 315764, 316181, 315920, 314012, 311173, 309170, 307951, 305477, 300738, 295244, 291069, 288910, 288263, 287936, 286008, 280927, 273451, 266374, 261763, 259360, 257875, 256519, 254778, 252009, 248147, 244015, 240329, 237031, 233837, 230573, 226768, 221924]
53915B21924n361m499k909j625m30J229K499K168Q28J44L29J50p10j180p19J7
53899B11855N28R39R68R2r85o75J117K478K033O89Q4M48R64J383K264L913N760
53882B33855O717O064M242K717K597L488M306M870N785O921P293O596N719N256
53868C06426M504K601k9k038k541j767p42m52q78o70J479M990P623P928O664N454
53852C38552M866M581M687N605O988P772P618P422Q103R358J0185J0207R852R236
53838D45032P703M891J731l34r73j178j731k218j869q40j64p18k484m610n993
53823D36245o236o221p235r273j0806j0629r325q312q083q092p945p810p835p886
53809C20557p812p441o504n079l929l865m923o420p543p522n932l409j592j520
$$ y = [221924, 216563, 212064, 209155, 207530, 207100, 208329, 210828, 212996, 213824, 213968, 214297, 214447, 213737, 212557, 211838, 211855, 212383, 213322, 214290, 214382, 213397, 212722, 213839, 216317, 218350, 219039, 219123, 219571, 220535, 221918, 224182, 228095, 233855, 240572, 246636, 250878, 253595, 256192, 259680, 263986, 268856, 274641, 281562, 288855, 295451, 301170, 306426, 310930, 313531, 313502, 311464, 308923, 307156, 306414, 305962, 305084, 304414, 305893, 310883, 318506, 326434, 333098, 338552, 343418, 347999, 352686, 358291, 365279, 373051, 380669, 388091, 396194, 405552, 415737, 425944, 435796, 445032, 452735, 457626, 459357, 459023, 458050, 456872, 455141, 452923, 451054, 450214, 450050, 449332, 446848, 442238, 436245, 430009, 423788, 416553, 407280, 396474, 385845, 376520, 368208, 360125, 352033, 344088, 336278, 328443, 320557, 312745, 305304, 298800, 293721, 289792, 285927, 281004, 274584, 267041, 259519, 253587, 250178, 248586, 247066]
53795B47066k538l380l744l934l736k985k647l779n539n801l966j685n27l30l83
53780B02092p64j618k225j901j120p77q41o05J44R21J256R71J11q73j226p02J5
53763A92858J83k6O7O25J298J885K270K051R69l21o80K11J591K636L185L411L465
53746B15678L630M179M811M801M114L694M250N287N931O180O547O898O703O223
53732B88926O349P037P129O152N193N277N897O074N957O118N931M296J825O28
53718C62789J563L010L065J795N29l24j615l864o134o776n203k764j702k852m744
53703C36773n476n030m873n625o359o247n527m569l288k033j715k422l073l028
53689B77508k866k879k306j093p34j906k760j507L25k73l260n267m104j341L10
$$ y = [247066, 244528, 241148, 237404, 233470, 229734, 226749, 224102, 220323, 214784, 208983, 205017, 203332, 202805, 202475, 202092, 201328, 199710, 197485, 195584, 194464, 193687, 192846, 192241, 192385, 193306, 194562, 195533, 195644, 194771, 193545, 192843, 192858, 193041, 193015, 193082, 193707, 195005, 196890, 199160, 201211, 202180, 201859, 201179, 201390, 202981, 205617, 208802, 212213, 215678, 219308, 223487, 228298, 233099, 237213, 240907, 245157, 250444, 256375, 262555, 269102, 276000, 282703, 288926, 295275, 302312, 309441, 315593, 320786, 326063, 331960, 338034, 343991, 350109, 356040, 360336, 362161, 362789, 364352, 367362, 370427, 372222, 372751, 372427, 370812, 366948, 360814, 354038, 348835, 346071, 344369, 341517, 336773, 331297, 326267, 321394, 315769, 309410, 303163, 297636, 293067, 289779, 287746, 286031, 283609, 280536, 277508, 274642, 271763, 269457, 268364, 267630, 265724, 262964, 261457, 261782, 261509, 258249, 252982, 248878, 247537, 247847]
53674B47847K98j26k15k62m50k96P09K414L969M443L668K383J329N00l52r41q22
53657B64096k15L43Q30J394J562Q32j17LJ264K384K607K589L069L637L451K422
53641B90151J199M05K84O07P74M61K20Q45K136K990K881K509K691L401M211M957
53625C20722N471N310M350L255K769K799K709K298K075K452L115L305K724J882
53611C65236J459J456J331R59Q95J511K366K748K419J489J46j158j810j802j719
53596C75526j550n06J314K223J145m94o49K96K25j333k511k000p00J1J23K40L58
53579C71718K75K84O24R31R00Q83J332K149K947L422L222K093N16l95P9J620L283
53562C95883M165L875K996K767L672M786N191N340N815N717M206K911M285P533
$$ y = [247847, 248145, 248019, 247804, 247542, 247092, 246796, 247505, 249919, 253888, 258331, 261999, 264382, 265711, 266211, 265859, 264918, 264096, 263881, 264224, 265054, 266448, 268010, 268842, 268725, 268728, 269992, 272376, 274983, 277572, 280641, 284278, 287729, 290151, 291350, 291755, 292039, 292646, 293420, 293881, 294101, 294946, 297082, 300072, 302953, 305462, 308153, 311554, 315765, 320722, 326193, 331503, 335853, 339108, 341877, 344676, 347385, 349683, 351758, 354210, 357325, 360630, 363354, 365236, 366695, 368151, 369482, 370441, 371336, 372847, 375213, 377961, 380380, 381869, 382015, 380857, 379047, 377245, 375526, 373976, 373470, 374784, 377007, 378152, 377658, 377009, 377305, 377530, 376197, 373686, 371686, 370986, 370997, 371120, 371360, 371718, 371993, 372277, 372901, 373832, 374732, 375615, 376947, 379096, 382043, 385465, 388687, 390780, 391296, 390901, 390980, 392600, 395883, 400048, 403923, 406919, 409686, 413358, 418144, 423335, 428675, 434490, 440207, 444413, 447324, 451609, 459142]
53548D59142Q995P248N082N205O549O791O280O877Q403R037Q604Q839J0297J1381
53534E68730J0910R810R462R676R350Q358P862Q737J0299J0954J0158R214R424
53521F92944R978Q973O520N094N980P228O564M851M559N736N955M134K080J624
53507G72220K131J994J117N76N69R7j407l171l965l330j687K47J702J855K81k298
53491G66931m201m321l135j790n63Q30J777J067j113k821k672j417m42K28J356
53476G49714K830L867M391M998N795O351O653P113P849Q727R969J1803J3764J5216
53462H59040J6318J7515J8379J8180J7588J8405K1241K4537K6505K7160K7756
53451A092624K8940L0249L1111L1492L1633L1731L2164L3657L6771M1038M4874
$$ y = [459142, 468137, 475385, 480467, 485672, 492221, 499012, 505292, 512169, 520572, 529609, 538213, 547052, 557349, 568730, 579640, 589450, 598912, 608588, 617938, 626296, 634158, 642895, 653194, 664148, 674306, 683520, 692944, 702922, 711895, 718415, 723509, 729489, 736717, 743281, 748132, 752691, 758427, 764382, 768516, 770596, 772220, 774351, 776345, 777462, 778038, 778607, 778704, 777297, 774126, 770161, 766831, 765144, 765391, 767093, 768948, 769229, 766931, 762730, 758409, 755274, 753484, 752921, 753751, 755528, 756595, 755482, 752661, 749989, 748572, 748130, 748358, 749714, 752544, 756411, 760802, 765800, 771595, 777946, 784599, 791712, 799561, 808288, 818257, 830060, 843824, 859040, 875358, 892873, 911252, 929432, 947020, 965425, 986666, 1011203, 1037708, 1064868, 1092624, 1121564, 1151813, 1182924, 1214416, 1246049, 1277780, 1309944, 1343601, 1380372, 1421410, 1466284]
53440A466284M6710M6412M5346M5009M5830M7334M8977N0543N2012N3394N4533
53429B002384N5060N4793N4162N3710N3236N2178N0842N0293N0712N0988N0460
53418B578818M9888M9912M9763M8688M7571M7526M7619M5802M1850L7708L4819
53407C079964L2644L0017K6602K2627J8589J5551J4451J4577J3976J2010J0212
53396C291220R672Q908N742M92m388p647j0573j4716j9609k3584k6060k7935l0109
53383C151413l2554l5030l7695m0501m2650m3431m3389m3780m4949m6090m6660
53372B694684m7084m7670m7836m7030m5576m3910m1657l8442l4982l2319l0371
53361B237807k8279k5867k3612k1269j7917j3528r328o100l081P75N181Q833J1138
$$ y = [1466284, 1512994, 1559406, 1604752, 1649761, 1695591, 1742925, 1791902, 1842445, 1894457, 1947851, 2002384, 2057444, 2112237, 2166399, 2220109, 2273345, 2325523, 2376365, 2426658, 2477370, 2528358, 2578818, 2628706, 2678618, 2728381, 2777069, 2824640, 2872166, 2919785, 2965587, 3007437, 3045145, 3079964, 3112608, 3142625, 3169227, 3191854, 3210443, 3225994, 3240445, 3255022, 3268998, 3281008, 3291220, 3300892, 3309800, 3315542, 3316034, 3311646, 3303999, 3293426, 3278710, 3259101, 3235517, 3209457, 3181522, 3151413, 3118859, 3083829, 3046134, 3005633, 2962983, 2919552, 2876163, 2832383, 2787434, 2741344, 2694684, 2647600, 2599930, 2552094, 2505064, 2459488, 2415578, 2373921, 2335479, 2300497, 2268178, 2237807, 2209528, 2183661, 2160049, 2138780, 2120863, 2107335, 2098007, 2091907, 2088826, 2089601, 2094782, 2103615, 2114753]
53348B114753J3036J6107K1016K6782L1675L4959L7479M0355M3579M6521M9345
53337B475607N2910N7319O1576O4877O7501P0187P3289P6809Q0616Q4285Q7263
53326C252239Q9535R1731R4480R7922J01782J05431J08038J09441J10790J13363
53316D274752J16678J18738J18416J16579J14516J12328J09591J06465J03180
53307E291243R9150R3805Q7793Q2247P7054P0947O3402N5460M8417M2415L6721
53296F048654L0746K4291J7108Q920p9r040j7188k4742l2890m2673n3996o5880
53284E883231p7385q7829r6440j02684j07071j10787j14114j16047j16041j15318
53274D839515j15384j15748j14485j11036j07180j04791j03785j03003j02091
$$ y = [2114753, 2127789, 2143896, 2164912, 2191694, 2223369, 2258328, 2295807, 2336162, 2379741, 2426262, 2475607, 2528517, 2585836, 2647412, 2712289, 2779790, 2849977, 2923266, 3000075, 3080691, 3164976, 3252239, 3341774, 3433505, 3527985, 3625907, 3727689, 3833120, 3941158, 4050599, 4161389, 4274752, 4391430, 4510168, 4628584, 4745163, 4859679, 4972007, 5081598, 5188063, 5291243, 5390393, 5484198, 5571991, 5654238, 5731292, 5802239, 5865641, 5921101, 5969518, 6011933, 6048654, 6079400, 6103691, 6120799, 6129719, 6129640, 6120600, 6103412, 6078670, 6045780, 6003107, 5949111, 5883231, 5805846, 5718017, 5621577, 5518893, 5411822, 5301035, 5186921, 5070874, 4954833, 4839515, 4724131, 4608383, 4493898, 4382862, 4275682, 4170891, 4067106, 3964103, 3862012]
53265C862012j01340j00231r7522r3015q8048q3758p9660p4692o9074o4154o0501
53254B950017n7038n2369m6481m0699l6275l3319l1033k8651k6024k3415k0952
53243B553761j8444j5765j3062j0438p708m809k082J44K094M095N928P222Q324
53230B509260J0003J2340J4737J7056J9797K2945K5729K7984L0765L4784L9118
53219B764518M2335M4319M5987M7718M9097M9858N0093M9633M8135M5840M3541
53208C281074M1758M0460L9379L8036L5767L2462K8975K6115K3516K0324J6652
53197C624518J3313J0323O847K608j826o250j1094j6362k1484k6567l2457l8955
53185C502614m4265m7173m8717n0693n3350n5706n7523n9627o2315o4629o5347
$$ y = [3862012, 3760672, 3660441, 3562919, 3469904, 3381856, 3298098, 3218438, 3143746, 3074672, 3010518, 2950017, 2892979, 2840610, 2794129, 2753430, 2717155, 2683836, 2652803, 2624152, 2598128, 2574713, 2553761, 2535317, 2519552, 2506490, 2496052, 2488344, 2483535, 2481453, 2481597, 2483691, 2487786, 2493714, 2500936, 2509260, 2519263, 2531603, 2546340, 2563396, 2583193, 2606138, 2631867, 2659851, 2690616, 2725400, 2764518, 2806853, 2851172, 2897159, 2944877, 2993974, 3043832, 3093925, 3143558, 3191693, 3237533, 3281074, 3322832, 3363292, 3402671, 3440707, 3476474, 3508936, 3537911, 3564026, 3587542, 3607866, 3624518, 3637831, 3648154, 3655001, 3657609, 3655783, 3649533, 3638439, 3622077, 3600593, 3574026, 3541569, 3502614, 3458349, 3411176, 3362459, 3311766, 3258416, 3202710, 3145187, 3085560, 3023245, 2958616, 2893269]
53174B893269o4128o1685n9374n8380n8602n8471n6701n4087n2742n3455n4700
53163B260944n4647n3255n1802n1071n0801n0572n0222m9381m7422m4235m0604
53152A716932l7514l5388l4226l3994l4456l5047l5317l5279l4874l3553l1107
53141A336177k8603k7590k8379k9884l1095l1696l1308k9473k6913k5456k5785
53130A019995k6291k5226k3095k1705k1530k1539k1171k0982k1322k1713k1686
53119G73735k1105j9660j7296j5311j5537j7820j9545j8534j5584j3224j2626
53108E87493j2750j2214j1033j0320j0757j1731j2076j1539j1005j1002j0658
53097D62408q948o626n609o435p567p537o557n461m341l199k879m019n651o099
$$ y = [2893269, 2829141, 2767456, 2708082, 2649702, 2591100, 2532629, 2475928, 2421841, 2369099, 2315644, 2260944, 2206297, 2153042, 2101240, 2050169, 1999368, 1948796, 1898574, 1849193, 1801771, 1757536, 1716932, 1679418, 1644030, 1609804, 1575810, 1541354, 1506307, 1470990, 1435711, 1400837, 1367284, 1336177, 1307574, 1279984, 1251605, 1221721, 1190626, 1158930, 1127622, 1098149, 1071236, 1045780, 1019995, 993704, 968478, 945383, 923678, 902148, 880609, 859438, 838456, 817134, 795421, 773735, 752630, 732970, 715674, 700363, 684826, 667006, 647461, 628927, 613343, 600119, 587493, 574743, 562529, 551496, 541176, 530419, 518688, 506612, 495073, 484068, 473066, 462408, 453460, 446834, 441225, 434790, 427223, 419686, 413129, 407668, 403327, 400128, 397249, 393230, 387579, 381480]
53083C81480n035l620k784k499k633l285l834l009o87J174N21k157m193l875k164
53068C43400r38m87K50J395J565j19k465l434k356k83J369J872J304L37k14j71
53052C41025l9J51J238L426N120M638K685J584K187L146L399L652M655N569N234
53037C87670L957K872K142R44j137l509n181n398m218k923l228n373p608q223
53023C50787p465o715o505o402o194n937n208l616j968j656k763l924m197l940
53009B84297l565k700j250j94m34j511k262k220j593n37O25R04l37k097k659k002
52993B62465j972l572n286n005k719k02J432K472L206L088J736k46j869k653k723
52978B48152k528k586k854k496j050L44K4j725k745j977q48r49j834k306k527
$$ y = [381480, 376445, 372825, 370041, 367542, 364909, 361624, 357790, 354781, 354094, 355268, 355789, 353632, 349439, 345564, 343400, 342462, 341975, 342225, 343620, 345185, 345066, 342601, 339167, 336811, 336528, 337897, 339769, 341073, 341410, 341196, 341025, 340986, 341137, 342375, 345801, 350921, 355559, 358244, 359828, 362015, 365161, 368560, 372212, 376867, 382436, 387670, 391627, 394499, 396641, 397585, 396448, 392939, 387758, 382360, 378142, 375219, 371991, 366618, 359010, 350787, 343322, 336607, 330102, 323700, 317506, 311569, 306361, 302745, 300777, 299121, 296358, 292434, 288237, 284297, 280732, 278032, 276782, 276588, 276154, 274643, 272381, 270161, 268568, 268031, 268656, 269560, 269223, 267126, 264467, 262465, 260493, 256921, 251635, 246630, 243911, 243709, 245141, 247613, 250819, 253907, 255643, 255397, 253528, 250875, 248152, 245624, 243038, 240184, 237688, 236638, 236982, 237006, 235281, 232536, 230559, 229711, 228762, 226928, 224622, 222095]
52963B22095l319m312m406l524k401j223J15R72P64K80N58R67J62j332j532kJ468
52946B05330J364%j602k578j972M09K627K240j86j399K7J765J388k84j032m75
52930B05622K90Q25J305J374P67L06Q38K007L016L634L486J757j055k526j216
52915B20430J104J871J245J204K178K949L252L968M847M441K516O15j93k59K35
52900B50403J986M884P207P419N872M103L362M159O188Q155Q566P316N810N081
52886C30511M523L011P15r42r05K58O91j056m484p419q098o779n101m250m138
52871B96537l900k766q99K66p92l531n404m821l101k368k636k475j726j426j533
52856B59425q43O55J319K96j249j975j930j663j188o59q13j798k437j597K76J743
$$ y = [222095, 218776, 214464, 210058, 206534, 204133, 202910, 203025, 203997, 204761, 205041, 205599, 206566, 206728, 205396, 203864, 203862, 205330, 206694, 206694, 205092, 202514, 200542, 200951, 203578, 205818, 205632, 204233, 204260, 206025, 207413, 207129, 206097, 205622, 205912, 206737, 208042, 209416, 210183, 210489, 211327, 213334, 216350, 219984, 223470, 225227, 224172, 221646, 220430, 221534, 223405, 224650, 225854, 228032, 230981, 234233, 238201, 243048, 247489, 250005, 250620, 250427, 250168, 250403, 252389, 257273, 264480, 271899, 277771, 281874, 285236, 289395, 295583, 303738, 312304, 319620, 325430, 330511, 335034, 338045, 338760, 337818, 336913, 337171, 337862, 336806, 332322, 324903, 316805, 310026, 304925, 300675, 296537, 292637, 289871, 288972, 289238, 288446, 284915, 279511, 274690, 271589, 269221, 266585, 264110, 262384, 260958, 259425, 258582, 259237, 260556, 260852, 259603, 257628, 255698, 254035, 252847, 252188, 251375, 249577, 247140, 245543, 245819, 247562]
52840B47562K002J366O26L39M03J26q16j594j104L80J479J655J765K272K253R59
52824B59673o79j056J33J773K750K798K312J833J497P42r95l085l954l027j631
52809B59084j256j617j280J98J698K091J488Q25P92J336J853J627L80j279k075
52794B63865j158Q85K346K129J041Q23J940L041K844J757J001R77J394K422M470
52779B89777O859P903O686M182K376K571M375N974N633L406J041j55n62q32m24
52764C38810J129K391J385j549m136n261n829o345n779l659j490j004k123l646
52750C02894m786n154m251k222m68n12k475n078o743o558m883l205k725l051l222
52735B47561l549m856o060m876j545N59n32k502k199j57P91J2o22k97l50j564
$$ y = [247562, 249564, 250930, 251556, 251895, 252298, 252424, 251608, 250014, 248910, 249290, 250769, 252424, 254189, 256461, 258714, 259673, 258994, 257938, 258071, 259844, 262594, 265392, 267704, 269537, 271034, 271776, 270781, 267696, 263742, 260715, 259084, 257828, 256211, 254931, 255129, 256827, 258918, 260406, 261231, 262023, 263359, 265212, 266839, 267219, 265940, 263865, 262707, 263592, 265938, 268067, 269108, 269931, 271871, 274912, 277756, 279513, 280514, 281491, 282885, 285307, 289777, 296636, 304539, 311225, 315407, 317783, 320354, 324729, 330703, 336336, 339742, 340783, 340628, 340066, 339234, 338810, 339939, 342330, 343715, 342166, 338030, 332769, 326940, 320595, 314816, 311157, 309667, 308663, 306540, 302894, 298108, 292954, 288703, 286481, 286013, 285501, 283026, 277948, 271205, 264647, 259764, 256559, 253834, 250783, 247561, 244012, 239156, 233096, 228220, 226675, 227234, 226702, 224200, 222001, 221844, 222635, 222647, 222025, 221728, 221378, 219814]
52719B19814k803k994k607k348j874q34r0p21k412l661l421k127j202j676l203
52704A87841m321l932k315o56J37j69j327k572k866j880m49M68Q80J056M18j714
52688A68599m470n898n180l356j723n41L61Q14P58O48P67O92J9q94j478j814k352
52671A44952k990l117k397j097L59J656K413K281J519J004J260J659J135l10j449
52656A46878j398p33m99o71m42K38M67j12o10j64R02J734K089K142J738O61n59
52639A51661r47k72O13P57J22n77p68n70l40J02J321L064L969L286K382L216N383
52622A72402O263M513J931R81J840K996L502L260K042Jj453j042K66J83j760l575
52606A92350l631k717k643l847n119n088l522j632j079k148l044j959K80R93p87
$$ y = [219814, 217011, 214017, 211410, 209062, 207188, 206354, 206264, 205543, 203131, 199470, 196049, 193922, 192720, 191044, 187841, 183520, 179588, 177273, 176617, 176754, 176585, 175258, 172686, 169820, 167940, 167491, 167959, 168839, 169895, 170313, 168599, 164129, 158231, 153051, 149695, 147972, 147431, 147792, 148606, 149364, 150012, 150779, 151471, 151490, 150596, 149118, 147304, 144952, 141962, 138845, 136448, 135351, 135710, 137366, 139779, 142060, 143579, 144583, 145843, 147502, 148637, 148327, 146878, 145480, 144747, 144248, 143577, 143135, 143373, 143840, 143728, 143118, 142954, 143856, 145590, 147679, 149821, 151559, 152220, 151661, 150714, 150442, 151055, 151812, 151934, 151357, 150589, 150019, 149679, 149781, 151102, 154166, 158135, 161421, 163803, 167019, 172402, 178665, 183178, 185109, 186090, 187930, 190926, 194428, 197688, 199730, 199731, 198278, 197236, 197502, 197685, 195925, 192350, 188719, 186002, 183359, 179512, 174393, 169305, 165783, 164151, 163072, 160924, 157880, 155921, 156201, 157194, 156407]
52591A56407k998l476k631k071j893j031L36O68n17j690j395j86M11R6lQ55J909
52574A42791J840M04j309k067j610n91K65P29Q93Q04M67M0j64k6K13K72L02P45
52556A43998J611K217J968J179N67J41o79j698j702j58J560J695M77j04J013K559
52540A54644K723J550P02J232K415K957K558J941J680J667J677J843K276K610
52526A82475K352J519N57k24p07o91q6O64J031J218J770K273J485o93k357j747
52510A88839M60K076K304K371L188L780K716K18k064k943k490j244M28K053K965
52495B02657K924K457K102J633N94p39j541j606j519j618j504j004p32j058j279
52480A99767o65K84O78Q16J621K769K900J882J291K105L250L272K250J146J79
$$ y = [156407, 153409, 149933, 147302, 145231, 143338, 142307, 142643, 143311, 142794, 141104, 139709, 139523, 139934, 140030, 140027, 140882, 142791, 144631, 145035, 143726, 141659, 140049, 139458, 139723, 140452, 141345, 142149, 142616, 142656, 142492, 142466, 142679, 142951, 143253, 143998, 145609, 147826, 149794, 150973, 151540, 151681, 151002, 149304, 147602, 147444, 149004, 150699, 151176, 151072, 152085, 154644, 157367, 158917, 159619, 160851, 163266, 166223, 168781, 170722, 172402, 174069, 175746, 177589, 179865, 182475, 184827, 186346, 186903, 186679, 185972, 185281, 185195, 185859, 186890, 188108, 189878, 192151, 193636, 192943, 190586, 188839, 189299, 191375, 193679, 196050, 199238, 203018, 205734, 205952, 203888, 200945, 198455, 197211, 197639, 199692, 202657, 205581, 208038, 210140, 211773, 212367, 211628, 210087, 208481, 206962, 205344, 203840, 202836, 202104, 201046, 199767, 199102, 199386, 200064, 200880, 202501, 205270, 208170, 210052, 211343, 213448, 216698, 219970, 222220, 223366, 223545]
52465B23545q66j510r75M25J457J509J186J315J972K580K490J496J35p23p62n34
52449B32740o52j008j131r82r02j017j055o76J03P32M76o78j646j382j86Q93J653
52432B25282K543L079K132J10r63l66N6j255l016k976j075R08J894J963J080o72
52416B28724k065j687J98K098L240L764L549K457J435J602K526K857K400J955
52402B53053J483K31j522k766l459m071l724j249J987K969J272l50l35m61k177
52387B40881l628k556j18P08p01k398k971k670j903o81M91P92K73k55m60o09p99
52370B23396r46j268j779j741o46P43J411J717K642L771L532J567n56j332r06
52355B29605k21L57Q77J021L52q92j859j954j275j72J368L537N863O958N713K746
$$ y = [223545, 222679, 221169, 220194, 220619, 222076, 223585, 224771, 226086, 228058, 230638, 233128, 234624, 234759, 234036, 233274, 232740, 232088, 231080, 229949, 228967, 228065, 227048, 225993, 225317, 225420, 226152, 226628, 225950, 224304, 222922, 222736, 223629, 225282, 227825, 230904, 233036, 233146, 232183, 231817, 231873, 230618, 227602, 224626, 223551, 224459, 226353, 228316, 229396, 228724, 226659, 224972, 225170, 227268, 230508, 234272, 237821, 240278, 241713, 243315, 245841, 248698, 251098, 253053, 254536, 254767, 253245, 250479, 247020, 242949, 239225, 237976, 239963, 242932, 244204, 243854, 243519, 243058, 240881, 237253, 234697, 234579, 235287, 234586, 232188, 229217, 226547, 224644, 223963, 224454, 225246, 225519, 225264, 224804, 224195, 223396, 222450, 221182, 219403, 217662, 217016, 217759, 219170, 220887, 223529, 227300, 230832, 232399, 231843, 230511, 229605, 229384, 229741, 230618, 231639, 231991, 231099, 229240, 227286, 226011, 225839, 227207, 230744, 236607, 243565, 249278, 252024]
$$ [...]
##END NTUPLES=NMR SPECTRUM
##END=
