##TITLE=coffee_type TOCA01-ROVE100D_80-20%
COFFEE_meoh_noesyp64 COFFEE_meoh {C:\Bruker\TOPSPIN} Administrator 9
##JCAMPDX= 6.0         $$ Bruker NMR JCAMP-DX V2.0
##DATA TYPE= NMR SPECTRUM
##DATA CLASS= NTUPLES
##ORIGIN= Bruker BioSpin GmbH
##OWNER= Administrator
$$ 1.72 TOPSPIN		Version 2.1
$$ 2012-05-18 15:44:58.636 -0700  Administrator@X
$$ Compression mode = diff/dup
##.OBSERVE FREQUENCY= 400.13188235
##.OBSERVE NUCLEUS= ^1H
##.ACQUISITION MODE= SIMULTANEOUS (DQD)
##.ACQUISITION SCHEME= undefined
##.AVERAGES= 64
##.DIGITISER RES= 22
##SPECTROMETER/DATA SYSTEM= spect
##.PULSE SEQUENCE= noesygpps1d.comp
##.SOLVENT NAME= COFFEE_meoh
##.SHIFT REFERENCE= INTERNAL, COFFEE_meoh, 1, 14.98061
##AUDIT TRAIL= $$ (NUMBER, WHEN, WHO, WHERE, PROCESS, VERSION, WHAT)
$$ ##TITLE= Audit trail, TOPSPIN		Version 2.1
$$ ##JCAMPDX= 5.01
$$ ##ORIGIN= Bruker BioSpin GmbH
$$ ##OWNER= Administrator
$$ $$ C:\Bruker\TOPSPIN/data/Administrator/nmr/12-COFFEE-2302/102/pdata/1/auditp.txt
$$ ##AUDIT TRAIL=  $$ (NUMBER, WHEN, WHO, WHERE, PROCESS, VERSION, WHAT)
(   1,<2012-02-23 22:22:41.281 -0500>,<Administrator>,<TOPSPIN>,<go>,<TOPSPIN 2.1>,
      <created by zg
	started at 2012-02-23 22:11:11.016 -0500,
	POWCHK enabled, PULCHK disabled,
       configuration hash MD5:
       B0 76 FB 9C 50 81 44 7D 18 B3 26 32 4E 60 AD 96
       data hash MD5: 64K
       C4 77 EF 76 97 AC 83 DA 77 48 97 CC 91 B4 7B ED>)
(   2,<2012-02-23 22:22:43.937 -0500>,<Administrator>,<TOPSPIN>,<proc1d>,<TOPSPIN 2.1>,
      <Start of raw data processing
       efp LB = 0.3 FT_mod = 6 PKNL = 1 PHC0 = 0 PHC1 = 0 SI = 128K 
       data hash MD5: 128K
       0C AE 45 B1 82 DD 44 25 CB 16 8F 59 35 C4 B9 47>)
(   3,<2012-02-23 22:22:45.219 -0500>,<Administrator>,<TOPSPIN>,<proc1d>,<TOPSPIN 2.1>,
      <pk PHC0 = 25.32898 PHC1 = 0 
       data hash MD5: 128K
       C0 5C 86 62 1B C1 1B 5F CD 8A 22 5A 6E AB DC 2A>)
(   4,<2012-02-23 22:22:45.484 -0500>,<Administrator>,<TOPSPIN>,<proc1d>,<TOPSPIN 2.1>,
      <abs ABSG = 1 
       data hash MD5: 128K
       46 80 20 D2 B5 F3 72 5D 21 73 50 F2 83 7B 29 2F>)
(   5,<2012-02-23 22:22:45.562 -0500>,<Administrator>,<TOPSPIN>,<proc1d>,<TOPSPIN 2.1>,
      <abs ABSG = 2 
       data hash MD5: 128K
       3C 7C 51 EC 69 4D 44 3B 77 77 66 7C FB 8C 93 0D>)
(   6,<2012-02-23 22:22:45.625 -0500>,<Administrator>,<TOPSPIN>,<proc1d>,<TOPSPIN 2.1>,
      <abs ABSG = 3 
       data hash MD5: 128K
       9C 96 6F 69 2E D5 D2 80 A0 6F 21 37 F8 45 07 77>)
(   7,<2012-02-23 22:22:45.703 -0500>,<Administrator>,<TOPSPIN>,<proc1d>,<TOPSPIN 2.1>,
      <abs ABSG = 4 
       data hash MD5: 128K
       5F 91 29 3A C9 B3 3D 03 9F 60 E7 93 D4 A1 EE 68>)
(   8,<2012-02-23 22:22:45.750 -0500>,<Administrator>,<TOPSPIN>,<proc1d>,<TOPSPIN 2.1>,
      <abs ABSG = 5 
       data hash MD5: 128K
       9A BF 24 DF AE 18 5F 13 FD B2 73 0A B9 36 7B 3C>)
(   9,<2012-02-23 22:22:45.875 -0500>,<Administrator>,<TOPSPIN>,<audit>,<TOPSPIN 2.1>,
      <user comment:
       ICON-NMR User ID: Administrator
$$ [...]
150 150 150 150 150 150 150 150
##$TP07= 0
##$TPNAME0= <>
##$TPNAME1= <>
##$TPNAME2= <>
##$TPNAME3= <>
##$TPNAME4= <>
##$TPNAME5= <>
##$TPNAME6= <>
##$TPNAME7= <>
##$TPOAL= (0..7)
0.5 0.5 0.5 0.5 0.5 0.5 0.5 0.5
##$TPOFFS= (0..7)
0 0 0 0 0 0 0 0
##$TUNHIN= 0
##$TUNHOUT= 0
##$TUNXOUT= 0
##$USERA1= <user>
##$USERA2= <user>
##$USERA3= <user>
##$USERA4= <user>
##$USERA5= <user>
##$V9= 5
##$VALIST= <valist>
##$VCLIST= <CCCCCCCCCCCCCCC>
##$VD= 0
##$VDLIST= <DDDDDDDDDDDDDDD>
##$VPLIST= <PPPPPPPPPPPPPPP>
##$VTLIST= <TTTTTTTTTTTTTTT>
##$WBST= 1024
##$WBSW= 4
##$XGAIN= (0..3)
0 0 0 0
##$XL= 0
##$YL= 0
##$YMAX_a= 15316693
##$YMIN_a= -7043205
##$ZGOPTNS= <>
##$ZL1= 120
##$ZL2= 120
##$ZL3= 120
##$ZL4= 120
##$ABSF1= 14.98061
##$ABSF2= -5.57192
##$ABSG= 5
##$ABSL= 3
##$ALPHA= 0
##$AQORDER= 0
##$ASSFAC= 0
##$ASSFACI= 0
##$ASSFACX= 0
##$ASSWID= 0
##$AUNMP= <proc_prof1d_extract>
##$AXLEFT= 0
##$AXNAME= <>
##$AXNUC= <1H>
##$AXRIGHT= 0
##$AXTYPE= 0
##$AXUNIT= <>
##$AZFE= 0.1
##$AZFW= 0.1
##$BCFW= 0
##$BC_mod= 0
##$BYTORDP= 0
##$COROFFS= 0
##$CY= 15
##$DATMOD= 1
##$DC= 0
##$DFILT= <>
##$DTYPP= 0
##$F1P= 0
##$F2P= 0
##$FCOR= 0.5
##$FTSIZE= 131072
##$FT_mod= 6
##$GAMMA= 0
##$GB= 0
##$INTBC= 1
##$INTSCL= 1
##$ISEN= 128
##$LB= 0.3
##$LEV0= 0
##$LPBIN= 0
##$MAXI= 10000
##$MC2= 0
##$MEAN= 0
##$ME_mod= 0
##$MI= 0
##$NCOEF= 0
##$NC_proc= -3
##$NLEV= 6
##$NOISF1= 0
##$NOISF2= 0
##$NSP= 0
##$NTH_PI= 0
##$NZP= 0
##$OFFSET= 14.98061
##$PC= 1
##$PHC0= 25.32898
##$PHC1= 0
##$PH_mod= 1
##$PKNL= yes
##$PPARMOD= 0
##$PPDIAG= 0
##$PPIPTYP= 0
##$PPMPNUM= 2147483647
##$PPRESOL= 1
##$PSCAL= 4
##$PSIGN= 0
##$PYNMP= <proc.py>
##$REVERSE= no
##$SF= 400.13
##$SI= 131072
##$SIGF1= 0
##$SIGF2= 0
##$SINO= 400
##$SIOLD= 131072
##$SPECTYP= <>
##$SREGLST= <1H.CDCl3>
##$SSB= 0
##$STSI= 131072
##$STSR= 0
##$SW_p= 8223.68421052632
##$SYMM= 0
##$S_DEV= 0
##$TDeff= 65536
##$TDoff= 0
##$TI= <>
##$TILT= no
##$TM1= 0
##$TM2= 0
##$TOPLEV= 0
##$USERP1= <user>
##$USERP2= <user>
##$USERP3= <user>
##$USERP4= <user>
##$USERP5= <user>
##$WDW= 1
##$XDIM= 131072
##$YMAX_p= 458758552
##$YMIN_p= -304959113
##$CURPLOT= <Network HP LaserJet P1505>
##$CURPRIN= <$Network HP LaserJet P1505>
##$DFORMAT= <normdp>
##$LAYOUT= <+/1D_H.xwp>
##$LFORMAT= <normlp>
##$PFORMAT= <normpl>
##$SURQMSG= 1
$$ End of Bruker specific parameters
$$ ---------------------------------
##NTUPLES= NMR SPECTRUM
##VAR_NAME=  FREQUENCY,     SPECTRUM/REAL,   SPECTRUM/IMAG
##SYMBOL=    X,             R,               I
##VAR_TYPE=  INDEPENDENT,   DEPENDENT,       DEPENDENT
##VAR_FORM=  AFFN,          ASDF,            ASDF
##VAR_DIM=   131072,        131072,          131072
##UNITS=     HZ,            ARBITRARY UNITS, ARBITRARY UNITS
##FACTOR=    0.0627417313425165, 1,          1
##FIRST=     8223.62146879498, -3060,        -98489
##LAST=      0,             2287,            -100559
##MIN=       0,             -304959113,      0
##MAX=       8223.62146879498, 458758552,    0
$$ Real data points
##PAGE= N=1
##DATA TABLE= (X++(R..R)), XYDATA
$$ [...]
66696 1510167 1493914 1477408 1462406 1449500 1437382 1424343 1409622 1393359 1376304 1359766 1344933
66685 1344933 1331917 1319988 1308544 1297100 1284668 1270447 1255280 1241295 1229744 1219901 1210204 1199653
66673 1199653 1188099 1176210 1165362 1156611 1149383 1141796 1132388 1120956 1108000 1094426 1081654 1070679
66661 1070679 1060866 1050903 1041054 1032950 1026766 1020234 1011249 1000105 988274 976434 964870 954592 946418
66648 946418 939520 932262 924253 916496 909718 903436 896612 888670 880167 872721 867615 863982 859296 852328
66634 852328 844656 838356 833309 828093 822563 817714 813448 808351 801749 794359 786691 778372 769569 761596
66620 761596 755194 749242 742191 734209 726996 721719 717851 714004 709285 703595 696941 689038 679938 670758
66606 670758 663030 657192 652367 647871 643994 640793 637226 632591 627960 624783 622575 619519 615169 610928
66592 610928 607794 605225 602499 599641 596440 592118 586806 582011 578579 575346 571001 566348 563435 562877
66578 562877 563196 562539 560192 556700 553214 550322 546893 540829 531855 522840 517012 514281 511771 507703 503087
66563 503087 499433 496593 493691 490748 488168 485549 482296 478995 476960 476470 476395 475645 474195 472447 470333
66548 470333 467518 464124 460763 457955 455845 454447 453811 453751 453536 452172 449187 445115 440998 437432 434260
66533 434260 431229 428633 427037 426500 426323 425553 423528 420051 415457 410663 406839 404657 403818 403333 402190
66518 402190 399848 396578 393620 392564 393841 395744 395620 392449 387903 384575 383429 383347 382784 381169 378744
66503 378744 375853 372828 370160 368172 366610 364950 363106 361494 360299 359055 357166 354663 352182 350294
66489 350294 349064 348174 347137 345455 342975 340337 338662 338420 338779 338412 336881 334907 333409 332650 332251 331567
66473 331567 329965 327290 324169 321462 319238 316788 313774 310817 308645 307265 306396 306081 306223 306122 305276
66458 305276 304221 303568 302548 299784 295667 292606 292340 293920 295085 294861 293964 293259 292919 292896 293125 293063 291860
66441 291860 289449 286899 285243 284244 282819 280544 278292 277255 277589 278224 277889 276187 273779 271804 271088
66426 271088 271660 272795 273606 273706 273218 272174 270333 267794 265346 263667 262431 260878 259150 258289 258718 259511
66410 259511 259565 258774 257534 255818 253698 252319 253158 256110 259240 260781 260672 259748 258282 256145 253895 252625
66394 252625 252633 253051 252944 252110 250549 247934 244273 240603 238192 237138 236446 235540 235083 236050 238383 240849 241957
66377 241957 241047 238842 236978 236573 237150 237409 236948 236403 235830 234177 231155 228628 228840 231580 234256 234654
66361 234654 232623 229144 225044 220975 217677 215585 214612 214612 215559 217158 218956 220996 223538 225861 226306 224182
66345 224182 220941 218713 218150 218366 218538 218662 218901 219028 218681 217751 216345 214659 212979 211728 211421 212387 214254
66328 214254 215904 216439 216106 215642 214905 213160 210847 209680 210419 211684 211907 211278 210592 209261 206271 202467
66312 202467 199877 198714 196912 193146 188786 186151 186115 188158 191560 195375 198071 198422 196614 193803 190985
66297 190985 188945 188641 190446 193013 193940 191983 188244 185048 183931 184682 185852 185989 184771 183223 182770
66282 182770 183923 185841 187160 187214 186574 186440 187455 189039 189953 189531 188238 187001 186239 185697 185029 184218 183336
66265 183336 182143 180211 177483 174545 172105 170435 169632 170257 172978 177252 181049 182522 181743 180360 179918
66250 179918 180980 183259 185644 186385 184440 180759 177408 175380 174220 173634 174003 174900 174731 172893 171141
66235 171141 171464 173421 174886 174870 174104 173080 171154 167948 164390 161756 160466 160343 161380 163628 166590
66220 166590 169205 170524 170470 170074 170653 172321 173623 173209 171561 170263 169861 169600 169220 169553 170708 171051 169227
66203 169227 166405 165163 166345 168172 168544 167288 165870 165636 166688 168051 168597 168061 167221 166841 166497 164935
66187 164935 161706 157841 154672 152434 150592 149135 148847 150153 152203 153459 153089 151559 150001 149171 149108
66172 149108 149584 150638 152538 155257 158159 160366 161455 161752 161909 162198 162261 161567 160086 158502 157764 158412
66156 158412 160219 162382 164057 164796 164582 163576 161985 160243 159067 158936 159437 159435 158209 156254 154724 154246
66140 154246 154610 155470 156738 158123 158941 158894 158754 159647 161742 164173 166177 167651 168571 168628 167847 166883 166153
66123 166153 165191 163550 161859 161088 161006 160375 158657 156541 154667 152963 151610 151552 153222 155649 157788 159955
66107 159955 162764 165219 165382 162953 159870 158017 157473 157394 157495 157918 158535 159312 160876 163846 167755 171243
66091 171243 173147 172959 170634 166692 162469 159530 158538 158867 159307 159025 158005 156841 155953 154894 152781 149636
66075 149636 146756 145284 144890 144500 143847 143463 143459 143383 143192 143234 143064 141441 138161 135012 134190 136217 139985 144241
66057 144241 148282 151611 153771 154585 154151 152809 151454 151398 153159 155564 156794 156331 155268 154628 154127 152938
66041 152938 151151 149883 149992 150983 151337 149992 147443 145271 144549 144947 145451 145574 145602 146069 147324 149202 150644
66024 150644 150151 147441 144352 143240 144526 146624 148210 149439 150668 151184 150064 147672 145517 144882 146035
66009 146035 148387 150890 152645 153641 154685 156305 158133 159583 160503 160764 160034 158771 158620 160560 163110
65994 163110 163787 162376 161372 162806 165862 168236 168830 168207 167160 165894 164424 162958 161872 161771 163426
65979 163426 166984 171179 173835 173525 170671 166995 164016 162091 160684 159342 158241 157772 157802 157633 156735 155319
65963 155319 154160 153953 154817 156279 157768 159243 161149 163610 166019 167859 169483 171377 172891 172809 171240
65948 171240 169925 170190 171577 173038 174533 176498 178534 179851 180645 181809 183268 183706 182264 179649 177229
65933 177229 175712 175112 175411 176649 178603 180873 183267 185835 188555 191126 193176 194665 195991 197437 198551
65918 198551 198459 197051 195381 194459 194022 193070 191346 189593 188435 187696 186875 185695 184150 182580 181751 182188
65902 182188 183306 183757 182874 181291 180077 179889 181038 183551 186737 189327 190564 190835 190939 191208 191570 191867
65886 191867 191787 191064 190154 190054 190901 191404 190306 187891 185438 183722 182868 183122 184636 186549 187297 186077 183559
65869 183559 181145 180026 180764 183058 185809 187896 188912 188898 187849 186207 185428 186881 189997 192481 192699
65854 192699 191151 189294 187767 186337 184953 184120 184384 185822 187896 189547 189695 187966 184905 181485 178633
65839 178633 177063 177012 177953 179007 179826 180734 181986 183327 184383 184963 184909 184168 183194 182745 183047 183632 184141 184703
65821 184703 185390 186019 186665 187595 188352 187841 185927 184109 183862 184964 186276 187480 189056 190969 192499 193204
65805 193204 193249 192918 192514 192488 192788 192413 190563 188077 186720 187075 188137 188904 189319 189464 189021 187870 186292
65788 186292 184323 181910 179936 179861 181670 183389 183550 183093 183684 185022 185337 184145 182926 182929 183713 184358 184915
65771 184915 185821 186685 186754 186299 186469 187568 188306 187374 185305 183995 184456 185812 186731 187110 187746 188913 190132
65754 190132 191022 191471 191044 189286 186796 185037 184658 184779 184363 183401 182226 180663 178778 177642 178145 179492
65738 179492 180095 179742 179641 180346 180880 180220 178548 176550 174484 172640 171958 173250 176065 179007 181038 182018
65722 182018 182207 181782 180854 179566 178069 176651 175804 175964 177043 178318 178809 177948 176141 174552 173959 173879 173377
65705 173377 172770 173713 177000 181017 183268 183150 182288 182262 183037 183798 184198 184109 183076 180977 178690 177008 175215
65688 175215 171934 167437 163849 162563 162572 162163 161299 161153 161902 162428 162109 161546 161189 160399 158457 155727 153229
65671 153229 151744 151731 153296 155560 156897 156731 156448 157492 159076 159090 157001 154448 152855 151855 150625 149475
65655 149475 149203 149668 150041 150035 149953 149725 148788 147019 145090 143636 142513 141211 139774 138918 139133 139890 140058 139241
65637 139241 138386 138819 140915 144056 147550 150867 153124 153299 151403 148769 146751 145621 145088 145124 145560 145473
65621 145473 144009 141708 140151 140232 141450 142944 144419 145731 146343 145853 144815 144431 145329 146861 147742 147284
65605 147284 145974 144771 143892 142514 139890 136576 134168 133767 134908 136139 136422 135824 135022 134432 133949 133359
65589 133359 132695 132097 131566 131252 131796 133798 136738 138936 139084 137660 136513 137118 139344 141584 141940 139790
65573 139790 136702 135379 137086 140355 142715 143254 142757 141885 140570 139144 138524 138643 137916 135224 131617 129078
65557 129078 128191 128087 128214 128948 130506 132314 133670 134306 134250 133930 134464 136783 140051 141849 140572 136958
65541 136958 132689 128301 123544 119256 117392 118866 122379 125943 128869 131697 134695 137261 138735 139215
65527 139215 139468 140260 141726 143069 142999 140925 137821 135565 135226 136154 136694 135520 132265 127508 122599 119173
65511 119173 118174 119204 121015 122689 124205 126053 128624 131850 135038 137028 137041 135530 133836 132731 131626
65496 131626 129553 126644 124177 123213 123544 124014 123576 122022 120069 118907 119406 121456 124074 126216 127490
65481 127490 128139 128505 128588 127975 126251 123758 121946 122495 125606 129403 131521 131341 130253 129797 130138 130579 130854
65464 130854 131147 131128 129968 127717 126006 126676 129729 133123 134747 134288 132993 131975 131261 130466 129800 129854 130551
65447 130551 130984 130606 130206 131156 133725 136574 138100 138046 137577 137909 139071 140052 140052 139454 139460 140739 142654 143910
65429 143910 143855 142970 142307 142719 144413 146708 148173 147626 145306 142783 141467 141474 142022 142478 142689 142780 143156 144333
65411 144333 146154 147420 147056 145635 145057 146513 149334 151978 153521 153886 153269 152064 151058 151000 151853 152845
65395 152845 153311 153274 153190 153397 153841 154106 153646 152110 149562 146396 143153 140466 138935 138721 139268 139761 139865
65378 139865 139792 139665 139166 138016 136414 134669 132637 130038 127325 125690 125905 127480 129276 130691 131821
65363 131821 132689 132985 132768 132777 133554 134603 135008 134733 134660 135285 136062 136350 136508 137460 139445 141680 143213 143603
65345 143603 142872 141360 139836 139213 139746 140751 141424 141700 142034 142685 143686 145306 147829 150887 153627 155687
65329 155687 157345 158453 158061 155839 153395 153178 156043 160599 164948 168344 170964 172870 173782 173560 172573
65314 172573 171834 172922 177152 184346 192692 200345 206956 213373 220279 227687 235416 243183 250221 255663
65300 255663 259684 263712 268964 274999 280110 283106 284403 285239 286046 285811 283175 277974 271390 264641 257935
65285 257935 250915 243602 236422 229567 222865 216265 210014 204425 199815 196463 194130 191806 188565 184715
65271 184715 181435 179256 177555 175653 173623 171678 169510 166809 163840 160912 157758 154104 150515 147900
65257 147900 146291 144820 142927 140941 139300 137721 135527 132566 129563 127589 127172 127788 128201 127468 125727
65242 125727 123982 123153 123244 123295 122172 119759 117501 117372 119893 123398 125678 126220 126367 127363 128875 129687 129377
65225 129377 128736 128571 128590 127871 126238 124672 124099 124187 123852 122712 121354 120226 119129 118035 117454 117385 116802
65208 116802 115197 114000 115138 118350 121268 122421 122889 124429 126998 129065 129633 128884 127097 124084 120046
65193 120046 116259 114371 115051 117500 120273 122477 124171 125705 127022 127889 128562 129583 130920 131870 132005
65178 132005 131548 130561 128593 125878 124179 125276 128710 131983 133123 132259 130589 128808 127060 125597 124601
65163 124601 123677 122246 120401 118909 118350 118605 119128 119435 119449 119567 120252 121272 121621 120580 118710 117374 117338
65146 117338 118170 118880 118733 117621 116200 115587 116287 117371 117336 115925 114434 114076 114766 115796 116833 117677 117855
65129 117855 117367 117258 118414 120051 120463 119213 117599 116813 116599 116040 114916 113863 113767 115325 118556 122302
65113 122302 124696 124618 122477 119392 116183 113459 112051 112611 114908 117884 120307 121351 121074 120592 121218 123022
65097 123022 124823 125948 127280 129805 132853 134771 134963 134209 133238 132107 130916 129988 129074 127432 125106
65082 125106 123269 122817 123433 124588 126709 130495 135394 139525 141133 139775 136339 132379 129373 128065 128220
65067 128220 128988 129587 129847 130328 131811 134288 136588 137373 136527 135025 133612 132322 131373 131427 132507 133553
65051 133553 133853 134224 135881 138618 141042 142326 142773 142859 142690 142480 142689 143550 145171 148084 152757 158438
65035 158438 163459 167087 170245 173969 177983 181506 184637 188091 192007 195996 200094 204856 210548 216900
65021 216900 223409 229198 232938 234045 234026 235429 239046 243076 245554 246627 247516 248091 246756 242596 236511
65006 236511 230041 223937 218150 212510 206923 201314 195732 190306 184917 179239 173215 167083 160828 154219
64992 154219 147805 143272 142017 143444 145280 145681 144616 143175 141915 140201 137014 132227 127095 123399
64978 123399 122041 122513 123676 124731 125275 124905 123405 121269 119511 118796 119015 119628 120108 120138 119922 120349 122274
64961 122274 125351 128000 128898 128197 126991 125983 125183 124597 124437 124481 123876 122111 119950 118851 119344 120368
64945 120368 120477 119448 118338 118094 118665 119563 120702 122208 123745 124602 124328 122872 120239 116572 112611 109579
64929 109579 108399 109269 111870 115487 118947 121145 121980 122396 123201 124231 124872 124959 124795 124662 124629 124621 124392 123719
64911 123719 122758 121831 120784 119279 118027 118821 122421 126971 129510 128864 126222 123153 120264 117871 116784
64896 116784 117717 120501 124172 127303 128181 125755 121102 117212 116459 118555 121493 123865 125436 126065 125437
64881 125437 123955 122732 122206 121586 120190 118653 118112 118580 118898 118168 116638 115173 114422 114632 115805 117668
64865 117668 119585 120775 120779 119812 118644 117908 117473 116812 116115 116442 118149 119675 118907 115829 112826 112043 113361
64848 113361 115391 117434 119499 121172 121730 121087 119561 116906 112828 108445 105915 106199 108193 110470 112749
64833 112749 115013 116395 116135 115164 115570 118476 123077 127621 130768 132199 132368 131640 129553 125427 119955
64818 119955 115388 113394 113393 113743 113880 114280 114935 115298 115463 116010 116714 116801 116594 117457 119656 121638 122098 121586
64800 121586 121264 121147 120529 119321 118037 117055 116722 117454 118782 119004 116997 114049 112722 113963 116262 117637
64784 117637 117527 116690 116060 115960 116012 115755 115566 116447 118385 119670 118838 116817 115791 116254 116759 116636 117182 119426
64766 119426 122289 124082 124701 125076 125324 124928 124289 124607 126173 127907 128770 128724 128144 127242 126419 126340 127076 127744
64748 127744 127557 126834 126381 126185 125456 124012 122936 123366 124917 125917 125366 124175 124038 125355 126911 127590
64732 127590 127662 128082 129118 130289 131333 132569 134375 136714 139144 140957 141549 141059 140441 140424 140600 140056 138646
64715 138646 136976 135291 133338 131349 130207 130236 130600 130418 129858 129667 130152 131104 132176 132780 132057 129663 126397
64698 126397 123645 122371 122865 124859 127308 128685 128301 127075 126353 126401 126832 127939 130310 133124 134175 132140
64682 132140 128092 124347 122441 122456 123594 124886 125819 126670 127959 129540 130785 131694 133013 135034 137146
64667 137146 138957 140885 143038 144402 144100 142796 141817 141322 140389 138673 136896 135735 135206 135209 135769 136493 136625
64650 136625 136009 135447 135825 137264 139182 140656 140769 139342 137578 137203 138608 140489 141643 142316 143071 143177
64634 143177 141317 137747 134606 133752 134933 136456 137126 137073 137017 137311 137713 137797 137416 136921 136973 138065 140121 142605
64616 142605 144933 146712 147610 147340 145967 144115 142585 141835 142071 143696 147103 151799 156159 158510 158297
64601 158297 156039 152493 148341 144439 141721 140574 140570 140831 140565 139388 137485 135534 134235 133978 135000 137476
64585 137476 141025 144417 146434 146915 146439 145192 142964 140239 138303 137927 138661 139768 141033 142211 142623
64570 142623 142125 141803 142627 143781 143377 140803 137441 134988 133899 133631 133616 133641 133898 135021 137508 140677 142742
64553 142742 142485 140521 138363 136618 134843 133039 132306 133536 135997 137899 138246 137682 137489 138227 139559 141022
64537 141022 142544 144248 146109 147824 148923 149002 148033 146462 144872 143678 143236 143998 146024 148402 149756
64522 149756 149553 148588 148034 148441 149833 152210 155377 158601 160979 162011 161549 159545 156406 153267 151146
64507 151146 149868 148554 147225 147131 149100 152193 154563 155295 154902 154281 153778 153320 152940 152862 153222 153953 154878
64490 154878 155707 155824 154378 151096 147090 144357 143983 145014 145540 144751 143456 142757 142921 143695 145021 146932
64474 146932 149093 150909 151941 151994 151028 149189 146807 144230 141876 140437 140519 141891 143590 145043 146588
64459 146588 148566 150557 152098 153521 155238 156647 156763 155660 154230 152628 150181 147020 144531 143624 143611
64444 143611 143523 143621 144680 146475 148028 148901 149250 148915 147621 146061 145752 147483 150540 153546 155447 155727
64428 155727 154570 153065 152466 152855 153136 152560 151551 150781 150295 150038 150360 151210 151636 151078 150606 151682 153969
64411 153969 155614 155694 155137 154951 154805 154068 153185 152961 153081 152525 151266 150470 150820 151622 152076 152594 154030 155976
64393 155976 156869 155892 153922 152190 150759 149041 147249 146263 146174 146069 145596 145693 147077 148854 149585 149240 149002
64376 149002 149380 149710 149689 150301 152530 155809 158426 159298 158882 158436 158675 159243 159452 159466 160322 162466 164710 165426
64358 165426 164672 164216 165295 167251 168734 169401 169840 170540 171740 173724 176356 178631 179574 179551 179981 181741
64342 181741 184410 186975 188640 188928 187773 185830 184257 183863 184635 186087 187650 188683 188608 187391 185704
64327 185704 184497 184469 185902 188583 191797 194632 196441 196917 195890 193458 190318 187480 185455 184048 183026
64312 183026 182585 182856 183312 183124 182048 180696 179889 179851 180016 179560 178200 176544 175597 175878 177080 178518 179722
64295 179722 180560 181040 181222 181364 181966 183433 185492 187076 187173 185981 184837 184701 185148 185355 185668 187260 190204
64278 190204 192863 193644 192748 191604 191109 191079 191134 191344 191996 193277 195288 197907 200489 202173 202811 203376 205068
64261 205068 208008 211037 212928 213663 214362 215937 218124 220058 221534 223086 224800 225826 225574 224802 224626
64246 224626 224650 223169 219516 215313 212716 212053 211950 211393 210715 210745 212031 214987 219594 224373 226742 225562
64230 225562 222898 222137 224448 228022 230683 232146 233456 235407 238229 241960 246162 249739 251942 253421
64216 253421 255567 258849 262448 265413 267593 269406 271229 273131 274813 275788 275951 275800 275618 274700 272119
64201 272119 268224 264574 262171 260523 258787 257055 255832 254782 252865 249743 246510 244819 245444 247663
64187 247663 249853 250755 250368 249701 249733 250732 252446 254570 256887 259347 262268 266255 271647 278084 284676 290505
64171 290505 294957 297919 299839 301350 302779 304231 306248 309851 315492 322086 327520 330207 330190 328900 328013
64156 328013 328351 329588 330837 331372 330766 328766 325592 322222 319727 318194 316878 315597 315276 316788 319874
64141 319874 323695 327862 332254 336377 339767 342828 346453 350809 355088 358458 360706 361998 362639 363162 364085
64126 364085 365391 366604 367430 367952 368165 367771 366497 364292 361241 357767 354766 352868 351492 349369 346218
64111 346218 343166 341159 339816 338505 337836 339022 342055 345581 348696 351929 356031 360619 364809 368808
64097 368808 374054 381604 390937 400573 409494 417632 425317 432906 441025 450560 461862 474155 486192
64084 486192 497563 508996 521285 534237 546809 557914 566780 572843 575910 576594 576193 575715 574922 572389
64070 572389 566612 557220 545386 533090 521832 511793 502279 492941 484349 477208 471323 465789 460116
64057 460116 454645 449717 445055 440470 436697 434826 435015 436371 438088 440047 442255 444466 446761 449853
64043 449853 454247 459486 464832 470469 477290 485526 494182 502077 509111 516293 524770 534930 546168 557253
64029 557253 567068 575333 582753 590367 598629 607067 614805 621315 626527 630326 632357 632514 631264 629162
64015 629162 626385 623166 620260 618116 615782 611664 605580 599058 593222 587538 581378 575783 572419 571330
64001 571330 571015 570475 569952 569655 569148 568459 568807 571560 576960 584265 592630 601506 610684 620349 630839 642197
63985 642197 654292 667388 681926 697548 713045 727777 742621 759001 777338 796852 816503
63974 816503 835570 853634 870603 886691 901984 916149 928990 941092 953401 966137 978552
63963 978552 989878 1000167 1010132 1020459 1031523 1043518 1056481 1070052 1083536 1096487 1109193 1122216
63951 1122216 1135362 1147518 1157747 1166299 1174192 1182154 1190397 1199087 1208413 1218421 1229435 1242497
63939 1242497 1258523 1276997 1296353 1315822 1336172 1358550 1383696 1412593 1446584 1485867 1528757
63928 1528757 1573449 1619904 1669099 1721275 1776423 1836071 1902730 1977087 2057146 2140940 2229193
63917 2229193 2324408 2428033 2539608 2658522 2785448 2921709 3068035 3224819 3393505 3576801
63907 3576801 3777060 3994978 4230715 4486127 4764915 5070435 5404446 5768754 6167270
63898 6167270 6605337 7087411 7616436 8195301 8827741 9517550 10267717 11080377 11956266
63889 11956266 12893274 13885966 14927146 16009526 17125290 18264315 19413336 20556517
63881 20556517 21675987 22751827 23762562 24686939 25506137 26204885 26770950 27193929 27464754
63872 27464754 27576474 27525540 27312334 26940723 26417555 25752989 24961231 24060419 23070986
63863 23070986 22013366 20906611 19768492 18616010 17465151 16330313 15224392 14159118
63855 14159118 13144303 12186433 11288785 10453382 9682166 8975654 8331227 7743896 7208724
63846 7208724 6721902 6279920 5878873 5514852 5184245 4883459 4608941 4357683 4127279
63837 4127279 3915473 3720181 3539852 3373055 3217651 3071145 2932057 2800284 2675952
63828 2675952 2558611 2447670 2342647 2242513 2145655 2051199 1959901 1873231 1791879 1715480
63818 1715480 1643265 1574589 1509361 1448257 1391935 1339665 1289565 1240758 1194581 1152877 1115621
63807 1115621 1080891 1046731 1012400 978458 946524 918472 894861 874300 854958 836283 818631
63796 818631 802007 786344 772467 761308 752286 743765 735086 726955 719871 713520 707814 703010 698466
63783 698466 692839 686126 680046 675407 670357 662418 651285 638482 625199 611906 599397 588481 578621
63770 578621 568216 556427 543716 530480 516365 501411 486975 474714 464996 456734 448623 440236
63758 440236 432051 424580 417559 410148 401930 393371 385054 376950 368918 361474 355354 350553 346555 343266
63744 343266 340799 338475 335180 330976 327293 324991 323142 320469 317161 314293 311960 309085 305137 301108
63730 301108 298465 297585 297480 296880 295456 294002 293334 293038 291819 289319 286987 286512 287744 288922 288740 287319
63714 287319 285170 282297 278818 275674 273891 273440 273389 272976 272074 270748 268964 266870 264960 263757 263394 263559
63698 263559 263753 263622 263153 262594 262347 263045 265501 270037 275699 280603 283442 284520 285254 287102 291051 297338
63682 297338 304882 311543 315930 318907 322558 327744 333570 339269 345539 353546 363429 374282 384964 394465
63668 394465 402301 409375 417881 429424 443307 457268 469618 480022 488545 494908 498784 500207 499551
63655 499551 497532 495006 492200 488351 482849 476459 470471 464728 457731 448971 439960 432268 425490 417988
63641 417988 408955 398914 388759 379263 371137 364591 358945 353566 349170 347357 348653 351651 354310 355619
63627 355619 355945 356376 358034 361534 366577 372155 377410 382369 387852 394688 402891 411513 419544 427179 435885
63612 435885 446785 459172 471107 481266 489542 495964 500016 501486 501277 500654 499879 498066 494253 488194
63598 488194 480233 470908 460888 450956 441713 433285 425359 417525 409564 401471 393511 386443 381503 379565
63584 379565 380067 381132 381228 380573 380580 382101 384664 387350 389951 393174 398095 405437 415060 426024 437491
63569 437491 449606 463244 478925 496372 515108 534922 555593 576654 597704 618724 640011
63558 640011 662173 686111 712312 739931 767248 793534 819864 847492 875819 902609 925907
63547 925907 945083 960273 971741 979953 985525 988651 988925 986137 981092 975392 970366 966221 962040 956479
63533 956479 948510 937711 924194 908615 892262 876584 862064 847702 832109 815240 798662 783972
63521 783972 771246 759303 747229 735253 724194 714508 706103 698775 692426 686935 682180 678252 675440
63508 675440 674116 675075 679785 689341 702755 717191 730771 744677 761594 782514 806125 830955
63496 830955 856642 883059 909770 936990 965760 996263 1026902 1055926 1083102 1108844 1132500
63485 1132500 1152656 1168646 1180731 1189279 1194917 1199199 1203809 1208951 1213341 1215814 1216233 1214943 1212176
63472 1212176 1207883 1201259 1190498 1174021 1152188 1127133 1100813 1073790 1045671 1015772 983438 948878
63460 948878 913932 880929 850339 820428 789693 758881 730146 704983 683403 664348 646341
63449 646341 628383 610944 595674 583629 574123 565731 557967 551492 546997 544292 542376 540305 538322
63436 538322 537950 540197 543709 545899 546385 548154 554311 564514 575665 585605 594883 605111 616745 628801
63422 628801 640023 649999 659447 669372 679723 689077 695978 700223 702376 702538 700333 695850 689680 682032
63408 682032 672733 662329 652424 644349 637818 631301 623631 615043 606733 599604 593506 587635 581560 575691
63394 575691 570868 567782 566758 567626 569630 571920 574416 577830 582703 588942 596519 605899 617218 629662
63380 629662 642482 656246 672294 691077 711758 733314 755323 777795 801034 825821 853125
63369 853125 883330 916030 950544 986324 1023060 1060905 1100419 1141681 1183447 1223704 1260960
63358 1260960 1294362 1322746 1344618 1359559 1368955 1374750 1377707 1377299 1373063 1365688 1356758 1347570 1338114
63345 1338114 1327238 1313875 1298009 1280234 1260566 1238166 1212338 1183490 1153035 1122570 1093157
63334 1093157 1065102 1038250 1012467 987865 964634 942961 923170 905579 890174 876923 866552
63323 866552 860202 857746 857255 857076 857979 862206 870597 881720 893763 906204 919504 934297 951368
63310 951368 971588 995239 1021696 1050031 1079532 1109600 1139794 1170180 1201155 1232758 1264585
63299 1264585 1296285 1327395 1356566 1381745 1401409 1415095 1422822 1424926 1422652 1417827 1411453 1403420
63287 1403420 1393956 1384223 1374738 1364177 1350785 1334365 1315895 1295758 1273495 1249206 1224077 1199328
63275 1199328 1175218 1151134 1126181 1099730 1071959 1043952 1016959 991530 967638 945390 925135
63264 925135 906831 889732 872958 856343 840673 826926 815152 804308 793614 783715 775791 769716
63252 769716 764238 759151 755961 755662 756957 757691 757125 755672 753312 749892 746617 745401 746449 747798 747655
63237 747655 745995 743487 740239 736487 733520 732614 733412 734384 734835 735581 737502 740121 742036 742437 741801 741186
63221 741186 741131 741335 741226 740609 739813 739380 739787 741410 744526 749074 754235 758444 760400 760400 760227 761166 762500
63204 762500 762739 762022 762047 763544 765294 766394 768152 772388 778654 784754 789739 794901 801715 810158 819397
63189 819397 828984 838709 848135 856929 865205 873163 880915 889127 899284 912759 929771 949422 970399
63176 970399 991484 1011937 1031786 1051512 1071408 1091778 1113764 1138837 1166809 1195157 1221372
63165 1221372 1245603 1270029 1295942 1322543 1348505 1373437 1397362 1419949 1441176 1461992 1483169
63154 1483169 1503731 1521646 1536268 1549163 1562024 1574424 1584224 1589678 1590377 1586433 1577759 1564580
63142 1564580 1548070 1529999 1511748 1493718 1475338 1455560 1433689 1410134 1386324 1363796 1343425
63131 1343425 1325474 1310105 1297782 1289315 1285320 1285333 1287736 1291204 1296158 1303941 1314585 1326522 1338949
63118 1338949 1353324 1371571 1393553 1417405 1441820 1466727 1491807 1515571 1536406 1554082 1570045
63107 1570045 1586451 1604517 1623261 1640104 1653305 1663452 1671889 1678239 1680626 1678057 1671224 1660867
63095 1660867 1646714 1628571 1607352 1584309 1559989 1534495 1508096 1481021 1453187 1424618 1395721
63084 1395721 1366883 1338431 1311285 1286869 1265907 1247920 1232321 1219117 1207968 1197568 1187027
63073 1187027 1177203 1169548 1164067 1159561 1155647 1153211 1152789 1153741 1155457 1158302 1162618 1167604 1172101 1176124
63059 1176124 1180697 1186133 1191388 1195480 1198952 1203302 1209193 1215885 1222480 1229049 1236155 1243727 1250982 1257268
63045 1257268 1262565 1267248 1271744 1276273 1280615 1284399 1287944 1292325 1297950 1303538 1307463 1309778 1311788 1313825
63031 1313825 1314922 1314905 1315259 1317174 1320085 1323095 1326638 1331469 1336896 1341582 1345726 1351137 1359170 1369593
63017 1369593 1381371 1393572 1405597 1417582 1430761 1446551 1464999 1484662 1504111 1523038 1541907
63006 1541907 1561223 1581260 1602093 1623863 1647351 1673905 1704176 1737214 1771582 1807033 1844128
62995 1844128 1882519 1921053 1959807 2000696 2045314 2093092 2142287 2192089 2242972 2295470 2349362
62984 2349362 2403851 2457987 2511123 2563357 2615327 2667388 2719291 2770794 2821874 2871895 2919264
62973 2919264 2962848 3003545 3043695 3084800 3126231 3165969 3201976 3232774 3257398 3275379 3286689
62962 3286689 3291322 3288759 3277982 3258240 3229950 3194686 3154156 3109392 3061103 3010487 2959120 2908238
62950 2908238 2858807 2812298 2770475 2733987 2701906 2673307 2648814 2629929 2617191 2609730 2606555 2607631
62938 2607631 2613658 2625161 2641762 2661980 2683910 2706526 2730169 2755410 2781772 2808170 2834232
62927 2834232 2860121 2885046 2907140 2925390 2940852 2955056 2967620 2976186 2978496 2973849 2962630 2945185
62915 2945185 2921316 2890397 2851786 2805516 2752777 2695384 2634628 2570936 2504633 2436489 2367254
62904 2367254 2297296 2227336 2159207 2094981 2035197 1978557 1923632 1870459 1820277 1774192 1732439
62893 1732439 1694500 1659396 1626079 1594129 1564013 1536285 1510640 1486160 1462423 1439799 1418655
62882 1418655 1398904 1380514 1363755 1348442 1333412 1317467 1300659 1284103 1268578 1253832 1239263
62871 1239263 1224687 1210268 1196167 1182648 1170268 1159474 1149906 1140352 1129635 1117738 1106076 1096479
62859 1096479 1089567 1084105 1078108 1070662 1062533 1055145 1049303 1044830 1040899 1036449 1030780 1024239 1018094 1013283
62845 1013283 1009450 1005636 1001674 998322 996030 994279 992344 990179 988239 986811 985836 984978 983554 980824
62831 980824 976786 972475 969012 966523 964313 961842 959154 956598 954626 953653 953569 953549 952938 952215 952402 953561
62815 953561 954578 954584 953958 953686 954276 955495 956625 956846 955947 954868 954864 955850 956353 955456 953898 952695 951597 949847
62797 949847 947707 946003 944542 942287 939104 936193 934650 934540 935518 937260 938994 939675 939262 938957 939516 940065
62781 940065 939440 938025 937215 937329 937173 935841 934030 933102 933417 934103 934137 933146 931310 929131 927467 927257 928616
62764 928616 930332 930772 929452 927365 925655 924471 923464 922823 922998 923551 923206 921328 918759 916848 916084 916115
62748 916115 916685 917980 920203 923353 927516 932993 939904 947802 955769 962936 969073 974954 982238 992647
62734 992647 1006810 1023839 1042338 1062044 1084128 1109541 1137442 1166065 1195138 1226411 1261337
62723 1261337 1299126 1338041 1377965 1420473 1466614 1516018 1568463 1625094 1687245 1754711 1825882
62712 1825882 1899205 1974088 2050789 2129819 2211017 2292631 2371616 2445301 2512608 2573393 2627054
62701 2627054 2672298 2707872 2732864 2746496 2748330 2738653 2718092 2686799 2644550 2591802 2530292 2462328
62689 2462328 2389679 2313225 2233513 2151512 2068795 1987005 1907270 1830301 1756882 1687760 1622998
62678 1622998 1561978 1504351 1450558 1401079 1355577 1313186 1273317 1235829 1200820 1168668 1139802
62667 1139802 1113949 1090079 1067737 1047850 1031452 1018035 1006167 995345 985969 977689 969334 960956
62655 960956 954656 952527 954621 959656 966933 976638 988748 1002610 1017495 1033013 1049158 1066458 1085865
62642 1085865 1108145 1133651 1163043 1197465 1237237 1280809 1326071 1372599 1421722 1474397 1530016
62631 1530016 1587600 1647233 1709684 1775081 1842379 1909752 1975114 2036634 2093248 2144524 2189785
62620 2189785 2227628 2256550 2275680 2284550 2282589 2269518 2246126 2213994 2174291 2127256 2073100 2013023
62608 2013023 1949137 1883505 1817418 1751329 1685236 1619213 1553880 1490492 1430461 1374628 1322852
62597 1322852 1274223 1227793 1183204 1140773 1101070 1064532 1031340 1001278 973544 947069 921432
62586 921432 897302 875543 855930 837241 818669 800713 784491 770522 758279 746502 733813
62575 733813 719582 704666 690970 679873 671232 664174 658311 653696 650060 646878 644036 641656 639375
62562 639375 636644 633803 632015 631837 632577 633300 633786 634163 634471 635276 638012 643818 652286 662002 671978 681965
62546 681965 691864 701837 712872 726168 741787 758611 775729 793074 810636 828170 846264 866796
62534 866796 891425 920085 951608 985301 1020974 1057855 1094751 1131564 1169562 1209550 1250440
62523 1250440 1290329 1328549 1365852 1402648 1437744 1468900 1494123 1512202 1522581 1525336 1521245 1511429
62511 1511429 1496674 1477163 1452874 1424190 1392072 1357727 1322228 1286508 1251510 1217973 1185814
62500 1185814 1154023 1121704 1089368 1058815 1031482 1007141 984365 961937 939524 917400 896034
62489 896034 875781 856456 837372 818329 800436 785254 773013 762280 751598 740810 730554
62478 730554 721207 712943 706225 701494 698532 696765 696027 696394 697320 697684 697033 696445 697824 702427 710102 719810
62462 719810 730660 742386 754957 768099 781599 796005 812413 831360 852359 874814 898796
62451 898796 924441 951092 977845 1004808 1033095 1063632 1096538 1131537 1168160 1205378 1241698
62440 1241698 1275959 1307615 1336180 1360955 1381524 1397908 1409759 1415833 1414771 1406329 1391635 1372454
62428 1372454 1350374 1326382 1300830 1273786 1245447 1216103 1185941 1155450 1126075 1099691 1076864
62417 1076864 1056075 1035279 1014119 994072 976517 961226 946966 933200 920823 911173 904515 899704
62405 899704 895380 891189 887595 884835 882708 881393 881666 883947 887718 892403 898301 905884 914429 922259
62391 922259 928552 934379 941619 951075 961726 971524 978676 982501 983512 982977 982212 981780 980829 977326 969694
62376 969694 958659 947087 937430 929461 920963 910430 898468 886636 875654 865120 854451 843547
62364 843547 832737 822488 813314 805775 800404 797569 797288 799111 802210 805680 809006 812490 817204 824076
62350 824076 832752 841624 849372 856303 863867 873098 883892 895565 907400 918684 928956 938538 948301
62337 948301 958591 968800 978189 986649 994255 1000556 1004796 1006577 1005931 1003199 999428 996505 996033 997958
62323 997958 1000840 1003532 1006038 1008854 1012311 1016960 1023979 1034548 1048925 1066431 1086207 1107872 1131806
62310 1131806 1159072 1190822 1227521 1268893 1314629 1364712 1418805 1475885 1535042 1596337 1660338
62299 1660338 1727040 1795702 1865436 1935147 2002898 2066107 2122638 2171325 2211470 2242488 2264258
62288 2264258 2277256 2281966 2278530 2267107 2248090 2221719 2188071 2147805 2102527 2054053 2003697 1952511
62276 1952511 1901541 1851265 1801336 1751669 1703481 1658483 1617212 1578793 1542139 1506672 1472162
62265 1472162 1438843 1407752 1379981 1355361 1332691 1311529 1292863 1277557 1264965 1253772 1243564
62254 1243564 1234773 1227540 1221522 1216624 1213087 1210794 1209086 1207242 1204548 1200066 1193268 1185111 1177605 1171662
62240 1171662 1166119 1159680 1153269 1149165 1147785 1146690 1143486 1138740 1134980 1133394 1132848 1132040 1131197 1131203 1132328
62225 1132328 1134636 1138731 1145010 1152795 1161221 1170592 1181753 1194500 1207847 1221902 1238098 1257146
62213 1257146 1277878 1298828 1320263 1344020 1371740 1403651 1438590 1474917 1511980 1551038 1594212
62202 1594212 1642205 1693744 1747562 1803964 1863624 1925645 1987963 2049389 2110085 2169925 2227229
62191 2227229 2279446 2324563 2361578 2389970 2409048 2417915 2416229 2404978 2386097 2361008 2329909 2292806
62179 2292806 2250822 2205917 2159534 2112100 2063798 2015397 1968367 1924388 1884547 1848650 1815462
62168 1815462 1783925 1753991 1726229 1701216 1679588 1662035 1648583 1638370 1630616 1625201 1621672 1618512
62156 1618512 1614575 1610714 1608741 1608996 1610217 1611573 1613384 1615788 1618310 1621283 1626177 1633646 1642376 1650954
62142 1650954 1660044 1671606 1686463 1703743 1722447 1742538 1764390 1787943 1812795 1838875 1866793
62131 1866793 1897510 1931483 1968091 2006076 2044495 2082992 2121417 2159818 2198761 2238640 2278287
62120 2278287 2315108 2347309 2375494 2401564 2426655 2450851 2474399 2498178 2522982 2549098 2576681
62109 2576681 2606054 2637501 2671095 2706783 2744415 2783708 2824201 2864948 2904125 2939447 2969485
62098 2969485 2994389 3015042 3031799 3044449 3053049 3058267 3061023 3062033 3061349 3058032 3050854 3039969 3027594
62085 3027594 3016363 3007233 2999601 2993040 2987959 2984685 2983058 2983250 2986195 2992667 3002378 3014306 3027606
62072 3027606 3042009 3057801 3075704 3096443 3120121 3146152 3173846 3202826 3232934 3264279 3297483
62061 3297483 3333385 3372123 3412923 3455122 3499048 3545438 3594169 3644039 3693975 3744196 3796042
62050 3796042 3850573 3907435 3965196 4022847 4080692 4139535 4199367 4259424 4319423 4379964 4441449
62039 4441449 4503299 4564896 4626954 4691270 4759138 4830557 4905058 4982733 5064009 5148717 5235905
62028 5235905 5324745 5415343 5508430 5604356 5702621 5802346 5902994 6004482 6106793 6209597
62018 6209597 6312204 6413762 6513685 6612003 6709093 6804804 6897969 6987103 7071681 7152596 7231359
62007 7231359 7308964 7385414 7460045 7532104 7600976 7665882 7725567 7778747 7825097 7865545 7901252
61996 7901252 7932327 7957730 7976345 7987961 7993451 7994200 7991094 7983694 7970568 7950785 7924914 7894314
61984 7894314 7859895 7822255 7782683 7743025 7704342 7666436 7628978 7592377 7557169 7523221 7490184
61973 7490184 7458342 7428484 7401174 7376559 7354635 7335189 7317587 7301073 7285308 7270411 7256585
61962 7256585 7243968 7232648 7222470 7212922 7203564 7194588 7186672 7180240 7174999 7170102 7164599 7157919 7150363
61949 7150363 7143218 7138058 7135591 7135048 7134651 7132721 7128539 7122337 7114511 7104796 7092278 7076154 7056256 7032744
61935 7032744 7005407 6973364 6935237 6889515 6835121 6772071 6701650 6625855 6546735 6466221 6386020
61924 6386020 6307071 6229090 6151170 6073036 5995567 5919983 5846841 5776033 5707594 5642062 5579824
61913 5579824 5520332 5462402 5405430 5349991 5296924 5246126 5196833 5149004 5103677 5061579 5021979
61902 5021979 4983519 4945892 4910139 4877404 4847936 4821296 4797054 4775123 4755685 4738870 4724385
61891 4724385 4711634 4700637 4692772 4690008 4693115 4700885 4711312 4723315 4737236 4754029 4774305 4797990
61879 4797990 4824657 4854184 4887167 4924542 4966699 5013198 5063497 5117637 5175815 5237486 5301539
61868 5301539 5367618 5436894 5511229 5591750 5678720 5772759 5875752 5990356 6118985 6263543
61858 6263543 6425848 6607813 6811323 7038456 7291810 7573905 7885791 8226698 8595645
61849 8595645 8993424 9422729 9886523 10386571 10923214 11495702 12102417 12741138 13409464
61840 13409464 14104513 14821177 15549559 16273094 16968614 17608342 18162825 18603809 18906957
61831 18906957 19054853 19039737 18864376 18540429 18085848 17522954 16876658 16171602 15429156
61822 15429156 14666608 13898695 13138900 12398931 11687670 11011241 10373617 9776772 9220933
61813 9220933 8705718 8231140 7797036 7401796 7042388 6715704 6419279 6150688 5907105
61804 5907105 5686105 5486500 5307854 5149278 5009075 4885368 4776636 4681632 4599334 4529165
61794 4529165 4470911 4424025 4387205 4358989 4338579 4325385 4317612 4312062 4306104 4299526 4293619 4288467
61782 4288467 4282062 4272464 4259872 4245860 4231261 4215829 4199740 4184241 4170698 4159830 4152095 4147883
61770 4147883 4146879 4148012 4150623 4155001 4161051 4167090 4170893 4171614 4169747 4165452 4158161 4147983 4136331 4124548
61756 4124548 4112776 4100988 4090551 4083854 4082597 4087140 4097462 4114118 4138215 4171024 4213735 4267039
61744 4267039 4330743 4404227 4487595 4582185 4689711 4811069 4946155 5094675 5256901 5433795
61734 5433795 5626749 5837415 6067720 6319799 6595659 6896830 7224625 7580994 7969191
61725 7969191 8393405 8857749 9365522 9919067 10519944 11169448 11869470 12623008 13433557
61716 13433557 14304079 15236968 16234693 17299413 18431216 19626977 20881005 22185436
61708 22185436 23528024 24888180 26234739 27526992 28717461 29754828 30587769 31171058
61700 31171058 31472831 31479672 31197038 30645817 29857976 28873213 27735892 26490707 25177769
61691 25177769 23829859 22473314 21130673 19821931 18563564 17367099 16239087 15182515
61683 15182515 14198431 13286718 12445949 11673165 10964363 10315412 9722419 9181233 8687099
61674 8687099 8235190 7821355 7442226 7094822 6776341 6484087 6215331 5967461 5738535
61665 5738535 5527224 5331760 5149325 4977166 4814049 4659769 4513357 4372820 4236958
61656 4236958 4106515 3982904 3866349 3755818 3650313 3549601 3453942 3363713 3279118 3199865
61646 3199865 3125281 3055093 2989680 2929009 2871552 2815083 2758660 2703298 2650679 2601830 2557008
61635 2557008 2515941 2477475 2439601 2400849 2361780 2324541 2290719 2259968 2230786 2202088 2173687
61624 2173687 2145751 2118526 2092542 2068432 2046250 2025280 2004668 1983915 1962757 1941163 1919800
61613 1919800 1899831 1881692 1864512 1847457 1831224 1817287 1805869 1795678 1785720 1776321 1768019 1760442
61601 1760442 1752886 1745260 1737809 1730497 1723344 1716887 1711646 1707527 1704293 1702125 1701025 1700237 1699205 1698792
61587 1698792 1700512 1704618 1709914 1715412 1721141 1727046 1732113 1735278 1736763 1738016 1740544 1744890 1750353 1755559
61573 1755559 1759730 1763556 1768394 1774622 1781364 1787892 1794496 1801561 1808483 1813992 1817028 1816837 1812855 1805362
61559 1805362 1795907 1786196 1776498 1765713 1753012 1738852 1724310 1709927 1695369 1679902 1663073 1645251
61547 1645251 1627628 1611375 1596669 1582769 1569145 1556215 1544713 1534675 1525476 1516885 1509601 1504453
61535 1504453 1501322 1499238 1497516 1496392 1496409 1497657 1499989 1503648 1509175 1516823 1526568 1538553 1552859 1568764
61521 1568764 1584909 1600630 1616727 1634726 1655713 1680081 1707695 1737745 1768891 1800332 1832731
61510 1832731 1867529 1905319 1945310 1986423 2028467 2071983 2117083 2162750 2207522 2250867 2293579
61499 2293579 2336480 2379079 2420143 2459404 2497768 2535676 2572393 2607381 2641096 2673432 2702537
61488 2702537 2726828 2747496 2767099 2785690 2800389 2809345 2814268 2817837 2819972 2818325 2811766 2801910 2791288
61475 2791288 2781303 2772126 2763620 2755927 2749618 2745512 2744178 2745726 2750405 2759062 2772475 2790471 2812394
61462 2812394 2838457 2870056 2908831 2956038 3012747 3079700 3156661 3242636 3337273 3441634 3557199
61451 3557199 3684646 3824113 3976242 4142218 4322875 4518278 4728174 4952333 5190291
61442 5190291 5441170 5704033 5978134 6262408 6554412 6849554 7141270 7421990 7684072
61433 7684072 7920051 8122561 8284942 8402577 8473664 8498587 8479023 8418166 8321416 8195727
61423 8195727 8047558 7881676 7702150 7513980 7323044 7134459 6951495 6776216 6610700
61414 6610700 6457295 6317901 6193417 6084064 5990090 5911993 5850068 5803894 5772462 5754835
61404 5754835 5750527 5759157 5779868 5811303 5852056 5900918 5956683 6018031 6083847 6153439 6226208 6301223
61392 6301223 6377369 6453844 6530161 6605699 6679789 6752541 6825128 6898639 6972750 7046088 7117913
61381 7117913 7188653 7258404 7325564 7387779 7444010 7494911 7541262 7582892 7619315 7650393 7675749
61370 7675749 7694296 7705268 7709249 7707098 7698032 7680061 7652714 7618394 7580397 7540308 7498058 7453845
61358 7453845 7408852 7364201 7320324 7277794 7238050 7202740 7172605 7147406 7126695 7110097 7096866
61347 7096866 7085676 7075369 7065921 7058337 7053261 7049809 7046190 7041601 7037110 7034430 7034333 7036924 7043240 7055715
61333 7055715 7076853 7108129 7150626 7206273 7277680 7366697 7473463 7597036 7736981 7894527
61323 7894527 8072297 8272571 8495583 8739526 9002178 9281941 9576877 9883118 10194909
61314 10194909 10505985 10810155 11100367 11368052 11604169 11800994 11952988 12056526 12109451
61305 12109451 12111167 12063066 11968741 11833267 11661555 11457017 11222193 10960815 10678787 10382685
61295 10382685 10077707 9767622 9456283 9148025 8846319 8552880 8268837 7996355 7738306
61286 7738306 7496340 7269914 7057686 6859679 6677642 6513209 6366004 6233996 6115738
61277 6115738 6011791 5923717 5852020 5795533 5752570 5722014 5703300 5696046 5699974 5714667 5739050
61266 5739050 5771412 5810028 5853244 5898859 5944433 5989014 6033867 6080442 6127880 6173535 6215749
61255 6215749 6254888 6291489 6324730 6353492 6378051 6399716 6419171 6435933 6449103 6457817 6460982 6457367
61243 6457367 6446258 6427673 6401853 6368902 6329171 6283681 6233790 6180290 6122996 6061460 5996199
61232 5996199 5928940 5861289 5793274 5723830 5652916 5582678 5516123 5454910 5398731 5346544 5297930
61221 5297930 5253411 5213906 5179968 5151329 5127102 5106438 5088923 5074299 5062131 5051828 5042732
61210 5042732 5034082 5025277 5016371 5007989 5000723 4995175 4992650 4994845 5002189 5013225 5026491 5042511 5063067
61197 5063067 5089020 5120038 5156315 5199348 5250794 5311443 5381460 5460735 5548725 5644680 5748153
61186 5748153 5858438 5973203 6088525 6200458 6305568 6399520 6476239 6529522 6555118 6550867
61176 6550867 6515783 6450022 6355422 6235088 6092564 5931899 5758153 5576888 5392960 5209987
61166 5209987 5030539 4856192 4687609 4525336 4370604 4224919 4089097 3963253 3847643
61157 3847643 3742749 3648417 3563571 3487170 3419121 3359845 3309020 3265111 3226370 3192316 3163921
61146 3163921 3142081 3126165 3114572 3106592 3102844 3103728 3108348 3115534 3125144 3137591 3152594 3169114 3185992
61133 3185992 3201778 3214461 3222579 3226555 3228037 3227861 3225381 3219580 3209809 3195480 3176163 3152341 3125193
61120 3125193 3095296 3062320 3026135 2987261 2945860 2901266 2853177 2802625 2751204 2700023 2649862
61109 2649862 2601476 2554790 2508321 2460305 2410329 2359519 2309633 2262414 2218841 2177960 2137095
61098 2137095 2094566 2052017 2012867 1978513 1947386 1917793 1890097 1865396 1843324 1822299 1801123
61087 1801123 1779203 1755808 1730442 1703855 1677614 1652612 1628929 1607200 1588809 1574072 1561148
61076 1561148 1547767 1533714 1520929 1511462 1506019 1504195 1505116 1507683 1511092 1515575 1522142 1531184 1541719
61063 1541719 1552466 1563337 1575378 1589328 1604555 1619405 1632478 1643737 1654514 1666211 1678924
61052 1678924 1691738 1704357 1717693 1732256 1746698 1758944 1768541 1776739 1784153 1789403 1790655 1787792
61040 1787792 1782439 1776322 1770212 1764016 1757022 1748015 1735988 1721253 1705654 1691209 1678503 1666516
61028 1666516 1653897 1640093 1625192 1609166 1591897 1573907 1556369 1539976 1524157 1507816 1490681
61017 1490681 1473717 1458518 1446607 1438702 1433859 1429626 1424014 1417485 1412256 1409581 1408646 1408346 1408943 1411060
61003 1411060 1413885 1415732 1416341 1417456 1420780 1426211 1432716 1440332 1450228 1462668 1475796 1487180 1496365
60990 1496365 1505176 1515451 1527172 1539103 1550510 1561566 1572552 1583716 1595831 1609959 1626325
60979 1626325 1644038 1662211 1680905 1700824 1722550 1746205 1771316 1796871 1822215 1848193 1876751
60968 1876751 1908925 1943770 1979692 2016219 2053822 2092467 2131233 2169254 2206538 2243876 2282368
60957 2282368 2322884 2365578 2410026 2456078 2504399 2555919 2611122 2670320 2734296 2804049 2880038
60946 2880038 2962202 3050781 3146717 3251242 3365458 3490332 3626823 3775808 3937808 4112663
60936 4112663 4299595 4498216 4709710 4936696 5181722 5446542 5733340 6046169 6390542
60927 6390542 6771901 7195142 7665186 8187041 8765007 9402339 10101934 10867399 11704043
60918 11704043 12619677 13624616 14730598 15949762 17295066 18781341 20425305 22245145
60910 22245145 24262403 26506482 29015793 31825272 34935213 38272407 41670643 44894922
60902 44894922 47706932 49939183 51540574 52578728 53208224 53619175 53975917 54358334 54726651
60893 54726651 54928976 54754257 54011101 52598705 50538267 47954005 45021477 41915796
60885 41915796 38781685 35724831 32812993 30080532 27536851 25178163 22998180 20994074
60877 20994074 19167061 17518950 16047194 14741929 13586970 12563286 11652293 10837894
60869 10837894 10107228 9449756 8855453 8314459 7818956 7364451 6948189 6566771 6216158
60860 6216158 5893291 5596254 5322746 5069385 4832604 4609522 4398167 4197808 4009054
60851 4009054 3832609 3667699 3512534 3366328 3229887 3103830 2987181 2878235 2776158
60842 2776158 2681167 2593525 2512810 2437955 2367759 2301622 2239886 2183137 2131234 2083511 2039801
60831 2039801 2000394 1964860 1931890 1900739 1871933 1845844 1821331 1796684 1771426 1746231 1721385
60820 1721385 1696314 1670560 1644289 1617701 1590861 1564342 1539280 1516212 1494374 1472585 1450560
60809 1450560 1429014 1408824 1390456 1373906 1358794 1344720 1331845 1320905 1312268 1305322 1299355 1294821
60797 1294821 1292928 1293943 1296688 1300044 1304252 1310261 1318419 1328466 1340298 1353923 1368880 1384664 1401706
60784 1401706 1420993 1442463 1464619 1486144 1507008 1527423 1546597 1563655 1579328 1595310 1611713
60773 1611713 1626317 1636968 1643936 1649158 1653751 1657228 1658977 1659424 1659260 1658191 1655143 1649601 1642261 1634359
60759 1634359 1626691 1619275 1611531 1602466 1590941 1576224 1558643 1539774 1521796 1506217 1492760 1479491
60747 1479491 1464559 1448127 1432387 1419435 1409370 1400789 1392794 1385870 1380826 1377614 1375563 1374369 1374230
60734 1374230 1375127 1376574 1378421 1381667 1387893 1397709 1410041 1423274 1436749 1450615 1464535 1477672 1490268
60721 1490268 1504149 1520745 1539232 1557480 1574215 1589287 1602450 1613455 1623179 1633099 1643425 1653283
60709 1653283 1662951 1674115 1687031 1699249 1708648 1716458 1725468 1736044 1745897 1753535 1759976 1766683 1773449
60696 1773449 1779025 1782773 1784821 1785273 1784054 1781333 1777709 1773973 1770639 1767459 1763542 1758392 1752576 1746881
60682 1746881 1741000 1733855 1725106 1715638 1706429 1697593 1688523 1678419 1666843 1654580 1643792 1636257 1631300
60669 1631300 1626369 1619880 1612522 1605638 1599528 1593847 1588432 1582895 1576404 1568817 1561334 1555018 1549287 1542816
60655 1542816 1535362 1527717 1520396 1513591 1508060 1504674 1502917 1500987 1497801 1493961 1490410 1486933 1482639 1477439
60641 1477439 1472385 1468535 1465811 1462969 1458692 1452733 1445870 1438604 1430213 1419595 1406905 1393765 1381670
60628 1381670 1370573 1359203 1346492 1332550 1318489 1305370 1293180 1280853 1267506 1253500 1240052
60617 1240052 1227987 1217321 1207926 1199935 1193378 1187962 1183594 1180776 1180239 1182337 1186889 1193322 1200824 1208669
60603 1208669 1216571 1224527 1232333 1239681 1246825 1254589 1263290 1272086 1279916 1286908 1294415 1303658 1314548 1325697
60589 1325697 1335396 1342936 1349444 1357234 1367868 1380885 1394671 1408218 1421442 1434165 1445958 1457239
60577 1457239 1469438 1483405 1498400 1513420 1528784 1545330 1562517 1578794 1593912 1609404 1626104
60566 1626104 1642353 1655741 1665916 1674566 1682997 1690852 1697098 1701113 1702498 1700758 1695734 1687914 1678040
60553 1678040 1666782 1654934 1643361 1632533 1622559 1613841 1607050 1602183 1598331 1594854 1592093 1590379 1589004
60540 1589004 1587056 1584840 1583514 1583440 1583797 1583801 1583534 1583402 1583536 1583917 1584519 1585176 1585834 1587022 1589420 1592813 1596221
60523 1596221 1599371 1603253 1608708 1615163 1621406 1627053 1632413 1637333 1641179 1643865 1645949 1647553 1648022 1647065
60509 1647065 1645576 1644777 1644913 1645254 1645158 1644661 1644073 1643312 1641636 1637910 1631468 1623099 1614898 1608508 1603552 1598459
60493 1598459 1592968 1589071 1588974 1592776 1598949 1606692 1616772 1629985 1645855 1663434 1682709 1704514 1729465
60480 1729465 1757737 1789644 1825669 1865896 1910177 1959058 2013790 2074850 2140786 2209021 2277514
60469 2277514 2344979 2409519 2467827 2516407 2553490 2579401 2595136 2601082 2597465 2585639 2568433 2549177
60457 2549177 2530753 2515556 2505627 2502168 2505024 2513115 2525445 2541582 2561368 2584618 2611026 2639906
60445 2639906 2669976 2700032 2730343 2763272 2802149 2849461 2906071 2971828 3046558 3130607 3225068
60434 3225068 3331988 3454247 3594544 3753917 3931133 4123852 4330634 4551720 4787913
60425 4787913 5039172 5304744 5584555 5880064 6193849 6528647 6886630 7268800 7674301
60416 7674301 8099505 8536608 8971855 9385019 9751812 10048492 10255705 10359931 10353845 10237240
60406 10237240 10017749 9709751 9331680 8903287 8443554 7968829 7491590 7020819 6563617
60397 6563617 6126253 5713664 5328531 4971398 4641746 4338918 4062375 3811635 3586143
60388 3586143 3384881 3205758 3045445 2900231 2767426 2645991 2535806 2436482 2347033 2266423
60378 2266423 2193805 2128052 2067504 2010654 1956957 1906625 1859652 1815438 1773432 1733806 1697208
60367 1697208 1663873 1633246 1604632 1578105 1554370 1533512 1514291 1495340 1477007 1461203 1449006
60356 1449006 1439058 1428975 1417981 1407367 1398527 1391437 1385238 1379599 1374951 1371724 1369683 1367890 1365241
60343 1365241 1361342 1356988 1353466 1351292 1349914 1348745 1348021 1348452 1350475 1354151 1359338 1365535 1371927 1378098
60329 1378098 1384410 1391232 1398068 1403946 1408374 1411318 1412522 1411724 1409509 1407047 1404806 1402291 1399281 1396420
60315 1396420 1394101 1391624 1388379 1385272 1383893 1384361 1384999 1384287 1382395 1380477 1379182 1378348 1377755 1377586 1378234 1379957
60299 1379957 1382718 1386193 1390009 1394074 1398613 1403853 1409850 1416584 1423906 1431347 1438404 1445297 1453024 1462212
60285 1462212 1472102 1481198 1488934 1496195 1504077 1512570 1520791 1528258 1535498 1543358 1552032 1560924 1569316 1576858
60271 1576858 1583416 1588792 1592906 1596156 1599186 1602245 1605117 1607808 1610890 1614750 1618717 1621357 1621716 1620111
60257 1620111 1617732 1615665 1614170 1612563 1609789 1605284 1599348 1592597 1585367 1577968 1571282 1566488 1564019 1563204
60243 1563204 1563109 1563424 1564399 1566276 1569047 1572502 1576279 1580044 1583796 1587878 1592597 1598091 1604596 1612377 1621164
60228 1621164 1630075 1638527 1646951 1656117 1665973 1675665 1684624 1693187 1702123 1711989 1722939 1734669 1746389
60215 1746389 1757308 1767505 1778191 1790839 1806076 1823399 1841796 1860586 1879785 1899862 1921155
60204 1921155 1943635 1967361 1992941 2021238 2052709 2087505 2126260 2170226 2220244 2275943 2336370
60193 2336370 2401275 2471274 2546716 2626865 2710614 2798045 2891138 2992673 3104198 3224917 3352687
60182 3352687 3486088 3625396 3771548 3924571 4083269 4246072 4411546 4578055 4743489
60173 4743489 4905679 5062826 5213313 5355365 5487196 5607340 5714555 5807596 5885477 5947933
60163 5947933 5995209 6027381 6044461 6047611 6039867 6025120 6006381 5985396 5963751 5943647 5927319 5916300
60151 5916300 5911755 5915376 5929409 5955785 5995390 6048166 6113768 6192272 6284509 6391441 6512669
60140 6512669 6645472 6785770 6930280 7077483 7226332 7374468 7518057 7653151 7776642
60131 7776642 7885924 7978275 8051170 8103252 8134631 8146144 8138507 8112428 8069349 8011652 7941954
60120 7941954 7862500 7775569 7684341 7593047 7506189 7427737 7360845 7307792 7269847 7247360 7240359
60109 7240359 7249196 7274583 7316911 7375460 7448195 7532434 7625674 7725578 7829103 7932111 8030309
60098 8030309 8120480 8200510 8268684 8323853 8366382 8398036 8420393 8433929 8439110 8437968 8434122 8431650
60086 8431650 8434413 8445901 8468805 8504832 8555726 8624552 8715284 8831024 8973199 9142586 9340232
60075 9340232 9567003 9823016 10108263 10423358 10768890 11144199 11547494 11977130 12431846
60066 12431846 12909309 13404870 13912264 14425189 14937578 15442478 15931495 16395915 16828045
60057 16828045 17221093 17568172 17862300 18097680 18270513 18378460 18419984 18394769 18304277 18151100
60047 18151100 17938077 17669165 17351613 16996463 16615997 16220558 15818026 15415851 15022580
60038 15022580 14646857 14295256 13971748 13679364 13421789 13202851 13024735 12887411 12789849
60029 12789849 12731014 12709115 12720421 12759502 12820469 12897358 12983531 13071562 13154131 13224899 13278740
60018 13278740 13311846 13321860 13307600 13268473 13204296 13115303 13001807 12864021 12703027 12521885
60008 12521885 12324962 12115999 11897489 11671777 11441581 11209201 10976649 10747318 10526184
59999 10526184 10317051 10120589 9936593 9767546 9618157 9491387 9386699 9302665 9239743 9199438
59989 9199438 9181729 9184777 9207117 9249136 9311877 9394583 9493812 9605021 9724588 9849656 9976191
59978 9976191 10098403 10210724 10309571 10392259 10455122 10494237 10507742 10495906 10458867 10395928 10307567
59967 10307567 10196673 10066931 9921172 9762218 9594322 9422608 9251672 9085654 8928853
59958 8928853 8784892 8655547 8541588 8444725 8367646 8312042 8277620 8263525 8270173 8299267 8352265
59947 8352265 8429045 8527936 8646927 8784894 8941488 9115871 9305869 9508181 9718532 9931309
59937 9931309 10140086 10339543 10526423 10697718 10848637 10973677 11069482 11135322 11170804 11174801
59927 11174801 11147256 11090789 11009356 10905980 10782725 10642449 10489651 10329653 10167731 10009100
59917 10009100 9858935 9721730 9600535 9497051 9412637 9349114 9308330 9290882 9295760 9321717
59907 9321717 9368621 9436869 9525638 9632412 9754113 9887923 10030971 10180225 10333172 10487798
59897 10487798 10641418 10790289 10931315 11063734 11188327 11305236 11413503 11512838 11605098 11693762
59887 11693762 11782494 11874510 11972825 12080543 12201006 12338046 12496086 12679497 12891422 13133323
59877 13133323 13405840 13709986 14047146 14417908 14821337 15255234 15716101 16198034 16692082
59868 16692082 17187403 17672674 18135534 18561248 18933683 19238444 19464639 19604014 19650446
59859 19650446 19601840 19461867 19238627 18941944 18582715 18173990 17730648 17266972 16794750
59850 16794750 16323611 15862359 15419558 15003168 14619672 14273252 13965854 13698565 13472781
59841 13472781 13289583 13148334 13046989 12984025 12959145 12971609 13018564 13095553 13197861 13320470
59831 13320470 13457078 13600143 13741996 13875106 13991165 14080799 14134948 14146483 14110406 14023128
59821 14023128 13882545 13689060 13446107 13159422 12836036 12483888 12111487 11726805 11336237
59812 11336237 10944902 10557892 10180576 9817535 9471696 9144826 8838440 8553887 8291958
59803 8291958 8052779 7835802 7639617 7462285 7302380 7159294 7031869 6917113 6811208
59794 6811208 6711731 6618110 6529937 6446017 6365490 6288920 6217401 6151194 6090105 6034735 5986174
59783 5986174 5944194 5906516 5870305 5833929 5796873 5758391 5716878 5670593 5618629 5561237 5499709
59772 5499709 5436197 5373144 5312278 5254154 5198997 5148051 5103619 5067528 5039870 5019577 5006154
59761 5006154 5000572 5004582 5019430 5045378 5082249 5130070 5188783 5257159 5332359 5411149 5491763 5574351
59749 5574351 5659652 5747763 5838133 5929881 6021510 6110792 6195535 6274078 6344608 6404807 6453525
59738 6453525 6492852 6527461 6561477 6596639 6633712 6674927 6724340 6786025 6862262 6953283 7058687
59727 7058687 7179378 7318202 7478376 7661283 7866215 8092333 8340372 8612415 8910711
59718 8910711 9236934 9591670 9973765 10380057 10805526 11242533 11678805 12096499 12474334
59709 12474334 12791679 13031828 13183733 13243213 13213665 13105236 12932490 12711972 12460275 12192201
59699 12192201 11919274 11649790 11390379 11147227 10925708 10729412 10560381 10420497 10312326
59690 10312326 10238331 10199449 10194790 10222736 10282059 10371984 10491850 10641419 10821411 11033049
59680 11033049 11276873 11552528 11859960 12200320 12575303 12986049 13433194 13917750 14441317
59671 14441317 15005430 15611121 16259211 16950772 17687115 18469329 19297568 20170534 21085557
59662 21085557 22038869 23025124 24036323 25061875 26090618 27112883 28120528 29105917
59654 29105917 30062659 30988159 31884838 32758180 33613835 34456946 35293395 36130054 36972789
59645 36972789 37824061 38682203 39541943 40394553 41227592 42025708 42772881 43454519 44058157
59636 44058157 44573538 44993326 45314207 45537414 45668972 45720219 45707427 45649286 45563880 45468187
59626 45468187 45379746 45316797 45295667 45328841 45426292 45597563 45851213 46192921 46625731 47152022
59616 47152022 47773655 48489709 49294883 50180071 51132919 52136533 53167682 54196400 55186813
59607 55186813 56098445 56888248 57513444 57934358 58117344 58038912 57690360 57079556 56228055
59598 56228055 55166060 53928962 52555621 51085927 49557262 48002162 46448248 44918341
59590 44918341 43428792 41987222 40592297 39235882 37905560 36586601 35264818 33930855
59582 33930855 32583186 31226998 29870574 28523515 27197561 25906205 24661024 23468452
59574 23468452 22331004 21250914 20231241 19273986 18379072 17545546 16772321 16057283 15397144
59565 15397144 14789136 14231800 13723167 13259004 12833933 12443776 12085911 11757994 11457462
59556 11457462 11182000 10929305 10696327 10479633 10276667 10085893 9905426 9732123 9562374
59547 9562374 9393514 9224430 9055124 8885767 8715875 8544398 8370914 8196773 8024784
59538 8024784 7857738 7697360 7544420 7399310 7262369 7134061 7015158 6906722 6809778 6724813
59528 6724813 6651481 6588991 6537112 6496666 6468389 6451253 6442720 6441081 6446835 6461205 6484066 6514091
59516 6514091 6550147 6591358 6636261 6683442 6733174 6787350 6847580 6914331 6988086 7070116 7161521
59505 7161521 7262518 7373398 7495470 7630339 7778764 7940990 8117831 8310821 8521543
59496 8521543 8751196 9000510 9269653 9558531 9867398 10196603 10545380 10911650 11293559
59487 11293559 11690382 12100935 12521717 12947755 13374829 13799576 14217703 14623995 15014733
59478 15014733 15388771 15745214 16080864 16391080 16672719 16925360 17149970 17347452 17518618
59469 17518618 17664881 17788742 17894127 17986292 18070824 18152483 18235221 18323086 18420065 18528542
59459 18528542 18648298 18777092 18911019 19043344 19163786 19260705 19324346 19347052 19320583 19235321
59449 19235321 19083549 18862768 18574864 18223147 17811932 17348509 16843294 16307284 15750426
59440 15750426 15182555 14614040 14054245 13510241 12987958 12493449 12031709 11604895 11213132
59431 11213132 10856700 10536186 10250971 9999338 9780429 9594803 9442684 9322822 9233564
59422 9233564 9173932 9142995 9139175 9161090 9208499 9281692 9380402 9503904 9651522 9822269 10014383
59411 10014383 10225976 10455858 10703017 10965493 11240043 11522240 11806087 12084172 12349296
59402 12349296 12595670 12817404 13006195 13152168 13247471 13288144 13272474 13199350 13069327 12886067
59392 12886067 12655178 12381947 12071337 11729849 11366004 10988628 10605218 10221755 9842941
59383 9842941 9472151 9111876 8764767 8433830 8121268 7827649 7552790 7297180 7061963
59374 7061963 6847613 6653135 6476674 6316580 6171792 6041595 5925439 5822967 5733922 5657768
59364 5657768 5593441 5539708 5495864 5461891 5437746 5422680 5415569 5415837 5423625 5439017 5461699 5491737
59352 5491737 5530111 5577615 5633164 5693854 5757043 5821947 5889017 5958389 6029937 6104891 6186683
59341 6186683 6279545 6386275 6507528 6643054 6793116 6958477 7139311 7334785 7544258 7768961
59331 7768961 8012145 8277359 8566923 8882507 9226816 9603763 10016587 10466524 10953885
59322 10953885 11479922 12046748 12655609 13306234 13997956 14730270 15501196 16305157 17132787
59313 17132787 17972560 18812340 19640031 20443929 21213224 21938531 22612607 23231178 23792847
59304 23792847 24297418 24744118 25131760 25460302 25731095 25945085 26101286 26197526 26232098 26203993
59294 26203993 26111933 25954297 25730456 25442026 25092952 24688894 24236598 23743206 23215532
59285 23215532 22659791 22081650 21485833 20875461 20252397 19618929 18979068 18337890 17699976
59276 17699976 17069144 16449689 15847063 15266814 14713071 14188221 13693607 13230064 12797997
59267 12797997 12397589 12029178 11693224 11389821 11118306 10877318 10665109 10479975 10320650
59258 10320650 10186258 10075654 9986942 9917914 9866847 9832414 9812864 9805781 9808735 9819752 9837015
59247 9837015 9858526 9882155 9905462 9925366 9938721 9943625 9939661 9926572 9903574 9870701 9830017 9784431
59235 9784431 9735725 9684820 9633562 9584874 9541180 9504045 9475622 9459024 9456590 9468912 9496290
59224 9496290 9540056 9601491 9680408 9776071 9888835 10019467 10167011 10328721 10502133 10686043
59214 10686043 10879059 11078271 11279840 11480036 11675057 11860434 12031588 12184873 12317567
59205 12317567 12426982 12510330 12565873 12593899 12596037 12573469 12526084 12453730 12358255 12243965 12116062
59194 12116062 11978834 11835183 11686973 11535189 11380146 11222301 11062959 10904010 10747273
59185 10747273 10594593 10448339 10311163 10185284 10072433 9974396 9893074 9830016 9786510 9764269
59175 9764269 9765627 9792944 9848145 9932759 10047961 10194538 10373174 10584701 10829674 11107901
59165 11107901 11419032 11763300 12140484 12547612 12978207 13423974 13876384 14326074 14761443
59156 14761443 15168690 15533260 15841168 16079882 16239081 16311094 16290820 16175969 15968177 15673803
59146 15673803 15303136 14868528 14382874 13858978 13309327 12746006 12180517 11623189 11082400
59137 11082400 10564338 10073281 9611613 9179878 8777934 8406564 8067242 7759972 7482217
59128 7482217 7230683 7003311 6798787 6615136 6450199 6303032 6173285 6059299 5958392
59119 5958392 5869350 5793182 5730712 5680576 5640605 5610384 5591200 5583643 5586258 5596674 5613348 5635986
59107 5635986 5664857 5700290 5742758 5793056 5852099 5920335 5997140 6080665 6168469 6258843 6351819
59096 6351819 6448624 6549854 6654290 6759797 6864837 6968367 7068574 7162886 7249405 7327153
59086 7327153 7394661 7449754 7491539 7521208 7539648 7545586 7537877 7518671 7492111 7460338 7423249 7382263
59074 7382263 7341631 7304947 7272646 7244572 7223279 7212800 7215255 7230611 7259150 7302197 7360583
59063 7360583 7434295 7523934 7631060 7756541 7899708 8059657 8236490 8430710 8642128 8870034
59053 8870034 9113856 9372928 9645748 9930120 10224121 10526739 10837422 11154857 11475900
59044 11475900 11795506 12107744 12406826 12686980 12941392 13161694 13338929 13465296 13535214
59035 13535214 13545145 13493028 13378454 13203554 12973217 12693952 12372561 12016044 11632081 11228526
59025 11228526 10812254 10389117 9964902 9545310 9134691 8735689 8350543 7981789 7631212
59016 7631212 7299253 6986338 6693703 6421598 6167388 5927101 5698843 5483635 5283009
59007 5283009 5097052 4924747 4764880 4616215 4477731 4349153 4230548 4121218 4019693
58998 4019693 3924935 3836624 3754115 3676177 3602276 3533191 3469660 3411029 3355801 3302971 3252237
58987 3252237 3203399 3156203 3110683 3067321 3026974 2990635 2958836 2931198 2907034 2886308 2869291
58976 2869291 2855368 2843298 2832939 2825535 2821640 2819807 2818334 2817548 2819330 2824817 2833492 2844121 2855497
58963 2855497 2866473 2876287 2885029 2893218 2900906 2907629 2913007 2916888 2919214 2920445 2921863 2924652 2928755 2933258
58949 2933258 2937830 2943103 2949780 2958173 2968608 2981277 2995265 3008371 3018488 3024999 3028620 3030170 3029814
58936 3029814 3027464 3023636 3019520 3015895 3012175 3007247 3001400 2996672 2994873 2996100 2999827 3006464 3016567 3029085
58922 3029085 3042038 3055076 3070176 3089426 3112984 3139443 3167324 3195942 3225643 3257552 3292506
58911 3292506 3330112 3369496 3410877 3455422 3503450 3554001 3606505 3661629 3719839 3780227 3841608
58900 3841608 3903960 3968003 4034231 4103197 4175881 4252612 4332191 4413202 4495879 4581930 4672997
58889 4672997 4770296 4875161 4988580 5110229 5239031 5374727 5518075 5669788 5830433 6001382
58879 6001382 6184625 6381317 6591507 6815536 7054678 7310107 7582446 7873003 8184416
58870 8184416 8519104 8877774 9260578 9669311 10107392 10577685 11081311 11618722 12190968
58861 12190968 12799372 13444646 14127228 14848403 15610248 16413772 17257118 18135773 19044387
58852 19044387 19978024 20931548 21898130 22868265 23829388 24765576 25657724 26484792 27225606
58843 27225606 27860077 28369814 28738972 28955605 29012946 28910296 28653275 28252974 27724022
58834 27724022 27082941 26347860 25538477 24674545 23773697 22850908 21919720 20992910 20081614
58825 20081614 19194552 18338444 17518491 16738024 15998434 15300190 14643642 14028484 13453006
58816 13453006 12914534 12410384 11938083 11495340 11080536 10692889 10331397 9993885 9677832
58807 9677832 9381934 9106061 8849722 8611308 8388968 8181564 7988711 7810485 7647300
58798 7647300 7499434 7366376 7246911 7140025 7045351 6962794 6892377 6834662 6790587 6760279
58788 6760279 6742346 6734935 6737389 6750548 6775664 6813561 6864800 6930150 7010507 7106359 7217401
58777 7217401 7342677 7481294 7633229 7799616 7982229 8182597 8401501 8639203 8896157
58768 8896157 9173588 9473362 9797282 10146667 10522775 10927421 11362788 11830581 12331666
58759 12331666 12866632 13436457 14042550 14686372 15368944 16090285 16849163 17643645 18471923
58750 18471923 19331880 20219277 21126557 22043646 22959321 23860897 24732594 25554933 26306187
58741 26306187 26964553 27509776 27924353 28194655 28311654 28271227 28074559 27728582 27245417
58732 27245417 26640680 25931882 25137691 24277181 23368567 22428499 21472683 20516191 19571859
58723 19571859 18648437 17751378 16885628 16056621 15268237 14521111 13814060 13146513 12518586
58714 12518586 11929485 11377283 10860210 10376714 9923954 9497694 9094606 8713932 8356146
58705 8356146 8020708 7706008 7410827 7134615 6876456 6634806 6408420 6196773 5999536
58696 5999536 5816359 5647256 5492233 5350129 5218529 5095353 4980075 4872982 4773783 4681578
58686 4681578 4595869 4516968 4445415 4381351 4324245 4272739 4224822 4178625 4133179 4088219 4043363
58675 4043363 3997774 3950622 3901603 3850982 3799350 3747274 3694919 3641914 3587663 3531773 3474247
58664 3474247 3415514 3356462 3298028 3240319 3182288 3122806 3062085 3001639 2942731 2885290 2828470
58653 2828470 2771895 2715963 2661222 2608023 2556961 2509272 2466178 2427601 2391784 2356637 2321574
58642 2321574 2287750 2256484 2227885 2201224 2176041 2152306 2129775 2107925 2086548 2065824 2045727
58631 2045727 2025957 2006698 1989009 1974103 1962468 1953827 1947644 1943430 1940750 1939151 1938031 1936635 1934378
58618 1934378 1931132 1926915 1921529 1915167 1909351 1906375 1907253 1910717 1914668 1918088 1921117 1924006 1926939 1930601
58604 1930601 1935805 1942388 1949113 1954832 1959222 1962350 1964271 1965310 1966224 1967672 1969791 1972558 1976176 1980877
58590 1980877 1986677 1993729 2002733 2014637 2029835 2047753 2067344 2088169 2111189 2138271 2170543 2207359
58578 2207359 2247250 2289746 2335680 2385898 2440558 2499875 2564580 2635177 2711608 2794322 2884852
58567 2884852 2984443 3092807 3209374 3335297 3472744 3622304 3782574 3952649 4133609 4326862
58557 4326862 4532365 4749694 4979900 5224611 5483282 5752454 6027856 6306188 6584333
58548 6584333 6857503 7118712 7359704 7572077 7747928 7880305 7963775 7995179 7974345 7904136
58538 7904136 7789556 7636641 7452066 7243115 7017023 6779903 6536527 6291187 6048152
58529 6048152 5810994 5581930 5362311 5153543 4957205 4774615 4606734 4454230 4317004
58520 4317004 4193663 4081996 3980194 3887434 3803368 3727494 3659160 3597681 3542155 3491495 3445020
58509 3445020 3402867 3365347 3331854 3300685 3270159 3239762 3209947 3180729 3150725 3117843 3080866
58498 3080866 3040166 2996859 2951595 2904270 2854629 2803004 2750744 2700023 2652694 2608825 2566705
58487 2566705 2524846 2483688 2444741 2408360 2373331 2338696 2304976 2273106 2242944 2213360 2183290
58476 2183290 2152209 2120148 2087937 2057091 2028823 2003292 1980103 1959041 1939696 1920882 1901346
58465 1901346 1881052 1861097 1842479 1825512 1810199 1796256 1782775 1768763 1754369 1740857 1729131
58454 1729131 1718871 1709408 1700815 1693723 1688522 1685062 1682765 1680771 1678462 1676062 1674346 1673623 1673682 1674921
58440 1674921 1678698 1685962 1696191 1708323 1722110 1737731 1754537 1771182 1787035 1802732 1819337 1837425
58428 1837425 1856780 1876378 1894675 1910451 1923327 1933282 1940055 1943560 1944348 1942792 1938190 1929557 1917075
58415 1917075 1901784 1884099 1863881 1841878 1819658 1797878 1776089 1754746 1735744 1719892 1705267
58404 1705267 1689546 1673127 1658365 1646290 1635694 1625315 1615346 1606524 1599062 1593005 1588635 1585995
58392 1585995 1584714 1584746 1586557 1590145 1594428 1598115 1600842 1603160 1605898 1609957 1616261 1625335 1636895 1650002
58378 1650002 1663498 1676455 1688749 1701300 1715173 1730174 1744794 1757680 1768620 1777972 1785920 1792711
58366 1792711 1798751 1803783 1806651 1806783 1805375 1804212 1803627 1802561 1800387 1797747 1795703 1795038 1796258 1799169 1802372
58351 1802372 1804415 1805873 1809172 1815791 1824517 1833096 1840572 1847119 1852472 1855967 1857794 1858926 1859627 1859033
58337 1859033 1856357 1851634 1844980 1836038 1824888 1813036 1802679 1794835 1788458 1781469 1772608 1762451 1752867
58324 1752867 1745740 1742200 1742666 1746934 1754064 1762924 1773543 1787452 1805930 1828057 1851300 1873913 1895858
58311 1895858 1917393 1937933 1956909 1974841 1992714 2010849 2029026 2047148 2064969 2081677 2096742
58300 2096742 2111070 2126355 2143201 2160638 2177594 2194062 2210715 2228039 2246150 2264764 2283095
58289 2283095 2300361 2316677 2332894 2349275 2364983 2379171 2391780 2402805 2411711 2418549 2424996 2433113
58277 2433113 2443375 2454970 2467740 2482438 2499058 2516415 2533938 2552682 2573773 2596878 2621067
58266 2621067 2646255 2672677 2699685 2726365 2753041 2780946 2810596 2841546 2873493 2906255 2938801
58255 2938801 2969977 3000657 3033627 3070482 3109769 3148880 3186496 3222195 3255182 3285244 3314181
58244 3314181 3344279 3375450 3405658 3434391 3464050 3497325 3534508 3574068 3614782 3656490 3699692
58233 3699692 3745283 3794052 3845700 3898889 3952999 4009342 4069949 4135575 4205555 4279160 4356259
58222 4356259 4436921 4521170 4609019 4700154 4793635 4888553 4985046 5084316 5187709 5295912 5408555
58211 5408555 5524003 5639936 5754848 5868917 5982878 6096404 6208359 6318569 6428626
58202 6428626 6540885 6657286 6779168 6907464 7042705 7185171 7335167 7492990 7658857
58193 7658857 7833443 8018481 8216312 8428649 8655867 8897318 9152087 9419898 9701854
58184 9701854 10000110 10316419 10651398 11005752 11381584 11781643 12207736 12660814 13142153
58175 13142153 13653311 14195496 14770621 15383018 16038471 16741196 17493051 18295909 19153396
58166 19153396 20069993 21050179 22099292 23223712 24428947 25718329 27094228 28559589
58158 28559589 30118003 31774451 33538359 35426136 37460160 39665766 42069884 44702678
58150 44702678 47601335 50814083 54400607 58426049 62952140 68032915 73716803 80050268
58142 80050268 87081000 94863544 103464863 112960351 123418191 134885055 147389399 160968918
58134 160968918 175717896 191837736 209661620 229633703 252251106 277965498 306975001
58127 306975001 338838760 372036350 403835223 430784865 449725722 458758552 457631989
58120 457631989 447463373 430137150 407763957 382343046 355578051 328776636 302813296
58113 302813296 278156937 254964957 233231125 212936213 194126781 176894000 161305620
58106 161305620 147364843 135014159 124154634 114661130 106397733 99232395 93040971
58099 93040971 87704593 83114410 79182134 75843055 73052474 70786706 69043171 67825569
58091 67825569 67125363 66926596 67226438 68026214 69275420 70815627 72380714 73652304 74327411
58082 74327411 74173924 73076775 71065161 68294640 64984544 61351808 57577747 53802435
58074 53802435 50121973 46584879 43202066 39971944 36902563 34016350 31341240 28899634
58066 28899634 26701211 24740789 23001405 21460376 20093535 18875883 17781914 16788361
58058 16788361 15877099 15035025 14251835 13518922 12829837 12180370 11567701 10989989 10446571
58049 10446571 9937399 9461660 9017439 8602992 8217544 7860124 7528076 7217530 6925216
58040 6925216 6649276 6388627 6142466 5910549 5693065 5489738 5299308 5120028 4950305
58031 4950305 4788828 4634718 4487868 4348617 4216706 4090999 3970614 3855824 3747271
58022 3747271 3644562 3546293 3451381 3359925 3272702 3190129 3111754 3036565 2963858 2893876 2827433
58011 2827433 2764828 2705434 2648369 2593132 2539452 2487307 2437705 2392734 2353761 2319695 2287841
58000 2287841 2256449 2225703 2196254 2167838 2139714 2111665 2084049 2057389 2032422 2010048 1990444
57989 1990444 1972316 1953682 1933640 1913186 1894288 1878376 1865665 1855387 1846178 1836385 1824820 1811804
57977 1811804 1799253 1789006 1780940 1773357 1765419 1758366 1753671 1750621 1746758 1740571 1732861 1725470 1719523
57964 1719523 1715056 1711456 1707778 1703283 1698205 1693555 1689928 1686951 1684271 1682373 1681851 1682393 1683307 1684745 1687517
57949 1687517 1691614 1695649 1698154 1699020 1699314 1699888 1700444 1700038 1698336 1696263 1695323 1696271 1698603 1701366 1704234 1707618
57933 1707618 1711884 1716743 1721479 1725661 1729513 1733393 1736873 1738607 1737480 1733799 1728844 1723220 1716192 1706948
57919 1706948 1696026 1685074 1675448 1667452 1660777 1655196 1650715 1647197 1643905 1639587 1633365 1625609 1617561
57906 1617561 1609972 1602649 1595542 1589491 1585210 1582091 1578908 1575443 1572477 1570192 1567549 1563484 1557970 1551553
57892 1551553 1544598 1537436 1530641 1524472 1518437 1512042 1505787 1500777 1497432 1495072 1492935 1491182 1490743 1492355
57878 1492355 1495798 1499882 1503147 1504816 1505128 1504697 1503603 1501245 1496939 1490357 1481475 1470572 1458414 1445970
57864 1445970 1433536 1420416 1405861 1390228 1374865 1360967 1348911 1338601 1329868 1322450 1316153 1311331
57852 1311331 1308736 1308575 1310109 1312602 1316260 1321701 1328760 1336395 1343538 1349559 1354152 1357565 1360894 1365485
57838 1365485 1371899 1379879 1388983 1398457 1406712 1412245 1415419 1418189 1421576 1424450 1425466 1425068 1424524 1423862 1422055
57823 1422055 1418737 1414439 1409324 1402950 1395386 1387482 1379886 1372652 1365975 1360500 1356638 1354139 1352434 1350921
57809 1350921 1349126 1347367 1347105 1349695 1354820 1361016 1367686 1375485 1384743 1394872 1405518 1416719 1427273
57796 1427273 1434534 1437113 1436705 1436050 1435967 1435628 1434836 1434271 1433892 1432742 1430425 1427433 1423927 1419499 1414326 1409275
57780 1409275 1404527 1399370 1393805 1389042 1385560 1381803 1375974 1368472 1361383 1355920 1351436 1346770 1341443 1335427
57766 1335427 1328728 1321605 1314529 1307487 1299807 1291064 1281841 1273194 1265548 1258350 1250620 1241605 1231207 1220139
57752 1220139 1209591 1200411 1192652 1186018 1180419 1175777 1171674 1167846 1164792 1163101 1162163 1160566 1158249 1157314
57738 1157314 1159861 1165568 1172209 1178112 1183131 1187700 1192343 1198366 1207562 1220372 1234994 1248993 1261279
57725 1261279 1272054 1281526 1289559 1296228 1301912 1306903 1311396 1315585 1319217 1321388 1321536 1320495 1319866 1320352
57711 1320352 1321240 1321382 1320003 1316676 1311450 1305255 1299424 1294486 1290019 1285972 1283316 1282790 1283612 1284294 1284510
57696 1284510 1285381 1287870 1291618 1295587 1299288 1302918 1306693 1310661 1315192 1320973 1328178 1336060 1343911 1352120
57682 1352120 1361547 1371868 1381453 1389276 1396213 1403847 1412606 1421768 1430716 1439221 1447007 1454241 1462295 1472671
57668 1472671 1484992 1497288 1508671 1520472 1534254 1550012 1567212 1586246 1607444 1629544 1650882
57657 1650882 1671825 1694512 1720226 1748494 1778934 1812379 1849401 1888789 1928473 1967482 2006538
57646 2006538 2047281 2091380 2139776 2192262 2248257 2308386 2374612 2448329 2529075 2615836 2708779
57635 2708779 2808599 2914757 3025866 3141970 3265374 3398957 3544483 3702609 3873394 4056326
57625 4056326 4250730 4456878 4676101 4909217 5155286 5412223 5677710 5948508 6219335
57616 6219335 6483488 6734530 6966520 7172852 7346392 7481936 7578566 7639445 7669466 7672889
57606 7672889 7651960 7606436 7533828 7430381 7292664 7119507 6913778 6682857 6436846 6185329
57596 6185329 5935188 5690864 5455795 5232968 5024425 4831104 4653560 4492570 4348808
57587 4348808 4222206 4111995 4017319 3937577 3872154 3820182 3780796 3753435 3737631 3732627 3737614
57576 3737614 3752424 3777623 3813749 3860702 3918120 3986035 4064814 4154630 4255336 4366739 4488623
57565 4488623 4620600 4762371 4914068 5075859 5247061 5425890 5610010 5796818 5983005
57556 5983005 6164216 6335273 6490279 6622364 6724039 6788693 6812182 6793289 6733204 6634984
57546 6634984 6503150 6343178 6160932 5962306 5752911 5537717 5320870 5105605 4894107
57537 4894107 4687664 4487643 4296414 4116659 3949404 3793329 3646463 3508076 3378578
57528 3378578 3258270 3147048 3044926 2951846 2866948 2788827 2716569 2649953 2588600 2531641 2478429
57517 2478429 2428996 2383518 2341803 2303649 2269308 2239211 2213269 2190638 2170185 2151256 2134157
57506 2134157 2119758 2108380 2099170 2090834 2082787 2075239 2068495 2062863 2059223 2058890 2062559 2069839 2080108
57493 2080108 2093468 2110614 2132083 2157770 2186861 2218068 2250249 2283219 2317971 2356214 2399717
57482 2399717 2449602 2505615 2566316 2630771 2700012 2776057 2859444 2948872 3043604 3144942 3254460
57471 3254460 3371690 3494752 3622837 3756884 3897853 4045292 4197595 4352699 4508136
57462 4508136 4660841 4807068 4942182 5060758 5157617 5229057 5272813 5287194 5271168 5225490
57452 5225490 5152957 5057197 4941770 4810742 4669296 4522732 4374846 4227726 4083028 3942843
57442 3942843 3809086 3682557 3563155 3451100 3347543 3253684 3169478 3093696 3025412 2964959
57432 2964959 2913192 2870266 2835582 2808523 2788470 2774339 2764980 2760220 2760766 2766896 2777961 2793592
57420 2793592 2814681 2842557 2877654 2919493 2967520 3021388 3081004 3147140 3221591 3305656 3398482
57409 3398482 3497911 3603069 3714963 3834185 3959187 4087646 4218448 4350856 4481895 4605841
57399 4605841 4716501 4809127 4880026 4925535 4942377 4928750 4884693 4811930 4713866 4595106 4459979
57388 4459979 4311577 4152880 3988393 3823360 3660970 3501452 3344667 3192749 3049086
57379 3049086 2915214 2790002 2671940 2560970 2457673 2361915 2273270 2192074 2118837 2052723
57369 2052723 1991557 1933503 1878170 1826227 1778662 1736334 1699117 1665115 1631738 1598270 1566700
57358 1566700 1539290 1515853 1494195 1472654 1451246 1430661 1411346 1393630 1377779 1363672 1350992
57347 1350992 1339691 1329536 1319376 1307974 1295716 1284428 1275293 1268048 1262415 1258776 1256654 1254023
57335 1254023 1249444 1243926 1239462 1236717 1235531 1236681 1241092 1247730 1254345 1260336 1267003 1274730 1281931 1287401
57321 1287401 1291874 1296294 1300254 1303395 1306831 1311606 1316848 1321175 1325118 1330294 1336576 1342069 1346020 1349924
57307 1349924 1355172 1361022 1365843 1369407 1372964 1377463 1382487 1386838 1389801 1391992 1395140 1400724 1408588 1417235
57293 1417235 1425635 1434337 1444456 1456087 1468393 1481089 1495136 1511653 1530483 1550139 1568982 1586205
57281 1586205 1601800 1616067 1629407 1642353 1655336 1668287 1680641 1691816 1701573 1710123 1718276 1727481
57269 1727481 1739075 1753097 1768172 1782910 1797172 1811690 1826796 1842081 1857091 1871830 1886569
57258 1886569 1901605 1917223 1933455 1949788 1965474 1980258 1994553 2008947 2023865 2039688 2056721
57247 2056721 2074959 2094248 2114789 2137012 2160697 2184664 2207815 2230423 2254029 2280134 2309177
57236 2309177 2340672 2373988 2408908 2445744 2485110 2527585 2573399 2622363 2673992 2727653 2782643
57225 2782643 2838358 2894521 2951232 3008674 3066735 3125050 3183386 3241808 3300237 3357929 3413613
57214 3413613 3466183 3515050 3559714 3599075 3631261 3654305 3667322 3671378 3669149 3663416 3655651 3646090
57202 3646090 3634901 3622904 3611150 3600225 3590095 3580298 3570162 3559267 3548079 3538017 3530757 3527654
57190 3527654 3529759 3537879 3552202 3572133 3596867 3625933 3658853 3694442 3730985 3767283 3803303 3839443
57178 3839443 3875057 3907949 3935943 3959349 3981550 4006686 4037063 4073330 4116630 4169136 4232112
57167 4232112 4304541 4384271 4469713 4559912 4653797 4750184 4847859 4944841 5038215 5125586 5206217
57156 5206217 5280075 5346651 5406006 5460348 5512886 5565217 5617278 5669976 5726199 5788527 5857052
57145 5857052 5930174 6006545 6085412 6165867 6246917 6328249 6410455 6494586 6581572 6671450 6762709
57134 6762709 6852899 6940387 7025155 7107451 7186136 7259082 7325112 7385094 7441287 7496057 7550978
57123 7550978 7606456 7662001 7717371 7773721 7833188 7896729 7962315 8025744 8083684 8135877 8184179
57112 8184179 8229740 8271770 8309043 8341748 8371247 8398785 8425395 8452758 8482720 8515194 8547025
57101 8547025 8573581 8591448 8599364 8596851 8582579 8554531 8511602 8454462 8384406 8301711 8205810 8096866
57089 8096866 7976078 7844027 7699732 7542191 7372213 7191876 7002619 6804843 6598966
57080 6598966 6385683 6164947 5935379 5694635 5439831 5167830 4876118 4563655 4230370
57071 4230370 3875843 3498933 3098521 2673983 2225110 1752107 1255330 734120 185868
57061 -393220 -1006620 -1657372 -2349542 -3089391 -3885404 -4747506 -5685678 -6708733 -7824884
57052 -7824884 -9043962 -10378377 -11841552 -13446817 -15209293 -17148614 -19289787 -21663590
57044 -21663590 -24308631 -27273465 -30616770 -34406812 -38721447 -43647209 -49277440 -55710908
57036 -55710908 -63047846 -71380230 -80784424 -91325670 -103059733 -116005829 -130107493
57029 -130107493 -145243403 -161306571 -178268380 -196131111 -214788991 -233903905 -252839893
57022 -252839893 -270620101 -285940156 -297379846 -303842123 -304959113 -301120096 -293085886
57015 -293085886 -281533421 -266887377 -249462918 -229675961 -208121610 -185519746 -162625277
57008 -162625277 -140165160 -118807416 -99142772 -81651149 -66638755 -54175293 -44087739
57001 -44087739 -36031407 -29597046 -24397043 -20109528 -16491367 -13372611 -10638881 -8210888
56993 -8210888 -6030360 -4053320 -2246933 -588518 934431 2326988 3592963 4739566
56985 4739566 5776939 6715714 7565895 8335696 9029510 9648299 10193640 10670815 11087531
56976 11087531 11451327 11769256 12048027 12292235 12503276 12681718 12830172 12952324 13049579
56967 13049579 13120165 13161470 13172250 13152825 13104568 13029991 12933101 12819356 12694891 12564993
56957 12564993 12432768 12299138 12163684 12024915 11880244 11727159 11564810 11393318 11210971
56948 11210971 11012889 10792821 10545701 10268920 9963375 9634746 9292864 8948581 8611224
56939 8611224 8288753 7988410 7715767 7474082 7265829 7094209 6962128 6870251 6816371 6794485
56929 6794485 6791915 6788227 6760574 6692893 6581016 6430463 6251018 6052859 5844812 5633632
56919 5633632 5424175 5219937 5022823 4832736 4648742 4471364 4303239 4147439 4005704
56910 4005704 3878273 3764386 3662501 3570796 3488007 3413525 3346702 3286826 3233868 3188292 3149743
56899 3149743 3116740 3088180 3064303 3045442 3030339 3016305 3000547 2980881 2955965 2925931 2892566
56888 2892566 2857957 2822875 2787063 2750903 2716073 2684410 2656633 2632401 2611269 2593420 2579479
56877 2579479 2569513 2562349 2556518 2552201 2551587 2556559 2566344 2578053 2589133 2598397 2605000 2607751 2605781 2599008
56863 2599008 2587570 2571522 2551469 2528800 2504811 2480265 2456153 2433979 2414432 2396313 2377718
56852 2377718 2358027 2337958 2318026 2298128 2278751 2261492 2247713 2237216 2228773 2221575 2215604 2210858
56840 2210858 2206954 2203598 2200915 2199080 2198061 2198174 2200503 2205970 2213782 2221520 2227278 2231246 2234539 2236984
56826 2236984 2237194 2234737 2230920 2226862 2221856 2214559 2205161 2195383 2186764 2179839 2174613 2170784 2167569 2164420
56812 2164420 2162104 2162225 2165491 2171326 2179322 2190101 2204189 2221012 2239743 2260599 2284501 2311791
56800 2311791 2341931 2374005 2406598 2437177 2462470 2479892 2488483 2488616 2481333 2468207 2451391 2433210
56788 2433210 2415489 2399266 2385138 2373661 2365259 2359875 2357275 2358039 2363867 2376354 2395660 2421035
56776 2421035 2452504 2491136 2537307 2589287 2643554 2695616 2740279 2772434 2788947 2789717 2776504 2751325
56764 2751325 2716553 2675658 2632385 2589241 2547706 2509535 2476591 2449391 2427192 2409833 2398316
56753 2398316 2393058 2392839 2396413 2404281 2417823 2437257 2461400 2488774 2517507 2544133 2563940 2573202
56741 2573202 2570638 2556638 2532049 2498344 2458130 2414404 2369325 2324338 2281386 2243091 2211331
56730 2211331 2186079 2166098 2150586 2139765 2134030 2133035 2135837 2141694 2150506 2162421 2177004 2192674
56718 2192674 2206838 2216696 2220161 2216423 2205942 2189981 2169891 2146621 2120826 2093293 2064866 2035962
56706 2035962 2006739 1978096 1951902 1929493 1910226 1892378 1875235 1859354 1844885 1831001 1817507
56695 1817507 1805728 1796736 1789517 1782103 1774075 1766801 1761385 1757501 1754265 1751178 1748030 1744727 1741542 1738829
56681 1738829 1736331 1733483 1730525 1728340 1726825 1724352 1719612 1713381 1707670 1703477 1700039 1696054 1690964 1685111
56667 1685111 1679197 1673682 1668463 1663209 1658112 1653914 1650872 1648189 1645022 1641708 1639247 1637716 1635967 1633005
56653 1633005 1629037 1624997 1621631 1619267 1617922 1617223 1616597 1615856 1615326 1615084 1614533 1613229 1611854 1611593 1612550 1613348
56637 1613348 1612624 1610490 1608175 1606519 1605209 1603453 1601070 1598829 1597880 1598829 1601276 1604224 1606917 1609099 1610518
56622 1610518 1610723 1609734 1608455 1607771 1607447 1606662 1605411 1604391 1603407 1601140 1597086 1592654 1589438 1587322 1585446
56607 1585446 1584120 1584147 1584598 1583271 1579769 1576480 1575653 1576709 1577398 1576662 1575243 1574055 1573103 1571828 1569848 1567552
56591 1567552 1566328 1567549 1570700 1573204 1573070 1571163 1569857 1569916 1569932 1568485 1565374 1560647 1553972 1545621 1536962
56576 1536962 1529187 1522275 1515744 1509609 1503897 1497991 1491418 1484831 1479324 1474950 1470798 1466510 1463062 1461794
56562 1461794 1463060 1465963 1469153 1471847 1474218 1476889 1480039 1483169 1485682 1487280 1487642 1486296 1483279 1479529
56548 1479529 1476015 1472641 1468605 1463761 1459078 1455576 1453223 1451060 1448189 1444547 1440907 1438245 1437052 1437266
56534 1437266 1438687 1441006 1443321 1444330 1443647 1442480 1442167 1442224 1440818 1437356 1433635 1431886 1432314 1433247 1433421 1433392
56518 1433392 1434645 1437817 1442041 1445873 1448637 1450797 1453145 1455917 1458853 1461786 1464795 1467928 1471280 1475227
56504 1475227 1480110 1485659 1491114 1495912 1499866 1502872 1505138 1507616 1511379 1516460 1522172 1528604 1536575 1545583
56490 1545583 1553171 1557421 1559222 1560869 1563182 1565379 1567253 1569755 1573322 1577047 1579795 1580991 1580067 1576457
56476 1576457 1570706 1564446 1558533 1552105 1544242 1535731 1528169 1521936 1516034 1509661 1503041 1496791 1491199 1486126
56462 1486126 1481128 1475675 1469608 1463252 1456858 1450316 1443868 1438542 1435084 1432538 1428760 1422540 1414749 1407332
56448 1407332 1401564 1397315 1393506 1389092 1383891 1378610 1374005 1370228 1367161 1364965 1363723 1362862 1361714 1360635
56434 1360635 1360723 1362220 1363924 1364651 1364666 1365081 1366240 1367326 1367413 1366326 1364510 1362607 1361254 1360837 1361095 1361240 1360848
56417 1360848 1360577 1361693 1364718 1368777 1372397 1374791 1376246 1377550 1379487 1382746 1387644 1393648 1399554 1404546
56403 1404546 1408880 1413255 1417812 1422093 1425671 1428354 1429935 1430331 1430037 1429995 1430855 1432506 1434353 1435877 1437058
56388 1437058 1438481 1440801 1443810 1446303 1447402 1447759 1448706 1450356 1451365 1450774 1449192 1447793 1446901 1446146 1445352
56373 1445352 1444558 1443617 1442528 1441843 1441906 1441924 1440702 1438258 1435765 1433637 1430678 1425666 1418997 1411984 1405132 1398132
56357 1398132 1391372 1386264 1383660 1382629 1381261 1378274 1373535 1367638 1361542 1356190 1351729 1347288 1342174 1337166
56343 1337166 1333873 1332662 1331887 1329542 1325325 1320915 1318527 1319178 1321806 1323959 1323923 1322404 1321523 1322033 1322381 1320970
56327 1320970 1318419 1316685 1316672 1317812 1319581 1322068 1324932 1326973 1327333 1326499 1325561 1324813 1323502 1320961 1317867
56312 1317867 1316196 1317446 1320745 1323408 1323992 1324136 1326448 1331104 1335880 1339321 1342202 1345484 1348561 1350616
56298 1350616 1352508 1355791 1360391 1364656 1367741 1370726 1374985 1380190 1384526 1386626 1386931 1387120 1388399 1390450
56284 1390450 1392071 1392596 1392506 1392834 1394434 1397700 1402394 1407571 1412186 1416003 1419567 1423202 1426590 1429617 1433095
56269 1433095 1438230 1445578 1454647 1464151 1472635 1479551 1485975 1493650 1502990 1512779 1522177 1532063 1543551 1555928
56255 1555928 1567309 1577018 1586137 1595649 1605066 1613242 1619802 1625351 1630677 1636160 1641789 1647471 1653233 1659031
56241 1659031 1664445 1668978 1672832 1676905 1681632 1686292 1690078 1693442 1697686 1703408 1710136 1717407 1725438 1734607
56227 1734607 1745050 1757040 1771189 1787891 1806864 1827526 1849621 1873381 1899255 1927460 1957570
56216 1957570 1988770 2020985 2055718 2095161 2140357 2190615 2244738 2302299 2363696 2429662 2501113
56205 2501113 2578909 2663264 2753690 2849952 2952864 3063719 3183045 3310354 3445114 3587569
56195 3587569 3738357 3897501 4064002 4236401 4413471 4594048 4776220 4956990 5132919
56186 5132919 5300885 5458038 5601439 5728305 5836767 5926160 5996398 6047091 6077201 6085662
56176 6085662 6072691 6040694 5993583 5934929 5866863 5790602 5707110 5616760 5519312 5415432 5307827
56165 5307827 5199514 5090925 4979954 4865210 4748005 4630454 4512696 4393039 4270405
56156 4270405 4145660 4020775 3897508 3776833 3658903 3543444 3430605 3321418 3217070
56147 3217070 3117967 3024018 2935694 2854043 2779463 2710963 2646904 2586098 2528117 2473155 2422108
56136 2422108 2376338 2336594 2301887 2269782 2238031 2206051 2175025 2146807 2122560 2102018 2083856
56125 2083856 2066969 2051442 2038184 2027586 2018954 2011456 2005260 2001265 1999821 2000163 2001195 2002657 2005386
56112 2005386 2010623 2018960 2029719 2041398 2053005 2064927 2078164 2092720 2107187 2120004 2130740 2140026
56100 2140026 2148639 2156997 2165200 2173214 2181108 2189349 2198792 2210238 2224039 2240003 2257441 2275501 2294017
56087 2294017 2314019 2336844 2362750 2391217 2422854 2460225 2506377 2563240 2631737 2712340 2804637
56076 2804637 2907300 3019774 3143570 3280744 3431341 3593390 3764960 3944616 4129499
56067 4129499 4314202 4492334 4658928 4811637 4950794 5078658 5197391 5306740 5403827 5485415
56057 5485415 5549847 5596721 5625762 5636888 5631030 5610134 5576301 5530919 5474096 5404516 5320259
56046 5320259 5220292 5105220 4976767 4837271 4690084 4539819 4391361 4248434 4113160 3986514
56036 3986514 3868702 3759365 3658082 3564959 3480569 3405161 3337886 3276796 3219843 3166315 3117348
56025 3117348 3074722 3039059 3009280 2983633 2960772 2939989 2921147 2904688 2891260 2880976 2873326
56014 2873326 2868005 2865425 2866093 2869825 2875954 2884149 2894697 2907907 2923427 2940214 2957393 2975249 2995079
56001 2995079 3017772 3042774 3068990 3096450 3126300 3159039 3193585 3228475 3263519 3299821 3338438
55990 3338438 3379421 3422165 3466436 3512777 3561591 3612050 3662816 3714319 3769277 3829805 3894635
55979 3894635 3960651 4026812 4094855 4166034 4239193 4312947 4388094 4466516 4548768 4634246 4723056
55968 4723056 4816225 4914146 5015918 5120387 5227207 5336896 5450407 5568611 5692015 5821156
55958 5821156 5957233 6101521 6253847 6412488 6576142 6745329 6921351 7105032 7297483
55949 7297483 7501105 7718140 7948393 8189721 8440909 8703250 8979556 9272666 9584848
55940 9584848 9917373 10270437 10644351 11040992 11463158 11912365 12388468 12892070 13426432
55931 13426432 13996253 14605122 15254935 15947333 16684867 17470959 18309882 19207226 20169564
55922 20169564 21202547 22309039 23489451 24744152 26075496 27488289 28989946 30591652
55914 30591652 32309219 34161973 36171024 38359926 40758029 43403551 46344278 49636352
55906 49636352 53341666 57523497 62241402 67548142 73489495 80104529 87425106 95477188
55898 95477188 104286755 113888709 124334984 135701516 148096758 161671691 176627961
55891 176627961 193226233 211801939 232771522 256554125 283309362 312498390 342493967
55884 342493967 370593148 393613935 408848889 414856649 411685159 400532892 383180983
55877 383180983 361526052 337322500 312065543 286925719 262709158 239864949 218559864
55870 218559864 198804584 180575164 163870852 148699637 135038446 122816807 111929104
55863 111929104 102252042 93655256 86010179 79198853 73116774 67670189 62775267 58360552
55855 58360552 54367083 50745107 47452305 44454318 41723147 39232962 36957747 34871665
55847 34871665 32948858 31163050 29490853 27917451 26437742 25050837 23754243 22542981
55839 22542981 21411620 20355067 19367984 18444580 17578797 16764367 15995350 15267013 14575738
55830 14575738 13917937 13289689 12687753 12110610 11558645 11033722 10538166 10073112 9637614
55821 9637614 9229676 8847720 8490300 8154864 7837992 7536848 7249564 6974476 6710099
55812 6710099 6455735 6211027 5975051 5747101 5528232 5320447 5124054 4937414 4759861
55803 4759861 4593255 4439417 4297147 4163239 4035929 3915905 3804053 3699626 3601255 3508877
55793 3508877 3423742 3346644 3276987 3213961 3157866 3109332 3067246 3028518 2990253 2951382 2911761
55782 2911761 2870806 2828086 2784396 2740922 2697617 2653586 2608886 2564744 2522071 2480934 2441494
55771 2441494 2404125 2368324 2332701 2296525 2260351 2224707 2189142 2153128 2117076 2081720 2046998
55760 2046998 2012091 1976278 1939611 1903222 1869041 1838580 1811788 1787555 1765210 1744676 1725275
55749 1725275 1705715 1685770 1667025 1651387 1639538 1631073 1625094 1620167 1614787 1608716 1603136 1598796 1594688
55736 1594688 1589143 1581372 1571293 1558838 1544463 1529454 1514605 1499083 1481625 1462330 1442328 1422377
55724 1422377 1403016 1385533 1371164 1359334 1348086 1336426 1325170 1315380 1307099 1299820 1292932 1285242
55712 1285242 1275096 1261775 1246141 1229540 1212768 1196504 1181774 1169065 1157460 1145500 1132676
55701 1132676 1119528 1106625 1094208 1082581 1072066 1062466 1053276 1044664 1037646 1033014 1030597 1030027 1031739
55688 1031739 1036288 1042704 1048430 1051456 1051979 1051333 1049695 1045766 1038636 1028948 1017887 1005908 993103 980144
55674 980144 968009 957115 947429 939111 932192 925700 918086 908759 898624 888843 879621 870482 861246
55661 861246 852309 844209 837205 831130 825478 819738 813760 807775 802174 797411 793835 791196 788546 785266
55647 785266 782216 781217 783169 787143 791577 795816 800104 804467 808120 809955 809544 807843 806834 807852 809994
55632 809994 810744 808677 805251 803512 805264 809864 815408 820408 824381 827385 829402 830220 829882 829004 828158
55617 828158 826947 824410 820698 817628 816792 817509 817511 815453 811922 808098 804391 800656 796999 793875 791795
55602 791795 791123 791782 792997 793752 793764 793588 793714 794056 794424 794868 795274 795231 794595 793577 791898 788640 783482 777376
55584 777376 771262 764787 757234 749125 741619 734554 726411 716408 705468 694789 684602 674864 665988
55571 665988 658059 650206 641793 633675 627105 621748 615985 609189 602607 597638 594097 590674 586430 581348
55557 581348 575911 570787 566684 563953 562316 561252 560478 559764 558526 556215 553163 550586 549429 549460 549640
55542 549640 549187 547987 546183 543778 540748 537316 533922 531042 529048 527991 527252 525642 522403 518267 515175
55527 515175 514586 516187 518490 520430 521927 523091 523604 523251 522507 522022 521727 521080 520140 519666 519844 519557 517699
55510 517699 515037 513931 515905 520070 524562 529217 535867 545700 556988 566204 571237 572849 572940 572172 569894
55495 569894 565827 560886 556138 551526 545966 538508 529319 519809 511929 506841 503979 501615 498630 495480
55481 495480 493197 491915 490907 489882 489447 490106 491298 491798 490974 489577 489302 491346 495094 498488 500126
55466 500126 500789 502262 504802 506687 506493 504938 503938 504497 506076 507444 507371 505000 500446 495068 490489
55451 490489 487287 484956 482818 480397 477074 472198 465709 458294 450868 444233 438958 435043 431793 428585
55437 428585 425694 423788 422767 421795 420377 418578 416241 413051 409603 407240 406183 404708 401194 396403
55423 396403 392739 391361 390969 389578 386706 383448 380796 378491 375633 372110 368943 367146 366696 367029 368123
55408 368123 370247 372789 374324 374198 373269 372753 373066 374258 376709 380478 384412 386756 386631 384418 381039
55393 381039 377455 374553 372669 371210 369328 367001 364951 363550 362393 361057 359744 358952 358752 358526 357286
55378 357286 354467 350769 348079 348040 350543 353916 356611 358405 359990 361794 363443 364225 363884 362901 361946 361167
55362 361167 360375 359907 360706 363148 366146 368042 368246 367532 366868 366457 365904 364849 363335 361870 361220 361878 363579
55345 363579 365354 366042 364963 362490 360038 358915 359019 359191 359023 359401 360709 361591 360700 359108 359369 362189
55329 362189 365323 366149 364246 360999 357717 355009 353377 353353 354919 357205 358942 359259 358196 356430 354408
55314 354408 351982 349137 346605 345082 344044 342242 339365 336387 334082 332131 330053 328174 327089 326732
55300 326732 326674 326870 327369 327596 326696 324684 322666 321632 321307 320479 318493 316225 315334 316583 319222 322071
55284 322071 324687 327000 328378 327963 325898 323378 321283 319404 317310 315357 314385 314732 315867 316837 316970
55269 316970 316403 315897 315828 315455 313702 310713 308133 307674 309752 313425 317110 319349 319577 318522 317499 317256
55253 317256 317742 318721 319912 320647 320308 319272 318653 318900 319364 319361 318819 317671 315517 312347 308877 305799 303410
55236 303410 302117 302359 303633 304616 304794 305037 306022 307164 307841 308491 309471 309798 308360 305710 303383 301916
55220 301916 300820 300116 300518 302125 304173 306227 308512 310838 312116 311385 308863 305716 303095 301361 299945
55205 299945 298146 296432 296509 299488 304258 308309 309971 309330 307423 305376 304033 303527 303173 302414 301623 301345
55189 301345 301140 300147 298470 296961 295844 294772 294178 295224 298026 301111 303176 304327 305115 305360 304734 303720
55173 303720 303036 302541 301516 299839 298204 297332 297468 298525 300182 301859 303058 303878 304924 306507 308179
55158 308179 309260 309747 310250 310783 310129 307196 302997 300267 300639 302951 304946 305800 305947 305172 302533 298226
55142 298226 294107 291777 291133 291330 292245 294177 296682 298680 299642 300053 300621 301427 302063 302472 303343 305339 307955
55125 307955 309521 308674 305545 301359 297303 294188 292543 292263 292447 292390 292498 293489 294972 295787 295636 295337 295442
55108 295442 295695 295959 296601 297533 297889 297190 296083 295370 295030 294716 294524 294603 294553 293845 292539 291089 289651 287946
55090 287946 285592 282498 279342 277644 278655 281876 285334 287637 289119 290630 292066 292762 292641 292162 291485
55075 291485 290531 289653 289508 290164 290816 290476 288782 286243 283913 282676 282686 283512 284738 286147 287540 288924
55059 288924 290814 293633 296776 299087 300488 302238 305119 308206 310092 310641 310830 311350 312122 312766 312838 311865
55043 311865 309819 307373 305165 303068 300733 298657 298077 299846 303652 308156 311612 312822 312077 311030 311207
55028 311207 312722 314573 315752 315713 314427 312648 311766 312573 314254 315160 314489 312727 310656 308689 307244 307101
55012 307101 308965 312728 317320 321298 323751 324742 324872 324566 324076 323945 324776 326331 327537 327709 327265 326898
54996 326898 326602 325965 324947 323861 322983 322610 323159 324786 327112 329465 331018 330738 328060 323879 319990 317126
54980 317126 314482 311627 309736 309999 311847 313810 315340 316580 317163 316692 315952 316087 316745 316470 314977 313695
54964 313695 313794 314758 315304 314852 313794 312922 312782 313190 313507 313783 315139 318270 322172 325488 328553 332596 337188
54947 337188 340226 340809 340513 341158 342594 343523 343365 342314 340303 337049 332885 328866 326076 325054 325568 326747
54931 326747 327765 328571 329620 330885 331667 331536 330984 330962 332037 333839 334997 333958 330563 326552 323813 322487
54915 322487 321604 321035 321459 322721 323823 324612 325951 328014 329958 331680 334176 337573 340595 342902 346246
54900 346246 351948 358744 364696 370039 376354 383905 391721 399764 409052 419714 430677 441474 452773
54887 452773 464765 476418 487008 497306 508537 520752 532783 543188 550773 554627 554354 550241
54875 550241 542978 533257 521742 509303 497012 485704 475408 465386 455053 444720 434968 425460
54863 425460 415289 404698 395506 389173 385144 381784 378352 375335 373400 372968 374497 378266 383874 390504
54849 390504 397507 404401 410808 417075 424391 433454 443427 453113 462737 473432 485183 496433 505778
54836 505778 512922 517848 520126 519500 516352 511088 503566 493440 480790 466348 451442 437525 425175
54823 425175 413706 402353 391513 382078 373950 366358 359380 353643 348454 341953 333874 326700 322994
54810 322994 322571 323374 324206 325290 326769 328140 329149 329957 330236 329029 325810 321074 315687 310304 305595
54795 305595 302322 300717 300114 299612 298927 298335 298031 297905 297820 297733 297501 296850 295771 294757 294374 294629 294987 295083
54777 295083 295124 295416 295768 295645 294723 293043 290757 288075 285335 282883 280971 280065 280820 283191 285785 287019
54761 287019 287029 287645 290170 293928 297474 300423 303273 306012 308004 309277 310923 313804 317453 320712 323130
54746 323130 325281 327921 331311 335413 340265 345844 351783 357667 363682 370668 379427 390160 402663 416682
54732 416682 431820 447413 462957 478477 494051 509149 522975 535312 546286 555205 560409 560783
54720 560783 557009 550879 543670 535580 526374 516132 505568 495947 488390 482719 477225 470325 462514 456041
54706 456041 452424 450849 449402 447317 445423 444750 445663 448374 453293 460218 467864 475191 482970 493039
54692 493039 505868 519902 533646 547473 562597 579060 595835 612514 629576 646735 661897
54681 661897 672288 676242 673838 666421 655783 643291 629318 613548 595818 576550 556589 537024
54669 537024 518922 502516 486758 470476 454021 439038 426470 415720 406023 397651 391204 386432
54657 386432 382430 378520 374452 370269 366368 363131 360165 356661 352953 350662 350475 350731 349364 346504 343905
54642 343905 342398 341410 340758 341186 342847 344607 345482 345779 346309 347316 348634 350134 351474 351969 351255 349677
54626 349677 347830 346177 345219 345267 345688 345201 343477 341904 342207 344751 348612 352806 356892 360775 364507 368099
54610 368099 371262 373660 375598 377899 380752 383423 385644 388584 393679 401015 409637 418775 427691 434885
54596 434885 439026 440797 442513 445537 449199 452633 456510 462085 469458 477814 486786 496475 506391 515595
54582 515595 524096 533261 544422 557611 571935 586710 601741 616709 630663 642106 649458 651677
54570 651677 648724 641485 631106 618386 603739 587510 570202 552568 535628 520393 507294 495973
54558 495973 485835 476608 468097 459661 450541 440855 431742 424257 418578 414533 412294 411813 411863 410659 407695
54543 407695 404281 401787 399871 397052 392746 387994 384094 381165 378385 375146 371384 366929 361253 354230
54529 354230 346799 340457 336050 333227 330941 328274 324924 321369 318643 317557 317868 318442 318375 317673 316678 315303
54513 315303 313300 310983 309118 308116 307715 307355 306480 304666 301991 299283 297492 296806 296853 297656 299591 302321
54497 302321 304624 305697 305998 306364 306970 307651 308510 309408 309439 307969 306010 305621 307830 311862 316400 320818
54481 320818 325117 329470 334220 339663 345473 350865 355660 360656 366504 372758 378664 384550 391680 400539
54467 400539 409766 417175 421796 424666 427379 429961 430625 427890 422396 415954 409155 401146 391876 383249
54453 383249 377138 373068 368928 363524 357321 351024 344666 338298 332506 327779 324010 320900 318215 315471
54439 315471 312340 309806 309911 313356 317963 320613 320534 319638 319696 320302 319964 318246 316101 314614 314138 314478 315333
54422 315333 316456 317649 318694 319238 319054 318615 319156 321698 325919 330202 332894 333566 333205 333319 334713 336916
54406 336916 338874 340132 341025 341693 341541 340244 338791 338593 339532 339724 337564 333485 329368 326668 325498 325064
54390 325064 324485 323405 322269 321936 322628 323269 322173 318508 313090 307877 304629 303637 303505 302467 300173 297791
54374 297791 296152 294511 291863 289072 288550 291563 296525 300335 301019 299004 296358 295158 296142 298453 300588
54359 300588 301721 302025 301950 301676 301410 301701 303089 305542 308369 310627 311745 312084 312753 314470 316726 318715
54343 318715 320941 324873 330618 336022 338922 339712 340794 343850 348505 353272 356894 358955 360229 362504
54329 362504 367020 372733 376890 377680 375731 372680 369219 365161 360752 356904 354252 352663 351645 350672 349226
54314 349226 347129 345002 343744 343258 342135 339158 334888 331222 329233 327954 325663 322147 319147 318439 319965
54299 319965 322168 323732 324428 324423 323625 322112 320625 320092 320825 322548 324990 327914 330709 332648 333754 334986
54283 334986 337196 340223 343291 346061 348864 351987 355181 357943 360003 361455 362592 363707 364748 365136
54269 365136 364226 362125 359671 357482 355396 353251 351610 350936 350248 347547 341852 334226 326499 319655 313757
54254 313757 308763 304727 301555 299127 297311 295426 292177 286973 281078 276617 274423 273512 272482 270583
54240 270583 267439 262889 257620 253021 249744 246927 243586 240294 238695 239507 241703 243664 244661 245157 245969
54225 245969 247198 247824 246551 243281 239462 236629 234930 233569 232356 231948 232634 233744 234584 235289 236278 237389
54209 237389 238112 238378 238524 238612 238349 237709 237108 236810 236649 236635 237417 239581 242592 245059 246239 246787 247658 248700
54191 248700 248963 248259 247627 247986 248916 249294 248762 248044 247919 248419 248992 249015 248131 246548 245153 244923 245957 247336
54173 247336 248105 248173 248063 248133 248436 249142 250570 252602 254309 254509 252770 249903 247319 245773 244616 242444
54157 242444 238596 233961 230238 228553 228866 230590 233340 237010 241302 245415 248288 249240 248436 246678 244563
54142 244563 242006 238812 235535 233327 232847 233746 235375 237415 239360 239980 238265 234909 232003 231032 231737
54127 231737 233120 234719 236338 237318 237034 235873 234772 233868 232472 230553 229297 229685 231094 231889 231123 229208
54111 229208 227234 226075 225969 226456 226761 226536 226147 225964 225619 224500 222926 222284 223811 227420 231743 234970
54095 234970 235760 233999 231023 228707 227934 228087 228195 228107 228175 228304 228201 228369 229825 232486 234701 235040 233969
54078 233969 232968 232432 231455 229576 227626 226521 226194 226363 227491 230002 233021 234991 235620 236278 238192 240906
54062 240906 242858 242926 241013 237651 233693 230259 228285 227783 227701 226783 224754 222598 221516 221618 221920 221725
54046 221725 221466 221808 222424 222566 222600 223877 226750 229644 230695 229728 228013 226635 225817 225355 224895 223897 222128
54029 222128 220268 219421 219890 220862 221331 220920 219788 218256 216763 215829 215776 216577 217977 219584 220966 221960 222835
54012 222835 223770 224309 223883 222942 222853 224222 225836 225932 224320 222580 222160 222896 223756 224448 225629 227691 230064
53995 230064 231990 233438 234877 236599 238823 242058 246544 251411 255297 258009 260719 264082 267136 268889
53981 268889 270296 273404 278627 283997 287473 289193 291014 294415 299457 305419 311715 318135 324672 331447
53967 331447 338596 345896 352603 358156 363301 369984 379383 390185 399614 406304 411279 415802 419354 420619
53953 420619 419741 418340 417575 417322 417202 417268 417416 417141 416285 415283 414243 412464 409394 405484 401540 397668
53937 397668 393451 388874 384483 380676 377292 374002 370794 367965 365659 363416 360398 356284 351970 349047
53923 349047 348496 349995 352353 354357 355334 355357 354981 354462 353272 350754 347202 343813 341570 340557 340293 340254
53907 340254 340099 339974 340533 342050 343620 344079 343684 343850 344860 344913 342145 336933 331623 328429 328007 329474
53891 329474 331295 332583 333892 336269 339511 342253 343984 345721 348123 350406 352179 354939 360102 366544
53877 366544 371974 376173 380807 386299 391007 393886 396069 399168 403544 408884 414919 420663 424431 425775
53863 425775 426283 427444 428813 429486 430203 432459 436349 441030 446659 453945 462021 468873 474251 480231 488127
53848 488127 496571 503702 509789 516203 522935 528877 533914 538852 543493 546685 548689 551641 556688 562007
53834 562007 564887 564830 563286 561073 557803 553670 549947 547090 543724 538508 532014 525621 519164 511086 500918
53819 500918 490397 481634 475052 469745 465148 461349 457915 453529 447301 439807 432156 424374 415596 405874
53805 405874 396812 389856 384589 379457 373806 368312 363591 359391 355423 351997 349199 346041 341236 334689
53791 334689 327713 321862 317846 315343 313257 310244 305640 300282 296182 295036 296825 299745 301373 300078
53777 300078 295736 289548 283378 279090 277896 279739 283232 286552 288603 289294 288875 287536 285753 284539 284804
53762 284804 286469 288483 289815 290426 291188 292769 294730 296089 296682 297279 298079 298144 297115 296597 298414 302053
53746 302053 305515 308449 312365 317445 321476 323150 324472 328198 334279 340671 346471 352168 357592 361996
53732 361996 365972 371106 377586 384065 390096 396637 403639 409271 412657 415634 420416 426688 432438 436704
53718 436704 440035 442931 445327 447355 449262 450580 450425 448714 446233 443430 440020 436027 432378 429930
53704 429930 428299 426222 423013 419273 416041 413573 411335 409147 407758 407827 408725 409014 407993 406173 404233
53689 404233 402231 399920 397085 393372 388506 383037 378189 374525 371366 367980 364670 362027 359666 356469
53675 356469 351894 346416 340922 336289 333264 332052 331884 331524 330338 328743 327711 327979 329375 330628 330251
53660 330251 328164 326148 326121 328084 330328 331550 332143 333325 335637 338577 341410 343994 346824 350366 354310
53645 354310 357670 359804 361286 363586 367845 373971 380738 386709 391305 395128 399076 403083 406186 407961
53631 407961 409339 411523 414659 418176 422014 426510 431092 434227 435216 435376 436780 440052 444030 447434 450158
53616 450158 452739 455164 456939 458196 459897 462467 464707 464786 462230 458390 454967 452721 451761 452268 454313
53601 454313 457351 460442 462841 464058 463716 461870 459327 457067 455327 453615 451649 449959 449456 450687 453602
53586 453602 457915 463417 469671 475398 478744 478805 476774 474828 473846 473027 471856 471234 471898 472785 472234 470261
53570 470261 468370 467335 466486 465345 464612 465036 466249 467412 468404 469770 471903 474877 478690 483202 488014
53555 488014 492877 498066 503978 510423 516553 521471 524834 527214 530091 535093 542631 551353 559405 566296
53541 566296 573088 580746 588924 596799 604540 613132 622731 632075 639935 646622 653452 661078 669097 677187
53527 677187 685711 694931 704254 712797 720313 727142 733550 739536 745104 750298 755017 759071 762387 765059
53513 765059 767409 770148 774097 779343 784868 789434 792786 795712 798952 802380 805264 807165 808466 809993
53499 809993 812058 814025 815099 815406 815790 816591 817298 817570 817821 818401 818910 819008 819365 820975 823815 826908 829635
53482 829635 832345 835720 840025 844828 849037 851479 852051 852240 853934 857634 862165 866085 869161 872655 878400
53467 878400 887274 898206 909001 918462 927319 936957 948065 960966 976190 993551 1011411 1028187
53455 1028187 1044348 1061718 1081052 1101559 1122661 1144878 1168823 1194516 1221956 1251272 1281989
53444 1281989 1313186 1344763 1377773 1413228 1451295 1491682 1533845 1576760 1619604 1662877 1707811
53433 1707811 1754525 1802040 1850322 1900646 1953199 2005823 2056352 2105151 2154214 2204535 2255495
53422 2255495 2306152 2355954 2404682 2452862 2501998 2553408 2606816 2660626 2713278 2763777 2811487
53411 2811487 2856297 2898861 2940089 2980547 3020556 3060146 3098271 3132810 3162362 3187722 3210831
53400 3210831 3232624 3252708 3270603 3286251 3299468 3309922 3317737 3323344 3326639 3326847 3323294 3315921 3305140
53387 3305140 3291587 3275773 3257590 3236379 3211774 3184058 3153408 3119615 3083160 3045759 3008828
53376 3008828 2971939 2933727 2893772 2852519 2809987 2765999 2721492 2678132 2636526 2596100 2556818
53365 2556818 2519707 2485293 2452742 2421104 2390468 2361407 2334281 2309671 2288609 2271638 2258192
53354 2258192 2247509 2239611 2234825 2232919 2233463 2236788 2243910 2255461 2271082 2289907 2311446 2335965 2363960
53341 2363960 2395334 2429426 2466047 2505884 2549247 2594996 2641824 2690511 2743717 2803189 2868132
53330 2868132 2936693 3008029 3082238 3159103 3237928 3318436 3401164 3487059 3576930 3670988 3768493
53319 3768493 3868097 3968921 4071127 4175164 4280690 4386589 4491953 4596796 4701737 4806919
53309 4806919 4911244 5012892 5110750 5204892 5295323 5380880 5460241 5533535 5601779 5664778 5720888
53298 5720888 5769158 5810469 5845998 5875574 5898323 5914056 5923115 5925375 5920080 5906385 5883711 5852177
53286 5852177 5813053 5767950 5716928 5658157 5590105 5513374 5429716 5340182 5245335 5146576 5045867
53275 5045867 4944243 4841626 4738017 4633986 4530132 4426980 4325311 4225798 4128304 4032307
53265 4032307 3937964 3845965 3756352 3668308 3581301 3495810 3412810 3333171 3257663 3187017 3121749
53254 3121749 3062074 3007767 2957709 2909983 2863306 2818383 2777205 2740949 2709066 2680315 2654027
53243 2654027 2630329 2609677 2592257 2577587 2564910 2554298 2546788 2542744 2540817 2539549 2539518 2542523 2548972
53230 2548972 2557565 2567573 2579816 2594984 2612523 2631893 2653632 2678333 2705556 2734621 2765654
53219 2765654 2799135 2835089 2873256 2913256 2954089 2994527 3034641 3075840 3118490 3160616 3200017
53208 3200017 3236796 3272677 3308781 3345179 3381473 3416078 3445792 3468325 3485248 3500647 3516681
53197 3516681 3532005 3544498 3553573 3559212 3560582 3556830 3548161 3535265 3518493 3498320 3475520 3449936
53185 3449936 3419953 3384204 3343251 3298646 3250965 3199880 3145834 3090430 3035019 2979706 2923986
53174 2923986 2867769 2811601 2756178 2701834 2648311 2594986 2541404 2487540 2433772 2380973 2330557
53163 2330557 2283654 2239732 2196548 2151993 2105858 2059538 2014469 1971214 1929594 1889111 1849413
53152 1849413 1810725 1773679 1738582 1705334 1674154 1645504 1618799 1592222 1564766 1537599 1512113
53141 1512113 1487245 1460366 1430687 1400235 1371233 1344086 1318381 1294197 1271323 1248376 1224172
53130 1224172 1199517 1176403 1155546 1135664 1115159 1093658 1071650 1049281 1026008 1001457 976429
53119 976429 952704 931505 912213 893166 873782 855141 838207 822332 806214 789566 772923
53108 772923 756370 739665 723511 709398 697835 687571 677053 666005 655169 645003 635141 624815
53096 624815 613404 600838 587825 575594 565142 556720 550013 544583 540068 536268 533137 530394 527130
53083 527130 522270 515744 508856 503081 498650 494627 490130 485125 480032 475075 470260 465868 462595 460934
53069 460934 460387 459596 457589 454760 452303 450802 449881 449177 448942 449426 450257 450889 451188 451212 450850 450266 450195 451181
53051 451181 452837 454588 456834 460439 465210 469825 473385 476103 478206 479140 478364 476157 473059 469210 464941
53036 464941 461279 458970 457389 455324 452581 449891 447420 444393 440342 435817 431452 426961 421462 414505
53022 414505 406633 399269 393958 391136 389513 387280 384000 380680 377857 374611 370014 364674 360073 356820
53008 356820 354440 352473 350886 349536 348055 346357 344704 343255 342073 341454 341597 341916 341285 339168 336053
52993 336053 332857 330457 329731 331123 333738 335519 334926 332225 328867 325968 323755 322015 320511 319084 317796
52978 317796 316947 316664 316531 315955 314851 313657 312622 311356 309217 306066 302504 299342 296941 295207 294137
52963 294137 293989 294651 295181 294488 292414 289688 286881 284011 281248 279360 279013 280013 281619 283320 284989
52948 284989 286505 287608 288040 287607 286261 284287 282257 280644 279631 279363 280015 281350 282509 282628 281688 280647
52932 280647 280766 282655 285635 288064 288752 288103 287494 287546 287730 287724 288271 290123 292925 295784 298400 300903 303096
52915 303096 304672 305906 307393 309313 311468 313749 315974 317719 319107 321297 325279 330453 335343 339429
52901 339429 343194 346634 349132 351024 353902 358716 364463 369278 372060 372714 371865 370963 371633 373967 376089
52886 376089 376325 375259 374727 375303 375856 375441 374460 373679 372940 371352 368441 364713 361173 358514 356725 355453
52870 355453 354500 353717 352488 349862 345591 340820 337385 336404 337513 339158 339560 337863 334797 331993 330448
52855 330448 329846 329487 329344 329770 330562 330885 330048 328047 325510 323415 322562 322884 323437 323424 323041 323046 323831 325339
52837 325339 327395 329499 330666 330389 329671 330175 332122 333848 333759 332077 330337 329812 330931 333637 337483 341536
52821 341536 344790 346822 347737 347671 346782 345682 345371 346507 348900 351672 353718 354229 353353 352467 353163 355595
52805 355595 358199 359502 359699 359916 360405 360539 360438 361247 363217 364651 363834 361378 359579 359732 361180 362865
52789 362865 364605 366595 368792 371374 374980 379832 385113 389843 394011 398364 403356 408702 413740 417928
52775 417928 421304 424645 428742 433309 437123 439437 440574 440775 439478 436516 433134 430626 428402 424740
52761 424740 419313 413769 409625 406625 403543 399591 394605 388609 381979 375635 370477 366594 363185 359172
52747 359172 354030 348449 344085 342028 341421 340180 337304 333843 331313 329824 328322 326150 323662 321405
52733 321405 319346 317051 314306 311386 308686 306089 302932 298962 295215 293372 294046 296165 298157 299170
52719 299170 298900 297141 294322 291925 291203 291423 290322 286622 281469 277078 274555 273443 272783 271852 270116
52704 270116 267330 263893 260584 257648 254606 251273 248493 247257 247264 247077 245820 244122 243113 242977 242928 242259
52688 242259 240916 239242 237636 236423 235655 234974 233871 232042 229395 226034 222491 219610 217679 215957 213698
52673 213698 211377 210162 210239 210588 210494 210330 210456 210317 209339 208051 207558 208284 209916 212135 214592 216388 216507
52656 216507 214928 212691 210808 209564 208831 208346 207625 206292 204849 204525 205943 208393 210778 212831 214907
52641 214907 216983 218607 219709 220690 221624 222056 221978 222354 224113 226911 229597 231838 234537 238447 242975 246809
52625 246809 249313 250782 251588 251722 251166 250132 248741 246895 244744 242886 241766 241122 240372 239449 238776 238395
52609 238395 237545 235445 232272 229018 226268 223502 219892 215554 211514 208406 205764 202902 200034 197983
52595 197983 197123 197158 197795 198899 200019 200516 200434 200668 201874 203664 205199 206103 206404 205959 204502 202068 199020
52578 199020 195913 193548 192670 193028 193216 192254 191088 191643 194433 198110 201455 204671 208093 210656 210791 208479
52562 208479 205370 202838 200869 199066 197808 197802 198904 200060 200272 199309 197650 196156 195618 196112 196810 196858 196456
52545 196456 196536 197382 198204 198385 198457 199237 200543 201536 202060 202742 203805 204772 205622 207323 210622 214881 218782
52528 218782 221764 224085 225804 226529 226234 225615 225422 225883 226930 228575 230796 233340 235870 238105 239751
52513 239751 240622 241015 241605 242651 243598 243782 243369 243227 244040 245895 248596 251775 254672 256482 257336 258525
52497 258525 261203 265097 268879 271646 273510 274879 275804 276301 276814 277909 279671 281538 282650 282336 280625
52482 280625 278435 276971 276752 277423 278504 279774 280784 280785 279750 278949 279677 281570 282927 282682 281457 280656
52466 280656 281037 282242 283220 283105 282097 281450 282204 284065 285983 287555 289101 290626 291705 292378 293134 293855
52450 293855 293884 293426 293660 294911 295906 295756 295515 296487 297825 297414 294870 292182 291148 291475 291849 291850 291948 292165
52432 292165 291634 289698 287088 285575 286248 288326 290194 291473 293163 295484 296755 295509 292964 292006 293886
52417 293886 297163 299922 301710 302992 303914 304316 304239 303768 302880 301870 301373 301559 301849 301887 302159 303156 304441
52400 304441 305308 306049 307785 311048 315104 318711 321141 322412 322923 323098 323212 323351 323416 323264 323061 323538 325528
52383 325528 328915 332321 334352 335029 335412 336008 336280 335768 334766 333500 331496 328344 324559 321114 318593
52368 318593 317295 317559 319213 321005 321416 320026 317565 314786 311901 309008 306438 304553 303618 303847 305100
52353 305100 306482 306843 305892 304627 304461 306079 309036 312179 314502 315855 316931 318408 320294 322230 324086
52338 324086 325742 326595 326079 324776 324267 325486 327747 329836 331663 334158 337651 341103 343290 344330 345414
52323 345414 347151 348827 349694 350334 351950 354511 356676 357843 359307 362619 367549 372613 377146 381649 386215
52308 386215 389924 392293 394295 397196 401045 405075 409099 413518 418083 421607 423272 423605 423688 423816 423574
52293 423574 423216 424209 427909 433944 440430 445769 449736 452781 455044 456610 458249 461078 465452 470614 475455
52278 475455 479291 482067 484250 486530 489282 492335 495596 499514 504405 509665 514480 519107 524371 529899
52264 529899 534080 536204 537511 539462 542077 544795 547895 551764 555460 557650 558812 561136 566047 573100
52250 573100 581536 591524 603027 614499 624027 631561 639030 648102 658497 668859 678809 689500 702045
52237 702045 715978 729876 743334 757532 773501 790638 807640 824402 842054 861279 881525
52226 881525 901954 922327 942755 963257 983774 1003984 1023063 1040460 1057118 1074941 1094625
52215 1094625 1114910 1134489 1153601 1172856 1191482 1208170 1223217 1238297 1253968 1268775 1281330
52204 1281330 1292211 1302981 1313957 1323945 1332064 1338979 1345914 1352898 1358696 1362625 1365799 1369927 1375082
52191 1375082 1379525 1381888 1382673 1383195 1383839 1384078 1383552 1382240 1380117 1377654 1376280 1377068 1379122 1380540 1381154 1383032
52175 1383032 1387928 1395461 1404343 1414064 1424395 1434394 1443423 1452704 1464365 1478895 1494519 1509240 1522560
52162 1522560 1535033 1547095 1558932 1570874 1583200 1595664 1607612 1618545 1628366 1637041 1644245 1649518
52150 1649518 1652839 1655040 1657290 1660003 1662395 1663386 1662655 1660493 1656867 1651445 1644690 1638200 1633183 1628851
52136 1628851 1623082 1614790 1605074 1595666 1586839 1577531 1567269 1556971 1547547 1538592 1529282 1520026 1512258
52123 1512258 1506636 1502340 1498282 1494205 1490311 1486595 1483077 1480029 1477313 1473902 1468820 1462426 1456213 1451413
52109 1451413 1448226 1446149 1444416 1442219 1439195 1435900 1433265 1431274 1428628 1423997 1417392 1409950 1402556 1395180
52095 1395180 1387635 1380527 1374843 1370657 1366809 1362188 1356809 1351223 1345406 1339162 1333235 1328671 1324868 1319641
52081 1319641 1311944 1303413 1296245 1290569 1285095 1279502 1274500 1269928 1264606 1258411 1252929 1249368 1246914 1243888
52067 1243888 1239610 1234396 1228576 1222389 1216266 1210262 1203587 1195689 1187647 1181596 1178538 1177303 1175844 1173110
52053 1173110 1169487 1165944 1163282 1161975 1162016 1162595 1162391 1160859 1159258 1159796 1163528 1169558 1176456 1183663 1190979
52038 1190979 1197639 1203247 1209287 1218322 1231385 1247076 1263405 1279534 1295567 1311924 1329613 1349984
52026 1349984 1373235 1397736 1421714 1445059 1468720 1493029 1517691 1542968 1569471 1596671 1622693
52015 1622693 1646022 1666825 1686344 1705540 1724535 1742859 1759909 1775394 1789527 1802642 1814556
52004 1814556 1824601 1832283 1837624 1840770 1841696 1840630 1838594 1836996 1836308 1835319 1832179 1826431 1819632 1813559
51990 1813559 1808279 1802570 1795831 1788542 1781029 1773146 1765479 1759527 1755806 1752888 1749331 1745688 1743394 1742409
51976 1742409 1741394 1739848 1738552 1737929 1737249 1735697 1733302 1730803 1729528 1731183 1736353 1743010 1747910 1750000
51962 1750000 1751359 1754346 1759118 1764522 1769932 1774872 1777985 1778084 1775976 1773774 1772284 1770141 1765750 1759188
51948 1759188 1751750 1744226 1736187 1726708 1715337 1702183 1687325 1670609 1652207 1632908 1613190 1592166
51936 1592166 1568327 1541394 1512582 1482946 1452585 1421887 1392182 1364067 1336109 1306541 1275595
51925 1275595 1244809 1214637 1184415 1154419 1125920 1098838 1071206 1041902 1012435 984783 958622
51914 958622 932201 905219 879179 855090 832326 810055 788422 767756 747648 727725 708754
51903 708754 691967 677467 664092 650925 638285 626952 617045 608091 599915 592836 586982 581884 576888
51890 576888 571678 566211 560411 554200 547698 541225 535188 529974 525713 522063 518469 514700 510763 506272
51876 506272 500542 493712 486993 481111 475187 468186 461001 455700 452771 450614 448006 445551 443807 441483
51862 441483 436996 431037 426012 423113 421233 418815 415579 412190 409121 406216 402796 398112 392310 386902
51848 386902 383533 382224 381682 381371 382094 384193 386370 387174 386814 386517 386672 386563 385547 383448 380046 375252
51832 375252 369930 365595 362910 360971 358410 354834 351034 348160 346860 346798 346776 345628 343295 340915 339752
51817 339752 340144 341523 343107 344341 344888 344639 343916 343447 343759 344461 344464 343360 342437 343691 347620 352471 356082
51800 356082 358111 359998 363011 366821 369939 371196 370865 370527 371698 374382 377298 379574 381481 383077 383084
51785 383084 380372 376227 373750 374637 377497 379683 379957 378885 377476 376213 375173 374457 374435 375693 378620
51770 378620 382915 387602 391553 394053 395250 396406 399163 403847 408699 411493 411668 410164 407709 404503
51756 404503 401382 399593 399097 398565 397562 397313 398551 400084 400600 400610 401258 402230 402391 401843 401848 403034 404941
51739 404941 406985 408636 409046 407927 406548 406476 407481 408133 408468 410342 414724 420031 423899 425645 426418 427759
51723 427759 430499 434305 437943 440616 443129 446767 450923 453215 452505 450510 449588 449986 450427 450535 451430 454328
51707 454328 459647 467095 475427 482323 485889 486717 487662 491114 496906 503112 508316 512696 517161 521994 526424
51692 526424 529378 530438 530012 528679 526665 524086 521404 519328 518248 517902 517639 516952 515814 514549 513462
51677 513462 512711 512424 512583 512731 512331 511645 511637 512426 512437 510080 505953 502225 499903 497915 495122 491917 489166
51660 489166 486685 483806 480792 478640 477716 477231 475902 472691 467410 461292 456612 454897 455508 456336 455769
51645 455769 453694 450969 448475 446469 444366 441379 437746 434963 434286 435284 436393 436658 436356 436184 436462 437138
51629 437138 438051 439180 440864 443549 447016 450346 453092 456104 460596 466776 474040 482070 490796 499399
51615 499399 506351 510657 512492 512457 510840 507770 503617 498992 494519 490508 486646 482200 476816 470831 464544
51600 464544 457720 450369 443349 437367 431936 426316 420974 416824 413312 408829 403168 398122 395203 394024
51586 394024 393447 393006 392534 391615 390333 389517 389292 388370 385881 383025 381389 380311 377634 373068 369166 368380
51570 368380 370260 372227 372333 370537 367827 364948 362099 359322 356849 354992 353789 352904 352030 351202 350603
51555 350603 350255 350205 350880 352852 356216 360410 364683 368541 371771 374245 375816 376437 376481 376876 378649 382107
51539 382107 386711 391872 397534 403714 409895 415424 420347 425277 430480 435616 440521 445754 452096 459660
51525 459660 467610 474642 479841 483428 486754 491123 496306 500411 501585 499946 497644 496821 497563 498055 496857
51510 496857 494595 493037 492851 493133 493254 494125 496945 501483 506598 511941 517894 523982 528836 532101 535166
51495 535166 539306 544165 548889 553824 559895 566812 573127 577811 580641 581228 579107 575138 571587 570099
51481 570099 570353 571245 572541 574614 577215 579538 581151 582032 581937 580626 578603 576787 575394 573914 572210
51466 572210 570757 569579 567839 564986 561519 558037 554212 549567 544762 541107 538805 536570 533225 529021
51452 529021 525040 521796 518894 515772 512272 508515 504704 501257 498829 497810 497777 497803 497412 496929 496613 495868
51436 495868 493941 491366 489906 490741 493145 495278 495874 494886 493107 491771 492145 494629 498285 501846 505137
51421 505137 508974 513716 518704 523329 527997 533459 539589 545363 550039 553990 558230 563270 568621 573579
51407 573579 578351 583972 590881 598009 603822 608083 612054 616978 622877 628886 634187 638420 641627 644086
51393 644086 645983 647155 647403 647020 646593 646182 645167 642996 639678 635401 630247 624434 618320 611885 604756
51378 604756 597024 589406 582055 573875 563825 552587 542196 534185 528781 525618 524173 523296 521297 517218
51364 517218 511703 506278 502164 500072 500382 502642 505103 505797 504450 502766 502456 503524 504991 506654 509123
51349 509123 512245 514664 515286 514278 512036 508048 501753 493967 486337 479574 473197 466889 460907 455046
51335 455046 448458 440945 433431 426576 419853 412613 405124 397730 389832 380839 371582 363744 358186 354654
51321 354654 352598 351161 348899 345006 340775 338330 337575 335783 330916 324237 318847 316463 316414 316976 316698
51306 316698 314950 312230 309813 308390 307297 305662 303812 302618 301809 300223 297794 295990 295812 296455 296638
51291 296638 296379 296500 297139 297872 298917 300922 303559 305543 306431 307439 309892 313652 317594 320992 323834
51276 323834 326392 329268 333364 338917 344844 349748 353340 356180 358517 360394 362525 365721 369492 372515
51262 372515 374739 377546 381323 384187 384039 380889 376296 371382 366418 361499 356432 350504 343480 336429
51248 336429 330511 325293 319373 312349 305126 298520 292761 288250 285522 284229 283245 282039 281091 280841 281049
51233 281049 281327 281403 280826 279371 277818 277221 277229 276244 273603 270483 268250 267105 266825 267495 268601 268613 266726
51216 266726 264260 263159 263621 264222 263857 262518 260683 259102 258851 260391 262675 264222 265013 266192 267882
51201 267882 268526 266779 263148 259248 256191 254200 253174 252896 252892 252608 251844 250904 250368 250686 251744 252750 252733
51184 252733 251280 248858 246436 244800 244015 243512 242986 243091 244656 247102 248554 248126 247354 248433 251530 254810
51168 254810 256734 257219 256724 255567 254389 254085 254640 254937 254266 253301 252998 253247 253403 253561 254387 255836 256903
51151 256903 256853 256152 255879 256437 257130 257136 256749 257323 259829 263774 267849 271264 273913 275678 276635 277907 281105
51134 281105 286302 291447 294430 295153 294973 294771 294377 293545 292643 292385 293360 295554 297879 298530 296610 293343
51118 293343 291068 291030 292543 294093 294595 293677 291535 288823 286285 284235 282597 281402 280870 280967 281218 281073
51102 281073 280256 278939 277784 277548 278172 278573 277931 276999 277306 279035 280599 280584 279283 277840 276673 275605
51086 275605 275037 275970 278738 282344 285349 287058 287687 287634 286922 285375 283151 280844 278908 277213 275427 273755
51070 273755 272770 272437 271804 269997 267194 264325 262134 260944 260921 261810 262424 261169 257545 252879 249257 247802
51054 247802 248039 248745 249147 249344 249736 250245 250258 249485 248672 249010 250732 252676 253557 253375 253164 253556 254230 254890
51036 254890 256011 258075 260542 262471 264123 267043 272040 277670 281485 282634 282613 283460 285858 289139 292421
51021 292421 295221 297312 298746 300041 301747 303546 304226 302977 300584 298905 299109 300757 302695 304439 306262
51006 306262 308207 309649 310090 309955 310255 311567 313624 315843 317975 320206 322732 325346 327504 328874 329827
50991 329827 331104 332883 334349 334418 332794 330189 327575 325420 323552 321659 319898 319014 319633 321429 323308
50976 323308 324541 325362 326284 327293 328110 328874 330052 331858 334169 336726 339073 340695 341779 343354 345926
50961 345926 348429 349503 349590 350545 353137 356123 358116 359228 360398 362153 364632 367894 371424 374189 375983
50946 375983 378070 381691 386554 391610 396574 401662 406376 409846 412275 414991 419050 424590 431480 439721
50932 439721 449172 459544 470704 482420 494063 505314 516921 529885 544091 558701 573709 589890
50920 589890 607257 624991 643316 664109 688792 716551 745456 774658 804693 836321 870075
50909 870075 906666 946858 990930 1038829 1090732 1146820 1206322 1267292 1327773 1387374 1447765
50898 1447765 1511345 1578914 1648589 1717268 1783132 1846202 1906656 1963551 2015637 2062639 2105055
50887 2105055 2143160 2176842 2206080 2230854 2250634 2264492 2271916 2273447 2270645 2265459 2259280 2252422
50875 2252422 2244700 2236324 2227590 2217690 2204865 2188293 2169132 2148975 2127769 2103897 2075831 2043033
50863 2043033 2005659 1964225 1919437 1871773 1821319 1768319 1713511 1657473 1600338 1542851 1487057
50852 1487057 1434812 1385960 1339077 1293809 1251356 1212640 1177213 1144157 1112969 1083273 1054709
50841 1054709 1027720 1003625 983370 966772 953325 942932 935289 929261 923689 918464 914239 911445
50829 911445 910106 910232 911725 914024 916428 918744 921368 924769 929082 934017 939059 944118 950147 958655
50815 958655 970247 983964 998351 1012697 1026943 1041168 1055930 1072639 1092580 1115578 1140494
50804 1140494 1167039 1196328 1229508 1266606 1307093 1350868 1398210 1449193 1503719 1562032 1624951
50793 1624951 1693623 1769039 1851477 1940338 2035053 2136305 2245760 2364149 2490073 2621255
50783 2621255 2756492 2895668 3038191 3182494 3327130 3471374 3614194 3753287 3885756
50774 3885756 4009351 4122590 4224094 4312467 4386744 4446611 4492355 4524985 4546115 4557226 4559205
50763 4559205 4553138 4541252 4526298 4510042 4493061 4475956 4459711 4444456 4428706 4410504 4388731
50752 4388731 4362633 4330510 4289819 4238649 4176645 4104442 4022633 3931435 3831241 3723457 3610695
50741 3610695 3495732 3380156 3264462 3149628 3037993 2932094 2833092 2740896 2655430 2577203
50731 2577203 2507004 2445741 2394299 2352793 2320114 2294916 2276927 2266563 2263435 2266156 2273570 2285140
50719 2285140 2299826 2315594 2330568 2344118 2356402 2367479 2377143 2384859 2389368 2389125 2383879 2375255 2364957
50706 2364957 2352749 2337074 2317368 2294735 2270280 2243830 2214811 2183696 2151781 2119771 2087417
50695 2087417 2054771 2023143 1994121 1967843 1943025 1918952 1896778 1878307 1863980 1852929 1844858
50684 1844858 1840985 1842871 1850990 1864749 1883388 1906590 1934653 1968317 2008067 2053546 2104136 2160065
50672 2160065 2222089 2289939 2362240 2438542 2520278 2608568 2701741 2796313 2890033 2982726 3074283
50661 3074283 3163198 3247345 3324931 3394225 3453502 3502109 3540844 3570380 3589774 3597440 3593473 3580153
50649 3580153 3560117 3534726 3504448 3470256 3434128 3398332 3364584 3333880 3306716 3283140 3262493
50638 3262493 3243374 3224149 3203703 3181663 3157835 3131440 3101018 3065182 3023537 2976822 2926156
50627 2926156 2872366 2816371 2760109 2706397 2657252 2612521 2570721 2531333 2495768 2466056 2443299
50616 2443299 2427852 2420346 2421606 2431646 2449666 2475315 2509287 2552216 2603579 2662312 2728141 2801530
50604 2801530 2882368 2969379 3060835 3155058 3249876 3342293 3429443 3509858 3583464 3650491 3710708
50593 3710708 3763599 3808916 3846919 3877985 3902012 3918384 3926972 3929024 3926478 3920258 3910009 3895788
50581 3895788 3879230 3862534 3847018 3833332 3822300 3814505 3809587 3807094 3807636 3811960 3819294 3828128 3838529
50568 3838529 3851865 3867734 3882996 3894979 3904306 3913265 3922365 3930054 3935265 3938620 3940935 3941769 3940008
50555 3940008 3935426 3929447 3924568 3922932 3925085 3930200 3937539 3947147 3958784 3970913 3981483 3989240 3993483
50542 3993483 3993037 3986533 3973681 3955228 3931376 3900795 3861350 3811454 3750917 3681140 3604491 3522891
50530 3522891 3436886 3346432 3252331 3156346 3060178 2965087 2872250 2782595 2696314 2613515 2535328
50519 2535328 2463244 2397131 2335135 2276211 2221687 2173538 2131957 2095674 2064013 2037513 2016798
50508 2016798 2001953 1992945 1989638 1991264 1996764 2005907 2019315 2037183 2058860 2084140 2114208 2150453
50496 2150453 2192777 2239821 2290703 2345769 2405747 2471004 2541790 2618410 2700654 2787591 2878463
50485 2878463 2973441 3072829 3175563 3278933 3379893 3476536 3568564 3656705 3741619 3823140 3900715
50474 3900715 3974738 4046939 4118935 4190769 4261556 4331244 4400889 4471468 4543479 4617803 4695659
50463 4695659 4777227 4861297 4946946 5034747 5125580 5218944 5313256 5407249 5500121 5590532 5676356
50452 5676356 5755418 5825933 5886300 5934973 5970494 5991396 5996372 5984937 5957702 5915677 5859737
50441 5859737 5791067 5711614 5623614 5529240 5431245 5333258 5238574 5149042 5065876 4990988 4926527
50430 4926527 4873413 4831360 4800041 4779075 4766790 4759994 4755220 4749564 4740403 4725159 4701476 4667077
50418 4667077 4619629 4557608 4481297 4392178 4291353 4179249 4056729 3925646 3788428 3648029
50408 3648029 3508004 3371316 3238873 3110294 2986288 2869091 2760238 2659143 2564422 2475670
50398 2475670 2393446 2318437 2251313 2192568 2141837 2097758 2058799 2023800 1991905 1963212 1939657
50387 1939657 1923745 1915647 1912669 1912327 1914776 1921306 1931790 1945016 1960670 1979400 2001255 2025471
50375 2025471 2051729 2080504 2112233 2147069 2185279 2226799 2270345 2314034 2357296 2401598 2448966
50364 2448966 2500172 2554378 2609957 2665486 2720409 2775065 2829997 2885228 2940213 2994432 3047887
50353 3047887 3101114 3154757 3208998 3263553 3318425 3374304 3431594 3489251 3545525 3599801 3652742
50342 3652742 3704532 3754208 3800981 3844688 3884223 3917077 3941717 3959260 3971205 3976289 3971176 3953877
50330 3953877 3925039 3886223 3838439 3782342 3718467 3646998 3568311 3483847 3395686 3305552 3215257
50319 3215257 3127660 3045561 2969514 2898176 2831168 2770374 2718128 2675362 2641875 2616996 2599249
50308 2599249 2586465 2577122 2570812 2566775 2562843 2556536 2546420 2531647 2510928 2482962 2447562 2405810
50296 2405810 2359401 2310130 2259205 2206395 2150478 2091355 2031149 1972519 1916420 1862442 1810782
50285 1810782 1762688 1718980 1679169 1642208 1607326 1573996 1541934 1511549 1483940 1460198 1440912
50274 1440912 1426282 1415975 1408700 1402649 1396935 1392267 1389901 1390336 1393477 1399515 1408744 1420615 1433941
50261 1433941 1448426 1465141 1484801 1506162 1527058 1546860 1566957 1588765 1612274 1636920 1662817
50250 1662817 1690218 1718471 1746584 1774591 1803315 1832846 1862217 1890685 1918326 1944933 1969286
50239 1969286 1990231 2007992 2023644 2037560 2048942 2056748 2060508 2060273 2056316 2049151 2039492 2027911 2014474
50226 2014474 1998782 1980401 1959326 1936097 1911462 1885902 1859377 1831461 1801717 1770210 1737755
50215 1737755 1705475 1673856 1642453 1610782 1579260 1548949 1520528 1493917 1468755 1444671 1421148
50204 1421148 1397777 1374959 1353924 1335736 1320400 1306933 1294042 1280827 1267444 1255260 1245730
50193 1245730 1238660 1232148 1224806 1217668 1213046 1211527 1210933 1208706 1204840 1201771 1201573 1203977 1207385 1211064
50179 1211064 1215472 1220577 1224887 1226633 1225385 1222030 1217705 1213402 1210045 1207930 1206029 1202807 1197969 1192746
50165 1192746 1188333 1184753 1181476 1178251 1174662 1169576 1161997 1152402 1142617 1134416 1128613 1125244 1123840 1123397
50151 1123397 1122654 1120791 1117716 1113676 1109059 1104797 1102475 1103386 1107340 1112748 1117923 1122037 1124830 1126106
50137 1126106 1126136 1126130 1127347 1129537 1131044 1130760 1129263 1127538 1125423 1122226 1118417 1115439 1113724 1111909 1108446
50122 1108446 1103291 1097544 1091916 1086012 1078935 1070274 1060613 1051144 1042500 1034027 1024590 1014265 1004703 997512
50108 997512 992579 988311 983383 978035 973743 971705 971577 971724 970850 969295 968445 968977 970103 970470 969329 966772
50092 966772 963350 959728 956392 953511 951206 949777 949273 949034 948378 947772 948437 950453 951985 951137 948306 946123
50076 946123 947004 950972 955794 959122 960529 961545 963801 967636 972594 978501 985201 991812 997555 1003200
50062 1003200 1010386 1019273 1028159 1035829 1042980 1050617 1058338 1065177 1071019 1076002 1079565 1081606 1083945 1088864
50048 1088864 1096117 1102830 1106575 1107517 1107418 1107803 1109513 1112957 1117860 1123247 1128264 1132887 1137610 1142773 1148433
50033 1148433 1154566 1161227 1168781 1178015 1189611 1203368 1218356 1234015 1250718 1268991 1288592 1308808
50021 1308808 1329485 1351242 1374576 1399143 1424333 1450472 1478954 1510797 1545363 1581044 1617209
50010 1617209 1654834 1695071 1737864 1782411 1828420 1876255 1926201 1978331 2033036 2091035 2152728
49999 2152728 2218033 2287029 2360322 2438518 2521481 2608399 2698625 2792302 2889770 2990080 3090314
49988 3090314 3186830 3277112 3359893 3433709 3496565 3547679 3588767 3622898 3652503 3678867 3702549
49977 3702549 3722956 3737758 3743883 3739419 3723985 3697514 3659475 3609278 3546673 3471835 3385813 3291064
49965 3291064 3190780 3087507 2982874 2878533 2776466 2678108 2583881 2493923 2408821 2329378
49955 2329378 2256052 2188847 2127420 2071221 2019852 1973268 1931207 1892679 1856649 1823140 1792925
49944 1792925 1766206 1742416 1721437 1703923 1689917 1678030 1666637 1655353 1644648 1634540 1624438
49933 1624438 1614039 1603628 1593460 1583339 1572972 1562389 1551850 1541397 1530641 1519180 1507338
49922 1507338 1496302 1487255 1480362 1474814 1469648 1464297 1458706 1453541 1449988 1448611 1448495 1448311 1448258 1450037 1454716
49907 1454716 1461596 1469669 1479307 1491753 1507498 1525819 1545597 1566064 1587119 1609438 1634121 1661891
49895 1661891 1692940 1727550 1766068 1807790 1850859 1894272 1939621 1989814 2046256 2108139 2174337
49884 2174337 2245014 2321322 2404571 2496177 2597604 2709537 2831270 2961321 3098479 3241898
49874 3241898 3390317 3541556 3692852 3841424 3984686 4120260 4246313 4362114 4468133
49865 4468133 4565426 4654978 4737583 4813800 4883306 4944301 4994010 5029821 5049628 5051358 5033075
49854 5033075 4993904 4934370 4855708 4759594 4648716 4526570 4395880 4257784 4113177 3964145
49844 3964145 3813146 3661422 3509465 3358808 3212070 3071049 2935787 2805930 2682108
49835 2682108 2565511 2456740 2355597 2261560 2174031 2092428 2016373 1945634 1879879 1818894 1763021
49824 1763021 1712698 1667353 1625404 1585747 1548533 1513976 1481008 1448027 1414658 1382049 1351512
49813 1351512 1323591 1298412 1276054 1256154 1237597 1219127 1200284 1181675 1164411 1149291 1136235
49802 1136235 1124431 1113141 1102420 1092991 1085463 1079775 1075263 1071144 1067210 1064354 1064055 1066679 1070483
49789 1070483 1073121 1074293 1076150 1080778 1088118 1096764 1105917 1115572 1125338 1134377 1142549 1150784 1160151 1171191
49775 1171191 1184134 1199061 1215740 1234005 1254396 1277702 1303837 1332127 1362892 1397704 1437560
49764 1437560 1481826 1529711 1581750 1638809 1700476 1765889 1835919 1913162 1999467 2094170 2194742
49753 2194742 2298395 2403047 2507552 2611189 2712462 2808547 2896505 2974889 3043588 3102679
49743 3102679 3152610 3195135 3232389 3264744 3290979 3310873 3325895 3336231 3338480 3327843 3301972
49732 3301972 3261445 3207100 3138594 3055756 2960244 2855327 2744601 2630985 2516449 2402496
49722 2402496 2291004 2184260 2083747 1989372 1900583 1817961 1742816 1675353 1614181 1557867 1506174
49711 1506174 1459464 1417598 1379836 1345339 1313361 1283482 1256131 1232518 1213277 1197127 1181482
49700 1181482 1164696 1147465 1131779 1118666 1107369 1096649 1086374 1077519 1071002 1067047 1065391 1065351 1065557
49687 1065557 1064494 1061860 1058965 1057300 1056997 1057135 1057166 1057315 1057749 1058095 1058119 1058412 1059959 1063018 1066683 1069714
49671 1069714 1071787 1073664 1075959 1078062 1078860 1078317 1077666 1077977 1079381 1081857 1085724 1090659 1095060 1097263 1096969
49656 1096969 1094890 1091749 1088432 1086279 1085816 1085636 1083936 1081016 1078859 1078384 1078720 1079397 1081328 1084692 1087506
49641 1087506 1087916 1087042 1087898 1091715 1096712 1100647 1103357 1106138 1109428 1112108 1113130 1113167 1113959 1116079 1118119
49626 1118119 1118656 1118407 1119432 1122422 1125904 1128337 1129723 1130619 1130824 1130149 1129666 1130904 1133977 1137418 1139689
49611 1139689 1140078 1138535 1135719 1133162 1132324 1133164 1134278 1134445 1133450 1131588 1129443 1128322 1129666 1133385 1137536
49596 1137536 1140272 1141582 1142603 1143925 1145332 1146661 1147936 1148857 1149075 1149059 1149885 1151933 1154331 1156075 1157209
49581 1157209 1158502 1160185 1161596 1162155 1162264 1162866 1164244 1165705 1166541 1166870 1167244 1167900 1169018 1171382 1175777 1181516
49565 1181516 1186485 1189244 1190495 1191921 1194207 1196943 1199903 1203345 1207270 1211539 1216872 1224633 1235077 1246589
49551 1246589 1257250 1266670 1275732 1285029 1294256 1303022 1311671 1321265 1332997 1347566 1364844 1384126 1404877
49538 1404877 1427122 1451077 1476498 1502560 1528320 1553356 1578222 1604272 1632622 1663194 1695071
49527 1695071 1727834 1762005 1798018 1835358 1873178 1911359 1950496 1991239 2034075 2079474 2127718
49516 2127718 2178743 2232410 2288601 2346804 2406285 2467127 2530488 2597026 2665601 2734484 2803443
49505 2803443 2873577 2945356 3018080 3091427 3166256 3243357 3322210 3401566 3480641 3559199 3636896
49494 3636896 3713020 3786696 3857094 3923669 3986330 4045330 4101114 4154333 4205278 4252551 4292926
49483 4292926 4323804 4345774 4361708 4373470 4380843 4383579 4382705 4379061 4372154 4361638 4348856 4335743
49471 4335743 4322880 4309664 4295759 4281558 4267861 4256044 4247776 4243469 4241535 4240394 4240769 4244853 4253519
49458 4253519 4265647 4280152 4297456 4318668 4344145 4373134 4404220 4436029 4467966 4500244 4532826
49447 4532826 4564698 4594700 4622586 4648473 4671662 4690966 4705874 4716371 4721784 4720937 4713444 4699803
49435 4699803 4680037 4653209 4618436 4575626 4525164 4467689 4404299 4336027 4262979 4184806 4102181
49424 4102181 4016840 3929977 3841584 3751730 3661526 3572208 3484028 3396654 3310122 3224939 3141768
49413 3141768 3061539 2985265 2913155 2844107 2776646 2710399 2646516 2586633 2531331 2479406 2428956
49402 2428956 2379489 2332543 2289771 2251028 2215153 2181894 2151663 2123740 2096455 2069504 2044542
49391 2044542 2022970 2004366 1987656 1972432 1958317 1944320 1929900 1915843 1903197 1892132 1882486
49380 1882486 1874406 1867542 1860741 1853734 1848219 1845927 1846309 1847456 1848626 1850424 1853037 1856110 1860189 1866566
49366 1866566 1875388 1885450 1896252 1908857 1924057 1940874 1957883 1975200 1994170 2015404 2037911
49355 2037911 2060024 2080627 2099500 2116965 2133496 2149535 2165522 2181868 2198835 2216648 2235828
49344 2235828 2257016 2280121 2304008 2327586 2351071 2375589 2401607 2428383 2454997 2481413 2508340
49333 2508340 2536533 2566373 2597722 2629928 2662279 2694674 2727565 2760958 2793720 2824300 2852366
49322 2852366 2879561 2908301 2939592 2972110 3003655 3033374 3062165 3091098 3120267 3149500 3179459
49311 3179459 3211268 3245333 3281090 3317717 3354568 3391157 3427375 3463781 3501287 3540511 3581682
49300 3581682 3624840 3669772 3716022 3763536 3812996 3864944 3918748 3973222 4028303 4085516 4146506
49289 4146506 4211538 4279436 4348657 4418487 4489639 4563674 4641489 4722545 4806022 4892473 4983394
49278 4983394 5079173 5178443 5279906 5384073 5492496 5605656 5722276 5840628 5960029 6080903
49268 6080903 6203658 6327724 6451811 6574947 6697033 6818239 6938219 7056260 7171933
49259 7171933 7285101 7395380 7501891 7603349 7697980 7783739 7859490 7926035 7985163 8037346
49249 8037346 8080919 8113804 8135633 8147976 8152997 8152262 8146312 8134909 8117810 8095527 8069190 8039687
49237 8039687 8007520 7973675 7939966 7907968 7878081 7850228 7825071 7803836 7787163 7774808 7766421
49226 7766421 7761835 7760562 7761918 7766039 7774085 7786820 7803495 7822804 7844594 7869705 7898110 7928174
49214 7928174 7958083 7987268 8015884 8043459 8068719 8090326 8107107 8117863 8121813 8119111 8110135 8094269
49202 8094269 8070176 8037330 7996399 7947915 7891512 7826927 7754910 7676496 7592032 7501583 7405797
49191 7405797 7305768 7202587 7097564 6992337 6887957 6784298 6681036 6578829 6478895 6381889
49181 6381889 6287931 6197124 6109152 6022886 5937564 5854056 5773790 5696536 5620481 5544569 5469656
49170 5469656 5397185 5327829 5261651 5198507 5137674 5077992 5019060 4961829 4907663 4857210 4810310
49159 4810310 4766295 4724155 4683168 4643814 4607562 4575435 4547094 4521381 4497157 4473746 4451387
49148 4451387 4431450 4415284 4402541 4391431 4380884 4371661 4365069 4361566 4360886 4362354 4364465 4365402 4365088
49135 4365088 4365917 4370418 4378817 4389790 4402817 4418461 4436751 4456712 4477488 4498922 4520983 4543683
49123 4543683 4567706 4594207 4623565 4654912 4687158 4719960 4753502 4787791 4822520 4857316 4891923
49112 4891923 4926368 4961074 4996630 5033257 5070482 5107259 5142390 5175101 5205529 5234680 5263722
49101 5263722 5293265 5323283 5353582 5384281 5415867 5448568 5481520 5513039 5542407 5571225 5602116
49090 5602116 5636000 5671499 5707102 5742762 5778970 5815455 5851790 5888526 5926713 5966713 6008111
49079 6008111 6050190 6091888 6132114 6171031 6210296 6250964 6291869 6331348 6369831 6409056 6449066
$$ [...]
##END NTUPLES=NMR SPECTRUM
##END=
