##TITLE=coffee_type TOCA01-ROVE100D_85-15%
COFFEE_meoh_noesyp64 COFFEE_meoh {C:\Bruker\TOPSPIN} Administrator 4
##JCAMPDX= 6.0         $$ Bruker NMR JCAMP-DX V2.0
##DATA TYPE= NMR SPECTRUM
##DATA CLASS= NTUPLES
##ORIGIN= Bruker BioSpin GmbH
##OWNER= Administrator
$$ 1.72 TOPSPIN		Version 2.1
$$ 2012-05-18 15:39:58.182 -0700  Administrator@X
$$ Compression mode = diff/dup
##.OBSERVE FREQUENCY= 400.13188235
##.OBSERVE NUCLEUS= ^1H
##.ACQUISITION MODE= SIMULTANEOUS (DQD)
##.ACQUISITION SCHEME= undefined
##.AVERAGES= 64
##.DIGITISER RES= 22
##SPECTROMETER/DATA SYSTEM= spect
##.PULSE SEQUENCE= noesygpps1d.comp
##.SOLVENT NAME= COFFEE_meoh
##.SHIFT REFERENCE= INTERNAL, COFFEE_meoh, 1, 14.98061
##AUDIT TRAIL= $$ (NUMBER, WHEN, WHO, WHERE, PROCESS, VERSION, WHAT)
$$ ##TITLE= Audit trail, TOPSPIN		Version 2.1
$$ ##JCAMPDX= 5.01
$$ ##ORIGIN= Bruker BioSpin GmbH
$$ ##OWNER= Administrator
$$ $$ C:\Bruker\TOPSPIN/data/Administrator/nmr/12-COFFEE-2002/42/pdata/1/auditp.txt
$$ ##AUDIT TRAIL=  $$ (NUMBER, WHEN, WHO, WHERE, PROCESS, VERSION, WHAT)
(   1,<2012-02-20 21:40:53.109 -0500>,<Administrator>,<TOPSPIN>,<go>,<TOPSPIN 2.1>,
      <created by zg
	started at 2012-02-20 21:29:22.922 -0500,
	POWCHK enabled, PULCHK disabled,
       configuration hash MD5:
       B0 76 FB 9C 50 81 44 7D 18 B3 26 32 4E 60 AD 96
       data hash MD5: 64K
       EB 3E 06 33 96 F7 34 15 F5 C3 CE 14 BB AD 84 E8>)
(   2,<2012-02-20 21:40:55.906 -0500>,<Administrator>,<TOPSPIN>,<proc1d>,<TOPSPIN 2.1>,
      <Start of raw data processing
       efp LB = 0.3 FT_mod = 6 PKNL = 1 PHC0 = 0 PHC1 = 0 SI = 128K 
       data hash MD5: 128K
       74 2B A3 C1 B5 62 F3 E0 DD 28 77 91 79 75 9E 18>)
(   3,<2012-02-20 21:40:57.203 -0500>,<Administrator>,<TOPSPIN>,<proc1d>,<TOPSPIN 2.1>,
      <pk PHC0 = 19.63257 PHC1 = 0 
       data hash MD5: 128K
       AC 58 CB F5 2C EA F2 1B BB 2E AE 87 95 01 AF 7C>)
(   4,<2012-02-20 21:40:57.563 -0500>,<Administrator>,<TOPSPIN>,<proc1d>,<TOPSPIN 2.1>,
      <abs ABSG = 1 
       data hash MD5: 128K
       3B 71 43 61 C7 8A 29 E7 A6 E2 BC 04 8B 76 0D B0>)
(   5,<2012-02-20 21:40:57.641 -0500>,<Administrator>,<TOPSPIN>,<proc1d>,<TOPSPIN 2.1>,
      <abs ABSG = 2 
       data hash MD5: 128K
       9C D1 E9 B2 DC 4B F1 01 FB 89 2A 5D B6 A2 65 2E>)
(   6,<2012-02-20 21:40:57.703 -0500>,<Administrator>,<TOPSPIN>,<proc1d>,<TOPSPIN 2.1>,
      <abs ABSG = 3 
       data hash MD5: 128K
       00 B2 CE 2E 39 67 95 55 3F E4 84 50 AC C7 C5 1D>)
(   7,<2012-02-20 21:40:57.766 -0500>,<Administrator>,<TOPSPIN>,<proc1d>,<TOPSPIN 2.1>,
      <abs ABSG = 4 
       data hash MD5: 128K
       D2 E8 4C 1E DF 74 C8 78 B0 0F CA DF A6 F2 3F 9B>)
(   8,<2012-02-20 21:40:57.828 -0500>,<Administrator>,<TOPSPIN>,<proc1d>,<TOPSPIN 2.1>,
      <abs ABSG = 5 
       data hash MD5: 128K
       E3 F0 19 28 EA B6 52 13 F4 0F F3 7E D4 60 CE 6B>)
(   9,<2012-02-20 21:40:58.156 -0500>,<Administrator>,<TOPSPIN>,<audit>,<TOPSPIN 2.1>,
      <user comment:
       ICON-NMR User ID: Administrator
$$ [...]
150 150 150 150 150 150 150 150
##$TP07= 0
##$TPNAME0= <>
##$TPNAME1= <>
##$TPNAME2= <>
##$TPNAME3= <>
##$TPNAME4= <>
##$TPNAME5= <>
##$TPNAME6= <>
##$TPNAME7= <>
##$TPOAL= (0..7)
0.5 0.5 0.5 0.5 0.5 0.5 0.5 0.5
##$TPOFFS= (0..7)
0 0 0 0 0 0 0 0
##$TUNHIN= 0
##$TUNHOUT= 0
##$TUNXOUT= 0
##$USERA1= <user>
##$USERA2= <user>
##$USERA3= <user>
##$USERA4= <user>
##$USERA5= <user>
##$V9= 5
##$VALIST= <valist>
##$VCLIST= <CCCCCCCCCCCCCCC>
##$VD= 0
##$VDLIST= <DDDDDDDDDDDDDDD>
##$VPLIST= <PPPPPPPPPPPPPPP>
##$VTLIST= <TTTTTTTTTTTTTTT>
##$WBST= 1024
##$WBSW= 4
##$XGAIN= (0..3)
0 0 0 0
##$XL= 0
##$YL= 0
##$YMAX_a= 14207362
##$YMIN_a= -6497515
##$ZGOPTNS= <>
##$ZL1= 120
##$ZL2= 120
##$ZL3= 120
##$ZL4= 120
##$ABSF1= 14.98061
##$ABSF2= -5.57192
##$ABSG= 5
##$ABSL= 3
##$ALPHA= 0
##$AQORDER= 0
##$ASSFAC= 0
##$ASSFACI= 0
##$ASSFACX= 0
##$ASSWID= 0
##$AUNMP= <proc_prof1d_extract>
##$AXLEFT= 0
##$AXNAME= <>
##$AXNUC= <1H>
##$AXRIGHT= 0
##$AXTYPE= 0
##$AXUNIT= <>
##$AZFE= 0.1
##$AZFW= 0.1
##$BCFW= 0
##$BC_mod= 0
##$BYTORDP= 0
##$COROFFS= 0
##$CY= 15
##$DATMOD= 1
##$DC= 0
##$DFILT= <>
##$DTYPP= 0
##$F1P= 0
##$F2P= 0
##$FCOR= 0.5
##$FTSIZE= 131072
##$FT_mod= 6
##$GAMMA= 0
##$GB= 0
##$INTBC= 1
##$INTSCL= 1
##$ISEN= 128
##$LB= 0.3
##$LEV0= 0
##$LPBIN= 0
##$MAXI= 10000
##$MC2= 0
##$MEAN= 0
##$ME_mod= 0
##$MI= 0
##$NCOEF= 0
##$NC_proc= -3
##$NLEV= 6
##$NOISF1= 0
##$NOISF2= 0
##$NSP= 0
##$NTH_PI= 0
##$NZP= 0
##$OFFSET= 14.98061
##$PC= 1
##$PHC0= 19.63257
##$PHC1= 0
##$PH_mod= 1
##$PKNL= yes
##$PPARMOD= 0
##$PPDIAG= 0
##$PPIPTYP= 0
##$PPMPNUM= 2147483647
##$PPRESOL= 1
##$PSCAL= 4
##$PSIGN= 0
##$PYNMP= <proc.py>
##$REVERSE= no
##$SF= 400.13
##$SI= 131072
##$SIGF1= 0
##$SIGF2= 0
##$SINO= 400
##$SIOLD= 131072
##$SPECTYP= <>
##$SREGLST= <1H.CDCl3>
##$SSB= 0
##$STSI= 131072
##$STSR= 0
##$SW_p= 8223.68421052632
##$SYMM= 0
##$S_DEV= 0
##$TDeff= 65536
##$TDoff= 0
##$TI= <>
##$TILT= no
##$TM1= 0
##$TM2= 0
##$TOPLEV= 0
##$USERP1= <user>
##$USERP2= <user>
##$USERP3= <user>
##$USERP4= <user>
##$USERP5= <user>
##$WDW= 1
##$XDIM= 131072
##$YMAX_p= 484687341
##$YMIN_p= -283251240
##$CURPLOT= <Network HP LaserJet P1505>
##$CURPRIN= <$Network HP LaserJet P1505>
##$DFORMAT= <normdp>
##$LAYOUT= <+/1D_H.xwp>
##$LFORMAT= <normlp>
##$PFORMAT= <normpl>
##$SURQMSG= 1
$$ End of Bruker specific parameters
$$ ---------------------------------
##NTUPLES= NMR SPECTRUM
##VAR_NAME=  FREQUENCY,     SPECTRUM/REAL,   SPECTRUM/IMAG
##SYMBOL=    X,             R,               I
##VAR_TYPE=  INDEPENDENT,   DEPENDENT,       DEPENDENT
##VAR_FORM=  AFFN,          ASDF,            ASDF
##VAR_DIM=   131072,        131072,          131072
##UNITS=     HZ,            ARBITRARY UNITS, ARBITRARY UNITS
##FACTOR=    0.0627417313425165, 1,          1
##FIRST=     8223.62146879498, 5556,         -97425
##LAST=      0,             11052,           -96786
##MIN=       0,             -283251240,      0
##MAX=       8223.62146879498, 484687341,    0
$$ Real data points
##PAGE= N=1
##DATA TABLE= (X++(R..R)), XYDATA
$$ [...]
60698A545587Q135O664O547P456P682O670N512M858L895J999J67q9J366L204M123
60683A613776L840K816J370p92m028p715j0245j0622r661q992r142r402r298r184
60669A532721r420r909j0456j0798j0277q520o487n751o415o767n513l386k073
60656A436949k314l616n094o038o154n839n803o132o309o372p132q600r171p452
60642A350923m424k589k977m120m209l267k559k442j991o67N17K44j327k785l454
60627A314873m215o196r399j2982j6082j7865j7731j6283j5382j6117j7254j6754
60615A148613j4454j2040j0666r925r142q261p287o066m883m098k966j06M291
60602A063010P984R156Q380P366O829O452O092O025O379P116Q130Q816Q243O573
$$ y = [1545587, 1553722, 1560386, 1566933, 1574389, 1582071, 1588741, 1594253, 1599111, 1603006, 1605005, 1605172, 1605083, 1606449, 1609653, 1613776, 1617616, 1620432, 1621802, 1621010, 1616982, 1609267, 1599022, 1588400, 1578739, 1569747, 1560605, 1551203, 1541905, 1532721, 1523301, 1513392, 1502936, 1492138, 1481861, 1473341, 1466854, 1461103, 1454688, 1447921, 1442408, 1439022, 1436949, 1434635, 1431019, 1425925, 1419887, 1413733, 1407894, 1402091, 1395959, 1389650, 1383278, 1376146, 1367546, 1358375, 1350923, 1346499, 1343910, 1340933, 1336813, 1332604, 1329337, 1326778, 1324336, 1322345, 1321678, 1322195, 1322439, 1321112, 1318327, 1314873, 1310658, 1304462, 1295063, 1282081, 1265999, 1248134, 1230403, 1214120, 1198738, 1182621, 1165367, 1148613, 1134159, 1122119, 1111453, 1101528, 1092386, 1084125, 1076838, 1070772, 1065889, 1061791, 1058825, 1058719, 1063010, 1070994, 1080150, 1088530, 1095896, 1102725, 1109177, 1115269, 1121294, 1127673, 1134789, 1142919, 1151735, 1159978, 1166551]
60588A166551N563O649R012J0457R975Q410O885N700M851M611N193O303P439Q246
60574A265845Q689R120J0119J1876J3753J4970J5662J6681J8300J9676J9976J9524
60562A444191J9337J9627J9291J7168J3558J0174Q487Q368Q428P473N324K511
60550A583937m25l226n870q260r855r812p926n277l451l155m005n456p279r102
60536A500838j0378j1015j1438j1747j1524j0693r825r222q456p280o119n110
60524A388031l522r87J486K843L611N016O906Q000P953P628P168N604L005J446
60510A444188K496M785N615M494L569M584O753Q048P567O024M562L786L581L330
60496A513382K434Q97p13j902k509k257o81K046M859O979Q969J1936J5962K0093
$$ y = [1166551, 1172114, 1178763, 1187775, 1198232, 1208207, 1216617, 1223502, 1229202, 1234053, 1238664, 1243857, 1250160, 1257599, 1265845, 1274534, 1283654, 1293773, 1305649, 1319402, 1334372, 1350034, 1366715, 1385015, 1404691, 1424667, 1444191, 1463528, 1483155, 1502446, 1519614, 1533172, 1543346, 1551833, 1560201, 1568629, 1576102, 1581426, 1583937, 1583512, 1580286, 1574416, 1566156, 1556301, 1546489, 1538563, 1533286, 1529835, 1526680, 1522675, 1517219, 1509940, 1500838, 1490460, 1479445, 1468007, 1456260, 1444736, 1434043, 1424218, 1414996, 1406540, 1399260, 1393141, 1388031, 1384509, 1383522, 1385008, 1387851, 1391462, 1396478, 1403384, 1411384, 1419337, 1426965, 1434133, 1439737, 1442742, 1444188, 1446684, 1451469, 1457084, 1461578, 1465147, 1469731, 1476484, 1484532, 1492099, 1498123, 1502685, 1506471, 1510052, 1513382, 1515816, 1516713, 1516000, 1514098, 1511589, 1509332, 1508651, 1510697, 1515556, 1522535, 1531504, 1543440, 1559402, 1579495]
60482A579495K3701K7061L0668L4793L9639M5144N0636N5586O0527O6015P0415
60471B083680P0272O3724N2554L9957K7356J4524J875q997j6906k1888k4358k4414
60459B257379k2036j7309j0416k101O105J2881J8226K2935K7295L1015L4047L6555
60447B394576L8269L9005L9568M1099M3660M6656N0603N7021O6378P7434Q8974
60436B983243J00990J13804J27393J42124J58859J77427J96229K14268K32530
60427D446867K52395K73756K96007L19790L46189L74702M03580M31505M56528
60418G601319M72722M69960M38844L75964K84396J70640M2561r0373k17234l27682
60408I221117m14386m74003n06884n16561n08700m89177m62313m30812l96881
$$ y = [1579495, 1603196, 1630257, 1660925, 1695718, 1735357, 1780501, 1831137, 1886723, 1947250, 2013265, 2083680, 2153952, 2217676, 2270230, 2310187, 2337543, 2352067, 2353942, 2344945, 2328039, 2306151, 2281793, 2257379, 2235343, 2218034, 2207618, 2205517, 2211622, 2224503, 2242729, 2265664, 2292959, 2323974, 2358021, 2394576, 2432845, 2471850, 2511418, 2552517, 2596177, 2642833, 2693436, 2750457, 2816835, 2894269, 2983243, 3084233, 3198037, 3325430, 3467554, 3626413, 3803840, 4000069, 4214337, 4446867, 4699262, 4973018, 5269025, 5588815, 5935004, 6309706, 6713286, 7144791, 7601319, 8074041, 8544001, 8982845, 9358809, 9643205, 9813845, 9856406, 9766033, 9548799, 9221117, 8806731, 8332728, 7825844, 7309283, 6800583, 6311406, 5849093, 5418281, 5021400]
60399E021400l62693l29762k98704k69852k43472k19194j96246j74755j56000
60390B770722j40556j27084j14079j02002r2292q4747p7637p0342o4114n9688
60380A838181n5840n1167m6049m1769l8618l6013l3803l2299l1258k9909k7961
60369A413495k5879k4175k2887k1769k0528j8952j7110j5380j4101j3264j2626
60358A206824j1822j0322p788m738k429j717k245k915k843j725J67J989K715K094
60344A165245R64M23P47J332J405P28j20j28J139K895L928M021M008M407M811
60329A195805M820M820N355O280O975O956O018M361K753J932J508J90k515n448
60315A239810p135p244o258m583k712j576j754k588k836j947k10J906L834M818
$$ y = [5021400, 4658707, 4328945, 4030241, 3760389, 3516917, 3297723, 3101477, 2926722, 2770722, 2630166, 2503082, 2389003, 2287001, 2194709, 2109962, 2032325, 1961983, 1897869, 1838181, 1782341, 1731174, 1685125, 1643356, 1604738, 1568725, 1534922, 1502623, 1471365, 1441456, 1413495, 1387616, 1363441, 1340554, 1318785, 1298257, 1279305, 1262195, 1246815, 1232714, 1219450, 1206824, 1195002, 1184680, 1176892, 1172154, 1169725, 1168008, 1165763, 1162848, 1160005, 1158280, 1158447, 1160436, 1163151, 1165245, 1166209, 1166632, 1167379, 1168711, 1170116, 1170844, 1170724, 1170596, 1171735, 1174630, 1178558, 1182579, 1186587, 1190994, 1195805, 1200625, 1205445, 1210800, 1217080, 1224055, 1231011, 1237029, 1241390, 1244143, 1246075, 1247583, 1247773, 1245258, 1239810, 1232675, 1225431, 1219173, 1214590, 1211878, 1210302, 1208548, 1205960, 1203124, 1201177, 1200967, 1202873, 1206707, 1211525]
60301A211525M608L994L878M117M032L796M284N554O515O410N876N985O810P475
60287A284859P508P551Q524J0242J1284J0469Q286O424N875O076O007N419M607
60274A383131L591K246R37K38J02K1J24J425M544Q383J0641R870O887L959K536
60259A438635K048R65j306l904n637o112n927o053o954p991p912o296m192k857
60245A376507k309j776j102p49o58j84Q22J876K815L951N207O068O363O216N365
60230A408412L783K722L535N439O306N944O531R028J1401J1824J1605J2963J5313
60217A514806J6133J4809J3341J3375J4390J5049J4946J4634J4845J5890J7330
60206A679548J8374J9013K0251K2703K5686K8415L1229L4620L8023M0803M3629
$$ y = [1211525, 1216133, 1220127, 1224005, 1228122, 1232154, 1235950, 1240234, 1245788, 1252303, 1258713, 1264589, 1270574, 1277384, 1284859, 1292367, 1299918, 1308442, 1318684, 1329968, 1340437, 1348723, 1355147, 1361022, 1367098, 1373105, 1378524, 1383131, 1386722, 1388968, 1389905, 1390143, 1390245, 1390266, 1390390, 1391815, 1396359, 1404742, 1415383, 1425253, 1432140, 1436099, 1438635, 1440683, 1441648, 1440342, 1436438, 1430801, 1424689, 1418762, 1412709, 1405755, 1397764, 1389852, 1383556, 1379364, 1376507, 1374198, 1372422, 1371320, 1370571, 1369913, 1369729, 1370551, 1372427, 1375242, 1379193, 1384400, 1390468, 1396831, 1403047, 1408412, 1412195, 1414917, 1418452, 1423891, 1430197, 1436141, 1442672, 1451700, 1463101, 1474925, 1486530, 1499493, 1514806, 1530939, 1545748, 1559089, 1572464, 1586854, 1601903, 1616849, 1631483, 1646328, 1662218, 1679548, 1697922, 1716935, 1737186, 1759889, 1785575, 1813990, 1845219, 1879839, 1917862, 1958665, 2002294]
60195B002294M7392N1458N4640N7446O1603O7504P3744P9335Q4780R0694R6907
60184B767797J03410J10857J19439J28203J36075J42960J49385J55620J61401
60175C975147J66099J69036J70002J69248J66648J61297J52608J41221J27951
60166E399257J12505R4485P5149N6606L9526K3191P748n435j5893k4669l2136
60155E730334l6919l7892l5784l1642k4957j4955k811R089J9959L1284M4575N9555
60143E709836P4970R0248J05674J21195J35748J47947J57065J62991J65376J63398
60133G034448J56634J45739J31797J15326R6430P5654N3965L1980R724j2722l4856
60122G804119n5917p4905r0476j01374j07252j08649j06026r9255q8278p3953
$$ y = [2002294, 2049686, 2101144, 2155784, 2213230, 2274833, 2342337, 2416081, 2495416, 2580196, 2670890, 2767797, 2871207, 2982064, 3101503, 3229706, 3365781, 3508741, 3658126, 3813746, 3975147, 4141246, 4310282, 4480284, 4649532, 4816180, 4977477, 5130085, 5271306, 5399257, 5511762, 5606247, 5681396, 5738002, 5777528, 5800719, 5808467, 5803032, 5787139, 5762470, 5730334, 5693415, 5655523, 5619739, 5588097, 5563140, 5548185, 5545374, 5554463, 5574422, 5605706, 5650281, 5709836, 5784806, 5875054, 5980728, 6101923, 6237671, 6385618, 6542683, 6705674, 6871050, 7034448, 7191082, 7336821, 7468618, 7583944, 7680374, 7756028, 7809993, 7841973, 7851697, 7838975, 7804119, 7748202, 7673297, 7582821, 7481447, 7374195, 7265546, 7159520, 7060265, 6971987, 6898034]
60112F898034n7880m1308k4276o057J3471L3142N1490O8129Q3385R6806J07011
60101G221947J13182J15574J14216J08418R8284Q5660P2500N9160M5280L1432
60091H065653J8702P399k418r733j3094j2078p086J802J4575L0333M7853O6785
60079H208693Q7294J09080J31989J56831J84161K12917K41973K72288L05466L40537
60069A0251229L74460M05767M35338M63305M87663N06713N20574N29163N30605
60060A4504817N23033N06453M81615M48445M06916L58213L03528K42753J75783
60051A7951556J04349L1224m1872j14304j84898k51427l11535l63173m04264m32929
60041A5982727m48371m51271m43297m26280m01539l69787l31963k90105k46858
$$ y = [6898034, 6840154, 6798846, 6774570, 6768513, 6781984, 6815126, 6866616, 6934745, 7018130, 7114936, 7221947, 7335129, 7450703, 7564919, 7673337, 7771621, 7857281, 7929781, 7988941, 8034221, 8065653, 8084355, 8091754, 8089336, 8079603, 8066509, 8054431, 8047345, 8049147, 8063722, 8094055, 8141908, 8208693, 8295987, 8405067, 8537056, 8693887, 8878048, 9090965, 9332938, 9605226, 9910692, 10251229, 10625689, 11031456, 11466794, 11930099, 12417762, 12924475, 13445049, 13974212, 14504817, 15027850, 15534303, 16015918, 16464363, 16871279, 17229492, 17533020, 17775773, 17951556, 18055905, 18087129, 18045257, 17930953, 17746055, 17494628, 17183093, 16819920, 16415656, 15982727, 15534356, 15083085, 14639788, 14213508, 13811969, 13442182, 13110219, 12820114, 12573256]
60032A2573256k03932j61530j19339p7576l7184L04L3056N9832Q0476R4849J01625
60021A2343837R9363Q8638P1890N1085K6932M10k6538n2469p7149j00339j21246
60010A2304414j39905j57689j75421j91959k05586k16044k24400k31603k37572
60001A0524235k40901k39208k31007k17665k02300j86297j68366j47484j24976
59992H766031j02562q0044n6380l1809p422J6282L9060O0058P8734R5874J12360
59981H890182J27552J39811J47773J50134J45578J34285J18372R9292P6039M7776
59971A0076794J6910j2804m0518o8137r6192j22398j44442j61871j74747j82622
59961I089973j85708j85100j80849j71445j56389j37981j19150j00543q0931n9754
$$ y = [12573256, 12369324, 12207794, 12088455, 12010879, 11973695, 11973999, 12007055, 12066887, 12147363, 12242212, 12343837, 12443200, 12531838, 12603728, 12654813, 12681745, 12682155, 12655617, 12603148, 12525999, 12425660, 12304414, 12164509, 12006820, 11831399, 11639440, 11433854, 11217810, 10993410, 10761807, 10524235, 10283334, 10044126, 9813119, 9595454, 9393154, 9206857, 9038491, 8891007, 8766031, 8663469, 8583425, 8527045, 8495236, 8487814, 8504096, 8543156, 8603214, 8681948, 8777822, 8890182, 9017734, 9157545, 9305318, 9455452, 9601030, 9735315, 9853687, 9952979, 10029018, 10076794, 10093704, 10080900, 10040382, 9972245, 9876053, 9753655, 9609213, 9447342, 9272595, 9089973, 8904265, 8719165, 8538316, 8366871, 8210482, 8072501, 7953351, 7852808, 7771877, 7712123]
59951G712123l7892j6166N605K7976N1040P4475R7895J20940J43272J64699J85185
59940H529152K04409K21128K33121K38241K35684K26175K10913J90811J66648
59931A0456282J39149J08603P5114L9702M372k9624o2724r5286j25560j50682
59921A0359346j69312j81996j89013j89355j82388j69427j52863j34214j13432
59912H877346q9818o3300l5070p164J8907M3073O6039Q7906J07948J25604J40949
59901I272420J53998J64097J70302J72118J69830J64396J56976J48124J37490
59892A0709751J24804J11147R8616Q8517Q0425P3395O7664O4923O7112P5309Q9303
59881A1650966J07825J29453J53983J82817K17355K56773K98022L38473L78043
$$ y = [7712123, 7674231, 7658065, 7663670, 7691646, 7742686, 7817161, 7915056, 8035996, 8179268, 8343967, 8529152, 8733561, 8954689, 9187810, 9426051, 9661735, 9887910, 10098823, 10289634, 10456282, 10595431, 10704034, 10779148, 10818850, 10823222, 10793598, 10730874, 10635588, 10510028, 10359346, 10190034, 10008038, 9819025, 9629670, 9447282, 9277855, 9124992, 8990778, 8877346, 8787528, 8724228, 8689158, 8681994, 8700901, 8743974, 8810013, 8897919, 9005867, 9131471, 9272420, 9426418, 9590515, 9760817, 9932935, 10102765, 10267161, 10424137, 10572261, 10709751, 10834555, 10945702, 11044318, 11132835, 11213260, 11286655, 11354319, 11419242, 11486354, 11561663, 11650966, 11758791, 11888244, 12042227, 12225044, 12442399, 12699172, 12997194, 13335667, 13713710]
59872A3713710M17923M57513M93510N21931N40005N45820N37312N12505M70162
59863A8210391M09521L30367K34495J26790J3846r8288k04468k99707l79881m43147
59853A7899919m89477n18909n31585n29330n15523m92972m63012m26882l86607
59844A3545622l44077l00366k56210k12108j67791j22906p8393l5999L705M1357
59834A2072834P6829J08795J36362J59274J76122J84456J83124J72328J50962
59825A3421086J16676O9909J5303m2600j02627j64164k23670k76727l21704l58760
59815A2132722l86827m04575m13128m14958m10745m00029l83978l64675l42406
59806H611401l16690k89559k64473k41968k19506j96011j73461j53415j35030
$$ y = [13713710, 14131633, 14589146, 15082656, 15604587, 16144592, 16690412, 17227724, 17740229, 18210391, 18619912, 18950279, 19184774, 19311564, 19325410, 19227122, 19022654, 18722947, 18343066, 17899919, 17410442, 16891533, 16359948, 15830618, 15315095, 14822123, 14359111, 13932229, 13545622, 13201545, 12901179, 12644969, 12432861, 12265070, 12142164, 12063771, 12027772, 12031477, 12072834, 12149663, 12258458, 12394820, 12554094, 12730216, 12914672, 13097796, 13270124, 13421086, 13537762, 13607671, 13622974, 13580374, 13477747, 13313583, 13089913, 12813186, 12491482, 12132722, 11745895, 11341320, 10928192, 10513234, 10102489, 9702460, 9318482, 8953807, 8611401, 8294711, 8005152, 7740679, 7498711, 7279205, 7083194, 6909733, 6756318, 6621288]
59797F621288j17762j03279r3087q6266q1081p7145p4645p2843p0717o7935o4262
59786E712266n9156n2824m6497m0926l5763l1084k8139k7846k9881l3996m0562
59775E285592m8755n5859n9865o1644o3053o3933o2665n9033n4682n0693m6105
59764D659305l9259k9779j8900q186J791J1495K1166K9865L6380M0903M5025N0063
59752D799869N6271O3662P2296Q1313Q8757R3216R4955R4847R2958Q8783Q2197
59741E709124P3598O3709N3731M5098L8433L3306K9464K7709K8992L3167L9163
59730F175494M5985N3298O1613P2279Q6597J04396J23980J44024J64968J88183
59720G220817K14380K43377K74840L08502L43805L79864M15451M48642M76590
$$ y = [6621288, 6503526, 6400247, 6307160, 6220894, 6139813, 6062668, 5988023, 5915180, 5844463, 5776528, 5712266, 5653110, 5600286, 5553789, 5512863, 5477100, 5446016, 5417877, 5390031, 5360150, 5326154, 5285592, 5236837, 5180978, 5121113, 5059469, 4996416, 4932483, 4869818, 4810785, 4756103, 4705410, 4659305, 4620046, 4590267, 4571367, 4563181, 4564972, 4576467, 4597633, 4627498, 4663878, 4704781, 4749806, 4799869, 4856140, 4919802, 4992098, 5073411, 5162168, 5255384, 5350339, 5445186, 5538144, 5626927, 5709124, 5782722, 5846431, 5900162, 5945260, 5983693, 6016999, 6046463, 6074172, 6103164, 6136331, 6175494, 6221479, 6274777, 6336390, 6408669, 6495266, 6599662, 6723642, 6867666, 7032634, 7220817, 7435197, 7678574, 7953414, 8261916, 8605721, 8985585, 9401036, 9849678, 10326268]
59711A0326268M95691N01385M87621M47721L77572K79226J61908L9326p4912j71018
59701A2870788k44090k93031l19343l26645l19732l02690k77987k47628k14230
59692A0325412j79760j44230j07224p0224l5750m404K5394N4802Q3539J11680
59682A0059235J40273J69568J98531K26929K56009K86183L16050L45092L75441
59673A2373311M09182M45493M82488N20656N62111O07174O54082P01801P50804
59664A7507102Q00889Q50351Q97843R43108R84871J019538J043288J054562J053549
59655B6155101J040237J014608R78795R37769Q97347Q61975Q34498Q16990Q10635
59646C4347955Q14737Q26703Q43292Q61334Q76876Q84530Q78588Q54781Q10483
$$ y = [10326268, 10821959, 11323344, 11810965, 12258686, 12636258, 12915484, 13077392, 13116718, 13041806, 12870788, 12626698, 12333667, 12014324, 11687679, 11367947, 11065257, 10787270, 10539642, 10325412, 10145652, 10001422, 9894198, 9823974, 9788224, 9783820, 9809214, 9864016, 9947555, 10059235, 10199508, 10369076, 10567607, 10794536, 11050545, 11336728, 11652778, 11997870, 12373311, 12782493, 13227986, 13710474, 14231130, 14793241, 15400415, 16054497, 16756298, 17507102, 18307991, 19158342, 20056185, 20999293, 21984164, 23003702, 24046990, 25101552, 26155101, 27195338, 28209946, 29188741, 30126510, 31023857, 31885832, 32720330, 33537320, 34347955, 35162692, 35989395, 36832687, 37694021, 38570897, 39455427, 40334015, 41188796, 41999279]
59637D1999279P44183O56236N50293M32691L09848J87028O9601l6017j23826j90129
59627D4599187k33406k53151k49937k26081j84879j28588n7760K7004J23059K26137
59617D3641585L33178M44201N60376O80104P97998R08180J006946J090659J152090
59608E0615317J181123J169082J110489J000929Q36417O17055L50339M9929k67654
59599E6663026n84387q81361j141509j353198j511308j615837j670418j681194
59591D6223814j655468j600827j525584j439184j351321j271239j208172j170796
59583C5001223j163883j184809j223795j267699j304060j323805j322874j302138
59575B4908160j265069j215152j155377j089087j019771r49919q80923q14001
$$ y = [41999279, 42743462, 43399698, 43949991, 44382682, 44692530, 44879558, 44949159, 44913142, 44789316, 44599187, 44365781, 44112630, 43862693, 43636612, 43451733, 43323145, 43265385, 43292389, 43415448, 43641585, 43974763, 44418964, 44979340, 45659444, 46457442, 47365622, 48372568, 49463227, 50615317, 51796440, 52965522, 54076011, 55076940, 55913357, 56530412, 56880751, 56930680, 56663026, 56078639, 55197278, 54055769, 52702571, 51191263, 49575426, 47905008, 46223814, 44568346, 42967519, 41441935, 40002751, 38651430, 37380191, 36172019, 35001223, 33837340, 32652531, 31428736, 30161037, 28856977, 27533172, 26210298, 24908160, 23643091, 22427939, 21272562, 20183475, 19163704, 18213785, 17332862, 16518861]
59567A6518861p50425o90754o34622n81586n31861m86069m44468m06481l71104
59558A1621491l37934l07536k80336k55618k32610k12175j95844j83122j71740
59549I444576j61254j54243j52507j54009j55584j57219j61037j66829j71415
59540H010479j72589j71311j69319j66490j61520j53926j44389j33907j23244
59531F613784j12570j01441q9645p7994o7363n7208m6260l4649k3809j4157m509
59520E984179N641J4905K2126K8235L4649M0932M5654M8860N1997N5609N8818
59509F391605O1239O4004O8315P4160Q1169Q9701J00098J11497J22665J33801
59499G298254J46413J61306J77695J94612K12108K30461K49221K68003K87582
$$ y = [16518861, 15768436, 15077682, 14443060, 13861474, 13329613, 12843544, 12399076, 11992595, 11621491, 11283557, 10976021, 10695685, 10440067, 10207457, 9995282, 9799438, 9616316, 9444576, 9283322, 9129079, 8976572, 8822563, 8666979, 8509760, 8348723, 8181894, 8010479, 7837890, 7666579, 7497260, 7330770, 7169250, 7015324, 6870935, 6737028, 6613784, 6501214, 6399773, 6310128, 6232134, 6164771, 6107563, 6061303, 6026654, 6002845, 5988688, 5984179, 5989820, 6004725, 6026851, 6055086, 6089735, 6130667, 6176321, 6225181, 6277178, 6332787, 6391605, 6452844, 6516848, 6585163, 6659323, 6740492, 6830193, 6930291, 7041788, 7164453, 7298254, 7444667, 7605973, 7783668, 7978280, 8190388, 8420849, 8670070, 8938073, 9225655]
59490I225655L08869L31125L52483L72165L90793M08111M21865M29813M31884
59481A2672763M29470M23300M12981L98116L78864L55574L28551K98134K64549
59472A5962302K28111J90171J53359J20233R1743O7659M8090L3886K5929K4737
59462A6946220L0597M3199O1204Q2899J07043J32279J55713J73081J80673J76365
59452A8089273J58771J26549P9507J9759m9249j24695k04532k85598l62887m31617
59442A7015281m89584n36435n70966n90638n94427n84882n66225n41211n10972
59433A2029941m77045m41459m04867l66597l27184k89199k54498k22040j89668
59424I057384j57128j26013r7379p0733m5142k0198M160K8056N1914P6574J02749
$$ y = [9225655, 9534524, 9865649, 10218132, 10590297, 10981090, 11389201, 11811066, 12240879, 12672763, 13102233, 13525533, 13938514, 14336630, 14715494, 15071068, 15399619, 15697753, 15962302, 16190413, 16380584, 16533943, 16654176, 16745919, 16813578, 16861668, 16895554, 16921483, 16946220, 16976817, 17020016, 17081220, 17164119, 17271162, 17403441, 17559154, 17732235, 17912908, 18089273, 18248044, 18374593, 18454100, 18473859, 18424610, 18299915, 18095383, 17809785, 17446898, 17015281, 16525697, 15989262, 15418296, 14827658, 14233231, 13648349, 13082124, 12540913, 12029941, 11552896, 11111437, 10706570, 10339973, 10012789, 9723590, 9469092, 9247052, 9057384, 8900256, 8774243, 8676864, 8606131, 8560989, 8540791, 8544951, 8573007, 8624921, 8701495, 8804244]
59413H804244J29841J55878J79479K01525K24066K47643K70219K88654L00804
59404A0802353L06352L05884K98982K83395K56779K19291J73467J21361O3160
59395A2831024o11o7054j32280j93778k49923k98320l36614l64697l84320l96531
59385A0406896m01100l98504l90722l79381l64477l45704l24271l02523k82201
59376G218013k63502k45472k27006k07821j88678j70509j53458j37101j21389
59367E503077j06822r3631q1360o9398n7668m6699l7024k8387j9581r590J007
59356D953924J0511J8221K5228L2746M0685M8514N6190O3078O7041O6463O2740
59345E445341N9311N8447O0416O5289P3636Q5185R8502J12639J27643J42911J56354
$$ y = [8804244, 8934085, 9089963, 9269442, 9470967, 9695033, 9942676, 10212895, 10501549, 10802353, 11108705, 11414589, 11713571, 11996966, 12253745, 12473036, 12646503, 12767864, 12831024, 12830413, 12763359, 12631079, 12437301, 12187378, 11889058, 11552444, 11187747, 10803427, 10406896, 10005796, 9607292, 9216570, 8837189, 8472712, 8127008, 7802737, 7500214, 7218013, 6954511, 6709039, 6482033, 6274212, 6085534, 5915025, 5761567, 5624466, 5503077, 5396255, 5302624, 5221264, 5151866, 5094198, 5047499, 5010475, 4982088, 4962507, 4952917, 4953924, 4964435, 4982656, 5007884, 5040630, 5081315, 5129829, 5186019, 5249097, 5316138, 5382601, 5445341, 5504652, 5563099, 5623515, 5688804, 5762440, 5847625, 5946127, 6058766, 6186409, 6329320, 6485674]
59334F485674J66248J73215J79708J88179K00156K16290K36460K60082K86695
59325H392707L16123L48009L81836M17466M55173M95017N36871N81040O27795
59316A2552037O75894P22308P63991P99166Q26328Q42784Q45367Q32609Q05586
59307A9666070P66651P18026O61808O00529N36995M73472M11526L52582K97882
59298B4485541K47177J97902J46660R1742L3570k7273r1347j59087k29079k98346
59288B4397460l63956m23772m76396n21353n59270n91166o17658o39118o56119
59279A9548652o69079o77829o81960o81239o75196o63023o44635o21310n94571
59270A3639810n64847n32051m97005m61295m25973l91154l56747l22910k90069
$$ y = [6485674, 6651922, 6825137, 7004845, 7193024, 7393180, 7609470, 7845930, 8106012, 8392707, 8708830, 9056839, 9438675, 9856141, 10311314, 10806331, 11343202, 11924242, 12552037, 13227931, 13950239, 14714230, 15513396, 16339724, 17182508, 18027875, 18860484, 19666070, 20432721, 21150747, 21812555, 22413084, 22950079, 23423551, 23835077, 24187659, 24485541, 24732718, 24930620, 25077280, 25169022, 25202592, 25175319, 25083972, 24924885, 24695806, 24397460, 24033504, 23609732, 23133336, 22611983, 22052713, 21461547, 20843889, 20204771, 19548652, 18879573, 18201744, 17519784, 16838545, 16163349, 15500326, 14855691, 14234381, 13639810, 13074963, 12542912, 12045907, 11584612, 11158639, 10767485, 10410738, 10087828, 9797759]
59261I797759k58989k30461k04347j79466j55047j31642j09904q9382o9511n0885
59251H318125l4201j8634k815J3020K7448M0175N2265O4009P4175Q1736Q6999
59240H702302R0500R1946R0881Q7450Q1895P3922O3297N0797L8174K7096J8062
59229I416322J0363L426j848l675j510L464J0313J9565L1606M5221N9146P3985
59217I666378R0946J09329J26968J42666J56495J67974J75651J78490J76207J68387
59207A1159491J54509J34610J08725P6300L7959k553l9999p1170r5405j12250
59197A1350217j21101j23078j20898j16235j08908r9025q7901p6534o5034n4207
59187A0377296m5646l9677l5061l1533l0562l2679l5941l8234l9424l9959l9029
$$ y = [9797759, 9538770, 9308309, 9103962, 8924496, 8769449, 8637807, 8527903, 8438521, 8369010, 8318125, 8283924, 8265290, 8262475, 8275495, 8302943, 8343118, 8395383, 8459392, 8533567, 8615303, 8702302, 8792802, 8884748, 8975629, 9063079, 9144974, 9218896, 9282193, 9332990, 9371164, 9398260, 9416322, 9426685, 9430111, 9428263, 9424588, 9423078, 9426542, 9436855, 9456420, 9488026, 9533247, 9592393, 9666378, 9757324, 9866653, 9993621, 10136287, 10292782, 10460756, 10636407, 10814897, 10991104, 11159491, 11314000, 11448610, 11557335, 11633635, 11671594, 11669041, 11629042, 11557872, 11462467, 11350217, 11229116, 11106038, 10985140, 10868905, 10759997, 10660972, 10573071, 10496537, 10431503, 10377296, 10331650, 10291973, 10256912, 10225379, 10194817, 10162138, 10126197, 10087963, 10048539, 10008580, 9969551]
59176I969551l5548k9698k1950j1537K727K0852M2086O6159R3178J23062J55885
59165A0374767J91986K30807K70467L09357L47287L83972M17103M43010M58765
59156A3427521M62692M53273M28544L86671L26878K50276J60126O0843m3601j49843
59146A5763380k53856l50437m34511n02539n52917n85963o03668o08389o01485
59137A1269615n83868n57698n26176m91709m55598m19512l85469l53946l23633
59128G172006k93871k65892k41025k19078j99223j81080j64260j48195j33082
59119E326300j19734j07857r6076q4175p3460o4065n4050m2523l1696k3898j8101
59108D610665j1413k910N951J3923K1038K7668L4248M1469M9302N6275O1153O4891
$$ y = [9969551, 9934003, 9904305, 9882355, 9870818, 9873545, 9894397, 9936483, 10002642, 10095820, 10218882, 10374767, 10566753, 10797560, 11068027, 11377384, 11724671, 12108643, 12525746, 12968756, 13427521, 13890213, 14343486, 14772030, 15158701, 15485579, 15735855, 15895981, 15956824, 15913223, 15763380, 15509524, 15159087, 14724576, 14222037, 13669120, 13083157, 12479489, 11871100, 11269615, 10685747, 10128049, 9601873, 9110164, 8654566, 8235054, 7849585, 7495639, 7172006, 6878135, 6612243, 6371218, 6152140, 5952917, 5771837, 5607577, 5459382, 5326300, 5206566, 5098709, 5002633, 4918458, 4844998, 4780933, 4726883, 4684360, 4652664, 4628766, 4610665, 4599252, 4596342, 4602293, 4616216, 4637254, 4664922, 4699170, 4740639, 4789941, 4846216, 4907369, 4972260]
59096D972260O9554P5797Q2722Q9762R7103J04528J11379J17663J23884J29666
59086E974318J33699J35176J34300J31489J26967J21189J14613J06781R6443Q3066
59076G158041O7785N2548L8494K5331J2341l5r915j5727j7921j8155j6983j3354
59064G262450o519K836J3689K5779L9096N3366O8739Q5955J05002J24413J42557
59053G917363J59092J74707J90307K06804K24647K42875K59632K74075K86830
59044I936332K97944L05742L08453L05734K97603K82987K60517K29944J91718
59035A2416974J46046R3475L5959k3521q1895j36348j84829k26979k63622k94722
59025A1480538l19034l36351l48637l57828l63814l65769l64279l60660l55097
$$ y = [4972260, 5041814, 5117611, 5200333, 5290095, 5387198, 5491726, 5603105, 5720768, 5844652, 5974318, 6108017, 6243193, 6377493, 6508982, 6635949, 6757138, 6871751, 6978532, 7074975, 7158041, 7225826, 7278374, 7316868, 7342199, 7354540, 7354505, 7344590, 7328863, 7310942, 7292787, 7275804, 7262450, 7255931, 7258767, 7272456, 7298235, 7337331, 7390697, 7459436, 7545391, 7650393, 7774806, 7917363, 8076455, 8251162, 8441469, 8648273, 8872920, 9115795, 9375427, 9649502, 9936332, 10234276, 10540018, 10848471, 11154205, 11451808, 11734795, 11995312, 12225256, 12416974, 12563020, 12656495, 12692454, 12668933, 12587038, 12450690, 12265861, 12038882, 11775260, 11480538, 11161504, 10825153, 10476516, 10118688, 9754874, 9389105, 9024826, 8664166, 8309069]
59016H309069l46823l35587l21951l06849k91716k78102k66059k53811k39989
59007E668182k25316k11224j97998j85395j73935j64056j54902j45247j35040
58998D075069j24958j15395j06746r9657r3844q7875q1276p5598p2056o9433o5885
58987C082346o1622n7999n5026n1719m8144m5262m3127m0779l7538l3195k7730
58976B580205k2033j7889j5790j3874j0599p279n934n758m087l75L171M835N228
58963B489821N779P084Q847J0083R477O734L355R90l97j629k487k312j642j426
58949B532277j154M16L083N484P099Q434R538J0009J0038R899Q845O151K754J80
58935B613053j666l884o183o972n713l523j606l52L72J441M125Q092J0783J0687
$$ y = [8309069, 7962246, 7626659, 7304708, 6997859, 6706143, 6428041, 6161982, 5908171, 5668182, 5442866, 5231642, 5033644, 4848249, 4674314, 4510258, 4355356, 4210109, 4075069, 3950111, 3834716, 3727970, 3628313, 3534469, 3446594, 3365318, 3289720, 3217664, 3148231, 3082346, 3020724, 2962725, 2907699, 2855980, 2807836, 2762574, 2719447, 2678668, 2641130, 2607935, 2580205, 2558172, 2540283, 2524493, 2510619, 2500020, 2492741, 2486807, 2481049, 2476962, 2476587, 2479758, 2484593, 2489821, 2495600, 2502684, 2511531, 2521614, 2531091, 2537825, 2541180, 2542170, 2541773, 2540144, 2537657, 2535345, 2533703, 2532277, 2531123, 2531539, 2534622, 2540106, 2547205, 2555639, 2565177, 2575186, 2585224, 2595123, 2603968, 2610119, 2612873, 2613053, 2611387, 2607503, 2601320, 2594348, 2588635, 2585112, 2583506, 2583154, 2583526, 2584967, 2589092, 2597184, 2607967, 2618654]
58921B618654J0078J2145J6403J9682K1073K2795K6197K9962L2804L5233L7823
58910B882849M0084M1933M4285M7331N0028N1964N4009N6516N8601N9869O1239
58899C448708O3416O6039O8884P2307P5912P8367P9357Q0500Q3579Q8904R5786
58888D301759J03429J10914J17444J23207J29191J35989J43501J51679J60687
58879E477800J70456J81013J92830K05840K18779K30822K43194K57628K73897
58870G452259K90668L08029L27138L47984L69799L93293M19987M49415M79602
58861A0838174N10512N44432N82449O22922O64185P06508P50556P95794Q41219
58852A6856751Q85797R27326R62525R88918J005280J009667R98568R68253R15520
$$ y = [2618654, 2628732, 2640877, 2657280, 2676962, 2698035, 2720830, 2747027, 2776989, 2809793, 2845026, 2882849, 2922933, 2964866, 3009151, 3056482, 3106510, 3158474, 3212483, 3268999, 3327600, 3387469, 3448708, 3512124, 3578163, 3647047, 3719354, 3795266, 3873633, 3952990, 4033490, 4117069, 4205973, 4301759, 4405188, 4516102, 4633546, 4756753, 4885944, 5021933, 5165434, 5317113, 5477800, 5648256, 5829269, 6022099, 6227939, 6446718, 6677540, 6920734, 7178362, 7452259, 7742927, 8050956, 8378094, 8726078, 9095877, 9489170, 9909157, 10358572, 10838174, 11348686, 11893118, 12475567, 13098489, 13762674, 14469182, 15219738, 16015532, 16856751, 17742548, 18669874, 19632399, 20621317, 21626597, 22636264, 23634832, 24603085, 25518605]
58843B5518605Q37146P30933N98211M43910K73959R4163q8434k65585m30266n77681
58833B7134961p03859q05546q82237r36334r70291r85088r82039r64196r35134
58824A8970237q97751q54862q09338p62944p16226o69925o25347n83356n44434
58815A2506054n09349m77993m48058m17322l87103l60782l38782l17875k95931
58806H952859k74408k55271k38230k22168k06776j91568j75609j59420j45013
58797G084396j32969j21520j09377r7133q5070p2245n8870m6887l6834k6663j5079
58786F281749l273Q199K1220L6562N1204O2077P0574Q0672R3927J08773J23476
58775F935160J37461J50505J62792J75429J89529K05258K22468K41028K59920
$$ y = [25518605, 26355751, 27086684, 27684895, 28128805, 28402764, 28496927, 28408493, 28142908, 27712642, 27134961, 26431102, 25625556, 24743319, 23806985, 22836694, 21851606, 20869567, 19905371, 18970237, 18072486, 17217624, 16408286, 15645342, 14929116, 14259191, 13633844, 13050488, 12506054, 11996705, 11518712, 11070654, 10653332, 10266229, 9905447, 9566665, 9248790, 8952859, 8678451, 8423180, 8184950, 7962782, 7756006, 7564438, 7388829, 7229409, 7084396, 6951427, 6829907, 6720530, 6623397, 6538327, 6466082, 6407212, 6360325, 6323491, 6296828, 6281749, 6278476, 6286675, 6307895, 6344457, 6395661, 6457738, 6528312, 6608984, 6702911, 6811684, 6935160, 7072621, 7223126, 7385918, 7561347, 7750876, 7956134, 8178602, 8419630, 8679550]
58766H679550K77689K94807L13833L36116L60218L84720M10494M38749M69022
58757A1965198N00972N36084N75444O17536O60340P04080P49742P96194Q40783
58748A7946373Q81508R16615R43176R58042R59096R43857R08078Q47689P61322
58739B6065756O49556N13391L55607J82584K675j76638l48839n07274o46364p63322
58729B5327132q57145r26888r72550r96613j002901r94528r74138r44859r09377
58720A6748133q69028q25081p79696p34230o88261o41931n97668n57686n21428
58711A0533124m87567m56976m31062m08434l85970l62711l40271l19955l01553
58702G038625k84476k68002k50831k32512k14903k00238j88100j76135j63404
$$ y = [8679550, 8957239, 9252046, 9565879, 9901995, 10262213, 10646933, 11057427, 11496176, 11965198, 12466170, 13002254, 13577698, 14195234, 14855574, 15559654, 16309396, 17105590, 17946373, 18827881, 19744496, 20687672, 21645714, 22604810, 23548667, 24456745, 25304434, 26065756, 26715312, 27228703, 27584310, 27766894, 27769569, 27592931, 27244092, 26736818, 26090454, 25327132, 24469987, 23543099, 22570549, 21573936, 20571035, 19576507, 18602369, 17657510, 16748133, 15879105, 15054024, 14274328, 13540098, 12851837, 12209906, 11612238, 11054552, 10533124, 10045557, 9588581, 9157519, 8749085, 8363115, 8000404, 7660133, 7340178, 7038625, 6754149, 6486147, 6235316, 6002804, 5787901, 5587663, 5399563, 5223428, 5060024]
58693E060024j51053j39937j29495j19137j09160j00069r2056q5079p8666p2098
58683C983274o5498o0027n6228n3110m9796m6870m5074m3976m3156m3366m5089
58672C431084m7171m8321m8722m8890m8500m7766m8311n0705n2871n2960n2278
58661B884589n3072n4872n5616n5272n5526n6633n7285n7152n7023n6690n5041
58650B270407n2188m9408m7079m4600m2187m0733l9951l8426l5665l2699l0671
58639A816800k9885k9916k9678k8020k5283k3415k3448k3984k3345k1870k0604
58628A537352j9178j6806j4049j1703r198n952l022j383K3K317M188L872K375
58615A468836K039K845K882J765Q47O31N21P22J821K935K728J937K436M107N064
$$ y = [5060024, 4908971, 4769034, 4639539, 4520402, 4411242, 4311173, 4219117, 4134038, 4055372, 3983274, 3917776, 3857749, 3801521, 3748411, 3698615, 3651745, 3606671, 3562695, 3519539, 3476173, 3431084, 3383913, 3335592, 3286870, 3237980, 3189480, 3141714, 3093403, 3042698, 2989827, 2936867, 2884589, 2831517, 2776645, 2721029, 2665757, 2610231, 2553598, 2496313, 2439161, 2382138, 2325448, 2270407, 2218219, 2168811, 2121732, 2077132, 2034945, 1994212, 1954261, 1915835, 1880170, 1847471, 1816800, 1786915, 1756999, 1727321, 1699301, 1674018, 1650603, 1627155, 1603171, 1579826, 1557956, 1537352, 1518174, 1501368, 1487319, 1475616, 1466418, 1460466, 1457444, 1456061, 1456084, 1458401, 1462589, 1466461, 1468836, 1470875, 1473720, 1476602, 1478367, 1479214, 1479845, 1480366, 1481088, 1482909, 1485844, 1488572, 1490509, 1492945, 1497052, 1502116]
58600A502116M695M176M110L925L449L012K314J157Q18K556N287O974P838R835
58586A562262J3364J6855J9399K1569K3894K6552L0136L4628L8354M0114M1549
58575A868676M4887M9302N2371N4436N8186O4149O9937P4291P8757Q4753R1724
58564B591469R9014J07177J16560J26550J36874J47982J59943J72529J86354K02200
58554D046652K19367K36377K52811K68543K81804K90289K93717K92895K86677
58545F469132K72155K47520K12609J67472J13270N4095n027o1634j14788j61511
58535G193293j97994k24104k43042k56206k62029k60487k54935k48003k38850
58526E007643k26128k11095j96095j81778j67338j52120j36293j21225j09302
$$ y = [1502116, 1506811, 1510987, 1515097, 1519022, 1522471, 1525483, 1527797, 1528954, 1529772, 1532328, 1537615, 1544589, 1552427, 1562262, 1575626, 1592481, 1611880, 1633449, 1657343, 1683895, 1714031, 1748659, 1787013, 1827127, 1868676, 1913563, 1962865, 2015236, 2069672, 2127858, 2192007, 2261944, 2336235, 2414992, 2499745, 2591469, 2690483, 2797660, 2914220, 3040770, 3177644, 3325626, 3485569, 3658098, 3844452, 4046652, 4266019, 4502396, 4755207, 5023750, 5305554, 5595843, 5889560, 6182455, 6469132, 6741287, 6988807, 7201416, 7368888, 7482158, 7536253, 7531226, 7469592, 7354804, 7193293, 6995299, 6771195, 6528153, 6271947, 6009918, 5749431, 5494496, 5246493, 5007643, 4781515, 4570420, 4374325, 4192547, 4025209, 3873089, 3736796, 3615571, 3506269]
58517C506269j01559r5516q7452p6957o7091o0009n4914n0510m6820m3871m0814
58506B780756l7294l3873l0725k7570k4993k4128k5043k7216l1022l6668m2262
58495B439962m5632m7571n0494n4160n5825n4603n2569n1166m9462m6416m2241
58484A889823l7174l1454k6678k4446k3689k1948j9274j7858j7924j7444j5974
58473A635960j5292j5796j5790j5004j5246j6812j7655j7110j7111j8661k0230
58462A451253k0789k1275k2028k1864k0784k0443k0870j9955j7394j5731j5981
58451A234139j5651j2925r677q171p505n705l142j588j447j791j828j083O68K754
58437A167048M075M652N312N972O048O174P362Q894R534J0170J2273J4337J3394
$$ y = [3506269, 3404710, 3309194, 3221742, 3144785, 3077694, 3017685, 2962771, 2912261, 2865441, 2821570, 2780756, 2743462, 2709589, 2678864, 2651294, 2626301, 2602173, 2577130, 2549914, 2518892, 2482224, 2439962, 2394330, 2346759, 2296265, 2242105, 2186280, 2131677, 2079108, 2027942, 1978480, 1932064, 1889823, 1852649, 1821195, 1794517, 1770071, 1746382, 1724434, 1705160, 1687302, 1669378, 1651934, 1635960, 1620668, 1604872, 1589082, 1574078, 1558832, 1542020, 1524365, 1507255, 1490144, 1471483, 1451253, 1430464, 1409189, 1387161, 1365297, 1344513, 1324070, 1303200, 1283245, 1265851, 1250120, 1234139, 1218488, 1205563, 1195886, 1187715, 1180210, 1174505, 1171363, 1169775, 1168328, 1166537, 1164709, 1163626, 1164294, 1167048, 1171123, 1175775, 1181087, 1187059, 1193107, 1199281, 1206643, 1215537, 1225071, 1235241, 1247514, 1261851, 1275245]
58424A275245R816O876N715M679L569M066N532N020K451J186K162K089r72m590
58410A322844o480p789r717j0848j0322j0127j1781j3850j4821j5320j5615j4150
58398A182024j0611p444o394o393o416p115q132p346m701l241m323n181l412n56
58384A100759R07J058R91P30O14J890M332O120P220R482J2514J3432J1921J1060
58370A183030J1541R926M846J72q12m2m58j411j316j006j186j36K941N600O034
58355A217723N908O792P423P193Q369J1837J4438J3769J1957J1610J1624J0253
58343A338896Q784Q739Q671O888M318J901j513n936q603q329p886r253j0392r493
58329A316792q315q229p211m082j599j863k704j975j252j899j803K91J591J79
$$ y = [1275245, 1285061, 1291937, 1297652, 1302331, 1305900, 1309966, 1315498, 1320518, 1322969, 1324155, 1326317, 1328406, 1327434, 1322844, 1316364, 1308575, 1298858, 1288010, 1277688, 1267561, 1255780, 1241930, 1227109, 1211789, 1196174, 1182024, 1171413, 1163969, 1157575, 1151182, 1144766, 1137651, 1129519, 1122173, 1117472, 1114231, 1109908, 1104727, 1101315, 1100759, 1101666, 1102724, 1103715, 1104445, 1105059, 1106949, 1111281, 1117401, 1124621, 1134103, 1146617, 1160049, 1171970, 1183030, 1194571, 1204497, 1209343, 1209515, 1208703, 1208661, 1208203, 1206792, 1205476, 1204470, 1203284, 1203148, 1206089, 1211689, 1217723, 1223631, 1230423, 1237846, 1245039, 1253408, 1265245, 1279683, 1293452, 1305409, 1317019, 1328643, 1338896, 1347680, 1356419, 1365090, 1371978, 1376296, 1378197, 1376684, 1370748, 1362145, 1353816, 1345930, 1336677, 1326285, 1316792, 1308477, 1300248, 1293037, 1288955, 1287356, 1285493, 1282789, 1280814, 1279562, 1277663, 1275860, 1276151, 1277742, 1277921]
58315A277921j177L4J781K092L285P259J0948J1219J0204J1209J3180J3738J3853
58302A375546J5069J5906J5186J4964J6161J5785J2596J0743J3198J6499J6835
58291A538488J6299J7950J9640J8397J6164J5580J4633J1147P919P627P438M559
58279A695841K144L505N457M065K056L644O754P553P920J1068J4365J4279J3960
58266A792611J7805K2690K2995K0609K1434K5237K7363K7599K8962L0424K9025
58255B066754K6754K7533K9829K9778K8854L0867L4247L4921L3905L4439L4929
58244B412810L2372K9470L0312L2576L1911L0285L1633L3360L1103K7992K9734
58233B753558L4224L5665L5395L8603M3727M5439M5226M8613N4543N7774N9185
$$ y = [1277921, 1276744, 1276778, 1278559, 1280651, 1283936, 1291195, 1302143, 1313362, 1323566, 1334775, 1347955, 1361693, 1375546, 1390615, 1406521, 1421707, 1436671, 1452832, 1468617, 1481213, 1491956, 1505154, 1521653, 1538488, 1554787, 1572737, 1592377, 1610774, 1626938, 1642518, 1657151, 1668298, 1676217, 1683844, 1691282, 1695841, 1697985, 1701490, 1706947, 1711012, 1713068, 1716712, 1723466, 1731019, 1738939, 1750007, 1764372, 1778651, 1792611, 1810416, 1833106, 1856101, 1876710, 1898144, 1923381, 1950744, 1978343, 2007305, 2037729, 2066754, 2093508, 2121041, 2150870, 2180648, 2209502, 2240369, 2274616, 2309537, 2343442, 2377881, 2412810, 2445182, 2474652, 2504964, 2537540, 2569451, 2599736, 2631369, 2664729, 2695832, 2723824, 2753558, 2787782, 2823447, 2858842, 2897445, 2941172, 2986611, 3031837, 3080450, 3134993, 3192767, 3251952]
58222C251952O3497O9357P2011P3136P7707Q3920Q6645Q7906R3157J00265J03225
58211D162778J03696J07569J13324J15437J15915J20300J25611J25155J22020
58202E211805J24559J31516J35350J37408J45332J57756J66494J72323J83862
58193F566405K01902K19298K35280K55371K78310K97340L13243L32081L52112
58184I051342L67320L81040M00828M23302M40283M56283M82358N16514N48815
58175A3068085N82021O26754O79411P26277P67313Q14077Q66445R14729R63186
58166B0008298J027070J106590J187678J267562J354477J443462J520095J588570
58158C0503802J668356J762633J858228J956284K072233K205771K343509K491385
$$ y = [3251952, 3315449, 3384806, 3456817, 3529953, 3607660, 3691580, 3778225, 3866131, 3959288, 4059553, 4162778, 4266474, 4374043, 4487367, 4602804, 4718719, 4839019, 4964630, 5089785, 5211805, 5336364, 5467880, 5603230, 5740638, 5885970, 6043726, 6210220, 6382543, 6566405, 6768307, 6987605, 7222885, 7478256, 7756566, 8053906, 8367149, 8699230, 9051342, 9418662, 9799702, 10200530, 10623832, 11064115, 11520398, 12002756, 12519270, 13068085, 13650106, 14276860, 14956271, 15682548, 16449861, 17263938, 18130383, 19045112, 20008298, 21035368, 22141958, 23329636, 24597198, 25951675, 27395137, 28915232, 30503802, 32172158, 33934791, 35793019, 37749303, 39821536, 42027307, 44370816, 46862201]
58150D6862201K669354K873713L082386L298351L547905L836026M148754M501461
58142G4820151M935402N464070O077933O806594P713990Q822206J0103086J1550494
58134A36293926J3186051J4991428J6936763J9100685K1664321K4773273K8506498
58127B75452945L2867018L7358737M0310365L9043866L1519891J8251115K463025
58120D77266962j1865730k2247961k8349977l1115620l1688351l0949597k9481213
58113B91568513k7599094k5441867k3120345k0774413j8502737j6329770j4274184
58106A45526103j2387287j0700997r199248p869388o729890n777587m953954m198228
58098H3709524l498891k860780k253458j628572r62433k40300N73421J467361
$$ y = [46862201, 49531555, 52405268, 55487654, 58786005, 62333910, 66169936, 70318690, 74820151, 79755553, 85219623, 91297556, 98104150, 105818140, 114640346, 124743432, 136293926, 149479977, 164471405, 181408168, 200508853, 222173174, 246946447, 275452945, 308319963, 345678700, 385989065, 425032931, 456552822, 474803937, 477266962, 465401232, 443153271, 414803294, 383687674, 351999323, 321049726, 291568513, 263969419, 238527552, 215407207, 194632794, 176130057, 159800287, 145526103, 133138816, 122437819, 113238571, 105369183, 98639293, 92861706, 87907752, 83709524, 80210633, 77349853, 75096395, 73467823, 72505390, 72265090, 72838511, 74305872]
58090G4305872K246578K521138J938796N00466j358135l037159m153390m686506
58082F8277660m824084m743539m541658m276350l988137l687229l369041l047437
58074C5800185k747603k473754k212812j965560j747297j561128j396817j254270
58066B0440944j142985j058128r80881r04343q38226p86478p40358o95438o56037
58057A2638070o20402n79879n35595m99026m73175m49046m22864m00947l85071
58048H272065l68589l49945l35324l25176l12275k95833k83430k76208k65809
58039E459476k49300k33773k22778k10998j95984j82911j73893j64024j51701
58030C674114j41960j36197j29174j19308j11607j07504j02011r3879q8368q7025
$$ y = [74305872, 76552450, 79073588, 81012384, 81512850, 80154715, 77117556, 72964166, 68277660, 63453576, 58710037, 54168379, 49892029, 45903892, 42216663, 38847622, 35800185, 33052582, 30578828, 28366016, 26400456, 24653159, 23092031, 21695214, 20440944, 19297959, 18239831, 17258950, 16354607, 15516381, 14729903, 13989545, 13294107, 12638070, 12017668, 11437789, 10902194, 10403168, 9929993, 9480947, 9058083, 8657136, 8272065, 7903476, 7553531, 7218207, 6893031, 6580756, 6284923, 6001493, 5725285, 5459476, 5210176, 4976403, 4753625, 4542627, 4346643, 4163732, 3989839, 3825815, 3674114, 3532154, 3395957, 3266783, 3147475, 3035868, 2928364, 2826353, 2732474, 2644106, 2557081]
58020B557081q4714p9761p7118p8217p7441p2066o6744o4610o2588n8647n5505
58009A779670n4068n1000m5485m0877l7752l2883k6711k3789k4342k3490k0151
57998A399122j8396j8884j7690j4921j5294j8670j9241j5960j4338j5995j6144
57987A213589j3726j4037j8185j9919j6512j3295j3422j2562q253n365p234r715
57975A061364r137q268r391r048n002j340j466k488j507j051l300n017l176j48
57961A001025J159J908L047K159j417l737k558j135k159l421l059l323n358o037
57947I77094l836k271l698n271m758m629o435o991m336j882k456l609k996k845
57933I21081m806n991m573l850o179q264p185n748o897q106o592m963o190p633
$$ y = [2557081, 2472367, 2392606, 2315488, 2237271, 2159830, 2087764, 2021020, 1956410, 1893822, 1835175, 1779670, 1725602, 1674602, 1629117, 1588240, 1550488, 1517605, 1490894, 1467105, 1442763, 1419273, 1399122, 1380726, 1361842, 1344152, 1329231, 1313937, 1295267, 1276026, 1260066, 1245728, 1229733, 1213589, 1199863, 1185826, 1167641, 1147722, 1131210, 1117915, 1104493, 1091931, 1083678, 1078313, 1071079, 1061364, 1052227, 1043959, 1034568, 1025520, 1020518, 1019178, 1017712, 1015224, 1013717, 1012666, 1009366, 1004349, 1001173, 1001025, 1002184, 1004092, 1007139, 1009298, 1007881, 1004144, 1001586, 1000451, 998292, 994871, 991812, 988489, 983131, 977094, 973258, 970987, 967289, 962018, 957260, 952631, 946196, 939205, 934869, 932987, 930531, 926922, 923926, 921081, 916275, 910284, 905711, 901861, 895682, 887418, 880233, 874485, 867588, 859482, 852890, 847927, 841737, 834104]
57919H34104n707k267p70j06K170M243L368J464J929L730L849K683K153J313j208
57904H50948l161j964M30O47o55q68m94j543l203l620l902o075q983j0208j0129
57889G97220j0298r980p939n560m505l586j362O16P26P97K877N025M351J947P65
57874G71094P87K00p22r16j696m688q370j0305j1120j2729j4532j4869j4342j4197
57860F63595j3381j0751q202p895q305o712l816k173j748p61O41J280K040M359
57846F08171O951P483O499O387P543Q529Q872Q920Q251O830O195O982P146N243
57832G10002L210L005K927O35k397l202k150j748k368k879l955o810r846j0313
57818F74111q473o905o611o789p272q104p935n827l433k594k188k19K566M262
$$ y = [834104, 828397, 826130, 825360, 825254, 827424, 831667, 835035, 836499, 838428, 842158, 846007, 848690, 850843, 852156, 850948, 847787, 845823, 846253, 846900, 846245, 845377, 844883, 843340, 840137, 836517, 832615, 826540, 817557, 807349, 797220, 786922, 776942, 769003, 763443, 758938, 755352, 753990, 754606, 755332, 756129, 759006, 764031, 768382, 770329, 771094, 771881, 772081, 771359, 770443, 768747, 764059, 755689, 745384, 734264, 721535, 707003, 692134, 677792, 663595, 650214, 639463, 631261, 623366, 615061, 608349, 604533, 602360, 600612, 599851, 600492, 601772, 603812, 608171, 615122, 622605, 629104, 635491, 643034, 651563, 660435, 669355, 677606, 684436, 690631, 697613, 704759, 710002, 713212, 716217, 719144, 719779, 717382, 714180, 712030, 710282, 707914, 705035, 701080, 694270, 684424, 674111, 665638, 658733, 652122, 645333, 638061, 629957, 622022, 616195, 612762, 610168, 607980, 607761, 610327, 614589]
57804F14589N225O807Q337Q532Q315Q900Q945P003N041N626P275O553L611J585
57790G06344J381J082j96j544k923n059p081p436o714o619o936o398n556n750
57776F46595o237n509m423m746n649n117l824m122n838o686o245o135o746p085
57762E68233p379q642j0074j0026r089r193j0173j0207r070q058p348o318n691
57749D56965o392p206o572n600o167p153o052l135n53J573M252O043M697J795
57735D26495J397M229P187Q458R069R447Q558O793N899N664M436L012M003O931
57721E11578P982N570K413J157J331J617J790J283j085m717p243p803p930q536
57707D97407q716q061p399o653m649j685K33L32n0K3P0r1N2K67J12P72L752P844
$$ y = [614589, 619814, 626621, 634958, 643490, 651805, 660705, 669650, 676653, 681694, 687320, 694595, 701148, 704759, 706344, 707725, 708807, 708611, 707067, 704144, 699085, 692004, 684568, 677854, 671235, 664299, 657901, 652345, 646595, 640358, 634849, 630426, 625680, 620031, 614914, 611090, 606968, 601130, 594444, 588199, 582064, 575318, 568233, 560854, 552212, 542138, 532112, 523023, 513830, 503657, 493450, 484380, 476322, 468974, 462656, 456965, 450573, 443367, 436795, 431195, 425028, 417875, 411823, 408688, 408135, 409708, 413960, 420003, 424700, 426495, 427892, 432121, 439308, 447766, 456835, 466282, 474840, 481633, 487532, 493196, 497632, 500644, 504647, 511578, 519560, 525130, 527543, 528700, 530031, 531648, 533438, 534721, 533636, 528919, 521676, 513873, 505943, 497407, 488691, 480630, 473231, 466578, 461929, 460244, 460477, 460809, 460759, 460782, 460852, 460761, 460813, 461080, 461192, 461964, 465716, 473560]
57689D73560J0192J0205R669R247Q091O742O997Q534R033P979P205P341P047O261
57675E88103O726Q563R765R852J0678J2638J3487J2216J0959J1582J3143J4220
57663G21932J5133J6457J7713J8838K0838K3865K6583K8325K9780L1028L1039
57652I81531K9852K9166L0105L2272L5091L8127M0269M0968M1984M5242M9465
57641A394072N1935N3098N5844O0587O5065O9029P4650Q1648Q6658Q8787R1514
57630B172887R7427J05055J12802J21962J33528J45665J57009J69399J84812K02183
57620C602729K19487K36319K52294K65525K74890K81208K84007K79540K64438
57611E960437K39245K06503J67764J24843Q1669M1866N285l1482p2144j18668
$$ y = [473560, 483752, 493957, 503626, 512873, 520964, 527706, 534703, 543237, 552270, 560249, 567454, 574795, 581842, 588103, 594829, 603392, 613157, 623009, 633687, 646325, 659812, 672028, 682987, 694569, 707712, 721932, 737065, 753522, 771235, 790073, 810911, 834776, 861359, 889684, 919464, 950492, 981531, 1011383, 1040549, 1070654, 1102926, 1138017, 1176144, 1216413, 1257381, 1299365, 1344607, 1394072, 1446007, 1499105, 1554949, 1615536, 1680601, 1749630, 1824280, 1905928, 1992586, 2081373, 2172887, 2270314, 2375369, 2488171, 2610133, 2743661, 2889326, 3046335, 3215734, 3400546, 3602729, 3822216, 4058535, 4310829, 4576354, 4851244, 5132452, 5416459, 5695999, 5960437, 6199682, 6406185, 6573949, 6698792, 6780461, 6822327, 6827612, 6796130, 6723986, 6605318]
57601F605318j69598k18736k57717k81753k91719k90456k79956k62988k43687
57592D308708k24212k03336j80458j58353j39791j24039j09064r4836q2039o9835
57582B922745n7497m6408l7882l0628k2550j3590m855L406J1199J8107K4984L4145
57570B801176M5866N6968O5151P2578Q2547R4808J06899J18373J30566J43442
57560C718374J55702J67210J78689J89469J97539K01294J99577J91016J74915
57551E373785J51781J21647Q3464L7903j0794n7729j00745j39216j71374j95246
57541E093476k11112k20686k24888k24123k19654k12704k03322j91860j80200
57532C204927j69587j58746j46279j33646j23388j15556j08193j00484r3146q6360
$$ y = [6605318, 6435720, 6216984, 5959267, 5677514, 5385795, 5095339, 4815383, 4552395, 4308708, 4084496, 3881160, 3700702, 3542349, 3402558, 3278519, 3169455, 3074619, 2992580, 2922745, 2865248, 2818840, 2780958, 2750330, 2727780, 2714190, 2709335, 2712741, 2723940, 2742047, 2767031, 2801176, 2847042, 2904010, 2969161, 3041739, 3124286, 3219094, 3325993, 3444366, 3574932, 3718374, 3874076, 4041286, 4219975, 4409444, 4606983, 4808277, 5007854, 5198870, 5373785, 5525566, 5647213, 5730677, 5768580, 5757786, 5700057, 5599312, 5460096, 5288722, 5093476, 4882364, 4661678, 4436790, 4212667, 3993013, 3780309, 3576987, 3385127, 3204927, 3035340, 2876594, 2730315, 2596669, 2473281, 2357725, 2249532, 2149048, 2055902, 1969542]
57522A969542p9537p2695o6312o0354n4769n0135m6495m2670l8250l4814l3498
57511A390013l2706l0196k6221k2555j9556j6459j3547j1757j0619q700n810l131
57499A188756j555j109j256o19K446P577J1884J3215J2810J3178J4870J6987J9561
57486A296745K3080K6764K9411L1287L3366L5597L7639M0334M4564M9526N3914
57475A702227N8083O3238O9313P5406Q1538Q8329R5727J03564J12397J22174J31081
57464B703077J37453J41924J46061J49646J50847J48157J40608J27076J07036
57455C951885Q1354N1243J7566j7806n1467q0726j05089j24490j38004j45683
57445C438783j49542j50916j48823j42765j34894j27166j18609j07874r6408q6400
$$ y = [1969542, 1890005, 1817310, 1750998, 1690644, 1635875, 1585740, 1539245, 1496575, 1458325, 1423511, 1390013, 1357307, 1327111, 1300890, 1278335, 1258779, 1242320, 1228773, 1217016, 1206397, 1197697, 1191887, 1188756, 1187201, 1186092, 1184836, 1184217, 1186663, 1194240, 1206124, 1219339, 1232149, 1245327, 1260197, 1277184, 1296745, 1319825, 1346589, 1376000, 1407287, 1440653, 1476250, 1513889, 1554223, 1598787, 1648313, 1702227, 1760310, 1823548, 1892861, 1968267, 2049805, 2138134, 2233861, 2337425, 2449822, 2571996, 2703077, 2840530, 2982454, 3128515, 3278161, 3429008, 3577165, 3717773, 3844849, 3951885, 4033239, 4084482, 4102048, 4084242, 4032775, 3952049, 3846960, 3722470, 3584466, 3438783, 3289241, 3138325, 2989502, 2846737, 2711843, 2584677, 2466068, 2358194, 2261786, 2175386]
57435B175386p7594o8949o1511n6311n1270m3742l4856k7843k3134j8537j3334
57424A698305q672m410R18P199J2780J7262K1630K6040L0032L4374M0105M6441
57412A922004N2154N8203O6195P5258Q3340R0646R8620J06525J12596J17844J24838
57401B908223J32830J37742J37019J31250J20988J05438Q4582N9420K9948m014
57391C843426l9901p3523j03049j28767j49279j61922j67285j69277j69849j67284
57381B513290j60653j52218j44011j35457j25948j16803j08929j01302r3237q5757
57371A288975p9396p3082o6449o0791n6451n1774m5984m0711l7233l4598l1909
57360G10597l0116k9936k9993k8843k7019k5600k4269k2212j9503j6539j3572
$$ y = [2175386, 2097792, 2028843, 1967332, 1911021, 1859751, 1816009, 1781153, 1753310, 1730176, 1711639, 1698305, 1689633, 1685223, 1686141, 1693340, 1706120, 1723382, 1745012, 1771052, 1801084, 1835458, 1875563, 1922004, 1974158, 2032361, 2098556, 2173814, 2257154, 2347800, 2446420, 2552945, 2665541, 2783385, 2908223, 3041053, 3178795, 3315814, 3447064, 3568052, 3673490, 3758072, 3817492, 3847440, 3843426, 3803525, 3730002, 3626953, 3498186, 3348907, 3186985, 3019700, 2850423, 2680574, 2513290, 2352637, 2200419, 2056408, 1920951, 1795003, 1678200, 1569271, 1467969, 1374732, 1288975, 1209579, 1136497, 1070048, 1009257, 952806, 901032, 855048, 814337, 777104, 742506, 710597, 680481, 650545, 620552, 591709, 564690, 539090, 514821, 492609, 473106, 456567, 442995]
57349D42995j1661j2256j4834j6697j6243j4799j4170j4178j3794j2945j1903
57338B89515j0413q618p512p322o823n341m046m109m798m622l337j811q25q19
57324B19119k015m036n917o917o778n464l531k424l026m203m206l138k363k059
57310A63042j437r96k002l818m286l163k471l019l220k175j271j529j841j163
57296A30651m02o51j304j330r44q24r31j020j129r05J64J540K182K675M717Q009
57280A40498R764Q323N355L394K990L314L936M705N219N394N486N055L299R68
57266B07700K50K050M845O910Q287R797J1521J2986J3768J3548J2583J2201J3616
57253C30062J6284J8760K0709K2508K3526K2970K1920K2152K3336K3879K4070
$$ y = [442995, 431334, 419078, 404244, 387547, 371304, 356505, 342335, 328157, 314363, 301418, 289515, 279102, 270484, 262972, 255650, 248827, 243486, 239440, 235331, 230533, 225911, 222574, 220763, 219938, 219119, 217104, 213068, 207151, 200234, 193456, 187992, 184461, 182037, 179011, 174808, 170602, 167464, 165101, 163042, 161605, 160609, 158607, 154789, 150503, 147340, 144869, 141850, 138630, 136455, 135184, 133655, 131814, 130651, 130249, 129598, 128294, 126964, 126020, 125196, 124265, 123245, 122116, 121211, 121375, 122915, 125097, 127772, 132489, 140498, 150262, 158585, 163940, 167334, 170324, 173638, 177574, 182279, 187498, 192892, 198378, 203433, 206732, 207700, 207950, 210000, 214845, 221755, 230042, 239839, 251360, 264346, 278114, 291662, 304245, 316446, 330062, 346346, 365106, 385815, 408323, 431849, 454819, 476739, 498891, 522227, 546106, 570176]
57242E70176K5415K7307K7661K6915K7777L0657L3047L4036L5651L8696M1147
57231I18485M2246M4343M8615N2436N3319N2467N2059N1892N1101N0574N0935
57220A468472N0497M7853M4593M2853M1849L9357L5182L0850K6972K2943J8259
57209A869680J2605N781j205o364r263j1704j4760j6881j6246j3202r037m224
57197A785180P70M688P002Q561R534Q669N766K824J389O97k32o91K48K471O365
57182A843241J3369K3473L4337M4249N3823O3553P2214P9273Q6028R2418R5263
57171B501241R2055Q4340P5303O6053N6350M6804L8153L0205K3570K0511K2257
57160C056842K7356L4452M4416N7602P1423Q3060R2675J01635J09413J14624J17448
$$ y = [570176, 595591, 622898, 650559, 677474, 705251, 735908, 768955, 802991, 838642, 877338, 918485, 960731, 1005074, 1053689, 1106125, 1159444, 1211911, 1263970, 1315862, 1366963, 1417537, 1468472, 1518969, 1566822, 1611415, 1654268, 1696117, 1735474, 1770656, 1801506, 1828478, 1851421, 1869680, 1882285, 1888066, 1886861, 1880497, 1871234, 1859530, 1844770, 1827889, 1811643, 1798441, 1789404, 1785180, 1785950, 1790638, 1797640, 1806201, 1815735, 1824404, 1830170, 1832994, 1834383, 1835080, 1834848, 1834157, 1834405, 1836876, 1843241, 1856610, 1880083, 1914420, 1958669, 2012492, 2076045, 2148259, 2227532, 2313560, 2405978, 2501241, 2593296, 2677636, 2752939, 2818992, 2875342, 2922146, 2960299, 2990504, 3014074, 3034585, 3056842, 3084198, 3118650, 3163066, 3220668, 3292091, 3375151, 3467826, 3569461, 3678874, 3793498, 3910946]
57149C910946J18732J18271J16055J13501J11391J08115J02039R4135Q6322P8833
57139D958340P1146O4038N8874N5783N3971N2637N0880M8401M6889M8430N1890
57128E561279N3591N2331N0672N0226M9213M6382M3669M2774M2345M0878L9466
57117F072826L9335L9497L9224M0118M3406M7750N1533N4648N6333N4423M8545
57106F587638M0862L2166K0944Q064j982o878r494j2827j6134j8562k1874k6405
57094F575518k8787k7058k3964k1910j8870j2746n492O20O669J3433J8309J9358
57082F495080J8210J5605Q485n027k2478m2259o6730r6581j27486j56128j84091
57071E836600k12057k36537k56664k77822l03780l31758l59937l92586m32271
$$ y = [3910946, 4029678, 4147949, 4264004, 4377505, 4488896, 4597011, 4699050, 4793185, 4879507, 4958340, 5029486, 5093524, 5152398, 5208181, 5262152, 5314789, 5365669, 5414070, 5460959, 5509389, 5561279, 5614870, 5667201, 5717873, 5768099, 5817312, 5863694, 5907363, 5950137, 5992482, 6033360, 6072826, 6112161, 6151658, 6190882, 6231000, 6274406, 6322156, 6373689, 6428337, 6484670, 6539093, 6587638, 6628500, 6660666, 6681610, 6689674, 6687692, 6680814, 6671320, 6658493, 6642359, 6623797, 6601923, 6575518, 6546731, 6519673, 6495709, 6473799, 6454929, 6442183, 6436691, 6437311, 6443980, 6457413, 6475722, 6495080, 6513290, 6528895, 6537380, 6532353, 6509875, 6467616, 6400886, 6304305, 6176819, 6020691, 5836600, 5624543, 5388006, 5131342, 4853520, 4549740, 4217982, 3858045, 3465459, 3033188]
57062C033188m74520n16269n62301o17145A84245e62257q27715r27136j039420
57053c356528j159023j289538j435286j593127j761702j949141k162047k396700
57045a7103092k651182k935318l257644l614033m001028m428193m904945n429024
57037d8324459o001558o637125p342344q101212q898846r739228j0618851j1506714
57029a17170337j2375013j3220497j4023158j4712542j5195589j5340712j4865150
57022b16902998j3365605j0719060p539295n029832m127854m724782n771151o119365
57014b74299942n233672l228944m88682K638252N904684R127209J2142590J4771976
57006b38666529J6824585J8159813J8746189J8653591J8006594J6956165J5664099
$$ y = [3033188, 2558668, 2042399, 1480098, 862953, 184245, -562257, -1389972, -2317108, -3356528, -4515551, -5805089, -7240375, -8833502, -10595204, -12544345, -14706392, -17103092, -19754274, -22689592, -25947236, -29561269, -33562297, -37990490, -42895435, -48324459, -54326017, -60963142, -68305486, -76406698, -85305544, -95044772, -105663623, -117170337, -129545350, -142765847, -156789005, -171501547, -186697136, -202037848, -216902998, -230268603, -240987663, -248526958, -253556790, -257684644, -262409426, -268180577, -274299942, -279533614, -282762558, -283251240, -280612988, -274708304, -265581095, -253438505, -238666529, -221841944, -203682131, -184935942, -166282351, -148275757, -131319592, -115655493]
56999a15655493J4271446J2871267J1516774J0243921R074069Q008696P041675
56992d2627645O174376N409542M738795M148791L633782L191700K813958K489067
56984a0027634K210680J972858J763384J571479a111776A34513J116382J002369
56976B253264R03692Q21259P49864O82345O18062N59848N05971M52383L99986
56967G946674L52479L09524K68462K30199J96872J65988J33363J00505P3352N4614
56957I832032M2071L3128K6490K0356J2963M102o492k0400l7647n5387p2280r1257
56945I687679j14850j41058j67212j94192k22564k47830k64148k70179k67068
56936G798578k54186k33130k14295k12690k35546k76729l22780l61464l85930
$$ y = [-115655493, -101384047, -88512780, -76996006, -66752085, -57678016, -49669320, -42627645, -36453269, -31043727, -26304932, -22156141, -18522359, -15330659, -12516701, -10027634, -7816954, -5844096, -4080712, -2509233, -1111776, 134513, 1250895, 2253264, 3156956, 3978215, 4728079, 5410424, 6028486, 6588334, 7094305, 7546688, 7946674, 8299153, 8608677, 8877139, 9107338, 9304210, 9470198, 9603561, 9704066, 9777418, 9832032, 9874103, 9907231, 9933721, 9954077, 9967040, 9971142, 9964650, 9944250, 9906603, 9851216, 9778936, 9687679, 9572829, 9431771, 9264559, 9070367, 8847803, 8599973, 8335825, 8065646, 7798578, 7544392, 7311262, 7096967, 6884277, 6648731, 6372002, 6049222, 5687758, 5301828]
56927E301828l95407l93440l83716l67423l45319l20270k95484k71778k48843
56918B280148k27669k09252j92427j75490j58796j43487j29083j14586j00587
56909H28771q8010p6031o3450n0900l9669k9658k0290j2070n248J378Q459J4487
56897D67769J8145K0443K2422K2579J8959J2192M159m615j3741k0880k3859k3809
56885D99764k3487k3435k2269j9862j7484j5226j1901p388k992N00L518O563R808
56872C76109J3542J7780K1626K3809K3428J9720J2284K321p507j5230k0561k3465
56860D43856k3601k1979k1078k1931k2818k2077k0451j9271j8186j6255j3652
56849B22557j0861p766m974m144n510o834o352n027m403m156l445k770k617k108
$$ y = [5301828, 4906421, 4512981, 4129265, 3761842, 3416523, 3096253, 2800769, 2528991, 2280148, 2052479, 1843227, 1650800, 1475310, 1316514, 1173027, 1043944, 929358, 828771, 740761, 664730, 601280, 550380, 510711, 481053, 460763, 448693, 443445, 444823, 453282, 467769, 485914, 506357, 528779, 551358, 570317, 582509, 586668, 582053, 568312, 547432, 523573, 499764, 476277, 452842, 430573, 410711, 393227, 378001, 366100, 358712, 355720, 356220, 359738, 366301, 376109, 389651, 407431, 429057, 452866, 476294, 496014, 508298, 510619, 503112, 487882, 467321, 443856, 420255, 398276, 377198, 355267, 332449, 310372, 289921, 270650, 252464, 236209, 222557, 211696, 203930, 198956, 194812, 189302, 182468, 176116, 171089, 166686, 162530, 159085, 156315, 153698, 151590]
56835A51590p30M67J029K311M693N975M982M347O895J1281J4292J5706J7419J9121
56821B59378J8489J5222J1616R313Q060P557P991Q870R560J0653J2817J4841J5152
56808D09519J4717J6022J9394K2736K4816K6533K8792L1278L3720L6448L9152
56797G03127M0440L8916L3797K4796J2828O67q592j3851j5974j5940j4226j1496
56785G74492q457n166j327L053Q092J4231K1097K7260L2240L7574M4570N2324
56773I99983N9450O6086P1679P2069O1932M0565J3273j2940l3488m6628n2545
56762A239436n3075n0725m7093m2678l7799l2644k6771j9887j2912p000j664M712
56750I11900J2581K0717K8102L5195M2740M9650N2177M5531K7739K678k1697l9205
$$ y = [151590, 150860, 151327, 152356, 154667, 159360, 165335, 170317, 174664, 181559, 192840, 207132, 222838, 240257, 259378, 277867, 293089, 304705, 314018, 322078, 329635, 337626, 346496, 356056, 366709, 379526, 394367, 409519, 424236, 440258, 459652, 482388, 507204, 533737, 562529, 593807, 627527, 663975, 703127, 743567, 782483, 816280, 841076, 853904, 854571, 845979, 832128, 816154, 800214, 785988, 774492, 766035, 760869, 759542, 762595, 770687, 784918, 806015, 833275, 865515, 903089, 947659, 999983, 1059433, 1125519, 1197198, 1269267, 1331199, 1371764, 1385037, 1372097, 1338609, 1291981, 1239436, 1186361, 1135636, 1088543, 1045865, 1008066, 975422, 948651, 928764, 915852, 908852, 907188, 911900, 924481, 945198, 973300, 1008495, 1051235, 1100885, 1153062, 1198593, 1226332, 1229010, 1207313, 1168108]
56738A168108m9016n3416n4097n1993m8698m5541m1887l6412k9626k3333j8166
56727G15923j3316q249l036K518Q474J3853J7738K0720K3480K4384K0530J1301
56715H34320o36j1930k0781k6773l0169l1688l1937l0873k8568k5995k4050k2242
56703E48678j9537j6166j3469j2313j2603j3726j4473j3356j0260p085n485m896
56691D05309m084l436l793m255l462k247k453l520l094j034M9j071k286j584j32
56676C68907k26j717k493j753r90j700l426m547m397l929m231m980m980m015l128
56661C22395l031l280l437l757m123l584j981p62q42r96J62J664J630M48L38J924
56645C02768L280K719R47j18L64J507J751M67j156j212N02J918J394j4j09J363
$$ y = [1168108, 1119092, 1065676, 1011579, 959586, 910888, 865347, 823460, 787048, 757422, 734089, 715923, 702607, 694358, 691322, 693840, 702314, 716167, 733905, 754625, 778105, 802489, 823019, 834320, 833684, 821754, 800973, 774200, 744031, 712343, 680406, 649533, 620965, 594970, 570920, 548678, 529141, 512975, 499506, 487193, 474590, 460864, 446391, 433035, 422775, 415690, 410205, 405309, 401225, 397789, 393996, 389741, 386279, 384032, 381579, 378059, 374965, 373931, 373980, 372909, 370623, 369039, 368907, 368681, 366964, 364471, 362718, 361728, 360028, 356602, 352055, 347658, 343729, 339498, 334518, 329538, 325523, 322395, 319364, 316084, 312647, 308890, 304767, 301183, 299202, 298440, 297598, 296602, 296764, 298428, 300058, 300506, 300844, 302768, 306048, 308767, 309714, 309596, 309960, 311467, 313218, 313685, 312529, 311317, 311819, 313737, 315131, 315117, 315008, 316371]
56629C16371K529J941kj942k810k382j382q02o27J29J644K671K309J157j23j824
56613C16857l526l230oL821N148L845K133J254R05R92J634J803K71k301m010m149
56597C21441l351j940o5J157P59k15M7J405K323K640L416M358L953K310J375J915
56581C41528K566K339J944J931J472rj545j915j250p11j309l163n131n504m003
56566C27240k537k779l730l337j770r83j495j826j068J50J329K685L800L729K709
56551C22117J939J499L84j257j959j321n45j43Q14K557L718L336K156J131K47
56536C34673n21p10m32n70j206j313n31K11M31R94K459L918M192L257J807M59
56520C47118k33O0Q17J155J034J124J554J985K734M358O121O474N274M031L776
$$ y = [316371, 318900, 320841, 320839, 318897, 316087, 313705, 312323, 311521, 310894, 311023, 312667, 315338, 317647, 318804, 318681, 316857, 313331, 310101, 310095, 313916, 319064, 322909, 325042, 326296, 327201, 328193, 329827, 331630, 331901, 329600, 325590, 321441, 318090, 316150, 316085, 317242, 318001, 317786, 317833, 319238, 321561, 324201, 327617, 331975, 335928, 338238, 339613, 341528, 344094, 346433, 348377, 350308, 351780, 351771, 350226, 348311, 347061, 346350, 345041, 341878, 336747, 331243, 327240, 324703, 321924, 318194, 314857, 313087, 312104, 310609, 308783, 307715, 307865, 309194, 311879, 315679, 319408, 322117, 324056, 325555, 325939, 324682, 322723, 321402, 320857, 320714, 321528, 324085, 327803, 331139, 333295, 334426, 334673, 334152, 333442, 333010, 332440, 331234, 329921, 329390, 329601, 330032, 331026, 333485, 337403, 341595, 344852, 346659, 347118, 346885, 346945, 347762, 348917, 349951, 351075, 352629, 354614, 357348, 361706, 367827, 374301, 379575, 383606, 387382]
56505C87382M107M491M918N048M373L558L991N571O566O116N400N747O987Q263
56491D62518R106R078P784N826M627M639M707L724J945K80p72j172j114j034j132
56476E09010j023n93p36k200m256n807p121q887j0205r554p449n973n658m992
56462D34556l274j763j556k146k716l210l526l166k307j883k268k922l413l567
56448C96839k800q52R68R61n74j765j853j728j903j891j620j658j885j712j451
56433C77076j677j638k96J383J518M55K29J091J296M19j8M75O56L65J022K587
56417C84943L045K012J807L515M785L543J420J274L042M225L543K203K050L520
56403D24927N267N464L922K547K817L666L345K363K289K734K261J592K573M325
$$ y = [387382, 391489, 395980, 400898, 405946, 410319, 413877, 417868, 423439, 430005, 436121, 441521, 447268, 454255, 462518, 471624, 480702, 488486, 494312, 498939, 503578, 508285, 512009, 513954, 514234, 513462, 512290, 511176, 510142, 509010, 507987, 507394, 506658, 504458, 500202, 494395, 487274, 478387, 468182, 458628, 451179, 445206, 439548, 434556, 431282, 429519, 427963, 425817, 423101, 419891, 416365, 413199, 410892, 409009, 406741, 403819, 400406, 396839, 394039, 393187, 394155, 395116, 394542, 392777, 390924, 389196, 387293, 385402, 383782, 382124, 380239, 378527, 377076, 375399, 373761, 373465, 374848, 376366, 376821, 377050, 378141, 379437, 379856, 379838, 380313, 380969, 381334, 382356, 384943, 387988, 390000, 391807, 395322, 400107, 403650, 405070, 406344, 409386, 413611, 417154, 419357, 421407, 424927, 430194, 435658, 439580, 442127, 444944, 448610, 451955, 454318, 456607, 459341, 461602, 463194, 465767, 470092]
56389D70092M127K142J380K492K747J095N2R09J210q30l091l198k188j895j689
56374D73355n41K96m20j193k53J215J022m66j280j090j051j572k231k942l573
56359D59276l470k625k047j918j186Q9J22j562k876k430j660j978k314j499p09
56344D33213j200j758q67M81O26K34R56K444L020K184N86j328k945l099j756o18
56328D30173n78k63J331K745K500J751K332L776M359L729K635J485Q60J907M473
56313D63215O341N870L957K185J007Q60K607N239N725L129M22K28J416J975K391
56298E06567L493L808K163N34J160K850L265K724K720K713J798J557L610N981
56284E44943N637L368K475L612M433L679K339J313P91J333K976M113L615L027
$$ y = [470092, 474219, 476361, 477741, 480233, 482980, 484075, 484127, 485036, 486246, 485416, 482325, 479127, 476939, 475044, 473355, 472814, 473110, 472690, 471497, 471244, 472459, 473481, 473015, 471735, 470645, 469594, 468022, 465791, 462849, 459276, 455806, 453181, 451134, 449216, 448030, 448119, 448241, 446679, 443803, 441373, 439713, 437735, 435421, 433922, 433213, 432013, 430255, 429388, 429869, 430495, 430729, 431685, 434129, 437149, 439333, 439919, 438591, 435646, 432547, 430791, 430173, 429595, 429332, 430663, 433408, 435908, 437659, 439991, 443767, 448126, 451855, 454490, 455975, 456835, 458742, 463215, 469556, 475426, 479383, 481568, 482575, 483435, 486042, 491281, 497006, 500135, 500557, 500785, 502201, 504176, 506567, 510060, 513868, 516031, 516565, 517725, 520575, 523840, 526564, 529284, 531997, 533795, 535352, 538962, 544943, 550580, 553948, 556423, 560035, 564468, 568147, 570486, 571799, 572590, 573923, 576899, 581012, 584627, 587654]
56270E87654M165O035O778P085Q547J0154R805Q191P738Q642R293R645J0787J1945
56256G06464J1474J0257J0697J2781J4332J4822J5481J5973J4473J1221Q786Q393
56244H55154Q731Q607Q195P533O234M918M655M993M622L860M246N909P398P997
56230I43052Q178Q243Q383R532J2191J5036J6596J7463J8992K0973K2591K4452
56218A125682K7296L0018L1523L3166L6717M1192M4562M7306N1172N5619N8842
56207A583095O1402O5431P0860P5747P9985Q5465R2820J00892J09174J17974J26660
56196B569505J34533J42863J53149J63872J71893J76666J80219J83435J85227
56187D061362J84819J81975J75312J63332J46875J28039J07234Q3842N8991L4833
$$ y = [587654, 591819, 597854, 604632, 611717, 620264, 630418, 640223, 648414, 656152, 664794, 674087, 683732, 694519, 706464, 717938, 728195, 738892, 751673, 766005, 780827, 796308, 812281, 826754, 837975, 846761, 855154, 863885, 872492, 880687, 888220, 894454, 899372, 904027, 909020, 913642, 917502, 921748, 927657, 935055, 943052, 951230, 959473, 967856, 977388, 989579, 1004615, 1021211, 1038674, 1057666, 1078639, 1101230, 1125682, 1152978, 1182996, 1214519, 1247685, 1284402, 1325594, 1370156, 1417462, 1468634, 1524253, 1583095, 1644497, 1709928, 1780788, 1856535, 1936520, 2021985, 2114805, 2215697, 2324871, 2442845, 2569505, 2704038, 2846901, 3000050, 3163922, 3335815, 3512481, 3692700, 3876135, 4061362, 4246181, 4428156, 4603468, 4766800, 4913675, 5041714, 5148948, 5232790, 5291781, 5326614]
56177E326614J1903j0154l0098m6302n9430p1033q0480q6433r0223r4331r8471
56166D671562j00781j02021j04784j09072j12491j14536j17038j20416j22987
56157C667436j24017j24335j23988j22360j20271j18966j17456j13860j08804
56148B593379j04404j00569r5591q9608q4222p9309p3554o7415o2279n7509n1747
56137A727172m6162m2881m1155l8662l5503l3218l1135k7643k3920k2155k1287
56126A363451j8788j5418j3630j2561r634o045n275o802o610l648n72J635M351
56113A270454O908P062N961P122J0290J1805J1425J2944J7123J9923J9158J7606
56101A417781J7827J8749J9118J9827K1172K1683K1003K0426J9957J8639J7761
$$ y = [5326614, 5338517, 5328363, 5298265, 5251963, 5192533, 5121500, 5041020, 4954587, 4864364, 4770033, 4671562, 4570781, 4468760, 4363976, 4254904, 4142413, 4027877, 3910839, 3790423, 3667436, 3543419, 3419084, 3295096, 3172736, 3052465, 2933499, 2816043, 2702183, 2593379, 2488975, 2388406, 2292815, 2203207, 2118985, 2039676, 1966122, 1898707, 1836428, 1778919, 1727172, 1681010, 1638129, 1596974, 1558312, 1522809, 1489591, 1458456, 1430813, 1406893, 1384738, 1363451, 1344663, 1329245, 1315615, 1303054, 1293420, 1287375, 1282100, 1275298, 1268688, 1265040, 1264468, 1266103, 1270454, 1277362, 1284424, 1290385, 1297507, 1307797, 1319602, 1331027, 1343971, 1361094, 1381017, 1400175, 1417781, 1435608, 1454357, 1473475, 1493302, 1514474, 1536157, 1557160, 1577586, 1597543, 1616182, 1633943]
56090A633943J9673K3393K5857K7258L0373L4926L8004M0003M4580N2284N9879
56079B030173O6429P4359Q3984R2732J00625J10715J23319J35573J47263J60774
56069C125946J74264J81447J79757J72692J62888J49536J34263J22566J16437
56060D519796J11324J02722R0106P2604M7538J6443j3211l5694n1755o3823p2240
56049D723810p8688q7585j00819j15656j29870j43875j55949j61240j58148j50513
56039C441467j41229j29148j14374j00679r0046q0103o9565o0976n5707n1375
56029B548265m6430m2125l8421l3360k7959k5799k6330k4833k0426j7393j7064
56018B228125j5609j1731r123q855o866j689K729M640P486J2478J5734J5930J7254
$$ y = [1633943, 1653616, 1677009, 1702866, 1730124, 1760497, 1795423, 1833427, 1873430, 1918010, 1970294, 2030173, 2096602, 2170961, 2254945, 2347677, 2448302, 2559017, 2682336, 2817909, 2965172, 3125946, 3300210, 3481657, 3661414, 3834106, 3996994, 4146530, 4280793, 4403359, 4519796, 4631120, 4733842, 4823948, 4896552, 4944090, 4960533, 4947322, 4911628, 4859873, 4796050, 4723810, 4645122, 4557537, 4456718, 4341062, 4211192, 4067317, 3911368, 3750128, 3591980, 3441467, 3300238, 3171090, 3056716, 2956037, 2865991, 2785888, 2716323, 2655347, 2599640, 2548265, 2501835, 2459710, 2421289, 2387929, 2359970, 2334171, 2307841, 2283008, 2262582, 2245189, 2228125, 2212516, 2200785, 2191662, 2182807, 2175941, 2174252, 2176981, 2181621, 2189107, 2201585, 2217319, 2233249, 2250503]
56005B250503K1608K5211K6113K7524L0703L2192L1254L2024L5244L6135L3703
55994B582214L3446L7239L9545L7640L6523L9275M1693M1208M2176M7285N2315
55983C030559N4339N6547O0451O2263O1517O3929P0954P6119P6401P7184Q1175
55972C771438Q3210Q1495Q2848R0515R7890J00785J04682J13045J19970J21953
55962D767831J25528J35350J45702J51835J58527J69408J79196J84792J92625
55953F210794K06748K21207K32265K45988K65431K83182K95301L09221L28912
55944H599049L46474L57940L72404L95036M16647M31510M49638M79226N12860
55935A2360784N44073N80837O28677O77109P17568P58269Q06582Q54471Q97295
$$ y = [2250503, 2272111, 2297322, 2323435, 2350959, 2381662, 2413854, 2445108, 2477132, 2512376, 2548511, 2582214, 2615660, 2652899, 2692444, 2730084, 2766607, 2805882, 2847575, 2888783, 2930959, 2978244, 3030559, 3084898, 3141445, 3201896, 3264159, 3325676, 3389605, 3460559, 3536678, 3613079, 3690263, 3771438, 3854648, 3936143, 4018991, 4109506, 4207396, 4308181, 4412863, 4525908, 4645878, 4767831, 4893359, 5028709, 5174411, 5326246, 5484773, 5654181, 5833377, 6018169, 6210794, 6417542, 6638749, 6871014, 7117002, 7382433, 7665615, 7960916, 8270137, 8599049, 8945523, 9303463, 9675867, 10070903, 10487550, 10919060, 11368698, 11847924, 12360784, 12904857, 13485694, 14114371, 14791480, 15509048, 16267317, 17073899, 17928370, 18825665]
55926A8825665R48556J018517J096115J169495J245319J329546J409874J477978
55918B8521065J548734J636003J730069J820863J921186K043740K178808K319339
55910D3719807K482387K679002K890306L102800L338465L618687L930797M265944
55902G0028195M656108N135221N702024O365530P184635Q209216R422887J0798353
55894A27502169J2362276J4150923J6172355J8489412K1252642K4539227K8245076
55887B62714080L2230493L6313023L9689048M0411979L6110995K5854728J1362995
55880D84687341l858661j6663775k5660726l1003526l3462595l3841736l2840843
55873C07355479l0997925k8649739k6016572k3303070k0673687j8198741j5901718
$$ y = [18825665, 19774221, 20792738, 21888853, 23058348, 24303667, 25633213, 27043087, 28521065, 30069799, 31705802, 33435871, 35256734, 37177920, 39221660, 41400468, 43719807, 46202194, 48881196, 51771502, 54874302, 58212767, 61831454, 65762251, 70028195, 74684303, 79819524, 85521548, 91887078, 99071713, 107280929, 116703816, 127502169, 139864445, 154015368, 170187723, 188677135, 209929777, 234469004, 262714080, 294944573, 331257596, 370946644, 411358623, 447469618, 473324346, 484687341, 480828680, 464164905, 438504179, 407500653, 374038058, 340196322, 307355479, 276357554, 247707815, 221691243, 198388173, 177714486, 159515745, 143614027]
55866A43614027j3825722j2006432j0427828r061648p916500p000275o267005
55859G7108617n648165n111999m653340m251956l881764l540901l236439k956465
55851D3827588k687893k443583k241737k074428j923004j787520j674309j571005
55843B7424109j461264j351048j255534j172333j090648j014491r53794r03374
55835A8221623q52162q03349p65350p32760o95482o57284o27098o01180n71275
55826A1915683n40990n17027m93612m62559m29681m04603l83311l57415l31632
55817G994853l14977l02776k84815k64298k51722k46074k38528k29308k24767
55808E637588k22522k15093k04471j98562j96659j91882j84340j78847j73423
$$ y = [143614027, 129788305, 117781873, 107354045, 98292397, 90375897, 83375622, 77108617, 71460452, 66348453, 61695113, 57443157, 53561393, 50020492, 46784053, 43827588, 41139695, 38696112, 36454375, 34379947, 32456943, 30669423, 28995114, 27424109, 25962845, 24611797, 23356263, 22183930, 21093282, 20078791, 19124997, 18221623, 17369461, 16566112, 15800762, 15068002, 14372520, 13715236, 13088138, 12486958, 11915683, 11374693, 10857666, 10364054, 9901495, 9471814, 9067211, 8683900, 8326485, 7994853, 7679876, 7377100, 7092285, 6827987, 6576265, 6330191, 6091663, 5862355, 5637588, 5415066, 5199973, 4995502, 4796940, 4600281, 4408399, 4224059, 4045212, 3871789]
55799C871789j62870j50180j42120j36932j28273j17614j10791j06063r7599q7506
55789B631841q2582q2148q0371p7582p7927p8787p4022o5374n9652n6802n1552
55778A845042m4565m1187m0861l8276l3573l1367l1142k8546k4862k5351k9107
55767A476205l0111k7646k6563k7857k7757k5765k5241k6274k5739k3970k4017
55756A185265k5139k4090k1729k1276k1554j9108j5398j4537j5522j4157j1089
55745I81666j0346j1313r893o375m603m484k795l93r63l610m192l183m600p854
55731I07062q492o720p434j1543j4582j4620j4562j5829j6155j4661j3386j2933
55719G56145j1704r716q414p117m487k631m582q740j1078j1659j3515j6357j7266
$$ y = [3871789, 3708919, 3558739, 3416619, 3279687, 3151414, 3033800, 2923009, 2816946, 2719347, 2631841, 2549259, 2467111, 2386740, 2309158, 2231231, 2152444, 2078422, 2013048, 1953396, 1896594, 1845042, 1800477, 1759290, 1718429, 1680153, 1646580, 1615213, 1584071, 1555525, 1530663, 1505312, 1476205, 1446094, 1418448, 1391885, 1364028, 1336271, 1310506, 1285265, 1258991, 1233252, 1209282, 1185265, 1160126, 1136036, 1114307, 1093031, 1071477, 1052369, 1036971, 1022434, 1006912, 992755, 981666, 971320, 960007, 950114, 943739, 939136, 934652, 931857, 931464, 930501, 926891, 922699, 919516, 914916, 907062, 898570, 891850, 884416, 872873, 858291, 843671, 829109, 813280, 797125, 782464, 769078, 756145, 744441, 734725, 726311, 719194, 714707, 712076, 707494, 698754, 687676, 676017, 662502, 646145, 628879]
55706F28879j6362j5898j5017j1492p398o627q002p393n474o485j0057j1571j0305
55693D96798j0084j1726j1921j0066r344j0281r762p433o736q618j0055r762r598
55680C71412r685p913m963m054n032m595k701k686m363l603J46K344R84n45j3
55665C24733K08j473k784k259j897k845l217k328k538m775o609o580o206o146
55651B75284m762k080o41q72l1K696M528M124L748M599M659L069K103K691K283
55636C01398m72l069l349k520j835j85K714M510M017L469M780O725P783Q436Q686
55621C41088O761K563p57r46L04M24o67j965l441m829m923l684k757k668k022
55606C22481l99O74O03P26J518J778J408J941L384L699K367J209R93N44m9Q97
$$ y = [628879, 612517, 596619, 581602, 570110, 562712, 556085, 548083, 540690, 535216, 528731, 518674, 507103, 496798, 486714, 474988, 463067, 453001, 443657, 433376, 423614, 416181, 409445, 400827, 390772, 381010, 371412, 361727, 353814, 348851, 344797, 339765, 335170, 332469, 329783, 325420, 321817, 321963, 324307, 325291, 324746, 324733, 324941, 323468, 320684, 318425, 316528, 313683, 310466, 308138, 305600, 300825, 294216, 287636, 281430, 275284, 270522, 268442, 267801, 266929, 266898, 269594, 274122, 278246, 281994, 286593, 291252, 294321, 296424, 299115, 301398, 300926, 297857, 294508, 291988, 290153, 289968, 292682, 297192, 301209, 304678, 309458, 316183, 323966, 332402, 341088, 347849, 350412, 349655, 348709, 349013, 349437, 348770, 346805, 343364, 338535, 333612, 329928, 327171, 324503, 322481, 322082, 322756, 323359, 324085, 325603, 327381, 328789, 330730, 334114, 337813, 340180, 341389, 342382, 342926, 342877, 343774]
55590C43774K918L241J405J36M44j7k351m381m891n601p060o949m873m433p594
55575C03768j0943j0734q292p116p697q470r181j0059r919p968n670m416l496
55562A99807k456k910n575q028p964o482n655n100l480j335O5Q86J451Q64r61
55547A53127j952q40M82j39j836k548k259k149k205j885j516j175Q8K153K991
55532A40337J767O42J426K694K455J479J459J874J482J144K289L951M118L029
55518A70146K554L152L802M176M753N336N353N093N281O013P320R645J2613J4574
55504B59811J4581J3628J2881J2077J0649Q758O177K037l130p090q935j0303j2393
55491B98748j4124j4723j5375j6408j5595j1840p993p115q088p912o494n865o147
$$ y = [343774, 346692, 349933, 351338, 351474, 351918, 351901, 349550, 345169, 340278, 334677, 327617, 320668, 315795, 311362, 303768, 292825, 282091, 273799, 266683, 258986, 250516, 241335, 231276, 221357, 213389, 207719, 203303, 199807, 197351, 194441, 188866, 180838, 172874, 166392, 160737, 155637, 152157, 150822, 150887, 151773, 153224, 154088, 153127, 151175, 150335, 150817, 150678, 148842, 146294, 144035, 141886, 139681, 137796, 136280, 135105, 135193, 137346, 140337, 142104, 142746, 144172, 146866, 149321, 150800, 152259, 154133, 155615, 156759, 159048, 162999, 167117, 170146, 172700, 175852, 179654, 183830, 188583, 193919, 199272, 204365, 209646, 215659, 222979, 232624, 245237, 259811, 274392, 288020, 300901, 312978, 323627, 332385, 338562, 340599, 337469, 330379, 321444, 311141, 298748, 284624, 269901, 254526, 238118, 222523, 210683, 202690, 195575, 187487, 179575, 173081, 167216, 161069]
55478A61069n786m839m818n669n679m176j981L97K771M033L170J239K71N51P98
55463A41351N26K64m8q87j729j691j248j654k916m013m673n343n710m927l123
55448A04179j300L5Q83P77q22l325n275n689m546k546j027j212k711l682l182
55433G0557k267j983j836j222p84r41p21L82R56j77j728j823q88n03n65J55J366
55416E7978J520M15n45n62k07o1j12m47j245k223l035l844m624m595l346j690
55400C3377m47O38J617J285r32l138k899m97J562J889J388J301J587J457N22p32
55384C7978j273p28l08j431l231l121o04J511J021m91k37J588K484J403l77j477
55368C2707j542n76J056K244K166J290L73p01j900k116p88O35N78l12m25K32O37
$$ y = [161069, 155283, 150444, 145626, 139957, 134278, 130102, 128121, 128518, 131289, 135322, 138492, 139731, 140002, 140553, 141351, 141877, 142141, 142093, 141206, 139477, 137786, 136538, 134884, 131968, 127955, 123282, 117939, 112229, 107302, 104179, 102879, 102914, 103797, 104574, 103752, 100427, 95152, 89463, 84917, 82371, 81344, 80132, 77421, 73739, 70557, 68290, 66307, 64471, 63249, 62465, 61524, 60803, 61185, 62141, 61964, 60236, 58413, 57525, 57022, 56457, 56612, 57978, 59498, 59913, 59368, 58806, 58599, 58538, 58426, 57979, 56734, 54511, 51476, 47632, 43008, 38413, 35067, 33377, 32930, 33568, 35185, 36470, 35538, 32400, 29501, 29004, 30566, 32455, 33843, 35144, 36731, 38188, 38710, 37978, 36705, 35977, 35669, 34238, 31007, 27886, 27282, 28793, 29814, 29323, 29086, 30674, 33158, 34561, 34184, 32707, 31165, 30589, 31645, 33889, 36055, 37345, 37718, 37017, 35117, 33001, 32213, 32848, 33426, 33114, 32689, 32921, 33558]
55351C3558R38J874K769K307R31L96J075J691J486R55M54j45n24j56N69P35K68
55334D9181l35j177k540l673l393j648O31K688L802K933J04k604l059j612j67
55319C9131N10R02Q80j73j810k892l328l687l477j750P03J765P41q53j515j241
55303B3906p09l37l15m78q4J252K627K884K240J706J300K12j495k697k615j395
55287B6002M06J962K332J564R43J161J125j38j457j142K29O42l73j529k105k484
55271B7138k601j862n67K79N80J011J463J257O36M47M87o0p75m51P00J116K38
55254B9036r16j572j918j841q10P27J419R03K13M9P7J88Q44J841K077J132o2n36
55236C0851l47N5N09R09J003O78K3p92j311r17K39J072J031Q52J081R33j87j174
$$ y = [33558, 34496, 36370, 39139, 41446, 42377, 42773, 43848, 45539, 47025, 47980, 48434, 48289, 47765, 47609, 48178, 48913, 49181, 48846, 47669, 45129, 41456, 38063, 36415, 37046, 39734, 43536, 46469, 46573, 43969, 40910, 39298, 39131, 39641, 40543, 41423, 41250, 39440, 36548, 33220, 29533, 26056, 24306, 25009, 26774, 27515, 26662, 25147, 23906, 23197, 22860, 22545, 22067, 21983, 23235, 25862, 28746, 30986, 32692, 33992, 34204, 32709, 30012, 27397, 26002, 26408, 28370, 30702, 32266, 33209, 34370, 35495, 35357, 33900, 32758, 32987, 33629, 33256, 31727, 29622, 27138, 24537, 22675, 22108, 22387, 22967, 23978, 25441, 26698, 27334, 27781, 28268, 28208, 27433, 26982, 27682, 28798, 29036, 28120, 26548, 24630, 22789, 21979, 22706, 24125, 25028, 25241, 25290, 25367, 25555, 26399, 28240, 30317, 31449, 31387, 30851, 30504, 30559, 31068, 31977, 32980, 33658, 33681, 32889, 31578, 30661, 30900, 31972, 33003, 33855, 34936, 35869, 35682, 34508]
55218C4508p34N50J179Q81J68j129k994l927k615k80Q24N53M83J008J142O96K93
55201C0606l10j546k178p10J703K439J331N68Q08M11j127k098j736j376j650j276
55185B3859J39P92k98j382p39O30P85k85j144j026j84Q67J443J153P83J527K921
55168B9841L201K065J167J256J037j99j007k48P57J67j704l040k726p29K266M600
55152C6704M453K123O9l88o38j901k733j433Q55J786J441J737K844K795P91j357
55136D7148j768q22j19k83o54n25Q5O62P42J90p29j463j420m39Q79J538J196N60
55118D4778M46Q16J126J163Q96J16j062j818j642j166j065p57N64K174K543J468
55102D8580Q0r35j607j630o97L85N67L13Q21J802K045J869K647L848L071l11l819
$$ y = [34508, 33774, 34324, 35503, 36384, 36552, 35423, 32429, 28502, 25887, 25607, 26431, 26984, 27467, 28475, 29617, 30313, 30606, 30296, 28750, 26572, 25862, 27565, 30004, 31335, 31903, 32711, 33122, 31995, 29897, 28161, 26785, 25135, 23859, 23998, 24790, 24492, 23110, 22371, 23001, 23786, 23501, 22357, 21331, 21147, 22014, 23457, 24610, 25393, 26920, 29841, 33042, 35107, 36274, 37530, 38567, 38368, 37361, 37113, 37870, 38037, 36333, 33293, 30567, 29838, 32104, 36704, 41157, 43280, 43349, 42961, 42323, 40422, 37689, 36256, 37111, 38897, 40338, 42075, 44919, 47714, 48505, 47148, 45380, 44558, 44439, 44156, 43502, 42977, 43062, 43724, 44466, 44656, 43927, 42464, 41044, 40605, 41484, 43022, 44218, 44778, 45224, 46040, 47166, 48329, 49225, 49341, 48279, 46461, 44819, 43653, 42588, 41831, 42395, 44569, 47112, 48580, 48660, 47725, 46118, 44488, 43791, 44176, 44743, 45056, 45877, 47679, 49724, 51593, 54240, 58088, 61159, 60848, 57029]
55085E7029m989l895j945j15P92J68j216j684j067q52j332q98R51K113R71j026
55069D3005j530n07L96M57K38L21R34K093L125L090K328K324L248L205J031j668
55053F2090k522j244O98K129K705K479K027K041K075Q69j446k961k567j265j69
55038F4939J020K437K986K196J354J221N22j578l295k655m99J042J719K519L127
55023G7055K501J194O91R24O63l5N3R94J543J273J002J120J131R19R00R21L81
55006I3230m84p55k46L73Q18J302J575J111K13k56k95p45j810k539k082p52L85
54989H9043N36m6j80R32K285J807r49l741m166k375m19L58K19n1%M00P61O68M91
54970H5573R52J687J427K60J33K005L954L605J255r83k092k447k098p65R47K090
$$ y = [57029, 52040, 48145, 46200, 46085, 46877, 47045, 45829, 44145, 43078, 42226, 40894, 39996, 40947, 43060, 44031, 43005, 41475, 40968, 41364, 41821, 42059, 42380, 43314, 45407, 48532, 51622, 53950, 56274, 59522, 62727, 63758, 62090, 59568, 58324, 59022, 61151, 63856, 66335, 68362, 70403, 72478, 73347, 71901, 68940, 66373, 65108, 64939, 65959, 68396, 71382, 73578, 74932, 76153, 76675, 75097, 71802, 69147, 68648, 69690, 71409, 73928, 77055, 79556, 80750, 81441, 82365, 83028, 82993, 83046, 84040, 85583, 86856, 87858, 88978, 90109, 91028, 91928, 92849, 93230, 92746, 91991, 91745, 92118, 92936, 94238, 95813, 96924, 97137, 96881, 96586, 95841, 94031, 91492, 89410, 88658, 89043, 89579, 89533, 89353, 90285, 92570, 94377, 93428, 89687, 85521, 83146, 82727, 83085, 83304, 83253, 83253, 83653, 84414, 85082, 85573, 86525, 88212, 89639, 89899, 90032, 92037, 95991, 99596, 100851, 99868, 97776, 95329, 93231, 92466, 93413, 95503]
54954I5503K771L539L739K279k20j620q32J175K866L469K865J345k64j240j808
54939A13567k714m077n144n119l758j590J98P43O00J039K031K264J466J035J557
54924A02098J635L61r39r30m83p49q09N69K323K632J868J529J457O71k9Q15K238
54907A14257J982L25j82J239K740L216L594M295M248L270K865L683M438M273M118
54892A58361M672N157N235O135Q561J1167J2483J2996J3935J5278J6209J6539
54880B86728J6393J5324J2830R212N095O81l886q075j1399j3761j5079j5184j4321
54867B64558j3052j1552r726q059p251p156p030o807o907o894n873m293l580l761
54853A62617l154j050J171K426L574N500P130P010N824N598O969Q700R785J0752
$$ y = [95503, 98274, 101813, 105552, 107831, 107611, 105991, 105159, 106334, 109200, 112669, 115534, 116879, 116615, 115375, 113567, 110853, 106776, 101632, 96513, 92755, 91165, 91363, 92106, 92706, 93745, 95776, 98040, 99506, 100541, 102098, 103733, 104094, 103155, 102225, 101742, 100993, 100184, 100753, 103076, 105708, 107576, 109105, 110562, 111233, 111204, 112019, 114257, 116239, 116564, 116382, 117621, 120361, 123577, 127171, 131466, 135714, 138984, 141849, 145532, 149970, 154243, 158361, 163033, 168190, 173425, 179560, 188121, 199288, 211771, 224767, 238702, 253980, 270189, 286728, 303121, 318445, 331275, 340487, 345582, 346263, 342377, 334302, 322903, 309142, 294063, 278879, 264558, 251506, 239954, 230228, 222169, 214918, 207762, 200732, 193925, 187018, 180124, 174251, 169958, 166378, 162617, 159463, 158413, 159584, 162010, 165584, 171084, 178214, 185224, 191048, 196646, 203615, 212315, 222100, 232852]
54839B32852J2586J5092J6740J6039J3075R471O569L911J75m704r278j2298j3680
54826B86550j3793j3012j2202j2380j3327j3597j2421j0733r674r024p750n541
54814A53096l174j759j877l010l712k994j608j158j975k759k438j343l00K91K03
54799A25483p74k111k634j943j036r65j563j958j744j259j135j793k931l432k476
54784I7729p72Q5m22j312j703j878k348k812k545j310L53J499J523J014J400L003
54768I1504M023K634l94k477k273n96J349K879L227K024O02R11K732L746K820
54753A12711J313O47O17Q17J760L441M584M522M251M531M573L745K955L025L332
54738A56824L493M694P606J0415J0882R474Q485R005J0458J2313J4275J5417J5031
$$ y = [232852, 245438, 260530, 277270, 293309, 306384, 315855, 322424, 326335, 326510, 321806, 312528, 300230, 286550, 272757, 259745, 247543, 235163, 221836, 208239, 195818, 185085, 175411, 166387, 158637, 153096, 149922, 148163, 146286, 143276, 139564, 136570, 134962, 133804, 131829, 129070, 126632, 125289, 124989, 125280, 125483, 124709, 122598, 119964, 118021, 116985, 116020, 114457, 112499, 110755, 109496, 108361, 106568, 103637, 100205, 97729, 96957, 97042, 96620, 95308, 93605, 91727, 89379, 86567, 84022, 82712, 83065, 84564, 86087, 87101, 88501, 91504, 95527, 98161, 97767, 95290, 93017, 92421, 93770, 96649, 99876, 101900, 102502, 103413, 106145, 109891, 112711, 114024, 114671, 115288, 116105, 117865, 121306, 125890, 130412, 134663, 139194, 143767, 147512, 150467, 153492, 156824, 160317, 165011, 172617, 183032, 193914, 203388, 211873, 220878, 231336, 243649, 257924, 273341, 288372]
54725B88372J4008J3643J3452J1849Q696N392K566n65m266p439r136r740j0110
54712C16722j0453j0432r759q475p053o109n505m304k261p66j115k350k206pK616
54697B48543L991M004L419K925L324N407Q880J2159J3988J4827J6079J8267K0470
54684C76283K1381K0535J8466J5834J2595Q324L216j723n715q907j1751j4228
54672D34310j6200j8018j9990k1586k1842k0484j8092j5503j3540j2912j3477
54661B42666j3884j2832j0608q607p412o362n121m492n007n635m882k905j492
54648A53427j724k492j932J12J866J833M06r76j538j377p00L23J197J544J669
54633A51638J873J540L5j734k015o39O95Q38M84M92M15k96q64j36J754L601M490
$$ y = [288372, 302380, 316023, 329475, 341324, 350020, 355412, 357978, 357413, 353147, 345708, 336572, 326832, 316722, 306269, 295837, 286078, 277603, 270550, 264441, 258936, 254632, 252371, 251605, 250490, 248140, 245934, 245927, 248543, 252534, 256538, 259957, 262882, 266206, 271613, 280493, 292652, 306640, 321467, 337546, 355813, 376283, 397664, 418199, 436665, 452499, 465094, 473418, 476634, 474911, 469196, 460289, 448538, 434310, 418110, 400092, 380102, 358516, 336674, 316190, 298098, 282595, 269055, 256143, 242666, 228782, 215950, 205342, 196735, 189323, 182961, 177840, 173348, 168341, 162706, 157824, 154919, 153427, 151703, 149211, 147279, 147391, 149257, 151090, 151496, 150520, 148982, 147605, 146905, 147228, 148425, 149969, 151638, 153511, 155051, 155086, 153352, 151337, 150698, 151393, 152231, 152715, 153207, 153622, 153326, 152462, 152326, 154080, 157681, 162171]
54616A62171M146K728J059L82J022J944K321K626L407M007L736L329L902N129
54602B01909N812N827O068O817P397P225O107L928J195n75l18J059J944K295L211
54587B59901M578N145M899N385P161Q756R072R180J0643J3141J5027J5485J5077
54574C83450J4601J4245J3725J2514J0209P001L523m7m192q893j2945j5100j5585
54561D02506j5797j6556j7303j7051j5605j3630j1764j0092q497p219o664o696
54549B55632o553n660m210k705j386m90n15j591k911l496l412l495m041m501m512
54534B06154m306m013l383k543k249k903l829m011l269k287j788k069l029m154
54520A62321m664m191l352l261m188n063m622k907j194m51l42p8K42q6j063j750
$$ y = [162171, 166317, 169045, 170104, 170486, 171508, 173452, 175773, 178399, 181806, 185813, 189549, 192878, 196780, 201909, 207721, 213548, 219616, 226433, 233830, 241055, 247162, 251090, 252285, 251710, 251392, 252451, 254395, 256690, 259901, 264479, 269624, 274523, 279908, 287069, 295825, 304897, 314077, 324720, 337861, 352888, 368373, 383450, 398051, 412296, 426021, 438535, 448744, 455745, 459268, 459221, 455029, 446136, 433191, 418091, 402506, 386709, 370153, 352850, 335799, 320194, 306564, 294800, 284708, 276211, 268992, 262328, 255632, 249079, 243419, 239209, 236504, 235118, 234628, 234113, 232522, 229611, 226115, 222703, 219208, 215167, 210666, 206154, 201848, 197835, 194452, 191909, 189660, 186757, 182928, 178917, 175648, 173361, 171573, 169504, 166475, 162321, 157657, 153466, 150114, 146853, 142665, 137602, 132980, 130073, 128879, 128428, 128086, 128008, 128250, 128164, 127101, 125351]
54504A25351j513p18M5O97J335J765J892K002K260K436K483K629K593J616m7o95
54488A44131O82K672L122J937P67L57j0n51k83J136K462K659K511L373N101O177
54472A76243N566L835K611L286N817Q481R342Q248O779O059N540M514L626L672
54458B53619L661J700k251n994p794q218q692r351r318q385p216o186n082m056
54444A76437l805m473n113m791l671k560j817j251p94o56r29j424j737j343J5
54429A42088J562J855N42p01k1K129L483K833J213J72M5L87R16J377J373J059
54413A60312J265K216K794J911Qj410j374O3K291M388N286M484K520K95j635k862
54397A80552k893j874j008j436k847l896l729k648j495q78p74n48K89J189J023
$$ y = [125351, 123838, 123120, 123165, 123862, 125197, 126962, 128854, 130856, 133116, 135552, 138035, 140664, 143257, 144873, 144826, 144131, 144813, 147485, 150607, 152544, 153311, 153668, 153658, 153107, 152824, 153960, 156422, 159081, 161592, 164965, 170066, 176243, 181809, 185644, 188255, 191541, 197358, 205839, 215181, 223429, 230208, 236267, 241807, 246321, 249947, 253619, 257280, 258980, 256729, 250735, 242941, 234723, 226031, 216680, 207362, 198977, 191761, 185575, 180493, 176437, 172632, 168159, 163046, 158255, 154584, 152024, 150207, 148956, 148162, 147506, 146577, 145153, 143416, 142073, 142088, 143650, 145505, 146047, 145346, 145325, 147454, 150937, 153770, 154983, 155155, 155200, 155587, 156503, 157880, 159253, 160312, 161577, 163793, 166587, 168498, 168506, 167096, 165722, 165785, 168076, 172464, 177750, 182234, 184754, 185049, 183414, 180552, 177659, 175785, 174777, 173341, 170494, 166598, 162869, 160221, 158726, 157848, 157074, 156526, 156815, 158004, 159027]
54382A59027k23j130p76q5l92j501k256k335k322k324j893j138p51q79r24n85
54366A39513k23q2Q4M19N90J75q45j974k382j567m5J075J468J832K376K149O36
54349A43199r35r42O45K623M121M780M255K941K462L898O020O775O015N094M336
54334A95287K951J358J388L611O144O815N243K530J08q84l95R5q54k635l514l300
54318B13948l406m269m874n077n921o961n848j999J575K025M27k29O72J355R38
54303A82356K81l1m85j350k166k702l102l096k233q99O4P01J811L430M574M579
54287A81732L760K575J122k07n25O17K558M147M736M453L894L641L694L307J746
54272B21250o60k538k712j346J89M78p99k719m100m599m721m887m932m588m008
$$ y = [159027, 158804, 157674, 156898, 156813, 156421, 154920, 152664, 150329, 148007, 145683, 143790, 142652, 141901, 141022, 140098, 139513, 139290, 139208, 139292, 139711, 140301, 140476, 139631, 137657, 135275, 133708, 133663, 134738, 136206, 138038, 140414, 142563, 143199, 142264, 141322, 141967, 144590, 148711, 153491, 157746, 160687, 163149, 167047, 173067, 179842, 185857, 190951, 195287, 198238, 199596, 200984, 204595, 210739, 217554, 222797, 225327, 225435, 224551, 224156, 224251, 223397, 220762, 217248, 213948, 210542, 206273, 201399, 196322, 190401, 183440, 177592, 175593, 177168, 179193, 179620, 179391, 180063, 181418, 182356, 182637, 182606, 182121, 180771, 178605, 175903, 172801, 169705, 167472, 166573, 166637, 167338, 169149, 172579, 177153, 181732, 185492, 188067, 189189, 188982, 188457, 189074, 191632, 195779, 200515, 204968, 208862, 212503, 216197, 219504, 221250, 220590, 218052, 215340, 213994, 214183, 214661, 213862, 211143, 207043, 202444, 197723, 192836, 187904, 183316, 179308]
54257A79308l583l588m021m490m204k800j234j123k791m699n325m886m603m906
54243A27055n151m779l828k446p63P29J235M48r84j920j731q81m70j020j864j988
54227A01642j341o92m54m67p88j596k206j449M53J594P69q86j541q96J98J328
54211I3668K325K379R07r78j498n23N18Q28Q69Q32K64m51L8J862L185K719J745
54194A08689K140L387L258J213p05p68K40N78J01r1M2q25k953m358l117j58J646
54177A08319J103N5O53K453L167J696p05k178k222j636j185r30o82n46o87p21
54161A05954M7J428J942M56j999l077j975l54K2n24o10q1J9p42j646k030j902
54144I4928j359l93O25J117J143J231J295O54n62r82L49K478L489K584O92p83
$$ y = [179308, 175725, 172137, 168116, 163626, 159422, 156622, 155388, 154265, 151474, 146775, 141450, 136564, 131961, 127055, 121904, 117125, 113297, 110851, 110088, 110817, 112052, 112500, 111516, 109596, 107865, 106984, 106514, 105494, 103630, 101642, 100301, 99609, 99155, 98688, 97900, 96304, 94098, 92649, 93102, 94696, 95465, 94579, 93038, 92142, 92340, 93668, 95993, 98372, 99279, 98301, 96803, 96280, 96798, 97626, 98495, 99327, 99591, 99140, 99178, 101040, 104225, 106944, 108689, 110829, 114216, 117474, 118687, 117982, 117214, 117454, 118032, 118133, 118042, 118084, 117259, 114306, 109948, 106831, 106673, 108319, 109422, 109477, 110130, 112583, 115750, 117446, 116741, 114563, 112341, 110705, 109520, 108590, 107908, 107362, 106675, 105954, 106001, 107429, 109371, 109827, 107828, 104751, 102776, 102422, 102444, 101920, 101310, 101229, 101248, 100506, 98860, 96830, 94928, 93569, 93176, 93801, 94918, 96061, 97292, 98587, 99241, 98679, 97697, 98046, 100524, 104013, 106597, 107289, 106506]
54128A06506j316j331j291r97P6J738K777K134J40j884k998l067k169n91O59N11
54112I8897o36j186n46Q3k20n19K90J378J119l62j562k021k514k871j823M73J859
54095H9839J263N32J591L247K780o9k800l478k473r77L73J087P54j0P0J048J576
54078I4353J071O04Q62Q47k24j150m55J181J842J157M21L34K31m18j197j664j815
54061I5980j503m85P38J158N57l41j044j603j727q26P00J385M28j296k363k131
54045H7627o42J699L835M383L045J053k95r46j484k007k198j855q05J027K886
54030I5323L261J567p43j566m46J156J622O95o09j086n12J63Ln50k27J085J925
54013A01061J247j75j048j319j660k023j836j222p66k03J432M108O218O123L912
$$ y = [106506, 105190, 103859, 102568, 101571, 101647, 103385, 106162, 108296, 108436, 106552, 103554, 100487, 98318, 97727, 98386, 98897, 98261, 97075, 96529, 96612, 96392, 95873, 96163, 97541, 98660, 98298, 96736, 94715, 92201, 89330, 87507, 87980, 89839, 91102, 91634, 93225, 96472, 99252, 99183, 96383, 92905, 90432, 89455, 89828, 90915, 91669, 91659, 91729, 92777, 94353, 95424, 96028, 96890, 97737, 97513, 96363, 95908, 97089, 98931, 100088, 100509, 100843, 101074, 100656, 99459, 97795, 95980, 94477, 93992, 94730, 95888, 96445, 96104, 95060, 93457, 91730, 90904, 91604, 92989, 93417, 92121, 89758, 87627, 86985, 88684, 92519, 96902, 99947, 101000, 100705, 99759, 98275, 96268, 94070, 92215, 91410, 92437, 95323, 98584, 100151, 99408, 97842, 97396, 98552, 100174, 100869, 100260, 99174, 98662, 98825, 98828, 98278, 98051, 99136, 101061, 102308, 102133, 101085, 99766, 98106, 96083, 94247, 93025, 92259, 92056, 93488, 97596, 103814, 109937, 113849]
53998A13849J375M14J374K783K868J518L20M82J346J548R10L83M65Q51J481K881
53982A34848N090P006P308N791L543K011J963L144M757O156P027P195O795O544
53968B09178P132Q123Q254P209O241O407O955O433M817L484L308L868M419M686
53954B90514M518L612K037N17j35J93P33L15j597m100n339m252j663N79J195L2
53938B87159k235m352n053m239l375l920n636p016p010n622l383j207l07j121
53924B32683k472k844k291j965k052j602m40K66j07n70p8J011J777K104K237J815
53908B27472M62j162j895j480o12K42J159J931J844N93j033j923j810j355j117
53893B21316q40P9J590K907L448L389L033K210Q60k05jJ331K744L757M754N682
$$ y = [113849, 115224, 115638, 117012, 119795, 122663, 124181, 124501, 124983, 126329, 127877, 128787, 129170, 129635, 130486, 131967, 134848, 139938, 146944, 154252, 160043, 163586, 165597, 167560, 170704, 175461, 181617, 188644, 195839, 202634, 209178, 216310, 224433, 232687, 239896, 246137, 252544, 259499, 265932, 270749, 274233, 277541, 281409, 285828, 290514, 295032, 298644, 300681, 301198, 301063, 301256, 301989, 302304, 300707, 296607, 291268, 287016, 285353, 285932, 287127, 287159, 284924, 280572, 275519, 271280, 267905, 263985, 258349, 251333, 244323, 238701, 235318, 234111, 233804, 232683, 230211, 227367, 225076, 223111, 221059, 219457, 219017, 219283, 219176, 218606, 218528, 219539, 221316, 223420, 225657, 227472, 227934, 226772, 224877, 223397, 222785, 223027, 224186, 226117, 227961, 228554, 227521, 225598, 223788, 222433, 221316, 220476, 220555, 222145, 225052, 228500, 231889, 234922, 237132, 237992, 237787, 237786, 239117, 241861, 245618, 250372, 256054]
53877B56054N693M607L687M052N123N651N522N326M735K950P56K70J942L428K511
53862C12307M0j455j177m02J26J136K899M307M706N190O758Q334Q147O488N464
53847C62868O167P457P858P439P344Q176R314R473P832M949K390J092M19o16j811
53832D40351k446k833l822n121n622n371n525o267o493n956n828o563p001o625
53818C64878o770q340j0014j0255r564r086q420o723m821m046l951l307k732l806
53804B73043n975o894o010n368o343p674p567n980l858j800l86n09k197m061m858
53789B03563m807m650m284l172j506j40K90k25j099j449q69j28k95j158j468q66
53773A77737l45n07o54k55P8n0J50J069J345k09k163j968L50J983J278o1K83J863
$$ y = [256054, 261747, 266354, 270041, 274093, 279216, 284867, 290389, 295715, 300450, 303400, 304156, 304426, 306368, 309796, 312307, 312347, 310892, 309715, 309313, 309439, 310575, 313474, 317781, 322487, 327677, 334435, 342769, 350916, 357404, 362868, 369035, 376492, 384350, 391789, 399133, 407309, 416623, 426096, 433928, 438877, 441267, 442359, 442778, 442162, 440351, 437905, 435072, 431250, 426129, 420507, 415136, 409611, 403344, 396851, 390895, 385067, 378504, 371503, 364878, 358108, 349768, 339754, 329499, 319935, 310849, 302429, 295706, 290885, 286839, 282888, 279581, 276849, 273043, 267068, 260174, 254164, 248796, 242453, 234779, 227212, 221232, 217374, 215574, 215188, 214679, 212482, 208421, 203563, 198756, 194106, 189822, 186650, 185144, 185004, 185294, 185069, 183970, 182521, 181652, 181524, 181229, 180071, 178603, 177737, 177392, 176885, 176231, 175976, 176054, 176004, 176154, 177223, 178568, 178359, 176196, 174228, 174578, 176561, 177839, 177778, 178061, 179924]
53755A79924K524K000K337M464O236N108J625j254j846j107l41O57K278L553L354
53740B09512K417K599M323O114O657O206N798O069P105Q498R257Q503O549M809
53726B94416M224M313M001K866J335J17k16N72K168L762M438L655J699k81j109
53711C25960q20o12j249k101k253j825j493j348j197j371k167k945k926k388k016
53696B99249j504l13O81K5j849k838k157j441k255l909m589l564j570J01L49j025
53680B73391k844l491k777k066k409l450m336m659m156k650q26J6m59j146j025
53665B37113l22J79l2j172k924l865k530M47K472J957K4j335j488q75J97J431
53649B29277K265K665L327M351M750M037L292L719N085O418P259P345O279M452
$$ y = [179924, 182448, 184448, 186785, 191249, 197485, 202593, 204218, 202964, 201118, 200011, 199670, 200327, 202605, 206158, 209512, 211929, 214528, 218851, 224965, 231622, 237828, 243626, 249695, 256800, 265298, 274555, 283058, 289607, 294416, 298640, 302953, 306954, 309820, 311155, 311272, 311056, 311628, 313796, 317558, 321996, 325651, 327350, 327069, 325960, 325140, 324528, 323279, 321178, 318925, 317100, 315607, 314259, 313062, 311691, 309524, 306579, 303653, 301265, 299249, 297745, 297432, 298113, 298138, 296289, 293451, 291294, 289853, 287598, 283689, 279100, 275536, 273966, 274067, 274416, 273391, 270547, 267056, 264279, 262213, 259804, 256354, 252018, 247359, 243203, 240553, 239727, 239743, 239284, 238138, 237113, 236791, 236970, 236938, 235766, 232842, 228977, 226447, 226894, 229366, 231323, 231347, 230012, 228524, 227649, 227846, 229277, 231542, 234207, 237534, 241885, 246635, 250672, 253964, 257683, 262768, 269186, 276445, 283790, 290069, 294521]
53635B94521L311L613M397M642M753N311N692N358N255O212O927N639L024J385
53621C60040J364J470Q76O10J558K993L678L280K128O18o59j073o88k34r0J09
53605C75980N96R25N17n64j654k142j996j699j509r19N30K047K184Q32m95r09
53589C71724j353k626l633k981j341n49r53j242n89N07J355J707J425O89L61R07
53573C63408J301L40j197j293L97J976J947J064R66K085L550M395M379M008L944
53558C91270M268M489M557N096O059O212N093M412N846Q214Q850P405O059O093
53544D73923O607O878P500Q362P942N952M639N778P983Q782P984P155O788O158
53530E72431N501O084Q053R929J0661J0723J0693J0064Q325O368N731O654P654
$$ y = [294521, 297832, 301445, 305842, 310484, 315237, 320548, 326240, 331598, 336853, 343065, 349992, 355631, 358655, 360040, 361404, 362874, 363750, 364360, 365918, 368911, 372589, 375869, 377997, 378615, 377956, 376883, 376195, 375961, 375871, 375980, 376576, 377501, 378018, 377454, 375800, 373658, 371662, 369963, 368454, 367535, 368065, 370112, 372296, 373128, 372633, 371724, 370371, 367745, 364112, 361131, 359790, 359241, 358288, 357046, 356457, 356964, 358319, 360026, 361451, 362140, 362501, 363408, 364709, 365049, 363852, 362559, 362956, 364932, 366879, 367943, 368909, 370994, 374544, 378939, 383318, 387326, 391270, 395538, 400027, 404584, 409680, 415739, 421951, 427044, 431456, 437302, 445516, 454366, 461771, 467830, 473923, 480530, 487408, 494908, 503270, 511212, 517164, 521803, 527581, 535564, 544346, 552330, 559485, 566273, 572431, 577932, 584016, 592069, 601998, 612659, 623382, 634075, 644139, 652464, 658832, 664563, 671217, 678871]
53517F78871P180N195K969J640J333J603K179K913L392L201K587K373L073M270
53503G22779M973M381K492K98q48n11K65J32r01j511o43J516L948N461N126L025
53487G49982P90L29J664K827K443J489J734L217M411M524M425N007N727N485M501
53472G98555M305N754P770Q631Q135P686Q304R482J0330J0993J2194J3998J5819
53459I21956J7365J8777K0063K1124K2059K2838K2952K2327K2202K4040K7559
53448A163262L0918L2865L3696L4020L4004L4139L5509L8368M1329M2854M3072
53437A564036M3390M4801M7270N0278N3157N4931N4771N2896N0735M9838N0526
53426B116629N1639N1757N0765M9867M9934N0349N0124M9579M9819N0748N0914
$$ y = [678871, 686051, 691246, 694215, 695855, 697188, 698791, 700970, 703883, 707275, 710476, 713063, 715436, 718509, 722779, 727752, 732133, 734625, 734923, 734075, 733564, 733829, 733961, 733060, 731549, 730906, 732422, 736370, 741831, 746957, 749982, 750772, 751101, 752765, 755592, 758035, 759524, 761258, 764475, 768886, 773410, 777835, 782842, 788569, 794054, 798555, 802860, 808614, 816384, 825015, 833150, 840836, 849140, 858622, 868952, 879945, 892139, 906137, 921956, 939321, 958098, 978161, 999285, 1021344, 1044182, 1067134, 1089461, 1111663, 1135703, 1163262, 1194180, 1227045, 1260741, 1294761, 1328765, 1362904, 1398413, 1436781, 1478110, 1520964, 1564036, 1607426, 1652227, 1699497, 1749775, 1802932, 1857863, 1912634, 1965530, 2016265, 2066103, 2116629, 2168268, 2220025, 2270790, 2320657, 2370591, 2420940, 2471064, 2520643, 2570462, 2621210, 2672124]
53415B672124M9587M7764M6562M5661M4156M2087M0119L8282L6061L3498L1176
53404C127077K9135K6634K3235J9510J6396J4244J2604J0819Q480N540K167j469
53392C294372n340r455j3624j7266j9769k1271k2929k5848k9656l2779l4399l5481
53380C026555l7278l9545m1085m1650m2122m2986m3714m3843m3628m3345m2821
53369B564538m1986m1058l9798l7479l4124l1055k9426k8600k6737k2915j8086
53358B213274j3999j1450r642p121l277J176N198Q429J1029J3002J4519J6447
53346B237585J9600K3618K7559L1478L6187M1309M5021M6379M6774M8183N0898
53335B654591N3969N7064O0633O4584O8043P0690P3425P7290Q1999Q5999Q8093
$$ y = [2672124, 2721711, 2769475, 2816037, 2861698, 2905854, 2947941, 2988060, 3026342, 3062403, 3095901, 3127077, 3156212, 3182846, 3206081, 3225591, 3241987, 3256231, 3268835, 3279654, 3288134, 3293674, 3295841, 3294372, 3289032, 3279577, 3265953, 3248687, 3228918, 3207647, 3184718, 3158870, 3129214, 3096435, 3062036, 3026555, 2989277, 2949732, 2908647, 2866997, 2824875, 2781889, 2738175, 2694332, 2650704, 2607359, 2564538, 2522552, 2481494, 2441696, 2404217, 2370093, 2339038, 2309612, 2281012, 2254275, 2231360, 2213274, 2199275, 2187825, 2178183, 2171062, 2167785, 2168961, 2174159, 2182588, 2193617, 2206619, 2221138, 2237585, 2257185, 2280803, 2308362, 2339840, 2376027, 2417336, 2462357, 2508736, 2555510, 2603693, 2654591, 2708560, 2765624, 2826257, 2890841, 2958884, 3029574, 3102999, 3180289, 3262288, 3348287, 3436380]
53324C436380Q8925R0482R3864R7934J00795J02235J03660J05559J06473J05143
53314D431450J02501J00478R9582R8811R7561R6265R5023R2708Q8039Q1133P3390
53303E456941O5981N8879N1594M4615L9178L5280L0676K3071J3068L589l846j0765
53291E808261j9060k8087l5717m1361m6486n2560n9885o8264p7422q6441r3848
53280E199130r8847j01920j03963j05363j06029j05804j04612j02651j00553r8918
53270D170470r7607r6104r4590r3887r3956r3227r0177q5220q0254p6549p3751
53259C195148p0928o7784o4489o0950n6834n2032m6788m1664l7563l5161l3747
53248B627208l1309k6724k1480j7993j6427j4718j1860r351q469p881n489j392
$$ y = [3436380, 3525305, 3615787, 3709651, 3807585, 3908380, 4010615, 4114275, 4219834, 4326307, 4431450, 4533951, 4634429, 4734011, 4832822, 4930383, 5026648, 5121671, 5214379, 5302418, 5383551, 5456941, 5522922, 5581801, 5633395, 5678010, 5717188, 5752468, 5783144, 5806215, 5819283, 5822872, 5819026, 5808261, 5789201, 5761114, 5725397, 5684036, 5637550, 5584990, 5525105, 5456841, 5379419, 5292978, 5199130, 5100283, 4998363, 4894400, 4789037, 4683008, 4577204, 4472592, 4369941, 4269388, 4170470, 4072863, 3976759, 3882169, 3788282, 3694326, 3601099, 3510922, 3425702, 3345448, 3268899, 3195148, 3124220, 3056436, 2991947, 2930997, 2874163, 2822131, 2775343, 2733679, 2696116, 2660955, 2627208, 2595899, 2569175, 2547695, 2529702, 2513275, 2498557, 2486697, 2477346, 2468877, 2460996, 2455507, 2454115]
53236B454115K676O083R370J2089J2885J2069J2137J4821J8993K2340K4002K4852
53224B626432K6116K8523L2045L5726L8330L9691M0834M2375M3662M3921M3393
53213C041048M2736M2045M1123L9990L8506L6193L3083K9997K7357K4446K0699
53202C417223J6942J4324J2569J0343P148L716N70k793p054j2074j7008k1052
53190C422854k3977k6236k8682l1867l5499l8758m1129m2996m5326m8676n2471
53179C007237n5437n7007n7852n8686n9047n8049n5937n3918n2595n1608n0739
53168B396362n0217m9714m8330m5970m3765m2565m2013m1492m1018m0702m0208
53157A910368l9239l7874l6069l3827l1959l1460l1745l1008k8767k6558k5364
$$ y = [2454115, 2456791, 2462874, 2472244, 2484333, 2497218, 2509287, 2521424, 2536245, 2555238, 2577578, 2601580, 2626432, 2652548, 2681071, 2713116, 2748842, 2787172, 2826863, 2867697, 2910072, 2953734, 2997655, 3041048, 3083784, 3125829, 3166952, 3206942, 3245448, 3281641, 3314724, 3344721, 3372078, 3396524, 3417223, 3434165, 3448489, 3461058, 3471401, 3478549, 3482265, 3482835, 3480042, 3472988, 3460914, 3443906, 3422854, 3398877, 3372641, 3343959, 3312092, 3276593, 3237835, 3196706, 3153710, 3108384, 3059708, 3007237, 2951800, 2894793, 2836941, 2778255, 2719208, 2661159, 2605222, 2551304, 2498709, 2447101, 2396362, 2346145, 2296431, 2248101, 2202131, 2158366, 2115801, 2073788, 2032296, 1991278, 1950576, 1910368, 1871129, 1833255, 1797186, 1763359, 1731400, 1699940, 1668195, 1637187, 1608420, 1581862, 1556498]
53146A556498k4255k2662k2010k3358k4975k4597k2988k2896k4908k6734k6660
53135A290455k5471k4524k3803k2761k1782k1763k2839k4157k4704k4118k3034
53124A031499k2589k3203k4085k4210k3435k2164k0611j9081j8359j8857j9825
53113G95080k0296k0366k0531k0278j8624j5871j3588j2810j3189j3911j4454
53102F11162j4452j3773j2843j2197j1680j0812r753r170r184r193q753p989p218
53089D74145o701o583o652o424n882n522n312m541l354l250m898o623o559n285
53075C96559m497l948j993J074K758J780l47j699k170k556l069l579m048m012
53061C70253k791q60K55L4l09P8K14j087l152m224l646k213p81N63K022L431M109
$$ y = [1556498, 1532243, 1509581, 1487571, 1464213, 1439238, 1414641, 1391653, 1368757, 1343849, 1317115, 1290455, 1264984, 1240460, 1216657, 1193896, 1172114, 1150351, 1127512, 1103355, 1078651, 1054533, 1031499, 1008910, 985707, 961622, 937412, 913977, 891813, 871202, 852121, 833762, 814905, 795080, 774784, 754418, 733887, 713609, 694985, 679114, 665526, 652716, 639527, 625616, 611162, 596710, 582937, 570094, 557897, 546217, 535405, 525652, 516482, 507298, 498105, 489352, 481363, 474145, 467444, 460861, 454209, 447785, 441903, 436381, 431069, 426528, 423174, 419924, 415026, 408403, 401844, 396559, 392062, 388114, 386121, 387195, 389953, 391733, 391386, 389687, 387517, 384961, 381892, 378313, 374265, 370253, 367462, 366602, 366857, 366891, 366582, 366660, 366874, 365787, 362635, 358411, 354765, 352552, 351771, 352334, 354356, 357787, 361896]
53044C61896L386J535P3L76J996L038K379P46m80p42m05j99p28j787k206j273
53028C67605j68q16l254n455o002n470m722l523j769p52j708l970n663n862n209
53013C13262m779n028n606n722n061m347m330m291k825l76O17j055l446m013k845
52998B60155j919j958j878r33J56M43o3o81q99p64r34k044l659m291l137j238
52982B36356j05K41Q11J673J762N67j166k629l751m436m133k804j600j678k615
52967B16493k749j196J002J964J024o80j652j654j547j797j866j247m31l65j246
52952B04053k334k841k592j921j224o89l15q1m8k16l66k68J10P36J688K794L425
52935A99911L125K400K203K629K759J797j16k153l265k542j47K148K433Q83l84
$$ y = [361896, 365282, 366817, 366890, 367266, 369262, 372300, 374679, 375425, 374945, 374203, 373798, 373599, 372871, 371084, 368878, 367605, 367437, 366621, 363367, 357912, 351910, 346440, 341718, 338195, 336426, 335674, 333966, 329996, 324333, 318471, 313262, 308483, 303455, 297849, 292127, 287066, 282719, 278389, 274098, 271273, 270897, 271514, 270459, 267013, 263000, 260155, 258236, 256278, 254400, 253467, 253623, 254066, 254003, 253322, 252423, 251659, 250725, 248681, 245022, 240731, 237594, 236356, 236251, 236492, 237303, 238976, 240738, 241305, 240139, 237510, 233759, 229323, 225190, 222386, 220786, 219108, 216493, 213744, 212548, 213550, 215514, 216538, 215858, 214206, 212552, 211005, 209208, 207342, 206095, 205664, 205299, 204053, 201719, 198878, 196286, 194365, 193141, 192452, 192137, 192056, 192008, 191792, 191426, 191158, 191268, 192004, 193692, 196486, 199911, 203036, 205436, 207639, 210268, 213027, 214824, 214708, 212555, 209290, 206748, 206601, 208749, 211182, 212065, 211681]
52920B11681OJ295K236K740L071K637J009o39n79J161K781K995K349K089K551
52905B37383L080L019K485K248K872L994M659M468M006M008M533N248N954O404
52891B94361O146N034L666K774K493K467K332J809P89l13q67j053j851l480m687
52876C09620m320k998k174k127j933j135l16p4n01j552k922l644k866j239m36
52861B81383r20j317n13O87P91k36j233j721k234k806k325j15K588L592K094n50
52845B77165k360k552j751j012r55j499k006j853j095m12k12j32L06R81J550K062
52829B66225K501K249R05n85q30K5L92m21j233r77l66n42r84j47K132M136M313
52812B76793K898J233K13k47o04r27o90O50K672L878L013O22j308j510q58j106
$$ y = [211681, 211687, 212982, 215218, 217958, 221029, 223666, 224675, 224036, 223457, 224618, 227399, 230394, 232743, 234832, 237383, 240463, 243482, 245967, 248215, 251087, 255081, 259740, 264208, 268214, 272222, 276755, 282003, 287957, 294361, 300507, 305541, 309207, 311981, 314474, 316941, 319273, 321082, 321871, 321558, 320691, 319638, 317787, 314307, 309620, 305300, 302302, 300128, 298001, 296068, 294933, 294617, 294543, 294042, 292490, 289568, 285924, 283058, 281819, 281383, 280463, 279146, 278633, 279320, 280111, 279875, 278642, 276921, 274687, 271881, 269556, 269441, 272029, 275621, 277715, 277165, 274805, 272253, 270502, 269490, 268535, 267036, 265030, 263177, 262082, 261670, 261458, 261326, 261632, 262613, 264163, 266225, 268726, 270975, 271880, 271295, 270465, 270490, 270882, 270461, 269228, 268251, 267885, 267343, 266359, 266212, 268344, 272480, 276793, 279691, 280924, 281137, 280890, 280286, 279359, 278669, 279319, 281991, 285869, 288882, 289504, 288196, 286686, 285828, 284722]
52796B84722k343k682q50J701K323O26r22k04J998L474L490K966K504J835J100
52781B99738J150K267L750M998O024O632O184M533K437O70m79o77M65K510M151
52766C44353M421L442J853K46q50j314j801k890m023m363m465n481o844o655m659
52751C10970k880k635k933k716k701l610m451m169l572l863m534m389l616l067
52737B61834k547j606j188k485m666n611m623k867j457o54o16j331j939j596q71
52722B27777r96j957k678k815k946l123k768j983j630j958k381k502k360j860
52708A95820j057p17j382k233k148j416j080j021n45l29j715m001m693k964r38
52693A69581p33j954k925k978k506j860j295j197j609k068k262k226j805p83L13
$$ y = [284722, 282379, 279697, 278847, 280548, 282871, 283497, 282575, 282371, 284369, 287843, 291333, 294299, 296803, 298638, 299738, 300888, 303155, 306905, 311903, 317927, 324559, 330743, 335276, 337713, 338383, 337904, 337227, 337692, 340202, 344353, 348774, 352216, 354069, 354315, 353465, 352151, 350350, 347460, 343437, 339074, 334609, 329128, 322284, 315629, 310970, 308090, 305455, 302522, 299806, 297105, 293495, 289044, 284875, 281303, 277440, 272906, 268517, 264901, 261834, 259287, 257681, 256493, 254008, 249342, 243731, 239108, 236241, 234784, 234130, 233514, 232183, 230244, 228648, 227777, 226781, 224824, 222146, 219331, 216385, 213262, 210494, 208511, 206881, 204923, 202542, 200040, 197680, 195820, 194763, 194046, 192664, 190431, 188283, 186867, 185787, 184766, 184221, 183892, 182177, 178176, 173483, 170519, 169581, 168848, 166894, 163969, 160991, 158485, 156625, 155330, 154133, 152524, 150456, 148194, 145968, 144163, 143380, 143693]
52678A43693O22K82K90Q87J301J222J118Q88l28k374l687l389k447j883j245N1
52662A35001J091O00j030k137j848o53N88J311J188L12o71j214j437j670j725
52647A27706j276n51j09p9j82k70l99n46o33q15j300j863j749l30K115M400N461
52630A29580N341M851M310L476K674K906M163M845L878K344J827K115K048J808
52616A76166K353L180K825J424N99O88K89j125k301k536k750l514m041m041m469
52601A62747n328m922k689q05j134k339k162r77q34j936k519j754n91J35M59K25
52585A35576r32k349k708k003j685k534l542l412k119m32J166K462K916J934j48
52570A22190j770j288J220L609L783K081P45R18J376P37m61r44q52j268k190k460
$$ y = [143693, 144315, 144597, 144887, 145774, 147075, 148297, 149415, 150303, 149975, 147601, 143914, 140525, 138078, 136195, 134950, 135001, 136092, 136692, 135662, 133525, 131677, 131024, 131612, 132923, 134111, 134423, 133752, 132538, 131101, 129431, 127706, 126430, 125879, 125770, 125691, 125509, 125239, 124840, 124294, 123661, 122846, 121546, 119683, 117934, 117604, 119719, 124119, 129580, 134921, 139772, 144082, 147558, 150232, 153138, 157301, 162146, 166024, 168368, 170195, 172310, 174358, 176166, 178519, 181699, 184524, 185948, 186547, 187235, 187524, 186399, 184098, 181562, 178812, 175298, 171257, 167216, 162747, 157419, 152497, 149808, 149003, 147869, 145530, 143368, 142391, 141557, 139621, 137102, 135348, 134757, 134892, 135351, 135576, 134644, 132295, 129587, 127584, 125899, 123365, 119823, 116411, 114292, 113860, 115026, 117488, 120404, 122338, 122190, 120420, 119132, 120352, 123961, 127744, 129825, 130570, 131488, 132864, 133601, 133140, 132196, 131344, 130076, 127886, 125426]
52554A25426j595m07K99O57J147J785K187K038J393P01L70L25K87M93J229J631
52538A37966K62k532m168k880r2J558J590J447J680J380L36k47L34J095P85m03
52522A38111j168n06J568M157O054O581N962M689K902R74Q4J073K882L326J752
52507A78441j40n01M70J125N74l61l54P51J690J329K46J57J665L285L395K343
52491A94115J745K152K635K558K489K986L466K964J514J58k56N8K03l10j014j086
52475B14377k99Q81J997K730K549J153n39q57O99K859M273M768M331K318j135
52460B40105m010m314k458n28K26o0j079k461l144k357r83m72o44j59J034J424
52444B20120L18j161j783j568j112q44j088j700j622j47J511J547L70J53J368
$$ y = [125426, 123831, 123424, 123723, 124380, 125527, 127312, 129499, 131537, 132930, 133631, 134001, 134326, 134613, 135106, 136335, 137966, 138228, 135696, 131528, 128648, 128556, 130114, 131704, 133151, 134831, 136211, 136547, 136300, 136634, 137729, 138514, 138111, 136943, 136437, 138005, 142162, 148216, 154797, 160759, 165448, 168350, 169324, 169408, 170481, 173363, 176689, 178441, 178301, 177800, 178270, 179395, 179969, 179608, 179254, 180005, 181695, 183024, 183270, 183427, 185092, 188377, 191772, 194115, 195860, 198012, 200647, 203205, 205694, 208680, 212146, 215110, 216624, 216782, 216526, 216584, 216787, 216477, 215463, 214377, 214078, 214959, 216956, 219686, 222235, 223388, 222849, 221992, 222691, 225550, 229823, 234591, 238922, 241240, 240105, 236095, 231781, 229323, 228795, 229021, 228961, 227882, 225421, 222277, 219920, 218937, 218465, 217821, 217662, 218696, 220120, 220438, 219277, 217494, 215926, 214814, 213970, 212882, 211182, 209560, 209413, 210924, 212471, 212841, 212994, 214362]
52429B14362K036J094K72J302L221L954L092J594kj367j527L9K067K846K404J977
52413B37364J917J543P26J17j00m37j042j439j296p48K3Q47J348J308J038R25
52397B42094R60J127J589K031J645N51K01J304K265J214j143k365j575k11L83
52382B50070M00M44N66Q36J483K023J536K27n36j98K56M8k20Q8N05N22O97J606
52364B60353K615K807K348J805R01p87k461k858k049j193q13n02k12l95p94n51
52348B58214K08K12j006k151j841l31J133J794J471R1j831k892k059MJ687K268
52332B54971K222K088J972J968K132K055J354N14L95R89J535J804K194K483J915
52317B80591P77M84J420K068J334M92J359L480M784M549L930L722L433K832K665
$$ y = [214362, 216398, 217492, 217764, 219066, 222287, 226241, 229333, 230927, 230925, 229558, 228031, 228070, 230137, 232983, 235387, 237364, 239281, 240824, 241550, 241667, 241567, 241130, 240088, 238649, 237353, 236605, 236628, 237475, 238823, 240131, 241169, 242094, 243054, 244181, 245770, 247801, 249446, 249997, 250198, 251502, 253767, 254981, 253838, 251473, 249898, 249687, 250070, 250470, 250914, 251480, 252316, 253799, 255822, 257358, 257585, 257049, 256851, 257107, 257155, 256935, 257023, 257528, 258050, 258747, 260353, 262968, 265775, 268123, 269928, 270829, 270042, 267581, 264723, 262674, 261481, 260668, 260166, 259954, 259559, 258765, 258214, 258422, 258634, 257628, 255477, 253636, 253305, 254438, 256232, 257703, 257794, 255963, 253071, 251012, 251016, 252703, 254971, 257193, 259281, 261253, 263221, 265353, 267408, 268762, 269276, 269671, 270660, 272195, 273999, 276193, 278676, 280591, 281368, 281852, 283272, 285340, 286674, 287166, 288525, 292005, 296789, 301338, 305268, 308990, 312423, 315255, 317920]
52302C17920L231L717L738M150N308N839M637L102L487N479O250M316J606Q82
52288C73662K362L967M175L340K523K189K364L068M102M821M778M296M031M010
52274D23688L675K875K223K227K568K777L289M861O881P324N152K139J222L131
52260D74032N708O690O112N416N317N481N740O290O850O801O356O577P925R618
52246E64913J0795J1356J1307J0425R297R659J2392J5768J7117J6051J4758J5100
52234G18938J6691J8140J8953J9533K0158K0743K1233K1603K1718K1473K0896
52223I40079K0073J9326J9369K0533K1846K1709J9941J8312J8489K0033K1070
52212A160780K0461J8720J7032J5948J5054J3649J1796J0463J0288J0335R017
$$ y = [317920, 321151, 324868, 328606, 332756, 338064, 343903, 348540, 351642, 355129, 360608, 366858, 371174, 372780, 373662, 376024, 379991, 384166, 387506, 390029, 392218, 394582, 397650, 401752, 406573, 411351, 415647, 419678, 423688, 427363, 430238, 432461, 434688, 437256, 440033, 443322, 448183, 455064, 462388, 467540, 469679, 470901, 474032, 479740, 486430, 492542, 497958, 503275, 508756, 514496, 520786, 527636, 534437, 540793, 547370, 555295, 564913, 575708, 587064, 598371, 608796, 618093, 627752, 640144, 655912, 673029, 689080, 703838, 718938, 735629, 753769, 772722, 792255, 812413, 833156, 854389, 875992, 897710, 919183, 940079, 960152, 979478, 998847, 1019380, 1041226, 1062935, 1082876, 1101188, 1119677, 1139710, 1160780, 1181241, 1199961, 1216993, 1232941, 1247995, 1261644, 1273440, 1283903, 1294191, 1304526, 1313543]
52201A313543O337M158L862M620M677L452J606j26j299j577j120o61m43K62J761
52186A339052K786J949j31j477j110M28K588N262P746Q812Q327P699Q088R127
52172A399146R836R955R918J0132J0720J1438J1701J1292J1079J2048J3485J3324
52160A534074J0813P664N767M819L337J200k83m55k1K80M35K46j085l661o173
52145A556957p388p785q661j0015j0715j0732j1614j3908j5455j3771r487n841
52133A431585m913n880p091q147r253j0035j0095r713q933p032m045j868k268
52120A342312m261n066l487j042K87M0j128k550l680m049l568k566j486q51j275
52105A307630k758m305n009n230n723o103n393l919l148l516l818l098j953j433
$$ y = [1313543, 1319880, 1324038, 1327900, 1332520, 1337197, 1340649, 1342255, 1342129, 1340830, 1339253, 1338133, 1337472, 1337029, 1337291, 1339052, 1341838, 1343787, 1343656, 1342179, 1341069, 1341497, 1344085, 1349347, 1357093, 1365905, 1374232, 1381931, 1390019, 1399146, 1408982, 1418937, 1428855, 1438987, 1449707, 1461145, 1472846, 1484138, 1495217, 1507265, 1520750, 1534074, 1544887, 1552551, 1558318, 1563137, 1566474, 1567674, 1567391, 1566936, 1566915, 1567195, 1567630, 1567876, 1566791, 1563130, 1556957, 1549569, 1541784, 1533123, 1523108, 1512393, 1501661, 1490047, 1476139, 1460684, 1446913, 1437426, 1431585, 1426672, 1420792, 1413701, 1405554, 1396301, 1386266, 1376171, 1366458, 1357525, 1350493, 1346448, 1344580, 1342312, 1338051, 1332985, 1329498, 1328456, 1328743, 1328783, 1327655, 1325105, 1321425, 1317376, 1313808, 1311242, 1309756, 1308905, 1307630, 1304872, 1300567, 1295558, 1290328, 1284605, 1278502, 1273109, 1269190, 1266042, 1262526, 1258708, 1255610, 1253657, 1252224]
52091A252224j702k232k521k278j763j946l418n146n592m977m853n352m810k855
52077A202779j709l067n470o444n869n239m760l485j916k033m378o969p820p124
52063A136496o158n265l923k227j173j462k640l568l510k634j582p20M0P75J315
52048A103764J514J591K027L157M889O651P811Q413R329J1112J3061J4039J4182
52035A201540J4778J6372J7904J8269J7816J7821J8957K0826K2490K3148K2880
52024A412801K2901K4354K6491K7117K5423K3281K2711K2981K1628J7980J4130
52013A661798J2249J2086J1646R681O817M513L426L051K694K257J803Q32j162
52000A731691l655n424o038o174o309o088n368m977n720p287q658r047q085n893
$$ y = [1252224, 1250522, 1248290, 1245769, 1243491, 1241728, 1239782, 1236364, 1231218, 1225626, 1220649, 1215796, 1210444, 1205634, 1202779, 1201070, 1198003, 1192533, 1186089, 1180220, 1174981, 1170221, 1166736, 1164820, 1162787, 1158409, 1151440, 1143620, 1136496, 1130338, 1125073, 1121150, 1118923, 1117750, 1116288, 1113648, 1110080, 1106570, 1103936, 1102354, 1101634, 1101674, 1102449, 1103764, 1105278, 1106869, 1108896, 1112053, 1116942, 1123593, 1131404, 1139817, 1149146, 1160258, 1173319, 1187358, 1201540, 1216318, 1232690, 1250594, 1268863, 1286679, 1304500, 1323457, 1344283, 1366773, 1389921, 1412801, 1435702, 1460056, 1486547, 1513664, 1539087, 1562368, 1585079, 1608060, 1629688, 1647668, 1661798, 1674047, 1686133, 1697779, 1707460, 1714277, 1718790, 1722216, 1725267, 1727961, 1730218, 1732021, 1732853, 1731691, 1728036, 1722612, 1716574, 1710400, 1704091, 1698003, 1692635, 1687658, 1681938, 1674651, 1665993, 1656946, 1648861, 1642968]
51986A642968l543k564l234l964l111q91J061J629J121Q20J885M157N857N367
51972A647558L590L188M973O615N918L770K398K108J690R83Q67J203Q73j53p18
51957A684863o20j147l055n540p552q966j0141j1348j2960j5042j6628j6554j5283
51944A560027j4687j5703j7392j8757k0177k2316k4568k5663k5415k5017k5724
51933A324608k7540k9214k9542k8676k7894k7873k7857k7174k6695k7586k9091
51922A015466k9163k7225k4944k3884k3741k3353k2321k1045k0013j9593j9863
51911G60321k0286k0144j9461j8817j8264j7299j5883j4485j3149j1598j0278
51900E80657j0011j0369r920q404p261p412p960p796p136o576n981n276n088n572
$$ y = [1642968, 1639425, 1636861, 1633627, 1629663, 1626552, 1625661, 1626722, 1628351, 1629472, 1630292, 1632177, 1636334, 1642191, 1647558, 1651148, 1654336, 1659309, 1665924, 1671842, 1675612, 1678010, 1680118, 1681808, 1682791, 1683658, 1684861, 1685734, 1685581, 1684863, 1684243, 1683096, 1680041, 1674501, 1666949, 1657983, 1647842, 1636494, 1623534, 1608492, 1591864, 1575310, 1560027, 1545340, 1529637, 1512245, 1493488, 1473311, 1450995, 1426427, 1400764, 1375349, 1350332, 1324608, 1297068, 1267854, 1238312, 1209636, 1181742, 1153869, 1126012, 1098838, 1072143, 1044557, 1015466, 986303, 959078, 934134, 910250, 886509, 863156, 840835, 819790, 799777, 780184, 760321, 740035, 719891, 700430, 681613, 663349, 646050, 630167, 615682, 602533, 590935, 580657, 570646, 560277, 550357, 541953, 534692, 527280, 519320, 511524, 504388, 497812, 491831, 486555, 481467, 475895]
51886D75895n772n216m857n218n033l343j609j678k736k611j520j840m060n709
51872D24693n156m120m960p086p858o149l445j728j531k019k105j343k92N6n67
51857C76390j321j389j115j497k820m374n360n514m895l728k566k096k354k530
51843C34831j836m50P00R71M75m37j651k951l584k842j186l1k1j40P79K015J631
51826C26273p87l262l862k978k201j907j350p32j230k718l210j490J021K227K097
51811C05891K107K671K830K100J054M8j047j743j148K35N51p43j752p44J346K325
51795C13981J779J212J736L084M572N619N372L281L60j220l62J838L443L553K506
51780C50754R83n08j554j811j232k50M22M35K87Q31K158L377L587K653Q72j176
$$ y = [475895, 470123, 464907, 460050, 454832, 449799, 446456, 444847, 443169, 440433, 437822, 436302, 434462, 430402, 424693, 419537, 415417, 410457, 403371, 395513, 389364, 385919, 384191, 382660, 380641, 378536, 377193, 376901, 376957, 376390, 375069, 373680, 372565, 371068, 368248, 363874, 358514, 353000, 348105, 344377, 341811, 339715, 337361, 334831, 332995, 332545, 333245, 334216, 334691, 334254, 332603, 329652, 326068, 323226, 322040, 322009, 321988, 321848, 322627, 324642, 326273, 325486, 322224, 318362, 315384, 313183, 311276, 309926, 309194, 307964, 305246, 302036, 300546, 301567, 303794, 305891, 307998, 310669, 313499, 315599, 316653, 316701, 315654, 313911, 312763, 312998, 313549, 312806, 311054, 310310, 311656, 313981, 315760, 316972, 318708, 321792, 326364, 331983, 337355, 340636, 340996, 339776, 339414, 341252, 344695, 348248, 350754, 351737, 351229, 349675, 347864, 346632, 346382, 346804, 347239, 347526, 348357, 350515, 353892, 357479, 360132, 361004, 359828]
51764C59828k218q22K621N384N095K578P35Q96J652J245j93j303j425j161j371
51749C71541k027k168j163J49K48q33j197L12K205K342R33K0M47J124J028K98
51733C73259p04j784k254j375K46J240J664K912N182O743O444N234M346L507K103
51718D06763P33K62K25m49j656k164j233O01K161K707K652L223M899O357N925
51703D31006L838J807N69m03p75P05L555N196M452L298L590M227L560K630L445
51688D70700N298N627L852J748M17o02j255o35P40O69j791m715n613m040j289
51673D69111J194K380J765j40k054l193l693l644k641o70J306K207J725J72j864
51658D61961l433l674k771j955k138l040l828m127m144m284m802n392n107l375
$$ y = [359828, 357610, 356788, 359409, 364793, 369888, 372466, 373201, 374097, 375749, 376994, 376801, 375498, 374073, 372912, 371541, 369514, 367346, 366183, 366332, 366580, 365747, 364550, 364862, 367067, 369409, 370342, 370362, 370809, 371933, 372961, 373259, 372555, 370771, 368517, 367142, 367388, 368628, 370292, 373204, 378386, 385129, 391573, 396807, 401153, 404660, 406763, 407496, 407758, 407983, 407534, 405878, 403714, 402481, 403082, 405243, 407950, 410602, 413825, 418724, 425081, 431006, 434844, 436651, 437220, 436817, 436042, 436747, 440302, 445498, 449950, 453248, 456838, 461065, 464625, 467255, 470700, 475998, 481625, 485477, 487225, 487642, 487040, 485785, 485150, 485890, 486559, 484768, 480053, 474440, 470400, 469111, 470305, 472685, 474450, 474310, 472256, 469063, 465370, 461726, 459085, 458415, 459721, 461928, 463653, 463825, 461961, 458528, 454854, 452083, 450128, 447990, 444950, 441122, 436995, 432851, 428567, 423765, 418373, 413266, 409891]
51644D09891j001N14P48N88O08K59r62k420l076k735k002j422j196j232r91K16
51628C95787K195L524L023J437Q61K330M714O194O297N848N421M778L931L655
51614D49995M205M351K862O62K6J460K837K228L09j153k028l550n895p648p742
51599D40919o696n716n415n658n968n858n284m757m625m523m100l796m122m478
51585C69923l863k627k313l469m714m505l020j716j571k265k846k786k408k293
51571C29527k329j795n60M40N29L28O06P23m83k589l802l367k350j838j596r69
51555C10475JQ82J407J374P62J86L23P75O15J93R14K790L845K885J394J324K243
51538C32388K388J681J858L619N525O076N535N082N167N535O212P530R256J0423
$$ y = [409891, 408890, 409404, 410152, 410740, 411348, 411607, 410645, 408225, 405149, 402414, 400412, 398990, 397794, 396562, 395571, 395787, 397982, 401506, 404529, 405966, 406827, 409157, 413871, 420065, 426362, 432210, 437631, 442409, 446340, 449995, 454200, 458551, 461413, 462075, 462101, 463561, 466398, 468626, 468935, 467782, 465754, 462204, 456309, 448661, 440919, 434223, 428507, 423092, 417434, 411466, 405608, 400324, 395567, 390942, 386419, 382319, 378523, 374401, 369923, 366060, 363433, 361120, 357651, 352937, 348432, 345412, 343696, 342125, 339860, 337014, 334228, 331820, 329527, 327198, 325403, 324843, 325283, 325812, 326140, 326746, 327469, 326986, 324397, 320595, 317228, 314878, 313040, 311444, 310475, 310476, 311358, 312765, 314139, 314901, 315087, 315410, 316185, 316800, 316993, 317907, 320697, 324542, 327427, 328821, 330145, 332388, 334776, 336457, 338315, 341934, 347459, 353535, 359070, 364152, 369319, 374854, 381066, 388596, 397852, 408275]
51524D08275J0330R336Q300P456O383N143M619N206N761M666J764j508l676m139
51510D67916k879m51J662J985P81j74J5L59j18n78L93K584M372M777M332L972
51494D88948L894L650L012K533L225N294P418P896O560M701L159J584j41j144
51480E40589r59m84n63o78j37N27N49M24R62J635J404N86L81R11J299J398J690
51463E49534J713M09j813l142k904k326k327k356k133k729m615o193n844m301
51449E10973l439l480l138k079j403j739k360k589k694k875k533j357k24j36p75
51434D80152j007o09m88j194k076k211j520m77O43J585J576N4j998k528o77K131
51418D71356M016M855N800P148P854P177N711M440L690L424L832M969O299P167
$$ y = [408275, 418605, 427941, 436241, 443697, 450080, 455223, 459842, 465048, 470809, 475475, 477239, 475731, 472055, 467916, 465037, 464586, 466248, 468233, 469014, 468840, 468855, 469214, 469096, 468518, 468911, 471495, 475867, 480644, 484976, 488948, 492842, 496492, 499504, 502037, 505262, 510556, 517974, 525870, 532430, 537131, 540290, 541874, 541733, 540589, 539630, 539146, 538583, 537905, 537768, 538295, 538844, 539268, 540230, 541865, 543269, 543855, 544236, 545147, 546446, 547844, 549534, 551247, 551656, 549843, 546701, 543797, 541471, 539144, 536788, 534655, 531926, 527311, 521118, 515274, 510973, 507534, 504054, 500916, 498837, 497434, 495695, 493335, 490746, 488052, 485177, 482644, 481287, 481063, 480927, 480152, 479145, 478536, 478048, 476854, 474778, 472567, 471047, 470570, 471213, 472798, 474374, 474428, 472430, 469902, 469225, 471356, 475372, 480227, 486027, 493175, 501029, 508206, 513917, 518357, 522047, 525471, 529303, 534272, 540571, 547738]
51404E47738P509P618P515P060O462O136O118N960N258L935K100n7k134l525l698
51389F03995k556o70Q54J074J6j328j971j789j403j420k018l023m124n064n859
51374E74714o743p801q846r670j0199j0286r693q542p375o431n356l971l060l591
51360D73150n344o816o607m613j992k72k17j027q80J137L867N417N370M750M147
51345D70070L241K259K309L588M539L831K058L32j703m954q645j0879j1220j1042
51331D43784j1133j0692r192p625p032p043o876o746p167p664p487p070p479q573
51317C32005q907p661n651m236l856m040m265m436m676m922m747l669j839j28
51303B68972O22K94o56j688k301k235j978k544m150n484n037k883n37O99O12k90
$$ y = [547738, 555247, 562865, 570380, 577440, 583902, 590038, 596156, 602116, 607374, 611309, 613409, 613352, 611218, 607693, 603995, 601439, 600769, 601623, 602697, 602713, 601385, 599414, 597625, 596222, 594802, 592784, 589761, 585637, 580573, 574714, 567971, 560170, 551324, 541654, 531455, 521169, 511476, 502934, 495559, 489128, 483772, 479801, 476741, 473150, 467806, 460990, 454383, 449770, 447778, 447506, 447289, 446262, 445382, 446519, 450386, 455803, 461173, 465923, 470070, 473311, 475570, 477879, 481467, 486006, 489837, 491895, 492227, 490524, 485570, 476925, 466046, 454826, 443784, 432651, 421959, 412767, 405142, 398110, 391067, 384191, 377445, 370278, 362614, 355127, 348057, 340578, 332005, 323098, 315437, 309786, 305550, 301694, 297654, 293389, 288953, 284277, 279355, 274608, 270939, 269100, 268972, 269594, 269888, 269232, 267544, 265243, 263008, 261030, 258486, 254336, 248852, 243815, 240932, 240395, 241094, 241706, 241416]
51287B41416j130r44M53J978K522K495L074M154M349L177J837J381J460J497J830
51272B69549K727L379L023K343K574L724M749N205N623O394P202P526P072N787
51258C36877M067K754K280K060J273p0j455k840m421n684n894n376n294n981o501
51243C05795o185n680n951o913p499o727m544k013p02j291k764l605l677m015
51229B44229m837m980l733j982q91n38o10j239k097j861p2J364L68k074k928j301
51213B16818M19J00j394k044j557r83o70k52m5p63j969k211r16R99K454L289L734
51196B15009L747L201K145N49j561l557m408l763k391j295q74j084j805k750l409
51181A97754l444k819j481M14J999K236J269L89L56O26P76J415K717L105R54k726
$$ y = [241416, 240286, 239342, 239795, 241773, 244295, 246790, 249864, 254018, 258367, 261544, 263381, 264762, 266222, 267719, 269549, 272276, 275655, 278678, 281021, 283595, 287319, 292068, 297273, 302896, 309290, 316492, 324018, 331090, 336877, 340944, 343698, 345978, 348038, 349311, 349241, 347786, 344946, 340525, 334841, 328947, 323571, 318277, 312296, 305795, 299610, 293930, 287979, 281066, 273567, 266840, 262296, 260283, 259581, 258290, 255526, 251921, 248244, 244229, 239392, 234412, 230679, 228697, 227806, 227268, 226658, 225419, 223322, 221461, 221389, 222753, 223121, 221047, 218119, 216818, 217237, 217337, 215943, 213899, 212342, 211359, 210689, 210437, 210392, 209629, 207660, 205449, 204533, 205532, 207986, 211275, 215009, 218756, 221957, 224102, 224651, 223090, 219533, 215125, 211362, 208971, 207676, 206802, 205718, 203913, 201163, 197754, 194310, 191491, 190010, 190424, 192423, 194659, 195928, 196317, 196673, 197299, 198075, 199490, 202207, 205312, 206266, 203540]
51165B03540m898l798n52K609M468M891M022K260M33p31j131j122j054j142j395
51150B06400j480j025o4J033K003K614K437J315O7n3J252L020M188M414L794K587
51134B32502J351N38r6r37j370l12J854L175K563J236Q12J076P91q6m08K38R82
51117B43909J076Q05P41R11R43N80j12p39q23m34l34j081k096k257j343m05o31
51100B38710k177m000m638l374j019P71J168P80K99n64k033l046k441r26l53j122
51084B16035j811j631j472j858j507P03L494M562L643K578K481K529J829J075
51070B30650J260J836J356l33j749j735r09o40j218j664j229m65n87j984l642
51055B18947m105l039j696j573k646l392k710j330o03m81L30K175L647L438K103
$$ y = [203540, 198642, 194844, 194292, 196901, 201369, 206260, 210282, 212542, 212975, 212244, 211113, 209991, 208937, 207795, 206400, 204920, 203895, 203831, 204864, 206867, 209481, 211918, 213233, 213300, 213247, 214499, 217519, 221707, 226121, 229915, 232502, 233853, 234391, 234295, 233358, 231988, 231676, 233530, 236705, 239268, 240504, 241316, 242392, 243183, 243097, 242689, 242927, 243909, 244985, 245790, 246531, 247442, 248385, 248965, 248853, 248114, 247291, 246857, 246523, 245442, 243346, 241089, 239746, 239341, 238710, 236533, 232533, 227895, 224521, 223502, 224273, 225441, 226221, 226520, 225956, 223923, 220877, 218436, 217510, 217157, 216035, 214224, 212593, 211121, 209263, 207756, 208459, 211953, 216515, 220158, 222736, 225217, 227746, 229575, 230650, 231910, 233746, 235102, 234769, 233020, 231285, 230376, 229736, 228518, 226854, 225625, 225160, 224573, 222589, 218947, 214842, 211803, 210107, 208534, 205888, 202496, 199786, 198456, 197853, 197372, 197702, 199877, 203524, 206962, 209065]
51040B09065J127R31O77j31r13q98n3J045J758J730J181Q96J458K379K532J535
51024B24319K69j79L51J237J879K054J866J759K294L507M525M290K679O93m72
51009B51071m04M49J360J871K009K108K419K803K783K048Q33k51p44o50k67J45
50993B67583N10R25J556K335K833K592J657N14m69j167j199q4J745K752J924R7
50977B84104j119j311j192j019m36J57k94j589j970n50J247J652R17M98P43Q87
50961B80725P49R71J651K162K378K863L670M013L473K560J757R23J76M64K486
50946C11021N451P635Q019O961N420M066L233L332M693O819Q315Q214P273P156
50932C97608Q216R129R129R442J1387J4038J5253J4563J3513J3277J3629J4317
$$ y = [209065, 210192, 211123, 211800, 211669, 210756, 209858, 209805, 210850, 212608, 214338, 215519, 216415, 217873, 220252, 222784, 224319, 224588, 224409, 224760, 225997, 227876, 229930, 231796, 233555, 235849, 239356, 243881, 248171, 250850, 251543, 251071, 250667, 251116, 252476, 254347, 256356, 258464, 260883, 263686, 266469, 268517, 269350, 269099, 268355, 267705, 267438, 267583, 268093, 269018, 270574, 272909, 275742, 278334, 279991, 280505, 280036, 278869, 277670, 277586, 279331, 282083, 284007, 284104, 282985, 281674, 280482, 279463, 279027, 279184, 278890, 277301, 275331, 274781, 276028, 277680, 278597, 279095, 279838, 280725, 281474, 282445, 284096, 286258, 288636, 291499, 295169, 299182, 302655, 305215, 306972, 307895, 308071, 308535, 311021, 316472, 324107, 332126, 339087, 344507, 348573, 351806, 355138, 359831, 366650, 374965, 383179, 390452, 397608, 405824, 414953, 424082, 433524, 444911, 458949, 474202, 488765, 502278, 515555, 529184, 543501]
50920E43501J5773J7885J9602K0646K2258K5154K7897K8744K8309K8927L1650
50909H10346L5293L8504M1402M4724M8433N1900N4902N7768O0715O3515O5788
50898A373290O7345O8237O8593O8420O7480O5503O2475N8576N3821M8076M1621
50887B043437L5384L0070K5192J9593J3041O671J487k782o606r215r542q403q106
50874B130221r569j1271j1727j1582j2231j3800j5945j9516k5296l1592l5466
50863A932226l6603l8010m2055m7603n1995n4320n5346n5470n4484n2921n1823
50852A391596n1075m9310m5918m2046l9024l6599l3613k9902k6456k3725k0921
50841I93007j7478j4286j2438j1312r231o055l609l065l235k444r66k14l44j37
$$ y = [543501, 559274, 577159, 596761, 617407, 639665, 664819, 692716, 721460, 749769, 778696, 810346, 845639, 884143, 925545, 970269, 1018702, 1070602, 1125504, 1183272, 1243987, 1307502, 1373290, 1440635, 1508872, 1577465, 1645885, 1713365, 1778868, 1841343, 1899919, 1953740, 2001816, 2043437, 2078821, 2108891, 2134083, 2153676, 2166717, 2173388, 2174875, 2172093, 2165487, 2156272, 2146730, 2138327, 2130221, 2120652, 2109381, 2097654, 2086072, 2073841, 2060041, 2044096, 2024580, 1999284, 1967692, 1932226, 1895623, 1857613, 1815558, 1767955, 1715960, 1661640, 1606294, 1550824, 1496340, 1443419, 1391596, 1340521, 1291211, 1245293, 1203247, 1164223, 1127624, 1094011, 1064109, 1037653, 1013928, 993007, 975529, 961243, 948805, 937493, 928262, 922207, 918598, 915533, 912298, 909854, 908888, 908674, 908330, 908193]
50827I08193J023K539L868N100O165O682O766O992P440P753Q136R107J0368J1190
50813A001322J1986J3863J6345J7343J6168J4983J6035J8740K0986K2312K4243
50802A194326K7779L2011L5410L7599L9610M2860M7836N3773N9649O5296P1081
50791A707230P6838Q2168Q7687R4611J02900J11205J18988J27101J35585J42685
50781B786998J47191J50128J52646J53734J51756J46971J40473J31668J19190
50772D080755J03816Q8061P2885N6987L9741K2762P963m204j3819k0528k4365
50761D410054k6270k6768k5283k1600j7152j3856j2451j2826j5262k0351k8041
50750D190194l7531m7941n8475o8486p8012q7882r8459j08486j15958j20147j22044
$$ y = [908193, 909216, 911755, 915623, 920723, 926888, 933570, 940336, 947328, 954768, 962521, 970657, 979764, 990132, 1001322, 1013308, 1027171, 1043516, 1060859, 1077027, 1092010, 1108045, 1126785, 1147771, 1170083, 1194326, 1222105, 1254116, 1289526, 1327125, 1366735, 1409595, 1457431, 1511204, 1570853, 1636149, 1707230, 1784068, 1866236, 1953923, 2048534, 2151434, 2262639, 2381627, 2508728, 2644313, 2786998, 2934189, 3084317, 3236963, 3390697, 3542453, 3689424, 3829897, 3961565, 4080755, 4184571, 4272632, 4345517, 4402504, 4442245, 4465007, 4472970, 4468766, 4454947, 4434419, 4410054, 4383784, 4357016, 4331733, 4310133, 4292981, 4279125, 4266674, 4253848, 4238586, 4218235, 4190194, 4152663, 4104722, 4046247, 3977761, 3899749, 3811867, 3713408, 3604922, 3488964, 3368817, 3246773]
50739C246773j22676j21616j17601j10326j01070r1584q2722p4278o5719n6651
50729B302530m6910l6831k7387j9415j2542n613J591P850J2198J5234J7988K0184
50717B228877K0806J9863J8431J6900J4361J0026M482p90m729p464j0178j4105
50705B296480j9115k3473k5563k5714k5681k6568k8063k9457l0376l0559k9784
50694B002127k8239k6202k3531k0206j7077j4953j3021r711n132j151J439M063
50682A848406P966J2203J5395J8128K2012K7141L2208L6790M1900M8183N5042
50671B165374O1836O8791P6028Q2604Q7294R0111R2275R4691R6658R6398R2776
50660C104836Q6371P8697P0556O1560N1125L9342K6746J3743O70j1948k3478l3164
$$ y = [3246773, 3124097, 3002481, 2884880, 2774554, 2673484, 2581900, 2499178, 2424900, 2359181, 2302530, 2255620, 2218789, 2191402, 2171987, 2159445, 2153832, 2155423, 2163273, 2175471, 2190705, 2208693, 2228877, 2249683, 2269546, 2287977, 2304877, 2319238, 2329264, 2333746, 2332956, 2328227, 2320763, 2310585, 2296480, 2277365, 2253892, 2228329, 2202615, 2176934, 2150366, 2122303, 2092846, 2062470, 2031911, 2002127, 1973888, 1947686, 1924155, 1903949, 1886872, 1871919, 1858898, 1849187, 1844055, 1842904, 1844343, 1848406, 1856372, 1868575, 1883970, 1902098, 1924110, 1951251, 1983459, 2020249, 2062149, 2110332, 2165374, 2227210, 2296001, 2372029, 2454633, 2541927, 2632038, 2724313, 2819004, 2915662, 3012060, 3104836, 3191207, 3269904, 3340460, 3402020, 3453145, 3492487, 3519233, 3532976, 3533646, 3521698, 3498220, 3465056]
50648C465056m0111m3817m4843m4245m2222l8285l3021k8383k5330k2405j7999
50637C084395j3186j0743j1800j5196j9910k6291l4370m2710m9738n5043n8521
50626B746887n9561n8160n5838n4016n1950m7714m1005l3640k7110k1060j4527
50615B282306p563o82O500J4929K4606L4302M3026N1096N9376O7867P5507Q1225
50603B732495Q4874Q7089Q8506Q9077Q7972Q4313P8219P1124O4622N8885N2766
50592C579942M5711L8974L4199L1254K8313K4058J8862J3725R104N319L014K268
50580C834743J995J293R41K342N406Q884J2611J7569K3360K7378K7798K6027K4751
50567D015098K4336K2670J8163J1433M267j747n658p649r293j2156j5823j8400
$$ y = [3465056, 3424945, 3381128, 3336285, 3292040, 3249818, 3211533, 3178512, 3150129, 3124799, 3102394, 3084395, 3071209, 3060466, 3048666, 3033470, 3013560, 2987269, 2952899, 2910189, 2860451, 2805408, 2746887, 2687326, 2629166, 2573328, 2519312, 2467362, 2419648, 2378643, 2345003, 2317893, 2296833, 2282306, 2274743, 2274061, 2280561, 2295490, 2320096, 2354398, 2397424, 2448520, 2507896, 2575763, 2651270, 2732495, 2817369, 2904458, 2992964, 3082041, 3170013, 3254326, 3332545, 3403669, 3468291, 3527176, 3579942, 3625653, 3664627, 3698826, 3730080, 3758393, 3782451, 3801313, 3815038, 3824142, 3829461, 3832475, 3834743, 3836738, 3838031, 3838972, 3841314, 3846720, 3855604, 3868215, 3885784, 3909144, 3936522, 3964320, 3990347, 4015098, 4039434, 4062104, 4080267, 4091700, 4095967, 4094220, 4088562, 4080913, 4071620, 4059464, 4043641, 4025241]
50555D025241j8953j8173j6392j2608o315R37O997J1243J4248J5995J5630J2610
50543D030460P331Q36n499j0712j5523k2236l2305m4430n6105o6502p6522q6304
50531C622489r4408r9803j03182j05580j06759j05923j03318j00027r6429r1856
50521B615204q5949p9574p3877o8835o3384n6953n0229m4110l8553l3082k7829
50510A992829k3080j8222j2480o634k351N74M515J0551J6457J9700K1168K3881
50498B026908K8877L4551L9702M4914N0685N6258O1048O5627P0492P5167P9361
50487B633590Q3829Q9246R4891R9348J01909J02749J02262J00771R8478R5420
50477C602493R1785Q8136Q4843Q1598P8403P6583P7508Q0383Q2824Q3793Q4499
$$ y = [4025241, 4006288, 3988115, 3971723, 3959115, 3952800, 3953737, 3960734, 3971977, 3986225, 4002220, 4017850, 4030460, 4037791, 4038627, 4033128, 4022416, 4006893, 3984657, 3952352, 3907922, 3851817, 3785315, 3708793, 3622489, 3528081, 3428278, 3325096, 3219516, 3112757, 3006834, 2903516, 2803489, 2707060, 2615204, 2529255, 2449681, 2375804, 2306969, 2243585, 2186632, 2136403, 2092293, 2053740, 2020658, 1992829, 1969749, 1951527, 1939047, 1932413, 1930062, 1930636, 1935151, 1945702, 1962159, 1981859, 2003027, 2026908, 2055785, 2090336, 2130038, 2174952, 2225637, 2281895, 2342943, 2408570, 2479062, 2554229, 2633590, 2717419, 2806665, 2901556, 3000904, 3102813, 3205562, 3307824, 3408595, 3507073, 3602493, 3694278, 3782414, 3867257, 3948855, 4027258, 4103841, 4181349, 4261732, 4344556, 4428349, 4512848]
50466D512848Q6087Q8149R0157R2713R6492J01260J06720J12863J18648J21997
50456E527934J22194J20755J18559J13812J04604R1834P7567O1757M3132K2371
50446F404519J619j8695l9814o1218q0091r4831j06696j16910j24379j27589j26771
50435E509144j22573j14269j01327q5650p0085n5184l9465k2801p646L663J1157
50424D904964J5877J7399J3974M815q890k5325m3710o4215q6532j08892j28654
50413D490811j43812j54001j60108j63022j62967j60131j55550j50570j45342
50404C095308j38528j29105j17995j07220r7739q8983q0322p1976o4237n6863
50394B142340m9694m3160l7563l2588k7893k3433j8846j3458p621k968k14K301
$$ y = [4512848, 4598935, 4687084, 4777241, 4869954, 4966446, 5067706, 5174426, 5287289, 5405937, 5527934, 5650128, 5770883, 5889442, 6003254, 6107858, 6199692, 6277259, 6339016, 6382148, 6404519, 6406138, 6387443, 6347629, 6286411, 6206320, 6111489, 6004793, 5887883, 5763504, 5635915, 5509144, 5386571, 5272302, 5170975, 5085325, 5015240, 4960056, 4920591, 4897790, 4890144, 4893807, 4904964, 4920841, 4938240, 4952214, 4957029, 4948139, 4922814, 4879104, 4814889, 4728357, 4619465, 4490811, 4346999, 4192998, 4032890, 3869868, 3706901, 3546770, 3391220, 3240650, 3095308, 2956780, 2827675, 2709680, 2602460, 2504721, 2415738, 2335416, 2263440, 2199203, 2142340, 2092646, 2049486, 2011923, 1979335, 1951442, 1928009, 1909163, 1895705, 1888084, 1885116, 1884902, 1887203]
50382A887203O515J1784J5798J7917J9816K2714K5853K8263L0361L2900L5632
50371B134756L8068M0600M3636M6400M7848M8324M9111N0478N1347N0950M9811
50360B651329M8788M8075M7680M8123M9801N1966N3156N2829N1987N1900N2791
50349C208425N4194N6213N9526O4035O8217P0266O9649O7155O3786O0005N5820
50338C897291N1038M5337L8391L0105K0682J0468j88j1207k2904l5647m9141o2431
50326C911794p4813q6323r6908j05497j10537j11365j08640j03513r6790q8851
50316B928557p9926p0328o0427n0263l9330k7324j5384n749L41L804N999O609
50304B596579M365o52o911j3595k1376l0697m0446m9049n5887o1022o4359o5837
$$ y = [1887203, 1893718, 1905502, 1921300, 1939217, 1959033, 1981747, 2007600, 2035863, 2066224, 2099124, 2134756, 2172824, 2213424, 2257060, 2303460, 2351308, 2399632, 2448743, 2499221, 2550568, 2601518, 2651329, 2700117, 2748192, 2795872, 2843995, 2893796, 2945762, 2998918, 3051747, 3103734, 3155634, 3208425, 3262619, 3318832, 3378358, 3442393, 3510610, 3580876, 3650525, 3717680, 3781466, 3841471, 3897291, 3948329, 3993666, 4032057, 4062162, 4082844, 4093312, 4093124, 4081917, 4059013, 4023366, 3974225, 3911794, 3836981, 3750658, 3653750, 3548253, 3437716, 3326351, 3217711, 3114198, 3017408, 2928557, 2848631, 2778303, 2717876, 2667613, 2628283, 2600959, 2585575, 2579826, 2580167, 2583971, 2589970, 2596579, 2600944, 2600292, 2593381, 2579786, 2558410, 2527713, 2487267, 2438218, 2382331, 2321309, 2256950, 2191113]
50292B191113o5894o5028o3307o0786n7907n5001n1861m8434m5357m3062m0766
50281A593710l7299l2813k8812k6366k5001k3533k1345j8471j5041j1295q017
50270A345717o155n721n337l388M38M911Q532J0707J1734J2279J3139J4928J7419
50257A419203J9441K0062J9767J9876K1015K2664K4148K5257K5925K6049K5986
50246A669393K6523K7882K9198K9397K8401K7023K5889K4624K2217J8187J3371
50235A942105R304O466L648l88m969q246r722j0861j2917j5342j7081j8389k0368
50222A843240k3268k6272k8751l0699l2070l2523l2093l1436l1062l0725k9862
50211A514479k8559k7734k8141k9189k9083k6657k2930k0287j9957k0934k1429
$$ y = [2191113, 2125219, 2060191, 1996884, 1936098, 1878191, 1823190, 1771329, 1722895, 1677538, 1634476, 1593710, 1556411, 1523598, 1494786, 1468420, 1443419, 1419886, 1398541, 1380070, 1365029, 1353734, 1345717, 1339562, 1333841, 1328504, 1325116, 1325554, 1330465, 1338997, 1349704, 1361438, 1373717, 1386856, 1401784, 1419203, 1438644, 1458706, 1478473, 1498349, 1519364, 1542028, 1566176, 1591433, 1617358, 1643407, 1669393, 1695916, 1723798, 1752996, 1782393, 1810794, 1837817, 1863706, 1888330, 1910547, 1928734, 1942105, 1951409, 1957875, 1961523, 1961135, 1956166, 1947920, 1938198, 1927337, 1914420, 1899078, 1881997, 1863608, 1843240, 1819972, 1793700, 1764949, 1734250, 1702180, 1669657, 1637564, 1606128, 1575066, 1544341, 1514479, 1485920, 1458186, 1430045, 1400856, 1371773, 1345116, 1322186, 1301899, 1281942, 1261008, 1239579]
50200A239579k0582j8430j5198j1524q675p438p031o049m331k956k493k284j688
50187A130900j034q24q16m61K01O88Q06O93L87j48p99j547k749m473n688n100
50171A110036l072j860l092n570o633n519m151m424n908o948o928o359n528m459
50157A039585l888m776o710q006p742o531m961k624O13L501M695M461M045L867
50143A015529L343K170P82m14j401k139k512k739l230m010m708n087n166m922
50129I85496m313l630l448m147n611p243q241q280q025q310q682p748n453l871
50115H98494m628o565p386o902o907p992q552p278m947k962j486RJ370J988J724
50100H37980R15p7q13r22q51j661l544n248n689n331n154n072m476l609l188k980
$$ y = [1239579, 1218997, 1200567, 1185369, 1173845, 1165170, 1157732, 1150701, 1144652, 1140321, 1137365, 1134872, 1132588, 1130900, 1129866, 1129042, 1128226, 1127765, 1127966, 1128654, 1129460, 1130153, 1130540, 1130392, 1129593, 1128046, 1125297, 1120824, 1115136, 1110036, 1106964, 1105104, 1102012, 1096442, 1089809, 1084290, 1080139, 1075715, 1069807, 1062859, 1055931, 1049572, 1044044, 1039585, 1035697, 1030921, 1024211, 1016205, 1008463, 1001932, 996971, 994347, 994960, 998461, 1003156, 1007617, 1011662, 1015529, 1018872, 1021042, 1021824, 1021410, 1020009, 1017870, 1015358, 1012619, 1009389, 1005379, 1000671, 995584, 990418, 985496, 981183, 977553, 974105, 969958, 964347, 957104, 948863, 940583, 932558, 924248, 915566, 907818, 902365, 898494, 893866, 887301, 879915, 873013, 866106, 858114, 849562, 842284, 837337, 834375, 832889, 832898, 834268, 836256, 837980, 838895, 838818, 838005, 837083, 836232, 834571, 831027, 825779, 820090, 814759, 809605, 804533, 800057, 796448, 793260, 790280]
50084G90280k202j166j119k192k793j675L69J534J033n18k059k657j576J126M057
50069G80442N451N157M994O545Q916R660P959N944O132Q274R866R495Q296P748
50055H84879P532O572N204M923O291Q350J0051J1014J0919R314O568M034K755
50042I78406K635L152M068M895M597K874J132J123K844M694N685O426P746R288
50028A039565J0133J0229J0439J1318J2495J3336J3770J4179J4763J5406J5988
50017A181621J6583J7167J7597J8003J8910K0556K2353K3457K3886K4465K5576
50006A410174K6576K6708K6159K5716K5835K6436K7366K8455K9260K9338K9013
49995A711036K9393L1309L4349L7225L9140M0582M2571M5200M7497M9005N0904
$$ y = [790280, 788078, 786912, 785793, 783601, 780808, 779133, 779502, 781036, 782069, 781551, 779492, 776835, 775259, 776385, 780442, 785893, 791050, 796044, 802589, 811505, 821165, 829124, 835068, 841200, 849474, 859340, 868835, 877131, 884879, 892411, 898983, 904187, 909110, 915401, 923751, 933802, 944816, 955735, 965049, 971617, 975651, 978406, 981041, 984193, 988261, 993156, 997753, 1000627, 1001759, 1002882, 1005726, 1010420, 1016105, 1022531, 1030277, 1039565, 1049698, 1059927, 1070366, 1081684, 1094179, 1107515, 1121285, 1135464, 1150227, 1165633, 1181621, 1198204, 1215371, 1232968, 1250971, 1269881, 1290437, 1312790, 1336247, 1360133, 1384598, 1410174, 1436750, 1463458, 1489617, 1515333, 1541168, 1567604, 1594970, 1623425, 1652685, 1682023, 1711036, 1740429, 1771738, 1806087, 1843312, 1882452, 1923034, 1965605, 2010805, 2058302, 2107307, 2158211]
49984B158211N4745O0313O5720O9712P2856P6107P9348Q1931Q3457Q3007P8888
49973B964295P0661O0644N1660M3595L4179K3229J4034R644R332R821Q756N856
49961C305706J569m012j1211k0698l3098m7906o3082p6344q6650r4102r8882j00971
49949B670319j00378r7255r2100q6195q0969p6427p1042o4031n6940n1956m9213
49938A843813m6917m3670l9635l5740l2755l0964k9847k8399k6534k5600k6479
49927A477273k7822k7566k5775k4281k3764k3017k1249j9288j7873j6489j4726
49916A235423j3409j3217j3304j2357j0405q496p140n933m354k261J29K270L590
49903A150536M085M316M631M899N079N387N788O110O748Q334J0553J2324J3395
$$ y = [2158211, 2212956, 2273269, 2338989, 2408701, 2481557, 2557664, 2637012, 2718943, 2802400, 2885407, 2964295, 3034956, 3095600, 3147260, 3190855, 3225034, 3248263, 3262297, 3271941, 3281273, 3291094, 3299850, 3305706, 3307275, 3303263, 3292052, 3271354, 3238256, 3190350, 3127268, 3050924, 2964274, 2870172, 2771290, 2670319, 2569941, 2472686, 2380586, 2294391, 2213422, 2136995, 2065953, 2001922, 1944982, 1893026, 1843813, 1796896, 1753226, 1713591, 1677851, 1645096, 1614132, 1584285, 1555886, 1529352, 1503752, 1477273, 1449451, 1421885, 1396110, 1371829, 1348065, 1325048, 1303799, 1284511, 1266638, 1250149, 1235423, 1222014, 1208797, 1195493, 1183136, 1172731, 1164235, 1157095, 1151162, 1146808, 1144547, 1144676, 1146946, 1150536, 1154621, 1158937, 1163568, 1168467, 1173546, 1178933, 1184721, 1190831, 1197579, 1205913, 1216466, 1228790, 1242185]
49890A242185J4522J5817J6436J6454J7483K0273K3159K4257K4031K4266K5490
49879A464373K7077K9132L2424L6807M1265M5551N0336N5790O1223O6307P1634
49868A981919P8002Q5810R4945J04568J13515J21680J30168J39013J45653J47341
49858C142614J44453J39502J33439J25086J14248J03036R3455Q5624P9071P3851
49848D234379O9442O4177N7029M8598L9242K7465J1504q375l0322n2775p4666
$$ y = [1242185, 1256707, 1272524, 1288960, 1305414, 1322897, 1343170, 1366329, 1390586, 1414617, 1438883, 1464373, 1491450, 1520582, 1553006, 1589813, 1631078, 1676629, 1726965, 1782755, 1843978, 1910285, 1981919, 2059921, 2145731, 2240676, 2345244, 2458759, 2580439, 2710607, 2849620, 2995273, 3142614, 3287067, 3426569, 3560008, 3685094, 3799342, 3902378, 3995833, 4081457, 4160528, 4234379, 4303821, 4367998, 4425027, 4473625, 4512867, 4540332, 4551836, 4543461, 4513139, 4460364, 4385698]
$$ [...]
##END NTUPLES=NMR SPECTRUM
##END=
