##TITLE=coffee_type TOCA01-ROVE100D_90-10%
COFFEE_meoh_noesyp64 COFFEE_meoh {C:\Bruker\TOPSPIN} Administrator 10
##JCAMPDX= 6.0         $$ Bruker NMR JCAMP-DX V2.0
##DATA TYPE= NMR SPECTRUM
##DATA CLASS= NTUPLES
##ORIGIN= Bruker BioSpin GmbH
##OWNER= Administrator
$$ 1.72 TOPSPIN		Version 2.1
$$ 2012-05-18 15:41:15.042 -0700  Administrator@X
$$ Compression mode = diff/dup
##.OBSERVE FREQUENCY= 400.13188235
##.OBSERVE NUCLEUS= ^1H
##.ACQUISITION MODE= SIMULTANEOUS (DQD)
##.ACQUISITION SCHEME= undefined
##.AVERAGES= 64
##.DIGITISER RES= 22
##SPECTROMETER/DATA SYSTEM= spect
##.PULSE SEQUENCE= noesygpps1d.comp
##.SOLVENT NAME= COFFEE_meoh
##.SHIFT REFERENCE= INTERNAL, COFFEE_meoh, 1, 14.98061
##AUDIT TRAIL= $$ (NUMBER, WHEN, WHO, WHERE, PROCESS, VERSION, WHAT)
$$ ##TITLE= Audit trail, TOPSPIN		Version 2.1
$$ ##JCAMPDX= 5.01
$$ ##ORIGIN= Bruker BioSpin GmbH
$$ ##OWNER= Administrator
$$ $$ C:\Bruker\TOPSPIN/data/Administrator/nmr/12-COFFEE-2002/102/pdata/1/auditp.txt
$$ ##AUDIT TRAIL=  $$ (NUMBER, WHEN, WHO, WHERE, PROCESS, VERSION, WHAT)
(   1,<2012-02-21 00:00:58.094 -0500>,<Administrator>,<TOPSPIN>,<go>,<TOPSPIN 2.1>,
      <created by zg
	started at 2012-02-20 23:49:27.844 -0500,
	POWCHK enabled, PULCHK disabled,
       configuration hash MD5:
       B0 76 FB 9C 50 81 44 7D 18 B3 26 32 4E 60 AD 96
       data hash MD5: 64K
       89 18 2C 00 AF B5 A5 F4 62 32 48 D3 C3 0A 46 F4>)
(   2,<2012-02-21 00:01:01.219 -0500>,<Administrator>,<TOPSPIN>,<proc1d>,<TOPSPIN 2.1>,
      <Start of raw data processing
       efp LB = 0.3 FT_mod = 6 PKNL = 1 PHC0 = 0 PHC1 = 0 SI = 128K 
       data hash MD5: 128K
       56 78 5B 4C 29 6D F0 C8 0C 97 E2 B1 96 80 CE C2>)
(   3,<2012-02-21 00:01:02.422 -0500>,<Administrator>,<TOPSPIN>,<proc1d>,<TOPSPIN 2.1>,
      <pk PHC0 = 23.83484 PHC1 = 0 
       data hash MD5: 128K
       A1 9B B0 8B 1B 39 84 9F 8F 42 F0 31 6F 9E 2A 95>)
(   4,<2012-02-21 00:01:02.656 -0500>,<Administrator>,<TOPSPIN>,<proc1d>,<TOPSPIN 2.1>,
      <abs ABSG = 1 
       data hash MD5: 128K
       75 DF FA 06 2A 42 71 3F DC C1 4A D8 F9 95 0C 6A>)
(   5,<2012-02-21 00:01:02.750 -0500>,<Administrator>,<TOPSPIN>,<proc1d>,<TOPSPIN 2.1>,
      <abs ABSG = 2 
       data hash MD5: 128K
       49 69 CF 4E F0 3B 25 FE 32 12 CA A9 DF 29 65 26>)
(   6,<2012-02-21 00:01:02.984 -0500>,<Administrator>,<TOPSPIN>,<proc1d>,<TOPSPIN 2.1>,
      <abs ABSG = 3 
       data hash MD5: 128K
       31 B7 D7 45 8D F8 32 33 65 F4 13 33 5A B2 4F C0>)
(   7,<2012-02-21 00:01:03.063 -0500>,<Administrator>,<TOPSPIN>,<proc1d>,<TOPSPIN 2.1>,
      <abs ABSG = 4 
       data hash MD5: 128K
       1B 61 AC 95 5B 42 97 A4 6D E1 D7 04 A9 2A 6C 20>)
(   8,<2012-02-21 00:01:03.125 -0500>,<Administrator>,<TOPSPIN>,<proc1d>,<TOPSPIN 2.1>,
      <abs ABSG = 5 
       data hash MD5: 128K
       3A 02 1A 96 49 5B CF D1 32 30 84 B4 E9 63 97 18>)
(   9,<2012-02-21 00:01:03.266 -0500>,<Administrator>,<TOPSPIN>,<audit>,<TOPSPIN 2.1>,
      <user comment:
       ICON-NMR User ID: Administrator
$$ [...]
150 150 150 150 150 150 150 150
##$TP07= 0
##$TPNAME0= <>
##$TPNAME1= <>
##$TPNAME2= <>
##$TPNAME3= <>
##$TPNAME4= <>
##$TPNAME5= <>
##$TPNAME6= <>
##$TPNAME7= <>
##$TPOAL= (0..7)
0.5 0.5 0.5 0.5 0.5 0.5 0.5 0.5
##$TPOFFS= (0..7)
0 0 0 0 0 0 0 0
##$TUNHIN= 0
##$TUNHOUT= 0
##$TUNXOUT= 0
##$USERA1= <user>
##$USERA2= <user>
##$USERA3= <user>
##$USERA4= <user>
##$USERA5= <user>
##$V9= 5
##$VALIST= <valist>
##$VCLIST= <CCCCCCCCCCCCCCC>
##$VD= 0
##$VDLIST= <DDDDDDDDDDDDDDD>
##$VPLIST= <PPPPPPPPPPPPPPP>
##$VTLIST= <TTTTTTTTTTTTTTT>
##$WBST= 1024
##$WBSW= 4
##$XGAIN= (0..3)
0 0 0 0
##$XL= 0
##$YL= 0
##$YMAX_a= 14566215
##$YMIN_a= -6823641
##$ZGOPTNS= <>
##$ZL1= 120
##$ZL2= 120
##$ZL3= 120
##$ZL4= 120
##$ABSF1= 14.98061
##$ABSF2= -5.57192
##$ABSG= 5
##$ABSL= 3
##$ALPHA= 0
##$AQORDER= 0
##$ASSFAC= 0
##$ASSFACI= 0
##$ASSFACX= 0
##$ASSWID= 0
##$AUNMP= <proc_prof1d_extract>
##$AXLEFT= 0
##$AXNAME= <>
##$AXNUC= <1H>
##$AXRIGHT= 0
##$AXTYPE= 0
##$AXUNIT= <>
##$AZFE= 0.1
##$AZFW= 0.1
##$BCFW= 0
##$BC_mod= 0
##$BYTORDP= 0
##$COROFFS= 0
##$CY= 15
##$DATMOD= 1
##$DC= 0
##$DFILT= <>
##$DTYPP= 0
##$F1P= 0
##$F2P= 0
##$FCOR= 0.5
##$FTSIZE= 131072
##$FT_mod= 6
##$GAMMA= 0
##$GB= 0
##$INTBC= 1
##$INTSCL= 1
##$ISEN= 128
##$LB= 0.3
##$LEV0= 0
##$LPBIN= 0
##$MAXI= 10000
##$MC2= 0
##$MEAN= 0
##$ME_mod= 0
##$MI= 0
##$NCOEF= 0
##$NC_proc= -3
##$NLEV= 6
##$NOISF1= 0
##$NOISF2= 0
##$NSP= 0
##$NTH_PI= 0
##$NZP= 0
##$OFFSET= 14.98061
##$PC= 1
##$PHC0= 23.83484
##$PHC1= 0
##$PH_mod= 1
##$PKNL= yes
##$PPARMOD= 0
##$PPDIAG= 0
##$PPIPTYP= 0
##$PPMPNUM= 2147483647
##$PPRESOL= 1
##$PSCAL= 4
##$PSIGN= 0
##$PYNMP= <proc.py>
##$REVERSE= no
##$SF= 400.13
##$SI= 131072
##$SIGF1= 0
##$SIGF2= 0
##$SINO= 400
##$SIOLD= 131072
##$SPECTYP= <>
##$SREGLST= <1H.CDCl3>
##$SSB= 0
##$STSI= 131072
##$STSR= 0
##$SW_p= 8223.68421052632
##$SYMM= 0
##$S_DEV= 0
##$TDeff= 65536
##$TDoff= 0
##$TI= <>
##$TILT= no
##$TM1= 0
##$TM2= 0
##$TOPLEV= 0
##$USERP1= <user>
##$USERP2= <user>
##$USERP3= <user>
##$USERP4= <user>
##$USERP5= <user>
##$WDW= 1
##$XDIM= 131072
##$YMAX_p= 497421563
##$YMIN_p= -281778687
##$CURPLOT= <Network HP LaserJet P1505>
##$CURPRIN= <$Network HP LaserJet P1505>
##$DFORMAT= <normdp>
##$LAYOUT= <+/1D_H.xwp>
##$LFORMAT= <normlp>
##$PFORMAT= <normpl>
##$SURQMSG= 1
$$ End of Bruker specific parameters
$$ ---------------------------------
##NTUPLES= NMR SPECTRUM
##VAR_NAME=  FREQUENCY,     SPECTRUM/REAL,   SPECTRUM/IMAG
##SYMBOL=    X,             R,               I
##VAR_TYPE=  INDEPENDENT,   DEPENDENT,       DEPENDENT
##VAR_FORM=  AFFN,          ASDF,            ASDF
##VAR_DIM=   131072,        131072,          131072
##UNITS=     HZ,            ARBITRARY UNITS, ARBITRARY UNITS
##FACTOR=    0.0627417313425165, 1,          1
##FIRST=     8223.62146879498, -8458,        -93399
##LAST=      0,             -2824,           -96147
##MIN=       0,             -281778687,      0
##MAX=       8223.62146879498, 497421563,    0
$$ Real data points
##PAGE= N=1
##DATA TABLE= (X++(R..R)), XYDATA
$$ [...]
66842 3892967 3916518 3938550 3959654 3980249 4000375 4019968 4039224 4058577 4078121 4097066 4114201
66831 4114201 4129066 4142287 4154530 4165651 4175295 4183800 4191716 4198714 4203870 4207111 4209658 4212649 4215840
66818 4215840 4218038 4218504 4217496 4215563 4212750 4208614 4202864 4195792 4188114 4180481 4173084 4165489 4156779 4146146
66804 4146146 4133635 4120142 4106294 4091508 4074665 4055653 4035582 4015427 3995154 3974396 3953144
66793 3953144 3931277 3908255 3884119 3860194 3837719 3815991 3792867 3767084 3739191 3710252 3680647
66782 3680647 3650519 3620405 3590787 3561511 3532122 3502328 3471773 3439975 3407109 3374435 3343272
66771 3343272 3313720 3284887 3256130 3227426 3198631 3169191 3138773 3107684 3076354 3044755 3012611
66760 3012611 2979959 2947234 2914915 2883251 2852129 2821059 2789495 2757444 2725712 2695255 2666256
66749 2666256 2637970 2609524 2580719 2551993 2523706 2495655 2467364 2438784 2410588 2383639 2358114
66738 2358114 2333161 2307454 2280140 2251469 2222737 2195616 2171157 2149012 2127526 2104752 2079591
66727 2079591 2052200 2023644 1995328 1968405 1943220 1919178 1895453 1871881 1848980 1827154 1806333
66716 1806333 1786435 1767660 1749871 1732137 1713491 1694098 1675190 1657775 1641742 1626192 1610250
66705 1610250 1593459 1575798 1557634 1539507 1521801 1504635 1488028 1471891 1455878 1439546 1422813
66694 1422813 1406056 1389613 1373445 1357415 1341654 1326430 1311803 1297647 1283891 1270526 1257427
66683 1257427 1244377 1231224 1217866 1204176 1190171 1176275 1163137 1151031 1139590 1128291 1117042
66672 1117042 1106075 1095388 1084759 1074351 1064798 1056238 1047643 1037779 1026661 1015395 1004592 993806
66660 993806 982743 972028 962117 952321 941863 931337 922040 914120 906593 899069 892185 886087 879737
66647 879737 872360 864621 857619 851359 844974 837982 830627 823340 816498 810414 804954 799336 792873 785812
66633 785812 779045 773141 767909 762673 756634 749269 740809 732160 724007 716221 708330 700207 692042 684159
66619 684159 677257 672183 668823 665788 661977 657971 654979 652783 649821 645218 639644 634070 628685 623282
66605 623282 617758 611945 605799 600159 596379 594510 592579 588570 582853 577861 575346 574482 572776 568452
66591 568452 561821 554628 548502 544115 541387 539756 538094 535137 530695 526024 522354 519405 516130 512468
66577 512468 509207 506288 502578 497620 492348 487576 483032 478669 475691 475033 475470 474584 471405 467091 463186
66562 463186 460236 458007 455995 453383 449356 444015 438719 435111 433788 433852 433702 432426 430475 428732 426949
66547 426949 423884 419317 414991 412621 411623 409916 406618 402648 398861 395102 391471 389017 388214 387687 385595
66532 385595 381894 378321 376345 375847 375775 375368 374594 373796 373130 372303 370906 369062 367496 366654 365901 363941 360095
66515 360095 355037 350227 346729 344598 343375 342960 343649 345195 346297 345551 342803 339112 335507 332323 329625
66500 329625 327475 325595 323568 321709 320980 321598 322387 322092 320625 318398 315248 311105 307211 305269 305295 305441
66484 305441 304161 301586 298471 294912 290833 286964 284392 283375 283243 283261 283038 282288 280899 279318 278411 278758
66468 278758 280322 282673 285088 286370 285277 281676 277089 273499 271538 270216 268500 266578 265174 264121
66454 264121 262517 260256 258437 257825 257710 256992 255728 254531 252891 249530 244676 240690 239642 241051 242797
66439 242797 243614 243719 243479 242705 241399 240207 239598 239101 237755 235146 231836 229073 228078 229152 231171 232363
66423 232363 231949 230915 230896 232433 234490 235571 235038 233477 232060 231613 232109 232980 233822 234622 235327 235553 235029
66406 235029 234075 233232 232475 231236 229281 227088 225209 223531 221436 218451 214598 210489 207293 206115 206879
66391 206879 208187 208978 210050 212999 217666 221718 223189 222467 221143 219844 218229 216374 214720 212901 210072
66376 210072 206669 204482 204389 205050 204585 202772 200816 199644 199328 199702 200538 201259 201314 200808 200169 199351 198040
66359 198040 196534 195649 195649 195903 195692 194759 193059 190715 188347 186781 186112 185636 184920 184270 183857 183114 181594
66342 181594 179842 178722 178295 178020 177749 177719 177626 176525 173844 170048 166245 163564 162884 164470 167492 170373
66326 170373 172023 172590 172807 172968 172840 172307 171603 170924 170154 169031 167369 165178 162844 161190 161107 162885 165926
66309 165926 168989 170714 170277 168054 165587 164290 164053 163604 162401 161448 161791 162918 163501 163278 163089 163197
66293 163197 162781 161374 159747 158685 157799 156418 154978 154509 155052 155589 155531 155380 155741 156387 156654 156210 155111
66276 155111 153420 151126 148295 145164 142119 139651 138169 137892 138853 140763 142713 143510 142748 141355 140594
66261 140594 140730 141155 141487 141821 142077 141885 141237 140514 139865 139198 138819 139271 140437 141661 142924 144877 147314
66244 147314 148660 147723 145159 142484 140371 138749 137818 137802 138156 138192 138269 139156 140259 139777 137164 134411 134133
66227 134133 136832 140650 143515 144931 145683 146348 146517 145520 143617 141945 141129 140393 138534 135525 132638 131060
66211 131060 130926 131724 133051 134670 136213 137200 137352 136768 135794 134682 133410 131960 130764 130391 130621 130383
66195 130383 129075 127422 126365 125635 124537 123824 125266 128893 132040 132138 129699 127392 126613 126246 124841 122844
66179 122844 122033 123446 126499 129858 132490 133864 133646 131611 127903 123338 119372 117461 118057 120150 122066
66164 122066 122943 123274 123922 124993 126040 126938 127829 128270 127475 125745 124857 126213 129031 131053 130792 128541
66148 128541 125622 123479 123169 124559 125915 125342 122992 120965 120686 121350 121551 121427 122115 123688 124932 125005
66132 125005 124213 123024 121431 119735 119118 120611 123823 127262 129796 131414 132653 133754 134444 134320 133299
66117 133299 131792 130422 129517 128877 128107 127076 125938 124836 123767 122727 121809 121151 120866 121033 121657 122642
66101 122642 123893 125352 126823 127816 127833 126802 125062 123024 121106 119886 119798 120549 121336 121857 122522 123354 123348
66084 123348 121690 119168 117399 116810 116251 114618 111936 108829 105990 104535 105641 108970 112241 113363 112601
66069 112601 111794 111910 112332 112303 111935 111677 111652 111798 112056 112166 111862 111513 112066 113962 116416 118096 118399 117902
66051 117902 117667 118190 118989 119297 119067 118863 118641 117308 114224 110680 108888 109487 110941 111509 110971 110158 109626
66034 109626 109403 109407 109510 109440 109110 108779 108539 108041 107248 107109 108787 112191 115769 117907 118222 117494 116758 116702 117547
66015 117547 118936 119834 118963 115842 111471 107751 106117 106743 108814 111093 112372 112206 111556 112053 114100 116319
65999 116319 117450 118091 119573 121714 122970 122672 121791 121372 121440 121757 122430 123225 123479 123412 124475 127443 130988
65982 130988 133143 133478 132735 131081 128162 124669 122233 121407 120945 119651 118016 117315 117841 118936 120428 122973
65966 122973 126715 130362 132288 132387 132202 133080 134661 135541 135001 133398 131137 128207 125110 123402 124429 127627
65950 127627 130692 131649 130539 129024 128516 128859 128878 127979 126769 125963 125347 124434 123659 123898 124920 125425 124850
65933 124850 124139 124295 125071 125609 125544 125010 124476 125094 128060 132622 135773 135313 132607 130925 131541 133026 134059
65916 134059 135074 136773 138682 140073 141188 142616 144191 145356 146105 146766 147092 146267 143809 140152 136467
65901 136467 134040 133515 134401 135506 135993 135888 135540 135038 134358 133667 133113 132539 131790 131221 131614 133456 136282
65884 136282 138781 139750 139158 138189 138057 138917 140048 140770 140861 140475 140226 140962 142712 144074 143634 141936 140930
65867 140930 141225 141049 138646 134757 131768 131057 132140 133902 135421 135705 134017 131078 129098 129809 132775
65852 132775 136103 138481 139918 140771 140905 140144 138982 138233 138140 138257 138117 137579 136487 134492 131524 128176
65836 128176 125449 124254 125147 127990 131590 134236 135165 135223 135538 135888 135026 132498 129395 127323 127234 129261
65820 129261 132896 136974 140073 141418 141312 140648 140288 140734 141791 142476 141885 140355 139211 139186 139692 139925 139997
65803 139997 140566 141908 143798 145739 146852 146202 144005 142007 141786 142954 143774 143292 141885 139948 137328
65788 137328 134440 132852 133835 136769 139702 141253 141513 141418 141947 143812 147035 150398 151821 149954 145420
65773 145420 140211 135896 132649 129955 127796 126833 127557 129519 131523 132637 133059 133904 135975 138880 141637
65758 141637 143928 146120 148028 148604 147450 145939 145887 147391 148846 148928 147680 145704 143419 141389 140347
65743 140347 140289 140202 139258 137700 136170 134973 134631 136204 139889 143774 145251 143630 140389 136979 133606 130435
65727 130435 128587 128982 130865 132431 132717 132228 131933 132366 133589 135235 136363 135926 133917 131775 131181 132468
65711 132468 134474 135885 136412 136635 137117 137852 138286 137590 135207 131515 127870 125565 124691 124272 123377 121720
65695 121720 119406 116895 115389 116266 119353 122340 122850 120938 118716 117633 117135 116152 114751 113589 112574
65680 112574 111222 110008 110120 111612 112749 111821 109109 106440 105160 105247 106229 108082 110805 113663 115500
65665 115500 115728 114648 112840 110609 108188 106167 105343 105962 107233 107817 107003 105412 104454 105145 107548 111195
65649 111195 115512 119686 122523 122976 120845 116842 112102 107810 104992 104151 105056 107145 110134 113901 117843
65634 117843 120788 121819 121102 119780 119137 119707 120904 121457 120440 118031 115187 112678 110602 108757 107152
65619 107152 106059 105776 106401 107580 108514 108534 107794 107168 107332 108125 108844 108889 108061 106512 104619 102752 101033
65602 101033 99478 98426 98459 99572 100701 100544 99022 97637 98052 100344 102869 103946 103467 102594 102144 101858
65586 101858 101371 101160 101934 103400 104338 103942 102658 101678 101843 102989 104061 103990 102725 101244 100292 99510 98244
65569 98244 96815 96246 96956 98455 100040 100999 100468 98323 96269 96657 99687 102888 104047 103639 103623 104745
65553 104745 106070 106634 106472 106214 106447 107314 108254 108382 107625 106985 107111 107216 106251 104600 103511 103097 102184 100226
65535 100226 98262 97553 98121 99081 99741 99898 99585 99116 99152 100208 102047 103701 104147 103073 101285 100237 100780
65518 100780 102338 103617 104169 104823 106413 108468 109501 108509 106063 103906 103373 104079 104272 102716 100100 98219
65502 98219 97876 98106 97523 95885 93972 92420 91267 90491 90359 90953 91778 92240 92369 92677 93297 93698 93447 92800
65484 92800 92109 90965 88669 85535 83026 82302 83088 84366 85731 87525 89737 91325 91005 88799 86591
65469 86591 86685 89468 92881 94703 94975 95402 96728 98029 98735 99829 102217 105031 106738 107175 107289 107394
65453 107394 106973 106008 105234 104936 104552 103767 103201 103730 105708 108963 112817 115975 117168 116427 115222 114917 115402
65436 115402 115563 114830 113802 113480 114212 115515 116735 117536 117603 116349 113617 110683 109614 111053 113265 114033
65420 114033 113114 112179 112682 114445 116069 116159 114416 112131 111256 112397 114163 115188 116155 118679 122556 125499
65404 125499 125758 123896 121746 120618 120807 121885 122936 123117 122388 121393 120640 120269 120419 121030 121373 120655 119060
65387 119060 117343 115463 112774 109578 107233 106327 105905 104974 103588 101884 99307 95770 92668 91617 92626
65372 92626 94374 95897 97264 98879 100752 102331 102740 101535 99425 97805 97417 98013 99321 101294 103131
65357 103131 103238 100967 97618 94999 93703 93385 93763 94481 94837 94738 95352 97823 101785 105934 109435 111913
65341 111913 112880 112406 111834 112479 113871 114506 114156 114229 115862 118772 122010 124821 126751 127891 129061 130831
65325 130831 132412 132539 131424 130690 131248 132416 133428 134569 136243 138083 139822 142255 146414 152205 158574
65310 158574 164763 170868 177445 184951 193263 201360 207950 212967 218141 225438 234861 244298 251607 256490
65296 256490 260068 262889 263938 261897 257071 251288 245746 239802 232493 224565 217848 212746 207612 200934
65282 200934 193207 186031 180085 174816 169792 165441 162294 159977 157383 153787 149596 145806 142826 140195
65268 140195 137596 135545 134551 133942 132352 129276 125385 121284 116961 112836 110378 110747 113177 115493 116185
65253 116185 115403 113953 111966 108928 104729 100338 97276 96395 97108 97865 97578 96705 96932 99484 103526 106447
65237 106447 106138 103037 99470 96973 94935 92143 88782 86093 84685 84230 84590 86134 88812 91887 94784
65222 94784 97342 99024 98861 96766 94144 92561 92233 92275 91925 91038 89917 89238 89788 91706 94239 96577
65206 96577 98539 100093 100886 100939 101219 102508 103963 103792 101432 98300 96337 96461 98409 101180 103375 103926
65190 103926 103102 102360 102793 104092 105323 106212 107095 107942 108085 106997 105007 103228 102810 103987 105667 106362
65174 106362 105796 105162 105360 105602 104662 103031 102474 103300 103495 101309 97690 95084 94512 94927 95011 94408 93375
65157 93375 92422 92359 93478 94519 93572 90496 87385 86218 87054 89009 91630 94261 95272 93570 90367 87973
65141 87973 87066 86531 85800 85766 87027 88624 89190 88518 87486 87081 87814 89290 90086 88943 86501 84949 85389
65124 85389 86487 86505 85829 86403 89126 92915 96167 98124 98721 98068 96581 95132 94473 94547 94561 93820 92447
65107 92447 91208 90601 90348 90033 89895 90329 90712 89678 86948 84165 83351 84979 87953 90897 92913 93692
65091 93692 93781 94450 96591 99801 102920 105013 105347 103196 98879 94666 93223 94859 97271 98235 97633 96598
65075 96598 95828 95464 95808 97152 99115 100754 101314 100669 99365 98413 98465 98880 98248 96369 95077 96267 99567
65058 99567 102918 105189 107075 109280 111027 111065 109460 107613 106749 107014 107887 108958 110238 112072 114832 118477
65042 118477 122335 125477 127345 128074 128401 129336 131629 135251 139541 144088 149242 155475 162517 169640 176544
65027 176544 183267 189245 193364 195403 196750 199112 202818 206882 210282 212628 213932 214547 215264 216677 218225
65012 218225 218420 216262 212108 207044 201848 196656 191192 185087 178317 171493 165432 160357 155903 151914
64998 151914 148620 145843 142718 138722 134432 130705 127480 124070 120333 116802 113767 110910 107928 104898
64984 104898 101931 99056 96684 95594 96101 97637 99480 101421 103255 104060 102832 99868 96816 95050 94448
64969 94448 93986 92996 91378 89065 86121 83346 82044 82807 84916 87146 88792 89817 90493 91235 92256 93040
64953 93040 92695 91303 90333 90957 92403 92877 91795 90125 88821 88093 88204 89540 91465 92390 91760 90960 91439
64936 91439 92844 93912 94383 94827 95185 94867 94130 94137 95482 97578 99572 100969 101207 99598 96264 92522 89853
64919 89853 88762 88838 89495 90309 90950 91192 90981 90467 90008 90094 91053 92792 94798 96255 96188 94091 90725 87829
64901 87829 86536 86467 86811 87645 89320 91067 91389 89857 87616 86157 86376 88541 92015 94977 95751 94751
64885 94751 93993 94445 95112 95084 94877 94899 94165 92025 90096 90698 93769 96862 97994 97236 95660 94178 93540
64868 93540 94163 95520 96634 97499 99029 101208 102279 100438 95793 90141 85397 82709 82468 84322 87249
64853 87249 90120 92249 93339 93235 92087 90549 89431 89148 89572 90255 90754 91078 91896 93897 96727 98962
64837 98962 99425 98197 96044 93343 90210 87338 85849 86125 87399 88781 90220 92008 93718 94300 93378
64822 93378 92005 91812 93482 96251 98742 100141 100713 101520 103513 106457 108710 108556 106020 102936 100986
64807 100986 100191 99702 99323 99280 98965 97273 94431 92339 92446 94057 95425 95834 95772 95541 94783 93365 91837
64790 91837 90747 90067 89548 89170 88926 88557 87818 86867 86075 85549 85111 84662 84258 83768 82834 81542 80932 82192
64772 82192 85189 88294 90127 90979 91871 92649 92148 90266 88694 88883 90156 90673 89826 88880 89469 92019 95450
64755 95450 97963 98493 97895 98222 100281 102512 103150 102786 103443 105483 107034 106576 104543 101940 98970 95999
64739 95999 94484 95534 98258 100769 102379 103726 105235 106738 108427 110692 112737 112637 109628 105616 103513
64724 103513 104230 105901 106074 104239 102019 101185 101914 103131 104110 105142 106566 107898 108424 108258 108240 108934 110182
64707 110182 111493 112371 112365 111438 110386 110321 111434 112549 112297 110628 108946 108679 109888 111398 112264 112739 113534
64690 113534 114507 114790 114149 113381 113039 112529 111035 108729 106462 104811 104106 104843 107096 109819 111639 112204
64674 112204 111989 111104 109405 107594 106883 107317 107645 107288 107300 108614 110279 110414 108475 105758 103919 103551 103980
64657 103980 103992 102993 101879 102402 105196 108717 110666 110290 108837 107861 107689 107628 107261 107177 108279 110526 112734
64640 112734 113983 114851 116600 119252 121424 122205 122199 122212 121786 119971 117011 114414 113471 114356 116363 118341 119124
64623 119124 118362 117018 116496 117227 118474 119413 119843 119927 119829 119725 119796 120070 120498 121133 121930 122505 122462 121889 121115
64604 121115 120022 118045 114979 111514 108839 107842 108581 110394 112569 114960 117748 120564 122403 122783 122478
64589 122478 122572 123107 123372 123280 123643 124872 126045 125644 123089 119474 116856 116635 118416 120586 122037 122886 123393
64572 123393 123072 121606 119915 119225 119372 119183 118367 117850 118145 118597 118651 118720 119220 119681 119644 119692 120669 122234 123040
64553 123040 122260 120315 118208 116701 116128 116485 117405 118202 118161 116993 115248 114198 114849 116906 118985 120007
64537 120007 120079 119892 119782 119720 119799 120215 120875 121403 121549 121369 121253 121934 124172 127847 131466 133160 132402 130473
64519 130473 128997 128358 127896 127352 127361 128271 129131 128524 126213 123282 120777 118971 118015 118317 119755 121307 122127
64502 122127 122401 122581 122522 122232 122653 124483 126743 127887 128086 128919 130758 132039 131490 129745 128174 127297 127001
64485 127001 127257 127870 128333 128578 129119 130031 130689 130950 131443 132072 131512 129176 126535 125304 125269 125111 124474 123795
64467 123795 122834 120948 118410 116012 113808 111704 110792 112305 115369 117653 118476 119475 121723 123935 124401
64452 124401 123309 122070 121292 120433 118937 116930 115208 114851 116260 118295 119134 118327 117183 116819 116917 116899 117168
64435 117168 118282 119852 121227 122497 123872 124813 124889 124836 125538 126369 125823 123585 120886 118894 117862 117815 118894
64418 118894 120803 122763 124203 124795 123869 120829 116315 112022 109093 107434 106683 106817 107422 107532 106899 106667
64402 106667 107993 110591 113299 115537 117439 119014 120000 120383 120426 120359 120552 121611 123687 125939 127311 127628
64386 127628 127408 127047 126911 127746 129900 132336 133592 133745 134271 135699 136654 135715 133114 129990 127001 124591
64370 124591 123613 124400 125773 126238 125947 126327 127916 129722 130806 131312 131647 131736 131680 132347 134619 138472 143194
64353 143194 148037 152243 155004 156042 155949 155445 154540 152906 150740 148715 147158 145878 144843 144511 145246 146600
64337 146600 147438 146869 145046 142993 141526 140542 139497 138340 137511 137215 137336 138018 139496 141204 141965 141566
64321 141566 141295 142245 143857 144973 145569 146274 146723 145891 144081 143098 143965 145620 146528 146605 146665 146708 145897 144073
64303 144073 142272 141424 141120 140076 137657 134704 132787 132767 134155 135855 137251 138404 139477 140490 141614
64288 141614 143286 145905 149627 154297 159071 162177 161959 158684 154849 153145 154178 156433 158110 158548 158212
64273 158212 157964 158461 159752 161196 162021 162168 162471 163794 166032 168202 169617 170725 172449 174891 177304
64258 177304 179530 182598 187119 191642 193770 192805 190342 188184 186902 186653 187886 190133 191294 189718 186595
64243 186595 184885 185972 188611 191152 193323 195360 196732 196784 195936 195239 195096 195279 195993 197980 201376 205184
64227 205184 208255 210362 211929 213043 213367 213070 213288 215174 218693 222896 227378 232781 239421 245957 250271
64212 250271 251669 251545 251625 252091 251813 250041 247250 244321 241299 237356 232034 226343 222168 220336 219600 218044
64196 218044 215389 213194 212729 213466 214191 214825 216194 218244 219601 219229 217831 217095 217888 219598 221042 221600
64180 221600 221583 221836 223134 225711 229296 233552 238400 243759 249092 253512 256494 258448 260566 264078 269445
64165 269445 275964 282133 286725 289748 292214 294836 297160 298249 297963 297112 296363 295548 294236 292502 290678
64150 290678 288682 286142 283118 280294 278432 277933 278877 280990 283483 285435 286672 287989 290226 293348 296696
64135 296696 299935 303395 307554 312399 317212 320833 322452 322600 323122 325431 328586 329780 327266 322445 318455
64120 318455 316905 316696 316018 314520 312968 311562 309714 307353 305295 303939 302516 300342 298175 297555 299178
64105 299178 302801 308369 315974 324570 332000 337123 341180 346290 353019 360141 366536 372589 379783 389409
64091 389409 401625 415381 429372 443319 458026 473901 489997 505147 519548 534224 549145
64080 549145 562878 574141 582650 588305 590577 589262 585051 578853 571192 562619 553827 544737 534265
64067 534265 521870 508776 496754 486132 475957 465882 456773 449410 443544 438522 434119 430408 427311
64054 427311 424647 422360 420492 419121 418378 418310 418808 419979 422389 426444 431535 436307 439926 442752 445852
64039 445852 450280 456741 465249 474946 484816 494801 505725 517954 530755 543309 555721 568387 580742
64026 580742 591366 599451 605759 611907 618685 625065 628950 629048 625890 620805 614330 606358 597660 590018
64012 590018 584355 579612 574249 568170 562280 556725 550798 544544 539270 536118 534871 534550 534632 535311 537060
63997 537060 540380 545583 552399 559998 567833 576227 585664 595766 605666 615498 626787 640780 656778
63984 656778 672920 688520 704776 722771 741625 759553 776401 793898 813170 833092 851850
63973 851850 869400 887267 906043 924141 939508 951972 963255 974809 986198 995916 1003463 1010198
63961 1010198 1018154 1028517 1041503 1056999 1074533 1092916 1110880 1128145 1144999 1160839 1174377
63950 1174377 1185702 1196733 1208651 1220043 1229123 1236963 1246708 1259862 1275227 1291743 1310465 1332888
63938 1332888 1358911 1387680 1419261 1454055 1491293 1529782 1570075 1614500 1664748 1720327 1779777
63927 1779777 1842673 1910075 1983561 2064242 2152248 2246720 2346493 2451283 2562358 2681840 2811253
63916 2811253 2950647 3099019 3255466 3419872 3592702 3774658 3967016 4172119 4392819
63907 4392819 4631155 4888193 5165657 5467265 5797767 6160959 6559382 6995926 7474952
63898 7474952 8001790 8581993 9221536 9926897 10703772 11555100 12480037 13474316 14531233
63889 14531233 15642549 16798933 17989656 19201932 20420606 21628055 22803328 23921011
63881 23921011 24952213 25868706 26647498 27272243 27731602 28017657 28125736 28054130 27802874
63872 27802874 27373307 26769941 26003280 25091066 24057196 22929125 21734687 20499256 19244433
63863 19244433 17988575 16747951 15537435 14370823 13260856 12218234 11249837 10358148
63855 10358148 9542821 8802392 8133996 7532458 6991273 6504734 6068292 5676966 5324714
63846 5324714 5005920 4716704 4454314 4215932 3998472 3798889 3614257 3442184 3281591
63837 3281591 3132385 2993768 2863361 2738553 2618208 2502582 2392102 2286893 2187031 2092425
63827 2092425 2002586 1916936 1835024 1756153 1679427 1604900 1534056 1468295 1407239 1349359 1293918
63816 1293918 1241430 1192503 1147190 1105295 1066294 1029052 992660 957650 925402 896266 869199
63805 869199 843379 819070 796575 775463 755466 737239 721495 707970 695890 684938 675193 666549
63793 666549 658728 651550 644824 638372 632437 627499 623371 619168 614625 610582 607369 603437 596766 587398
63779 587398 577463 568635 560409 551148 540093 527938 515779 503908 491637 478298 464334 451045
63767 451045 439062 427549 415418 402938 391412 381505 372715 364515 357146 350922 345428 339922 334117
63754 334117 328161 322143 316057 310037 304180 298317 292364 286798 282290 278786 275400 271442 267174 263270
63740 263270 259902 256937 254828 254487 255851 257197 256491 253328 249087 245346 242705 241075 240327 240311 240653 240984
63724 240984 241193 241232 240925 240197 239263 238299 237116 235427 233349 231388 229972 229130 228489 227492 225764 223483 221247
63707 221247 219424 217784 215941 214055 212838 212926 214342 216556 218918 221025 222755 224039 224819 225316 226049
63692 226049 227282 228564 229201 229069 228583 228053 227726 228378 230985 235522 240846 246229 252296 259838 268385 276789
63676 276789 284732 292703 300781 308556 316383 325637 337211 350433 363995 377449 391079 404594 416805
63663 416805 426934 435745 444670 453768 461084 464539 464123 461586 458077 453048 445855 437436 429416 422126
63649 422126 414632 406592 398836 391905 385236 378405 372200 367404 363107 357431 349884 341993 335399 330250
63635 330250 325878 322185 319584 318126 317617 318273 320250 322484 323227 322292 321901 324464 329991 336482 342397
63620 342397 347882 353831 360782 368799 377540 386230 394284 402155 410888 420683 430615 439943 448751 456871
63606 456871 463131 466430 466981 465655 462573 457136 449191 439451 428928 418534 409049 400797 393317 385781
63592 385781 377860 370065 363446 359065 357253 357061 356950 356502 356981 359623 363890 368123 371541 374825 379067
63577 379067 385021 393156 403358 414539 425392 435685 446070 456653 466786 476655 488118 503219
63565 503219 522234 543720 566161 589098 612894 637998 664635 692980 723279 755553 789201
63554 789201 823183 856774 889839 922110 952537 979698 1002575 1020498 1032741 1038912 1039732 1036872
63542 1036872 1031948 1025913 1019199 1011964 1004363 996927 990260 983768 975147 962131 944678 924656 903606
63529 903606 881810 859392 837020 815181 793895 773677 755708 740404 726635 713192 700433
63518 700433 689679 681419 674870 669046 663566 658540 654273 651192 649784 650593 654255 661223 671254 683572
63504 683572 697696 713758 731780 751183 771436 792885 816556 843365 873734 907525 943873
63493 943873 981313 1018454 1054460 1088761 1120671 1149526 1174809 1195860 1211877 1222647 1229031 1232396
63481 1232396 1233782 1233850 1233200 1232367 1231788 1232055 1233635 1235737 1235765 1230648 1218807 1200629 1177339 1149867 1118580
63466 1118580 1083576 1045264 1004937 964493 925097 886353 847304 808093 770164 735102 703938
63455 703938 677263 654907 635265 616014 596288 577670 562351 550590 540633 530946 521746 514119
63443 514119 508291 503339 498417 493739 490283 488866 489655 492248 495871 499629 502941 505847 508787 512208
63429 512208 516595 522722 531315 542294 554732 567796 581333 595160 608219 619154 627781 635354
63417 635354 643061 650639 656731 660180 660457 657157 649963 639391 626968 614207 601738 589781 578843
63404 578843 569226 560302 551392 543326 537996 536024 535956 536306 537368 540154 544360 548425 551115 552083 551456
63389 551456 550029 549639 552129 557892 566178 576516 588721 601904 614944 628158 643087 660358 679106
63376 679106 698988 721300 747307 776600 808014 841133 875917 911950 949366 989697 1034199
63365 1034199 1081679 1129496 1176717 1224806 1274644 1324036 1369018 1406993 1437777 1461915 1479013
63354 1479013 1488089 1488989 1482819 1471202 1455851 1438929 1422820 1408618 1395137 1380193 1362702 1342915
63342 1342915 1320951 1296155 1267885 1235947 1200204 1160888 1119591 1078963 1040995 1006253 974857
63331 974857 947045 922568 900855 882350 868376 858887 851640 844606 838161 833786 831716 831278 832771
63318 832771 837447 845913 857832 872845 890642 910385 931255 953514 978101 1005321 1034811 1066424
63306 1066424 1100170 1135539 1171835 1208957 1246925 1284942 1321872 1357204 1390493 1420232 1444566
63295 1444566 1462800 1474997 1480409 1477979 1468503 1454896 1439986 1425115 1410885 1397670 1384805 1370407
63283 1370407 1352636 1330571 1303925 1273057 1239430 1204909 1170271 1135358 1100657 1067272 1035124
63272 1035124 1002768 969660 937186 906736 878207 851320 826991 806067 787767 770776 755157
63261 755157 741815 730611 720326 710198 700384 691121 682449 674620 667889 662028 656802 652693 650327
63248 650327 649397 649002 648865 649296 650019 650001 648642 646291 643332 639551 634807 629719 625088 620905 616518 611800
63232 611800 607751 605615 605486 606075 606012 605193 604619 605219 607266 610705 615196 619734 622942 624187 623995 623230
63216 623230 622554 622868 625285 629970 635659 641162 646745 653121 659614 664541 667457 669914 673698 679032 684875
63201 684875 690341 695373 700430 705919 711818 717614 722729 727183 731798 737641 745230 754151 763416 772355
63187 772355 781322 791377 803214 816740 831809 848738 867549 887140 906084 924263 943035 963674
63175 963674 986291 1010440 1036021 1063045 1091006 1119176 1147475 1176554 1206935 1238340 1269899
63164 1269899 1300755 1330433 1358889 1386320 1412735 1437625 1460339 1481006 1500824 1520980 1541273
63153 1541273 1560203 1576432 1589677 1600000 1606783 1608986 1606079 1598181 1585423 1567825 1545903 1520901
63141 1520901 1494236 1466931 1439542 1412231 1384831 1357316 1330394 1305410 1283613 1265709 1251934
63130 1251934 1242047 1235251 1230713 1228291 1228330 1230810 1235517 1243164 1255365 1272742 1293580 1315008 1335313
63117 1335313 1354697 1374270 1394914 1416788 1439260 1461452 1483257 1505511 1528468 1550483 1569131
63106 1569131 1583774 1596126 1607916 1618619 1626004 1628399 1625739 1618621 1607276 1591827 1572913 1551272
63094 1551272 1526795 1498773 1467463 1434819 1403130 1373265 1344837 1317807 1293001 1270981 1251162
63083 1251162 1232292 1213213 1193130 1172100 1151709 1134333 1120910 1109992 1099695 1089884 1081492 1074373
63071 1074373 1067505 1061358 1058391 1060185 1064891 1068657 1069380 1068364 1068453 1071277 1076394 1082310 1087789 1092526 1097211
63056 1097211 1102998 1110525 1119303 1128351 1137352 1146712 1156338 1165080 1172030 1177886 1184225 1191602 1199298 1206942
63042 1206942 1215319 1225053 1235236 1244046 1250457 1254898 1258568 1262506 1266983 1271416 1275025 1277764 1280312 1283050
63028 1283050 1285629 1287790 1289915 1292232 1294187 1295424 1297003 1300632 1306813 1314588 1323142 1332807 1344222 1357278
63014 1357278 1371416 1386469 1402592 1419461 1436221 1452555 1469573 1489162 1512351 1538663 1567207
63003 1567207 1597876 1630946 1665962 1702010 1739097 1778259 1820060 1863935 1909469 1957330 2008180
62992 2008180 2061454 2116210 2172609 2231556 2293205 2356751 2421476 2486982 2552459 2616629 2678535
62981 2678535 2737806 2794291 2848287 2901054 2954092 3007534 3059936 3109906 3157355 3202910 3246641
62970 3246641 3287731 3324966 3357186 3383395 3402547 3413150 3413441 3402511 3381165 3351111 3313313 3267750
62958 3267750 3214728 3155635 3092248 3026101 2958911 2892936 2830355 2772651 2720890 2676074 2638695
62947 2638695 2608265 2583809 2564685 2550755 2542192 2539633 2544182 2556412 2575160 2597833 2622290 2648237
62935 2648237 2676500 2707155 2738906 2770408 2801619 2833194 2864739 2894534 2921282 2945472 2968333
62924 2968333 2989750 3007806 3020279 3025986 3024641 3015983 2999447 2974615 2941734 2901496 2854063 2798648
62912 2798648 2734759 2663913 2589282 2513268 2436298 2358454 2281195 2206328 2134064 2063543 1994987
62901 1994987 1930027 1870050 1815511 1766753 1723931 1685768 1649858 1614966 1582015 1552255 1525531
62890 1525531 1501044 1478772 1459083 1441610 1425480 1410347 1396449 1383896 1372457 1361710 1350986
62879 1350986 1339611 1327696 1316207 1305814 1296083 1286229 1275970 1265144 1253290 1240479 1227956 1216874
62867 1216874 1206697 1195775 1183380 1170399 1158244 1147860 1139503 1132433 1124873 1115427 1104839 1095518
62855 1095518 1088870 1083758 1077917 1070320 1061732 1053527 1046500 1040546 1035015 1029379 1023796 1019009 1015608 1013520
62841 1013520 1012179 1011048 1009931 1009018 1008649 1008874 1009188 1008773 1006954 1003483 998804 994219 991243 990133 989400
62826 989400 987505 984748 982516 980863 978206 973853 969525 967336 967142 967133 966567 966484 967656 969218 970006 970357
62810 970357 971739 974942 979267 983333 986158 987551 987885 987605 986794 985345 983679 982878 983613 985165 986157 986230
62794 986230 986373 987417 988908 989886 990200 990353 990396 989810 988625 987957 988984 991639 994642 996803 998150 999775
62778 999775 1002607 1006201 1008751 1008553 1005633 1001863 999399 999035 1000020 1001145 1001789 1002103 1002596 1003628 1005105 1006466
62762 1006466 1007107 1006941 1006495 1006296 1006294 1006116 1005807 1005863 1006399 1006742 1006315 1005676 1006112 1008196 1011234 1014221 1016898 1019705
62744 1019705 1023114 1027261 1031997 1037116 1042765 1049678 1058750 1070315 1084131 1099992 1117838 1137301 1157878
62731 1157878 1179761 1203761 1230112 1258226 1288109 1321028 1357946 1398099 1440258 1484801 1533255
62720 1533255 1586126 1642584 1702336 1766396 1835549 1909091 1985810 2065471 2148646 2235423 2324802
62709 2324802 2415212 2505273 2593804 2678814 2756539 2822337 2873360 2909925 2933520 2944034 2940027
62698 2940027 2921052 2887988 2841215 2780517 2707464 2626203 2540760 2452678 2362242 2270718 2179965
62687 2179965 2090712 2002763 1916595 1833584 1754866 1681017 1612598 1549957 1492525 1439231 1389619
62676 1389619 1343820 1301481 1261571 1223443 1187546 1154918 1126290 1101569 1079799 1059746 1040953
62665 1040953 1024081 1009941 998482 989065 981272 975020 970418 968130 969284 974041 980647 986809 991831
62652 991831 996614 1002062 1008739 1017885 1031174 1049012 1070098 1093101 1117852 1144639 1173425 1204464
62640 1204464 1238726 1276933 1318827 1364081 1413252 1466981 1524765 1585457 1648656 1714633 1782976
62629 1782976 1852239 1921075 1988926 2055267 2118779 2177583 2229859 2273816 2307457 2329032 2337819
62618 2337819 2334073 2318011 2289143 2247057 2193017 2130409 2063045 1992849 1919583 1843095 1765318
62607 1765318 1689340 1616639 1546241 1477059 1410200 1347967 1291027 1237910 1187567 1141127 1100201
62596 1100201 1064322 1031306 999764 970102 942991 918093 894654 872416 851398 831494 812793
62585 812793 795720 780284 765749 751632 738501 727104 717075 707299 697310 687625 678766 670661
62573 670661 663004 655719 648969 643045 638158 634020 629898 625585 622160 621150 622892 626112 629042 630566
62559 630566 630604 630153 630949 634317 639970 646333 652225 657870 664242 671937 680860 690600 700835 711694 723885
62544 723885 738156 754463 771997 790183 809437 830738 854637 880764 908167 936135 964938
62533 964938 995769 1029711 1066741 1106001 1146975 1189986 1235418 1282858 1331187 1379201 1425686
62522 1425686 1468931 1506602 1536662 1558738 1574372 1585331 1591434 1590485 1580537 1561801 1536005 1504618
62510 1504618 1468470 1428599 1386455 1343251 1299898 1257518 1217129 1178675 1141148 1103995 1067770
62499 1067770 1033262 1000739 970444 943037 918907 897427 877409 858144 839607 821853 804503
62488 804503 786839 768471 750182 733938 721394 712210 704311 695938 686938 678047 669839 662782 657478
62475 657478 654062 651858 650362 650196 652299 656409 661129 665521 670010 675574 682610 690811 699795 709512
62461 709512 720130 731736 744280 757840 772801 789577 808275 829003 852439 879477 910079
62450 910079 942970 976903 1011913 1048913 1088279 1129159 1170036 1209746 1248074 1285362 1321161
62439 1321161 1353168 1378194 1394671 1403652 1406841 1404187 1394247 1376521 1352456 1324177 1293123 1260058
62427 1260058 1225565 1190054 1153855 1117848 1083732 1053161 1026565 1002961 980939 959820 939955
62416 939955 922037 906175 891776 878289 865759 854535 844804 836642 830177 825247 821209 817623 815003
62403 815003 814337 815917 819068 822910 826932 830895 834834 839193 844516 850900 858165 866423 875957 886633
62389 886633 898068 910282 923244 935701 945581 952073 956438 960067 962540 962407 959201 953593 945888
62376 945888 935470 921884 905707 888235 870780 854231 838713 823683 808866 794901 782508
62365 782508 771306 760403 750187 742462 738409 737173 736950 736811 737008 738152 740737 745030 750709 756857
62351 756857 762910 769473 777718 788114 800147 813107 826616 840443 854312 868056 881758 895662
62339 895662 909900 924075 937004 947398 955180 961798 968785 976197 982718 986967 988338 987153 984641
62326 984641 982471 981538 981352 981170 981397 983144 986737 991641 997797 1006053 1017143 1031098 1047791 1067215
62312 1067215 1089113 1113315 1140724 1173050 1211126 1254236 1301458 1352860 1408987 1470062 1536212
62301 1536212 1607601 1683596 1762449 1842362 1922146 2000370 2074869 2143940 2207039 2263217 2309694
62290 2309694 2343339 2363212 2370437 2366024 2350223 2323884 2288984 2247302 2199454 2145526 2086017 2022057
62278 2022057 1955377 1888132 1822137 1758284 1697145 1639743 1586815 1537599 1490486 1445011 1402265
62267 1402265 1363325 1328250 1296613 1267836 1240735 1213991 1187767 1163985 1144426 1129146 1117125
62256 1117125 1107585 1100058 1093949 1088784 1084444 1080617 1076524 1071724 1066740 1062364 1058719 1055438 1052325 1049394
62242 1049394 1046555 1043600 1040116 1035292 1028534 1020740 1014263 1010909 1010374 1011120 1012277 1014065 1016909 1020986
62228 1020986 1026387 1033035 1040531 1048630 1057682 1068091 1079618 1091782 1104672 1118711 1133746 1149099
62216 1149099 1164588 1181024 1199586 1221006 1245216 1271389 1298488 1326250 1355568 1387457 1421909
62205 1421909 1458463 1497921 1542677 1594883 1654586 1719942 1788908 1860340 1933730 2008415 2083206
62194 2083206 2156411 2225812 2288581 2341773 2383398 2413044 2431122 2437560 2431665 2413344 2383970 2345662
62182 2345662 2299980 2247595 2188995 2125200 2057965 1989724 1923285 1861013 1803766 1750559 1699621
62171 1699621 1650300 1604035 1563168 1528753 1499929 1475517 1455289 1438992 1425068 1411796 1399481
62160 1399481 1390085 1384457 1381211 1378691 1376730 1375792 1375647 1375894 1376896 1378997 1381392 1382790 1382937 1382721 1383149
62145 1383149 1384986 1388914 1395188 1403457 1413572 1426150 1441609 1459244 1478191 1498733 1521524 1546019
62133 1546019 1571047 1596799 1624809 1655830 1689030 1723642 1760154 1799158 1839854 1880371 1918993
62122 1918993 1954623 1986680 2015230 2040967 2064752 2087315 2109469 2132123 2155914 2181240 2208773
62111 2208773 2239391 2273416 2310461 2350308 2393437 2440331 2490516 2542415 2593663 2641444 2683211
62100 2683211 2717624 2744630 2764424 2776774 2781636 2779924 2773064 2761903 2746475 2726758 2703284 2676902
62088 2676902 2648166 2617205 2584407 2551250 2520126 2492905 2469752 2449702 2432198 2417527 2405811
62077 2405811 2396459 2388977 2383683 2380957 2380128 2379797 2379314 2379569 2382241 2388552 2398704 2412068 2427584 2444172
62063 2444172 2461282 2479421 2499955 2523993 2551431 2581331 2613161 2647170 2683481 2721480 2760536
62052 2760536 2800770 2842575 2885831 2930247 2976151 3024171 3074282 3125947 3179140 3234553 3292821
62041 3292821 3354253 3419144 3487432 3557949 3629067 3700540 3773992 3851153 3932263 4016536 4103284
62030 4103284 4191760 4280405 4367234 4451166 4532684 4613362 4694921 4778367 4863565 4949665 5035955
62019 5035955 5121956 5206712 5288728 5367051 5441895 5513824 5583065 5650441 5718369 5789739 5865572
62008 5865572 5944475 6024426 6104375 6183946 6262502 6339226 6413781 6486202 6556015 6621822 6682035
61997 6682035 6736092 6784925 6830187 6872836 6912448 6947866 6978369 7004113 7025659 7043484 7057988
61986 7057988 7069580 7078508 7084844 7088979 7091964 7095041 7098871 7103644 7109733 7117490 7126044 7133080 7136669 7137161
61972 7137161 7136574 7136256 7135880 7134551 7131770 7127031 7119550 7109058 7096186 7081548 7065232 7047753 7030407
61959 7030407 7013618 6995856 6975822 6955274 6938064 6926219 6918397 6912352 6907495 6904538 6904101 6906643 6912784
61946 6912784 6922637 6935386 6950283 6967605 6987933 7010969 7035689 7061101 7086095 7108890 7127508
61935 7127508 7140747 7148244 7149813 7145234 7134401 7116988 7092144 7059204 7018949 6973823 6926733 6879505
61923 6879505 6832131 6783292 6731965 6678745 6625346 6572654 6519895 6466099 6411620 6357421 6303292
61912 6303292 6247903 6190707 6132978 6076664 6022676 5970474 5918892 5867142 5815405 5764803 5716781
61901 5716781 5672286 5631334 5593186 5556914 5522113 5489301 5459502 5433346 5410651 5390874 5373627
61890 5373627 5358793 5346675 5338225 5334619 5336268 5342697 5353588 5369285 5389772 5413941 5440717 5470421
61878 5470421 5504097 5541709 5581948 5623693 5666876 5711959 5759487 5810189 5864627 5922440 5982611
61867 5982611 6044678 6109164 6176859 6248642 6326219 6412026 6507792 6613960 6731197 6861710 7008256
61856 7008256 7172392 7354792 7557123 7782554 8034199 8313851 8622602 8962131 9334970
61847 9334970 9743967 10192102 10682711 11219332 11804987 12441387 13128342 13863226 14640460
61838 14640460 15451170 16282578 17116382 17926359 18677111 19326148 19829447 20148506 20256607
61829 20256607 20143067 19814870 19295020 18617742 17822177 16946793 16025941 15088739 14159636
61820 14159636 13259222 12403719 11603267 10861341 10177068 9548779 8975416 8455098 7983724
61811 7983724 7555944 7167191 6814327 6494743 6205712 5944643 5709219 5497062 5305776
61802 5305776 5133674 4979950 4843723 4723302 4616901 4523736 4443661 4375819 4318556 4270824
61792 4270824 4232699 4203832 4182075 4164611 4150104 4138678 4129714 4120744 4109006 4093388 4074426 4053099
61780 4053099 4030295 4006951 3983761 3960844 3938408 3917831 3901494 3891210 3887010 3887448 3890810 3896071
61768 3896071 3903150 3912376 3923362 3934303 3942752 3947311 3948279 3946517 3942167 3934930 3925213 3914261 3903154
61755 3903154 3892431 3883118 3877595 3878741 3888251 3906293 3932780 3968405 4014169 4070405 4136800 4213158
61743 4213158 4299727 4396877 4504929 4624398 4756087 4900853 5059335 5231715 5417477 5615792
61733 5615792 5826781 6052415 6295503 6557648 6838783 7139030 7460459 7806571 8180600
61724 8180600 8585120 9023215 9499280 10018236 10584184 11200326 11870561 12601168 13400524
61715 13400524 14276687 15235277 16279816 17413375 18638558 19955225 21358449 22838153
61707 22838153 24378513 25955229 27531885 29057981 30469540 31692365 32649189 33271177
61699 33271177 33510411 33348219 32796944 31896398 30706763 29299104 27745573 26112083 24454414
61690 24454414 22816733 21231750 19722499 18304665 16987635 15774431 14662712 13647495
61682 13647495 12723323 11884168 11122610 10430566 9801013 9228414 8707516 8232608 7798510
61673 7798510 7401866 7040700 6712419 6412648 6136527 5881089 5645807 5430536 5233339
61664 5233339 5050804 4880071 4719811 4569265 4427080 4291350 4160390 4033428 3911091
61655 3911091 3795242 3687452 3587102 3491588 3398972 3309909 3226373 3149047 3076852 3008652 2944330
61644 2944330 2884077 2827560 2774007 2722398 2671422 2620149 2569164 2520168 2473900 2429253 2385149
61633 2385149 2342425 2302664 2265634 2229368 2192819 2156979 2122901 2089906 2056761 2023881 1993258
61622 1993258 1966422 1943237 1922492 1902934 1883887 1865623 1849177 1835179 1822810 1810427 1797342
61611 1797342 1784491 1773317 1764462 1757546 1751639 1745702 1738984 1731262 1722604 1713028 1702815 1692925 1684453
61598 1684453 1677619 1671878 1667012 1663335 1660668 1658073 1655113 1652624 1651604 1651880 1652547 1653238 1654226 1655595 1656971
61583 1656971 1657973 1658379 1658054 1657272 1656895 1657661 1659393 1661400 1663551 1666490 1670954 1677415 1686247 1697573 1710753
61568 1710753 1724394 1737022 1747708 1756423 1764110 1771866 1779360 1784458 1785325 1782775 1779405 1776341 1771947
61555 1771947 1764156 1752976 1739927 1725915 1710852 1694955 1679110 1663792 1648563 1633047 1617699
61544 1617699 1603060 1588757 1573950 1558660 1544119 1531619 1521406 1512822 1505266 1498758 1493739 1490515
61532 1490515 1488832 1487965 1487455 1487906 1490675 1496380 1503999 1511866 1519430 1527520 1537055 1548230 1561159 1576662
61518 1576662 1595968 1619825 1647958 1679042 1711215 1743288 1775802 1810538 1848798 1890513 1934969
61507 1934969 1981580 2029624 2078125 2126632 2175587 2225266 2274863 2323194 2369835 2414957 2458620
61496 2458620 2501005 2542787 2584189 2623877 2659812 2691290 2719362 2745252 2769138 2790577 2809348
61485 2809348 2825468 2838677 2848071 2852307 2850612 2844090 2835482 2826891 2818016 2807361 2794814 2782024 2770517
61472 2770517 2760531 2751860 2744790 2740025 2738554 2741707 2750423 2764224 2781812 2802967 2829099 2861720 2901278
61459 2901278 2947714 3001131 3061514 3128777 3203726 3288192 3383706 3490783 3609904 3742132 3888078
61448 3888078 4047323 4219941 4407875 4613695 4838396 5081337 5341831 5619677 5914292
61439 5914292 6224181 6546854 6877998 7210442 7534636 7840218 8116761 8353767 8541654
61430 8541654 8673666 8746697 8760638 8717918 8623786 8485917 8312942 8113420 7895871 7668556
61420 7668556 7438424 7210621 6989315 6778430 6581225 6399851 6235895 6090859 5965485
61411 5965485 5859072 5770254 5698299 5643046 5603913 5579818 5570128 5574874 5593813 5625815 5669342
61400 5669342 5722988 5785334 5854809 5929923 6009180 6090620 6172173 6252958 6333636 6414941 6496366
61389 6496366 6576777 6655541 6732231 6805989 6876581 6945702 7015639 7086426 7155795 7222304 7286929
61378 7286929 7350703 7412272 7469124 7520176 7565588 7604786 7636532 7660857 7679099 7691519 7696282
61367 7696282 7691583 7677775 7656547 7628690 7593736 7551717 7504473 7454842 7404710 7354227 7303271
61356 7303271 7253595 7208752 7171276 7140398 7113507 7089756 7071160 7059876 7055397 7055057 7056502 7058744
61344 7058744 7061116 7062358 7061126 7056916 7049957 7040471 7028639 7015592 7003953 6996802 6996137 7002913 7018602
61331 7018602 7045859 7087154 7143460 7215157 7303982 7413283 7546247 7704370 7887567 8095269
61321 8095269 8327297 8583793 8864156 9165908 9485002 9817443 10159894 10508063 10854888
61312 10854888 11190686 11504292 11783604 12016505 12193330 12308793 12361051 12350002 12278079 12151788
61302 12151788 11979791 11768646 11521829 11243047 10938499 10615176 10278832 9934877 9589693
61293 9589693 9249275 8917177 8595044 8284552 7987672 7705562 7438639 7187858 6955030
61284 6955030 6741604 6547575 6371679 6212616 6070292 5945850 5839994 5751347 5677227 5616169
61274 5616169 5568706 5535372 5515093 5506300 5508688 5522829 5548574 5584629 5629245 5680426 5735750 5792811
61262 5792811 5849943 5906354 5961924 6017014 6071744 6124915 6174189 6217848 6255992 6289665 6319439
61251 6319439 6345212 6366598 6382972 6393850 6399850 6402447 6401960 6396403 6383153 6361289 6331635 6295109
61239 6295109 6251953 6202227 6146245 6084714 6018870 5950065 5878772 5804576 5727618 5649425 5571892
61228 5571892 5496341 5424102 5356851 5295305 5238554 5185897 5138621 5098749 5066617 5040878 5020205
61217 5020205 5003579 4989469 4976515 4964959 4955831 4948485 4940219 4928736 4914099 4898217 4883452 4871882
61205 4871882 4864657 4861315 4860138 4859647 4859621 4860908 4864779 4872470 4884977 4903436 4929848 4966776 5015632
61192 5015632 5075827 5146381 5227897 5322006 5429325 5548837 5678796 5816951 5959856 6102847
61182 6102847 6240569 6366824 6474191 6554767 6601414 6608340 6571923 6492492 6374835 6225552
61172 6225552 6050208 5853965 5643853 5428065 5212894 5001884 4797874 4603981 4422237
61163 4422237 4252946 4095950 3951308 3818519 3696631 3585568 3485924 3396980 3316476 3243007
61153 3243007 3177259 3120033 3070350 3026577 2988424 2956799 2932275 2914513 2902628 2895474 2892019 2891918
61141 2891918 2895421 2902647 2913588 2928689 2948230 2970782 2993316 3013372 3030328 3044309 3054932 3061640
61129 3061640 3064354 3063227 3058418 3050403 3039664 3025809 3007928 2986005 2960977 2933274 2902577 2869297
61117 2869297 2834708 2798980 2760535 2718244 2673005 2626300 2578566 2530075 2482121 2435853 2390703
61106 2390703 2345269 2299112 2252721 2206405 2160409 2115460 2072069 2029834 1988452 1948971 1913014
61095 1913014 1881080 1852298 1825318 1798765 1771594 1743928 1716864 1690576 1663446 1634137 1603622
61084 1603622 1573849 1545110 1516292 1487288 1459600 1434732 1413435 1396393 1384059 1375480 1368488 1361580
61072 1361580 1355041 1350144 1348009 1349107 1352908 1357905 1362776 1367603 1373458 1381067 1390707 1402891 1417861
61059 1417861 1434440 1450777 1466494 1482854 1500417 1517740 1533164 1547004 1561110 1576750 1593643
61048 1593643 1610641 1626637 1640964 1653492 1664387 1673406 1679460 1681187 1678082 1670968 1661339 1650348
61036 1650348 1638540 1626464 1615197 1605848 1598495 1591836 1584028 1573919 1561670 1548528 1535750 1523391
61024 1523391 1510277 1495624 1480335 1465962 1452726 1439624 1426367 1413795 1402179 1390659 1379079
61013 1379079 1368951 1361637 1356705 1353124 1350881 1350186 1350151 1349809 1349655 1350598 1351985 1352388 1352037 1352793 1355775 1360469
60997 1360469 1366121 1372506 1379303 1386295 1394469 1405471 1419408 1434372 1448565 1461812 1474641 1487136
60985 1487136 1499469 1512521 1527026 1542578 1558277 1574163 1591524 1611780 1635130 1660240 1685537
60974 1685537 1711102 1738850 1770390 1805321 1842395 1881594 1923795 1968850 2015548 2063425 2113247
60963 2113247 2165619 2220435 2277734 2337690 2399650 2462746 2527724 2596538 2669783 2746350 2826494
60952 2826494 2913386 3010162 3116649 3230562 3351220 3480688 3621631 3775168 3940792 4117753
60942 4117753 4306423 4508171 4723407 4950242 5186705 5434459 5698766 5984315 6292936
60933 6292936 6626116 6987565 7381657 7810981 8277161 8782785 9331312 9927354 10579758
60924 10579758 11303333 12115343 13031697 14068692 15246047 16584436 18101779 19816396
60916 19816396 21752255 23936654 26396905 29167252 32285387 35737223 39360957 42806632
60908 42806632 45641235 47556973 48520759 48749331 48562761 48260067 48076888 48158009 48483867
60899 48483867 48810427 48733420 47881355 46102458 43509217 40376684 37001625 33617047 30374394
60890 30374394 27357770 24604216 22123890 19915523 17971621 16276752 14807851 13538687
60882 13538687 12443192 11495320 10668844 9939519 9287679 8699158 8164688 7678267 7234825
60873 7234825 6828774 6454838 6109538 5790661 5495396 5220340 4963563 4725229 4505203
60864 4505203 4300701 4107232 3921603 3743406 3573787 3413480 3262230 3119584 2985534
60855 2985534 2860133 2742809 2632675 2529561 2434042 2346006 2263846 2185860 2112126 2044090
60845 2044090 1982379 1925819 1872665 1821864 1772978 1725791 1680593 1638231 1599311 1563642 1530791
60834 1530791 1500759 1473713 1449379 1427097 1406346 1387136 1370169 1356497 1346456 1338920 1332344 1326633
60822 1326633 1323000 1321645 1320738 1318477 1315022 1311315 1306941 1300801 1293452 1286947 1281989 1276673 1268743 1258047
60808 1258047 1245963 1233228 1219516 1204984 1191224 1180132 1172144 1166024 1160464 1155507 1152039 1150188
60796 1150188 1149000 1147858 1147498 1149075 1152782 1157958 1164135 1171336 1179699 1189428 1200897 1214310 1229585
60783 1229585 1247019 1267396 1290704 1315277 1339112 1361543 1382668 1401690 1417145 1428739 1437845
60772 1437845 1446248 1455187 1465176 1475577 1484775 1492058 1498903 1506888 1514790 1519749 1521129 1520990 1520634 1519233
60758 1519233 1516519 1514084 1512605 1510175 1505360 1499929 1496209 1493057 1486890 1476020 1461862 1446332 1430102
60745 1430102 1413283 1396067 1378515 1360917 1344247 1329243 1315397 1301904 1289040 1277418 1266651
60734 1266651 1256272 1247440 1241959 1239876 1239667 1240644 1243597 1249134 1256981 1266882 1278604 1290965 1302512
60721 1302512 1313395 1325100 1338190 1351715 1365018 1378437 1392045 1405425 1419178 1434838 1452475
60710 1452475 1469919 1485287 1498997 1512415 1525884 1539035 1551881 1564506 1576564 1587987 1599224
60699 1599224 1609984 1618913 1625636 1632079 1640403 1650253 1659319 1666139 1671136 1675237 1678678 1681259 1682906 1683830
60685 1683830 1684606 1685931 1687862 1689487 1689747 1688339 1685587 1681925 1677743 1673106 1667227 1658964 1648357 1636994
60671 1636994 1626259 1616021 1605641 1595335 1585508 1575590 1564871 1554053 1544656 1537070 1530368 1523943
60659 1523943 1518105 1512979 1508041 1503153 1499041 1496129 1493477 1489515 1483529 1476133 1468444 1461001 1453333 1444524
60645 1444524 1434372 1423872 1414337 1406226 1399274 1393577 1389836 1388398 1388593 1389356 1390107 1390713 1390913 1390245 1388489
60630 1388489 1385766 1381999 1376559 1368773 1358738 1347244 1334783 1321103 1306110 1290726 1276102 1262124
60618 1262124 1247541 1231784 1215925 1201511 1189055 1178032 1167810 1158138 1149231 1141952 1137440 1135932
60606 1135932 1136203 1136712 1137174 1138580 1141925 1147440 1154809 1163429 1172355 1180467 1187074 1192356 1197152 1202288 1207938
60591 1207938 1213642 1219150 1225086 1232279 1240409 1247973 1253864 1258390 1262449 1266437 1270525 1275301 1281214 1287755
60577 1287755 1294056 1300189 1307128 1315538 1325325 1336301 1348466 1361546 1375086 1389343 1405361 1423662
60565 1423662 1443347 1463091 1482706 1503032 1524266 1545132 1564106 1581065 1597113 1612887 1627694
60554 1627694 1640432 1650610 1657940 1661661 1661240 1657598 1652707 1647911 1643297 1638590 1633652 1627885 1620186 1609883
60540 1609883 1597081 1581903 1564513 1546230 1529303 1514593 1500451 1485059 1469117 1455063 1444302
60529 1444302 1436555 1431451 1429090 1428987 1430044 1431971 1435479 1440458 1445092 1447769 1449138 1451308 1455302 1460145
60515 1460145 1464389 1467654 1470386 1472825 1475065 1477937 1482730 1489457 1496234 1501483 1506314 1513206 1522156 1529899
60501 1529899 1533829 1535260 1537389 1541199 1545179 1548373 1551429 1554564 1556625 1557053 1557255 1558999 1562572 1567642
60487 1567642 1575056 1586544 1602966 1623918 1648924 1678136 1711752 1749350 1790134 1833681 1880470
60476 1880470 1931712 1988304 2049425 2112090 2172048 2225029 2267364 2296388 2311129 2312583 2302886 2284261
60464 2284261 2259100 2230707 2203000 2179028 2160061 2146528 2139487 2140622 2150800 2169177 2194020 2224008
60452 2224008 2258266 2295429 2333559 2371344 2409021 2447810 2488847 2533008 2581306 2634796 2694193
60441 2694193 2760304 2834944 2920892 3020590 3135075 3264397 3408913 3570044 3749925 3950396
60431 3950396 4172113 4414410 4676097 4956750 5257503 5580668 5928532 6302428 6702614
60422 6702614 7127985 7573992 8028981 8471953 8874586 9206622 9440894 9556049 9538554 9385594
60412 9385594 9107233 8725137 8267735 7764467 7241581 6720161 6215923 5739799 5298448
60403 5298448 4894717 4528754 4199522 3905453 3643929 3411166 3203307 3017449 2851334
60394 2851334 2702657 2569257 2449446 2341488 2243127 2152420 2068791 1992524 1923463 1860810
60384 1860810 1803930 1752401 1705415 1661970 1621669 1584502 1549827 1516434 1483841 1452732 1423892
60373 1423892 1397413 1373165 1351270 1331656 1313779 1297219 1282043 1268127 1254632 1240691 1226364
60362 1226364 1212514 1199963 1189099 1180049 1172735 1166808 1161874 1157883 1155196 1154240 1155072 1157195 1159821 1162427
60348 1162427 1164994 1167653 1170282 1172696 1174942 1177042 1178693 1179766 1180950 1183249 1186797 1190802 1194831 1199513
60334 1199513 1205601 1212788 1219898 1225993 1231031 1235613 1240350 1245403 1250460 1255163 1259414 1263068 1265572 1266467
60320 1266467 1266269 1266229 1266911 1267506 1266896 1264986 1262511 1259862 1256799 1253371 1250505 1249167 1249130 1249046 1247982 1246629
60304 1246629 1246704 1249263 1253897 1259417 1264777 1269280 1272733 1275979 1280766 1288263 1297745 1307350 1316099 1324615
60290 1324615 1333896 1344074 1354686 1365599 1377094 1389120 1400825 1411125 1419682 1427149 1434277 1440993
60278 1440993 1446658 1451003 1454203 1456135 1456379 1455191 1453627 1452405 1451578 1451823 1454799 1461158 1469093 1476258 1482527
60263 1482527 1489392 1497014 1503515 1507262 1508313 1507288 1504168 1498785 1491513 1482961 1473794 1465120 1458133 1452925
60249 1452925 1448513 1444324 1440798 1438278 1436452 1435325 1435554 1437146 1438882 1439983 1441439 1444643 1449374 1454136
60235 1454136 1458121 1461855 1466260 1471849 1478585 1485780 1492347 1497808 1502800 1508007 1513083 1517473 1522006 1528617
60221 1528617 1538339 1550376 1563265 1576364 1589996 1604774 1621079 1638758 1656979 1674583 1690978
60210 1690978 1706693 1722963 1740712 1760018 1780533 1802369 1826310 1853119 1882928 1915622 1951530
60199 1951530 1991154 2034180 2079379 2125911 2174544 2227462 2286946 2354062 2428232 2508033 2592778
60188 2592778 2683298 2780928 2886043 2998229 3117689 3245566 3382576 3528051 3680657 3839618
60178 3839618 4004937 4176802 4354747 4536855 4719643 4899159 5072218 5236218 5388388
60169 5388388 5526470 5650095 5760072 5855812 5934522 5993424 6031848 6050869 6052319 6038990 6014611
60158 6014611 5982354 5943973 5901177 5857185 5815979 5780659 5753292 5735630 5729080 5734700 5754122 5789819
60146 5789819 5843418 5914366 6001199 6103394 6220801 6352056 6495111 6648946 6813173 6985851
60136 6985851 7162769 7338680 7508020 7664796 7803590 7921356 8017318 8090852 8140383 8164531
60126 8164531 8163290 8137736 8089415 8020383 7933249 7831093 7717972 7599281 7480613 7366116
60116 7366116 7258875 7162642 7081722 7018822 6974397 6948756 6943594 6960460 6998604 7055417 7128477
60105 7128477 7216260 7317139 7428559 7547133 7668921 7789579 7904712 8010409 8103637 8182504
60095 8182504 8246222 8294597 8327612 8345905 8351503 8347469 8336810 8322364 8307714 8297324 8295437 8305615
60083 8305615 8331622 8377755 8447523 8542394 8662341 8807227 8977432 9173988 9398837 9654481
60073 9654481 9942643 10263550 10616927 11003069 11422155 11872884 12352511 12857706 13384353
60064 13384353 13926496 14476446 15026018 15567086 16090979 16588351 17050159 17468426 17835920
60055 17835920 18145722 18391561 18568343 18672160 18700277 18651521 18526645 18328244 18060694 17730513
60045 17730513 17346624 16919977 16462942 15988822 15511066 15041880 14591199 14167039 13776524
60036 13776524 13425945 13119754 12860134 12647910 12483513 12366590 12295057 12265191 12272665 12313088
60026 12313088 12381584 12472424 12579091 12694173 12809104 12914995 13004420 13072291 13114865 13128833
60016 13128833 13112284 13066021 12992703 12894458 12771980 12625877 12457914 12270541 12066052 11846708
60006 11846708 11615083 11373752 11125163 10872430 10619799 10371545 10130705 9899676 9682017
59997 9682017 9482736 9306363 9155074 9028910 8927310 8850047 8797142 8768657 8764801 8785799
59987 8785799 8831276 8899765 8989075 9097185 9222530 9363188 9515661 9674494 9833081 9984891
59977 9984891 10124163 10245816 10345094 10417644 10460190 10471211 10450739 10399337 10317497 10206317 10068657
59966 10068657 9909174 9733166 9545594 9351165 9154652 8960620 8773171 8596390 8434737
59957 8434737 8292290 8171450 8072851 7996588 7943185 7913305 7907128 7924408 7964860 8028249 8114545
59946 8114545 8224411 8359125 8519304 8703599 8908945 9131878 9369030 9616386 9868557
59937 9868557 10118825 10359458 10582311 10780293 10948942 11086157 11190116 11258082 11287659 11278492
59927 11278492 11231986 11149898 11034063 10887328 10714096 10520274 10313376 10102228 9895291 9698851
59917 9698851 9517248 9354562 9215094 9102137 9017186 8960604 8932250 8931286 8956337 9006284 9080290
59906 9080290 9176763 9293227 9427672 9579042 9745534 9922975 10105655 10288437 10467545 10639964
59896 10639964 10803025 10954436 11092156 11214657 11321939 11415931 11499157 11573288 11639727 11701224
59886 11701224 11761932 11826071 11897622 11981440 12083627 12210266 12366323 12555947 12782941 13050232
59876 13050232 13359256 13710556 14104836 14542760 15023167 15541400 16089293 16656676 17232495
59867 17232495 17804035 18355050 18865432 19313620 19679829 19947704 20104598 20142426 20059360 19860537
59857 19860537 19556726 19162259 18693863 18170404 17612233 17039397 16469265 15915019 15386109
59848 15386109 14890059 14433553 14021700 13656871 13339204 13068552 12845623 12671218 12544954
59839 12544954 12465203 12430027 12437728 12486404 12573228 12694281 12844806 13019272 13211045 13412245
59829 13412245 13614060 13806887 13979767 14119963 14214117 14250824 14222729 14126782 13963311 13735223
59819 13735223 13447714 13108210 12726264 12312989 11879682 11436354 10991491 10552907 10127981
59810 10127981 9722513 9339866 8981781 8649711 8344832 8067174 7815733 7589696 7388961
59801 7388961 7213002 7059515 6924600 6804430 6696631 6599971 6512817 6432242 6354858 6278374
59791 6278374 6202209 6126962 6053817 5984267 5919680 5860768 5807734 5760880 5720630 5686880 5658538
59780 5658538 5633536 5608807 5580616 5545850 5503324 5453493 5397148 5335167 5269241 5201665 5134354
59769 5134354 5069033 5008277 4954977 4910489 4874662 4848023 4832382 4828623 4835364 4850691 4873803 4904023
59757 4904023 4939764 4979973 5025487 5077745 5137265 5204650 5281550 5368627 5463326 5561453 5660143
59746 5660143 5757643 5851386 5938805 6019559 6094406 6162016 6219527 6266709 6307068 6344031 6378206
59735 6378206 6409524 6440108 6473512 6512499 6559127 6616068 6686226 6771377 6872302 6990139 7126915
59724 7126915 7284986 7466713 7674717 7911976 8181327 8484672 8822613 9195117 9602570
59715 9602570 10045329 10521415 11024655 11544772 12067215 12570865 13026612 13401141 13664810
59706 13664810 13798538 13797315 13671185 13443043 13142002 12795675 12426972 12055394 11697635 11365750
59696 11365750 11066654 10804414 10581899 10400160 10258480 10156217 10093203 10067735 10076131 10115511
59686 10115511 10185506 10286143 10415754 10572584 10757071 10970830 11214297 11487048 11789728
59677 11789728 12124106 12491689 12893656 13331700 13807734 14323062 14878910 15477398 16121038
59668 16121038 16811750 17551256 18341693 19184526 20079085 21022947 22012957 23044356 24108970
59659 24108970 25195426 26291086 27383025 28457700 29501661 30503997 31458808 32366468
59651 32366468 33233640 34071760 34893937 35712140 36536500 37375821 38236864 39122240 40028694
59642 40028694 40946781 41861557 42753926 43602414 44384617 45078171 45662475 46121627 46447027
59633 46447027 46638122 46701831 46651662 46506443 46288774 46024139 45740232 45464571 45220807 45027220
59623 45027220 44898880 44850112 44894086 45041211 45299213 45674149 46170289 46789460 47531371 48393651
59613 48393651 49370116 50448961 51612691 52837922 54092928 55335485 56514636 57574853
59605 57574853 58458633 59108321 59471317 59508314 59199397 58545644 57568666 56309163 54822120
59596 54822120 53168402 51407340 49593725 47777087 45999661 44293479 42679181 41166701
59588 41166701 39755694 38434912 37182182 35967045 34756359 33521295 32243195 30916512
59580 30916512 29548689 28157507 26766449 25399188 24075525 22810250 21613830 20492796
59572 20492796 19449677 18483772 17592782 16773774 16022967 15335481 14706017 14129821 13602948
59563 13602948 13121719 12682143 12280117 11912332 11576768 11271898 10995337 10743590 10513074
59554 10513074 10300959 10105006 9923122 9753091 9592143 9436720 9283362 9129887 8974991
59545 8974991 8816758 8652768 8482117 8306336 8127902 7948854 7771236 7597560 7429839
59536 7429839 7269045 7116329 6973764 6843096 6724784 6619066 6526695 6447531 6379742 6322002
59526 6322002 6275451 6241828 6220542 6209351 6207102 6213831 6228833 6250893 6280233 6317872 6362849 6412186
59514 6412186 6464142 6519578 6579550 6643377 6710059 6780002 6854266 6933292 7017568 7108765 7209225
59503 7209225 7320903 7445425 7584503 7739428 7910520 8097592 8300811 8521067 8760027
59494 8760027 9019798 9301833 9606094 9931940 10279663 10650072 11042499 11454321 11882541
59485 11882541 12324423 12776110 13231932 13685904 14132984 14568251 14986129 15381641 15751785
59476 15751785 16094486 16406491 16683274 16921060 17118674 17277928 17402936 17498823 17570521 17622715
59466 17622715 17660774 17691062 17720142 17754461 17801086 17867487 17959190 18077760 18221539 18387420
59456 18387420 18570393 18761212 18945792 19107748 19231554 19303785 19312854 19248896 19104274 18874218
59446 18874218 18557586 18157799 17683181 17145853 16559852 15940100 15302506 14663400 14037149
59437 14037149 13433825 12859618 12319559 11819020 11362320 10950714 10582556 10255114 9965890
59428 9965890 9712835 9494304 9308923 9155153 9031230 8935929 8869004 8830311 8818836 8833200
59418 8833200 8872845 8938049 9028951 9145189 9286376 9452396 9643274 9859028 10099241 10362187
59408 10362187 10644740 10943640 11256287 11579332 11906616 12229002 12535751 12815430 13056397
59399 13056397 13248181 13382837 13454532 13458336 13390777 13251760 13045140 12777532 12457390 12094848
59389 12094848 11700873 11285753 10858652 10428092 10001583 9584655 9181252 8795236 8430503
59380 8430503 8089519 7772670 7479252 7208264 6958371 6728360 6517986 6327477 6155982
59371 6155982 6001492 5862457 5738550 5629713 5535464 5455220 5387983 5331537 5283486 5243770
59361 5243770 5214806 5198238 5192607 5195089 5204522 5221615 5247009 5280438 5321581 5370714 5428202 5493377
59349 5493377 5563474 5633635 5699207 5759208 5817493 5879961 5950823 6031642 6123129 6226777 6344752
59338 6344752 6478628 6628211 6791201 6964093 7143917 7329815 7523797 7730538 7956059
59329 7956059 8205638 8482581 8788994 9127196 9499644 9907963 10353300 10837847 11365173
59320 11365173 11938775 12560859 13232303 13952683 14719862 15529920 16377219 17253452 18146480
59311 18146480 19041003 19920709 20769661 21572902 22318212 22998340 23610664 24154396 24629121
59302 24629121 25036136 25379404 25663874 25893215 26069254 26192248 26260654 26271082 26219066 26099856
59292 26099856 25909100 25644312 25306246 24898381 24425647 23895212 23317996 22706533 22069854
59283 22069854 21411722 20734448 20042362 19340348 18631248 17917291 17203355 16496806 15804422
59274 15804422 15130973 14480535 13857612 13266603 12710877 12192252 11710858 11265869 10856956
59265 10856956 10484590 10148491 9846564 9575962 9334542 9120702 8932755 8769332 8629641
59256 8629641 8512547 8416257 8339685 8283074 8246079 8226183 8220406 8227940 8249784 8286254 8336189
59245 8336189 8398366 8472365 8557961 8654343 8759680 8870800 8983900 9096360 9207265 9315341
59235 9315341 9417328 9509716 9591422 9663272 9725312 9776300 9815748 9845020 9866387 9882471 9896876
59224 9896876 9913980 9937435 9969510 10012113 10067630 10138455 10226278 10331877 10454882 10593573 10745508
59213 10745508 10908305 11079159 11253622 11425602 11588588 11736002 11860327 11953140 12007268 12019407
59203 12019407 11990994 11927070 11834346 11719644 11589386 11449855 11307287 11167243 11034089 10911264
59193 10911264 10801750 10707912 10631076 10571552 10528842 10501572 10487452 10483491 10486172 10491632 10496617 10499754
59181 10499754 10501458 10502365 10502336 10501216 10499842 10499979 10504014 10515195 10537514 10574867 10630878 10709727 10816032
59168 10816032 10953249 11123051 11327095 11568489 11850490 12174216 12538328 12940076 13375295
59159 13375295 13837320 14316339 14799311 15269977 15709829 16100372 16424797 16667730 16814842
59150 16814842 16854346 16779304 16588645 16286933 15883728 15392352 14828367 14209284 13555007 12886096
59140 12886096 12219755 11567929 10939532 10342714 9783680 9264881 8786328 8347894 7948875
59131 7948875 7586475 7256864 6957351 6686061 6440258 6216864 6014108 5830801 5664490
59122 5664490 5512287 5373420 5249118 5139863 5044254 4960288 4886130 4819921 4760788 4709997
59112 4709997 4669204 4637492 4612089 4592197 4580019 4577417 4583573 4596811 4616992 4644852 4680205 4722004
59100 4722004 4769501 4822641 4881926 4948212 5021990 5102697 5189622 5283429 5385602 5496285 5613941
59089 5613941 5737321 5866304 6000469 6138428 6279218 6422829 6568402 6713152 6854061
59080 6854061 6989626 7118847 7239383 7347816 7441328 7518385 7578400 7621753 7649963 7665250
59070 7665250 7670005 7666747 7658036 7646237 7633919 7624598 7622238 7629647 7648187 7679394 7725876 7789873
59058 7789873 7871727 7970653 8086597 8220615 8373776 8546370 8738004 8947929 9175331 9419628
59048 9419628 9680388 9956717 10246743 10547581 10855527 11166334 11475541 11778226 12067780
59039 12067780 12334982 12569128 12760461 12901503 12986797 13012906 12979435 12889464 12748295 12561750
59029 12561750 12335540 12075622 11788580 11481347 11160122 10829188 10490976 10147537 9801472
59020 9801472 9455145 9109991 8767634 8431048 8103160 7784558 7474000 7171342 6878668
59011 6878668 6598301 6330957 6076437 5835032 5607485 5394079 5194255 5006789 4830195
59002 4830195 4663538 4507082 4361724 4227728 4104379 3990533 3884761 3785187 3690233 3599689
58992 3599689 3514244 3434021 3358398 3287198 3220986 3159936 3103274 3050062 2999742 2951889 2906290
58981 2906290 2863419 2824007 2788037 2755017 2725317 2700218 2680380 2665031 2652824 2642759 2634320
58970 2634320 2627675 2623873 2623935 2627613 2633735 2641540 2650607 2659721 2667262 2672938 2677891 2682847 2687313 2690646
58956 2690646 2692573 2692594 2690569 2688228 2688269 2691134 2694375 2696231 2698294 2703296 2711761 2722482 2735136 2750191
58942 2750191 2766399 2780419 2789686 2794654 2797553 2799597 2800087 2798053 2794096 2789997 2786659 2783303 2779302 2776144
58928 2776144 2776403 2780956 2788407 2797391 2808164 2821446 2836885 2853620 2871652 2891725 2914160 2938605
58916 2938605 2964959 2993894 3026067 3060939 3096921 3133266 3171663 3214888 3263572 3315325 3367832
58905 3367832 3421715 3479121 3540535 3604591 3670400 3738193 3807870 3878842 3951430 4026777 4105135
58894 4105135 4185778 4268796 4355506 4446878 4543209 4645684 4756509 4876797 5005715 5142366
58884 5142366 5287228 5441185 5604497 5777385 5960432 6153857 6357597 6572571 6800626
58875 6800626 7042886 7299575 7571959 7862847 8174395 8506793 8859892 9234768 9632940
58866 9632940 10055566 10504475 10982878 11494093 12040495 12624333 13248323 13914590 14624209
58857 14624209 15378465 16179177 17026821 17919565 18854986 19831064 20843876 21884972 22941890
58848 22941890 23999982 25042180 26047557 26991383 27846633 28585466 29181048 29610097 29854949
58839 29854949 29904669 29756572 29417766 28904145 28236755 27439182 26537333 25558636 24529383
58830 24529383 23473180 22411641 21364080 20344938 19362854 18423413 17531621 16691146 15903228
58821 15903228 15167798 14484152 13849371 13258252 12706715 12193799 11718563 11276822 10863271
58812 10863271 10475462 10113190 9774924 9457525 9159187 8880288 8621250 8381349 8159639
58803 8159639 7955372 7767360 7594197 7435036 7289239 7155814 7034414 6926182 6832169 6751442
58793 6751442 6682198 6624082 6577707 6542473 6516988 6501650 6498920 6510518 6535772 6573216 6622708
58782 6622708 6685518 6763117 6856127 6963759 7084166 7215960 7359460 7516220 7687671 7874712
58772 7874712 8078050 8298112 8534878 8788510 9059999 9350851 9662506 9996330 10353571
58763 10353571 10735035 11141579 11575223 12038936 12535184 13065915 13634216 14244259 14898793
58754 14898793 15598245 16343087 17135195 17975371 18860973 19787267 20749216 21739726 22746953
58745 22746953 23754873 24745028 25695711 26580720 27371731 28042220 28568364 28928232 29103772
58736 29103772 29084796 28870567 28468803 27895064 27171982 26325937 25383200 24369327 23310196
58727 23310196 22230332 21149707 20083719 19045709 18047052 17094701 16191088 15337290 14534752
58718 14534752 13783633 13081534 12425032 11811559 11239216 10705765 10208320 9743421 9307197
58709 9307197 8896168 8508109 8141795 7796360 7471485 7167524 6884271 6619914 6372051
58700 6372051 6139263 5920933 5716328 5525023 5347456 5183733 5032454 4891924 4761756
58691 4761756 4641928 4531166 4428017 4332850 4246872 4169372 4097692 4029808 3965400 3904613 3847412
58680 3847412 3794067 3744660 3697951 3651831 3604843 3556365 3505913 3453612 3400825 3348778 3296995
58669 3296995 3244450 3191733 3140514 3091254 3042901 2994300 2944430 2892026 2836855 2780833 2726015
58658 2726015 2671905 2616686 2560480 2505180 2451341 2397750 2344291 2292950 2245386 2201247 2159290
58647 2159290 2118683 2078994 2040416 2004139 1970971 1939663 1908145 1876395 1846381 1819227 1794186
58636 1794186 1770480 1748245 1727379 1707099 1687096 1667817 1649554 1632495 1617452 1605025 1594312
58625 1594312 1584115 1575177 1569392 1567001 1566495 1567150 1569550 1573495 1577490 1580631 1583163 1584967 1585354 1584652 1584208
58610 1584208 1584535 1585111 1586116 1588487 1592100 1595756 1599164 1603133 1607629 1611588 1614795 1617935 1620574 1621157 1619491
58595 1619491 1617359 1616336 1616883 1619742 1626010 1635366 1646292 1658554 1673461 1691364 1711164 1732833 1758016
58582 1758016 1787279 1819123 1852854 1890326 1933459 1981756 2033448 2087572 2143851 2202196 2263580
58571 2263580 2330144 2403356 2483035 2568711 2660667 2759159 2864228 2976970 3099557 3233337
58561 3233337 3378208 3534345 3703070 3885649 4082879 4296243 4527438 4775983 5039082
58552 5039082 5314702 5603004 5903554 6212409 6522606 6825829 7112483 7371494 7591476
58543 7591476 7762000 7874214 7922241 7904919 7825391 7689019 7503003 7277542 7024651 6754540
58533 6754540 6474277 6190085 5908835 5636484 5376659 5131374 4901659 4687131 4486764
58524 4486764 4300756 4130155 3974542 3831978 3701553 3583974 3479213 3385597 3301704 3226978
58514 3226978 3159953 3098127 3040429 2987793 2940547 2897177 2856221 2817258 2779537 2742110 2706106
58503 2706106 2674235 2646788 2620319 2591334 2558972 2523007 2481971 2435171 2384552 2332672 2280326
58492 2280326 2227596 2175708 2126384 2080511 2038375 1999747 1963111 1926621 1890735 1858216 1830823
58481 1830823 1807787 1787974 1771188 1756577 1742271 1727819 1714794 1703868 1693567 1682876 1672531
58470 1672531 1662421 1650403 1635436 1619443 1604161 1588206 1569208 1547046 1523172 1498531 1473967
58459 1473967 1451086 1430904 1412659 1395039 1377330 1358859 1339292 1320274 1304495 1292198 1280917
58448 1280917 1269529 1259910 1253517 1249254 1246099 1244772 1245063 1244635 1242755 1242367 1245952 1251843 1257169 1262146
58434 1262146 1268766 1277259 1286516 1296274 1306417 1315669 1323277 1330455 1338172 1345268 1350671 1355556 1361110 1366149
58420 1366149 1369173 1370930 1372657 1373664 1373042 1371943 1371667 1371150 1368860 1365755 1363893 1363332 1362560 1360562 1356443
58405 1356443 1348548 1336308 1321763 1307230 1292655 1276949 1260399 1243987 1227970 1212959 1200688
58394 1200688 1191789 1184388 1176692 1169264 1163218 1158298 1154542 1153489 1155559 1158337 1159793 1161166 1164480 1169230
58380 1169230 1173906 1178809 1184995 1192265 1200348 1210157 1221707 1232861 1242251 1251254 1260944 1269515 1275045
58367 1275045 1278329 1280464 1280207 1276669 1272290 1270081 1269879 1270090 1271137 1274448 1280006 1287561 1298297 1312682
58353 1312682 1328629 1344101 1359328 1374454 1387965 1399915 1413472 1430166 1446567 1458818 1467406
58342 1467406 1474192 1478138 1477900 1475554 1473471 1470088 1462819 1452630 1441728 1429546 1415452 1402750 1395270
58329 1395270 1392082 1390055 1389321 1391642 1395883 1400308 1407502 1421800 1443142 1468005 1494613 1522316 1547559
58316 1547559 1565937 1577638 1586299 1593491 1598576 1602539 1607164 1611486 1613695 1615614 1620993 1630410 1641924
58303 1641924 1655237 1670838 1686655 1700258 1712996 1727422 1742232 1754469 1765101 1777428 1791516
58292 1791516 1805323 1819873 1837945 1858666 1878467 1896337 1913216 1927563 1936849 1942436 1947891 1953517
58280 1953517 1957511 1961059 1966985 1974655 1981652 1989302 2001049 2016482 2032360 2048247 2065782 2084035
58268 2084035 2101445 2120785 2145860 2174515 2201313 2226136 2253720 2285544 2318686 2352004 2386912
58257 2386912 2422505 2456313 2489493 2525133 2562108 2596915 2630718 2667833 2707825 2745842 2780286
58246 2780286 2813493 2845520 2874349 2901826 2932238 2965071 2996096 3025432 3057574 3093671 3130796
58235 3130796 3168572 3209462 3252806 3295758 3339800 3389196 3443537 3499191 3557254 3622066 3692481
58224 3692481 3762916 3832761 3906418 3984348 4062814 4142420 4228055 4320053 4414153 4510434 4613335
58213 4613335 4722404 4832058 4941122 5053665 5169910 5285447 5400085 5518486 5641524
58204 5641524 5766014 5893172 6028087 6170887 6318051 6472027 6639187 6818551 7003461
58195 7003461 7194402 7398897 7618626 7848481 8088680 8345546 8619526 8904804 9201734
58186 9201734 9517203 9852029 10201243 10567883 10962725 11388660 11838867 12311882 12814553
58177 12814553 13348732 13909746 14499870 15128764 15799075 16506850 17257475 18065249 18935955
58168 18935955 19866626 20863595 21942637 23109623 24359838 25698068 27139388 28687893
58160 28687893 30335299 32082477 33940239 35906720 37968008 40124725 42394397 44786155
58152 44786155 47300703 49958886 52801589 55857661 59142711 62694134 66574869 70838478
58144 70838478 75526001 80701521 86452537 92854446 99985030 107985424 117060146 127409523
58136 127409523 139212729 152674469 168012413 185387609 204936018 226904815 251704925
58129 251704925 279860154 311987364 348566917 388980655 430111137 466028023 489941492
58122 489941492 497421563 488352495 466227111 435845007 401413824 365899167 331150754
58115 331150754 298205132 267607247 239690061 214673207 192609807 173377717 156766784
58108 156766784 142534824 130396669 120045016 111217265 103714827 97366913 92024288
58101 92024288 87586467 83989144 81162715 79036017 77572773 76780150 76711926 77482864 79170234
58092 79170234 81534129 83812960 84946198 84148267 81321547 76963809 71764589 66292265
58084 66292265 60911141 55813125 51070160 46700326 42720167 39144254 35961082 33138240
58076 33138240 30644401 28448222 26507045 24777710 23233037 21853562 20611737 19478310
58068 19478310 18436066 17474666 16579967 15739515 14949687 14206541 13498032 12815087 12161491
58059 12161491 11543462 10958410 10402792 9881196 9397640 8946504 8521217 8123411 7754602
58050 7754602 7407340 7073641 6754345 6451715 6161014 5878135 5607931 5356167 5120152
58041 5120152 4895377 4684348 4490639 4310829 4140368 3981300 3836681 3703361 3577369
58032 3577369 3460319 3353549 3252070 3151321 3053994 2963540 2877042 2791305 2709665 2635396
58022 2635396 2564137 2490308 2415960 2346136 2280332 2215447 2152508 2093635 2036718 1979644 1925655
58011 1925655 1878275 1835115 1792699 1753026 1719145 1688516 1657270 1627211 1602266 1581439 1561287
58000 1561287 1542099 1525794 1510875 1494994 1479308 1464991 1448856 1427988 1405571 1386610 1370850
57989 1370850 1355128 1339598 1326170 1313695 1300180 1287234 1277105 1267791 1256263 1244099 1234869 1228141
57977 1228141 1221040 1213700 1208311 1204680 1201365 1199386 1200277 1202116 1201693 1199092 1196349 1193355 1188820 1183351
57963 1183351 1177935 1171383 1162932 1155332 1151695 1151163 1150905 1150190 1149290 1146979 1142663 1138559 1136304 1133915 1129443
57948 1129443 1124578 1120879 1115486 1104991 1090912 1077062 1064018 1050582 1038102 1028475 1020049 1010335
57936 1010335 1000908 994732 990306 983510 974174 966010 960932 958155 958383 964307 976720 993629 1012911
57923 1012911 1032716 1050056 1062561 1071216 1078411 1084207 1087446 1089222 1091706 1094474 1095427 1094518 1093258 1091403
57909 1091403 1087532 1082221 1077439 1073382 1068851 1063904 1059209 1053838 1046905 1040403 1037096 1036357 1035245 1032738
57895 1032738 1029721 1025790 1019744 1012675 1006979 1002521 997108 990530 984891 980942 977246 973193 970046 968793
57881 968793 969314 971590 975405 979062 980663 980447 979830 978814 976527 973409 970299 966057 958760 948642 937327
57866 937327 924899 910567 895534 882175 870612 858991 847001 836317 827678 820255 814061 810358
57854 810358 809355 809738 810696 812446 814883 817700 821709 828013 835989 843990 851687 859831 868213 875924 883113
57839 883113 890317 896650 900897 903933 907603 911579 913772 913607 912487 911054 908397 904074 898750 892736
57825 892736 885804 878459 871538 864684 857077 849475 843573 839484 835623 830976 825815 820631 816054 813363
57811 813363 813196 814309 815485 817989 823916 832632 841156 847792 853275 858687 864461 871216 879380 887934
57797 887934 895295 901142 905700 907998 906977 903722 900167 896163 890304 883271 877571 873853 870073 864683
57783 864683 858430 852600 847503 843102 839386 835830 831818 827585 823542 819320 814803 810980 807887 803033
57769 803033 794356 783615 774123 766172 757841 749289 742383 736324 727775 715951 703874 693625 683731
57756 683731 672505 660759 649728 639154 629091 621064 615745 611687 607929 605734 606111 607587 608304
57743 608304 608773 610823 615069 620867 627673 635079 642468 649806 657884 666938 675918 683845 690802 696918
57729 696918 701521 704187 705717 707346 709743 713116 717287 721283 723974 725546 727276 729604 731564 732304
57715 732304 731811 729877 725934 720409 714825 709923 705022 699801 695262 692087 689379 685925 681837 678110
57701 678110 675497 674546 675894 679684 685057 690696 695591 699381 702666 706905 713140 720696 727865 733762
57687 733762 738748 743405 748096 753299 759242 765489 771835 779126 787946 797181 805476 813666 823944 836830
57673 836830 850683 864013 876556 888324 899506 911200 924329 937998 951033 964917 982706
57662 982706 1004724 1027898 1049924 1071741 1095118 1120264 1147030 1176269 1208402 1242177 1276206
57651 1276206 1310630 1346354 1383944 1424053 1467544 1514337 1563302 1613957 1667059 1723182 1782267
57640 1782267 1845022 1912927 1986218 2063662 2145084 2232093 2325431 2423644 2525794 2633682 2749929
57629 2749929 2875510 3010865 3158027 3319758 3497430 3691234 3901620 4129046 4372902
57620 4372902 4631869 4904686 5189544 5483291 5781875 6080459 6371928 6646096 6891611
57611 6891611 7098627 7259950 7371786 7435011 7454558 7435227 7377239 7275701 7123951 6918151
57601 6918151 6661443 6365735 6048646 5726979 5412627 5113724 4836712 4585366 4359435
57592 4359435 4156831 3976883 3819952 3684617 3567380 3465272 3377214 3302666 3240406 3189132
57582 3189132 3148271 3117572 3096412 3083905 3079436 3082923 3094593 3114526 3142474 3178399 3223082 3277716
57570 3277716 3342879 3418440 3504366 3600943 3708235 3826336 3956349 4100090 4258372 4430281
57560 4430281 4614414 4809830 5015179 5227540 5442448 5654204 5855573 6037733 6191232
57551 6191232 6307174 6378190 6399488 6369510 6289326 6161934 5992944 5791134 5566418 5326947
57541 5326947 5079087 4829407 4584369 4347837 4121086 3905837 3705153 3520535 3350305
57532 3350305 3192244 3046079 2911992 2788321 2672556 2563773 2462783 2370701 2288218 2215138
57522 2215138 2149438 2087930 2029007 1973910 1924396 1880285 1840231 1803487 1769620 1737807 1707866
57511 1707866 1680912 1657561 1636547 1616668 1598980 1585302 1575332 1567056 1559463 1553196 1548920 1546759
57499 1546759 1547093 1550298 1555719 1562287 1570167 1580623 1594250 1610416 1628474 1648636 1671590 1697996
57487 1697996 1728237 1762168 1799265 1839278 1882203 1927348 1973624 2021529 2073672 2132180 2196504
57476 2196504 2265031 2338026 2417513 2504900 2600160 2702961 2813252 2931051 3056882 3192088
57466 3192088 3337428 3491561 3651865 3816268 3983013 4148978 4309471 4459435 4593558
57457 4593558 4705380 4787781 4834984 4844007 4814928 4750697 4656131 4536014 4394521 4236998 4071012
57446 4071012 3903909 3739952 3581189 3430167 3289657 3160174 3040159 2928961 2827909
57437 2827909 2738197 2659529 2591199 2532832 2483590 2442193 2408188 2381725 2361678 2345829 2333596
57426 2333596 2326865 2327061 2333010 2342936 2357198 2377372 2403557 2434346 2469120 2508817 2554444 2606045
57414 2606045 2663504 2727462 2798987 2878616 2965958 3060176 3161029 3269437 3386699 3513039
57404 3513039 3647250 3787738 3933045 4080802 4226812 4365762 4492355 4601095 4685605 4739491
57394 4739491 4758308 4740316 4685597 4595454 4473103 4324302 4156517 3977257 3793067 3609404
57384 3609404 3430565 3259284 3096523 2942053 2795685 2658220 2531199 2415630 2311065
57375 2311065 2216110 2129642 2051158 1980063 1915357 1856393 1803232 1755607 1712081 1671253 1633501
57364 1633501 1600261 1571409 1544717 1518657 1494518 1474524 1458592 1444305 1429802 1415327 1401912
57353 1401912 1389885 1379155 1369917 1362327 1355974 1350140 1344306 1338290 1332366 1327330 1323826 1321437 1319041
57340 1319041 1316319 1314280 1313928 1315039 1316776 1319134 1323077 1329204 1336663 1343631 1349051 1353828 1360018 1368638
57326 1368638 1378725 1388809 1398683 1409007 1419732 1430014 1439564 1449062 1459136 1469728 1480551 1491371
57314 1491371 1501741 1511242 1520079 1528853 1537875 1547369 1558023 1570178 1582676 1593841 1603858 1614963
57302 1614963 1628953 1645501 1663126 1680636 1697391 1713352 1729377 1746413 1764105 1781299 1798136
57291 1798136 1816257 1836553 1858140 1880095 1902535 1925187 1946579 1966098 1985524 2007129 2031146
57280 2031146 2056451 2082634 2109794 2137039 2163096 2188373 2215011 2244712 2277367 2311670 2346159
57269 2346159 2379810 2412586 2445472 2479362 2514018 2548715 2583685 2620221 2659446 2701514 2745888
57258 2745888 2791812 2838590 2885901 2933863 2982656 3032236 3082590 3133996 3186962 3242114 3299910
57247 3299910 3359821 3419925 3478323 3535039 3591593 3648617 3705164 3760726 3816559 3874178 3933609
57236 3933609 3993944 4054650 4115557 4176610 4238632 4303428 4372099 4443988 4518139 4594861 4674803
57225 4674803 4757564 4842656 4930969 5023493 5118944 5214475 5308892 5403550 5499491 5594844 5685700
57214 5685700 5768790 5842837 5908025 5964922 6013738 6054018 6085103 6107261 6122596 6134560 6146172
57203 6146172 6158745 6172651 6189240 6211149 6240265 6276241 6317875 6365238 6419130 6478715 6541135
57192 6541135 6603575 6664552 6723051 6777811 6827990 6873460 6913875 6948229 6975798 6996884 7012583
57181 7012583 7024772 7036460 7051012 7070696 7096941 7132220 7180329 7244118 7323760 7417794 7525071
57170 7525071 7645236 7777987 7922292 8075851 8235339 8397904 8562525 8729328 8897906
57161 8897906 9066911 9234500 9397833 9552822 9696205 9827810 9949406 10061858 10165185
57152 10165185 10260700 10350493 10434633 10511137 10578987 10638947 10691187 10734698 10769954 10799970 10827702
57141 10827702 10854151 10879749 10905818 10933898 10965144 11000708 11041105 11085043 11130649 11177510 11225134
57130 11225134 11269722 11305722 11331207 11348996 11362045 11370715 11375052 11376137 11373827 11366243 11353003 11336303
57118 11336303 11317658 11296439 11272793 11248786 11225194 11200146 11172455 11143366 11113632 11082127 11048984
57107 11048984 11016809 10986906 10957433 10927179 10897939 10871033 10844415 10815192 10782178 10744441 10700844
57096 10700844 10653072 10605832 10562092 10521402 10484385 10454572 10433316 10416823 10400706 10383572 10363780
57085 10363780 10337297 10302012 10260071 10212730 10156941 10090237 10014613 9932016 9840164 9736464 9621753
57074 9621753 9496113 9355025 9193859 9012632 8812906 8594320 8357898 8108215 7848066
57065 7848066 7575069 7287070 6986000 6672421 6341200 5986140 5602770 5182195 4708471
57056 4708471 4167088 3550001 2847642 2042976 1118654 62533 -1139557 -2508413 -4062524
57047 -4062524 -5813486 -7777588 -9983737 -12463517 -15244132 -18359749 -21859292 -25794405
57039 -25794405 -30211554 -35165117 -40723875 -46952840 -53903630 -61635397 -70227853 -79757828
57031 -79757828 -90277188 -101816737 -114368510 -127831802 -142008151 -156672698 -171581614
57024 -171581614 -186344571 -200400659 -213354650 -225425580 -237379988 -249757182 -262041951
57017 -262041951 -272621504 -279603873 -281778687 -279011393 -271975596 -261604463 -248668930
57010 -248668930 -233670457 -216996261 -199123325 -180670437 -162286702 -144523500 -127790886
57003 -127790886 -112363299 -98379525 -85854198 -74724338 -64896195 -56258499 -48684781
56996 -48684781 -42051673 -36253533 -31193147 -26771592 -22899342 -19507621 -16538161 -13930380
56988 -13930380 -11628165 -9590636 -7786306 -6183405 -4753918 -3479416 -2343968 -1327059
56980 -1327059 -410418 414883 1155277 1822054 2425176 2966541 3447239 3876144 4264523
56971 4264523 4617429 4936884 5227941 5494733 5735445 5948046 6136560 6305416 6451992
56962 6451992 6570996 6662058 6726910 6763334 6768497 6745079 6698223 6629328 6537869 6425646 6293711
56951 6293711 6138495 5956835 5752315 5531940 5299795 5058797 4814930 4573727 4335172
56942 4335172 4097620 3864598 3642833 3436329 3247597 3081541 2940771 2817039 2692307
56933 2692307 2548949 2377154 2176029 1953261 1722805 1497718 1284113 1083373 897558
56924 897558 729242 578436 443835 325494 222651 130926 45713 -33191 -104026 -168045
56914 -168045 -227945 -282879 -329537 -367318 -398306 -422804 -438718 -445058 -442816 -432925 -416330 -395312
56902 -395312 -371752 -344843 -313171 -278011 -241767 -204545 -165519 -126749 -92576 -66007 -48259
56891 -48259 -40388 -41997 -49249 -57530 -65752 -75552 -87231 -99291 -110780 -120997 -127784 -129427 -127742
56878 -127742 -126214 -125363 -122621 -116220 -106456 -93610 -77427 -58428 -37478 -14777 8217 26745 35664
56865 35664 34313 26033 13423 -3293 -23735 -46235 -69432 -92564 -113960 -131416 -144276 -153490
56853 -153490 -159817 -163673 -166252 -168830 -171152 -172187 -172040 -171562 -170700 -168886 -166325 -163333 -159313 -154101 -149227
56838 -149227 -145903 -142801 -137875 -131302 -124409 -116782 -106852 -94519 -80816 -65614 -47976 -28037 -6261
56824 18416 47137 78087 107166 131324 149504 161268 166999 168871 169166 167900 164299 160062 158683
56811 158683 161704 167871 175962 186367 199933 217137 238418 263850 292737 324930 361849 404694
56799 404694 452377 502475 552649 598998 634643 653220 653862 641014 620077 595114 569319 544747
56787 544747 521801 501140 485426 477139 475833 480099 490946 510268 537091 568878 606050 651735
56775 651735 707353 771796 844471 924431 1005039 1073074 1115570 1126517 1107233 1063619 1004452
56764 1004452 939411 875746 816640 762767 714204 670979 633643 603778 582675 569667 563324
56753 563324 563929 572906 590188 614370 645388 684697 732420 785784 839811 887403 919558 929038
56741 929038 915089 883012 839124 788047 734150 682037 634387 591398 553063 520070 492280
56730 492280 468704 449560 436200 428540 424812 424390 428654 438426 452741 470783 492696 517264 540488
56717 540488 557376 564009 558045 539556 512094 480947 449441 418179 387661 359296 333444 308924
56705 308924 285416 264342 246569 231205 217545 206363 198269 192242 186565 180040 172196 163858 157445
56692 157445 154763 154379 153174 150447 148171 147279 146508 145302 144879 145552 145767 144877 144227 144324 143539 140965 138114
56675 138114 136334 134880 133049 131910 132165 132297 130631 127440 123557 118870 113867 110709 110737 112340 113019
56660 113019 112272 110992 109567 108162 107386 107063 105736 102893 100197 98984 98161 96391 94775 95177 97082
56645 97082 98270 97868 96646 94933 92226 88612 84983 82019 80205 80403 83070 87171 91011 93907 96169
56630 96169 97998 99477 101241 104090 108127 112899 117954 122665 126070 127653 127924 127824 128097 129396 132013
56615 132013 134999 136543 136036 135053 135634 138156 141313 143511 143883 142717 141270 140604 140420 139651 137978 135793
56599 135793 133027 129379 125566 122767 120864 118837 116879 116169 116433 115883 114071 112726 113130 114677 116687
56584 116687 119495 122789 125039 125820 126804 129207 131938 133486 133992 134291 134643 135585 138243 142417 145989 147632
56568 147632 148555 150263 152208 153135 153067 152351 150252 146350 142221 140053 140452 142755 146263 149857 151679 150763
56552 150763 148105 145219 142762 141392 142118 144357 145356 143271 139586 136955 136007 135857 136352 137969 140468
56537 140468 143335 146710 150469 153374 154517 154589 154513 153916 152220 150004 148093 146484 145360 145699 147592 149465
56521 149465 150347 151472 154242 158260 162692 167672 172704 175729 175926 175644 177355 180390 182987 185787 190554
56506 190554 196829 202694 207812 213013 217966 222090 226994 234927 245205 254956 263230 271669 281179 290593
56492 290593 298945 306674 313992 319946 323741 325683 326608 327440 329100 331646 333735 334050 332693 330190 326142
56477 326142 320373 314425 310129 307300 304408 300689 296095 290240 283320 277109 273097 270475 267762 265339
56463 265339 264304 263971 262935 261655 261324 260933 258264 253392 248517 244515 240334 235735 231913 229102 225941
56448 225941 221658 216897 212279 208090 205421 205456 207413 209054 209346 208973 208445 207645 207072 207407 207978 207598 206728
56431 206728 206744 207417 207448 207250 208522 211002 212424 212117 212106 213909 216667 219329 222482 226889 231902 236306
56415 236306 239531 241532 242825 244865 248855 254033 258695 262892 268235 274913 281000 285147 288040 290815
56401 290815 293924 297979 303596 309694 313837 315216 315791 317748 321178 324848 327823 329620 330089 329891 330214
56386 330214 331606 333845 336804 340271 343159 344308 344060 343721 343677 343423 343059 343012 342506 340132 335958 331458
56370 331458 327518 324078 321357 319514 317439 314012 310407 309042 310258 312052 312872 312570 310827 307142 302493
56355 302493 298677 295859 293037 290753 290662 292248 292800 291155 288837 286968 284771 281810 279063 276909 274617
56340 274617 272781 273626 277644 282197 284821 285963 287360 289606 292354 295046 296530 295802 294010 293867 296297
56325 296297 299501 301893 303892 306101 307978 309311 310960 313199 315214 316914 319159 321535 322255 321169
56311 321169 320524 321719 323531 324584 325400 326902 329089 332173 336784 342051 345908 348409 352239 358557 364874
56296 364874 368613 370430 372289 374527 376714 379393 382884 385927 387375 388012 389248 391293 393802 396917
56282 396917 400680 404806 409777 416468 424086 430447 434959 439116 443519 447043 449791 453942 460308 466800
56268 466800 471852 476743 483079 490666 499545 511245 526034 541443 555454 568676 581640 592947
56256 592947 602295 612450 625559 639995 653368 666165 679712 693000 704532 715066 725614 734840
56244 734840 741581 747832 755877 764166 769583 772533 776343 782499 789586 796229 802284 807773 813311 821000
56230 821000 832499 846744 861504 876293 891882 908365 925826 945543 968162 992049 1015831
56219 1015831 1041209 1070775 1104421 1140558 1179446 1222533 1269636 1319699 1373347 1431835 1494392
56208 1494392 1559512 1628097 1702533 1783355 1869636 1962090 2062933 2172954 2291251 2417628
56198 2417628 2553013 2697955 2852757 3018252 3194116 3377275 3564496 3755754 3952385
56189 3952385 4152403 4350334 4541150 4721711 4888692 5037935 5166196 5271468 5351629 5404753
56179 5404753 5430695 5430793 5406511 5360173 5296224 5219602 5133167 5038355 4937465 4833101 4726016
56168 4726016 4615643 4502332 4387172 4270220 4150777 4028908 3905053 3778981 3650764
56159 3650764 3521697 3392538 3262055 3129293 2996078 2865301 2737998 2614131 2494852
56150 2494852 2381706 2274760 2173611 2078893 1990837 1908035 1829872 1758291 1694654 1636869 1582450
56139 1582450 1532297 1488180 1448425 1409807 1372237 1337844 1306761 1277612 1250980 1228370 1208531
56128 1208531 1188826 1169774 1154336 1142972 1133003 1122698 1112596 1103091 1094217 1087661 1085619 1087534
56116 1087534 1090803 1094484 1099594 1106541 1115299 1127117 1142673 1159390 1174168 1188029 1204447 1223914
56104 1223914 1244102 1264715 1287782 1313114 1337629 1359543 1379805 1399330 1418205 1437412 1457864
56093 1457864 1478033 1496077 1513907 1535490 1561647 1590419 1621934 1658664 1701280 1748731 1802379
56082 1802379 1865552 1938965 2020840 2111433 2212809 2324189 2442561 2568349 2705565 2855584
56072 2855584 3015523 3183201 3358121 3535858 3706619 3861930 3999446 4120314 4226265
56063 4226265 4320729 4408045 4488843 4559144 4615098 4655068 4676312 4674631 4649846 4608188 4557033
56052 4557033 4499719 4436207 4364836 4281692 4181791 4063263 3928512 3781088 3624661 3465399
56042 3465399 3311172 3166776 3032764 2909610 2799707 2704659 2624000 2556956 2502124 2455482
56032 2455482 2412823 2374352 2342797 2317098 2292641 2267740 2244740 2224264 2203960 2184103 2168928
56021 2168928 2160609 2156575 2154242 2153790 2154968 2155965 2156930 2160070 2165205 2169936 2174997 2184105 2197472 2211047
56007 2211047 2223611 2238971 2259440 2282755 2307277 2334660 2365347 2396904 2428817 2463606 2501277
55996 2501277 2538179 2573293 2610166 2650688 2692501 2734322 2778069 2823901 2869262 2914789 2964975
55985 2964975 3020918 3078626 3136458 3197635 3263232 3329537 3394946 3462678 3534134 3606400 3678851
55974 3678851 3755248 3836714 3919962 4005051 4097227 4198091 4302703 4408527 4519296 4636920
55964 4636920 4757950 4881664 5013179 5154734 5302237 5454142 5614884 5785767 5961932
55955 5961932 6142631 6334706 6541069 6755732 6975553 7206823 7454486 7714929 7985487
55946 7985487 8270912 8574201 8891431 9222191 9574652 9953681 10354676 10775631 11223462
55937 11223462 11701226 12201648 12721771 13271669 13859962 14483608 15141524 15844956 16603785
55928 16603785 17415638 18279744 19208462 20213446 21293470 22447753 23687651 25022678
55920 25022678 26448771 27962885 29574231 31287770 33092691 34982112 36968628 39066300
55912 39066300 41275980 43605683 46087275 48755444 51629997 54738084 58132996 61870481
55904 61870481 65989106 70535904 75586941 81221616 87511104 94566027 102567007 111716153
55896 111716153 122191405 134181084 147918687 163641738 181571036 201985074 225249494
55889 225249494 251703043 281580505 315037899 351832427 390320008 426526999 454707371
55882 454707371 469653122 469128924 454514752 429473504 398091980 363779069 329007499
55875 329007499 295396334 263884774 234978281 208953057 185907152 165749250 148257958
55868 148257958 133170117 120201291 109035428 99363283 90934089 83549377 77030782
55861 77030782 71226872 66034418 61380451 57190808 53395294 49946977 46811110 43944536
55853 43944536 41304704 38866953 36614371 34521931 32568020 30749917 29069800 27514559
55845 27514559 26064397 24710562 23448739 22265059 21145024 20088033 19098186 18168533
55837 18168533 17288260 16457209 15678947 14946759 14250488 13590730 12972770 12392307 11839932
55828 11839932 11314246 10818152 10347321 9894286 9459311 9045762 8649300 8262835 7888117
55819 7888117 7531528 7192144 6864326 6548531 6249352 5966065 5694979 5438223 5200666
55810 5200666 4980469 4771500 4572719 4386963 4212955 4046645 3888063 3739204 3597719
55801 3597719 3460134 3328728 3207962 3096919 2992545 2897311 2815917 2746676 2683318 2622862
55791 2622862 2564613 2504262 2436922 2364389 2292433 2222728 2154101 2089283 2032860 1983980 1938191
55780 1938191 1895190 1858075 1826256 1795990 1767030 1742130 1720515 1698061 1673561 1649118 1624788
55769 1624788 1598320 1569803 1541575 1514008 1485852 1457661 1430431 1402370 1371649 1340624 1312476
55758 1312476 1285554 1256228 1225418 1196795 1170320 1143404 1117076 1094889 1076545 1058495 1040340
55747 1040340 1025064 1013402 1003459 995528 991742 991005 989580 986966 986188 988116 990184 990845 990639 988678
55733 988678 982661 972793 961554 949489 935187 919382 904765 891531 877085 860440 843297 826822
55721 826822 810996 796920 786138 777795 769756 761803 754277 744800 730539 712822 695231 677997
55709 677997 658916 638833 621047 605527 589027 571220 555605 543736 533328 522783 512832 502772
55697 502772 489847 473718 457371 442329 426948 410620 395613 383468 373573 366770 366384 373775
55685 373775 386099 400000 414308 427851 438197 444540 448873 452516 454193 453054 450804 449087 447307
55672 447307 444800 442876 442888 443976 444068 441700 436199 427925 418971 411736 406207 400390 393445 386148 378394
55657 378394 369097 359035 350933 345941 342621 340181 339970 342677 346471 349239 350819 352316 355029 360483
55643 360483 369311 379488 387670 392740 396139 398694 399545 398394 396182 393219 389210 385451 384230 385545
55629 385545 387174 388525 391515 396933 402919 407955 412506 416629 418893 419034 419069 420294 421456 421104 419502
55614 419502 417094 413467 409070 405675 403884 402302 400191 398637 398067 397128 395262 393943 393988 394039 393048 391941
55598 391941 391425 390740 390033 391287 394930 398053 398269 397165 397610 399600 401164 401601 401192 399146 394514 388268
55582 388268 382019 375307 366429 355499 344604 335103 326557 318239 310100 302122 294023 285883 278116 270629
55568 270629 262652 253707 244474 236348 229795 223168 214034 202325 191281 184231 181239 180130 179477 178589
55554 178589 175807 169991 163500 160638 162519 166020 168150 168803 168692 167712 166512 166805 168555 169297 167750
55539 167750 165728 164883 163996 161397 157995 155839 155435 156321 158523 161529 163455 163273 162475 162618 162677 160822
55523 160822 157612 155360 155212 156606 158740 160938 162475 163604 165927 170376 175837 181055 186701 194024
55509 194024 202691 211704 221456 233051 246331 260050 273225 284844 293168 296996 297043 294749 290480
55496 290480 284121 276366 267918 258270 246907 234998 224386 215557 207944 201380 195739 189938 182996
55483 182996 175641 169489 165112 162112 160290 159342 158169 156047 153887 153026 153426 154362 155928 158239 160120
55468 160120 160524 160664 162677 166574 170491 173668 177009 180532 182420 181211 177371 172172 166491 161309 157796
55453 157796 155809 153226 147937 140256 132682 127364 124142 121008 116247 109966 103573 98142 93796 90428
55439 90428 87995 85888 83026 79146 75259 72317 70157 68253 66570 64991 62754 59312 55090 50790
55425 50790 46694 43289 41591 41856 42742 42742 41916 41412 41921 43327 45139 46453 46249 44648 43199 43128 44062
55408 44062 45181 46503 47938 48100 45595 40997 36332 33013 31303 31152 32197 33225 32923 31258 29398
55393 29398 28494 29053 31038 33749 35998 37078 37240 36816 35646 33939 32822 33168 34587 36280 38124 40197
55377 40197 42148 43854 45746 47680 48516 47719 46315 45308 44433 43603 44134 46861 50233 52079 52371 52417
55361 52417 52155 50430 47536 45272 44363 43563 41683 39228 37737 38488 41783 46586 51094 54471 57553
55346 57553 60966 63492 63630 62026 60660 60117 59398 58156 57315 57390 57821 58121 58308 58076 56919 55256 54197
55329 54197 53949 53604 52598 51331 50210 49137 48105 47398 47140 47477 48976 51830 54824 56248 55837 54710
55313 54710 53506 51773 49277 46687 44586 42707 40486 37798 35007 32819 31995 32558 33428 33307 31792
55298 31792 29265 26280 23673 22567 23351 25133 26801 28009 28529 27813 26210 25437 26451 27840 27861 27073
55282 27073 27187 28237 28933 29163 29815 30463 29594 27235 25203 24394 23802 22615 21371 20476 19304 17509 15900
55265 15900 15408 16269 18449 21570 24279 25263 25152 25917 27987 29562 29283 27997 27155 26903 26607 26032 25148
55248 25148 23700 21739 19809 18149 16469 14766 13493 12708 12121 12058 13207 15231 17015 18528 20962
55233 20962 24526 27620 28959 29148 29251 29125 28216 27013 26500 26820 27401 27938 28463 28845 28866 28531 27985 27456
55215 27456 27308 27581 27448 25892 23093 20478 19413 20516 23797 28185 31107 30342 26759 23778 23496 24655
55199 24655 24995 24146 23299 23342 24510 26900 30062 32657 33580 33202 32811 33173 34093 34799 34259 31794 28082
55182 28082 25152 24807 27224 31250 35448 38602 39998 39865 39147 38397 37225 35061 32134 29511 28471
55167 28471 29667 32291 34294 34227 32905 32453 33714 35550 36646 36975 37285 38091 39350 40355 39909 37644
55151 37644 35094 34314 35314 36082 35306 33838 33262 34255 36638 39646 41764 41702 40106 39058 39411 39945 39602
55134 39602 38945 38617 37888 35987 33756 32789 33622 35592 37633 38600 37843 36284 35857 37003 37829 36735 34750
55117 34750 34018 34884 35889 36042 35610 34882 33449 30950 27898 25619 25490 27870 31485 34316 35314 34880
55101 34880 33817 32669 32006 32145 32407 31905 31285 32174 34451 35925 35630 35568 37696 40735 41858 40504 38604
55084 38604 37649 37401 37245 37000 36260 34473 32138 30884 31805 34205 36285 36813 36136 35727 36670 38560 40226
55067 40226 41297 42282 43175 43222 42392 41795 41948 41863 40727 39396 39157 39987 41191 42917 45700 48979 51424
55050 51424 52614 53408 54695 56420 57703 57556 55847 53904 53546 55171 57512 59537 61493 63570 64884
55035 64884 64813 64269 64469 65244 65629 65412 64999 64473 63844 63594 64018 64747 65824 68279 72444 76569 78550 78373
55017 78373 77504 76555 75180 73872 74064 76277 79433 82167 83783 83913 82331 79514 76767 75454 76165 78334
55001 78334 80527 81684 82342 83841 86065 87115 85785 83080 80445 77951 75481 74322 75723 78686 80946
54986 80946 81642 81519 81063 80108 78983 78468 78665 79055 79455 79850 79734 78794 77778 77551 77880 78216 78872 80130
54968 80130 81134 81225 81333 82198 82171 79192 74437 71473 71859 73876 75691 77317 79047 80346 81209 82618
54952 82618 84680 85966 85611 84663 84481 85133 86162 87702 89845 91894 93086 93396 93164 92683 92424 92779 93308
54935 93308 93170 92495 92375 93341 94816 96064 96568 95577 92819 89815 88857 90167 91490 91062 89655 89056 89849
54918 89849 91457 93259 94864 96050 97049 98292 99781 101568 104663 110038 116580 121600 123743 123973 123474
54903 123474 122415 121329 121702 124080 127271 130590 135219 141887 148757 153460 156348 160066 166550 175952
54889 175952 187866 201866 216851 231210 244008 255546 266888 279158 292615 305775 316027
54878 316027 321740 323238 321368 316169 307721 297181 285758 273437 259901 245973 232843 220387
54866 220387 207758 195382 184997 177598 172492 168543 165330 162783 160582 158460 156698 155938 156545 158158
54852 158158 159863 161034 162145 164325 168022 172675 177977 184707 193715 204705 216741 229387 242558
54839 242558 255694 268007 279328 289839 298925 305036 306817 304023 297354 287821 276251 263041 248449
54826 248449 233203 218492 205083 192771 181044 169843 159368 149625 140772 133483 128174 124039
54814 124039 119563 114088 108418 103805 100773 98968 97831 97154 97094 97803 99150 100793 102319 103270 103366 102922
54798 102922 102582 102200 100576 97191 93753 92772 94559 96717 96839 94728 91824 89576 88642 88492 87385 83932
54782 83932 79196 75978 75402 75590 74489 72438 70754 69401 67953 67743 70710 76259 81188 82953 81689
54767 81689 79112 77063 77267 80836 87016 93267 97193 98069 96541 93856 91594 91213 93192 96970 101768
54752 101768 106902 111362 114125 115287 116203 118041 120675 123239 125229 126828 128668 131590 136163 142174
54738 142174 148999 156572 165467 175906 187371 199474 212483 226524 240930 254979 268801 282844
54726 282844 296828 309956 321901 332703 341614 346832 346725 341000 330609 317108 302403 288542
54714 288542 276981 267941 260596 253809 246677 238999 231750 226696 224759 224772 224558 223296 222215 222896 225765
54699 225765 230444 236534 243346 249777 255460 261532 269339 278838 289339 301381 316475 334836 354619
54686 354619 373855 392233 410569 429240 447483 463518 475027 480187 478713 471489 459189 442014
54674 442014 420900 397914 374915 352510 330694 309684 289651 270523 252784 237696 225895
54663 225895 216376 207638 199295 191806 185203 179078 173430 168475 163760 158486 152777 147788 144356 142235
54649 142235 140837 140104 140198 140673 140452 138678 135527 132169 129961 129673 131380 134683 138759 142519 145326 147480
54633 147480 149396 150489 149754 147520 145581 145152 145540 145396 144501 143562 143014 142955 143821 146139 149657 153535 157340
54616 157340 161235 165168 168449 170331 170805 170752 171399 173375 176139 178574 180322 182295 185747 191143 198015
54601 198015 205459 212533 218626 223775 228334 232237 235044 236850 238525 240835 243860 247511 251951 257202
54587 257202 262905 268913 275575 283113 291205 299478 307918 316720 326304 337402 350337 364244 378108
54574 378108 392440 408365 424789 438318 446736 450794 451521 447717 437974 423735 408151 392562 376095
54561 376095 358283 340120 322664 306224 290955 276939 263718 251038 239889 231535 225722 221207
54549 221207 217790 216274 216478 216882 216533 215877 215397 214662 213151 210939 208313 205646 203721 203018 202504 200354
54533 200354 196108 190970 185841 180382 174450 168965 164496 160089 154473 147837 141626 137036 134184 132259
54519 132259 130094 127074 123800 121408 120101 118950 117286 115509 114293 113837 114247 115862 118606 121537 123616
54504 123616 124680 125343 126177 127206 128006 128280 128429 129139 130068 129626 126925 123464 121709 122278 123700 124732
54488 124732 125448 125964 125737 124820 124554 126215 129787 134475 139465 143713 146118 146786 147363 149483 153460 158888
54472 158888 165515 172783 179467 184815 189617 195337 202435 210115 217361 223702 229247 234336 238892 242028
54458 242028 242796 241326 238450 234120 227311 217904 207619 198373 190529 183425 176710 170362 164154 158045
54444 158045 152617 148332 144818 141519 138483 135780 132890 129636 127197 127050 128983 131018 131378 130109 128957
54429 128957 129994 133820 138569 141180 140369 137927 136490 136654 137122 137102 137280 138531 140760 143219 145114 145814
54413 145814 145244 144316 144369 145908 148178 149946 150312 148921 146099 142927 140657 139785 139877 140214 140363 140280 140361 141290
54395 141290 143332 145713 147140 147007 145795 144291 142874 141698 141143 141631 142977 144142 143857 141656 138213
54380 138213 134608 131452 129026 127901 128577 130388 131646 131438 130636 130525 130927 130539 128813 126631 125106 124456
54364 124456 124330 124637 125667 127537 129841 131818 132771 132430 131080 129523 128792 129472 130991 131933 131567 130811
54348 130811 131114 132734 134979 137896 142425 148515 154438 158772 162134 166099 171118 176385 181082 184863
54334 184863 187680 190149 193572 198525 203765 207582 209895 211902 213973 215169 214833 213347 211181 208410
54320 208410 205485 203212 201408 198641 194035 188551 183863 180632 178600 177613 177645 178146 178271 177662 176479 174834
54304 174834 172736 170428 168280 166452 165036 164245 163948 163361 161970 160637 160897 163012 165486 166886 167422
54289 167422 168225 169684 171248 172513 173669 174890 176132 177709 180359 184294 188622 192127 194389 195816
54275 195816 196914 197954 199108 200336 201194 201115 199964 197998 195332 191733 187049 181681 176494 172206 168721
54260 168721 165149 160851 156483 153471 152199 151331 149335 146096 142416 138644 134683 130846 127513 124173
54246 124173 120004 115351 111444 108575 105698 102017 97756 93132 88036 83343 81107 82315 85389 87928
54232 87928 89102 89427 89172 88396 87924 88671 90095 90603 89637 88292 87680 87663 87574 87373 87575 88357 89151 89122 88123
54213 88123 87190 87720 89945 92670 94809 96487 98069 98892 97976 95542 92743 90279 88418 88136 90711 95846
54197 95846 101415 105506 107778 108536 107809 106059 104715 104880 106099 107311 108411 109794 110911 110696 109392
54182 109392 108622 109203 109972 109442 107795 106303 105399 104406 103101 102395 103002 104249 104839 104419 103741 103504 103624
54165 103624 103652 103397 103054 103021 103601 104539 104893 103743 101052 97623 94349 91919 91001 91906 93904 95523 95892
54148 95892 95368 94717 94241 94006 94318 95421 96986 98317 98885 98518 97456 96414 96195 96813 97268 96507 94479
54131 94479 92127 90710 91199 93695 97009 99167 98857 96398 93316 91179 90754 91597 92236 91297 88755 85756
54115 85756 83204 81180 79735 79339 80159 81643 83157 84377 84934 84729 84939 87402 92195 96942 99426 99905
54099 99905 99931 99980 99576 98819 98325 98141 98042 98294 98904 98810 97320 95752 95886 97190 97471 96119 94703 94148 93450
54080 93450 91837 90357 90146 90485 89800 87759 85425 83951 83933 85403 87715 89708 90469 89730 87624 84770
54064 84770 82551 82140 82943 83031 81656 80284 80462 81701 82309 81468 79526 76971 74234 72166 71627 72618 74500
54047 74500 76937 80031 83600 86835 88715 88603 86764 84511 83400 83799 84622 84856 84915 86008 88549 91767
54031 91767 94578 96290 96749 96418 96224 96706 97346 97129 95612 93100 90020 86803 84327 83656 84953 87055
54015 87055 88545 89096 89448 90207 91080 91479 91558 92097 93300 94156 93534 91724 90503 91601 95338 100617 105810
53998 105810 109653 111807 112833 113501 114081 114493 115018 116366 118828 121715 123932 125070 125809 127225 129766
53983 129766 133029 136657 141078 146721 152687 157307 160426 163961 169298 175216 179761 183378 188407 195738
53969 195738 203858 211324 218388 225688 233067 240497 248596 257106 264189 268565 271419 274969 279824 284919
53955 284919 289285 292569 294439 294912 295003 295672 296168 294683 290741 285855 281586 277910 273800 268625 262660
53940 262660 256827 252105 248667 245531 241637 237267 233662 231231 229026 226200 223133 220659 218983 217960
53926 217960 217715 218223 218687 218274 217257 216678 216801 216680 215486 213650 212326 212099 212664 213416 213832 213387 211728
53909 211728 209177 206741 205385 205465 206808 208993 211362 213132 213921 213998 213838 213665 213601 213825 214154 213880 212714
53892 212714 211642 212107 214371 217395 220370 223577 227479 231752 235715 239137 242027 244009 244727 244819 245902
53877 245902 249235 254517 260202 265046 269154 273431 278132 282500 285901 288649 291169 292978 293460 293388 294547
53862 294547 297663 301579 304754 306833 308542 310871 314828 321098 329248 337683 344963 350906 356255 361857
53848 361857 368506 376767 386199 395200 402253 407081 410264 412342 413852 415514 417448 418665 418317 417171
53834 417171 416825 417556 417991 416953 414570 411235 406514 399880 391915 383927 376597 369605 362458 354954 346859
53819 346859 337909 328528 319962 313061 307257 301402 295443 290368 286348 281973 275903 268546 261303 254776
53805 254776 248722 243299 239093 235806 232102 227158 221590 216477 212174 208411 204886 201284 197198 192403
53791 192403 187031 181452 176428 173177 172352 172840 172515 170555 168249 167128 167153 167143 166178 164042 161129 158548
53775 158548 157600 158344 159248 158903 157613 156736 157061 158417 160246 161829 162513 162434 162501 163039 163143 162184 161198 161617
53757 161617 163136 164200 164406 165091 167343 170586 173616 176213 179099 182751 186817 190610 193823 196701 199631
53742 199631 202771 206210 210304 215423 221431 227908 234797 242193 249516 255807 261083 266409 272211 277491
53728 277491 281374 284492 287959 291686 294617 296162 296603 296572 296800 297851 299434 300579 301058 301788 303049 303366
53712 303366 301369 297933 295079 293334 291636 289387 287070 285010 282993 281101 279579 277818 274767 270526
53698 270526 266448 263535 261682 260483 259638 258515 256485 253909 251869 250762 250094 249642 249717 250175 250275 249720
53682 249720 248857 247656 245533 242398 238895 235393 231692 227923 224753 222437 220630 219304 218796 218746 218115
53667 218115 216569 214836 213430 212144 211129 211193 212446 213773 214306 214413 214638 214738 214609 215192 217536 221567
53651 221567 226527 231913 237241 241520 243896 244550 244481 244827 246739 251100 257654 264877 271354 276929 282173
53636 282173 287283 291970 295883 298777 300859 303324 307706 314174 321163 327168 332078 336255 339505 342016
53622 342016 345276 350500 356532 360739 362066 362105 362990 365185 367704 369584 370566 370699 369961 368445 366679 365439
53606 365439 365045 364991 364543 363529 362203 360600 358630 356640 355092 353659 351593 349121 347473 347202 347469 347496
53590 347496 347676 348519 349469 349697 349360 349090 348805 348048 347097 346719 346928 346824 345678 343607 341407 340121 340416
53573 340416 341789 342773 342563 342146 343212 346356 351025 356657 362830 368498 372197 373385 373082 373110 374993 379291
53557 379291 385307 391556 397184 402887 409874 418025 425758 431750 436117 439823 443657 448212 454356 462968
53543 462968 473954 485851 496825 506273 515180 524605 534168 542623 549757 556830 564988 574037 583029
53530 583029 591324 598782 605757 613200 621881 631036 638832 644699 650123 656297 662255 666552 669723 673460
53516 673460 677969 681878 684623 687402 691559 697057 702665 706918 709154 710459 713020 717484 721653 723338
53502 723338 723824 726462 731978 737570 741029 743354 746217 749098 750689 751565 753392 756267 758733 760089 761059
53487 761059 762271 763444 764215 764656 764851 764948 765785 768487 773093 778296 782881 786923 791303 796543 802450 808568
53471 808568 814751 821460 829546 839425 850386 861104 871005 880879 892089 905491 921138 938487 956596
53458 956596 974558 992293 1010787 1031194 1053874 1078651 1105692 1135380 1167305 1200131 1232845
53447 1232845 1265636 1299221 1333803 1369246 1405828 1444108 1484269 1526224 1570098 1615854 1662485
53436 1662485 1708521 1753604 1798924 1845970 1895498 1947701 2002305 2058008 2112781 2165526 2216850
53425 2216850 2267621 2317570 2366181 2414184 2462920 2512542 2562022 2610884 2659662 2708490 2756343
53414 2756343 2802215 2846175 2888671 2929374 2967534 3003251 3037659 3071537 3103986 3132905 3157037
53403 3157037 3177432 3196517 3215644 3233883 3249244 3260530 3267765 3271556 3272601 3271224 3266736 3257676
53391 3257676 3243380 3224878 3203567 3179554 3152318 3122453 3091433 3059711 3026273 2990214 2951609
53380 2951609 2910718 2867528 2822503 2776755 2730949 2684989 2639236 2595040 2553299 2513264 2473563
53369 2473563 2433986 2395659 2359923 2327584 2298786 2273023 2249541 2228119 2209169 2192948 2179259
53358 2179259 2168149 2160027 2154707 2151226 2149292 2150054 2154693 2163081 2174784 2190486 2210983 2235311 2261506
53345 2261506 2289228 2320193 2355716 2395123 2436976 2480696 2526286 2573589 2622827 2675353 2732877
53334 2732877 2796008 2863998 2935629 3009923 3086395 3165206 3246877 3331452 3418272 3507064 3598688
53323 3598688 3693925 3791785 3890195 3988518 4088259 4190797 4295415 4400365 4504902 4609007
53313 4609007 4711668 4811095 4906912 5000665 5093367 5183454 5268032 5345431 5415656 5478910 5534936
53302 5534936 5583772 5626120 5662647 5693463 5718301 5736564 5747140 5749007 5742282 5728097 5707113 5678703
53290 5678703 5641902 5596647 5543682 5483723 5417134 5344106 5264719 5179047 5087522 4991089 4890935
53279 4890935 4788417 4685281 4583206 4482679 4382808 4282710 4182730 4083920 3986939 3892065
53269 3892065 3799746 3710238 3622931 3536945 3452385 3370289 3291463 3216135 3144785 3078362 3017319
53258 3017319 2960991 2908247 2858255 2810506 2764840 2721805 2682413 2647057 2615099 2585878 2559592
53247 2559592 2536714 2517064 2500121 2485903 2474887 2467184 2462333 2459801 2459248 2460582 2464172 2470684 2479998
53234 2479998 2490610 2500946 2511230 2523185 2537918 2555027 2573944 2595096 2619179 2646170 2675773
53223 2675773 2708154 2743466 2781108 2820206 2860527 2902260 2945185 2988675 3032224 3075342 3117261
53212 3117261 3157429 3195956 3232830 3267079 3297714 3325208 3350918 3374997 3396114 3413389 3427446
53201 3427446 3439156 3448475 3455155 3459518 3461567 3460017 3453139 3440293 3422066 3399425 3373350 3344738
53189 3344738 3313775 3279650 3241513 3199513 3154384 3106484 3055971 3003549 2950181 2896171 2841243
53178 2841243 2785408 2729178 2673034 2617333 2562586 2509286 2457628 2407878 2360566 2315524 2271258
53167 2271258 2226404 2181644 2138931 2098760 2059501 2019722 1979848 1940867 1902649 1864662 1827582
53156 1827582 1792900 1761151 1731517 1703134 1675909 1649982 1625076 1600704 1576508 1552154 1527202
53145 1527202 1501363 1474850 1448421 1423103 1399579 1377477 1355334 1331769 1306814 1281673 1257012
53134 1257012 1232093 1206093 1179692 1154456 1130771 1107444 1083605 1059894 1037069 1014418 990711
53123 990711 966173 942096 918727 895012 870688 847138 825555 805461 785826 766560 748012
53112 748012 729982 712297 695564 680206 665402 650193 635085 621272 608735 596473 584270
53101 584270 572707 561504 549545 536872 525160 515647 507763 500361 493195 486517 480192 473951 467703
53088 467703 461017 453179 444530 436975 432141 429512 427120 423707 419379 414598 409637 405063 401740 399795
53074 399795 398099 395336 391568 388204 386128 384201 380293 373917 367109 362203 359418 357414 355552 354380
53060 354380 354087 353892 353239 352426 351670 350623 349366 348855 349600 350672 350844 350090 349207 348390 347115 345285 343781
53043 343781 343795 345895 349700 354220 358611 362583 365897 367771 367549 365952 364702 364518 364208 362210 358362
53028 358362 353661 348890 344085 338848 332629 325057 316525 308180 300997 295165 290506 286874 283809 280392
53014 280392 275939 270485 264483 258632 254133 252167 252615 254021 255261 256452 257711 258087 256614 253636 250219
52999 250219 246906 243951 242127 242163 243588 244956 244978 243050 239406 235510 233482 234003 235238 234904 233013 231588
52983 231588 232020 233810 235656 236642 236397 235094 233459 232198 231432 231050 231025 230811 229281 226354 223974 224116
52967 224116 226240 228141 228871 229168 229198 227865 224816 221494 219374 218413 217896 217659 217595 216886 214739 211394 207828
52950 207828 204837 202815 201902 201882 202254 202598 202594 201856 200571 200177 202256 206384 210114 211535 210958 209673 208281
52933 208281 207030 206683 207735 209301 209939 209411 208770 209002 210392 212934 216301 219352 220625 219722 217722 216079
52917 216079 215485 215925 217210 219163 221647 224744 228641 233126 237448 241060 244345 248103 252321 255927 258099
52902 258099 259448 261459 264945 269542 274602 279917 285438 290957 296432 302102 307879 313113 317436 321353
52888 321353 325405 329065 331125 330962 328934 325839 322559 319947 318283 316950 315231 313279 311634 310050
52874 310050 307627 304066 300014 296173 292813 290157 288387 287021 285064 282161 279175 277402 277456 278881 280395
52859 280395 280674 279464 277843 276869 276228 274907 272886 271138 270074 269142 268051 267166 266357 264608 261447 257980
52843 257980 255871 255917 258019 261705 266040 269644 271585 272021 271606 270642 269082 266877 264055 260976 258751
52828 258751 258650 260661 263198 264735 265229 265541 266012 266228 265890 265361 265395 266431 268043 269286 269962 271146 273695
52811 273695 276598 278023 277873 277882 278904 279777 279609 279627 281484 284759 287475 288496 288254 287559 286819 286230 285939
52794 285939 286158 287459 290438 294581 298199 300107 300639 300478 299600 298317 298247 300724 304893 308786 311852 315004
52778 315004 318562 321782 324479 327709 332369 337979 343089 346340 347242 346634 346160 346594 347048 346555 345753 345825
52762 345825 346361 345798 343641 340687 337255 332987 328510 325377 323719 321714 318144 313938 310213 306264 300914
52747 300914 294762 289621 286260 283969 281921 279720 276896 273040 268555 264385 260838 257304 253188 248647
52733 248647 244342 240854 238274 236016 233205 229661 226352 224376 223520 222376 219951 216720 213918 212174
52719 212174 211163 210352 209565 208630 206896 203658 199203 194957 192165 190650 189229 187186 184956 183490 183334
52704 183334 184135 184612 183298 180006 176482 174886 175525 176651 176504 174795 172167 169181 166211 163586 161193
52689 161193 158479 155257 152035 149215 146567 143910 141685 140263 139266 138152 136978 135947 134655 132538
52675 132538 129717 126771 124080 122052 121538 122969 125210 126336 125730 124670 124623 125647 126768 127389 127903 129200
52659 129200 131688 134606 136355 135933 134127 132848 133194 134487 135286 134933 133924 133163 133079 133349 133442 133427 134017
52642 134017 135543 137204 137855 137281 136105 134761 133408 132713 133520 135520 137318 138389 139914 142982 146892
52627 146892 150274 153109 156333 159888 162621 164263 166165 169575 174019 177970 180512 181839 182506 182749 182349
52612 182349 180948 178573 175825 173230 170486 166923 162768 159269 157237 156014 154299 151624 148601 146053
52598 146053 144254 142796 141027 138859 137161 136829 137356 137083 135184 132607 130628 129314 128149 127226 126719
52583 126719 125904 124037 121906 121020 121258 120690 118112 114590 112062 111308 111826 112871 113987 115009 115994 116817
52567 116817 116784 115260 112763 110738 110103 110770 112528 115172 117480 117515 114892 111779 110667 111788 113440 114098
52551 114098 113381 111805 110569 111002 113248 115978 118094 119932 122043 123873 124943 126281 129041 132400 134643
52536 134643 135745 136873 137710 136717 134266 133056 134504 136802 137736 137562 137681 138182 138600 139801 142881 146617
52520 146617 148193 146780 144846 145340 148679 153008 156613 159251 161434 163084 163401 162234 161222 162691 167109
52505 167109 172305 175753 177061 177585 178327 179336 180870 183800 188409 193483 197078 198046 196866 195288 195072
52490 195072 196576 198560 199683 200087 201163 203921 208005 212025 214378 214021 211229 207657 205076 203952 203613
52475 203613 203498 203519 203479 203137 202965 203843 205718 207491 208658 210068 212397 214798 216104 216718 218099 220604
52459 220604 223058 224470 225027 225047 224083 221900 219613 218823 219811 221363 222366 222804 223069 223069 222589 221976 221725 221494
52441 221494 220228 217448 213934 210937 209089 208314 208354 208925 209687 210635 212293 214939 217601 218576 217298 215193
52425 215193 214255 215120 217052 219465 222585 226454 230037 232006 232206 231692 231279 230618 229027 226752 224825 223804
52409 223804 223376 223274 223865 225346 226937 227650 227683 228228 229842 231750 233041 233866 234956 236491 238066 239411
52393 239411 240368 240370 238855 236463 235032 235859 238253 240246 240503 239203 237485 236595 237373 239765 242577 244301
52377 244301 244610 244740 246083 248656 251349 253418 255046 256442 257030 256060 253749 251402 250402 251296 253659
52362 253659 256456 258556 259383 259347 259410 260010 260586 260334 259214 257834 256559 255252 253872 252749 251964 250931
52346 250931 249081 246847 245440 245627 247053 248768 250052 250628 250492 249918 249484 249762 250907 252561 254079 254873
52330 254873 254840 254614 255141 256709 258658 260367 262319 265595 270251 274835 277843 279196 279809 280084 279596 278322
52314 278322 277390 278104 280537 283656 286640 289498 292355 294830 296616 298348 301319 306251 312636 319332 325558
52299 325558 331292 336987 343043 349385 355401 360375 364102 367064 369977 373235 376774 380320 383743 387243
52285 387243 391193 395640 400062 403897 407284 410961 415353 420122 424862 429811 435375 441114 445756 448450
52271 448450 449749 451161 453812 457746 462442 467700 473652 479963 485555 489649 492866 496654 501632 507150
52257 507150 512630 518501 525327 532715 539925 547147 555214 564180 573189 581884 591104 601784 613856 626634
52243 626634 639778 653435 667909 683664 701254 720643 740770 760350 779080 797735 817243
52232 817243 838020 859984 882615 904993 926362 946883 967581 989457 1012976 1038281 1065166
52221 1065166 1092457 1118053 1140378 1159792 1178153 1196997 1216500 1235968 1254647 1271855 1287023
52210 1287023 1300267 1312747 1325893 1340121 1354468 1367402 1377792 1385234 1390004 1392994 1395474 1398435
52198 1398435 1401843 1404629 1405658 1404928 1403679 1403168 1403549 1404197 1404885 1405973 1407415 1408413 1408496 1408309 1408840 1410381
52182 1410381 1412887 1416747 1422336 1429185 1436574 1444727 1454350 1465189 1476220 1487350 1499601 1513284 1527287
52169 1527287 1540829 1554655 1569525 1584492 1597815 1608945 1618596 1627389 1635484 1643073 1650045 1655315
52157 1655315 1657626 1657169 1655597 1654256 1652959 1650563 1646189 1639802 1631933 1622948 1612611 1600796 1588573
52144 1588573 1577579 1567762 1556932 1543582 1529189 1516278 1504954 1493169 1480137 1467531 1456971
52133 1456971 1448028 1439418 1430802 1422635 1415308 1409275 1405158 1402955 1401699 1400453 1399093 1397790 1396451 1395064
52119 1395064 1393698 1391701 1387744 1381408 1374151 1368030 1363873 1361086 1358642 1355799 1352384 1348939 1346196 1344169
52105 1344169 1342256 1340303 1338690 1337078 1334146 1329256 1323443 1318050 1313212 1308494 1304187 1300888 1298308 1295479
52091 1295479 1291910 1287909 1284153 1281581 1280942 1281514 1280867 1277044 1270793 1264633 1259860 1255478 1250022 1243469 1237015
52076 1237015 1231583 1226913 1221921 1215940 1209545 1203825 1198931 1194083 1189151 1185130 1182447 1179933 1176418 1172414
52062 1172414 1169018 1165989 1162251 1157697 1153038 1148410 1143689 1139819 1138134 1138415 1139299 1140658 1143826 1149223
52048 1149223 1155477 1161568 1168122 1175693 1183315 1190086 1197042 1206093 1217757 1231241 1246217 1263150 1281999
52035 1281999 1301864 1322281 1344011 1367985 1393811 1419765 1444385 1467809 1491335 1515739 1540579
52024 1540579 1565435 1590957 1617657 1644138 1667971 1688510 1707480 1726318 1744275 1759912 1773195
52013 1773195 1784841 1794561 1801485 1805905 1809073 1811287 1811625 1809864 1807224 1804562 1800966 1795188 1787656 1779775
51999 1779775 1771618 1761810 1750083 1738513 1729208 1721622 1713496 1704198 1695658 1689808 1686509 1684742 1684516 1686219
51985 1686219 1688755 1689978 1689136 1687809 1688168 1691113 1696228 1702588 1709175 1715162 1720301 1724867 1729185 1733551
51971 1733551 1738402 1743904 1749404 1753954 1757359 1760034 1762008 1762978 1763281 1763611 1763549 1761584 1757068 1751013 1744357
51956 1744357 1736626 1727251 1717147 1707694 1698579 1687849 1673961 1657004 1638178 1618777 1599526 1580127
51944 1580127 1559470 1536726 1512128 1486448 1460236 1433903 1407903 1382142 1355900 1329087 1302910
51933 1302910 1278220 1253776 1227371 1198442 1168360 1138417 1108935 1080433 1053978 1029579 1005379
51922 1005379 979507 952149 925034 899337 874904 851208 828219 806204 785152 764603 743951
51911 743951 722953 702038 682036 663528 646576 631041 616870 603989 592194 581371 571589 562861
51899 562861 554892 547153 539035 530079 520394 510950 502998 496882 491595 485878 479616 473859 469496 466240
51885 466240 463063 459391 455535 451977 448640 445155 441545 438171 434949 431178 426498 421664 417909 415579
51871 415579 413678 410826 406536 401662 397683 395389 394163 392672 390322 387701 385468 383322 380432 376569
51857 376569 372339 368551 365716 363876 362454 360517 357757 355038 353511 353320 353639 353718 353246 351955 349683
51842 349683 346827 343948 340938 337417 333983 332023 331991 332802 333434 334137 335286 335938 334659 331433 327682 324489
51826 324489 321779 319328 317610 317165 317683 318246 318349 318394 319251 321394 324376 327078 328527 328520 327463 325799 323745
51809 323745 321417 318979 316747 315311 315318 316837 319109 321213 322923 324607 326541 328732 331162 333648 335579
51794 335579 336475 336796 337412 338195 338066 336859 336194 337657 340771 343734 345695 347261 348954 350417 351225 351300
51778 351300 350266 347597 344074 341990 342956 346157 349649 352671 355595 358291 360056 361046 362283 363927 364855
51763 364855 364539 364243 365590 368669 372242 375123 376639 376500 375126 373697 372999 372531 371536 370483 370463 371356
51747 371356 371753 370843 369414 368781 369619 372121 376239 381072 384755 385884 384852 383212 381892 380563 378715
51732 378715 376765 375776 376147 376902 376698 375749 376156 379530 384519 387805 387886 386854 387836 391602 396472 400730
51716 400730 403809 405571 405952 405570 405559 406312 407113 407398 407670 408887 411591 415941 421762 427999 432809 435008
51700 435008 435145 434712 434795 436014 439030 444042 450148 456216 462220 468689 475101 480195 483974 487927 492547
51685 492547 496006 496338 494009 491147 488937 487027 484967 482659 479477 474571 468552 463624 461350 461131 461473
51670 461473 461863 462659 463794 464560 464352 462967 460406 457018 453556 450558 447881 445275 442915 440662 437392
51655 437392 432171 425955 420897 417765 415152 411686 407943 405306 403659 401385 397537 393048 389527 387477
51641 387477 386116 384655 383258 382692 383346 384838 386420 387377 387077 385262 382724 381167 381645 383369 384803
51626 384803 385859 388074 392578 398901 406105 413884 421843 428818 434233 439401 445990 453383 459041 461617
51612 461617 462350 462969 463614 463588 463094 463063 463830 464937 465836 465850 463749 458538 450767 442197 433940 425666 416906
51595 416906 408319 401012 395092 389619 383934 378410 373727 369872 366259 362656 359443 356705 353621 349390
51581 349390 344647 341094 339507 338814 337630 335962 334610 333498 331770 329409 327567 326933 326693 325473 322658
51566 322658 318557 314106 310784 309905 311259 313069 313936 314212 314762 315138 314174 312033 310454 310769 312666 315096
51550 315096 317571 320115 322569 324545 325800 326320 326228 325878 325898 326889 329002 331816 334672 337297 340131 343876
51534 343876 348670 354095 360034 366859 374436 381693 387953 394162 401858 411165 420688 429285 437049 444630
51520 444630 452409 460325 467555 472467 474002 473262 472642 473035 472926 470720 466876 463128 460519 458972 458032
51505 458032 457290 456675 456965 459341 463772 468559 472159 474834 477782 481551 486322 492872 501799 511973 521124
51490 521124 527972 532895 536657 539672 542516 545907 549736 552864 554287 553962 552418 550177 547732 545480
51476 545480 543608 542442 542760 545008 548410 551715 554722 558051 561465 563752 564660 565558 567439 569314 569651
51461 569651 568539 567212 565968 563782 559835 554252 547318 539069 530106 521971 515973 511905 508265 503607
51447 503607 497496 490557 484056 479274 476832 476334 476665 476550 474874 470972 465290 459791 456880 457302 459317
51432 459317 460428 459660 457779 455786 454204 453657 454838 457368 459790 461394 463193 466263 470000 473194 476105
51417 476105 479981 484836 489257 492594 495946 500557 506508 513477 521592 530758 540156 549321 558845 568959
51403 568959 578166 584539 588145 591001 594571 598299 600788 601521 600981 599701 597827 595402 592625 589802 587274
51388 587274 585412 584524 584639 585467 586719 588473 590941 593674 595317 594561 591296 586486 581023 575294 569656
51373 569656 564456 559213 552616 543983 534210 524707 515791 506861 497793 489263 481757 475062 468934 463567
51359 463567 459086 455144 451467 448412 446445 445248 443968 442454 441773 443091 446242 449870 452989 455975
51345 455975 459785 464540 469304 473019 475213 475964 475743 475277 474881 473738 470402 464339 456462 447846 438510
51330 438510 427973 416504 405015 393942 383007 372145 362066 353631 347026 341695 336829 331821
51318 331821 326465 320802 314775 308264 301646 295937 291786 288509 284846 280638 277002 274555 272324 269062
51304 269062 265003 261395 258548 255436 251479 247680 245330 244269 243397 242634 243229 245723 248455 248952 246537
51289 246537 242975 240554 240098 240922 242110 243246 244111 244305 243583 242492 242264 243738 246415 248873 250282 251276
51273 251276 253152 256438 260499 264441 268091 272079 277177 283607 290866 298193 305202 311945 318436 324471
51259 324471 330000 335157 339687 342886 344593 345711 346952 347558 346200 342936 339082 335059 329728 322409
51245 322409 314446 307681 302029 295657 287434 278217 269686 262704 257141 252633 248945 245726 242381 238402
51231 238402 233785 229115 225230 222772 221918 222371 223509 224737 225756 226423 226339 224940 222127 218472 214635
51216 214635 211055 208428 207730 208925 210235 209767 207727 205997 205610 205760 205449 204898 204856 205509 206592 207769
51200 207769 208465 208215 207663 208229 210146 211748 211496 209764 207778 205798 203637 202137 202467 204102 205006 203992
51184 203992 201743 199366 197096 194795 192647 190783 188956 187163 186117 186540 188335 190766 193164 195113
51170 195113 196274 196549 196382 196564 197538 198907 199778 199647 198929 198496 198792 199647 200757 201944 203031 204123 205888
51153 205888 208727 211472 212082 210254 208336 208756 211350 214329 217081 220422 224363 227286 227831 226462 224630
51138 224630 223220 222215 221244 220013 218681 218076 219067 221494 224112 225700 225893 225024 223770 223069 223775 226093
51122 226093 229504 233127 235884 236766 235763 234369 234241 235319 236108 235865 235439 235654 235940 235209 233402 231432
51106 231432 230027 229203 228552 227527 225664 222893 219677 216759 214899 214606 215585 216509 215960 213762 210897 208187
51090 208187 205723 203543 201936 200822 199761 198957 199385 201371 203771 205191 205444 205340 205664 206914 209394
51075 209394 212812 216238 219014 221281 223136 223976 223501 222712 222839 223568 223324 221294 218286 215593 213833 212985
51059 212985 212756 212550 211638 209732 207192 204579 202240 200268 198457 196278 193367 190210 188009 187681 189119
51044 189119 191495 194023 196346 198446 200403 202239 203915 205412 206756 207990 209176 210304 211036 210763 209393
51029 209393 208034 208238 210384 213290 215787 218036 220842 224218 227303 229431 230647 231395 232261 233768 235692
51014 235692 236774 236013 234343 234203 237076 242067 247254 251763 255883 259640 262289 263383 263630 264105 264909
50999 264909 265198 264577 263942 264456 265984 267123 266885 265874 265520 266530 268448 270516 272483 274459 276327 277630
50983 277630 278088 278103 278452 279415 280506 281346 282428 284337 286380 286913 285344 283092 282064 282809 284706 287262
50967 287262 290289 293072 294446 293908 292125 290270 289399 290399 293742 298813 303910 307466 309359 310951 313907
50952 313907 318850 324835 330136 333743 336117 338285 340507 342429 344414 347794 353303 359834 365506 369729
50938 369729 373632 378575 384999 392872 402389 413532 425351 436599 447138 458099 470434 483902
50926 483902 497830 512258 527682 543981 560518 577327 595534 616234 639382 664068 689554
50915 689554 715913 743897 774486 808374 845731 886466 930564 977931 1028259 1081632 1139083
50904 1139083 1201615 1268487 1337297 1406253 1475606 1546333 1618205 1689994 1760987 1831128 1899784
50893 1899784 1965387 2026558 2082791 2133732 2178406 2215664 2245071 2266907 2281533 2289292 2291115 2288766
50881 2288766 2283999 2277438 2268659 2257490 2244840 2231947 2219307 2206817 2194509 2182154 2168343 2151070
50869 2151070 2129481 2104075 2074961 2041157 2002286 1959717 1914888 1867239 1815066 1758051 1697899
50858 1697899 1636734 1575961 1516393 1458379 1401676 1346099 1292410 1241926 1195405 1153135 1115868
50847 1115868 1084492 1058537 1036003 1015057 995307 977240 961286 947705 936648 927797 920334 913544
50835 913544 907148 901127 895797 892070 890846 891986 894415 897310 900610 904463 909005 914659 921697 929411
50821 929411 936804 944311 953617 965358 978202 990833 1003532 1017001 1030889 1044782 1059650 1076813
50809 1076813 1096108 1116597 1138692 1163906 1192532 1223188 1255035 1289121 1327003 1369080 1414997
50798 1414997 1464814 1519133 1578678 1644353 1717109 1797056 1883216 1974879 2072965 2179364 2295066
50787 2295066 2419585 2552119 2692423 2840194 2994096 3152017 3312242 3473933 3636233
50778 3636233 3797066 3953038 4100491 4236479 4358775 4465367 4554355 4624440 4675415 4708236
50768 4708236 4724660 4726656 4715981 4694425 4664717 4630889 4597127 4565914 4537538 4511418 4487547
50757 4487547 4466353 4447583 4429851 4411012 4388248 4357695 4315012 4257431 4185459 4101925 4009097
50746 4009097 3907028 3794920 3673501 3545434 3413655 3280251 3147237 3017455 2893715
50737 2893715 2777260 2668062 2566831 2475876 2397362 2331126 2275032 2227391 2188382 2158962 2139127
50726 2139127 2127658 2123119 2124368 2130248 2139536 2151442 2165759 2182134 2199316 2215397 2228762 2238749
50714 2238749 2245477 2249208 2249906 2247309 2241281 2231905 2219187 2202939 2183156 2160299 2134901 2107148 2077259
50701 2077259 2046043 2014466 1982845 1951243 1920613 1892536 1867533 1844699 1823659 1805882 1793070
50690 1793070 1785085 1780707 1779872 1783576 1791672 1802431 1814850 1830104 1849972 1874793 1903817 1936748
50678 1936748 1973820 2014878 2059603 2108668 2163728 2225958 2295189 2370674 2452182 2539960 2633898
50667 2633898 2732980 2835378 2938849 3041265 3141079 3237261 3328508 3412541 3486509 3548293 3597206
50656 3597206 3633218 3655852 3664301 3658518 3639586 3608982 3568281 3520003 3467970 3415918 3365956 3319063
50644 3319063 3276755 3241174 3213272 3191652 3173642 3157107 3140957 3124456 3106596 3086017 3061150
50633 3061150 3030404 2992424 2946359 2892226 2831337 2766189 2699441 2632920 2567795 2505441 2447423
50622 2447423 2394611 2347012 2304879 2269541 2242651 2224873 2215664 2214405 2221499 2238223 2265382 2302142
50610 2302142 2346537 2397343 2455053 2520603 2593547 2672029 2754104 2838218 2922599 3005197 3084400
50599 3084400 3159122 3228220 3290740 3346789 3397248 3442440 3481957 3515903 3545110 3569927 3590144
50588 3590144 3606546 3621088 3634635 3645864 3653633 3659312 3665322 3672303 3679485 3687382 3698215 3713456
50576 3713456 3732422 3753748 3777178 3803401 3832897 3865279 3899149 3932354 3962841 3989435 4011459
50565 4011459 4027886 4037645 4040755 4038368 4031553 4020681 4006105 3988856 3970463 3952600 3936881 3924546
50553 3924546 3916344 3913033 3915584 3924067 3936557 3950190 3963433 3976471 3989263 4000164 4006741 4007073 3999810
50540 3999810 3983713 3957682 3920803 3872118 3810994 3738089 3655383 3564884 3467745 3364794 3257293
50529 3257293 3146924 3035715 2926287 2821262 2721677 2626511 2534539 2446356 2364091 2289467
50519 2289467 2222685 2162944 2109522 2062361 2021840 1987907 1959517 1935436 1915582 1900834 1891432
50508 1891432 1886531 1885781 1890189 1900511 1915618 1933626 1954094 1978065 2006274 2038508 2074576 2114711
50496 2114711 2159015 2207538 2261025 2320555 2386222 2457067 2532588 2613312 2699470 2790037 2883737
50485 2883737 2980282 3079827 3181575 3283525 3383290 3478773 3568597 3652747 3732775 3810747 3887916
50474 3887916 3964635 4041327 4118974 4198581 4280535 4364590 4450314 4537571 4626830 4719100 4815509
50463 4815509 4916946 5023845 5135858 5251559 5369010 5487047 5605631 5724311 5840581
50454 5840581 5950431 6050387 6138243 6211794 6267930 6303741 6318118 6311641 6285125 6238820 6172904
50443 6172904 6088212 5986522 5870660 5744586 5613079 5481056 5353105 5233282 5124790 5029626
50433 5029626 4948883 4883600 4835050 4803990 4789645 4789564 4800323 4818327 4840174 4862480 4881215 4891133
50421 4891133 4886172 4860969 4812322 4739442 4643274 4525919 4390585 4241504 4083392 3920563
50411 3920563 3756193 3592243 3430397 3273354 3124825 2987645 2861866 2745244 2635778
50402 2635778 2533331 2438786 2352471 2274028 2203343 2140707 2086066 2038705 1997808 1962855 1933340
50391 1933340 1908652 1888549 1873432 1863859 1859948 1861360 1867413 1876924 1888404 1901137 1916035 1934871
50379 1934871 1958497 1986104 2016178 2047728 2080600 2115206 2152304 2192548 2235792 2280931 2326683
50368 2326683 2372351 2417831 2463398 2509828 2558105 2608369 2659452 2710082 2760180 2810227 2859756
50357 2859756 2907673 2954200 3001234 3050206 3100579 3151315 3203019 3257481 3315432 3375887 3437661
50346 3437661 3500478 3564200 3627790 3689747 3749189 3805888 3859332 3908286 3951453 3988152 4017803
50335 4017803 4038742 4048158 4043798 4025542 3994631 3951493 3895195 3825321 3743450 3652107 3553040 3447477
50323 3447477 3337488 3225940 3115444 3008628 2909213 2821047 2745362 2680291 2624076 2577766
50313 2577766 2543756 2522427 2511587 2508706 2512208 2520421 2530668 2540125 2546781 2549011 2544803 2532149 2509966
50300 2509966 2478207 2437308 2388169 2332516 2272602 2210157 2145817 2079833 2013162 1947672 1885220
50289 1885220 1826702 1772080 1721130 1673868 1630209 1589624 1551582 1516211 1484049 1455042 1428290
50278 1428290 1403055 1379641 1358824 1340755 1325067 1311994 1302546 1297276 1295433 1295798 1297956 1302227 1308723
50265 1308723 1317254 1328118 1342166 1359772 1380160 1401936 1423839 1444833 1464263 1482657 1501989
50254 1501989 1524265 1549684 1576654 1603635 1630392 1657382 1684629 1711723 1738566 1765448 1792307
50243 1792307 1818304 1842359 1864145 1884464 1904479 1924289 1942242 1955972 1964379 1968302 1969007 1966413
50231 1966413 1959447 1948067 1934094 1919580 1904767 1888077 1867747 1843026 1814187 1782298 1749010
50220 1749010 1715822 1683136 1650413 1617404 1584661 1552656 1521073 1489583 1458725 1429348 1401542
50209 1401542 1374929 1349678 1326312 1304583 1283604 1263333 1244967 1229292 1215310 1201275 1186779
50198 1186779 1173266 1162562 1155225 1150218 1145961 1141809 1138536 1137215 1137664 1138448 1138358 1137372 1136028 1134585 1133179
50183 1133179 1132166 1131767 1131685 1131512 1131191 1130807 1130333 1129753 1128896 1126895 1122585 1115984 1108646 1101880 1095303 1087832
50167 1087832 1079375 1070588 1061643 1052542 1044229 1037969 1033602 1029605 1025021 1020236 1015763 1011469 1007541 1005092
50153 1005092 1005066 1007057 1009785 1012345 1014686 1017351 1021014 1025825 1030889 1034727 1036388 1035882 1033732 1030737 1028095
50138 1028095 1026751 1026216 1024627 1020377 1013401 1004904 996412 989032 982741 976180 967880 958013 948276 939965
50124 939965 932934 926589 920857 915762 911003 906509 902485 898404 892911 885578 877896 871610 866700 861933
50110 861933 856836 852019 847842 843809 839416 834972 831521 830090 830673 831731 831210 828485 824696 820920 816910
50095 816910 812237 807467 803093 798203 791644 784026 777118 771512 766316 761104 756717 753860 752153 751027
50081 751027 750564 751015 752217 753897 755909 757913 759476 760710 762249 764498 767473 771241 775710 780038 783432
50066 783432 786742 792121 800544 810592 820276 829066 837438 845447 852879 860221 868303 877181 886270 895346
50052 895346 904499 913257 920802 927246 933783 941141 948602 955048 960432 965601 971045 976509 981785 987105
50038 987105 992446 997055 1000293 1002896 1006751 1013262 1022054 1031353 1039367 1045436 1050405 1056188 1064510 1075613
50024 1075613 1088275 1101272 1114446 1128104 1141939 1155255 1168032 1181045 1194987 1210048 1226382
50013 1226382 1244310 1263829 1284385 1305434 1327041 1349890 1374937 1402786 1432877 1463300 1492034
50002 1492034 1518557 1543846 1568812 1593419 1617618 1642344 1668866 1697446 1727318 1757979 1789915
49991 1789915 1823785 1859170 1894673 1929412 1964149 2000532 2039378 2080420 2123902 2171461 2224543
49980 2224543 2282538 2343702 2407790 2476404 2550305 2627430 2704263 2778336 2848578 2913830 2972126
49969 2972126 3021319 3059758 3086606 3102546 3110427 3114288 3116990 3119035 3119936 3120067 3120039 3118257 3110409 3092436
49955 3092436 3063490 3024888 2976456 2915614 2840756 2754389 2661823 2567577 2474164 2383498 2297512
49944 2297512 2217017 2141297 2069488 2001669 1938375 1879842 1826019 1776548 1730501 1686915 1645793
49933 1645793 1607737 1572372 1538250 1504725 1472798 1443312 1415407 1387711 1360249 1334022 1309269
49922 1309269 1285432 1262575 1241616 1223050 1206323 1190643 1175818 1162238 1150518 1141091 1133651 1127144
49910 1127144 1120935 1115802 1113116 1113005 1113991 1114488 1114055 1113088 1112075 1111507 1112036 1114172 1117885 1122776 1128528 1135015
49894 1135015 1141987 1148913 1155433 1161984 1169651 1179007 1189391 1199912 1211072 1224566 1241310 1260459
49882 1260459 1280701 1301708 1323827 1347311 1372676 1400965 1432574 1466340 1501066 1537661 1578574
49871 1578574 1625187 1676997 1733394 1795012 1862954 1937795 2019971 2110355 2209760 2318303 2435606
49860 2435606 2561136 2693978 2832653 2975191 3118708 3258772 3390210 3509436 3615845
49851 3615845 3710799 3795890 3872527 3942305 4006689 4066436 4121706 4172209 4216534 4251744 4274554
49840 4274554 4282798 4275001 4248886 4201704 4132679 4044287 3940479 3824293 3697966 3564532 3427789
49829 3427789 3290352 3152867 3015768 2880927 2750702 2625963 2506145 2391068 2281647
49820 2281647 2178825 2082871 1993903 1911994 1836282 1765182 1698220 1636670 1581429 1531313 1484695
49809 1484695 1441865 1404000 1370240 1337858 1305592 1275008 1247786 1223217 1199421 1175951 1153946
49798 1153946 1134273 1116477 1099180 1080944 1061281 1041570 1024438 1011394 1001343 992112 982999 974922
49786 974922 968444 962789 956937 950750 944678 938945 933469 928211 923341 919230 916390 915212 915522 916592
49772 916592 917716 918829 920461 923039 926201 929032 931180 933576 937657 944011 952272 962162 973896 987438
49758 987438 1002183 1017801 1034677 1053083 1072628 1093127 1115415 1140553 1168770 1199944 1234669
49747 1234669 1273923 1317932 1366228 1418709 1475799 1537691 1604240 1675653 1752656 1835922 1925661
49736 1925661 2021216 2120215 2218498 2312058 2398998 2478689 2549366 2608064 2653209 2685957 2708753
49725 2708753 2724016 2734719 2744404 2755025 2765502 2773419 2777214 2775432 2764789 2740922 2701175 2645412
49713 2645412 2574342 2488725 2390700 2284411 2174358 2063844 1955532 1852403 1756887 1669404
49703 1669404 1588840 1514601 1447484 1388449 1337149 1292009 1251369 1214306 1180646 1150470 1123463
49692 1123463 1098614 1074915 1052634 1033483 1018827 1007789 997915 987854 978579 971505 966346 961701
49680 961701 957082 952992 949247 944761 939400 934638 931593 929523 927213 925035 924418 925799 928221 930618
49666 930618 932436 933334 933505 934173 936398 939203 940209 938553 935914 934096 932828 930914 928413 926263 924365
49651 924365 921567 917616 913832 911502 910463 909688 908637 907667 907550 908981 912178 916643 921481 926126 930556
49636 930556 934825 938856 942853 947345 952308 956580 958821 959077 958882 959658 961310 962617 962818 962561 963411 966567
49620 966567 971992 978501 984526 988903 991273 992028 992010 992152 993122 995094 997710 1000270 1002053 1002668 1002249 1001378
49604 1001378 1000657 1000209 999645 998778 998330 999611 1003138 1007780 1011675 1013955 1015125 1015757 1015614 1014591 1013866 1014923
49588 1014923 1017320 1018513 1016616 1012746 1009747 1008841 1008599 1007363 1005635 1005302 1007084 1009751 1011866 1013405 1015401
49573 1015401 1018609 1022890 1027453 1031267 1033581 1034533 1035059 1035795 1036342 1036130 1035716 1036499 1039135 1043007 1047411 1052486
49557 1052486 1058571 1065265 1071776 1077861 1083908 1090380 1097678 1106230 1116103 1126668 1137207 1147708 1158577
49544 1158577 1169795 1181202 1193556 1208304 1225855 1244863 1263736 1282427 1302222 1324263 1348755
49533 1348755 1375155 1402425 1429413 1455866 1482984 1512278 1543781 1576151 1608663 1642340 1678678
49522 1678678 1717908 1759160 1801828 1846053 1892088 1940054 1990496 2044354 2101867 2161923 2223144
49511 2223144 2285499 2350235 2418011 2487683 2557496 2627326 2699019 2774246 2852508 2931820 3011067
49500 3011067 3090845 3171826 3253208 3333523 3412514 3491241 3570237 3648386 3723974 3796181 3864960
49489 3864960 3929855 3989649 4043034 4088970 4126385 4154318 4172873 4183647 4188722 4189200 4184860 4174998
49477 4174998 4159303 4138106 4112295 4083259 4052700 4022228 3993027 3965788 3940925 3918954 3900764
49466 3900764 3887318 3878804 3874269 3872520 3873562 3878695 3889055 3904536 3924469 3948758 3977530 4010034
49454 4010034 4044938 4081899 4121684 4164203 4207466 4249571 4291002 4333505 4376844 4418188 4455015
49443 4455015 4487155 4515151 4537905 4553343 4560739 4560873 4553995 4538942 4514512 4480633 4437743 4385838
49431 4385838 4324704 4254550 4176019 4090022 3997915 3901461 3802343 3701981 3601839 3503152 3406039
49420 3406039 3309587 3213447 3118854 3027475 2939631 2854337 2770832 2689462 2611163 2536711 2466429
49409 2466429 2400083 2337001 2276648 2219115 2164769 2113578 2065143 2019196 1975620 1934125 1894550
49398 1894550 1857506 1824197 1795271 1770041 1746931 1724495 1702174 1680493 1660588 1643187 1627891
49387 1627891 1613557 1599424 1585672 1572953 1561575 1551161 1540960 1530596 1520673 1512423 1506497 1502241
49375 1502241 1498493 1494895 1492052 1490501 1489963 1489755 1489784 1491054 1495017 1502087 1510871 1519524 1527961 1537924 1550579
49360 1550579 1565227 1581084 1598968 1619606 1641046 1659748 1674309 1686437 1698139 1709657 1720591
49349 1720591 1731282 1742153 1753093 1764529 1777870 1793706 1810687 1827611 1845813 1867818 1893875
49338 1893875 1921226 1946906 1970195 1992222 2014272 2036895 2059968 2083151 2106470 2130513 2155754
49327 2155754 2181717 2207130 2230909 2252868 2273749 2294748 2316728 2339531 2362295 2384670 2407314
49316 2407314 2430978 2455685 2481291 2508333 2537675 2569669 2604105 2640559 2678198 2715881 2753279
49305 2753279 2791666 2832789 2877113 2923698 2971535 3020328 3070365 3122343 3177051 3234528 3293825
49294 3293825 3354378 3417214 3483895 3554489 3627438 3701190 3775141 3849460 3925177 4004254 4088216
49283 4088216 4176601 4267762 4361158 4457601 4557330 4659404 4763346 4869962 4979906 5092721
49273 5092721 5208015 5326309 5447779 5571264 5695713 5821829 5951034 6083181 6216361
49264 6216361 6348797 6480055 6610487 6740104 6867933 6992008 7110144 7221149 7325128
49255 7325128 7422333 7512050 7592791 7663064 7721651 7767823 7801837 7824798 7837517 7839982 7832405 7816117
49243 7816117 7792752 7763142 7727960 7689063 7649088 7609642 7570568 7531228 7492070 7454911 7421999
49232 7421999 7394620 7372283 7353470 7337509 7325554 7319463 7320150 7327359 7340429 7358585 7380881 7406713
49220 7406713 7436401 7470665 7509613 7552555 7598444 7646007 7693888 7741305 7788173 7833849 7876061
49209 7876061 7911916 7939718 7958912 7968595 7967259 7954114 7929611 7894429 7848734 7792618 7726333 7649847
49197 7649847 7563050 7466845 7363341 7254501 7141202 7023890 6903481 6781194 6658198 6535980
49187 6535980 6416472 6301207 6190551 6084095 5981418 5882323 5787055 5696732 5612826 5535469
49177 5535469 5462687 5391982 5322399 5254474 5188747 5125316 5064596 5007436 4954167 4904246 4857048
49166 4857048 4812355 4769727 4728016 4686133 4644176 4603393 4565047 4529485 4496127 4464129 4433030
49155 4433030 4402935 4374102 4346392 4319283 4292544 4266675 4242339 4219409 4197023 4174729 4153195
49144 4153195 4133349 4115075 4097406 4079986 4063528 4048532 4034314 4020067 4006364 3994538 3984681
49133 3984681 3975391 3965847 3957304 3951942 3950748 3952971 3957127 3961899 3966498 3971014 3976520 3984307 3994821 4007498
49119 4007498 4021504 4036417 4052452 4070423 4091310 4115394 4141901 4169834 4199070 4230225 4263596
49108 4263596 4298783 4335226 4372494 4410030 4447328 4484705 4523334 4564139 4607043 4651520 4697329
49097 4697329 4744293 4791948 4840093 4889319 4940229 4992275 5044234 5095883 5148381 5202697 5258308
49086 5258308 5313937 5369022 5423869 5478709 5533323 5587487 5641018 5693103 5742187 5787106 5828342
49075 5828342 5867814 5907305 5947233 5986978 6026180 6065220 6104247 6142131 6177178 6209088 6239594
49064 6239594 6270569 6301962 6332317 6361094 6389402 6418163 6446595 6473336 6498452 6523398 6549196
49053 6549196 6575566 6601900 6628154 6654402 6680233 6705190 6729407 6753300 6776815 6799474 6821025
49042 6821025 6841611 6861371 6880262 6898246 6915289 6931174 6945760 6959481 6973146 6987125 7001121
49031 7001121 7015096 7029999 7047028 7066183 7085900 7104160 7119828 7133109 7145194 7157619 7171575
49020 7171575 7187373 7204387 7221580 7238200 7254188 7270042 7286156 7302225 7317410 7331234 7343990
49009 7343990 7356051 7367085 7376542 7384693 7392488 7400310 7407506 7413164 7416561 7416626 7412023 7402604 7390065 7376177
48995 7376177 7360776 7342444 7320832 7297189 7272719 7247617 7221897 7195915 7169418 7141059 7109685
48984 7109685 7075602 7040033 7004038 6968733 6935860 6906842 6881295 6857507 6834545 6813057 6793796
48973 6793796 6776440 6760549 6746862 6736464 6728860 6722125 6715434 6710402 6709089 6711356 6715323 6720102 6726595
48960 6726595 6735321 6744988 6754114 6762849 6771941 6780966 6789276 6798126 6809841 6824666 6840216 6854528 6867993
48947 6867993 6881526 6894426 6905241 6913583 6919760 6923482 6924208 6922194 6918025 6911616 6902745 6892032 6880149
$$ [...]
##END NTUPLES=NMR SPECTRUM
##END=
