##TITLE=coffee_type TOCA01-ROVE100D_95-5%
COFFEE_meoh_noesyp64 COFFEE_meoh {C:\Bruker\TOPSPIN} Administrator 8
##JCAMPDX= 6.0         $$ Bruker NMR JCAMP-DX V2.0
##DATA TYPE= NMR SPECTRUM
##DATA CLASS= NTUPLES
##ORIGIN= Bruker BioSpin GmbH
##OWNER= Administrator
$$ 1.72 TOPSPIN		Version 2.1
$$ 2012-05-18 15:40:51.151 -0700  Administrator@X
$$ Compression mode = diff/dup
##.OBSERVE FREQUENCY= 400.13188235
##.OBSERVE NUCLEUS= ^1H
##.ACQUISITION MODE= SIMULTANEOUS (DQD)
##.ACQUISITION SCHEME= undefined
##.AVERAGES= 64
##.DIGITISER RES= 22
##SPECTROMETER/DATA SYSTEM= spect
##.PULSE SEQUENCE= noesygpps1d.comp
##.SOLVENT NAME= COFFEE_meoh
##.SHIFT REFERENCE= INTERNAL, COFFEE_meoh, 1, 14.98061
##AUDIT TRAIL= $$ (NUMBER, WHEN, WHO, WHERE, PROCESS, VERSION, WHAT)
$$ ##TITLE= Audit trail, TOPSPIN		Version 2.1
$$ ##JCAMPDX= 5.01
$$ ##ORIGIN= Bruker BioSpin GmbH
$$ ##OWNER= Administrator
$$ $$ C:\Bruker\TOPSPIN/data/Administrator/nmr/12-COFFEE-2002/82/pdata/1/auditp.txt
$$ ##AUDIT TRAIL=  $$ (NUMBER, WHEN, WHO, WHERE, PROCESS, VERSION, WHAT)
(   1,<2012-02-20 23:14:29.000 -0500>,<Administrator>,<TOPSPIN>,<go>,<TOPSPIN 2.1>,
      <created by zg
	started at 2012-02-20 23:02:58.672 -0500,
	POWCHK enabled, PULCHK disabled,
       configuration hash MD5:
       B0 76 FB 9C 50 81 44 7D 18 B3 26 32 4E 60 AD 96
       data hash MD5: 64K
       CA 15 01 FE 1B 54 E3 AF 02 08 E4 86 99 19 EE B5>)
(   2,<2012-02-20 23:14:31.703 -0500>,<Administrator>,<TOPSPIN>,<proc1d>,<TOPSPIN 2.1>,
      <Start of raw data processing
       efp LB = 0.3 FT_mod = 6 PKNL = 1 PHC0 = 0 PHC1 = 0 SI = 128K 
       data hash MD5: 128K
       02 74 63 D8 17 2D E9 59 BF 11 8B 2B 1F 75 C0 1E>)
(   3,<2012-02-20 23:14:33.031 -0500>,<Administrator>,<TOPSPIN>,<proc1d>,<TOPSPIN 2.1>,
      <pk PHC0 = 23.87878 PHC1 = 0 
       data hash MD5: 128K
       65 E1 BF D2 08 2E E0 07 B7 F1 FA F6 4A CD 4C 79>)
(   4,<2012-02-20 23:14:33.297 -0500>,<Administrator>,<TOPSPIN>,<proc1d>,<TOPSPIN 2.1>,
      <abs ABSG = 1 
       data hash MD5: 128K
       D3 4B 7B 83 2B E0 A3 85 6F 64 75 34 9F 1A D4 7B>)
(   5,<2012-02-20 23:14:33.375 -0500>,<Administrator>,<TOPSPIN>,<proc1d>,<TOPSPIN 2.1>,
      <abs ABSG = 2 
       data hash MD5: 128K
       03 AA 11 AC 23 E4 97 16 29 A0 71 6F 80 9D ED 12>)
(   6,<2012-02-20 23:14:33.438 -0500>,<Administrator>,<TOPSPIN>,<proc1d>,<TOPSPIN 2.1>,
      <abs ABSG = 3 
       data hash MD5: 128K
       C3 47 31 39 A5 B3 E0 01 DD BE 12 43 DB E4 63 AB>)
(   7,<2012-02-20 23:14:33.500 -0500>,<Administrator>,<TOPSPIN>,<proc1d>,<TOPSPIN 2.1>,
      <abs ABSG = 4 
       data hash MD5: 128K
       F1 A4 2B E9 5A 68 9E 5E A7 2D 16 F3 55 9B B7 BA>)
(   8,<2012-02-20 23:14:33.594 -0500>,<Administrator>,<TOPSPIN>,<proc1d>,<TOPSPIN 2.1>,
      <abs ABSG = 5 
       data hash MD5: 128K
       9E BD DE 54 CF 90 4F 0A 39 A4 35 1F 4A F0 DE A8>)
(   9,<2012-02-20 23:14:33.875 -0500>,<Administrator>,<TOPSPIN>,<audit>,<TOPSPIN 2.1>,
      <user comment:
       ICON-NMR User ID: Administrator
$$ [...]
150 150 150 150 150 150 150 150
##$TP07= 0
##$TPNAME0= <>
##$TPNAME1= <>
##$TPNAME2= <>
##$TPNAME3= <>
##$TPNAME4= <>
##$TPNAME5= <>
##$TPNAME6= <>
##$TPNAME7= <>
##$TPOAL= (0..7)
0.5 0.5 0.5 0.5 0.5 0.5 0.5 0.5
##$TPOFFS= (0..7)
0 0 0 0 0 0 0 0
##$TUNHIN= 0
##$TUNHOUT= 0
##$TUNXOUT= 0
##$USERA1= <user>
##$USERA2= <user>
##$USERA3= <user>
##$USERA4= <user>
##$USERA5= <user>
##$V9= 5
##$VALIST= <valist>
##$VCLIST= <CCCCCCCCCCCCCCC>
##$VD= 0
##$VDLIST= <DDDDDDDDDDDDDDD>
##$VPLIST= <PPPPPPPPPPPPPPP>
##$VTLIST= <TTTTTTTTTTTTTTT>
##$WBST= 1024
##$WBSW= 4
##$XGAIN= (0..3)
0 0 0 0
##$XL= 0
##$YL= 0
##$YMAX_a= 10970588
##$YMIN_a= -9795818
##$ZGOPTNS= <>
##$ZL1= 120
##$ZL2= 120
##$ZL3= 120
##$ZL4= 120
##$ABSF1= 14.98061
##$ABSF2= -5.57192
##$ABSG= 5
##$ABSL= 3
##$ALPHA= 0
##$AQORDER= 0
##$ASSFAC= 0
##$ASSFACI= 0
##$ASSFACX= 0
##$ASSWID= 0
##$AUNMP= <proc_prof1d_extract>
##$AXLEFT= 0
##$AXNAME= <>
##$AXNUC= <1H>
##$AXRIGHT= 0
##$AXTYPE= 0
##$AXUNIT= <>
##$AZFE= 0.1
##$AZFW= 0.1
##$BCFW= 0
##$BC_mod= 0
##$BYTORDP= 0
##$COROFFS= 0
##$CY= 15
##$DATMOD= 1
##$DC= 0
##$DFILT= <>
##$DTYPP= 0
##$F1P= 0
##$F2P= 0
##$FCOR= 0.5
##$FTSIZE= 131072
##$FT_mod= 6
##$GAMMA= 0
##$GB= 0
##$INTBC= 1
##$INTSCL= 1
##$ISEN= 128
##$LB= 0.3
##$LEV0= 0
##$LPBIN= 0
##$MAXI= 10000
##$MC2= 0
##$MEAN= 0
##$ME_mod= 0
##$MI= 0
##$NCOEF= 0
##$NC_proc= -1
##$NLEV= 6
##$NOISF1= 0
##$NOISF2= 0
##$NSP= 0
##$NTH_PI= 0
##$NZP= 0
##$OFFSET= 14.98061
##$PC= 1
##$PHC0= 23.87878
##$PHC1= 0
##$PH_mod= 1
##$PKNL= yes
##$PPARMOD= 0
##$PPDIAG= 0
##$PPIPTYP= 0
##$PPMPNUM= 2147483647
##$PPRESOL= 1
##$PSCAL= 4
##$PSIGN= 0
##$PYNMP= <proc.py>
##$REVERSE= no
##$SF= 400.13
##$SI= 131072
##$SIGF1= 0
##$SIGF2= 0
##$SINO= 400
##$SIOLD= 131072
##$SPECTYP= <>
##$SREGLST= <1H.CDCl3>
##$SSB= 0
##$STSI= 131072
##$STSR= 0
##$SW_p= 8223.68421052632
##$SYMM= 0
##$S_DEV= 0
##$TDeff= 65536
##$TDoff= 0
##$TI= <>
##$TILT= no
##$TM1= 0
##$TM2= 0
##$TOPLEV= 0
##$USERP1= <user>
##$USERP2= <user>
##$USERP3= <user>
##$USERP4= <user>
##$USERP5= <user>
##$WDW= 1
##$XDIM= 131072
##$YMAX_p= 124552592
##$YMIN_p= -420009649
##$CURPLOT= <Network HP LaserJet P1505>
##$CURPRIN= <$Network HP LaserJet P1505>
##$DFORMAT= <normdp>
##$LAYOUT= <+/1D_H.xwp>
##$LFORMAT= <normlp>
##$PFORMAT= <normpl>
##$SURQMSG= 1
$$ End of Bruker specific parameters
$$ ---------------------------------
##NTUPLES= NMR SPECTRUM
##VAR_NAME=  FREQUENCY,     SPECTRUM/REAL,   SPECTRUM/IMAG
##SYMBOL=    X,             R,               I
##VAR_TYPE=  INDEPENDENT,   DEPENDENT,       DEPENDENT
##VAR_FORM=  AFFN,          ASDF,            ASDF
##VAR_DIM=   131072,        131072,          131072
##UNITS=     HZ,            ARBITRARY UNITS, ARBITRARY UNITS
##FACTOR=    0.0627417313425165, 1,          1
##FIRST=     8223.62146879498, -202,         -17330
##LAST=      0,             368,             -17974
##MIN=       0,             -420009649,      0
##MAX=       8223.62146879498, 124552592,    0
$$ Real data points
##PAGE= N=1
##DATA TABLE= (X++(R..R)), XYDATA
$$ [...]
62241B50231k136k024j804j698j529j135p16n29m90l52o0K82O38R93J275J510
$$ 250231 248095 246071 244267 242569 241040 239905 239189 238660 238170 237818 237758 238040 238678 239671 240946 242456
62225B42456J908K561L209L558L709L973M386M667M650M482M421M593N011N569
$$ 242456 244364 246925 250134 253692 257401 261374 265760 270427 275077 279559 283980 288573 293584 299153
62211B99153O094O466O764P135P596Q101Q741R699J0938J2184J3210J4057J4886
$$ 299153 305247 311713 318477 325612 333208 341309 350050 359749 370687 382871 396081 410138 425024
62198D25024J5794J6749J7593J8049J7873J7066J5826J4229J2155R548O630L666
$$ 425024 440818 457567 475160 493209 511082 528148 543974 558203 570358 579906 586536 590202
62186E90202O88k374n363p938r953j1588j3055j4373j5434j6154j6423j6122j5363
$$ 590202 590890 588516 583153 575215 565262 553674 540619 526246 510812 494658 478235 462113 446750
62173D46750j4513j3793j2991j1783j0286q933p897o917n822m814m120l629l114
$$ 446750 432237 418444 405453 393670 383384 374451 366554 359637 353815 349001 344881 341252 338138
62160C38138k631k362k243j990j496r50o21n74o55o15l13J13M11N95R98J757K459
$$ 338138 335507 333145 330902 328912 327416 326466 325845 325271 324616 324001 323688 323801 324212 324807 325805 327562 330021
62143C30021K597K243J991K229K809L430M059M800N588O238O678P028P463Q058
$$ 330021 332618 334861 336852 339081 341890 345320 349379 354179 359767 366005 372683 379711 387174 395232
62129C95232Q750R372R820J0087J0195J0102R777R273Q642P894P111O468N993
$$ 395232 403982 413354 423174 433261 443456 453558 463335 472608 481250 489144 496255 502723 508716
62116E08716N530N066M898N220N759O179O645P578Q935J0205J1125J1864J2410
$$ 508716 514246 519312 524210 529430 535189 541368 548013 555591 564526 574731 585856 597720 610130
62103F10130J2310J1302R781Q298O889N254L371J573J34r16j647k221k940m031
$$ 610130 622440 633742 643523 651821 658710 663964 667335 668908 669042 668126 666479 664258 661318 657287
62089F57287n343o475p237p740q036p873p027n740m645m158m045l730k964k039
$$ 657287 651944 645469 638232 630492 622456 614583 607556 601816 597171 593013 588968 585238 582274 580235
62075E80235j328q14l20N7P0j57j15M73J291J853K097K395L116M300N654O754
$$ 580235 578907 578093 577773 577830 577900 577743 577628 578101 579392 581245 583342 585737 588853 593153 598807 605561
62059F05561P371P671Q030Q623R301R885J0355J0755J1089J1392J1720J2004J2138
$$ 605561 612932 620603 628633 637256 646557 656442 666797 677552 688641 700033 711753 723757 735895
62046G35895J2250J2638J3333J4022J4533J5106J5971J6927J7621J8055J8524
$$ 735895 748145 760783 774116 788138 802671 817777 833748 850675 868296 886351 904875
62035I04875J9164J9900K0707K1631K2514K3020K2955K2436K1756K1199K0972
$$ 904875 924039 943939 964646 986277 1008791 1031811 1054766 1077202 1098958 1120157 1141129
62024A141129K1107K1436K1789K2165K2559K2765K2464K1592K0415J9260J8325
$$ 1141129 1162236 1183672 1205461 1227626 1250185 1272950 1295414 1317006 1337421 1356681 1375006
62013A375006J7706J7440J7447J7562J7675J7850J8210J8787J9420J9849J9916
$$ 1375006 1392712 1410152 1427599 1445161 1462836 1480686 1498896 1517683 1537103 1556952 1576868
62002A576868J9661J9154J8342J7153J5766J4514J3520J2644J1808J1122J0606
$$ 1576868 1596529 1615683 1634025 1651178 1666944 1681458 1694978 1707622 1719430 1730552 1741158
61991A741158J0021R184Q211P285O430N663N119M790M391L792L331L345L602L596
$$ 1741158 1751179 1760363 1768574 1775859 1782289 1787952 1793071 1797861 1802252 1806044 1809375 1812720 1816322 1819918
61977A819918L281L038L006K897K496J936J330N93k70j037j607k151k779l332
$$ 1819918 1823199 1826237 1829243 1832140 1834636 1836572 1837902 1838495 1838225 1837188 1835581 1833430 1830651 1827319
61963A827319l694m039m490m831m799m534m398m459m434m089l496k807k031j091
$$ 1827319 1823625 1819586 1815096 1810265 1805466 1800932 1796534 1792075 1787641 1783552 1780056 1777249 1775218 1774127
61949A774127p2Q00J405J933K716L818M924N720O290O887P422P482O894N983N025
$$ 1774127 1774055 1774855 1776260 1778193 1780909 1784727 1789651 1795371 1801661 1808548 1815970 1823452 1830346 1836329 1841354
61934A841354L817K051n0j873l180m399n979p797r320j0259j0810j1281j1754
$$ 1841354 1845171 1847222 1847172 1845299 1842119 1837720 1831741 1823944 1814624 1804365 1793555 1782274 1770520
61921A770520j2145j2468j2827j3187j3360j3308j3315j3688j4346j4866j4981
$$ 1770520 1758375 1745907 1733080 1719893 1706533 1693225 1679910 1666222 1651876 1637010 1622029
61910A622029j4848j4815j4984j5139j4995j4465j3744j3155j2865j2712j2378
$$ 1622029 1607181 1592366 1577382 1562243 1547248 1532783 1519039 1505884 1493019 1480307 1467929
61899A467929j1775j1104j0524r865q852p511o200n225m571l989l198k053o26
$$ 1467929 1456154 1445050 1434526 1424661 1415809 1408298 1402098 1396873 1392302 1388313 1385115 1383062 1382436
61886A382436P65J822K569L383M586O104P548Q577R149R509J0020J0934J2181
$$ 1382436 1383201 1385023 1387592 1390975 1395561 1401665 1409213 1417790 1426939 1436448 1446468 1457402 1469583
61873A469583J3394J4231J4687J5081J5723J6644J7652J8550J9399K0508K2174
$$ 1469583 1482977 1497208 1511895 1526976 1542699 1559343 1576995 1595545 1614944 1635452 1657626
61862A657626K4363K6789K9349L2387L6330M1136M6353N1732N7557O4251P1894
$$ 1657626 1681989 1708778 1738127 1770514 1806844 1847980 1894333 1946065 2003622 2067873 2139767
61851B139767Q0248Q9101R8433J08322J18864J30154J42200J54876J67998J81423
$$ 2139767 2220015 2309116 2407549 2515871 2634735 2764889 2907089 3061965 3229963 3411386
61841C411386J94889K07764K18958K26967K29893K25496K11542J86385J49569
$$ 3411386 3606275 3814039 4032997 4259964 4489857 4715353 4926895 5113280 5262849
61832E262849J02239M7203j1483o9328j22238j67138k02366k27692k43812k51594
$$ 5262849 5365088 5412291 5400808 5331480 5209242 5042104 4839738 4612046 4368234 4116640
61822D116640k51948k46289k36593k24608k11157j96529j81311j66344j52085
$$ 4116640 3864692 3618403 3381810 3157202 2946045 2749516 2568205 2401861 2249776
61813B249776j38453j25369j13063j01788r1651q2731p4990o8011o1241n4640
$$ 2249776 2111323 1985954 1872891 1771103 1679452 1596721 1521731 1453720 1392479 1337839
61803A337839m8699m3674l9143l4605l0115k6089k2700j9754j6980j4189j1352
$$ 1337839 1289140 1245466 1206323 1171718 1141603 1115514 1092814 1073060 1056080 1041891 1030539
61792A030539q698o578n058l830k702j913j737k000k268k372k459k702l152l761
$$ 1030539 1021841 1015263 1010205 1006375 1003673 1001760 1000023 998023 995755 993383 990924 988222 985070 981309
61778I81309m320m524m278l834l362k605j259M59J979L001L669M147M388M290
$$ 981309 976989 972465 968187 964353 960991 958386 957127 957586 959565 962566 966235 970382 974770 979060
61764I79060L858L125K204J346P69M12Q4j70p6N03J406K416L483M710O282Q382
$$ 979060 982918 986043 988247 989593 990362 990774 990858 990688 990612 991115 992521 994937 998420 1003130 1009412 1017794
61748A017794J0975J3711J6210J8460K0763K3332K6157K9205L2514L5997L9416
$$ 1017794 1028769 1042480 1058690 1077150 1097913 1121245 1147402 1176607 1209121 1245118 1284534
61737A284534M2678M5980M9630N3712N8065O2489O7034P2028P7747Q4014R0434
$$ 1284534 1327212 1373192 1422822 1476534 1534599 1597088 1664122 1736150 1813897 1897911 1988345
61726A988345R7056J04634J13886J24725J36543J49113J62810J78000J94645K12572
$$ 1988345 2085401 2190035 2303921 2428646 2565189 2714302 2877112 3055112 3249757 3462329
61716C462329K31849K52644K74966K98632L23279L48291L72760L95494M14793
$$ 3462329 3694178 3946822 4221788 4520420 4843699 5191990 5564750 5960244 6375037
61707F375037M28149M32270M23445L97935L52557K85905J99778R9488p369j12739
$$ 6375037 6803186 7235456 7658901 8056836 8409393 8695298 8895076 8994564 8987195 8874456
61697H874456k09435k91904l56753m02931m31363m44347m44920m36162m20531
$$ 8874456 8665021 8373117 8016364 7613433 7182070 6737723 6292803 5856641 5436110
61688E436110l99689l75045l48217l20825k94003k68296k44021k21468k00809
$$ 5436110 5036421 4661376 4313159 3992334 3698331 3430035 3186014 2964546 2763737
61679B763737j81994j64876j49348j35331j22660j11116j00553r1015q2651p5484
$$ 2763737 2581743 2416867 2267519 2132188 2009528 1898412 1797859 1706844 1624193 1548709
61669A548709o9275o3623n8237n3072m8316m4241m1021l8566l6513l4504l2444
$$ 1548709 1479434 1415811 1357574 1304502 1256186 1211945 1170924 1132358 1095845 1061341 1028897
61658A028897l0473k8703k7073k5459k3842k2338k1068k0040j9141j8292j7533
$$ 1028897 998424 969721 942648 917189 893347 871009 849941 829901 810760 792468 774935
61647G74935j6856j6038j4901j3704j2975j2869j2956j2780j2357j1896j1372
$$ 774935 758079 742041 727140 713436 700461 687592 674636 661856 649499 637603 626231
61636F26231j0691j0067r814r865r870r680r424r168q847q472q114p701p134o594
$$ 626231 615540 605473 595659 585794 575924 566244 556820 547652 538805 530333 522219 514518 507384 500790
61622E00790o360o344o134n545m815m242l890l684l518l233k790k411k292k252
$$ 500790 494430 488086 481952 476407 471592 467350 463460 459776 456258 453025 450235 447824 445532 443280
61608D43280j968j547j416j630j782j626j351j154r84q76j047j462j708j557j271
$$ 443280 441312 439765 438349 436719 434937 433311 431960 430806 429822 428946 427899 426437 424729 423172 421901
61593D21901j142j097r97q98p93m57J07M27J73l55o49o87p27p24m41M7L87M82
$$ 421901 420759 419662 418665 417767 416974 416517 416624 417051 417224 416869 416220 415533 414806 414082 413641 413688 414075 414557
61575D14557N56P77J104J503J988K477K835L046L173L232L258L325L336L001K224
$$ 414557 415113 415890 416994 418497 420485 422962 425797 428843 432016 435248 438506 441831 445167 448168 450392
61560D50392J329O12o2r03j686k070k236k678l362l702l391k864k692k921l194
$$ 450392 451721 452333 452271 451368 449682 447612 445376 442698 439336 435634 432243 429379 426687 423766 420572
61545D20572l273l192l112l173l404l641l657l417l106k891k732k491k069j469
$$ 420572 417299 414107 410995 407822 404418 400777 397120 393703 390597 387706 384974 382483 380414 378945
61531C78945q34m09k69j43K81R54J584K098K671L316L792M083M533N346O192O689
$$ 378945 378111 377702 377433 377290 377571 378525 380109 382207 384878 388194 391986 396069 400602 405948 412140 418829
61515D18829O981P558Q532R502J0148J0588J1087J1676J2227J2719J3183J3530
$$ 418829 425810 433368 441900 451402 461550 472138 483225 494901 507128 519847 533030 546560
61503E46560J3643J3605J3571J3453J3002J2246J1573J1204J0855J0202R440R009
$$ 546560 560203 573808 587379 600832 613834 626080 637653 648857 659712 669914 679354 688363
61491F88363Q894Q558P664O446N276M239L281K470J823J112J52r18j846k650l509
$$ 688363 697257 705815 713479 719925 725201 729440 732721 735191 737014 738126 738278 737360 735514 732864 729355
61476G29355m342m824m768m288l579k770j976j298o68J56J406L102N018O792Q166
$$ 729355 725013 720189 715421 711133 707554 704784 702808 701510 700842 700998 702404 705506 710524 717316 725482
61461G25482R255J0488J2200J4329J6600J8864K1189K3667K6355K9291L2459L5746
$$ 725482 734737 745225 757425 771754 788354 807218 828407 852074 878429 907720 940179 975925
61449I75925L9106M2711M6800N1399N6278O1120O5736P0171P4662P9344Q3887
$$ 975925 1015031 1057742 1104542 1155941 1212219 1273339 1339075 1409246 1483908 1563252 1647139
61438A647139Q7574Q9714Q9887Q7675Q2523P4106O2681M8926L3600J7580J906
$$ 1647139 1734713 1824427 1914314 2001989 2084512 2158618 2221299 2270225 2303825 2321405 2323311
61427B323311j2609k5693l7279m6962n4185n8853o1428o2374o1876o0070n7238
$$ 2323311 2310702 2285009 2247730 2200768 2146583 2087730 2026302 1963928 1902052 1841982 1784744
61416A784744n3652m9462m4851m0082l5314l0494k5519k0430j5381j0582o193
$$ 1784744 1731092 1681630 1636779 1596697 1561383 1530889 1505370 1484940 1469559 1458977 1452784
61405A452784k224J470M987Q263J1255J4058J6677J8841K0292K1142K1718K2163
$$ 1452784 1450560 1452030 1457017 1465280 1476535 1490593 1507270 1526111 1546403 1567545 1589263 1611426
61393A611426K2459K2645K2718K2434K1652K0738K0260K0230K0125J9623J8930
$$ 1611426 1633885 1656530 1679248 1701682 1723334 1744072 1764332 1784562 1804687 1824310 1843240
61382A843240J8308J7788J7429J7369J7394J6891J5534J3681J1834J0064Q201
$$ 1843240 1861548 1879336 1896765 1914134 1931528 1948419 1963953 1977634 1989468 1999532 2007733
61371B007733O316M559K788P55j481l633n591p420r072j0425j1560j2634j3480
$$ 2007733 2014049 2018608 2021396 2022151 2020670 2017037 2011446 2004026 1994954 1984529 1972969 1960335 1946855
61358A946855j3639j2941j1818j0857j0173r352p985o152m364l060k251j642j027
$$ 1946855 1933216 1920275 1908457 1897600 1887427 1878075 1870090 1863938 1859574 1856514 1854263 1852621 1851594
61345A851594m74j57j90n91j309k168k926l429l668l604l043j700N81L704P358
$$ 1851594 1851120 1850963 1850773 1850182 1848873 1846705 1843779 1840350 1836682 1833078 1830035 1828335 1828916 1832620 1839978
61330A839978J1246J5358J9947K5180L0830L6577M2426M8679N5442O2439O9305
$$ 1839978 1851224 1866582 1886529 1911709 1942539 1979116 2021542 2070221 2125663 2188102 2257407
61319B257407P5825Q1847Q7184R1630R4879R6351R5362R1512Q4759P5079O2466
$$ 2257407 2333232 2415079 2502263 2593893 2688772 2785123 2880485 2971997 3056756 3131835 3194301
61308C194301M7368L0803J3817k891j8746l3080m5585n6621o6702p5704q2994
$$ 3194301 3241669 3272472 3286289 3283398 3264652 3231572 3185987 3129366 3062664 2986960 2903966
61297B903966q8168r1431r3233r3905r3618r2439r0333q7293q3499p9239p4674
$$ 2903966 2815798 2724367 2631134 2537229 2443611 2351172 2260839 2173546 2090047 2010808 1936134
61286A936134o9814o4648n9191n3521m7911m2775l8208l3787k9097k4283j9791
$$ 1936134 1866320 1801672 1742481 1688960 1641049 1598274 1560066 1526279 1497182 1472899 1453108
61275A453108j5660j1541p420l782q70J810M853Q146J1040J3160J4721J6039J7102
$$ 1453108 1437448 1425907 1418487 1414705 1413835 1415645 1420498 1428644 1439684 1452844 1467565 1483604 1500706
61262A500706J7724J7873J7660J7108J6140J4827J3446J2249J1209J0109Q839
$$ 1500706 1518430 1536303 1553963 1571071 1587211 1602038 1615484 1627733 1638942 1649051 1657890
61251A657890P465O073M658L230J821L10j549l738n823p454q834j0410j2184j3693
$$ 1657890 1665355 1671428 1676086 1679316 1681137 1681447 1679898 1676160 1670337 1662883 1654049 1643639 1631455 1617762
61237A617762j4754j5714j6872j8003j8758j9217j9656j9984j9828j9135j8270
$$ 1617762 1603008 1587294 1570422 1552419 1533661 1514444 1494788 1474804 1454976 1435841 1417571
61226A417571j7459j6485j5130j3599j2238j1008r567p816o134m946m302l967
$$ 1417571 1400112 1383627 1368497 1354898 1342660 1331652 1322085 1314269 1308135 1303189 1298887 1294920
61214A294920l746l649l719l891m068m214m356m427m237l628k705j843j358j133
$$ 1294920 1291174 1287525 1283806 1279915 1275847 1271633 1267277 1262850 1258613 1254985 1252280 1250437 1249079 1247946
61200A247946o83L28J738L238M922P215J0234J3524J6646J9749K3236K7049L0644
$$ 1247946 1247263 1247591 1249329 1252567 1257489 1264704 1274938 1288462 1305108 1324857 1348093 1375142 1405786
61187A405786L3673L6248L8394L9658L9511L7822L4600K9508K2142J2706K047
$$ 1405786 1439459 1475707 1514101 1553759 1593270 1631092 1665692 1695200 1717342 1730048 1732095
61176A732095r029k0067l0574l9783m7126n2597n6362n8327n8430n7144n5200
$$ 1732095 1723066 1702999 1672425 1632642 1585516 1532919 1476557 1418230 1359800 1302656 1247456
61165A247456n2834m9776m6012m2186l8982l6377l3787l0834k7696k4741k2067
$$ 1247456 1194622 1144846 1098834 1056648 1017666 981289 947502 916668 888972 864231 842164
61154H42164j9523j7044j4828j3041j1523r911q091o346m922l686k352r23M23
$$ 842164 822641 805597 790769 777728 766205 756294 748203 741857 736935 733249 730897 729974 730397
61141G30397J692L038M325N185N514N611N636N296M335L038J936J177M93l07j129
$$ 730397 732089 735127 739452 744637 750151 755762 761398 766694 771029 774067 776003 777180 777673 777366 776237
61126G76237j904k780l911n211o427p382q102q743r373r865j0079j0111j0258
$$ 776237 774333 771553 767642 762431 756004 748622 740520 731777 722404 712539 702460 692349 682091
61113F82091j0693j1300j1869j2274j2437j2294j1951j1704j1770j2098j2534
$$ 682091 671398 660098 648229 635955 623518 611224 599273 587569 575799 563701 551167
61102E51167j2953j3144j2802j1902j0850j0012r264q314p306o745o835p262p635
$$ 551167 538214 525070 512268 500366 489516 479504 470240 461926 454620 447875 441040 433778 426143
61089D26143p882q154q540q906q934q367p393o621o425o437o003n018m013l395
$$ 426143 418261 410107 401567 392661 383727 375360 367967 361346 354921 348484 342481 337463 333450 330055
61075C30055k977k344j431n34K3J80K52O70J493K243K516K583K966L587L822L512
$$ 330055 327078 324734 323303 322769 322792 322972 323224 323894 325387 327630 330146 332729 335695 339282 343104 346616
61059C46616L275L635M300M718M854M972N015M747M339M239M471M511L977L074
$$ 346616 349891 353526 357826 362544 367398 372370 377385 382132 386471 390710 395181 399692 403669 406743
61045D06743K219J541R46M29L7l76j100k179l233l781l701l321l041k997l093
$$ 406743 408962 410503 411449 411878 411915 411539 410439 408260 405027 401246 397545 394224 391183 388186 385093
61030C85093l246l412l537l570l560l601l705l835l992m136m087l745l329l139
$$ 385093 381847 378435 374898 371328 367768 364167 360462 356627 352635 348499 344412 340667 337338 334199
61016C34199l115k915k494k230k353k539k359j849j324q91m32JJ79J11J21M31
$$ 334199 331084 328169 325675 323445 321092 318553 316194 314345 313021 312130 311698 311699 311878 311989 312110 312541
61000C12541Q47J060J090J250J698K194K404K314K282K556K929K962K544K063
$$ 312541 313388 314448 315538 316788 318486 320680 323084 325398 327680 330236 333165 336127 338671 340734
60986C40734K002K450L100L589L799L881M106M622N322N968O457O938P572Q282
$$ 340734 342736 345186 348286 351875 355674 359555 363661 368283 373605 379573 386030 392968 400540 408822
60972D08822Q832R117R291R598J0161J0925J1719J2317J2560J2537J2634J3241
$$ 408822 417654 426771 436062 445660 455821 466746 478465 490782 503342 515879 528513 541754
60960E41754J4314J5359J5968J6278J6768J7703J8952K0302K1660K2957K4157
$$ 541754 556068 571427 587395 603673 620441 638144 657096 677398 699058 722015 746172
60949G46172K5459K7253K9675L2433L5227L8134M1367M4822M8083N0827N3145
$$ 746172 771631 798884 828559 860992 896219 934353 975720 1020542 1068625 1119452 1172597
60938A172597N5496N8441O2239O6722P1744P7654Q4915R3297J02021J10837J20467
$$ 1172597 1228093 1286534 1348773 1415495 1487239 1564893 1649808 1743105 1845126 1955963 2076430
60927B076430J31709J44770J59788J77323J97802K21107K47252K76925L10887
$$ 2076430 2208139 2352909 2512697 2690020 2887822 3108929 3356181 3633106 3943993
60918C943993L49855L95666M51171N17432N92438O74174P61605Q45627Q97615
$$ 3943993 4293848 4689514 5140685 5658117 6250555 6924729 7686334 8531961 9429576
60909I429576Q75808P54877N53621L29922J44534K8489j8625j0385L4826Q5030
$$ 9429576 10305384 11060261 11613882 11943804 12088338 12116827 12098202 12087817 12122643 12207673
60899A2207673R1991J3547j54614l71198n75941p25484q08228q34384q19994p79362
$$ 12207673 12299664 12313211 12158597 11787399 11211458 10485974 9677746 8843362 8023368 7244006
60889G244006p24097o62370n98362n34112m71910m14145l61913l15205k74137
$$ 7244006 6519909 5857539 5259177 4725065 4253155 3839010 3477097 3161892 2887755
60880B887755k38938k09095j83546j61670j43335j28115j15225j04159r4791q6877
$$ 2887755 2648817 2439722 2256176 2094506 1951171 1823056 1707831 1603672 1508881 1422004
60870A422004p9974p3750o7955o2303n6835n2139m8709m6225m3965m1673l9515
$$ 1422004 1342030 1268280 1200325 1138022 1081187 1029048 980339 934114 890149 848476 808961
60859H08961l7422l5104l2600l0281k8324k6636k5144k3714k2013j9930j7992
$$ 808961 771539 736435 703835 673554 645230 618594 593450 569736 547723 527793 509801
60848E09801j6776j6100j5314j4241j3218j2299j1176r870q874q435q200p732
$$ 509801 493025 476925 461611 447370 434152 421853 410677 400807 391933 383498 375298 367566
60836C67566o953n977m927m047l567l380l143k779k501k359k119j692j286j018
$$ 367566 360613 354636 349709 345662 342095 338715 335572 332793 330292 327933 325814 324122 322836 321818
60822C21818p52m09j34o7j58l16n32q05j136j569k056k409k526k629k978l474
$$ 321818 321066 320657 320523 320456 320298 319982 319450 318645 317509 315940 313884 311475 308949 306320 303342 299868
60806B99868l804l824l648l366l006k624k210j704j224j011r97p29n4N74Q14J032
$$ 299868 296064 292240 288592 285226 282220 279596 277386 275682 274458 273447 272450 271721 271667 272241 273055 274087
60790B74087J691K550L113L489M107M876N354N567N878O140N863N128M593M518
$$ 274087 275778 278328 281441 284930 289037 293913 299267 304834 310712 316852 322715 327843 332436 336954
60776C36954M523M369M211M030L606L153L207L694L835L239K350J632J023M57
$$ 336954 341477 345846 350057 354087 357693 360846 364053 367747 371582 374821 377171 378803 379826 380283
60762C80283K10L27L70R3j79k65n34j208j870k090k070k173k319k339k472l015
$$ 380283 380493 380820 381190 381283 381104 380839 380305 379097 377227 375137 373067 370894 368575 366236 363764 360749
60746C60749l770m336m661m897m980m737m229l661l171k882k887k956k611j760
$$ 360749 356979 352643 347982 343085 338105 333368 329139 325478 322307 319425 316538 313582 310971 309211
60732C09211q89l89r3K73O37Q72J171J721K361K884L368L866M181M252M382M728
$$ 309211 308322 307933 307840 308113 308750 309622 310793 312514 314875 317759 321127 324993 329174 333426 337808 342536
60716C42536M933M684M271M134M214M139L865L596L345L027K776K788K961L006
$$ 342536 347469 352153 356424 360558 364772 368911 372776 376372 379717 382744 385520 388308 391269 394275
60702C94275K808K404J835J288J107J377J752J970K164K403K386J949J496J431
$$ 394275 397083 399487 401322 402610 403717 405094 406846 408816 410980 413383 415769 417718 419214 420645
60688D20645J506J297Q92O24M08m9o12r40j154j603k120k170j737j407j546j943
$$ 420645 422151 423448 424340 424964 425372 425323 424711 423771 422617 421014 418894 416724 414987 413580 412034 410091
60672D10091k333k681k890k740k344k176k448k801k826k549k243j995j695j260
$$ 410091 407758 405077 402187 399447 397103 394927 392479 389678 386852 384303 382060 380065 378370 377110
60658C77110p48l74m16r40j641k080k148k083k126k306k519k652k586k318j989
$$ 377110 376362 375988 375572 374632 372991 370911 368763 366680 364554 362248 359729 357077 354491 352173 350184
60643C50184j748j589j469j408j330r76k62M62P63O43M33K65k7n20j061j513j926
$$ 350184 348436 346847 345378 343970 342640 341664 341402 341864 342627 343270 343703 343968 343941 343421 342360 340847 338921
60626C38921k377k834l230l553l850m184m534m764m771m687m716m754m464l819
$$ 338921 336544 333710 330480 326927 323077 318893 314359 309595 304824 300137 295421 290667 286203 282384
60612B82384l192k778k289j480o02K9N32J122J586J581J277J171J381J601J628
$$ 282384 279192 276414 274125 272645 272043 272072 272604 273726 275312 276893 278170 279341 280722 282323 283951
60597B83951J580J552J505J471J526J608J616J636J754J812J616J323J198J182
$$ 283951 285531 287083 288588 290059 291585 293193 294809 296445 298199 300011 301627 302950 304148 305330
60583C05330J038Q41Q86J186J453J600J795K069K229K266K433K851L375L816M109
$$ 305330 306368 307209 308095 309281 310734 312334 314129 316198 318427 320693 323126 325977 329352 333168 337277
60568C37277M208M156M198M580N181N665N876N860N590N043M473M172M023L633
$$ 337277 341485 345641 349839 354419 359600 365265 371141 377001 382591 387634 392107 396279 400302 403935
60554D03935K915K157J500Q44J73l54p51j223j792k259k532k722k823k747k656
$$ 403935 406850 409007 410507 411351 411524 411170 410419 409196 407404 405145 402613 399891 397068 394321 391665
60539C91665k849l269l529l497l508l780m072m014l550k857k124j529j170q97
$$ 391665 388816 385547 382018 378521 375013 371233 367161 363147 359597 356740 354616 353087 351917 351020
60525C51020m64R0M40M15J80j0PL14Q60J319J363J077P93O15M39L80O89J237J576
$$ 351020 350556 350646 351086 351501 351681 351671 351678 351992 352852 354171 355534 356611 357404 358019 358458 358838 359527 360764 362340
60506C62340J571J503J499J374J142J166J474J533R88K27j82k21k45l51l52j21
$$ 362340 363911 365414 366913 368287 369429 370595 372069 373602 374590 374817 374635 374414 374169 373818 373466 373345
60490C73345L36J019J832K555L099L654M362N097N779O629P879R375J0775J1958
$$ 373345 373681 374700 376532 379087 382186 385840 390202 395299 401078 407707 415586 424961 435736 447694
60476D47694J3003J3907J4520J4665J4111J2592J0104P038L901R74j645l850n549
$$ 447694 460697 474604 489124 503789 517900 530492 540596 547634 551535 552509 550864 547014 541465
60463E41465o673p045o475n114l537k196j003L93K093L915N684P228Q305Q784
$$ 541465 534792 527747 521272 516158 512621 510425 509422 509815 511908 515823 521507 528735 537040 545824
60449E45824Q919R152R721J0543J1470J2464J3569J4874J6489J8520K1071K4251
$$ 545824 554743 563895 573616 584159 595629 608093 621662 636536 653025 671545 692616 716867
60437G16867K8026L2116L6240M0462M5081N0124N5227O0153O5095P0330P5875
$$ 716867 744893 777009 813249 853711 898792 948916 1004143 1064296 1129391 1199721 1275596
60426A275596Q1697Q7995R4894J02006J08422J12900J13840J09332R7833P8992
$$ 1275596 1357293 1445288 1540182 1642188 1750610 1863510 1977350 2086682 2184515 2263507
60416B263507N3769K3905q438m0689p0032r4017j11252j21650j26160j26077j22522
$$ 2263507 2317276 2341181 2332743 2292054 2222022 2128005 2016753 1895103 1768943 1642866 1520344
60405A520344j16416j08758j00532r2258q3920p5518o7438o0123n3614m7729m2481
$$ 1520344 1403928 1295170 1194638 1102380 1018460 942942 875504 815381 761767 714038 671557
60394F71557l7971l4001l0227k6675k3739k1565j9757j7854j5847j4081j2792
$$ 671557 633586 599585 569358 542683 518944 497379 477622 459768 443921 429840 417048
60383D17048j1913j1212j0487r673q894q353q099p873p319o374n367m682m355
$$ 417048 405135 393923 383436 373763 364869 356516 348417 340544 333225 326851 321484 316802 312447
60370C12447m111l754l392l242l318l418l329k970k404j809j382j133q81n24j98
$$ 312447 308336 304582 301190 297948 294630 291212 287883 284913 282509 280700 279318 278185 277304 276780 276582
60355B76582n4PJ88M90P24P97P95Q05Q25Q14O73L63Q8K52R31J607J724J362J024
$$ 276582 276528 276535 276723 277213 277937 278734 279529 280334 281159 281973 282646 283009 283097 283349 284280 285887 287611 288973 289997
60336B89997R16Q76Q97J224J825K260K233J929J664J511J416J325J124P34L53
$$ 289997 290913 291789 292686 293910 295735 297995 300228 302157 303821 305332 306748 308073 309197 309931 310284
60321C10284K64L39J27m55r50j032r17q82q39o72n53n53l51K92J002J235J014
$$ 310284 310548 310887 311014 310559 309609 308577 307660 306778 305939 305267 304714 304161 303810 304102 305104 306339 307353
60304C07353Q03Q02P93O16M13L78N73R60J419J794K059K343K644K697K377K037
$$ 307353 308156 308958 309751 310367 310780 311158 311731 312691 314110 315904 317963 320306 322950 325647 328024 330061
60288C30061K091K452K712K768K880L144L280L026K439J726J029M73J91J71J90
$$ 330061 332152 334604 337316 340084 342964 346108 349388 352414 354853 356579 357608 358081 358272 358443 358633
60273C58633L3l00o26p29m72J57J014J820K295K309J960J502J125Q02L58k93j067
$$ 358633 358666 358366 357740 357011 356539 356696 357710 359530 361825 364134 366094 367596 368721 369523 369881 369588 368521
60256C68521j764k160k144j871j680j715j702j311o41j01R1j6l87r37j219p36
$$ 368521 366757 364597 362453 360582 358902 357187 355485 354174 353533 353432 353523 353507 353120 352183 350964 350228
60240C50228L50J240J458J356J456J758J963J987J894J649J310J206J539J985
$$ 350228 350578 351818 353276 354632 356088 357846 359809 361796 363690 365339 366649 367855 369394 371379
60226C71379K116K016K134K632L227L558L474L034K540K418K768L194L318L349
$$ 371379 373495 375511 377645 380277 383504 387062 390536 393570 396110 398528 401296 404490 407808 411157
60212D11157L717M336M651M453M253M634N549O460O993P264P640Q319R199J0131
$$ 411157 414874 419210 423861 428314 432567 437201 442750 449210 456203 463467 471107 479426 488625 498756
60198D98756J1115J2209J3316J4289J5245J6487J8105J9843K1487K3143K4955
$$ 498756 509871 522080 535396 549685 564930 581417 599522 619365 640852 663995 688950
60187F88950K6855K8732L0675L2835L5198L7643M0077M2351M4242M5657M6745
$$ 688950 715805 744537 775212 808047 843245 880888 920965 963316 1007558 1053215 1099960
60176A099960M7620M8132M8017M7136M5478M3068M0032L6507L2481K7880K2917
$$ 1099960 1147580 1195712 1243729 1290865 1336343 1379411 1419443 1455950 1488431 1516311 1539228
60165A539228J8014J3333Q679L977m60m287p382r657j0981j1499j1542j1075r647
$$ 1539228 1557242 1570575 1579254 1583231 1582771 1578484 1571102 1561445 1550464 1538965 1527423 1516348 1506701
60152A506701p146m155j196J898N540R701J4131J8833K3797K8606L2826L6517
$$ 1506701 1499555 1495400 1494204 1496102 1501642 1511343 1525474 1544307 1568104 1596710 1629536 1666053
60140A666053L9903M2806M4876M6098M6511M5754M3444L9805L5405L0422K4739
$$ 1666053 1705956 1748762 1793638 1839736 1886247 1932001 1975445 2015250 2050655 2081077 2105816
60129B105816J8494J2008N277j775q653j4615j9559k3953k7904l0867l2414l2657
$$ 2105816 2124310 2136318 2141595 2139820 2131167 2116552 2096993 2073040 2045136 2014269 1981855 1949198
60117A949198l1751k9528k5885k1198j6089j1017o184j497L375Q626J3999J9010
$$ 1949198 1917447 1887919 1862034 1840836 1824747 1813730 1807546 1806049 1809424 1818050 1832049 1851059
60105A851059K3457K7321L0350L2166L2711L2168L0541K7774K4244K0539J6777
$$ 1851059 1874516 1901837 1932187 1964353 1997064 2029232 2059773 2087547 2111791 2132330 2149107
60094B149107J2643Q260M399J637k31j640k506k303o96K186N953J0312J5264K0978
$$ 2149107 2161750 2170010 2174409 2176046 2175815 2174175 2171669 2169366 2168670 2170856 2176809 2187121 2202385 2223363
60080B223363K7422L4252M1257M8694N6886O5682P4661Q3667R2770J01871J10864
$$ 2223363 2250785 2285037 2326294 2374988 2431874 2497556 2572217 2655884 2748654 2850525 2961389
60069B961389J19916J29066J37626J44558J49437J52495J53740J52683J48985
$$ 2961389 3081305 3210371 3347997 3492555 3641992 3794487 3948227 4100910 4249895
60060D249895J42758J34096J22876J09183R3456P6035N7018L6666J5495o171k8172
$$ 4249895 4392653 4526749 4649625 4758808 4852264 4928299 4985317 5021983 5037478 5031307 5003135
60049E003135m9951p0462q8892j04906j18058j27537j32863j34388j32790j28472
$$ 5003135 4953184 4882722 4793830 4688924 4570866 4443329 4310466 4176078 4043288 3914816
60039C914816j21685j12876j02529r0950p8434o5381n2118l8900k6175j4496m056
$$ 3914816 3793131 3680255 3577726 3486776 3408342 3342961 3290843 3251943 3225768 3211272 3207216
60028C207216N337J3655K0437K5234K7910K8380K6584K2841J7777J1698M581l228
$$ 3207216 3212553 3226208 3246645 3271879 3299789 3328169 3354753 3377594 3395371 3407069 3411650 3408422
60016C408422j0864j7845k4498l1201l7713m3610m8854n3504n7365o0397o3024
$$ 3408422 3397558 3379713 3355215 3324014 3286301 3242691 3193837 3140333 3082968 3022571 2959547
60005B959547o5476o7201o7462o6220o3954o0875n6926n2314m7454m2436l6969
$$ 2959547 2894071 2826870 2759408 2693188 2629234 2568359 2511433 2459119 2411665 2369229 2332260
59994B332260l0871k4299j7532j0837m363K007Q601J5447K2072K8008L3266L7952
$$ 2332260 2301389 2277090 2259558 2248721 2244358 2246365 2254966 2270413 2292485 2320493 2353759 2391711
59982B391711M1737M4076M4804M4122M2057L8397L3084K6446J8924J0877K507
$$ 2391711 2433448 2477524 2522328 2566450 2608507 2646904 2679988 2706434 2725358 2736235 2738742
59971B738742o107j4853k3336l0962l7396m2761m7219n0627n2701n3293n2294
$$ 2738742 2732635 2717782 2694446 2663484 2626088 2583327 2536108 2485481 2432780 2379487 2327193
59960B327193m9676m5781m1327l6777l1998k6723k1049j5141q851k054M913J1618
$$ 2327193 2277517 2231736 2190409 2153632 2121634 2094911 2073862 2058721 2049870 2047816 2052729 2064347
59948B064347J8108K4755L1632L8418M4862N0925N6543O1465O5314O7609O7997
$$ 2064347 2082455 2107210 2138842 2177260 2222122 2273047 2329590 2391055 2456369 2523978 2591975
59937B591975O6566O3731N9536N3562M5728L6813K7626J8070P616l536j4394k4216
$$ 2591975 2658541 2722272 2781808 2835370 2881098 2917911 2945537 2963607 2971223 2967687 2953293 2929077
59925B929077l2964m0755m7358n2351n5354n6095n4643n1560m7452m2351l5988
$$ 2929077 2896113 2855358 2808000 2755649 2700295 2644200 2589557 2537997 2490545 2448194 2412206
59914B412206k8647k1205j4168p190K47P984J5365K1965K7821L3110L7844M1934
$$ 2412206 2383559 2362354 2348186 2340996 2341243 2349227 2364592 2386557 2414378 2447488 2485332 2527266
59902B527266M5278M7774M9300M9735M9052M7389M4979M2020L8706L5335L2177
$$ 2527266 2572544 2620318 2669618 2719353 2768405 2815794 2860773 2902793 2941499 2976834 3009011
59891C009011K9200K6196K3308K1199K0470K1124K2828K5561K9681L5463M2816
$$ 3009011 3038211 3064407 3087715 3108914 3129384 3150508 3173336 3198897 3228578 3264041 3306857
59880C306857N1435O0999P1288Q2228R3744J05551J17172J28194J38252J46678
$$ 3306857 3358292 3419291 3490579 3572807 3666551 3772102 3889274 4017468 4155720 4302398
59870D302398J52497J54935J53560J47786J36681J19662R7110P0021L9461O796
$$ 4302398 4454895 4609830 4763390 4911176 5047857 5167519 5264629 5334650 5374111 5380907
59860E380907k5948n6713q4273j08080j27467j41728j50846j55456j55990j52524
$$ 5380907 5354959 5298246 5213973 5105893 4978426 4836698 4685852 4530396 4374406 4221882
59850D221882j45570j36335j25899j14560j02262q9232p5857o2354m8875l5728
$$ 4221882 4076312 3939977 3814078 3699518 3597256 3508024 3432167 3369813 3320938 3285210
59840C285210k3102j0808J321J2921K3357L2415M0421M7497N3029N6043N6020
$$ 3285210 3262108 3251300 3252621 3265542 3288899 3321314 3361735 3409232 3462261 3518304 3574324
59829C574324N3049M7225L8244K5847J0484o773k4957m3456o1542p8098r2067
$$ 3574324 3627373 3674598 3712842 3738689 3749173 3742400 3717443 3673987 3612445 3534347 3442280
59818C442280j03033j11106j16509j19426j20066j18613j15283j10530j04937
$$ 3442280 3339247 3228141 3111632 2992206 2872140 2753527 2638244 2527714 2422777
59809B422777r8747r1796q4151p6470o9356o2689n6033m9402m3193l7549l2382
$$ 2422777 2324030 2232234 2148083 2071613 2002257 1939568 1883535 1834133 1790940 1753391 1721009
59798A721009k7863k4408k2115k0675j9773j9290j9047j8770j8296j7536j6313
$$ 1721009 1693146 1668738 1646623 1625948 1606175 1586885 1567838 1549068 1530772 1513236 1496923
59787A496923j4586j2705j1038r540q015o772o454p226q652j0321j2126j3913
$$ 1496923 1482337 1469632 1458594 1449054 1441039 1434267 1427813 1420587 1411935 1401614 1389488 1375575
59775A375575j5377j6444j7277j7792j7650j6830j5706j4384j2470r792o879m359
$$ 1375575 1360198 1343754 1326477 1308685 1291035 1274205 1258499 1244115 1231645 1221853 1214974 1210615
59763A210615k177J81K936N779Q263J0175J1646J3056J4755J6724J8684K0549
$$ 1210615 1208438 1208619 1211555 1217334 1225597 1235772 1247418 1260474 1275229 1291953 1310637 1331186
59751A331186K2508K4559K6221K6950K6688K5757K4401K2610K0340J7725J5061
$$ 1331186 1353694 1378253 1404474 1431424 1458112 1483869 1508270 1530880 1551220 1568945 1584006
59740A584006J2609J0456Q615P301O920P583Q814J0085J1515J3729J7023K1076
$$ 1584006 1596615 1607071 1615686 1622987 1629907 1637490 1646304 1656389 1667904 1681633 1698656 1719732
59728A719732K5537L0415L5815M1674M7971N4822O2219O9929P7889Q6428R5833
$$ 1719732 1745269 1775684 1811499 1853173 1901144 1955966 2018185 2088114 2166003 2252431 2348264
59717B348264J05901J16059J25687J34053J40049J42197J38762J27895J08282
$$ 2348264 2454165 2570224 2695911 2829964 2970013 3112210 3250972 3378867 3487149
59708C487149Q0316M6709J1639k0988m8648p0174q5239r4021r7153r5640r0659
$$ 3487149 3567465 3614174 3625813 3604825 3556177 3486003 3400764 3306743 3209590 3113950 3023291
59697C023291q3292p4384o4616n4562m4544l4524k4336j4069m066N418J4382K2922
$$ 3023291 2939999 2865615 2800999 2746437 2701893 2667369 2643033 2628964 2624898 2630316 2644698 2667620
59685B667620L1106L9083M7084N5251O3578P2034Q0633Q9343R8114J07031J16281
$$ 2667620 2698726 2737809 2784893 2840144 2903722 2975756 3056389 3145732 3243846 3350877 3467158
59674C467158J26018J36385J47611J59798J72657J85743J98957K12553K26624
$$ 3467158 3593176 3729561 3877172 4036970 4209627 4395370 4594327 4806880 5033504
59665E033504K40838K54666K67527K78713K87534K93674K97060K97299K93700
$$ 5033504 5274342 5529008 5796535 6075248 6362782 6656456 6953516 7250815 7544515
59656G544515K86133K75605K63769K52104K41711K33488K28066K25671K26292
$$ 7544515 7830648 8106253 8370022 8622126 8863837 9097325 9325391 9551062 9777354
59647I777354K29757K35387K41704K46814K49078K47325K40647K28313K09870
$$ 9777354 10007111 10242498 10484202 10731016 10980094 11227419 11468066 11696379 11906249
59638A1906249J85244J54950J20404Q3873M7730J3752j6825m2797o2883p6103
$$ 11906249 12091493 12246443 12366847 12450720 12498450 12512202 12495377 12452580 12389697 12313594
59628A2313594q2097q1106p3806o1087m3728k2274K744L0563O0408R1818J24620
$$ 12313594 12231497 12150391 12076585 12015498 11971770 11949496 11952240 11982803 12043211 12135029 12259649
59617A2259649J58505J92827K26675K58962K88273L12846L30714L39779L37763
$$ 12259649 12418154 12610981 12837656 13096618 13384891 13697737 14028451 14368230 14705993
59608A4705993L22313K91477K44331J81386J04697J7753p4710j67139k53945l30418
$$ 14705993 15028306 15319783 15564114 15745500 15850197 15867950 15793240 15626101 15372156 15041738
59598A5041738l93340m40989m72861m89533m92637m84597m68079m45651m19819
$$ 15041738 14648398 14207409 13734548 13245015 12752378 12267781 11799702 11354051 10934232
59589A0934232l93219l68643l48891l36343l32248l35970l44956l55676l64863
$$ 10934232 10541013 10172370 9823479 9487136 9154888 8818918 8473962 8118286 7753423
59580G753423l70206l70350l64797l53997l39244l22084l03532k83928k63532
$$ 7753423 7383217 7012867 6648070 6294073 5954829 5632745 5329213 5045285 4781753
59571D781753k43065k23443k05096j87842j71448j56035j41814j28788j16850
$$ 4781753 4538688 4315245 4110149 3922307 3750859 3594824 3453010 3324222 3207372
59562C207372j06004r6223q7289p9001p1403o4599n8475n2906m8085m4327m1638
$$ 3207372 3101368 3005145 2917856 2838855 2767452 2702853 2644378 2591472 2543387 2499060 2457422
59551B457422l9745l8479l7874l7956l8658l9881m1416m2843m3778m4160m4161
$$ 2457422 2417677 2379198 2341324 2303368 2264710 2224829 2183413 2140570 2096792 2052632 2008471
59540B008471m3858m3220m2239m0830l8794l6104l3129l0196k7162k3777k0260
$$ 2008471 1964613 1921393 1879154 1838324 1799530 1763426 1730297 1700101 1672939 1649162 1628902
59529A628902j7061j4144j1041p598m165j065J688M065N999P730R657J1727J3417
$$ 1628902 1611841 1597697 1586656 1579058 1574893 1573828 1575516 1579581 1585580 1593310 1602967 1614694 1628111
59516A628111J4502J5313J6150J6904J7510J8245J9296K0520K1879K3718K6237
$$ 1628111 1642613 1657926 1674076 1690980 1708490 1726735 1746031 1766551 1788430 1812148 1838385
59505A838385K9150L2176L5498L9320M3387M7383N1554N6362O1753O7209P2506
$$ 1838385 1867535 1899711 1935209 1974529 2017916 2065299 2116853 2173215 2234968 2302177 2374683
59494B374683P7937Q3816R0084R6442J02577J08209J13086J17057J20028J21943
$$ 2374683 2452620 2536436 2626520 2722962 2825539 2933748 3046834 3163891 3283919 3405862
59484C405862J22754J22372J20572J17075J11885J05394R8143R0488Q2544P4195
$$ 3405862 3528616 3650988 3771560 3888635 4000520 4105914 4204057 4294545 4377089 4451284
59474D451284O5213N5632M6000L7069K9182K2272J6518J2531J0748J0985J2848
$$ 4451284 4516497 4572129 4618129 4655198 4684380 4706652 4723170 4735701 4746449 4757434 4770282
59463D770282J6245K1182K7263L3657L9363M3359M4689M2697L7090K7721J4565
$$ 4770282 4786527 4807709 4834972 4868629 4907992 4951351 4996040 5038737 5075827 5103548 5118113
59452E118113k009k1151m1933o3616q5454j06527j25849j42512j55653j64709
$$ 5118113 5116104 5094953 5053020 4989404 4903950 4797423 4671574 4529062 4373409 4208700
59442D208700j69806j71514j70078j65363j57702j48276j38250j27951j17238
$$ 4208700 4038894 3867380 3697302 3531939 3374237 3225961 3087711 2959760 2842522
59433B842522j06246r5248q4210p3071o2287n2553m4003l6105k8336k0557j2866
$$ 2842522 2736276 2641028 2556818 2483747 2421460 2368907 2324904 2288799 2260463 2239906 2227040
59422B227040n378J807Q727J5623K2673K9771L6773M3762N0807N7668O4050P0016
$$ 2227040 2221662 2223469 2232196 2247819 2270492 2300263 2337036 2380798 2431605 2489273 2553323 2623339
59410B623339P5771Q1150Q5640Q8839R0539R0388Q7830Q2454P4175O3072M9285
$$ 2623339 2699110 2780260 2865900 2954739 3045278 3135666 3223496 3305950 3380125 3443197 3492482
59399C492482L3137J5214l740k2933m1621n9192p5120q8843r9855j08021j13576
$$ 3492482 3525619 3540833 3537093 3514160 3472539 3413347 3338227 3249384 3149529 3041508 2927932
59388B927932j16753j17588j16230j13175j08993j04023r8475r2599q6585q0474
$$ 2927932 2811179 2693591 2577361 2464186 2355193 2251170 2152695 2060096 1973511 1893037
59378A893037p4348o8387o2624n6930n1307m5967m0961l6116l1490k7498k4230
$$ 1893037 1818689 1750302 1687678 1630748 1579441 1533474 1492513 1456397 1424907 1397409 1373179
59367A373179k1112j7592j3842j0412p441m718k159J55K313M486O652Q673J0570
$$ 1373179 1352067 1334475 1320633 1310221 1302780 1298062 1295903 1296058 1298371 1302857 1309509 1318182 1328752
59354A328752J2414J4214J6094J8265K0482K1885K1865K0832J9800J9471K0090
$$ 1328752 1341166 1355380 1371474 1389739 1410221 1432106 1453971 1474803 1494603 1514074 1534164
59343A534164K1816K4627K8128L1976L6337M1365M6423N0505N3343N5602N8094
$$ 1534164 1555980 1580607 1608735 1640711 1677048 1718413 1764836 1815341 1868684 1924286 1982380
59332A982380O1361O5915P2126P9723Q7995R6622J05918J16170J27248J38941
$$ 1982380 2043741 2109656 2181782 2261505 2349500 2446122 2552040 2668210 2795458 2934399
59322B934399J51236J64051J77068J89983K02563K14312K24408K32051K36643
$$ 2934399 3085635 3249686 3426754 3616737 3819300 4033612 4258020 4490071 4726714
59313D726714K37596K34341K26704K15089K00293J83289J65112J46623J28319
$$ 4726714 4964310 5198651 5425355 5640444 5840737 6024026 6189138 6335761 6464080
59304F464080J10535R3642P7809O2641M7516L2158J6563M65j6632l4894n3934
$$ 6464080 6574615 6668257 6746066 6808707 6856223 6888381 6904944 6905409 6888777 6853883 6799949
59293F799949p3170r1987j09609j25189j38248j48803j57162j63809j69350j74217
$$ 6799949 6726779 6634792 6525183 6399994 6261746 6112943 5955781 5791972 5622622 5448405
59283E448405j78404j81785j84478j86550j87600j87105j85041j81668j76914
$$ 5448405 5270001 5088216 4903738 4717188 4529588 4342483 4157442 3975774 3798860
59274C798860j70552j62908j54726j46271j37186j27355j17270j07400r7752q8243
$$ 3798860 3628308 3465400 3310674 3164403 3027217 2899862 2782592 2675192 2577440 2489197
59264B489197p9041p0273o1880n3945m6762m0352l4357k8559k3149j8241j3547
$$ 2489197 2410156 2339883 2278003 2224058 2177296 2136944 2102587 2074028 2050879 2032638 2019091
59253B019091q768l993N29M684Q454J1827J4974J8195K1553K4790K7693L0237
$$ 2019091 2010323 2006330 2006859 2011543 2019997 2031824 2046798 2064993 2086546 2111336 2139029 2169266
59241B169266L2344L3854L4766L5139L4752L3313L1071K8693K6379K3652K0269
$$ 2169266 2201610 2235464 2270230 2305369 2340121 2373434 2404505 2433198 2459577 2483229 2503498
59230B503498J6792J3946J1908J0566J0006J0299J1177J2389J4113J6622J9778
$$ 2503498 2520290 2534236 2546144 2556710 2566716 2577015 2588192 2600581 2614694 2631316 2651094
59219B651094K3261K7045L1211L5397L8881M1178M2284M2349M1387L9213L5467
$$ 2651094 2674355 2701400 2732611 2768008 2806889 2848067 2890351 2932700 2974087 3013300 3048767
59208C048767K9782K2078J2730K372q297j8405k6957l3275l7384l9718m0533l9781
$$ 3048767 3078549 3100627 3113357 3115729 3107432 3089027 3062070 3028795 2991411 2951693 2911160 2871379
59196B871379l7495l4060l0030k5748k1179j6195j1029o307k495N55L231N451
$$ 2871379 2833884 2799824 2769794 2744046 2722867 2706672 2695643 2689336 2686841 2687396 2690627 2696078
59184B696078O726O966O779O841P220P578P812Q263R399J1473J4456J8240K2929
$$ 2696078 2702804 2709770 2716549 2723390 2730610 2738188 2746000 2754263 2763662 2775135 2789591 2807831 2830760
59171B830760K8846L6125M4431N3279O2540P2348Q2590R2828J02609J11475J18675
$$ 2830760 2859606 2895731 2940162 2993441 3055981 3128329 3210919 3303747 3406356 3517831 3636506
59160C636506J23290J24641J22232J15314J03101Q5612O3836L8875J1356j8111
$$ 3636506 3759796 3884437 4006669 4121983 4225084 4310696 4374532 4413407 4424763 4406652
59150D406652m8347p7784j05027j28944j48571j63266j72854j77589j78052j75175
$$ 4406652 4358305 4280521 4175494 4046550 3897979 3734713 3561859 3384270 3206218 3031043
59140C031043j69928j62795j53879j43585j32822j22322j12150j02169r2615q3898
$$ 3031043 2861115 2698320 2544441 2400856 2268034 2145712 2033562 1931393 1838778 1754880
59130A754880p6116o9071o2569n6487n0776m5601m1213l7483l3855k9983k6217
$$ 1754880 1678764 1609693 1547124 1490637 1439861 1394260 1353047 1315564 1281709 1251726 1225509
59119A225509k3099k0669j8489j6226j3840j1448r201p269n645m065k273l05J628
$$ 1225509 1202410 1181741 1163252 1147026 1133186 1121738 1112537 1105268 1099623 1095558 1093285 1092980 1094608
59106A094608L385M953O443Q111J0157J2421J4537J6399J8217K0048K1673K3123
$$ 1094608 1097993 1102946 1109389 1117500 1127657 1140078 1154615 1171014 1189231 1209279 1230952 1254075
59094A254075K4849K7105K9500L1528L3214L4932L6766L8436L9696M0502M0842
$$ 1254075 1278924 1306029 1335529 1367057 1400271 1435203 1471969 1510405 1550101 1590603 1631445
59083A631445M0695M0093L9036L7477L5445L3044L0208K6713K2618J8371J4368
$$ 1631445 1672140 1712233 1751269 1788746 1824191 1857235 1887443 1914156 1936774 1955145 1969513
59072A969513J0609P019L802J247n61j535j404m4K200M862P893J1561J5917K0734
$$ 1969513 1980122 1987141 1990943 1992190 1991629 1990094 1988690 1988646 1990846 1995708 2003601 2015162 2031079 2051813
59058B051813K5814L1122L6608M2143M7655N3155N8663O4155O9470P4254P8127
$$ 2051813 2077627 2108749 2145357 2187500 2235155 2288310 2346973 2411128 2480598 2554852 2632979
59047B632979Q1031Q3192Q4588Q4598Q2326P7233O9375N9247M7406L4167J9587
$$ 2632979 2714010 2797202 2881790 2966388 3048714 3125947 3195322 3254569 3301975 3336142 3355729
59036C355729L968j1704k6131l8569m9032n7716o4626o9911p4027p7337p9831
$$ 3355729 3359697 3347993 3321862 3283293 3234261 3176545 3111919 3042008 2967981 2890644 2810813
59025B810813q1484q2565q3385q3995q4360q4515q4436q4007q3232q2204q0758
$$ 2810813 2729329 2646764 2563379 2479384 2395024 2310509 2226073 2142066 2058834 1976630 1895872
59014A895872p8604p5854p2969p0078o6892o3470o0358n7680n4739n1065m7235
$$ 1895872 1817268 1741414 1668445 1598367 1531475 1468005 1407647 1349967 1295228 1244163 1196928
59003A196928m4028m1338l8580l5744l3293l1237k9134k6896k4921k3414k2111
$$ 1196928 1152900 1111562 1072982 1037238 1003945 972708 943574 916678 891757 868343 846232
58992H46232k0744j9349j8057j6991j6274j5829j5249j4231j3029j2051j1202
$$ 846232 825488 806139 788082 771091 754817 738988 723739 709508 696479 684428 673226
58981F73226j0080q739p677p059o464n533m464l624l026k396j568o06L40J222
$$ 673226 663146 654407 646730 639671 633207 627674 623210 619586 616560 614164 612596 611990 612330 613552
58967F13552K086K931L548L663L277K695K141J559R06L78J68J80K13K28K49K46
$$ 613552 615638 618569 622117 625780 629057 631752 633893 635452 636358 636736 636904 637084 637297 637525 637774 638020
58951F38020K88N87J239K015K658L101L344L338L179L065K907K346J324K93l89
$$ 638020 638308 638895 640134 642149 644807 647908 651252 654590 657769 660834 663741 666087 667411 667704 667315
58936F67315q40j208j301j017o67m62j14O39J523K175K728L444M158M638N106
$$ 667315 666475 665267 663966 662949 662282 661820 661706 662345 663868 666043 668771 672215 676373 681011 686117
58921F86117N823O536O906P176P728Q369Q730R063R850J0887J1595J2089J3025
$$ 686117 691940 698476 705382 712558 720286 728655 737385 746448 756298 767185 778780 790869 803894
58908H03894J4428J5536J5980J6241J6792J7483J8102J8821J9790K0736K1413
$$ 803894 818322 833858 849838 866079 882871 900354 918456 937277 957067 977803 999216
58897I99216K1969K2617K3324K4066K5034K6374K7962K9678L1591L3710L5804
$$ 999216 1021185 1043802 1067126 1091192 1116226 1142600 1170562 1200240 1231831 1265541 1301345
58886A301345L7742L9727M2021M4604M7293N0082N3211N6911O1101O5385O9415
$$ 1301345 1339087 1378814 1420835 1465439 1512732 1562814 1616025 1672936 1734037 1799422 1868837
58875A868837P3331P7644Q2620Q8022R3622R9618J06326J13702J21577J30037
$$ 1868837 1942168 2019812 2102432 2190454 2284076 2383694 2490020 2603722 2725299 2855336
58865B855336J39224J48980J59131J69913J81633J94080K06766K19525K32409
$$ 2855336 2994560 3143540 3302671 3472584 3654217 3848297 4055063 4274588 4506997
58856D506997K45122K57074K67906K77426K84988K89458K89739K84922K74020
$$ 4506997 4752119 5009193 5277099 5554525 5839513 6128971 6418710 6703632 6977652
58847F977652K56069K30613J97733J57781J11583O0926Q230m4340r5116j42389
$$ 6977652 7233721 7464334 7662067 7819848 7931431 7992357 8000587 7956247 7861131 7718742
58837G718742j84262k19291k46901k67199k80698k88222k90611k88449k82279
$$ 7718742 7534480 7315189 7068288 6801089 6520391 6232169 5941558 5653109 5370830
58828E370830k72968k61438k48215k33685k18626k03942j89955j76477j63566
$$ 5370830 5097862 4836424 4588209 4354524 4135898 3931956 3742001 3565524 3401958
58819C401958j51593j40597j30251j20528j11787j04094r7040r0361q4183p8506
$$ 3401958 3250365 3109768 2979517 2858989 2747202 2643108 2546068 2455707 2371524 2293018
58809B293018p2997o7502o2244n7305n2414m7522m3049l9336l6160l3120l0061
$$ 2293018 2220021 2152519 2090275 2032970 1980556 1933034 1889985 1850649 1814489 1781369 1751308
58798A751308k6977k3791k0502j7270j4160j1061p941m863j764J501M804P860
$$ 1751308 1724331 1700540 1680038 1662768 1648608 1637547 1629606 1624743 1622979 1624480 1629284 1637144
58786A637144J0744J3873J7424K1126K4745K8299L1773L5047L8283M1909M6039
$$ 1637144 1647888 1661761 1679185 1700311 1725056 1753355 1785128 1820175 1858458 1900367 1946406
58775A946406N0304N4393N8485O2916O7777P3001P8492Q4074Q9641R5483J02127
$$ 1946406 1996710 2051103 2109588 2172504 2240281 2313282 2391774 2475848 2565489 2660972 2763099
58764B763099J09699J17794J26091J34763J44171J54436J65466J77172J89448
$$ 2763099 2872798 2990592 3116683 3251446 3395617 3550053 3715519 3892691 4082139
58755D082139K02157K15108K27903K39936K50783K60444K68719K74444K75891
$$ 4082139 4284296 4499404 4727307 4967243 5218026 5478470 5747189 6021633 6297524
58746F297524K71829K61771K45152K21074J89040J49615J04162N4365K114n0562
$$ 6297524 6569353 6831124 7076276 7297350 7486390 7636005 7740167 7794532 7796646 7746084
58736G746084j01662j49171j91037k25755k53012k73388k87371k95113k97108
$$ 7746084 7644422 7495251 7304214 7078459 6825447 6552059 6264688 5969575 5672467
58727E672467k94395k87997k78631k67030k54038k40213k25806k11253j97201
$$ 5672467 5378072 5090075 4811444 4544414 4290376 4050163 3824357 3613104 3415903
58718C415903j83918j71207j58985j47549j37179j27959j19944j12986j06451
$$ 3415903 3231985 3060778 2901793 2754244 2617065 2489106 2369162 2256176 2149725
58709B149725r9702r2948q6950q1809p6803p1533o6431o1913n7738n3623m9771
$$ 2149725 2050023 1957075 1870125 1788316 1711513 1639980 1573549 1511636 1453898 1400275 1350504
58698A350504m6379m3205m0038l7077l4456l1899k9246k6821k4875k3106k1145
$$ 1350504 1304125 1260920 1220882 1183805 1149349 1117450 1088204 1061383 1036508 1013402 992257
58687I92257j9103j7284j5741j4438j3506j2918j2295j1394j0504j0116j0353
$$ 992257 973154 955870 940129 925691 912185 899267 886972 875578 865074 854958 844605
58676H44605j0968j1561j1811j1744j1808j2255j2584j2124j1166j0720j1155
$$ 844605 833637 822076 810265 798521 786713 774458 761874 749750 738584 727864 716709
58665G16709j1849j2329j2836j3484j3794j3579j3413j3674j3882j3608j3275
$$ 716709 704860 692531 679695 666211 652417 638838 625425 611751 597869 584261 570986
58654E70986j3372j3535j3170j2503j2108j1889j1322j0441r742r316q811q134
$$ 570986 557614 544079 530909 518406 506298 494409 483087 472646 462904 453588 444777 436643
58642D36643p532p006o318n559n153n207n295n063m670m465m485m426m052l551
$$ 436643 429111 422105 415787 410228 405075 399868 394573 389510 384840 380375 375890 371464 367412 363861
58628C63861l292l267k974k108j082n24m34l52j74j78l18k40k8j51n44n20J14
$$ 363861 360569 357302 354328 352220 351138 350614 350180 349828 349654 349476 349158 348918 348890 348739 348195 347675 347789
58611C47789O45N17J28J05M18O68P63Q85J148J559J982J981J273M14L05Q98J222
$$ 347789 348434 348951 349079 349184 349602 350270 351033 351918 353066 354625 356607 358588 359861 360275 360580 361478 362700
58594C62700Q98O97J203J946K426L079M395N883O749P043P366P951Q722R762J1041
$$ 362700 363598 364295 365498 367444 369870 372949 377344 383227 389976 397019 404385 412336 421058 430820 441861
58579D41861J2111J2731J3406J4632J6105J7251J8115J9132K0415K1910K3794
$$ 441861 453972 466703 480109 494741 510846 528097 546212 565344 585759 607669 631463
58568F31463K6163K8730L1300L4065L7020L9680M2005M4829M8722N3042N6935
$$ 631463 657626 686356 717656 751721 788741 828421 870426 915255 963977 1017019 1073954
58557A073954O0644O4978O9939P4806P9128Q2735Q5120Q5609Q3925P9882P2862
$$ 1073954 1134598 1199576 1269515 1344321 1423449 1506184 1591304 1676913 1760838 1840720 1913582
58546A913582O2369M8791L3005J5635k606k0298l5969m9099n9782o7809p2937
$$ 1913582 1975951 2024742 2057747 2073382 2070776 2050478 2014509 1965410 1905628 1837819 1764882
58535A764882p5700p7006p7053p5495p2474o8757o4869o0842n6694n2558m8430
$$ 1764882 1689182 1612176 1535123 1459628 1387154 1318397 1253528 1192686 1135992 1083434 1035004
58524A035004m4340m0559l7170l3781l0148k6698k3868k1430j9075j7149j6007
$$ 1035004 990664 950105 912935 879154 849006 822308 798440 777010 757935 740786 724779
58513G24779j5129j3783j2138j0903j0182r592r153r114r190q920q551q674r203
$$ 724779 709650 695867 683729 672826 662644 653052 643899 634785 625595 616675 608124 599450 590247
58500E90247r597r894j0586j1610j2406j2822j3107j3147j2588j1617j0744r930
$$ 590247 580650 570756 560170 548560 536154 523332 510225 497078 484490 472873 462129 452199
58488D52199q756p400o500o128n757n209m777m477m022l505l288l197k706j953
$$ 452199 443443 436043 429543 423415 417658 412449 407672 403195 399173 395668 392380 389183 386477 384524
58474C84524j725k296l028l321l278l290l565m149m894n407n446n347n559n972
$$ 384524 382799 380503 377475 374154 370876 367586 364021 359872 354978 349571 344125 338778 333219 327247
58460C27247o175o166o182o074n577m931m582m384l860l036k391k039j661j119
$$ 327247 321072 314906 308724 302650 297073 292142 287560 283176 279316 276280 273889 271850 270189 269070
58446B69070n70r2L02M24K44J02K17L42L80P18J385J622J039M96Q66J661J914
$$ 269070 268500 268408 268710 269134 269378 269480 269697 270039 270419 271137 272522 274144 275183 275679 276545 278206 280120
58429B80120J774J988K415K342J877J680J662J252P13Q06J324J287N46o1j42r1
$$ 280120 281894 283882 286297 288639 290516 292196 293858 295110 295823 296629 297953 299240 299786 299725 299583 299492
58413B99492j02K3M8m69j242j560j502j720k212k462k615l233m023m102l512l112
$$ 299492 299390 299413 299461 298992 297750 296190 294688 292968 290756 288294 285679 282446 278423 274321 270809 267697
58397B67697l075k761k126j848k006j959j615j537j698j476r19p28q33m20N33
$$ 267697 264622 261861 259735 257887 255881 253922 252307 250770 249072 247596 246677 245949 245116 244696 245229
58382B45229J117J109J298K015K667K983L358L703L350K362J641J452J143N26
$$ 245229 246346 247455 248753 250768 253435 256418 259776 263479 266829 269191 270832 272284 273427 273953
58368B73953J80J80p3n13l75K65M26K9J67J183K045K177K308K921L379L267L174
$$ 273953 274133 274313 274240 273727 273352 273617 274043 274072 274239 275422 277467 279644 281952 284873 288252 291519 294693
58351B94693L407L345K755K465K931L357L025K322J779J222N12L0k02p41j611
$$ 294693 298100 301445 304200 306665 309596 312953 315978 318300 320079 321301 321813 321843 321641 320900 319289
58336C19289k075j991k133k709k883k300j740j693j614j161q83j032j039p10o35
$$ 319289 317214 315223 313090 310381 307498 305198 303458 301765 300151 298990 298107 297075 296036 295326 294691
58321B94691q67n72M16J183J354J673K340K471J837J514J995K332K037K123L142
$$ 294691 293824 293252 293668 294851 296205 297878 300218 302689 304526 306040 308035 310367 312404 314527 317669
58306C17669L961L637L006L083L369L071K685K947L410L366L161L392L702L562
$$ 317669 321630 325267 328273 331356 334725 337796 340481 343428 346838 350204 353365 356757 360459 364021
58292C64021L283L221L001K433K164K512K697K191J647J637J593J007M38M45N64
$$ 364021 367304 370525 373526 375959 378123 380635 383332 385523 387170 388807 390400 391407 391845 392290 392854
58277C92854L45K46O28J034J246J894L165M197M503M719N235N522N458N808O615
$$ 392854 393199 393445 394073 395107 396353 398247 401412 405609 410112 414831 420066 425588 431046 436854 443469
58262D43469O808O210O115P003P579P173O994P861Q621Q251P633P698P658O699
$$ 443469 450277 456487 462602 469605 477184 484357 491351 499212 507833 516084 523717 531415 539073 545772
58248E45772N635N331N106M279L678M024M496M415M683N985P245P543P756Q741
$$ 545772 551407 556738 561844 566123 569801 573825 578321 582736 587419 593404 600649 608192 615948 624689
58234F24689R652R744R993J1154J2088J1850J1553J2310J3235J3332J3524J4701
$$ 624689 634341 644085 654078 665232 677320 689170 700723 713033 726268 739600 753124 767825
58222G67825J5744J5632J5569J6846J8453J9058J9475K0890K2456K2991K3310
$$ 767825 783569 799201 814770 831616 850069 869127 888602 909492 931948 954939 978249
58211I78249K4510K5753K6084K6540K8101K9474K9378K9046L0031L1520L2411
$$ 978249 1002759 1028512 1054596 1081136 1109237 1138711 1168089 1197135 1227166 1258686 1291097
58200A291097L3889L7210M1019M3696M6277N0244N4587N8027O1868O7599P3829
$$ 1291097 1324986 1362196 1403215 1446911 1493188 1543432 1598019 1656046 1717914 1785513 1859342
58189A859342P8683Q3062Q8387R3497R7097J00753J06061J11454J15344J19742
$$ 1859342 1938025 2021087 2109474 2202971 2300068 2400821 2506882 2618336 2733680 2853422
58179B853422J26973J35546J43280J51680J62949J75514J87028J98894K13132
$$ 2853422 2980395 3115941 3259221 3410901 3573850 3749364 3936392 4135286 4348418
58170D348418K27578K39202K49404K61083K73420K84713K97307L14128L33457
$$ 4348418 4575996 4815198 5064602 5325685 5599105 5883818 6181125 6495253 6828710
58161F828710L52760L74375M01477M31933M62264M93706N27877N61140N90951
$$ 6828710 7181470 7555845 7957322 8389255 8851519 9345225 9873102 10434242 11025193
58152A1025193O23286O65511P16507P72478Q37359R17667J012358J118585J242132
$$ 11025193 11648479 12313990 13030497 13802975 14640334 15558001 16570359 17688944 18931076
58143A8931076J390599J562192J753991J974617K234162K528855K851710L209888
$$ 18931076 20321675 21883867 23637858 25612475 27846637 30375492 33227202 36437090
58135C6437090L613557M060134M555385N140364N870339O779133P882178R143632
$$ 36437090 40050647 44110781 48666166 53806530 59676869 66456002 74338180 83481812
58127H3481812J0312905J0787130R821410P085712L063623j172335m632011o896902
$$ 83481812 93794717 104581847 114403257 121488969 124552592 123380257 118748246 111851344
58119A11851344q082943q511349q472086q170706p733396p212053o620105n980610
$$ 111851344 103768401 95257052 86784966 78614260 70880864 63668811 57048706 51068096
58111E1068096n331378m699622m099516l548463l061547k633505k247131j897306
$$ 51068096 45736718 41037096 36937580 33389117 30327570 27694065 25446934 23549628
58103B3549628j589796j321568j081362q66565o80619n15063l51426j78923O965
$$ 23549628 21959832 20638264 19556902 18690337 18009718 17494655 17143229 16964306 16971271
58094A6971271K16548M44751O27792O51571M36964K0785m58291q54724j097707
$$ 16971271 17187819 17632570 18260362 18911933 19348897 19369682 18911391 18056667 16958960
58085A6958960j198684j206967j167539j106688j036625r62562q86064q07234
$$ 16958960 15760276 14553309 13385770 12279082 11242457 10279895 9393831 8586597
58077H586597p27575o50833n80348n16639m58803m06874l61155l20682k84624
$$ 8586597 7859022 7208189 6627841 6111202 5652399 5245525 4884370 4563688 4279064
58068D279064k54037k29957k10718j93528j77872j65023j54922j45994j37484
$$ 4279064 4025027 3795070 3584352 3390824 3212952 3047929 2893007 2747013 2609529
58059B609529j29691j22329j14754j07380j00951r4890q8234q1522p5954p1521
$$ 2609529 2479838 2357509 2242755 2135375 2034424 1939534 1851300 1769778 1693824 1622303
58049A622303o7793o5480o5150o5339o4152o1923o0133n8603n6051n2652m9636
$$ 1622303 1554510 1489030 1423880 1358541 1294389 1232466 1172333 1113730 1057679 1005027 955391
58038I55391m6950m3624m0003l7278l5223l2601k9519k7192k5732k4227k2697
$$ 955391 908441 864817 824814 787536 752313 719712 690193 663001 637269 613042 590345
58027E90345k1861k1307k0022j8465j7958j8244j7806j6458j5474j5193j4592
$$ 590345 568484 547177 527155 508690 490732 472488 454682 438224 422750 407557 392965
58016C92965j3372j2459j2153j1645j0657r887r557r071q309p818p602p105o432
$$ 392965 379593 367134 354981 343336 332679 322792 313235 304164 295855 288037 280435 273330 266898
58003B66898o204o262n890n252n152n462n270m578m268m484m454l995l687l530
$$ 266898 260694 254432 248542 243290 238138 232676 227406 222828 218560 214076 209622 205627 201940 198410
57989A98410k915j981j600j878k056j934k053k405k374j996j953k174j851r36
$$ 198410 195495 193514 191914 190036 187980 186046 183993 181588 179214 177218 175265 173091 171240 170304
57975A70304k64j00J42N66N75J29p7R4K4m09n90m00m47q29r17o06n12p27n68J24
$$ 170304 170040 169940 170082 170648 171223 171352 171275 171369 171393 170984 170394 169994 169547 168718 167801 167195 166683 165956 165388 165512
57955A65512O14N23L08J84k94j228j999k285k461k632k343j558r77r83j163j178
$$ 165512 166126 166649 166957 167141 166847 165619 163620 161335 158874 156242 153899 152341 151364 150381 149218 148040
57939A48040j229j335j141p49q24j491k025j975j721j613j425j066r40j217j463
$$ 148040 146811 145476 144335 143586 142762 141271 139246 137271 135550 133937 132512 131446 130506 129289 127826
57924A27826j394j258j186q94l60m1j03j32Q1K27J62J86L61K78j66m76l82k59
$$ 127826 126432 125174 123988 123094 122734 122693 122590 122458 122539 122766 122928 123114 123475 123753 123587 123111 122729 122470
57906A22470m33o49o43n91o97q30q80r76j154j270j368j647j968j993j848k002
$$ 122470 122037 121388 120745 120154 119457 118627 117747 116771 115617 114347 112979 111332 109364 107371 105523 103521
57890A03521k447k636k349j898j431p83j02J53QL4M19P49Q24R15R95N91l24j081
$$ 103521 101074 98438 96089 94191 92760 91977 91875 92028 92036 92070 92489 93238 94062 94977 95972 96563 96239 95158
57872I5158j306j426j824k263k484k673k928k930k590k390k666l034k930k284
$$ 95158 93852 92426 90602 88339 85855 83182 80254 77324 74734 72344 69678 66644 63714 61430
57858F1430j355m05K20K57j6L9N19Q63P94P59J150J691K001K136K282K365K322
$$ 61430 60075 59670 59890 60147 60131 60170 60689 61552 62346 63105 64255 65946 67947 70083 72365 74730 77052
57841G7052K234K043J549R35P12R10R96P07L74J88j28o52r91j019j180j659j971
$$ 77052 79286 81329 82878 83813 84525 85435 86431 87138 87512 87700 87572 86920 85929 84910 83730 82071 80100
57824H0100j778j494j568j769j730j592j619j650j452j188j050q65m80j14Q7L81
$$ 80100 78322 76828 75260 73491 71761 70169 68550 66900 65448 64260 63210 62345 61865 61751 61838 62219
57808F2219R14J335J351J213J268J469J675J976K295K224J703J305J368J375P96
$$ 62219 63133 64468 65819 67032 68300 69769 71444 73420 75715 77939 79642 80947 82315 83690 84486
57793H4486J6k30K1J04k59p34r78r84r11j023j519k188k484k245j984k103k278
$$ 84486 84502 84272 84293 84397 84138 83404 82426 81442 80531 79508 77989 75801 73317 71072 69088 66985 64707
57776F4707k040j541j191r83p59p67j319k071k354k067j737j783k161k681l149
$$ 64707 62667 61126 59935 58952 58193 57426 56107 54036 51682 49615 47878 46095 43934 41253 38104
57761C8104l317l107k827k833l040l132l003k728k245j529q99p21r48j212j309
$$ 38104 34787 31680 28853 26020 22980 19848 16845 14117 11872 10343 9444 8723 7775 6563 5254
57746E254j239r89o61n42p02D42o4Q52J403J424J326J464J795K150K411K447K196
$$ 5254 4015 3026 2365 1823 1121 442 378 1230 2633 4057 5383 6847 8642 10792 13203 15650 17846
57729A7846J811J466J124P21M45M90O94P15M76J59j41m06n80o71q88j303j632
$$ 17846 19657 21123 22247 22968 23413 23903 24597 25312 25788 25947 25806 25400 24820 24149 23261 21958 20326
57712B0326j626j496j571j766j771j589j460j362j100o80k53K55R72J636J840
$$ 20326 18700 17204 15633 13867 12096 10507 9047 7685 6585 5905 5652 5907 6879 8515 10355
57697A0355J657J564J705J715J347Q76P15R29J265J386J132P31O89J227J903K176
$$ 10355 12012 13576 15281 16996 18343 19219 19934 20863 22128 23514 24646 25377 26066 27293 29196 31372
57681C1372K130K272K651K772K418K010J988K259K516K698K868K967K976L107
$$ 31372 33502 35774 38425 41197 43615 45625 47613 49872 52388 55086 57954 60921 63897 67004
57667F7004L544M106M441M469M426M567M962N572O286O890P173P140P130P548
$$ 67004 70548 74654 79095 83564 87990 92557 97519 103091 109377 116267 123440 130580 137710 145258
57653A45258Q474R528J0250J0583J0796J1058J1324J1690J2487J3789J5131J6074
$$ 145258 153732 163260 173510 184093 194889 205947 217271 228961 241448 255237 270368 286442
57641B86442J6826J7950J9560K1233K2632K3868K5227K6833K8728L0956L3467
$$ 286442 303268 321218 340778 362011 384643 408511 433738 460571 489299 520255 553722
57630E53722L6188L9207M2713M6650N0690N4633N8671O3011O7466P1499P4613
$$ 553722 589910 629117 671830 718480 769170 823803 882474 945485 1012951 1084450 1159063
57619A159063P6479P6777P5085P1021O4451N5539M4662L2442J9823P950k290j0597
$$ 1159063 1235542 1312319 1387404 1458425 1522876 1578415 1623077 1655519 1675342 1683292 1681002 1670405
57607A670405j7165k2510k7620l3984m2714n3300o3598p1339p5546p6428p4530
$$ 1670405 1653240 1630730 1603110 1569126 1526412 1473112 1409514 1338175 1262629 1186201 1111671
57596A111671p0471o5185n9609n4081m8397m2551l7005l2173k8036k4315k0814
$$ 1111671 1041200 976015 916406 862325 813928 771377 734372 702199 674163 649848 629034
57585F29034j7410j3992j0587p398m581k084K85K650N006P287R506J1797J4298
$$ 629034 611624 597632 587045 579647 575066 572982 573267 575917 580923 588210 597716 609513 623811
57572F23811J6966J9682K2513K5670K9107L2479L5642L8875M2343M5725M8689
$$ 623811 640777 660459 682972 708642 737749 770228 805870 844745 887088 932813 981502
57561I81502N1416N4114N6251N6815N5279N1754M6241L8384K8105J5964K749j0870
$$ 981502 1032918 1087032 1143283 1200098 1255377 1307131 1353372 1391756 1419861 1435825 1438574 1427704
57549A427704k4108l5973m5772n3453n9246o3215o5363o5846o4938o2911o0140
$$ 1427704 1403596 1367623 1321851 1268398 1209152 1145937 1080574 1014728 949790 886879 826739
57538H26739n7028n3712n0121m6382m2917l9932l7158l4282l1369k8611k6018
$$ 826739 769711 715999 665878 619496 576579 536647 499489 465207 433838 405227 379209
57527C79209k3598k1555j9964j8503j6895j5382j4366j3696j2765j1342r881q912
$$ 379209 355611 334056 314092 295589 278694 263312 248946 235250 222485 211143 201262 192350
57515A92350q413p942p172o187n340m878m695m389l671k675j832j417j285j080
$$ 192350 183937 175995 168823 162636 157296 152418 147723 143334 139663 136988 135156 133739 132454 131374
57501A31374n88R0P11J197J704K343K990L500M036M847N775O331O434O649P465
$$ 131374 130786 130876 131587 132784 134488 136831 139821 143321 147357 152204 157979 164310 170744 177393 184858
57486A84858Q634R579J0234J1031J2210J3568J4913J6330J7945J9702K1511K3353
$$ 184858 193492 203071 213305 224336 236546 250114 265027 281357 299302 319004 340515 363868
57474C63868K5172K6908K8722L0945L3627L6348L8633M0388M1775M2800M3267
$$ 363868 389040 415948 444670 475615 509242 545590 584223 624611 666386 709186 752453
57463G52453M2940M1565L8759L4111K7482J9132R622l46j0029j8817k6400l2695
$$ 752453 795393 836958 875717 909828 937310 956442 966064 965718 955689 936872 910472 877777
57451H77777l7646m1125m3087m3714m3348m2299m0716l8651l6176l3475l0766
$$ 877777 840131 799006 755919 712205 668857 626558 585842 547191 511015 477540 446774
57440D46774k8181k5679k3148k0560j8044j5784j3850j2120j0403q598o734m887
$$ 446774 418593 392914 369766 349206 331162 315378 301528 289408 279005 270407 263673 258786
57428B58786l130j507J7J575L245M896O303P473Q670J0074J1545J2911J4320J6060
$$ 258786 255656 254149 254166 255741 258986 263882 270185 277658 286328 296402 307947 320858 335178 351238
57414C51238J8107K0120K1907K3659K5647K7880L0104L2042L3531L4571L5342
$$ 351238 369345 389465 411372 435031 460678 488558 518662 550704 584235 618806 654148
57403F54148L5932L5989L4761L1596K6356J9278J0652Q61r433j9368k8245l5683
$$ 654148 690080 726069 760830 792426 818782 838060 848712 849573 840140 820772 792527 756844
57391G56844m1500m5682m8415m9995n0560n0020m8342m5794m2858l9933l7162
$$ 756844 715344 669662 621247 571252 520692 470672 422330 376536 333678 293745 256583
57380B56583l4529l2015k9637k7374k5172k3049k1115j9425j7834A0245d318j3249
$$ 256583 222054 190039 160402 133028 107856 84807 63692 44267 26433 10245 -4318 -17567
57368a7567j2338j1685j1161j0760j0388r786q916q182p983q138q086p626p155
$$ -17567 -29905 -41590 -52751 -63511 -73899 -83685 -92601 -100783 -108766 -116904 -124990 -132616 -139771
57355a39771p051p164p039o536n961n642n523n278m793m359m306m520m523m110
$$ -139771 -146822 -153986 -161025 -167561 -173522 -179164 -184687 -189965 -194758 -199117 -203423 -207943 -212466 -216576
57341b16576l612l453l568l559l245k833k599k659k970l311l295k714j893j430
$$ -216576 -220188 -223641 -227209 -230768 -234013 -236846 -239445 -242104 -245074 -248385 -251680 -254394 -256287 -257717
57327b57717j553j943k235k388k484k437k149j775j636j884k410k974l346l397
$$ -257717 -259270 -261213 -263448 -265836 -268320 -270757 -272906 -274681 -276317 -278201 -280611 -283585 -286931 -290328
57313b90328l187k932k866l084l457l687l489k927k421k315k461k407k025j623
$$ -290328 -293515 -296447 -299313 -302397 -305854 -309541 -313030 -315957 -318378 -320693 -323154 -325561 -327586 -329209
57299c29209j550j795k099k232k136j960j961k200k401k277j958j831j975k090
$$ -329209 -330759 -332554 -334653 -336885 -339021 -340981 -342942 -345142 -347543 -349820 -351778 -353609 -355584 -357674
57285c57674j977j813j830k031k255k340k129j601j036q27j013j292j432j453
$$ -357674 -359651 -361464 -363294 -365325 -367580 -369920 -372049 -373650 -374686 -375513 -376526 -377818 -379250 -380703
57271c80703j387j217j095j219j471j542j462j551j796j794j484j323j483j431
$$ -380703 -382090 -383307 -384402 -385621 -387092 -388634 -390096 -391647 -393443 -395237 -396721 -398044 -399527 -400958
57257d00958p91n9M7l86o68m61j3L93P16R18R25Q61R32J084J059Q03N60N61P71
$$ -400958 -401749 -401808 -401761 -402147 -402815 -403276 -403289 -402896 -402180 -401262 -400337 -399476 -398544 -397460 -396401 -395598 -395038 -394477 -393706
57238c93706R68R40P15N91Q39J328J683J802J916K109K223K305K719L560M404
$$ -393706 -392738 -391798 -391083 -390492 -389653 -388325 -386642 -384840 -382924 -380815 -378592 -376287 -373568 -370008 -365604
57223c65604M948N404O046O764P447Q319R485J0533J1028J0997J0541R351P180
$$ -365604 -360656 -355252 -349206 -342442 -334995 -326676 -317191 -306658 -295630 -284633 -274092 -264741 -257561
57210b57561M431J732q06l365n765p608q875r825j0497j0805j0910j0978j0800
$$ -257561 -253130 -251398 -252204 -255569 -261334 -268942 -277817 -287642 -298139 -308944 -319854 -330832 -341632
57197c41632j0118r169q378p733o963o118n460m954m399l903l689l657l572l508
$$ -341632 -351750 -360919 -369297 -377030 -383993 -390111 -395571 -400525 -404924 -408827 -412516 -416173 -419745 -423253
57183d23253l567l437k754j717q07o8P87J766K631L324L809L791L083K056J124
$$ -423253 -426820 -430257 -433011 -434728 -435535 -435603 -434816 -433050 -430419 -427095 -423286 -419495 -416412 -414356 -413232
57168d13232J13j268k726l791m574n362n817n407m354l333k438j258K22J696L216
$$ -413232 -413119 -414387 -417113 -420904 -425478 -430840 -436657 -442064 -446418 -449751 -452189 -453447 -453225 -451529 -448313
57153d48313M966O510P236P363P592P926P785P155O582O101N248M066L154K587
$$ -448313 -443347 -436837 -429601 -422238 -414646 -406720 -398935 -391780 -385198 -379097 -373849 -369783 -366629 -364042
57139c64042J857Q46o6q53j850k874l449l838m777o190p270p914q862j0287j1435
$$ -364042 -362185 -361339 -361405 -362258 -364108 -366982 -370431 -374269 -379046 -385236 -392506 -400420 -409282 -419569 -431004
57124d31004j1947j2321j2825j3060j2972j3213j4162j5459j6777j8088j9047
$$ -431004 -442951 -455272 -468097 -481157 -494129 -507342 -521504 -536963 -553740 -571828 -590875
57113e90875j9207j8995j9408k0545k1560k2181k3029k4279k5346k6199k7613
$$ -590875 -610082 -629077 -648485 -669030 -690590 -712771 -735800 -760079 -785425 -811624 -839237
57102h39237k9732l1745l3322l5131l7538m0121m2831m6216n0030n3067n4889
$$ -839237 -868969 -900714 -934036 -969167 -1006705 -1046826 -1089657 -1135873 -1185903 -1238970 -1293859
57091a293859n6380n8136n9692o0810o2138o4080o6452o9674p4822q1931q9797
$$ -1293859 -1350239 -1408375 -1468067 -1528877 -1591015 -1655095 -1721547 -1791221 -1866043 -1947974 -2037771
57080b037771r7870j06812j16736j26670j36387j46871j58414j70037j81494j93933
$$ -2037771 -2135641 -2242453 -2359189 -2485859 -2622246 -2769117 -2927531 -3097568 -3279062 -3472995
57070c472995k07900k22685k38443k56879k78961l03958l31595l62929l98275
$$ -3472995 -3680895 -3903580 -4142023 -4398902 -4677863 -4981821 -5313416 -5676345 -6074620
57061f074620m36572m77825n23830n75617o32714o96001p68449q51941r46241
$$ -6074620 -6511192 -6989017 -7512847 -8088464 -8721178 -9417179 -10185628 -11037569 -11983810
57052a1983810j052367j173852j313406j471896j652360j861630k106137k389799
$$ -11983810 -13036177 -14210029 -15523435 -16995331 -18647691 -20509321 -22615458 -25005257
57044b5005257k717750l098089l538035m042970m621802n288545o056082o933529
$$ -25005257 -27723007 -30821096 -34359131 -38402101 -43023903 -48312448 -54368530 -61302059
57036f1302059p932047r065980j0343365j1759830j3303397j4956257j6688742
$$ -61302059 -69234106 -78300086 -88643451 -100403281 -113706678 -128662935 -145351677
57029a45351677j8461808k0234600k1944375k3466459k4628491k5306978k5492693
$$ -145351677 -163813485 -184048085 -205992460 -229458919 -254087410 -279394388 -304887081
57022c04887081k5194349k4249125k2280530j8922317j4129388q289973k056886
$$ -304887081 -330081430 -354330555 -376611085 -395533402 -409662790 -417952763 -420009649
57015d20009649L934293R257359J3732492J7358257K0211097K2366727K3871516
$$ -420009649 -416075356 -406817997 -393085505 -375727248 -355516151 -333149424 -309277908
57008c09277908K4754245K5045029K4784016K4027986K2858062K1376082J9687037
$$ -309277908 -284523663 -259478634 -234694618 -210666632 -187808570 -166432488 -146745451
57001a46745451J7884261J6047465J4244141J2526172J0928364R473558Q176427
$$ -146745451 -128861190 -112813725 -98569584 -86043412 -75115048 -65641490 -57465063
56994e7465063P040892O058980N216611M499229L891534L376694K939544K568774
$$ -57465063 -50424171 -44365191 -39148580 -34649351 -30757817 -27381123 -24441579 -21872805
56986b1872805K254420J985999J755061J556832J387320J241040J113231J001757
$$ -21872805 -19618385 -17632386 -15877325 -14320493 -12933173 -11692133 -10578902 -9577145
56978i577145R04904Q19586P43361O75981O17042N64128N15068M70082M29898
$$ -9577145 -8672241 -7852655 -7109294 -6433313 -5816271 -5252143 -4737075 -4266993 -3837095
56969c837095L93556L59816L29028L01864K77621K55359K35244K17349K00547
$$ -3837095 -3443539 -3083723 -2754695 -2452831 -2175210 -1919851 -1684607 -1467258 -1266711
56960a266711J84052J68685J55250J42965J30861J19362J09133R9663f6459A4980
$$ -1266711 -1082659 -913974 -758724 -615759 -484898 -365536 -256403 -156740 -66459 14980
56949H8648O6327N8695N1054M3629L5617K6382J6424O105n318j8244l1603m4239
$$ 88648 154975 213670 264724 308353 343970 370352 386776 392881 387563 369319 337716 293477
56937B93477n5985o5938p1338C0116c3581n5788m8651m2494l7182l2861k9182
$$ 293477 237492 171554 100216 30116 -33581 -89369 -138020 -180514 -217696 -250557 -279739
56926b79739k5516k1957j9031j6688j4546j2737j1537j0607r462q293p469o688
$$ -279739 -305255 -327212 -346243 -362931 -377477 -390214 -401751 -412358 -421820 -430113 -437582 -444270
56914d44270n501m146l021j841j37J892L792N587P381Q803R648J0418J1482J2351
$$ -444270 -449771 -453917 -456938 -458779 -458916 -457024 -453232 -447645 -440264 -431461 -421813 -411395 -399913 -387562
56900c87562J2584J2651J3104J3586J3539J3240J3177J3048J2371J1424J0690
$$ -387562 -374978 -362327 -349223 -335637 -322098 -308858 -295681 -282633 -270262 -258838 -248148
56889b48148R924Q819P910P761P847P342O563O386O772O969O897P115P649P942
$$ -248148 -238224 -229405 -221495 -213734 -205887 -198545 -191982 -185596 -178824 -171855 -164958 -157843 -150194 -142252
56875a42252P896P950Q242Q588R047R671R877R075P683O644O039N206M020L160
$$ -142252 -134356 -126406 -118164 -109576 -100529 -90858 -80981 -71906 -64223 -57579 -51540 -46334 -42314 -39154
56861c9154L039L342L659L837L727L281K929L157L768M105c92C053K855K233J913
$$ -39154 -36115 -32773 -29114 -25277 -21550 -18269 -15340 -12183 -8415 -4310 -392 3053 5908 8141 10054
56846A0054K127K513K533K261K089J958J592J220J293J714K036K242K626L072
$$ 10054 12181 14694 17227 19488 21577 23535 25127 26347 27640 29354 31390 33632 36258 39330
56832C9330L209L101L067K985K519J867J489J265O82k67j112j754k455l057l008
$$ 39330 42539 45640 48707 51692 54211 56078 57567 58832 59514 59247 58135 56381 53926 50869 47861
56817D7861k209j146j62P83J694K535L524M781N826O170O245O908Q135R069R396
$$ 47861 45652 44506 44344 45127 46821 49356 52880 57661 63487 69657 75902 82810 90945 100014 109410
56802A09410R756J0654J1772J2502J2444J1251Q714N368K347L73p14j356j716
$$ 109410 119166 129820 141592 154094 166538 177789 186503 191871 194218 194591 193877 192521 190805
56789A90805j813j676j219l85N64J333K059L034M100M966N865P290R132J0879
$$ 190805 188992 187316 186097 185712 186276 187609 189668 192702 196802 201768 207633 214923 224055 234934
56775B34934J2524J4378J5979J6082J3955J0002N043k30m949q166r724j0369j0700
$$ 234934 247458 261836 277815 293897 307852 317854 322897 322667 317718 309552 299828 289459 278759
56762B78759j0545r665q381p134n932m596l132j607m1J407K592L804N493P442
$$ 278759 268214 258549 250168 243034 237102 232506 229374 227767 227726 229133 231725 235529 241022 248464
56748B48464Q845R292R068Q266O415L320k90l438n796p509q635r128r134q872
$$ 248464 257309 266601 275669 283935 290350 293670 293380 289942 284146 276637 268002 258874 249740 240868
56734B40868q420p778o949n880m592l358k406j550m60P22J663K497L570M540M547
$$ 240868 232448 224670 217721 211841 207249 203891 201485 199935 199475 200197 201860 204357 207927 212467 217014
56719B17014L432J983P33o67k564m485n757o303o420o236n827n400m992m409l709
$$ 217014 220446 222429 223162 222495 219931 215446 209689 203386 196966 190730 184903 179503 174511 170102 166393
56704A66393l295l234l069k572k102j894j588r18k81q6p6J73N05N35L63L28L68
$$ 166393 163098 159864 156795 154223 152121 150227 148639 147721 147440 147354 147278 147451 147956 148491 148854 149182 149550
56687A49550J89j35k40k4K53L36J30l08p24q50p65q25j049j039o89m75p04j039
$$ 149550 149739 149604 149364 149340 149593 149929 150059 149751 149027 148177 147412 146587 145538 144499 143810 143335 142631 141592
56669A41592j103j067j179j184p90k91j69l71m92m52m58m96m23l55n07p80r03
$$ 141592 140489 139422 138243 137059 136269 135978 135809 135438 134946 134494 134036 133540 133117 132762 132255 131475 130572
56652A30572q78q64q40o94n05l93k69p0Jj76l45k55j06k06m46m83k65K6L37O68
$$ 130572 129694 128830 127990 127296 126791 126398 126129 126059 126060 125884 125539 125284 125178 124972 124526 124043 123778 123804 124141 124809
56632A24809Q22O58M27M20N10L80K7l25o48r94j177r85o09m29m65m51l27k68l00
$$ 124809 125631 126289 126716 127136 127646 128026 128053 127728 127080 126086 124909 123924 123315 122886 122421 121970 121643 121375 121075
56613A21075k74j24O2K50M04L81J21j99m09n73p61q47p93q69j273j739j917j881
$$ 121075 120801 120677 120739 120989 121393 121774 121895 121696 121287 120714 119953 119106 118313 117444 116171 114432 112515 110634
56595A10634j913j976j813j380q37l06P6R9j75k59J54P18R54R63J118J344J257
$$ 110634 108721 106745 104932 103552 102715 102409 102485 102584 102409 102150 102304 103022 103976 104939 106057 107401 108658
56578A08658Q77O00N55N28M96O55R74J165J165J153J149R73O38L70K47J69J63
$$ 108658 109535 110135 110690 111218 111714 112369 113343 114508 115673 116826 117975 118948 119586 119956 120203 120372 120535
56561A20535L37N82O97P28Q16Q51O41L81M43P71R24P29M45K92K16J92L25N95Q11
$$ 120535 120872 121454 122151 122879 123695 124546 125187 125568 126011 126782 127706 128435 128880 129172 129388 129580 129905 130500 131311
56542A31311Q66P79N07M5l44l90k25k08l84m85m27l54k97q9K65N46O64O97O47
$$ 131311 132177 132956 133463 133508 133164 132774 132549 132341 131957 131472 131045 130691 130394 130305 130570 131116 131780 132477 133124
56523A33124M41K07J72L35M70M79M20L24K14K53N35Q34Q80P45O63O19N33N85R38
$$ 133124 133565 133772 133944 134279 134749 135228 135648 135972 136186 136439 136974 137808 138688 139433 140096 140715 141248 141833 142771
56504A42771J334J435J409J636J979J967J602J351J393J415J266J188J350J583
$$ 142771 144105 145540 146949 148585 150564 152531 154133 155484 156877 158292 159558 160746 162096 163679
56490A63679J699J652J408J040Q90J144J358R29j6p42r17q85r70j072j084j114
$$ 163679 165378 167030 168438 169478 170368 171512 172870 173799 173783 173041 172124 171239 170269 169197 168113 166999
56474A66999j207j280j405j636j666j234p36q15j318j436r52n26o06q32q09p39
$$ 166999 165792 164512 163107 161471 159805 158571 157835 157020 155702 154266 153314 152788 152182 151350 150541 149802
56458A49802r06j175j340j450j475j189o79m70p74j174j304j333j476j504j148
$$ 149802 148896 147721 146381 144931 143456 142267 141588 141118 140344 139170 137866 136533 135057 133553 132405
56443A32405n72j04J52J74o9l60l36l6P6j66l79k90j34j12k1L29P85J193J609
$$ 132405 131833 131729 131881 132055 131986 131626 131290 131254 131330 131164 130785 130495 130361 130249 130228 130557 131342 132535 134144
56424A34144J913J779J218P07N06M06L63O93J359J738J488J053R27R42P45M26
$$ 134144 136057 137836 139054 139761 140267 140673 141036 141729 143088 144826 146314 147367 148294 149236 149981 150407
56408A50407K37J82K93P80J512J911J690J266J030Q32N33M50P64J084J105J093
$$ 150407 150644 150826 151119 151899 153411 155322 157012 158278 159308 160140 160673 161123 161887 162971 164076 165169
56392A65169J223J098M88p1p1J72J60M2J50K55P7k1L72Q38O98Q6l30m18n08o04
$$ 165169 166392 167490 167978 167907 167836 168008 168168 168210 168360 168615 168692 168671 169043 169881 170579 170665 170335 169917 169409 168805
56372A68805m27j13r0l73o49q47j068j169r99q65j078j351j259j000j031j225
$$ 168805 168378 168265 168175 167802 167153 166306 165238 164069 163070 162205 161127 159776 158517 157517 156486 155261
56356A55261j124p97o92p84o64k99k1J15K87L31l5n51o20j75K96M92M84L07J2
$$ 155261 154137 153340 152648 151864 151200 150901 150880 150995 151282 151613 151578 151027 150407 150232 150528 151020 151504 151811 151823
56337A51823q5K04M72L10J09M76J113J141M63j12j17Q5J29J32J66L4k11j97J38
$$ 151823 151738 151942 152414 152724 152833 153309 154422 155563 156026 155914 155797 155882 156011 156143 156309 156343 156132 155935 156073
56318A56073L89L25J58Q6P6J89N24Q32P38L69K35M08N12M59N90R55J131Q94N23
$$ 156073 156462 156787 156945 157031 157107 157296 157820 158652 159390 159759 159994 160402 160914 161373 161963 162918 164049 164943 165466
56299A65466K64P1m6N3K51K27L8R6M81P60O43L58K42L82P36J165J365J142P82
$$ 165466 165730 165801 165755 165808 166059 166286 166324 166420 166901 167661 168304 168662 168904 169286 170022 171187 172552 173694 174476
56280A74476P31R52J068J033J131J394J554J560J630J793J882J922K050K134K020
$$ 174476 175207 176159 177227 178260 179391 180785 182339 183899 185529 187322 189204 191126 193176 195310 197330
56265A97330J969K325K898L247L426L783M208M264L958L653L373K955K676K921
$$ 197330 199299 201624 204522 207769 211195 214978 219186 223450 227408 231061 234434 237389 240065 242986
56251B42986L360L293K782K532K709K714K213J481P89K32J45Q10J687J919J537
$$ 242986 246346 249639 252421 254953 257662 260376 262589 264070 264859 265091 265236 266046 267733 269652 271189
56236B71189J262J252J057Q19J237K240K959L206L708M584M929M432M076M608
$$ 271189 272451 273703 274760 275579 276816 279056 282015 285221 288929 293513 298442 302874 306950 311558
56222C11558N472O022O661P918R320J0097J0326J0584J1044J1684J2719J4192
$$ 311558 317030 323052 329713 337631 346951 357048 367374 377958 389002 400686 413405 427597
56210D27597J5601J6596J7560J8956K0618K2198K3760K5467K7237K9146L1570
$$ 427597 443198 459794 477354 496310 516928 539126 562886 588353 615590 644736 676306
56199F76306L4514L7362L9760M2080M4658M7155M9189N0910N2472N3498N3620
$$ 676306 710820 748182 787942 830022 874680 921835 971024 1021934 1074406 1127904 1181524
56188A181524N2927N1530M9144M5560M0944L5401K8854K1685J4702Q163J576n187
$$ 1181524 1234451 1285981 1335125 1380685 1421629 1457030 1485884 1507569 1522271 1530434 1532010 1526823
56176A526823j1364j6305k0171k3258k5490k7071k8668l0424l1647l2014l2219
$$ 1526823 1515459 1499154 1478983 1455725 1430235 1403164 1374496 1344072 1312425 1280411 1248192
56165A248192l2846l3501l3765l4061l4808l5572l5823l5827l6042l6309l6328
$$ 1248192 1215346 1181845 1148080 1114019 1079211 1043639 1007816 971989 935947 899638 863310
56154H63310l6181l5806l4690l2770l0839k9348k7738k5544k3301k1566k0042
$$ 863310 827129 791323 756633 723863 693024 663676 635938 610394 587093 565527 545485
56143E45485j8427j7176j6487j5533j3720j1843j0843j0342r470q382p707p225
$$ 545485 527058 509882 493395 477862 464142 452299 441456 431114 421644 413262 405555 398330
56131C98330o369n424n002m818m183l261k692k397j867j242r90r31n72q2R0K24
$$ 398330 391961 386537 381535 376717 372534 369273 366581 364184 362317 361075 360085 359154 358582 358500 358590 358814
56115C58814Q91J868K488K705K934L181L253L385L789M011L641L211L412L944
$$ 358814 359705 361573 364061 366766 369700 372881 376134 379519 383308 387319 390960 394171 397583 401527
56101D01527M038L705L468L323K940K459K223K115K022K383L398M346M639M877
$$ 401527 405565 409270 412738 416061 419001 421460 423683 425798 427820 430203 433601 437947 442586 447463
56087D47463N889P377Q597R675J1072J2492J3547J4901J7466K0898K4242K7423
$$ 447463 453352 460729 469326 479001 490073 502565 516112 531013 548479 569377 593619 621042
56075F21042L0915L4469L7486M0149M2786M4578M4324M2131L9046L5479L1332
$$ 621042 651957 686426 723912 764061 806847 851425 895749 937880 976926 1012405 1043737
56064A043737K7291K4374K2475K0551J8030J4835J0519M853j058n651q711j1123
$$ 1043737 1071028 1095402 1117877 1138428 1156458 1171293 1181812 1186665 1185607 1179956 1171245 1160122
56052A160122j3304j5236j7583k1199k5710k9971l3587l6729l8812l8896l7171
$$ 1160122 1146818 1131582 1113999 1092800 1067090 1037119 1003532 966803 927991 889095 851924
56041H51924l4743l2159k9358k6596k4163k1573j8460j5662j4082j3126j1678
$$ 851924 817181 785022 755664 729068 704905 683332 664872 649210 635128 622002 610324
56030F10324j0001r015q458p503o512o255o105m914l206k378k264j577l82J28
$$ 610324 600323 591308 582850 575347 568835 562580 556475 551561 548355 545977 543713 542136 541754 541882
56016E41882lM15J395J776J461J568K327K897L166L753M320L995L335L735N016
$$ 541882 541879 542294 543689 545465 546926 548494 550821 553718 556884 560637 564957 568952 572287 576022 581038
56001E81038N721N661N977O794P139P094P693Q739R069Q916R584J0819J1066J0350
$$ 581038 586759 592420 598397 605191 612330 619424 627117 635856 644925 653841 663425 674244 685310 695660
55987F95660J0308J1244J1769J1562J1879J2993J3737J3868J4418J5450J5955
$$ 695660 705968 717212 728981 740543 752422 765415 779152 793020 807438 822888 838843
55976H38843J6153J7296J9051J9792J9645K0381K2186K3441K3936K5255K7581
$$ 838843 854996 872292 891343 911135 930780 951161 973347 996788 1020724 1045979 1073560
55965A073560K9257K9932L1092L3011L4314L5011L6840M0027M2892M5104M8128
$$ 1073560 1102817 1132749 1163841 1196852 1231166 1266177 1303017 1343044 1385936 1431040 1479168
55954A479168N2023N5249N8005O2176O7532P1733P4567P8331Q3435Q7737R0890
$$ 1479168 1531191 1586440 1644445 1706621 1774153 1845886 1920453 1998784 2082219 2169956 2260846
55943B260846R5068J00597J05152J08365J12822J19477J26499J33661J43183J55073
$$ 2260846 2355914 2456511 2561663 2670028 2782850 2902327 3028826 3162487 3305670 3460743
55933C460743J66476J76813J88671K02337K14615K24471K34571K45899K56430
$$ 3460743 3627219 3804032 3992703 4195040 4409655 4634126 4868697 5114596 5371026
55924E371026K66543K79857K96979L14584L32380L54559L82378M11959M41265
$$ 5371026 5637569 5917426 6214405 6528989 6861369 7215928 7598306 8010265 8451530
55915H451530M72240N04327N33977N62904N98535O43719O94749P52011Q22583
$$ 8451530 8923770 9428097 9962074 10524978 11123513 11767232 12461981 13213992 14036575
55906A4036575R09308J008093J119629J252310J409646J587397J787219K018706
$$ 14036575 14945883 15953976 17073605 18325915 19735561 21322958 23110177 25128883
55898B5128883K283240K572826K891517L259966L692800M194061M781183N481683
$$ 25128883 27412123 29984949 32876466 36136432 39829232 44023293 48804476 54286159
55890E4286159O292368P176334Q103874R007005R611279R382236P819708M913402
$$ 54286159 60578527 67754861 75858735 84865740 94477019 103859255 111678963 116592365
55882A16592365J276654k224100m977541o816822p858006q285829q273016p972425
$$ 116592365 117869019 115644919 110667378 103850556 95992550 87706721 79433705 71461280
55874G1461280p497426o913614o266968n605284m965685m364135l810169l316927
$$ 71461280 63963854 57050240 50783272 45177988 40212303 35848168 32037999 28721072
55866B8721072k888721k514486k183357j895589j652116j445693j269306j122680
$$ 28721072 25832351 23317865 21134508 19238919 17586803 16141110 14871804 13749124
55858A3749124j003823r03596q14680p37613o72871o15239n60959n12605m71853
$$ 13749124 12745301 11841705 11027025 10289412 9616541 9001302 8440343 7927738 7455885
55849G455885m34497l97361l63311l34915l09414k84382k62400k45689k31619
$$ 7455885 7021388 6624027 6260716 5925801 5616387 5332005 5069605 4823916 4592297
55840D592297k17621k05420j96489j88204j78424j69230j62391j55513j46344
$$ 4592297 4374676 4169256 3972767 3784563 3606139 3436909 3274518 3119005 2972661
55831B972661j36734j28830j21323j12859j05346j00462r6298r0774q5077q0781
$$ 2972661 2835927 2707097 2585774 2472915 2367569 2267107 2170809 2080035 1994958 1914177
55821A914177p6750p1856o7654o5411o3463o0234n7012n5079n2994m9436m5977
$$ 1914177 1837427 1765571 1697917 1632506 1569043 1508809 1451797 1396718 1343724 1294288 1248311
55810A248311m4333m3403m1680m0100l9917m0067l9164l7950l7391l6497l4316
$$ 1248311 1203978 1160575 1118895 1078795 1038878 998811 959647 921697 884306 847809 813493
55799H13493l1958l0464k8677k5424k1790j9211j7264j5312j4319j4963j5928
$$ 813493 781535 751071 722394 696970 675180 655969 638705 623393 609074 594111 578183
55788E78183j6002j5983j6688j7057j6100j4763j3968j2811j0617q715q208p913
$$ 578183 562181 546198 529510 512453 496353 481590 467622 454811 444194 435479 427271 419358
55776D19358o606n363n559o384o492o406p127p936p747p203p321p534p014o535
$$ 419358 412752 407389 401830 395446 388954 382548 375421 367485 359738 352535 345214 337680 330666 324131
55762C24131p009p625p380p049p578p999p088n745n473n706m926l422k647k633
$$ 324131 317122 309497 302117 295068 287490 279491 272403 266658 261185 255479 250553 247131 244484 241851
55748B41851k217j268o32m17j17O9l00o84l58J69J9m87o17q01j802l057l433l111
$$ 241851 239634 238366 237734 237317 237200 237269 236969 236285 235927 236096 236115 235628 235011 234210 232408 229351 225918 222807
55730B22807l112l528l672l561l791m320m626m618m414l734k565j735j791k063
$$ 222807 219695 216167 212495 208934 205143 200823 196197 191579 187165 183431 180866 179131 177340 175277
55716A75277j880j768k347k992k922k663l053l669l613l103k873k753k214j628
$$ 175277 173397 171629 169282 166290 163368 160705 157652 153983 150370 147267 144394 141641 139427 137799
55702A37799j588j673j268q91j324k089k229j943k038k354k184j709j575j534
$$ 137799 136211 134538 133270 132379 131055 128966 126737 124794 122756 120402 118218 116509 114934 113400
55688A13400r51k25k88j044j624j818k017k101j674j086j011j352j561j703k035
$$ 113400 112449 112224 111936 110892 109268 107450 105433 103332 101658 100572 99561 98209 96648 94945 92910
55673I2910k105j409m68j53l26l48l07o17r32o97k93m18q04q00o73j039j509j300
$$ 92910 90805 89396 88928 88775 88449 88101 87794 87177 86245 85548 85255 84837 84033 83233 82560 81521 80012 78712
55655G8712o86n25p05m89k2q6n75o24q1M40P91J338J942K099J932J895J734R59
$$ 78712 78026 77501 76796 76307 76285 76199 75624 75000 74919 75359 76150 77488 79430 81529 83461 85356 87090 88049
55637H8049L3j26L80O68N96P54J186J348J245J372J618J428R47Q06R02N90k5j96
$$ 88049 88082 87956 88336 89004 89600 90354 91540 92888 94133 95505 97123 98551 99498 100304 101206 101796 101771 101575
55619A01575J21K30p0l01l32m35m69q5L41J20m75n54q6J29j16k51j19j02j06L05
$$ 101575 101696 101926 101856 101555 101223 100788 100319 100234 100575 100695 100220 99666 99580 99709 99593 99342 99223 99121 99015 99320
55599I9320Q00O34P1J34Q24J024M25P2N70J104Q11lo74j164j657j953j892j726
$$ 99320 100120 100754 100825 100959 101783 102807 103232 103304 103874 104978 105789 105786 105112 103948 102291 100338 98446 96720
55581I6720j662j635j708k107k650k876k787k808k941k801k472k453k680k511
$$ 96720 95058 93423 91715 89608 86958 84082 81295 78487 75546 72745 70273 67820 65140 62629
55567F2629j860j391j422j480j235r89r81r89q68p84p37n12k75m45q63q85l75
$$ 62629 60769 59378 57956 56476 55241 54252 53271 52282 51414 50630 49893 49381 49106 48661 47798 46913 46538
55550D6538J07K49L00L14Jn10n98j03L64L68J58M2o7k34k97k38k14j09L29Q72
$$ 46538 46645 46894 47194 47508 47509 46999 46401 46298 46662 47030 47188 47230 47163 46929 46632 46394 46180 46071 46400 47272
55530D7272R93O91M77N62P12Q56J041R41K31o26q47n23l76m85k47L48O17M68O26
$$ 47272 48265 48956 49433 49995 50707 51563 52604 53545 53776 53150 52303 51780 51404 50919 50672 51020 51637 52105 52731
55511E2731J350J998K134K090K089J875J527J594K045K091J464Q94Q52Q06K44
$$ 52731 54081 56079 58213 60303 62392 64267 65794 67388 69433 71524 72988 73882 74734 75540 75784
55496G5784m59q33j103j616k148k330k194j859j339r36j151j799k008j455p86
$$ 75784 75325 74492 73389 71773 69625 67295 65101 63242 61903 60967 59816 58017 56009 54554 53768
55481E3768n00k32L43P94O97L85L27L95L06K15L14M04L62M97R40J280J195Q92
$$ 53768 53268 53036 53379 54173 54870 55255 55582 55977 56283 56498 56812 57216 57578 58075 59015 60295 61490 62382
55463F2382N86J41l67m39M0M14J54m18p69r27j134j320j402j580j885j978j762
$$ 62382 62968 63109 62742 62303 62343 62757 62911 62493 61724 60797 59663 58343 56941 55361 53476 51498 49736
55446D9736j647j789j729j175n60l27l28l52o13j158j459j181p84q03j025r85
$$ 49736 48089 46300 44571 43396 42836 42509 42181 41829 41216 40058 38599 37418 36634 35831 34806 33821
55430C3821p46o13n38l93m08p34r82p87m25l54n00n08l92l82m56m33l23j61J34
$$ 33821 33075 32462 31924 31531 31123 30389 29407 28620 28195 27841 27341 26833 26441 26059 25603 25170 24847 24686 24820
55411B4820M63M54L0l30k33Q9J88l0m25q64j060o85P9N51M29J39L5p4l32m39k96
$$ 24820 25283 25737 25767 25437 25204 25293 25481 25451 25026 24162 23102 22417 22496 23047 23476 23615 23650 23576 23244 22805 22509
55390B2509l40p43r23m56J46K27p1k20k01k50k31J10N38O39M72L39K35J9j64j37
$$ 22509 22169 21426 20503 20047 20193 20420 20349 20129 19928 19678 19447 19557 20095 20734 21206 21545 21780 21799 21635 21498
55370B1498n5p9j2L20O62P00N21L01k1m16n46k86JJ11L48Q31J045O55J83K25N15
$$ 21498 21443 21364 21352 21672 22334 23034 23555 23856 23835 23419 22873 22587 22588 22699 23047 23878 24923 25578 25761 25986 26501
55349B6501M56J02p7m5j00k23j92p3m0L3K80M18J46l18n87o47o19l92kP7l95q87
$$ 26501 26957 27059 26982 26937 26837 26614 26422 26349 26309 26342 26622 27040 27186 26868 26281 25634 25015 24623 24621 24698 24303 23416
55327B3416q32m35k28j80L1L13L80L74N66P47N74K05j0j56m24n50k31K33L73L19
$$ 23416 22584 22149 21921 21741 21772 22085 22465 22839 23405 24152 24726 24931 24921 24765 24341 23791 23560 23793 24166 24485
55307B4485M15M40j1o78r69q65p58o62l31J4l7k94k24J39L07J95J08K3l04o44
$$ 24485 24900 25340 25329 24651 23682 22817 22059 21397 21066 21080 21043 20749 20525 20664 20971 21166 21274 21297 20993 20349
55287B0349n42j88j78m92n29j83k2k58m02j46J53J46K1R3L26N43O28M72L4m24
$$ 20349 19807 19619 19441 18949 18420 18237 18215 17957 17555 17409 17562 17708 17729 17822 18148 18691 19319 19791 19825 19401
55267A9401n69m63m23m98m86l81l42l15j59j4o0q0J99M88K82k35l92j6L67L89
$$ 19401 18832 18369 17946 17448 16962 16581 16239 15924 15765 15751 15691 15611 15810 16298 16580 16345 15953 15937 16304 16693
55247A6693K41J42O8O9K58M17J55l95o23k87J72K96J38j9m7P5K75L42J14k00k45
$$ 16693 16934 17076 17144 17213 17471 17888 18043 17648 17025 16738 16910 17206 17344 17325 17278 17353 17628 17970 18084 17884 17639
55226A7639j8J93K59K49J63j9j09K6J60J10J68O51J218J267P95K77j13m86o58
$$ 17639 17621 17814 18073 18322 18485 18466 18357 18383 18543 18653 18821 19472 20690 21957 22752 23029 22916 22430 21772
55207B1772l73N2N7k04j11K99L12k28o10l53J37L39K76J29j61n36o54l97r3J6
$$ 21772 21399 21451 21508 21304 21193 21492 21804 21576 20966 20613 20750 21089 21365 21494 21333 20797 20143 19746 19653 19669
55187A9669O8J43Q6o3QK93L64O3j98p7K06L12K60K04J38M5rq6l06m49j31N27Q67
$$ 19669 19737 19880 19966 19903 19911 20204 20568 20631 20433 20356 20562 20874 21134 21338 21476 21521 21512 21426 21120 20671 20540 21067 21934
55164B1934N76N7j86j56j09j55k82m34l92%M85O44N35N85Q02P55L92K25M58O49
$$ 21934 22510 22567 22381 22225 22116 21961 21679 21245 20853 20853 21338 21982 22517 23102 23904 24659 25051 25276 25734 26383
55144B6383M57J59O3K5j34k34j46j22l41n40m81l33k99k59o2J87L82N89O85L36
$$ 26383 26840 26999 27062 27087 26953 26719 26573 26451 26110 25570 25089 24756 24457 24198 24136 24323 24705 25294 25979 26315
55124B6315l97q61o30j10P5j11k62k25j51j55k04k59k36j6K70K96l0m09n72n75
$$ 26315 25918 25057 24427 24317 24392 24281 24019 23794 23643 23488 23284 23025 22789 22773 23043 23339 23309 22900 22328 21753
55104B1753n34m49l97m90n08n1P46J125O42k56q69j006q65n50j49J20J80K75N21
$$ 21753 21219 20770 20373 19883 19375 19324 20070 21195 21837 21581 20712 19706 18841 18291 18142 18262 18442 18717 19238
55085A9238O41M19R6L5K17L82L76J46k77o12m94l3K03Oj45J35N03M48N9k31k85
$$ 19238 19879 20298 20394 20429 20646 21028 21404 21550 21273 20661 20167 20134 20337 20343 20198 20333 20836 21284 21343 21112 20827
55064B0827k25qL98O99N86K19L6J83M80P32Q01N79K19J24M30O88M21j99n70m02
$$ 20827 20602 20594 20992 21691 22277 22496 22532 22715 23195 23927 24728 25307 25526 25650 26080 26768 27189 26990 26420 26018
55044B6018Q8N32P12N66K31l6j07j00j10j18j34k30k41J27P57J057O97O5l01l48
$$ 26018 26106 26638 27350 27916 28147 28111 28004 27904 27794 27676 27542 27312 27071 27198 27955 29012 29709 29774 29473 29125
55024B9125k52J2M71Q31P82M27J14rK2J87L63K99qk06j16k5j47j96Q9M08L65J44
$$ 29125 28873 28885 29356 30187 30969 31396 31510 31501 31523 31710 32073 32372 32364 32158 32042 32017 31870 31674 31763 32171 32536 32680
55002C2680J75L76K99p9k80l9L69N45L57n7m04m06j01J15n5l89m56j71J67L09
$$ 32680 32855 33231 33530 33451 33171 33132 33501 34046 34403 34346 33942 33536 33435 33550 33495 33106 32650 32479 32646 32955
54982C2955K11n0l18l52q2K84N11N62M63J84j65l02j35Q0Q5r0l46o47q13n42Q3
$$ 32955 33166 33116 32798 32446 32364 32648 33159 33721 34184 34368 34203 33901 33766 33846 33931 33841 33495 32848 32035 31493 31576
54961C1576N28M70J89L6j3pK17N82O10J68j53R0M58L63M5J6R0k19o84o36j15J60
$$ 31576 32104 32574 32763 32799 32786 32779 32996 33578 34188 34356 34203 34293 34751 35114 35159 35175 35265 35046 34362 33726 33611 33771
54939C3771m5k19k9K42L45M39O42P53O46M26J09l89q32p80k11L87O83P71P40M74
$$ 33771 33726 33507 33478 33720 34065 34504 35146 35899 36545 36971 37080 36691 35859 35079 34868 35255 35938 36709 37449 37923
54919C7923M2j79k5K03J98K5j15j44l6K37N52P16P43P88Q00O03L42M16Q64J286
$$ 37923 37965 37786 37761 37964 38162 38187 38072 37928 37892 38129 38681 39397 40140 40928 41728 42331 42673 43089 43953 45239
54899D5239J428J469J536J494J312J316J700K177K434K592K922L347L557L526
$$ 45239 46667 48136 49672 51166 52478 53794 55494 57671 60105 62697 65619 68966 72523 76049
54885G6049L522L671L780L582K996K103J059O7o92j203j707k479l470m177m116
$$ 76049 79571 83242 87022 90604 93600 95703 96762 96829 96137 94934 93227 90748 87278 83101 78985
54870G8985l424k791k679k861k873k661k480k368k099j630j205j005r11p19l83
$$ 78985 75561 72770 70091 67230 64357 61696 59216 56848 54749 53119 51914 50909 49998 49279 48896
54855D8896l0J84K36K98N91J088J517J729J895K167K432K590K850L361L821L789
$$ 48896 48866 49050 49286 49584 50175 51263 52780 54509 56404 58571 61003 63593 66443 69804 73625 77414
54839G7414L278K688K221J704R78Q5q89j895k787l356l543l474l304l180l178
$$ 77414 80692 83380 85601 87305 88283 88368 87479 85584 82797 79441 75898 72424 69120 65940 62762
54824F2762l227l155k966k810k641k211j589j243j307j237o33K0L0m22n54j41
$$ 62762 59535 56380 53414 50604 47963 45752 44163 42920 41613 40376 39743 39763 39793 39371 38817 38676
54808C8676K67K46p9m79q81j125r78n59k33r6L5R8j67n96o42j81K12M9m03n36
$$ 38676 38943 39189 39110 38631 37750 36625 35647 35088 34855 34759 34794 34892 34725 34129 33487 33306 33518 33567 33164 32628
54788C2628j51M07O77M77J2l33m24n06p31q42n83j96m1K6L45O86M85k36q15q85
$$ 32628 32477 32884 33561 34038 34050 33717 33293 32787 32056 31214 30631 30435 30394 30420 30765 31451 31936 31700 30885 30000
54768C0000o74l45K43R21J127P51M50P29J213J256Q24L94K48L27M69N28M13K26
$$ 30000 29326 28981 29224 30145 31272 32023 32473 33202 34415 35671 36495 36889 37137 37464 37933 38461 38874 39100
54750C9100J68K38K61L06O58J274J682J607J281J007Q46R03J414K311L090L444
$$ 39100 39268 39506 39767 40073 40731 42005 43687 45294 46575 47582 48428 49331 50745 53056 56146 59590
54734E9590L619L886M082M007L847L849L870L659L296K954K488J627M19p55j586
$$ 59590 63209 67095 71177 75184 79031 82880 86750 90409 93705 96659 99147 100774 101193 100438 98852
54719I8852k041k324k674l081l211k849k376k334k554k342j592j001r68r56m34
$$ 98852 96811 94487 91813 88732 85521 82672 80296 77962 75408 73066 71474 70473 69505 68549 68115
54704F8115K67N69N84P64J056J098R98J195J688K036K095K198K609L246L936M582
$$ 68115 68382 68951 69535 70299 71355 72453 73451 74646 76334 78370 80465 82663 85272 88518 92454 97036
54688I7036N084N383N570N688N527M874L798K451Q57q85k390l416m188m982n611
$$ 97036 102120 107503 113073 118761 124288 129162 132960 135411 136268 135383 132993 129577 125389 120407 114796
54673A14796n764n590n443n261m785m197l944l959l697k996k363k218k364k367
$$ 114796 109032 103442 97999 92738 87953 83756 79812 75853 72156 69160 66797 64579 62215 59848
54659E9848k084j632j152p80o07n46m48l30l19l39k36j55l97q46r60n09R3L22
$$ 59848 57764 56132 54980 54200 53593 53047 52599 52269 51950 51611 51375 51220 50823 49977 49017 48508 48601 48923
54641D8923J57r2k55l43l23j64K2Q6L0l0l2LPj09m01p49q95o99l20j6J66L77O80
$$ 48923 49080 48988 48733 48390 48067 47903 47925 48011 48041 48011 47979 47982 47989 47880 47479 46730 45835 45136 44816 44800 44966 45343 46023
54618D6023R12Q64N27R4k30l45j81L15R93J440J364J027J023J531K093K223K002
$$ 46023 46935 47799 48326 48420 48190 47845 47664 47979 48972 50412 51776 52803 53826 55357 57450 59673 61675
54601F1675J823J807J787J725J726J727J494J069Q48J091J527J651J309Q23O01
$$ 61675 63498 65305 67092 68817 70543 72270 73764 74833 75681 76772 78299 79950 81259 82082 82683
54586H2683P55J084J418J779K229K641K801K737K730K959L287L508L611L629L396
$$ 82683 83438 84522 85940 87719 89948 92589 95390 98127 100857 103816 107103 110611 114222 117851 121247
54571A21247K672J497J54j128k295l315m114m660m954m937m562l999l566l409
$$ 121247 123919 125416 125570 124442 122147 118832 114718 110058 105104 100167 95605 91606 88040 84631
54557H4631l335l039k477j900j590j544j489j191p35m03l05k73j32M2J7l24q44
$$ 84631 81296 78257 75780 73880 72290 70746 69257 68066 67331 66928 66623 66350 66218 66260 66277 65953 65109
54540F5109j238j230q33m39m89r81j478j641j546j391j169q68p37j009j456j574
$$ 65109 63871 62641 61808 61369 60880 59899 58421 56780 55234 53843 52674 51806 51069 50060 48604 47030
54524D7030j192o82m52n02n79n45m31k75p5N4j34p01j296j390q72k01J16O5OR5
$$ 47030 45838 45156 44704 44202 43623 43078 42647 42372 42297 42351 42217 41516 40220 38830 37958 37757 37873 37938 37944 38039
54504C8039J68J04L0Q3K26M13O38P85O49K07k60m43k61J72O10P17L42j92l50m1
$$ 38039 38207 38311 38341 38424 38650 39063 39701 40486 41135 41342 41082 40639 40378 40550 41160 41877 42219 42027 41677 41636
54484D1636L19M18M35N93Q16R75J142J320J305J039Q48R37J060R88R81J366J908
$$ 41636 41955 42373 42808 43401 44217 45192 46334 47654 48959 49998 50846 51783 52843 53831 54812 56178 58086
54467E8086K120J985J888J938J854J460Q71J87n99j355j850k031k034j914j700
$$ 58086 60206 62191 64079 66017 67871 69331 70202 70389 69790 68435 66585 64554 62520 60606 58906
54452E8906j600j770j981j875j547j427j608j709j495j163r07o03j62J69J47m4
$$ 58906 57306 55536 53555 51680 50133 48706 47098 45389 43894 42731 41824 41221 41059 41228 41375 41331
54436D1331m8J40J78j19m42l30K53P83P63L06m2q6k10o22q41l55N05Q72N10M4
$$ 41331 41283 41423 41601 41482 41040 40710 40963 41746 42509 42815 42773 42687 42477 41855 41014 40659 41164 42036 42546 42590
54416D2590K4K70L47K17J13Q8N0M2J40K39J31j90m74n05k83J8K21K76K69K60K00
$$ 42590 42614 42884 43231 43448 43561 43649 43699 43741 43881 44120 44251 44061 43587 43082 42799 42817 43038 43314 43583 43843 44043
54395D4043%l05n80o87n82l61k66m97q83r16l42M12P09M45P0j00j78l37m86n36
$$ 44043 44043 43738 43158 42471 41889 41528 41262 40765 39882 38966 38624 39036 39745 40190 40260 40160 39982 39645 39159 38623
54375C8623o23q69j077r06l21L24O36N71L78K83K49R8j86m06m12k48RL51P03P97
$$ 38623 38000 37131 36054 35148 34827 35151 35787 36358 36736 37019 37268 37366 37180 36774 36362 36114 36123 36474 37177 37974
54355C7974M63j06m78l92R0O87J101J194J078R49Q08N61L71N52R82J094O95L50
$$ 37974 38437 38331 37853 37461 37551 38238 39339 40533 41611 42560 43368 43929 44300 44852 45834 46928 47623 47973
54337D7973N68J033J158J040J203J617J723J313Q03N13L27J75K20M32M38O3l96
$$ 47973 48541 49574 50732 51772 52975 54592 56315 57628 58431 58944 59271 59446 59666 60098 60536 60599 60203
54320F0203o35o99p47q06r07j075j135q63m67m49q41j047o97j60J7j80m47o21
$$ 60203 59568 58869 58122 57316 56409 55334 54199 53336 52869 52420 51579 50532 49835 49675 49692 49512 49065 48444
54302D8444o28k99L53Q86Q71L88j60n62q17q42n19M0M87N74L35O3J17N97J145
$$ 48444 47816 47517 47870 48756 49627 50015 49855 49293 48476 47634 47115 47155 47642 48216 48551 48614 48731 49328 50473
54283E0473J285J013P48O90N69K75J75N11Q98Q44M79K88L19J96j82m65m38l36
$$ 50473 51758 52771 53519 54209 54778 55053 55228 55739 56637 57481 57960 58248 58567 58763 58581 58116 57678 57342
54265E7342m72q16j101j135r23o78o80j057j567j816j642j241r24q63j023j199
$$ 57342 56870 56054 54953 53818 52895 52217 51537 50480 48913 47097 45455 44214 43290 42427 41404 40205
54249D0205j138p87l87k17k84l50k46o3n9l91r30j291j172o71j88J3J0kL7J16
$$ 40205 39067 38280 37893 37676 37392 37042 36796 36733 36674 36283 35353 34062 32890 32219 32031 32044 32054 32052 32089 32205
54229C2205K41L25J66k58o29n97k11J51K06j3k46k44K1L21L79K09J02J94K66N1
$$ 32205 32446 32771 32937 32679 32050 31453 31242 31393 31599 31586 31340 31096 31117 31438 31817 32026 32128 32322 32588 32639
54209C2639l30n06k83J70N52O97O42N12L55Q2l23o39n76j56K73M42L84K40O7j00
$$ 32639 32309 31803 31520 31690 32242 32939 33581 34093 34448 34530 34207 33568 32992 32836 33109 33551 33935 34175 34242 34142
54189C4142j98k74m34n81m65j19Q3m5k04n9K85N01M61K34j29m82n31k32K1j24
$$ 34142 33944 33670 33236 32655 32190 32071 32154 32109 31905 31846 32131 32632 33093 33327 33198 32716 32185 31953 31974 31850
54169C1850m29m19r6J26P0k0L0Q2J6r6j69k46l17k48nK58L49K09j09m22m37j6
$$ 31850 31421 31002 30906 31032 31102 31082 31112 31194 31210 31114 30945 30699 30382 30134 30129 30387 30736 30945 30836 30414 29977 29961
54147B9961N66Q36O45K85P3Nj01k84l66j54L04O93P16M32K31L27M70K95j81o35
$$ 29961 30527 31363 32008 32293 32366 32371 32270 31986 31620 31466 31770 32463 33179 33611 33842 34169 34639 34934 34753 34118
54127C4118q76r11p36l04K22N23M57J74j22l60n15n26l84j84l7k2j85m62o44n62
$$ 34118 33242 32331 31595 31291 31513 32036 32493 32667 32545 32185 31670 31144 30760 30576 30539 30517 30332 29870 29226 28664
54107B8664k72M5L48O61Q64P22J97m25p71o39p2O34J063R91N89K21N5J8M1J34
$$ 28664 28392 28437 28785 29446 30310 31032 31229 30804 30033 29394 29322 29956 31019 32010 32599 32820 32875 32893 32934 33068
54087C3068K55L16K81J83M9m2O7L46M39N0n73q70o84m09m30o54p60n79j86K00
$$ 33068 33323 33639 33920 34103 34152 34110 34177 34523 34962 35012 34439 33569 32885 32476 32046 31392 30632 30053 29867 30067
54067C0067K87k2m19m92l03l18o86r43o70j19J74J07QO3J17J5j50k07q9J77M58
$$ 30067 30354 30332 29913 29421 29118 28800 28114 27171 26501 26382 26556 26663 26671 26734 26851 26866 26716 26509 26420 26597 27055
54046B7055N18K45r8p0L91Q26P48J99l27m11m7M13N75K65l22p40o43j34L26L96
$$ 27055 27573 27818 27720 27650 28041 28867 29615 29814 29487 29076 29029 29442 30017 30282 29960 29220 28577 28443 28769 29165
54026B9165J82J0pm1k02l44k89m7K52M97N68L19j93n61l87K26P10O71K79L9K07
$$ 29165 29347 29357 29350 29309 29107 28763 28474 28427 28679 29176 29744 30063 29870 29309 28922 29148 29858 30529 30808 30847 31054
54005C1054N59O49K94k09l44Q4P52J211J323J191Q80M28O6N0K56K80j3k45m8M56
$$ 31054 31613 32262 32556 32347 32003 32087 32839 34050 35373 36564 37444 37872 37938 37988 38244 38524 38511 38266 38218 38674
53985C8674Q41R02P76O80P15Q52R66R43Q40Q78J152J472J631J656J691J721J702
$$ 38674 39515 40417 41193 41873 42588 43440 44406 45349 46189 47067 48219 49691 51322 52978 54669 56390 58092
53968E8092J748J981K229K199J919J726J777J858J768J573J374J108P82O09O91
$$ 58092 59840 61821 64050 66249 68168 69894 71671 73529 75297 76870 78244 79352 80134 80743 81434
53953H1434P92O84N27N70O43L79j34m28l71l97p98j258j347j132r77r77r97j060
$$ 81434 82226 82910 83437 84007 84650 85029 84895 84467 84096 83699 82901 81643 80296 79164 78187 77210 76213 75153
53935G5153j277j500j465j250j203j381j435j174q50p22o51l90j5J85J35m2k78
$$ 75153 73876 72376 70911 69661 68458 67077 65642 64468 63618 62896 62245 61855 61840 62025 62160 62118 61840
53918F1840n82q21p47l36P6J34j68m93n18k28J27L21L58M14N91Q01Q37N49M5k84
$$ 61840 61258 60437 59690 59354 59430 59564 59396 58903 58385 58157 58284 58605 58963 59377 59968 60769 61606 62155 62200 61916
53898F1916n1O21J071P66p3p00p01l03P6L59O71R81J063P63K07k30j61M24J067
$$ 61916 61865 62486 63557 64323 64250 63550 62849 62546 62622 62981 63652 64633 65696 66459 66666 66436 66275 66699 67766
53879F7766J260J030Q41R68J186J190J048J028J239J510J598J341Q09L37J87K59
$$ 67766 69026 70056 70897 71865 73051 74241 75289 76317 77556 79066 80664 82005 82814 83151 83338 83597
53863H3597K58J93L05N27M83J93K58R88J834K069J746J485J559J701J687J603
$$ 83597 83855 84048 84353 84880 85363 85556 85814 86802 88636 90705 92451 93936 95495 97196 98883 100486
53847A00486J575J596J682J833J916J814J636J510J305Q65L93K07K03Pm05o67
$$ 100486 102061 103657 105339 107172 109088 110902 112538 114048 115353 116218 116611 116818 117021 117028 116623 115956
53831A15956o41o26q49j135j235j161j067j049j227j755k546l196l359l084k691
$$ 115956 115315 114689 113840 112705 111470 110309 109242 108193 106966 105211 102665 99469 96110 93026 90335
53816I0335k412k249k066j776j456j300j372j485j464j358j259j061p26n73r17
$$ 90335 87923 85674 83608 81832 80376 79076 77704 76219 74755 73397 72138 71077 70351 69778 68861
53801F8861j473j570j056n41o22j184j687j852j789j663j498j236q80n53l91l43
$$ 68861 67388 65818 64762 64221 63599 62415 60728 58876 57087 55424 53926 52690 51810 51257 50866 50523
53785E0523j62K12M05M0o21q87n03N8K77J63jj61l83n43m56j92QJ07K92O38R20
$$ 50523 50361 50573 50978 51018 50397 49510 49007 49065 49342 49505 49504 49343 48960 48417 47961 47769 47777 47884 48176 48814 49734
53764D9734Q36L71j20k44j7J22j27m89m65lM69O54P02Q26R34Q50O32N09O18R28
$$ 49734 50570 50941 50821 50577 50560 50682 50555 50066 49601 49598 50067 50721 51423 52249 53183 54033 54665 55174 55792 56720
53744E6720J275J419J271J061J092J236J079N94L49P78J555J996J856J471J249
$$ 56720 57995 59414 60685 61746 62838 64074 65153 65747 66096 66874 68429 70425 72281 73752 75001
53729G5001J304J491J541J231O45J92J85M49N34K95K9R6M82Q73R73P83M99K52
$$ 75001 76305 77796 79337 80568 81213 81405 81590 82039 82573 82868 82897 82993 83475 84348 85321 86104 86603 86855
53711H6855m9m84q98j052r73r09r66r70q02n87m78m74n51p59j037j144r52o30
$$ 86855 86806 86322 85424 84372 83399 82490 81524 80554 79752 79165 78687 78213 77662 76903 75866 74722 73770 73140
53693G3140m30l57l10l29n12p60q40o58l59j42r5j67k26j53M0K25L14K98K10P5
$$ 73140 72710 72353 72043 71714 71202 70442 69602 68944 68585 68443 68348 68181 67955 67802 67842 68067 68381 68679 68889 68964
53673F8964n9k07n10j008j452j493j120o91m98m90m94m22k57j1J94K33J92K76
$$ 68964 68905 68698 68188 67180 65728 64235 63115 62424 61926 61436 60942 60520 60263 60252 60446 60679 60871 61147
53655F1147M86O23O44O74P18O53N70P19J031J156J020R23R81R52Q23R73J430J576
$$ 61147 61633 62256 62900 63574 64292 64945 65515 66234 67265 68421 69441 70364 71345 72297 73120 74093 75523 77099
53637G7099J054M46M34P79P77M36M20R95J674J975J868J512J069Q19R74J281J309
$$ 77099 78153 78599 79033 79812 80589 81025 81445 82440 84114 86089 87957 89469 90538 91357 92331 93612 94921
53620I4921J115J152J467J581J235P74N07K95j6k17j61j30l89o40m39N2J89l05
$$ 94921 96036 97188 98655 100236 101471 102245 102752 103047 103031 102814 102653 102523 102134 101494 101055 101107 101296 100991
53602A00991r99j289j022m76k2J57J08L0Q6K20J79k12p92j153r99m52O7K31P5
$$ 100991 99992 98703 97681 97205 97183 97340 97448 97478 97564 97784 97963 97751 96959 95806 94807 94355 94422 94653 94728
53583I4728j73l06k37K7L56N19M30K56J89J80N0j88k97j59J00K92M07N77Q88J242
$$ 94728 94555 94249 94012 94039 94395 94914 95344 95600 95789 95969 96019 95831 95534 95375 95475 95767 96174 96751 97639 98881
53563I8881J419J257Q47M86M10O06R18J191J324J274J158J171J307J361J282J320
$$ 98881 100300 101557 102404 102890 103300 103906 104824 106015 107339 108613 109771 110942 112249 113610 114892 116212
53547A16212J632J955J984J854J946K298K544K451K176K005K020K120K139J959
$$ 116212 117844 119799 121783 123637 125583 127881 130425 132876 135052 137057 139077 141197 143336 145295
53533A45295J681J637K002K469K570K282K029K043K107J969J721J618J697J798
$$ 145295 146976 148613 150615 153084 155654 157936 159965 162008 164115 166084 167805 169423 171120 172918
53519A72918J748J495J136Q96R31J156J408J662J932J999J608R23M54L88L84J19
$$ 172918 174666 176161 177297 178193 179124 180280 181688 183350 185282 187281 188889 189812 190266 190654 191038 191157
53503A91157k36l25p4L15O83R55J069J031R65R12P65N42M94P11Q59O12K04J49
$$ 191157 190921 190596 190522 190837 191520 192475 193544 194575 195540 196452 197217 197759 198253 198964 199823 200435 200639 200788
53485B00788M83O55K95k78m45j3O49J073J127R79Q39Q14R44J258J689K014K036
$$ 200788 201271 201926 202221 201943 201498 201485 202134 203207 204334 205313 206152 206966 207910 209168 210857 212871 214907
53468B14907J854J834K200K771L209L405L505L599L644L695L931M395M850N110
$$ 214907 216761 218595 220795 223566 226775 230180 233685 237284 240928 244623 248554 252949 257799 262909
53454B62909N318N750O359O840P051P156P273P304P279P528Q252R088R531R692
$$ 262909 268227 273977 280336 287176 294227 301383 308656 315960 323239 330767 339019 348107 357638 367330
53440C67330J0133J0952J1574J1643J1616J2061J2729J2943J2632J2386J2519
$$ 367330 377463 388415 399989 411632 423248 435309 448038 460981 473613 485999 498518
53429D98518J2688J2593J2501J2736J3069J3085J2860J2821J3023J3046J2665
$$ 498518 511206 523799 536300 549036 562105 575190 588050 600871 613894 626940 639605
53418F39605J2194J1999J1975J1782J1415J1204J1227J1105J0509R654R033Q758
$$ 639605 651799 663798 675773 687555 698970 710174 721401 732506 743015 752669 761702 770460
53406G70460Q485P923P206O598O068N402M560L739L081K494J813J000J63n78j230
$$ 770460 778945 786868 794074 800672 806740 812142 816702 820441 823522 826016 827829 828829 828992 828414 827184
53391H27184j942k867l970n030n886o566p168p729q276q895r570j0113j0357j0363
$$ 827184 825242 822375 818405 813375 807489 800923 793755 786026 777750 768855 759285 749172 738815 728452
53377G28452j0312j0309j0375j0578j0903j1119j1008j0652j0306j0006r560q940
$$ 728452 718140 707831 697456 686878 675975 664856 653848 643196 632890 622884 613324 604384
53365F04384q384q033p694p120o367n668n096m539l926l274k539j602n16M52J147
$$ 604384 596000 587967 580273 573153 566786 561118 556022 551483 547557 544283 541744 540142 539626 540078 541225
53350E41225J829K846M066M919N179N371O133P343Q365R045R869J1080J2212J2817
$$ 541225 543054 545900 549966 554885 560064 565435 571568 578911 587276 596321 606190 617270 629482 642299
53336F42299J3188J3878J4864J5692J6262J6870J7612J8234J8665J9220K0089
$$ 642299 655487 669365 684229 699921 716183 733053 750665 768899 787564 806784 826873
53325H26873K1037K1779K2393K3159K4114K4982K5442K5454K5360K5576K6119
$$ 826873 847910 869689 892082 915241 939355 964337 989779 1015233 1040593 1066169 1092288
53314A092288K6518K6391K5926K5554K5257K4639K3587K2460K1492K0442J9001
$$ 1092288 1118806 1145197 1171123 1196677 1221934 1246573 1270160 1292620 1314112 1334554 1353555
53303A353555J7204J5284J3388J1632J0147Q844P328N353L180J280k72j797l587
$$ 1353555 1370759 1386043 1399431 1411063 1421210 1430054 1437382 1442735 1445915 1447195 1446923 1445126 1441539
53290A441539n663p932j0312j2593j4467j5850j7072j8572k0367k2015k3193k4073
$$ 1441539 1435876 1427944 1417632 1405039 1390572 1374722 1357650 1339078 1318711 1296696 1273503 1249430
53278A249430k4970k5748k5983k5625k5164k4937k4730k4281k3801k3603k3501
$$ 1249430 1224460 1198712 1172729 1147104 1121940 1097003 1072273 1047992 1024191 1000588 977087
53267I77087k3095k2467k2049k1843k1352k0339j9202j8378j7743j6883j5681
$$ 977087 953992 931525 909476 887633 866281 845942 826740 808362 790619 773736 758055
53256G58055j4399j3279j2288j1179r856q614p930p824p686o952n828m945m472
$$ 758055 743656 730377 718089 706910 697054 688440 680510 672686 665000 658048 652220 647275 642803
53243F42803m045l442k825k236j473n88J0J89L88R86J786K421K923L532M261M962
$$ 642803 638758 635316 632491 630255 628782 628194 628204 628393 628781 629767 631553 633974 636897 640429 644690 649652
53227F49652N598O166O566O784P003P342P721Q190R035J0263J1307J1597J1251
$$ 649652 655250 661416 667982 674766 681769 689111 696832 705022 714057 724320 735627 747224 758475
53214G58475J0795J0461J0133R820R672R601R289Q693Q167P932P673O890N493
$$ 758475 769270 779731 789864 799684 809356 818957 828246 836939 845106 853038 860711 867601 873094
53201H73094L960K818K137J557Q27Q7n18j222k319l601m602n361o409p874r127
$$ 873094 877054 879872 882009 883566 884393 884480 883962 882740 880421 876820 872218 866857 860448 852574 843447
53186H43447r667r845j0321j1162j1943j2440j2754j2945j3027j3189j3614j4121
$$ 843447 833780 823935 813614 802452 790509 778069 765315 752370 739343 726154 712540 698419
53174F98419j4337j4167j3787j3253j2540j1850j1495j1452j1378j1089j0731
$$ 698419 684082 669915 656128 642875 630335 618485 606990 595538 584160 573071 562340
53163E62340j0470j0308j0242j0277j0272j0028r553r065q642q163p581p053o695
$$ 562340 551870 541562 531320 521043 510771 500743 491190 482125 473483 465320 457739 450686 443991
53150D43991o481o383o476o760p081p266p259p081o823o665o747o981p106o970
$$ 443991 437510 431127 424651 417891 410810 403544 396285 389204 382381 375716 368969 361988 354882 347912
53136C47912o680o427o302o286o307o302o271o260o237o094n836n670n808o200
$$ 347912 341232 334805 328503 322217 315910 309608 303337 297077 290840 284746 278910 273240 267432 261232
53122B61232o604o778o624o230n892n883o097o061n539m893m615m664m600m253
$$ 261232 254628 247850 241226 234996 229104 223221 217124 211063 205524 200631 196016 191352 186752 182499
53108A82499l909l821l860l749l428l094k974l128l362l386l111k756k519k359
$$ 182499 178590 174769 170909 167160 163732 160638 157664 154536 151174 147788 144677 141921 139402 137043
53094A37043k165k047k122k230k100j797j661j791j913j774j478j261j199j239
$$ 137043 134878 132831 130709 128479 126379 124582 122921 121130 119217 117443 115965 114704 113505 112266
53080A12266j321j380j334j172j008r34r07q25o92o33p47r36r17n49r2ql87p96
$$ 112266 110945 109565 108231 107059 106051 105117 104210 103385 102693 102060 101313 100377 99460 98911 98819 98811 98424 97628
53062I7628q29o20n76p38p36l35K50O49P16N77M34M49O44Q55Q78O83M53M02N96
$$ 97628 96799 96179 95603 94865 94129 93794 94044 94693 95409 95986 96420 96869 97513 98368 99246 99929 100382 100784 101380
53043A01380R48J271J291Q14q1r95j524j622j576j610j605j389j181j406k005
$$ 101380 102328 103599 104890 105704 105623 104628 103104 101482 99906 98296 96691 95302 94121 92715 90710
53028I0710k322j945j363j311j710j802j309p65o40p45p38o82p05o26l49j92m53
$$ 90710 88388 86443 85080 83769 82059 80257 78948 78183 77543 76798 76060 75378 74673 74047 73698 73506 73053
53011G3053q60r59p58o10o35o88p25p91q07p10o44p10p02m12j9J87K37K61J51
$$ 73053 72193 71234 70476 69866 69231 68543 67818 67027 66220 65510 64866 64156 63454 63042 63023 63210 63447 63708 63859
52992F3859j75l72q9L69L36k92r11r91n75mM44N68L26m2k37k45k53l15l82m82
$$ 63859 63684 63312 63223 63592 63928 63636 62725 61734 61159 61155 61599 62167 62493 62451 62214 61969 61716 61401 61019 60537
52972F0537n99n39k41j0o5j11J66N05M50J44Q7K59K10j03k63j29lpN8J71M2k91
$$ 60537 59938 59399 59158 59148 59083 58972 59138 59643 60093 60237 60324 60583 60793 60690 60427 60298 60295 60288 60346 60517 60559 60268
52950F0268m61m30n38p91p99n36m27n03k46M38Q94P18L73L42L44j9m35l54J08
$$ 60268 59807 59377 58839 58048 57249 56713 56286 55783 55537 55975 56869 57587 57960 58302 58646 58627 58192 57838 57946
52931E7946L90L46K37J72M9p6m0P5M0j48k80k18N6N03R34J084R29P83Q38R39R41
$$ 57946 58336 58682 58919 59091 59140 59064 59024 59099 59139 58991 58711 58493 58549 59052 59986 61070 61999 62782 63620 64559 65500
52910F5500R59J078J162J169J281J483J434J071Q64J146J565J635J440J311J192
$$ 65500 66459 67537 68699 69868 71149 72632 74066 75137 76001 77147 78712 80347 81787 83098 84290
52895H4290Q82N82O27Q56Q29N08K50J75N8k11m82o40o87n82l14j09k24o05j006
$$ 84290 85172 85754 86381 87237 88066 88574 88824 88999 89057 88846 88364 87724 87037 86455 86141 86032 85808 85203 84197
52876H4197j269j295r43l43l0l34q21q38m07r3j28k11j72k04l51l53j51q5l27
$$ 84197 82928 81633 80690 80347 80317 79983 79162 78324 77917 77824 77696 77485 77313 77109 76758 76405 76254 76169 75842
52857G5842n28l17J71M89M14R2k08k94j58om5k31l30k41r0J7R4J44J14L6O4K38
$$ 75842 75314 74997 75168 75657 76071 76163 75955 75661 75503 75497 75452 75221 74891 74650 74560 74577 74671 74815 74929 74965 75029 75267
52835G5267M20M68M14L46K84K23K04K00O9l33q69j109p02J50P65O94K96K79P44
$$ 75267 75687 76155 76569 76915 77199 77422 77626 77826 77895 77562 76693 75584 74882 75032 75797 76491 76787 77066 77810
52816G7810J027O38p4m50l71k10j90k17j89j51j29o8J1Q5K24M47N44L33k4j95
$$ 77810 78837 79475 79401 78951 78580 78370 78180 77963 77774 77623 77494 77426 77437 77522 77746 78193 78737 79070 79046 78851
52796G8851j28l7%J16L18M04L02K68N95J216J693J612J035N13N44J046J494J615
$$ 78851 78723 78686 78686 78802 79120 79524 79826 80094 80689 81905 83598 85210 86245 86758 87302 88348 89842 91457
52778I1457J619J702J673J323Q08M01R6k09m04l68k93m01n34m33k57l72p47j008
$$ 91457 93076 94778 96451 97774 98582 98983 99079 98870 98466 98098 97805 97404 96870 96437 96180 95808 95061 94053
52760I4053j046j083j196j197j056j059j349j706j854j733j434j086q70q76r25
$$ 94053 93007 91924 90728 89531 88475 87416 86067 84361 82507 80774 79340 78254 77384 76508 75583
52745G5583p49l99j90k80n35q09j071j261j292j216j150j045p89n05m20m85m61
$$ 75583 74834 74435 74245 73965 73430 72621 71550 70289 68997 67781 66631 65586 64797 64292 63872 63387 62926
52728F2926l55l91n69n81l17l4J4j03k57m88q18j083j077p74l23Rm9m83q63p64
$$ 62926 62571 62180 61611 61030 60713 60679 60693 60590 60333 59845 59027 57944 56867 56093 55770 55779 55730 55247 54384 53620
52708E3620k96P5J89K62L22Q3m86r05p91l59q0r6k62m69o77p71o96o21p19r09
$$ 53620 53324 53399 53588 53850 54172 54255 53769 52864 52073 51714 51634 51538 51276 50807 50130 49359 48663 48042 47323 46414
52688D6414r83r23q76q93q08m99r6R7q1m22n40l21o6o8k49l82m75o60q29p06l17
$$ 46414 45431 44508 43632 42739 41931 41432 41336 41433 41352 40930 40390 40069 40003 39935 39686 39304 38829 38169 37340 36634 36317
52667C6317lL6n8j00m6Q7K65L42J99j3o3L1R0J66M37P57P49L41j14l58m45l98
$$ 36317 36314 36350 36292 36192 36146 36233 36498 36840 37039 37026 36963 36994 37084 37250 37687 38444 39193 39534 39420 39062 38617 38219
52645C8219j37J89K42K6p4N9J10k5Q2O92J378J568J317J088J068J090J032R09
$$ 38219 38082 38271 38513 38539 38465 38524 38634 38609 38691 39383 40761 42329 43646 44734 45802 46892 47924 48833
52627D8833P11M39K35J88J72O0o4q6p1j24k15l41n84r04j077j038r97j032r33
$$ 48833 49544 49983 50218 50406 50578 50638 50574 50488 50417 50293 50078 49737 49153 48249 47172 46134 45137 44105 43172
52608D3172o43m63n64o70n78n23o75o84k45J97M3n11p10l49L1N3p7j25k19m60
$$ 43172 42529 42066 41502 40832 40254 39731 39056 38372 38127 38324 38367 37856 37146 36797 36828 36881 36804 36679 36460 36000
52588C6000o03m18o2R6j28o00r61q49l28N1j64o74q00l75J10K61K27K56L27L49
$$ 36000 35397 34979 34917 35013 34885 34285 33324 32475 32147 32198 32034 31360 30560 30185 30295 30556 30783 31039 31366 31715
52568C1715M05M99M86L83M23N83M57q3n25l53J83M03J06k82l71k10J3K20L31K32
$$ 31715 32120 32619 33105 33488 33911 34494 34951 34868 34343 33990 34173 34576 34682 34400 34029 33819 33832 34052 34383 34615
52548C4615Pk4L28Q49J135R71M35k19o91p84n61k54QK77N49O31M22J56J42L19
$$ 34615 34622 34598 34926 35775 36910 37881 38316 38097 37406 36622 36061 35807 35815 36092 36641 37272 37694 37850 37992 38311
52528C8311L43Q5j71j49Q5K82L45K98J74M6P7L42O92R61J148J253J097O19J40
$$ 38311 38654 38739 38568 38419 38504 38786 39131 39429 39603 39649 39726 40068 40760 41721 42869 44122 45219 45838 45978
52509D5978L5K12K83K10L47P93J136J020O05K73J38J32K15L27L23K39L54P26R34
$$ 45978 46013 46225 46508 46718 47065 47858 48994 50014 50619 50892 51030 51162 51377 51704 52027 52266 52620 53346 54280
52490E4280O31J30M1M07O89N31J74j4j7kkM5J39K53M07N47N08K39m3p5J44M09
$$ 54280 54911 55041 55082 55489 56178 56709 56883 56869 56852 56850 56848 56893 57032 57285 57692 58239 58747 58986 58943 58868 59012 59421
52468E9421N62N74M26J51m5R5N11P85O16K26M7J47K19R6l8o7j89n53q98r08o82
$$ 59421 59983 60557 60983 61134 61089 61184 61695 62480 63096 63322 63369 63516 63735 63831 63793 63726 63537 62984 62086 61178 60496
52447F0496n39m79k52J25L25K25N4NN3K30O00R24P69J59l03k34L9P5k1O5K13N4
$$ 60496 59957 59478 59226 59351 59676 59901 59955 59960 60013 60243 60843 61767 62536 62695 62392 62158 62197 62272 62251 62316 62529 62583
52425F2583l48n48l49K0L13N12O16N72M11K23Ok28k79J6M24N32K87L5l0p2k22
$$ 62583 62235 61687 61338 61358 61671 62183 62799 63371 63782 64005 64011 63783 63504 63520 63944 64476 64763 64798 64768 64696 64474
52404F4474l17j91L4J69K17K43J92J2j26%L42N90N51L99M31O61P51M35p7k64Q2
$$ 64474 64157 63966 64000 64169 64386 64629 64821 64833 64707 64707 65049 65639 66190 66589 67020 67681 68432 68867 68790 68526 68608
52383F8608N95P64N33K99L66N75N25K9o52j053r49n36j41J25L62N76O39N35M17
$$ 68608 69203 69967 70500 70799 71165 71740 72265 72294 71642 70589 69640 69104 68963 69088 69450 70026 70665 71200 71617
52364G1617L28J43j57l81m25m04l69k03M8L9l82q44r05o23l57k45j94k20l66m61
$$ 71617 71945 72088 71931 71550 71125 70721 70352 70149 70197 70236 69854 69010 68105 67482 67125 66880 66686 66466 66100 65639
52344F5639l36j84k80m77m00k5L18N28P35Q47N68J5k57j7K72J95k3O2M03N89N19
$$ 65639 65303 65119 64839 64362 63962 63937 64255 64783 65518 66365 66933 66948 66691 66674 66946 67141 67118 67180 67583 68172 68691
52323F8691N05P46J019R68N52J20N5L60O81P35O09N43N31L99K20K94O95J110J255
$$ 68691 69196 69942 70961 71929 72481 72601 72656 73016 73697 74432 75041 75584 76115 76514 76734 77028 77723 78833 80088
52304H0088J175J053R51Q64Q40Q53Q24Q13J042J539J982K025J671J184Q12O77
$$ 80088 81263 82316 83267 84131 84971 85824 86648 87461 88503 90042 92024 94049 95720 96904 97716 98393
52288I8393P98J021J098R72Q74R83J138J085Q32O12N84P36J023J347J510J390
$$ 98393 99191 100212 101310 102282 103156 104139 105277 106362 107194 107806 108390 109126 110149 111496 113006 114396
52272A14396J162J100J167J053O47K96L89Q92J469J907K202K266J925J320R83
$$ 114396 115558 116658 117825 118878 119525 119821 120210 121102 122571 124478 126680 128946 130871 132191 133174
52257A33174J244J765J976J851J836K064K157J925J781K136K760L138L183L220
$$ 133174 134418 136183 138159 140010 141846 143910 146067 147992 149773 151909 154669 157807 160990 164210
52243A64210L427L703M043M539N081N366N299N101N024N132N343N500N459N317
$$ 164210 167637 171340 175383 179922 185003 190369 195668 200769 205793 210925 216268 221768 227227 232544
52229B32544N400N824O234O307O246O404O643O547O182O025O194O334O314O414
$$ 232544 237944 243768 250002 256309 262555 268959 275602 282149 288331 294356 300550 306884 313198 319612
52215C19612O674O660O121N390M827M339L775L334L250L366L365L169K803K198
$$ 319612 326286 332946 339067 344457 349284 353623 357398 360732 363982 367348 370713 373882 376685 378883
52201C78883J402P24L98K90K23K04J88q2o33r90p45j36L09M38M31L94L73N60R88
$$ 378883 380285 381009 381407 381697 381920 382124 382312 382230 381597 380607 379862 379726 380035 380473 380904 381298 381671 382231 383219
52182C83219J295J208J095J522K385L021L084K865K736K775L004L473M001M219
$$ 383219 384514 385722 386817 388339 390724 393745 396829 399694 402430 405205 408209 411682 415683 419902
52168D19902M045L777L646L539L293K942K560K134J722J496J459J338R27L76k9
$$ 419902 423947 427724 431370 434909 438202 441144 443704 445838 447560 449056 450515 451853 452780 453156 453127
52153D53127k52n08r81j590k094k368k555k897l339l530l332l118l310l747l878
$$ 453127 452875 452367 451386 449796 447702 445334 442779 439882 436543 433013 429681 426563 423253 419506 415628
52138D15628l526l108l004l089l005k672k306k099k035j957j729j354j011q69
$$ 415628 412102 408994 405990 402901 399896 397224 394918 392819 390784 388827 387098 385744 384733 383864
52124C83864q99r74j057j203j369j439j428j408j289r44n37m60p97j128j039o18
$$ 383864 382965 381991 380934 379731 378362 376923 375495 374087 372798 371854 371317 370857 370060 368932 367893 367275
52108C67275k86l10o26r99j204j167j089j257j650j830j471q17m32m83n78l64
$$ 367275 366989 366679 366053 365054 363850 362683 361594 360337 358687 356857 355386 354569 354137 353654 353076 352712
52092C52712n7j67q29j519j632j191q18r41j254j195p98o57j048j519j557j318
$$ 352712 352655 352488 351659 350140 348508 347317 346499 345558 344304 343109 342311 341654 340606 339087 337530 336212
52076C36212j268j432j431j212j183j531j858j756j401j265j433j565j436j183
$$ 336212 334944 333512 332081 330869 329686 328155 326297 324541 323140 321875 320442 318877 317441 316258
52062C16258r85q39o97o20o43o79o39n17k83J30O21Q60O67K91J90N09R94J348
$$ 316258 315273 314434 313737 313117 312474 311795 311156 310639 310356 310486 311107 311967 312634 312925 313115 313624 314618 315966
52044C15966J533J712K024K480L014L573M123M611M950N128N340N794O401O824
$$ 315966 317499 319211 321235 323715 326729 330302 334425 339036 343986 349114 354454 360248 366649 373473
52030C73473O902O862O953P114P189P200P194P022O626O288O266O289N928N327
$$ 373473 380375 387237 394190 401304 408493 415693 422887 429909 436535 442823 449089 455378 461306 466633
52016D66633N019N020M708L813K870K403K149J524N06l91p96p47m87l38o34j345
$$ 466633 471652 476672 481380 485193 488063 490466 492615 494139 494645 494254 493458 492711 492224 491886 491252 489907
52000D89907j964k098k023k250k728k939k725k525k678k933k839k357j836j542
$$ 489907 487943 485845 483822 481572 478844 475905 473180 470655 467977 465044 462205 459848 458012 456470
51986D56470j403j162o99j45K87N95R46J332J474J248R51R36J124J197J156J268
$$ 456470 455067 453905 453206 453061 453348 453943 454889 456221 457695 458943 459894 460830 461954 463151 464307 465575
51970D65575J530J630J457J293J338J366J078N72J83N3J3j54n29j055j566j891
$$ 465575 467105 468735 470192 471485 472823 474189 475267 475839 476022 476075 476088 475934 475405 474350 472784 470893
51954D70893k007k073k290k676l088l447l841m422n161n799o099o127o143o272
$$ 470893 468886 466813 464523 461847 458759 455312 451471 447049 441888 436089 429990 423863 417720 411448
51940D11448o399o445o539o803p140p373p487p565p642p740p920q126q119p793
$$ 411448 405049 398604 392065 385262 378122 370749 363262 355697 348055 340315 332395 324269 316150 308357
51926C08357p416p339p536p695p621p366p081o914o996p229p252o860o346o108
$$ 308357 300941 293602 286066 278371 270750 263384 256303 249389 242393 235164 227912 221052 214706 208598
51912B08598o040n704n049m483m254m160l986l810l715l561l259k965k804k670
$$ 208598 202558 196854 191805 187322 183068 178908 174922 171112 167397 163836 160577 157612 154808 152138
51898A52138k448k272k287k388k347k074j675j341j233j366j553j609j575j561
$$ 152138 149690 147418 145131 142743 140396 138322 136647 135306 134073 132707 131154 129545 127970 126409
51884A26409j456j106p06o52r11r97p05l95m25o14o16m79n03p87j183j521j630
$$ 126409 124953 123847 123141 122489 121578 120581 119876 119481 119056 118442 117826 117347 116844 116057 114874 113353 111723
51867A11723j358q14m14m27o62p76p19o26n49n43p79j234j485j195o58m17n10
$$ 111723 110365 109551 109137 108710 108048 107272 106553 105927 105378 104835 104056 102822 101337 100142 99484 99067 98557
51850I8557n16k98j78l45n38m79k78k03k91l96m54n42p31r52r96o69p3L51K68
$$ 98557 98041 97743 97565 97220 96682 96203 95925 95722 95431 95035 94581 94039 93308 92356 91360 90691 90618 90969 91237
51831I1237j31l68l10k56m19o01n25k13J02K42J78m4k90l80k55m1J40K41J90o6
$$ 91237 91106 90738 90428 90172 89753 89152 88627 88414 88516 88758 88936 88892 88602 88222 87967 87926 88066 88307 88497 88431
51811H8431l64l78k9L32L61J69R9K07K55J78K04M71P82Q65P16N60N59O64P44P17
$$ 88431 88067 87689 87660 87992 88353 88522 88621 88828 89083 89261 89465 89936 90718 91583 92299 92859 93418 94082 94826 95543
51791I5543O27N93O87Q06P59M93J93N9J26K79M06L88J46k13l99k66n0p5k96m19
$$ 95543 96170 96763 97450 98256 99015 99508 99701 99760 99886 100165 100571 100959 101105 100892 100493 100227 100177 100102 99806 99387
51771I9387l78l81m45k70K24O25N86L42L54N95O70M82L62M82N98M83K95K85M09
$$ 99387 99009 98628 98183 97913 98137 98762 99348 99690 100044 100639 101309 101791 102153 102635 103233 103716 104011 104296 104705
51752A04705M23K25n1k19j90JJ90K52K09J69J17m7k88m42m33k79M5N10P69M65
$$ 104705 105128 105353 105302 105083 104893 104894 105084 105336 105545 105714 105831 105784 105496 105054 104621 104342 104387 104897 105666 106131
51732A06131j98m97p3O00Q71P25O11P03P52N79K57q2l48l92j40J84K31j5k15j15
$$ 106131 105933 105436 105363 105963 106834 107559 108170 108873 109625 110204 110461 110379 110031 109639 109499 109683 109914 109899 109684 109569
51712A09569K16N69P95P91N46K67K15L64M16J91j18k14QM33Q78J123J021O96M64
$$ 109569 109785 110354 111149 111940 112486 112753 112968 113332 113748 113939 113821 113607 113615 114048 114926 116049 117070 117766 118230
51693A18230N01O43O50N10M05M57O90J092J549J811J668J247Q82O87M05k06r61
$$ 118230 118731 119374 120024 120534 120939 121396 122086 123178 124727 126538 128206 129453 130335 131022 131427 131221 130260
51676A30260j405j351j046p83n49k40l4k29p21r81o90j60J10M2o6o8q4j76j97
$$ 130260 128855 127504 126458 125675 125126 124886 124852 124623 123902 122921 122231 122071 122181 122223 122157 122089 122005 121829 121632
51657A21632j10j59n62j173j604j617j335j067j034j212j377j326j041o99m81
$$ 121632 121522 121363 120801 119628 118024 116407 115072 114005 112971 111759 110382 109056 108015 107316 106835
51642A06835m39m81m49l16k58m60p83q20l83J69L67J92j5j43l77o70n92P9R00
$$ 106835 106396 105915 105466 105150 104892 104432 103649 102829 102446 102615 102982 103174 103159 103016 102639 101969 101377 101456 102356
51623A02356J270J202J246J700K213K293J872J238O16L7m38n95l11K32O73Q07
$$ 102356 103626 104828 106074 107774 109987 112280 114152 115390 116006 116043 115605 115010 114699 114931 115604 116411
51607A16411P21O09N82O67Q50J022R35M33l32j002j386j602j813k001k019j840
$$ 116411 117132 117741 118323 118990 119840 120862 121797 122230 121898 120896 119510 117908 116095 114094 112075 110235
51591A10235j636j629j866k141k164j852j450j248j235j153q70n31k81j00L6j2
$$ 110235 108599 106970 105104 102963 100799 98947 97497 96249 95014 93861 92991 92460 92179 92079 92115 92103
51575I2103l32p21r03q68q17p84o41l94k44k34j53R7K53O2l05n01m93n32o42n42
$$ 92103 91771 91050 90147 89279 88462 87678 87037 86643 86399 86165 86012 86109 86362 86424 86119 85618 85125 84593 83951 83409
51555H3409r7M16O52N93M26K76K08L23N87P07M58P2j0K73N35N15M08M83O72P11
$$ 83409 83312 83728 84380 84973 85399 85675 85883 86206 86793 87500 87958 88030 88020 88293 88828 89343 89751 90234 90906 91617
51535I1617N57M28N30Q74J340J758J974J990J949J945J928J872J922K186K495
$$ 91617 92174 92602 93132 94006 95346 97104 99078 101068 103017 104962 106890 108762 110684 112870 115365
51520A15365K584K434K265K173K025J734J388J035N50j23p41r75q24o46p50j089
$$ 115365 117949 120383 122648 124821 126846 128580 129968 131003 131553 131430 130689 129714 128890 128244 127494 126405
51504A26405j343j277q98m37j54j23j40R4O26J124J238J084J163J764K590L107
$$ 126405 125062 123785 122887 122450 122296 122173 122033 122127 122753 123877 125115 126199 127362 129126 131716 134823
51488A34823L144K972K825K648K300J805J265P00J13l72n86n04k60k8O5j8j81
$$ 134823 137967 140939 143764 146412 148712 150517 151782 152482 152595 152223 151637 151133 150873 150845 150910 150892 150711
51471A50711k69k23j21lK23O02R76J120R67O44L36J98K74L54J23m79j126j491
$$ 150711 150442 150219 150098 150095 150318 150920 151896 153016 153983 154627 154963 155161 155435 155789 155912 155433 154307 152816
51453A52816j635j806j999k013j838j689j624j462j181j064j281j569j580j368
$$ 152816 151181 149375 147376 145363 143525 141836 140212 138750 137569 136505 135224 133655 132075 130707
51439A30707j219j163r56n20j58j38l34m25l38k82l69m57l91k77l04m33m08r9
$$ 130707 129488 128325 127369 126849 126691 126553 126219 125794 125456 125174 124805 124348 123957 123680 123376 122943 122535 122436
51421A22436L50P50J062J280J291J020O06L00K28L78P55J334J878K068J885J703
$$ 122436 122786 123536 124598 125878 127169 128189 128795 129095 129323 129701 130456 131790 133668 135736 137621 139324
51405A39324J822K084K067J660J248J295J787K231K159J593R74O77O83P08N84
$$ 139324 141146 143230 145297 146957 148205 149500 151287 153518 155677 157270 158244 158921 159604 160312 160896
51390A60896L66J58k8j72j84l4R2m8m01n84l33J36L20pn85j053j294j408j470
$$ 160896 161262 161420 161392 161220 161036 161002 161094 161046 160645 160061 159728 159864 160184 160177 159592 158539 157245 155837 154367
51371A54367j568j825k230k527k508k356k410k665k807k735k700k769k547j724
$$ 154367 152799 150974 148744 146217 143709 141353 138943 136278 133471 130736 128036 125267 122720 120996
51357A20996o47o4k77q42j080p38j28K64K80J81K65M58M70L08L50Q19J420J680
$$ 120996 120349 120285 120008 119166 118086 117348 117220 117484 117764 117945 118210 118668 119138 119446 119796 120615 122035 123715
51339A23715J471J020N83K76Q9r5m02p57r67j076j437k170k892l186l123l009
$$ 123715 125186 126206 126789 127065 127154 127059 126657 125900 124933 123857 122420 120250 117358 114172 111049 108040
51323A08040k868k577k251k139k134j927j567j442j671j908j872j710j699j817
$$ 108040 105172 102595 100344 98205 96071 94144 92577 91135 89464 87556 85684 83974 82275 80458
51309H0458j861j728j485j293j251j305j259j011p11m85k41P3J69k15p78q87m26
$$ 80458 78597 76869 75384 74091 72840 71535 70276 69265 68554 68069 67828 67901 68070 67855 67077 66190 65764
51292F5764R6K45J26K6K5P7J61J87P7lJ86N12N48K43M0J99M05L11M2q9m3R5L67
$$ 65764 65860 66105 66231 66257 66282 66359 66520 66707 66784 66781 66967 67479 68027 68270 68310 68509 68914 69225 69267 69178 69135 69230 69597
51269F9597P48R97R98J030J334J675J719J539J447J473J443J394J515J748J834
$$ 69597 70345 71342 72340 73370 74704 76379 78098 79637 81084 82557 84000 85394 86909 88657 90491
51254I0491J725J618J608J557J335Q94K16o29j363j705j710j676j755j883k015
$$ 90491 92216 93834 95442 96999 98334 99228 99444 98815 97452 95747 94037 92361 90606 88723 86708
51239H6708k193k381k447k356k195k007j797j618j493j286q65l69j29k84o20q34
$$ 86708 84515 82134 79687 77331 75136 73129 71332 69714 68221 66935 66070 65701 65572 65288 64668 63834
51223F3834q28p37o94o77n47k66k3k2k05l43l71m07m41l40j64j78l64l52j8K39
$$ 63834 63006 62269 61575 60898 60351 60085 60062 60040 59835 59492 59121 58714 58273 57933 57769 57591 57227 56875 56857 57096
51203E7096J14j02rK36K55J07R0J02j77n93o15j55K78L58K56J52l7l08m02k98
$$ 57096 57210 57108 57099 57335 57590 57697 57787 57889 57712 57119 56504 56349 56627 56985 57241 57393 57356 57048 56646 56348
51183E6348l60p26r90p92l71j85k50k89k40k40k30kL65N23L34M0q1l6L5J34L80
$$ 56348 55988 55262 54272 53480 53109 52924 52674 52385 52145 51905 51675 51673 52038 52561 52895 52935 52854 52818 52853 52987 53367
51162E3367P51J018R68O66M17M33N54M41ln20p93p63n64k87J05O20J086J205Q59
$$ 53367 54118 55136 56104 56770 57187 57620 58174 58615 58612 58092 57299 56536 55972 55685 55790 56410 57496 58701 59560
51143E9560L37J26L71O49M54j94p60p70k39L88O27L51m0L5O61J206J049L27k87
$$ 59560 59897 60023 60394 61043 61497 61303 60543 59773 59534 59922 60549 60900 60860 60895 61556 62762 63811 64138 63851
51124F3851m27l10k35k10j96k22k05QK89K99J6j52L0K61K42J24J50J59r2l96l30
$$ 63851 63424 63114 62879 62669 62473 62251 62046 62054 62343 62642 62658 62506 62536 62797 63039 63163 63313 63472 63380 62984 62654
51103F2654L6J72j84p18j028j052r23o37j47L76O44N10J21k80n34n86m04lM11
$$ 62654 62690 62862 62678 61960 60932 59880 58957 58320 58173 58549 59193 59703 59824 59544 59010 58424 58020 58017 58428
51084E8428M76J8p00j157j085o39j37K17L60L25K61L48N63P11O80N54M29L00J85
$$ 58428 58904 58922 58222 57065 55980 55341 55204 55421 55781 56106 56367 56715 57278 57989 58669 59223 59652 59952 60137
51065F0137J51J37m3l69n58m59l24m32p08q62q08o70n11l01q8L5O7O1J9m9n0M0
$$ 60137 60288 60425 60382 60013 59455 58996 58672 58240 57532 56670 55862 55192 54681 54380 54292 54327 54394 54455 54474 54425 54375 54415
51043E4415J19J76L79P43R39P13K68j1j00k00k54%M84P82P22N83N56M13n4n90
$$ 54415 54534 54710 55089 55832 56771 57484 57752 57741 57641 57441 57187 57187 57671 58453 59175 59758 60314 60727 60673 60083
51023F0083p41m19L9K93L34M06O96J079J161P21M2l13j25L16O43P87Q27P28M37
$$ 60083 59342 58923 58962 59255 59589 59995 60691 61770 62931 63652 63694 63381 63256 63572 64215 65002 65829 66557 66994
51004F6994M3k61l88l52j89qO6O5K29O69J096J106O89K40R1J68J82N3k2J27M02
$$ 66994 67037 66776 66388 66036 65847 65839 65905 65970 66199 66868 67964 69070 69759 69999 70090 70258 70440 70493 70471 70598 71000
50983G1000N72N94O41Q03Q76O37J90j80m01n97p34n44M0O49Q53O19K35o5j86o7
$$ 71000 71572 72166 72807 73610 74486 75123 75313 75133 74732 74135 73401 72857 72897 73546 74399 75018 75253 75188 75002 74935
50963G4935K55N32N26L08J56J77K26K40L63P00J091J296J289J235J274J373J421
$$ 74935 75190 75722 76248 76556 76712 76889 77115 77355 77718 78418 79509 80805 82094 83329 84603 85976 87397
50946H7397J353J197J026R01Q72R93J241J467J521J503J724K288K864L097L069
$$ 87397 88750 89947 90973 91874 92746 93739 94980 96447 97968 99471 101195 103483 106347 109444 112513
50931A12513L121L277L234K948K830L186L727M040M206M627N330N883O053O131
$$ 112513 115634 118911 122145 125093 127923 131109 134836 138876 143082 147709 153039 158922 164975 171106
50917A71106O453O947P398P836Q418R035R470R886J0773J2287J3939J5113J5731
$$ 171106 177559 184506 191904 199740 208158 217193 226663 236549 247322 259609 273548 288661 304392
50904C04392J6212J6892J7762J8654J9459K0081K0401K0416K0293K0170J9961
$$ 304392 320604 337496 355258 373912 393371 413452 433853 454269 474562 494732 514693
50893E14693J9443J8479J7064J5193J2850J0175P547N349L677K335J074j55j279
$$ 514693 534136 552615 569679 584872 597722 607897 615444 620793 624470 626805 627879 627724 626445
50880F26445k275l172l895m255m148l765l470l514l907m528n304o198p174q149
$$ 626445 624170 620998 617103 612848 608700 604935 601465 597951 594044 589516 584212 578014 570840 562691
50866E62691r047r886j0836j2079j3578j4992j5980j6548j6893j7037j6786j6175
$$ 562691 553644 543758 532922 520843 507265 492273 476293 459745 442852 425815 409029 392854
50854C92854j5602j5301j4919j3953j2508j1236j0508j0011r272q269p272o389
$$ 392854 377252 361951 347032 333079 320571 309335 298827 288816 279544 271275 264003 257614
50842B57614n536m736m123l655l113k415j703j084n07N0M33M87K94J32K27O05
$$ 257614 252078 247342 243219 239564 236451 234036 232333 231249 230742 230792 231225 231712 232006 232138 232365 232970
50826B32970J094J425J454J329J333J541J749J848K063K677L604M425M844M939
$$ 232970 234064 235489 236943 238272 239605 241146 242895 244743 246806 249483 253087 257512 262356 267295
50812B67295M944N010N166N398N679O000O419P005P700Q381R098J0099J1479J2953
$$ 267295 272239 277249 282415 287813 293492 299492 305911 312916 320616 328997 338095 348194 359673 372626
50798C72626J4155J5082J6102J7501J9225K1039K2823K4592K6439K8500L0922
$$ 372626 386781 401863 417965 435466 454691 475730 498553 523145 549584 578084 609006
50787F09006L3656L6342L8574M0280M1736M3144M4329M4939M4897M4451M3702
$$ 609006 642662 679004 717578 757858 799594 842738 887067 932006 976903 1021354 1065056
50776A065056M2285L9676L5855L1433K7021K2552J7516J1799O045J076k846n965
$$ 1065056 1107341 1147017 1182872 1214305 1241326 1263878 1281394 1293193 1299238 1300314 1297468 1291503
50764A291503q405r945j0435j0150r552q872q087p230o538o305o733p927r908
$$ 1291503 1283098 1273153 1262718 1252568 1243016 1234144 1226057 1218827 1212289 1205984 1199251 1191324 1181416
50751A181416j2580j5706j8980k2114k4988k7657l0229l2688l4903l6730l8008
$$ 1181416 1168836 1153130 1134150 1112036 1087048 1059391 1029162 996474 961571 924841 886833
50740H86833l8491l7983l6578l4602l2259k9530k6557k3743k1281j8817j5976
$$ 886833 848342 810359 773781 739179 706920 677390 650833 627090 605809 586992 571016
50729E71016j2996j0433q359o285l922j574L46J768K785L402L713L963M189M040
$$ 571016 558020 547587 539228 532943 529021 527447 527793 529561 532346 535748 539461 543424 547613 551653
50715E51653L252K079R83N4q96j854k571l012l475m218n196o203p060p633p816
$$ 551653 554905 556984 557967 558021 557125 555271 552700 549688 546213 541995 536799 530596 523536 515903 508087
50700E08087p651p325p023o821o652o355n746m756l517k244j114k33M18J076K067
$$ 508087 500436 493111 486088 479267 472615 466260 460514 455758 452241 449997 448883 448650 449068 450144 452211
50685D52211L427M785N769O444P169Q170R406J0711J1927J2984J4014J5272J6771
$$ 452211 455638 460423 466192 472636 479805 487975 497381 508092 520019 533003 547017 562289 579060
50672E79060J8207J9462K0909K2885K5020K6567K7288K7639K7981K8110K7631
$$ 579060 597267 616729 637638 660523 685543 712110 739398 767037 795018 823128 850759
50661H50759K6425K4559K2087J9092J5757J2158Q221M015r2l736o835r484j1702
$$ 850759 877184 901743 923830 942922 958679 970837 979058 983073 982981 979245 972410 962926 951224
50648I51224j3371j4322j4425j3739j2588j1354j0158q933p744o786o094n598
$$ 951224 937853 923531 909106 895367 882779 871425 861267 852334 844590 837804 831710 826112
50636H26112n477o083p442r151j0910j2795j4853j6761j8161j9063j9650j9884
$$ 826112 820635 814552 807110 797959 787049 774254 759401 742640 724479 705416 685766 665882
50624F65882j9584j8645j7106j5130j3114j1482j0140q431n893k891j46K080M079
$$ 665882 646298 627653 610547 595417 582303 570821 560681 552250 546357 543466 543320 545400 549479
50611E49479O141Q346J0716J3218J5592J7508J8889J9846K0418K0566K0360J9890
$$ 549479 555620 563966 574682 587900 603492 621000 639889 659735 680153 700719 721079 740969
50599G40969J9066J7791J6221J4631J3074J1453R825Q354P048N797M627L665K906
$$ 740969 760035 777826 794047 808678 821752 833205 843030 851384 858432 864229 868856 872521 875427
50586H75427K297J911J816J892K032K379K985L451L400L199L635M853O186P101
$$ 875427 877724 879635 881451 883343 885375 887754 890739 894190 897590 900789 904424 909277 915463 922564
50572I22564P777Q483Q972Q879Q282P450O398N058L694K633J755O72o37j754k457
$$ 922564 930341 938824 947796 956675 964957 972407 978805 983863 987557 990190 991945 992617 991980 990226 987769
50557I87769l027l781m504m538l384j199J223L033L913M201M334M349L950K966
$$ 987769 984742 980961 976457 971919 968535 967336 968559 971592 975505 979706 984040 988389 992339 995305
50543I95305J538j30j952l893n852p814r962j2520j5400j8204k0562k2466k4135
$$ 995305 996843 996713 994761 990868 985016 977202 967240 954720 939320 921116 900554 878088 853953
50530H53953k5622k6753k7384k7599k7505k6997k5936k4423k2776k1203j9711
$$ 853953 828331 801578 774194 746595 719090 692093 666157 641734 618958 597755 578044
50519E78044j8255j6841j5443j4012j2539j1021r414p719o107m739l508k194q40
$$ 578044 559789 542948 527505 513493 500954 489933 480519 472800 466693 461954 458446 456252 455412
50506D55412K69J086J951L160M572N864O970Q059R188J0248J1234J2348J3721
$$ 455412 455681 456767 458718 461878 466450 472314 479284 487343 496531 506779 518013 530361 544082
50493E44082J5171J6338J7110J7808J8896K0484K2195K3515K4218K4383K4180
$$ 544082 559253 575591 592701 610509 629405 649889 672084 695599 719817 744200 768380
50482G68380K3789K3428K3184K2826K2000K0665J9278J8421J8390J9064J9995
$$ 768380 792169 815597 838781 861607 883607 904272 923550 941971 960361 979425 999420
50471I99420K0618K0624K0245K0036K0330K0992K1740K2506K3425K4574K5854
$$ 999420 1020038 1040662 1060907 1080943 1101273 1122265 1144005 1166511 1189936 1214510 1240364
50460A240364K7013K7790K8075K8020K7766K7208K6119K4516K2540K0000J6409
$$ 1240364 1267377 1295167 1323242 1351262 1379028 1406236 1432355 1456871 1479411 1499411 1515820
50449A515820J1666O395J335l367q049j2888j7683k2078k5739k8375k9903l0567
$$ 1515820 1527486 1533881 1535216 1531849 1523800 1510912 1493229 1471151 1445412 1417037 1387134 1356567
50437A356567l0677l0237k8968k6673k3418j9439j5079j0752o786l285k52K209
$$ 1356567 1325890 1295653 1266685 1240012 1216594 1197155 1182076 1171324 1164538 1161253 1161001 1163210
50425A163210L925M820M865L902J701j812o474j1953j7765k3319k8179l2232l5494
$$ 1163210 1167135 1171955 1176820 1180722 1182423 1180611 1174137 1162184 1144419 1121100 1092921 1060689 1025195
50412A025195l7845l9169l9645l9597l9093l7953l6197l4156l2056k9772k7206
$$ 1025195 987350 948181 908536 868939 829846 791893 755696 721540 689484 659712 632506
50401F32506k4638k2475k0727j9002j6943j4593j2305j0392q867p484o027m545
$$ 632506 607868 585393 564666 545664 528721 514128 501823 491431 482564 475080 469053 464508
50389D64508l242k122r49M08J745K774L510M228N099O016O759P255P633Q094Q705
$$ 464508 461266 459144 458195 458603 460348 463122 466632 470860 475959 481975 488734 495989 503622 511716 520421
50374E20421R333R772J0061J0503J1277J2117J2571J2558J2416J2381J2299J1997
$$ 520421 529754 539526 549587 560090 571367 583484 596055 608613 621029 633410 645709 657706
50362F57706J1652J1538J1559J1453J1265J1303J1550J1624J1433J1428J1935
$$ 657706 669358 680896 692455 703908 715173 726476 738026 749650 761083 772511 784446
50351G84446J2585J2875J2949J3366J4184J4842J4944J4690J4375J3956J3291
$$ 784446 797031 809906 822855 836221 850405 865247 880191 894881 909256 923212 936503
50340I36503J2439J1457J0182Q524O660M701K413m04l473o380r148j2126j5356
$$ 936503 948942 960399 970581 979105 985765 990466 992879 992475 989002 982622 973474 961348 945992
50327I45992j8475k1197k3539k5501k6884k7539k7523k6894k5592k3630k1206
$$ 945992 927517 906320 882781 857280 830396 802857 775334 748440 722848 699218 678012
50316F78012j8543j5725j2819r980p315m833k598q00M88J420K122K432K030Q17
$$ 678012 659469 643744 630925 620945 613630 608797 606199 605399 605887 607307 609429 611861 613891 614708
50302F14708j016l179n460p730r928j1998j3777j4977j5444j5351j5039j4661
$$ 614708 613692 610513 605053 597323 587395 575397 561620 546643 531199 515848 500809 486148
50290D86148j4137j3432j2731j2256j1966j1598j0918r912q769p740p017o620
$$ 486148 472011 458579 445848 433592 421626 410028 399110 389198 380429 372689 365672 359052
50278C59052o354n935n210m274l339k522j773j000k32M01Q01J059J433K100K926
$$ 359052 352698 346763 341553 337279 333940 331418 329645 328645 328413 328814 329615 330674 332107 334207 337133
50263C37133L561L833L985M379N014N530N655N601N765O251O763O999O991P015
$$ 337133 340694 344527 348512 352891 357905 363435 369090 374691 380456 386707 393470 400469 407460 414475
50249D14475P223P498P644P640P615P592P457P125O667O161N537M724L774K794
$$ 414475 421698 429196 436840 444480 452095 459687 467144 474269 480936 487097 492634 497358 501132 503926
50235E03926J816R30L37Q6k02r47k034k930l400l736m256m924n680o668p879q843
$$ 503926 505742 506672 507009 507095 506893 505946 503912 500982 497582 493846 489590 484666 478986 472318 464439 455596
$$ [...]
##END NTUPLES=NMR SPECTRUM
##END=
