##TITLE=coffee_type TOCA01
COFFEE_meoh_noesyp64 COFFEE_meoh {C:\Bruker\TOPSPIN} Administrator 8
##JCAMPDX= 6.0         $$ Bruker NMR JCAMP-DX V2.0
##DATA TYPE= NMR SPECTRUM
##DATA CLASS= NTUPLES
##ORIGIN= Bruker BioSpin GmbH
##OWNER= Administrator
$$ 1.72 TOPSPIN		Version 2.1
$$ 2012-05-18 15:44:47.261 -0700  Administrator@X
$$ Compression mode = diff/dup
##.OBSERVE FREQUENCY= 400.13188235
##.OBSERVE NUCLEUS= ^1H
##.ACQUISITION MODE= SIMULTANEOUS (DQD)
##.ACQUISITION SCHEME= undefined
##.AVERAGES= 64
##.DIGITISER RES= 22
##SPECTROMETER/DATA SYSTEM= spect
##.PULSE SEQUENCE= noesygpps1d.comp
##.SOLVENT NAME= COFFEE_meoh
##.SHIFT REFERENCE= INTERNAL, COFFEE_meoh, 1, 14.98061
##AUDIT TRAIL= $$ (NUMBER, WHEN, WHO, WHERE, PROCESS, VERSION, WHAT)
$$ ##TITLE= Audit trail, TOPSPIN		Version 2.1
$$ ##JCAMPDX= 5.01
$$ ##ORIGIN= Bruker BioSpin GmbH
$$ ##OWNER= Administrator
$$ $$ C:\Bruker\TOPSPIN/data/Administrator/nmr/12-COFFEE-2302/92/pdata/1/auditp.txt
$$ ##AUDIT TRAIL=  $$ (NUMBER, WHEN, WHO, WHERE, PROCESS, VERSION, WHAT)
(   1,<2012-02-23 21:59:15.656 -0500>,<Administrator>,<TOPSPIN>,<go>,<TOPSPIN 2.1>,
      <created by zg
	started at 2012-02-23 21:47:45.422 -0500,
	POWCHK enabled, PULCHK disabled,
       configuration hash MD5:
       B0 76 FB 9C 50 81 44 7D 18 B3 26 32 4E 60 AD 96
       data hash MD5: 64K
       F6 24 41 42 94 03 F4 D4 0D CB 64 E9 A2 90 37 50>)
(   2,<2012-02-23 21:59:18.297 -0500>,<Administrator>,<TOPSPIN>,<proc1d>,<TOPSPIN 2.1>,
      <Start of raw data processing
       efp LB = 0.3 FT_mod = 6 PKNL = 1 PHC0 = 0 PHC1 = 0 SI = 128K 
       data hash MD5: 128K
       28 7D F9 6B A3 EE 36 AA 42 C3 A3 6C 5E 9B E6 65>)
(   3,<2012-02-23 21:59:19.781 -0500>,<Administrator>,<TOPSPIN>,<proc1d>,<TOPSPIN 2.1>,
      <pk PHC0 = 23.79089 PHC1 = 0 
       data hash MD5: 128K
       0B 2F FA D1 91 7E C6 9B 0D A1 9C 3A AB 7B B5 AC>)
(   4,<2012-02-23 21:59:20.031 -0500>,<Administrator>,<TOPSPIN>,<proc1d>,<TOPSPIN 2.1>,
      <abs ABSG = 1 
       data hash MD5: 128K
       C1 03 07 68 62 9B CD AA BA D7 14 8F 3A 18 DC 08>)
(   5,<2012-02-23 21:59:20.109 -0500>,<Administrator>,<TOPSPIN>,<proc1d>,<TOPSPIN 2.1>,
      <abs ABSG = 2 
       data hash MD5: 128K
       D8 47 45 AF FF 5C 62 94 33 2B 31 E4 72 1A 94 36>)
(   6,<2012-02-23 21:59:20.172 -0500>,<Administrator>,<TOPSPIN>,<proc1d>,<TOPSPIN 2.1>,
      <abs ABSG = 3 
       data hash MD5: 128K
       7F 8A E0 FD 20 BB 41 D8 42 F6 7B 46 1B 1C 83 49>)
(   7,<2012-02-23 21:59:20.234 -0500>,<Administrator>,<TOPSPIN>,<proc1d>,<TOPSPIN 2.1>,
      <abs ABSG = 4 
       data hash MD5: 128K
       35 A0 96 1E 74 DE 71 BF 24 2D 22 56 45 00 47 AF>)
(   8,<2012-02-23 21:59:20.281 -0500>,<Administrator>,<TOPSPIN>,<proc1d>,<TOPSPIN 2.1>,
      <abs ABSG = 5 
       data hash MD5: 128K
       70 4F DD 89 A0 45 A0 D9 87 82 F3 99 0A 72 E3 B8>)
(   9,<2012-02-23 21:59:20.406 -0500>,<Administrator>,<TOPSPIN>,<audit>,<TOPSPIN 2.1>,
      <user comment:
       ICON-NMR User ID: Administrator
$$ [...]
150 150 150 150 150 150 150 150
##$TP07= 0
##$TPNAME0= <>
##$TPNAME1= <>
##$TPNAME2= <>
##$TPNAME3= <>
##$TPNAME4= <>
##$TPNAME5= <>
##$TPNAME6= <>
##$TPNAME7= <>
##$TPOAL= (0..7)
0.5 0.5 0.5 0.5 0.5 0.5 0.5 0.5
##$TPOFFS= (0..7)
0 0 0 0 0 0 0 0
##$TUNHIN= 0
##$TUNHOUT= 0
##$TUNXOUT= 0
##$USERA1= <user>
##$USERA2= <user>
##$USERA3= <user>
##$USERA4= <user>
##$USERA5= <user>
##$V9= 5
##$VALIST= <valist>
##$VCLIST= <CCCCCCCCCCCCCCC>
##$VD= 0
##$VDLIST= <DDDDDDDDDDDDDDD>
##$VPLIST= <PPPPPPPPPPPPPPP>
##$VTLIST= <TTTTTTTTTTTTTTT>
##$WBST= 1024
##$WBSW= 4
##$XGAIN= (0..3)
0 0 0 0
##$XL= 0
##$YL= 0
##$YMAX_a= 15483659
##$YMIN_a= -7155381
##$ZGOPTNS= <>
##$ZL1= 120
##$ZL2= 120
##$ZL3= 120
##$ZL4= 120
##$ABSF1= 14.98061
##$ABSF2= -5.57192
##$ABSG= 5
##$ABSL= 3
##$ALPHA= 0
##$AQORDER= 0
##$ASSFAC= 0
##$ASSFACI= 0
##$ASSFACX= 0
##$ASSWID= 0
##$AUNMP= <proc_prof1d_extract>
##$AXLEFT= 0
##$AXNAME= <>
##$AXNUC= <1H>
##$AXRIGHT= 0
##$AXTYPE= 0
##$AXUNIT= <>
##$AZFE= 0.1
##$AZFW= 0.1
##$BCFW= 0
##$BC_mod= 0
##$BYTORDP= 0
##$COROFFS= 0
##$CY= 15
##$DATMOD= 1
##$DC= 0
##$DFILT= <>
##$DTYPP= 0
##$F1P= 0
##$F2P= 0
##$FCOR= 0.5
##$FTSIZE= 131072
##$FT_mod= 6
##$GAMMA= 0
##$GB= 0
##$INTBC= 1
##$INTSCL= 1
##$ISEN= 128
##$LB= 0.3
##$LEV0= 0
##$LPBIN= 0
##$MAXI= 10000
##$MC2= 0
##$MEAN= 0
##$ME_mod= 0
##$MI= 0
##$NCOEF= 0
##$NC_proc= -3
##$NLEV= 6
##$NOISF1= 0
##$NOISF2= 0
##$NSP= 0
##$NTH_PI= 0
##$NZP= 0
##$OFFSET= 14.98061
##$PC= 1
##$PHC0= 23.79089
##$PHC1= 0
##$PH_mod= 1
##$PKNL= yes
##$PPARMOD= 0
##$PPDIAG= 0
##$PPIPTYP= 0
##$PPMPNUM= 2147483647
##$PPRESOL= 1
##$PSCAL= 4
##$PSIGN= 0
##$PYNMP= <proc.py>
##$REVERSE= no
##$SF= 400.13
##$SI= 131072
##$SIGF1= 0
##$SIGF2= 0
##$SINO= 400
##$SIOLD= 131072
##$SPECTYP= <>
##$SREGLST= <1H.CDCl3>
##$SSB= 0
##$STSI= 131072
##$STSR= 0
##$SW_p= 8223.68421052632
##$SYMM= 0
##$S_DEV= 0
##$TDeff= 65536
##$TDoff= 0
##$TI= <>
##$TILT= no
##$TM1= 0
##$TM2= 0
##$TOPLEV= 0
##$USERP1= <user>
##$USERP2= <user>
##$USERP3= <user>
##$USERP4= <user>
##$USERP5= <user>
##$WDW= 1
##$XDIM= 131072
##$YMAX_p= 520409141
##$YMIN_p= -267061487
##$CURPLOT= <Network HP LaserJet P1505>
##$CURPRIN= <$Network HP LaserJet P1505>
##$DFORMAT= <normdp>
##$LAYOUT= <+/1D_H.xwp>
##$LFORMAT= <normlp>
##$PFORMAT= <normpl>
##$SURQMSG= 1
$$ End of Bruker specific parameters
$$ ---------------------------------
##NTUPLES= NMR SPECTRUM
##VAR_NAME=  FREQUENCY,     SPECTRUM/REAL,   SPECTRUM/IMAG
##SYMBOL=    X,             R,               I
##VAR_TYPE=  INDEPENDENT,   DEPENDENT,       DEPENDENT
##VAR_FORM=  AFFN,          ASDF,            ASDF
##VAR_DIM=   131072,        131072,          131072
##UNITS=     HZ,            ARBITRARY UNITS, ARBITRARY UNITS
##FACTOR=    0.0627417313425165, 1,          1
##FIRST=     8223.62146879498, 2961,         -93403
##LAST=      0,             6559,            -92916
##MIN=       0,             -267061487,      0
##MAX=       8223.62146879498, 520409141,    0
$$ Real data points
##PAGE= N=1
##DATA TABLE= (X++(R..R)), XYDATA
$$ [...]
$$ plain form
60620 1399467 1377780 1357634 1339920 1324061 1308349 1291817 1275559 1261921 1252543 1247125 1243774 1240569
60608 1240569 1237082 1234328 1233185 1233432 1234741 1237738 1242898 1248879 1253466 1256365 1259714 1265356 1272777 1280307
60594 1280307 1287234 1293876 1300459 1307055 1314067 1321715 1329412 1336556 1343747 1352152 1361675 1370694 1377790 1383044
60580 1383044 1387530 1392337 1398381 1406370 1416362 1427771 1440115 1453349 1467289 1481494 1496213 1512689
60568 1512689 1531691 1552343 1573355 1594865 1617794 1641614 1664317 1684870 1704179 1723013 1740408
60557 1740408 1755106 1767190 1776883 1782719 1782870 1778032 1771284 1764886 1758541 1750966 1741727 1731112 1719597
60544 1719597 1708284 1698848 1692056 1686794 1681164 1674059 1665363 1655411 1644909 1634680 1624751 1614216 1602696
60531 1602696 1591393 1581857 1574145 1567187 1560765 1556149 1554632 1556211 1559977 1565135 1571162 1577341 1582737 1586727
$$ packed form
60620A399467k1687k0146j7714j5859j5712j6532j6258j3638r378n418l351l205
60608A240569l487k754j143K47J309K997N160N981M587K899L349N642P421P530
60594A280307O927O642O583O596P012P648P697P144P191Q405R523R019P096N254
60580A383044M486M807O044P989R992J1409J2344J3234J3940J4205J4719J6476
60568A512689J9002K0652K1012K1510K2929K3820K2703K0553J9309J8834J7395
60557A740408J4698J2084R693N836J51m838o748o398o345p575r239j0615j1515
60544A719597j1313r436o792n262n630p105q696r952j0502j0229r929j0535j1520
60531A602696j1303r536p712o958o422m616j517J579L766N158O027O179N396L990
$$ plain form
60517 1586727 1589326 1590897 1591785 1592461 1593705 1596010 1598727 1600587 1601526 1603273 1607195 1612079 1615126 1614977 1612695
60502 1612695 1609867 1607056 1604270 1601536 1598267 1593182 1585798 1577414 1569973 1564377 1560296 1557007 1554081 1552036
60488 1552036 1552700 1557943 1567507 1579064 1591167 1605240 1623814 1647738 1676124 1708161 1743718 1782725
60476 1782725 1825251 1871918 1923149 1978148 2035218 2092362 2146561 2193358 2228836 2251938 2263597
60465 2263597 2264134 2253304 2232976 2207808 2182423 2159069 2138637 2122585 2112742 2110027 2114358 2125334
60453 2125334 2142119 2163111 2186784 2213027 2242965 2277226 2314756 2353646 2393027 2434057 2479106
60442 2479106 2530213 2588448 2654401 2728619 2811376 2902763 3003699 3116583 3244277 3388422
60432 3388422 3549230 3726889 3922777 4139234 4378562 4642313 4931370 5246634 5589680
$$ packed form
60517A586727K599J571Q88O76J244K305K717J860R39J747L922M884L047j49k282
60502A612695k828k811k786k734l269n085p384q384p441n596m081l289k926k045
60488A552036O64N243R564J1557J2103J4073J8574K3924K8386L2037L5557L9007
60476A782725M2526M6667N1231N4999N7070N7144N4199M6797L5478K3102J1659
60465B263597N37j0830k0328k5168k5385k3354k0432j6052r843k715M331J0976
60453B125334J6785K0992K3673K6243K9938L4261L7530L8890L9381M1030M5049
60442B479106N1107N8235O5953P4218Q2757R1387J00936J12884J27694J44145
60432C388422J60808J77659J95888K16457K39328K63751K89057L15264L43046
$$ plain form
60423 5589680 5962436 6365804 6798152 7254084 7722726 8185581 8616232 8983763 9258561
60414 9258561 9417470 9446949 9344640 9119479 8789927 8380751 7919343 7431933 6940141 6459312
60404 6459312 5999374 5566679 5164935 4795431 4457803 4151028 3873521 3622851 3396339
60395 3396339 3192096 3008933 2845364 2699269 2568562 2451640 2347133 2253594 2169414 2092731
60385 2092731 2021703 1955319 1893760 1837450 1785933 1738098 1693156 1650799 1610659 1572308 1535695
60374 1535695 1500976 1468106 1437176 1408938 1384304 1363356 1345392 1329776 1316215 1304506 1294651
60363 1294651 1286952 1281267 1276434 1271208 1265536 1260118 1255099 1250249 1246331 1244935 1246645 1250210 1253883 1256868
60349 1256868 1259263 1261382 1263513 1265751 1267853 1269627 1271406 1273610 1276021 1278350 1281347 1286250 1292968 1299828
$$ packed form
60423E589680L72756M03368M32348M55932M68642M62855M30651L67531K74798
60414I258561J58909K9479j02309k25161l29552m09176m61408m87410m91792m80829
60404F459312m59938m32695m01744l69504l37628l06775k77507k50670k26512
60395C396339k04243j83163j63569j46095j30707j16922j04507r3539q4180p6683
60385B092731p1028o6384o1559n6310n1517m7835m4942m2357m0140l8351l6613
60374A535695l4719l2870l0930k8238k4634k0948j7964j5616j3561j1709r855
60363A294651p699n685m833n226n672n418n019m850l918j396J710L565L673K985
60349A256868K395K119K131K238K102J774J779K204K411K329K997M903O718O860
$$ plain form
60335 1299828 1305434 1309893 1313880 1317560 1321046 1325106 1330635 1337746 1345746 1353497 1359623 1363164 1364616 1365741
60321 1365741 1367732 1369964 1371022 1370459 1368978 1367306 1365629 1364046 1362907 1362495 1362561 1362399 1361474 1360076 1359176 1359491
60305 1359491 1360922 1363180 1366546 1371293 1376630 1381138 1384429 1387690 1392394 1399041 1407221 1416124 1424762 1432437
60291 1432437 1439559 1447528 1457440 1469109 1481460 1493486 1504781 1515659 1526844 1538492 1549529 1558574
60279 1558574 1565538 1571552 1577210 1581777 1584384 1585175 1584895 1584203 1583724 1583860 1584039 1583100 1581183 1580423 1582861 1588295
60263 1588295 1594972 1601783 1608688 1615417 1620936 1624263 1624906 1622516 1616993 1609221 1601057 1594256 1589593 1586871
60249 1586871 1585197 1583238 1579988 1575771 1572186 1570632 1571045 1572258 1573456 1574858 1577076 1580282 1584393 1589794
60235 1589794 1597207 1606671 1617197 1627819 1638520 1649527 1660119 1669104 1676470 1683591 1691544 1700036 1708418
$$ packed form
60335A299828N606M459L987L680L486M060N529P111Q000P751O126L541J452J125
60321A365741J991K232J058n63j481j672j677j583j139m12O6j62r25j398r00L15
60305A359491J431K258L366M747N337M508L291L261M704O647Q180Q903Q638P675
60291A432437P122P969R912J1669J2351J2026J1295J0878J1185J1648J1037R045
60279A558574O964O014N658M567K607P91k80o92m79J36J79r39j917p60K438N434
60263A588295O677O811O905O729N519L327O43k390n523p772q164o801m663k722
60249A586871j674j959l250m217l585j554M13J213J198J402K218L206M111N401
60235A589794P413R464J0526J0622J0701J1007J0592Q985P366P121P953Q492Q382
$$ plain form
60222 1708418 1716841 1725671 1734487 1742710 1750935 1760540 1771766 1783165 1793488 1803509 1815320 1830124
60210 1830124 1847412 1866220 1886416 1908499 1932922 1960227 1991406 2027195 2067054 2109642 2154406
60199 2154406 2201985 2253051 2307788 2366864 2431657 2502646 2578514 2658127 2742840 2835520 2937609
60188 2937609 3048449 3167453 3295406 3433147 3580214 3735707 3899876 4074042 4259038
60179 4259038 4454056 4656841 4864728 5075496 5287089 5496465 5699196 5890812 6068445
60170 6068445 6230784 6376831 6505382 6615437 6706239 6776954 6826967 6856554 6866752 6858893 6834984
60159 6834984 6798291 6752760 6702049 6649745 6599917 6556353 6521640 6498046 6488623 6495928 6520128 6560286
60147 6560286 6617387 6694044 6791077 6906619 7039110 7188791 7355087 7534591 7723087 7917735
$$ packed form
60222A708418Q423Q830Q816Q223Q225R605J1226J1399J0323J0021J1811J4804
60210A830124J7288J8808K0196K2083K4423K7305L1179L5789L9859M2588M4764
60199B154406M7579N1066N4737N9076O4793P0989P5868P9613Q4713R2680J02089
60188B937609J10840J19004J27953J37741J47067J55493J64169J74166J84996
60179D259038J95018K02785K07887K10768K11593K09376K02731J91616J77633
60170F068445J62339J46047J28551J10055R0802P0715N0013K9587J0198p859k3909
60159F834984l6693m5531n0711n2304m9828m3564l4713k3594r423P305K4200M0158
60147F560286N7101P6657R7033J15542J32491J49681J66296J79504J88496J94648
$$ plain form
60137 7917735 8115551 8311257 8498753 8673778 8833468 8974258 9092263 9185211 9252157 9291662
60127 9291662 9302049 9283325 9237226 9165488 9069908 8954468 8825773 8690575 8553641 8418318
60117 8418318 8288118 8167228 8060083 7970742 7902016 7854976 7829836 7827451 7849295 7895900 7965982
60106 7965982 8057244 8167269 8293210 8431158 8576163 8722640 8864683 8996603 9113889 9213980
60096 9213980 9296325 9361626 9410601 9443097 9458756 9459016 9448196 9432057 9415518 9402335 9396617 9403442
60084 9403442 9427525 9471839 9537902 9627030 9741055 9882357 10053839 10258807 10500279 10779948
60074 10779948 11097849 11453261 11846181 12277785 12749243 13260074 13807703 14388159 14996489
60065 14996489 15626438 16270375 16919917 17566124 18198786 18806072 19375665 19896482 20359406
$$ packed form
60137G917735J97816J95706J87496J75025J59690J40790J18005R2948O6946L9505
60127I291662J0387j8724m6099p1738r5580j15440j28695j35198j36934j35323
60117H418318j30200j20890j07145q9341o8726m7040k5140k385K1844M6605P0082
60106G965982R1262J10025J25941J37948J45005J46477J42043J31920J17286J00091
60096I213980Q2345O5301M8975L2496J5659K60j0820j6139j6539j3183n718O825
60084I403442K4083M4314O6063Q9128J14025J41302J71482K04968K41472K79669
60074A0779948L17901L55412L92920M31604M71458N10831N47629N80456O08330
60065A4996489O29949O43937O49542O46207O32662O07286N69593N20817M62924
$$ plain form
60056 20359406 20756885 21082334 21329871 21494364 21571731 21559306 21456068 21263105 20984681 20629078
60046 20629078 20207897 19734312 19222127 18685963 18140859 17600600 17076324 16576747 16109160
60037 16109160 15680055 15295323 14960165 14678421 14451784 14279981 14161511 14093608 14071823 14090878
60027 14090878 14146111 14232931 14344572 14471556 14603857 14732484 14848751 14944040 15011893 15049395
60017 15049395 15055158 15026805 14961870 14860515 14725793 14561378 14370232 14155212 13919517 13666180
60007 13666180 13397949 13117918 12829779 12537554 12245521 11958139 11679476 11412966 11162030
59998 11162030 10930223 10720157 10533050 10370179 10233945 10126350 10047249 9995608 9972117 9978960
59988 9978960 10017040 10084856 10180120 10300848 10444262 10605869 10780372 10962692 11147430 11327898
$$ packed form
60056B0359406L97479L25449K47537J64493P7367j2425j03238j92963k78424l55603
60046B0629078m21181m73585n12185n36164n45104n40259n24276m99577m67587
60037A6109160m29105l84732l35158k81744k26637j71803j18470o7903k1785J9055
60027A4090878N5233Q6820J11641J26984J32301J28627J16267R5289O7853L7502
60017A5049395N763k8353o4935j01355j34722j64415j91146k15020k35695k53337
60007A3666180k68231k80031k88139k92225k92033k87382k78663k66510k50936
59998A1162030k31807k10066j87107j62871j36234j07595p9101n1641k3491O843
59988I978960L8080O7816R5264J20728J43414J61607J74503J82320J84738J80468
$$ plain form
59978 11327898 11496464 11645863 11770276 11865598 11928921 11957654 11949421 11903282 11820780 11705182
59968 11705182 11559799 11387739 11193129 10981800 10760592 10536367 10315404 10102779 9901960
59959 9901960 9715341 9545214 9394025 9264018 9157314 9076147 9022289 8996234 8997579 9026353
59949 9026353 9083544 9170326 9287191 9433804 9609302 9812596 10042261 10295667 10567954 10852396
59939 10852396 11142062 11430545 11710868 11974820 12214355 12423127 12596081 12728608 12817455
59930 12817455 12861944 12863102 12821982 12739867 12619590 12465424 12282119 12075396 11852928 11623257
59920 11623257 11393777 11170884 10961370 10771590 10605143 10463334 10348333 10264088 10213449 10196032
59910 10196032 10209823 10253404 10325603 10424264 10546820 10691368 10855985 11037290 11230595 11431133
$$ packed form
59978A1327898J68566J49399J24413R5322O3323K8733q233m6139q2502j15598
59968A1705182j45383j72060j94610k11329k21208k24225k20963k12625k00819
59959I901960j86619j70127j51189j30007j06704q1167n3858k6055J345K8774
59949I026353N7191Q6782J16865J46613J75498K03294K29665K53406K72287K84442
59939A0852396K89666K88483K80323K63952K39535K08772J72954J32527Q8847
59930A2817455M4489J158m1120q2115j20277j54166j83305k06723k22468k29671
59920A1623257k29480k22893k09514j89780j66447j41809j15001q4245n0639j7417
59910A0196032J3791M3581P2199R8661J22556J44548J64617J81305J93305K00538
$$ plain form
59900 11431133 11634563 11836674 12033481 12221628 12398343 12561185 12708228 12838501 12952329
59891 12952329 13051527 13139049 13217885 13290324 13358985 13428472 13505214 13595516 13704647 13838008 14002204
59880 14002204 14204171 14449483 14741669 15082632 15473557 15915838 16411006 16958844 17555088
59871 17555088 18191349 18856979 19539874 20225057 20893355 21522218 22087585 22565444 22933655
59862 22933655 23174696 23278052 23240967 23067917 22769650 22361829 21863521 21296110 20682192
59853 20682192 20043443 19398236 18761072 18143850 17556764 17008058 16504146 16050433 15651078
59844 15651078 15307577 15018809 14783551 14602441 14476784 14406031 14387340 14417314 14493260 14612583
59834 14612583 14771289 14963096 15179723 15411880 15649756 15882308 16096344 16277047 16409828
$$ packed form
59900A1431133K03430K02111J96807J88147J76715J62842J47043J30273J13828
59891A2952329R9198Q7522P8836P2439O8661O9487P6742R0302J09131J33361J64196
59880A4002204K01967K45312K92186L40963L90925M42281M95168N47838N96244
59871A7555088O36261O65630O82895O85183O68298O28863N65367M77859L68211
59862B2933655K41041J03356l7085j73050k98267m07821m98308n67411o13918
59853B0682192o38749o45207o37164o17222n87086n48706n03912m53713l99355
59844A5651078l43501k88768k35258j81110j25657p0753j8691K9974P5946J19323
59834A4612583J58706J91807K16627K32157K37876K32552K14036J80703J32781
$$ plain form
59825 16409828 16481970 16483598 16408663 16255627 16026760 15726763 15362691 14944844 14486120 13999495
59815 13999495 13496386 12987321 12482663 11991402 11519599 11070803 10647837 10253651 9890694
59806 9890694 9560015 9261066 8992175 8751179 8535656 8342607 8168435 8009735 7863831
59797 7863831 7728005 7598735 7472814 7349215 7228940 7113026 7001733 6895816 6797346 6708662
59787 6708662 6631160 6565323 6510933 6466676 6430143 6398593 6369045 6337588 6299798 6252655 6195613
59776 6195613 6129541 6055601 5975668 5892915 5810921 5732333 5658724 5591340 5531655 5481583 5443136
59765 5443136 5417192 5402597 5397525 5402087 5418680 5449398 5493916 5550315 5616805 5691960 5774353 5863167
59753 5863167 5958753 6061832 6172279 6288894 6409621 6531407 6650419 6762925 6865655 6955428
$$ packed form
59825A6409828P2142J628p4935j53036k28867k99997l64072m17847m58724m86625
59815A3999495n03109n09065n04658m91261m71803m48796m22966l94186l62957
59806I890694l30679k98949k68891k40996k15523j93049j74172j58700j45904
59797G863831j35826j29270j25921j23599j20275j15914j11293j05917r8470q8684
59787F708662p7502o5837n4390m4257l6533l1550k9548l1457l7790m7143n7042
59776F195613o6072p3940p9933q2753q1994p8588p3609o7384n9685n0072l8447
59765E443136k5944j4595n072M562J6593L0718M4518N6399O6490P5155Q2393Q8814
59753E863167R5586J03079J10447J16615J20727J21786J19012J12506J02730Q9773
$$ plain form
59743 6955428 7029686 7088132 7133175 7168214 7196141 7219812 7242827 7268835 7300627 7340480 7390803
59732 7390803 7453898 7531786 7626803 7741646 7878503 8039135 8226289 8443916 8695326 8982391
59722 8982391 9307417 9674385 10086985 10546237 11051093 11599711 12187465 12802977 13426450
59713 13426450 14030843 14583423 15048042 15390596 15586871 15628502 15524504 15298719 14983841
59704 14983841 14613286 14214807 13809245 13412725 13037868 12693240 12383783 12112736 11882455
59695 11882455 11693619 11545312 11436835 11368621 11340844 11352002 11399651 11481972 11598026 11747005
59685 11747005 11928120 12141164 12386538 12664655 12975871 13321314 13703320 14124378 14585598
59676 14585598 15086978 15629693 16217513 16855144 17545572 18290011 19090185 19949107 20869100
$$ packed form
59743F955428P4258N8446M5043L5039K7927K3671K3015K6008L1792L9853N0323
59732G390803O3095P7888R5017J14843J36857J60632J87154K17627K51410K87065
59722H982391L25026L66968M12600M59252N04856N48618N87754O15512O23473
59713A3426450O04393N52580M64619L42554J96275M1631j03998k25785l14878
59704A4983841l70555l98479m05562l96520l74857l44628l09457k71047k30281
59695A1882455j88836j48307j08477o8214k7777J1158M7649Q2321J16054J48979
59685A1747005J81115K13044K45374K78117L11216L45443L82006M21058M61220
59676A4585598N01380N42715N87820O37631O90428P44439Q00174Q58922R19993
$$ plain form
59667 20869100 21850111 22890237 23986245 25132174 26318063 27531060 28757328 29982257
59659 29982257 31190037 32365170 33495403 34573671 35598654 36575070 37513524 38428910
59651 38428910 39338022 40257640 41202809 42184653 43208743 44274977 45377740 46505105 47638427
59642 47638427 48753946 49825282 50824851 51724818 52499346 53127814 53597441 53904987 54057445
59633 54057445 54070688 53966255 53769046 53507282 53212096 52914381 52641366 52416295 52260077
59624 52260077 52191528 52226378 52377446 52655717 53070314 53627976 54333720 55191221 56200652
59615 56200652 57355714 58643116 60043166 61527700 63056437 64576516 66025767 67335718
59607 67335718 68433530 69247002 69713861 69790702 69457634 68719797 67607239 66171351 64477071
$$ packed form
59667B0869100R81011J040126J096008J145929J185889J212997J226268J224929
59659B9982257J207780J175133J130233J078268J024983R76416R38454R15386
59651C8428910R09112R19618R45169R81844J024090J066234J102763J127365J133322
59642D7638427J115519J071336R99569Q99967P74528O28468M69627L07546J52458
59633E4057445J3243j04433j97209k61764k95186k97715k73015k25071j56218
59624E2260077o8549L4850J51068K78271M14597N57662P05744Q57501J009431
59615E6200652J155062J287402J400050J484534J528737J520079J449251J309951
59607F7335718J097812Q13472M66859P6841l33068p37837j112558j435888j694280
$$ plain form
59598 64477071 62594401 60592656 58536564 56482248 54474070 52543805 50710723 48980762
59590 48980762 47345976 45786154 44272113 42769684 41245590 39675807 38052539 36384837
59582 36384837 34693063 33002250 31337741 29722181 28172705 26699748 25308799 24003103
59574 24003103 22784320 21651425 20600744 19628015 18729992 17903718 17145173 16449654 15812987
59565 15812987 15231236 14699498 14212463 13766530 13360100 12991308 12656656 12352631 12077305
59556 12077305 11828931 11603606 11395739 11200460 11014368 10834180 10656119 10476950 10294673
59547 10294673 10107907 9915428 9716694 9512407 9304418 9095482 8888883 8687427 8492512
59538 8492512 8304587 8124666 7954915 7797660 7654215 7524838 7409595 7309048 7224093 7155067
$$ packed form
59598F4477071j882670k001745k056092k054316k008178j930265j833082j729961
59590D8980762j634786j559822j514041j502429j524094j569783j623268j667702
59582C6384837j691774j690813j664509j615560j549476j472957j390949j305696
59574B4003103j218783j132895j050681r72729q98023q26274p58545o95519o36667
59565A5812987n81751n31738m87035m45933m06430l68792l34652l04025k75326
59556A2077305k48374k25325k07867j95279j86092j80188j78061j79169j82277
59547A0294673j86766j92479j98734k04287k07989k08936k06599k01456j94915
59538H492512j87925j79921j69751j57255j43445j29377j15243j00547q4955o9026
$$ plain form
59528 7155067 7101214 7061293 7034505 7020156 7016701 7022345 7036785 7061005 7094718 7135427 7180992 7231667
59516 7231667 7288103 7348726 7411252 7476129 7546182 7622933 7705439 7793182 7888176 7993452 8111025
59505 8111025 8242336 8389442 8554467 8738274 8940394 9160197 9398111 9656220 9937619
59496 9937619 10244477 10576744 10933452 11315100 11723682 12160327 12623939 13112097 13621781
59487 13621781 14148721 14687287 15231878 15777539 16318602 16847702 17357261 17841730 18297985
59478 18297985 18724283 19119607 19483499 19815368 20113589 20375727 20600285 20788863 20947077
59469 20947077 21083301 21206035 21322359 21438726 21562171 21699354 21854153 22026404 22212233
59460 22212233 22404231 22591265 22759325 22893082 22976492 22993192 22929003 22775422 22530001 22193114
$$ packed form
59528G155067n3853l9921k6788j4349l455N644J4440K4220L3713M0709M5565N0675
59516G231667N6436O0623O2526O4877P0053P6751Q2506Q7743R4994J05276J17573
59505H111025J31311J47106J65025J83807K02120K19803K37914K58109K81399
59496I937619L06858L32267L56708L81648M08582M36645M63612M88158N09684
59487A3621781N26940N38566N44591N45661N41063N29100N09559M84469M56255
59478A8297985M26298L95324L63892L31869K98221K62138K24558J88578J58214
59469B0947077J36224J22734J16324J16367J23445J37183J54799J72251J85829
59460B2212233J91998J87034J68060J33757Q3410J6700o4189j53581k45421l36887
$$ plain form
59450 22193114 21765952 21252797 20663992 20014889 19321710 18598916 17859678 17117172 16384507
59441 16384507 15673564 14993866 14352098 13752424 13197239 12687709 12223951 11805224 11430171
59432 11430171 11096739 10802162 10543776 10320227 10131552 9977769 9857574 9768593 9708897 9678254
59422 9678254 9677885 9708698 9769653 9858194 9972579 10113399 10282578 10481541 10710830 10970625
59412 10970625 11260413 11578315 11921558 12287194 12671158 13066612 13464186 13853821 14225514
59403 14225514 14568380 14870260 15118808 15302654 15412027 15439727 15382392 15240804 15019316 14725624
59393 14725624 14370396 13965606 13522660 13052398 12565993 12074106 11584935 11104266 10637372
59384 10637372 10189431 9763936 9362338 8985771 8635709 8312254 8013235 7736254 7480908
$$ packed form
59450B2193114m27162n13155n88805o49103o93179p22794p39238p42506p32665
59441A6384507p10943o79698o41768n99674n55185n09530m63758m18727l75053
59432A1430171l33432k94577k58386k23549j88675j53783j20195q8981n9696l0643
59422I678254l69L0813O0955Q8541J14385J40820J69179J98963K29289K59795
59412A0970625K89788L17902L43243L65636L83964L95454L97574L89635L71693
59403A4225514L42866L01880K48548J83846J09373K7700n7335j41588k21488k93692
59393A4725624l55228m04790m42946m70262m86405m91887m89171m80669m66894
59384A0637372m47941m25495m01598l76567l50062l23455k99019k76981k55346
$$ plain form
59375 7480908 7248293 7039010 6852362 6686702 6539828 6409597 6294902 6195749 6112125 6043272
59365 6043272 5988282 5946607 5917662 5900617 5894877 5899955 5914613 5937015 5966266 6003017 6048214 6102072
59353 6102072 6164798 6237354 6320559 6413517 6513164 6615173 6715773 6814028 6912921 7017674 7132852
59342 7132852 7261616 7407091 7572541 7759718 7968412 8198059 8448169 8716591 8999563
59333 8999563 9295694 9609457 9949585 10324467 10739801 11199324 11705802 12261224 12867420
59324 12867420 13526980 14243080 15018204 15852858 16744545 17686936 18669967 19680862 20704640
59315 20704640 21723772 22719051 23672536 24570080 25401239 26158138 26835918 27433903 27954978
59306 27954978 28403231 28782181 29094511 29342101 29525485 29643151 29691465 29665633 29561372 29376126
$$ packed form
59375G480908k32615k09283j86648j65660j46874j30231j14695r9153q3624o8853
59365F043272n4990m1675k8945j7045n740N078J4658K2402K9251L6751M5197N3858
59353F102072O2726P2556Q3205R2958R9647J02009J00600R8255R8893J04753J15178
59342G132852J28764J45475J65450J87177K08694K29647K50110K68422K82972
59333H999563K96131L13763L40128L74882M15334M59523N06478N55422O06196
59324A2867420O59560P16100P75124Q34654Q91687R42391R83031J010895J023778
59315B0704640J019132R95279R53485Q97544Q31159P56899O77780N97985N21075
59306B7954978M48253L78950L12330K47590J83384J17666M8314k5832j04261j85246
$$ plain form
59296 29376126 29109125 28761436 28337449 27846447 27301453 26715853 26101324 25468269 24825910
59287 24825910 24180365 23533038 22881563 22222053 21550788 20865594 20167120 19458623 18744225
59278 18744225 18028244 17316513 16616786 15936446 15280358 14651845 14054764 13493202 12969410
59269 12969410 12483333 12034294 11622311 11247670 10909860 10607138 10337072 10097677 9888105
59260 9888105 9707816 9555044 9426726 9320233 9234641 9170104 9126582 9103398 9099423 9113515 9145348
59249 9145348 9195647 9264631 9350299 9449435 9560127 9681482 9810553 9941707 10070296 10195386
59239 10195386 10317399 10434309 10541632 10635237 10712728 10773021 10816511 10845621 10864013 10875125
59229 10875125 10881962 10887536 10894642 10905824 10924500 10955400 11002795 11068778 11154137 11260131 11388059
$$ packed form
59296B9376126k67001l47689m23987m91002n44994n85600o14529o33055o42359
59287B4825910o45545o47327o51475o59510o71265o85194o98474p08497p14398
59278A8744225p15981p11731o99727o80340o56088o28513n97081n61562n23792
59269A2969410m86077m49039m11983l74641l37810l02722k70066k39395k09572
59260I888105j80289j52772j28318j06493q5592o4537m3522k3184l975J4092L1833
59249I145348N0299O8984Q5668R9136J10692J21355J29071J31154J28589J25090
59239A0195386J22013J16910J07323R3605P7491O0293M3490K9110J8392J1112
59229A0875125O837N574P106J1182J8676L0900M7395O5983Q5359J05994J27928
$$ plain form
59218 11388059 11537496 11706140 11891018 12088708 12294585 12503029 12708431 12905341 13087916
59209 13087916 13250122 13386468 13492097 13562685 13595108 13588228 13542822 13461641 13350390 13218029
59199 13218029 13074868 12930012 12790420 12661252 12545954 12446293 12363026 12296330 12245363 12208204
59189 12208204 12182779 12167227 12158992 12154777 12152249 12150879 12150408 12149697 12148306 12148280 12153193 12166292 12190817 12231297
59175 12231297 12292972 12380330 12497332 12648528 12838625 13071366 13349848 13677205 14055328 14482926
59165 14482926 14955602 15467098 16008852 16568210 17128053 17668194 18166956 18602695 18955768
59156 18955768 19209582 19349900 19364747 19246958 18996897 18622122 18135202 17552759 16895095
59147 16895095 16183993 15439898 14681250 13925062 13185995 12474655 11797888 11160408 10565132
$$ packed form
59218A1388059J49437J68644J84878J97690K05877K08444K05402J96910J82575
59209A3087916J62206J36346J05629P0588L2423o880m5406q1181j11251j32361
59199A3218029j43161j44856j39592j29168j15298r9661q3267o6696n0967l7159
59189A2208204k5425j5552q235m215k528j370m71p11j391k6M913J3099K4525M0480
59175A2231297O1675Q7358J17002J51196J90097K32741K78482L27357L78123M27598
59165A4482926M72676N11496N41754N59358N59843N40141M98762M35739L53073
59156A8955768K53814J40318J4847j17789k50061l74775m86920n82443o57664
59147A6895095p11102p44095p58648p56188p39067p11340o76767o37480n95276
$$ plain form
59138 10565132 10012647 9502168 9033169 8605092 8215879 7862181 7540811 7248875 6983012
59129 6983012 6740051 6518321 6316973 6134266 5967880 5816768 5681100 5560246 5452018
59120 5452018 5354044 5264925 5184232 5112515 5051149 5000958 4960965 4929509 4906340 4892561 4888724
59109 4888724 4894132 4907803 4928993 4957061 4991996 5034832 5086402 5145948 5212159 5285137 5366125
59098 5366125 5455711 5553741 5660575 5776787 5901676 6033669 6172300 6318531 6473023 6635144
59088 6635144 6803344 6975255 7147655 7317658 7483723 7644334 7796168 7935147 8058910
59079 8058910 8166734 8257401 8329092 8381427 8415917 8434319 8438117 8429826 8413394 8393122 8373141
59068 8373141 8357424 8348789 8348286 8357209 8379323 8419345 8479644 8560412 8662631 8788473 8938884
$$ packed form
59138A0565132n52485n10479m68999m28077l89213l53698l21370k91936k65863
59129F983012k42961k21730k01348j82707j66386j51112j35668j20854j08228
59120E452018r7974q9119q0693p1717o1366n0191l9993l1456k3169j3779l837
59109D888724N408J3671K1190K8068L4935M2836N1570N9546O6211P2978Q0988
59098E366125Q9586R8030J06834J16212J24889J31993J38631J46231J54492J62121
59088F635144J68200J71911J72400J70003J66065J60611J51834J38979J23763
59079H058910J07824R0667P1691N2335L4490J8402L798q291j6432k0272j9981
59068H373141j5717q635n03Q923K2114M0022O0299Q0768J02219J25842J50411
$$ plain form
59057 8938884 9113350 9312488 9538459 9792167 10072001 10375942 10702884 11051297 11418523
59048 11418523 11801844 12198039 12600972 13001306 13389027 13754152 14084506 14365851 14586292
59039 14586292 14739485 14822956 14835771 14779539 14659788 14484209 14260275 13995563 13698668 13377677
59029 13377677 13038124 12683391 12316238 11938933 11552983 11160186 10763531 10366422 9971656
59020 9971656 9581596 9198333 8823153 8457032 8102130 7761412 7436163 7125400 6828569
59011 6828569 6546996 6281552 6030641 5792274 5566966 5356776 5162286 4982036 4814296
59002 4814296 4657815 4511283 4373610 4244705 4124940 4013900 3910403 3813460 3722444 3636608
58992 3636608 3555159 3477741 3404288 3334558 3268037 3204111 3142307 3082747 3026263 2973555 2924590
$$ packed form
59057H938884J74466J99138K25971K53708K79834L03941L26942L48413L67226
59048A1418523L83321L96195M02933M00334L87721L65125L30354K81345K20441
59039A4586292J53193Q3471J2815n6232j19751j75579k23934k64712k96895l20991
59029A3377677l39553l54733l67153l77305l85950l92797l96655l97109l94766
59020I971656l90060l83263l75180l66121l54902l40718l25249l10763k96831
59011F828569k81573k65444k50911k38367k25308k10190j94490j80250j67740
59002D814296j56481j46532j37673j28905j19765j11040j03497r6943r1016q5836
58992C636608q1449p7418p3453o9730o6521o3926o1804n9560n6484n2708m8965
$$ plain form
58981 2924590 2879613 2840202 2807822 2781440 2758187 2736502 2717066 2700600 2686874 2676450 2671142
58970 2671142 2671517 2675675 2681838 2690540 2702837 2717792 2733458 2749107 2764624 2778534 2788628 2794408
58958 2794408 2797408 2799111 2799692 2798821 2796688 2794189 2792765 2794161 2799832 2810397 2825474 2843623 2862619
58945 2862619 2880621 2897347 2913638 2929967 2946054 2961539 2975755 2987019 2993733 2996533 2998001 2999938
58933 2999938 3002194 3004269 3006448 3009083 3012453 3017823 3026953 3040011 3055580 3073147 3093628 3116965 3141468
58920 3141468 3166553 3193898 3224630 3257483 3291249 3326998 3366175 3408402 3453004 3500906 3553051
58909 3553051 3608613 3666984 3729935 3799266 3873485 3949534 4027192 4109266 4197711 4291830 4390216
58898 4390216 4492341 4597908 4706262 4816846 4929462 5044392 5163217 5288802 5423141
$$ packed form
58981B924590m4977l9411l2380k6382k3253k1685j9436j6466j3726j0424n308
58970B671142L75M158O163Q702J2297J4955J5666J5649J5517J3910J0094N780
58958B794408L000J703N81q71k133k499j424J396N671J0565J5077J8149J8996
58945B862619J8002J6726J6291J6329J6087J5485J4216J1264O714K800J468J937
58933B999938K256K075K179K635L370N370R130J3058J5569J7567K0481K3337K4503
58920C141468K5085K7345L0732L2853L3766L5749L9177M2227M4602M7902N2145
58909C553051N5562N8371O2951O9331P4219P6049P7658Q2074Q8445R4119R8386
58898D390216J02125J05567J08354J10584J12616J14930J18825J25585J34339
$$ plain form
58889 5423141 5565756 5715526 5873400 6041779 6221820 6413065 6615504 6830468 7059650
58880 7059650 7304604 7567011 7848015 8147366 8464528 8800632 9158341 9539988 9946877
58871 9946877 10380171 10841378 11332217 11855040 12413236 13010337 13649033 14331869 15062327
58862 15062327 15844084 16679541 17570106 18517451 19523253 20587604 21708340 22881357 24100239
58853 24100239 25355138 26631877 27911368 29169256 30376807 31502806 32514413 33377220
58845 33377220 34057921 34530010 34777438 34793369 34578410 34142482 33506702 32699945 31752531
58836 31752531 30693503 29551720 28355860 27132228 25903560 24689333 23505150 22361647
58828 22361647 21265778 20223561 19240330 18318406 17456323 16651090 15900311 15202023 14553731
$$ packed form
58889E423141J42615J49770J57874J68379J80041J91245K02439K14964K29182
58880G059650K44954K62407K81004K99351L17162L36104L57709L81647M06889
58871I946877M33294M61207M90839N22823N58196N97101O38696O82836P30458
58862A5062327P81757Q35457Q90565R47345J005802J064351J120736J173017J218882
58853B4100239J254899J276739J279491J257888J207551J125999J011607Q62807
58845C3377220O80701M72089K47428J5931k14959m35928o35780q06757r47414
58836C1752531j059028j141783j195860j223632j228668j214227j184183j143503
58828B2361647j095869j042217r83231r21924q62083q05233p50779o98288o48292
$$ plain form
58819 14553731 13952200 13393535 12873217 12386660 11930054 11500714 11097129 10719054 10366810
58810 10366810 10039818 9736273 9454650 9194507 8955101 8734368 8530354 8342711 8171699
58801 8171699 8016710 7877037 7753118 7645494 7553228 7474738 7409551 7357960 7319715 7294429
58791 7294429 7282448 7283889 7297662 7323070 7361673 7415886 7486320 7572031 7672598 7788222 7918612
58780 7918612 8063731 8225143 8404533 8601285 8813551 9041529 9287683 9553862 9840252
58771 9840252 10147325 10476925 10831080 11211302 11619334 12057122 12525909 13026800 13562444
58762 13562444 14136930 14753971 15416299 16126663 16888134 17703596 18576024 19508522 20502180
58753 20502180 21553913 22657675 23807058 24994426 26207180 27426166 28627212 29782313
$$ packed form
58819A4553731o01531n58665n20318m86557m56606m29340m03585l78075l52244
58810A0366810l26992l03545k81623k60143k39406k20733k04014j87643j71012
58801H171699j54989j39673j23919j07624r2266p8490o5187n1591l8245k5286
58791G294429j1981J441J3773K5408L8603N4213P0434Q5711J00567J15624J30390
58780G918612J45119J61412J79390J96752K12266K27978K46154K66179K86390
58771I840252L07073L29600L54155L80222M08032M37788M68787N00891N35644
58762A3562444N74486O17041O62328P10364P61471Q15462Q72428R32498R93658
58753B0502180J051733J103762J149383J187368J212754J218986J201046J155101
$$ plain form
58745 29782313 30859733 31825757 32647792 33295721 33742230 33965989 33956736 33716782 33257904
58736 33257904 32598657 31764371 30786210 29697263 28528849 27309452 26064377 24814699
58728 24814699 23577215 22365950 21192817 20066622 18992803 17974769 17014629 16112567
58720 16112567 15266954 14475713 13736819 13047508 12404416 11804849 11246769 10727151 10241465
58711 10241465 9785105 9354487 8946819 8560172 8194104 7849157 7525420 7222224 6938874
58702 6938874 6674405 6426835 6194142 5976032 5773441 5586313 5413270 5253299 5106088
58693 5106088 4970533 4844702 4727803 4620682 4523746 4435538 4353770 4276720 4203435 4133785
58683 4133785 4068658 4008952 3953979 3901672 3850326 3799152 3747518 3695074 3642526 3590729 3538966
$$ packed form
58745B9782313J077420R66024Q22035O47929M46509K23759r253k39954m58878
58736C3257904o59247q34286r78161j088947j168414j219397j245075j249678
58728B4814699j237484j211265j173133j126195j073819j018034r60140r02062
58720A6112567q45613p91241p38894o89311o43092n99567n58080n19618m85686
58711A0241465m56360m30618m07668l86647l66068l44947l23737l03196k83350
58702F938874k64469k47570k32693k18110k02591j87128j73043j59971j47211
58693E106088j35555j25831j16899j07121r6936q8208q1768p7050p3285o9650
58683D133785o5127n9706n4973n2307n1346n1174n1634n2444n2548n1797n1763
$$ plain form
58672 3538966 3485601 3430460 3375126 3320859 3267753 3215781 3164774 3113170 3058725 3000951 2941253
58661 2941253 2880339 2817340 2752032 2686115 2621478 2558738 2498216 2440804 2386842 2335335 2285123
58650 2285123 2235906 2187804 2141269 2098028 2060542 2029443 2002435 1976594 1951023 1926625 1904162
58639 1904162 1883355 1863381 1843623 1824123 1805383 1787484 1769811 1752204 1735792 1721766 1709924
58628 1709924 1699534 1690858 1684240 1678223 1670388 1659922 1647821 1634989 1621987 1610271 1601420 1595001
58616 1595001 1589268 1584147 1581381 1581415 1582355 1582786 1583636 1586351 1590927 1596638 1603288 1610876 1619179 1628270 1638359
58601 1638359 1648848 1658732 1668016 1677344 1686306 1693819 1700299 1707668 1716993 1727980 1741057 1757893 1779186
58588 1779186 1803684 1830041 1858108 1888079 1920159 1955527 1995796 2041056 2090206 2143512 2202754
$$ packed form
58672C538966n3365n5141n5334n4267n3106n1972n1007n1604n4445n7774n9698
58661B941253o0914o2999o5308o5917o4637o2740o0522n7412n3962n1507n0212
58650B285123m9217m8102m6535m3241l7486l1099k7008k5841k5571k4398k2463
58639A904162k0807j9974j9758j9500j8740j7899j7673j7607j6412j4026j1842
58628A709924j0390q676o618o017p835j0466j2101j2832j3002j1716q851o419
58616A595001n733n121k766L4R40M31Q50K715M576N711O650P588Q303R091J0089
58601A638359J0489R884R284R328Q962P513O480P369R325J0987J3077J6836K1293
58588A779186K4498K6357K8067K9971L2080L5368M0269M5260M9150N3306N9242
$$ plain form
58577 2202754 2268248 2337921 2410296 2486468 2568205 2656012 2750217 2852265 2963601 3084507 3214999
58566 3214999 3355738 3507390 3670478 3846622 4038698 4249194 4479466 4730777 5004439
58557 5004439 5300641 5618655 5958264 6318818 6696102 7081799 7466413 7840878 8194816
58548 8194816 8515386 8788961 9002769 9145196 9207583 9187723 9090739 8925953 8704012 8436622
58538 8436622 8136166 7813914 7479469 7141846 6809016 6486035 6175534 5880225 5602763
58529 5602763 5343253 5099875 4872609 4663623 4473294 4298889 4138352 3992508 3862120
58520 3862120 3745470 3640469 3546722 3463825 3389752 3322455 3261050 3204203 3149598 3096247 3044925
58509 3044925 2995034 2943819 2890472 2838429 2791369 2748941 2708333 2667944 2627365 2585600 2541568
$$ packed form
58577B202754O5494O9673P2375P6172Q1737Q7807R4205J02048J11336J20906J30492
58566C214999J40739J51652J63088J76144J92076K10496K30272K51311K73662
58557E004439K96202L18014L39609L60554L77284L85697L84614L74465L53938
58548H194816L20570K73575K13808J42427O2387j9860r6984j64786k21941k67390
58538H436622l00456l22252l34445l37623l32830l22981l10501k95309k77462
58529E602763k59510k43378k27266k08986j90329j74405j60537j45844j30388
58520C862120j16650j05001r3747q2897p4073o7297o1405n6847n4605n3351n1322
58509C044925m9891n1215n3347n2043m7060m2428m0608m0389m0579m1765m4032
$$ plain form
58498 2541568 2495248 2446938 2396861 2346598 2298912 2254786 2212526 2170989 2131490 2095326 2062024
58487 2062024 2031601 2005864 1985429 1967843 1950708 1934264 1918795 1902077 1882084 1860091 1838415
58476 1838415 1816851 1793905 1769801 1745646 1721112 1695584 1670355 1647226 1625898 1604721 1582938
58465 1582938 1560464 1536877 1512562 1489432 1468640 1448842 1428345 1407450 1387101 1367056 1347231
58454 1347231 1329100 1313851 1300808 1289308 1280125 1273246 1266551 1258926 1252566 1249832 1249860 1250701 1252651 1256687
58440 1256687 1261458 1264824 1267118 1270221 1274652 1279933 1286431 1294451 1302794 1310528 1318698 1328184 1337622 1345888
58426 1345888 1354802 1366597 1380148 1392480 1402693 1411771 1419877 1426543 1432264 1437214 1439467 1437115 1431164
58413 1431164 1423954 1415730 1405084 1391604 1375784 1357395 1336294 1313855 1291626 1269714 1248340 1229300
$$ packed form
58498B541568m6320m8310n0077n0263m7686m4126m2260m1537l9499l6164l3302
58487B062024l0423k5737k0435j7586j7135j6444j5469j6718j9993k1993k1676
58476A838415k1564k2946k4104k4155k4534k5528k5229k3129k1328k1177k1783
58465A582938k2474k3587k4315k3130k0792j9798k0497k0895k0349k0045j9825
58454A347231j8131j5249j3043j1500r183o879o695p625o360k734K8Q41J950M036
58440A256687M771L366K294L103M431N281O498Q020Q343P734Q170R486R438Q266
58426A345888Q914J1795J3551J2332J0213R078Q106O666N721M950K253k352n951
58413A431164p210q224j0646j3480j5820j8389k1101k2439k2229k1912k1374j9040
$$ plain form
58401 1229300 1213683 1199731 1185366 1171393 1159966 1151338 1144416 1139065 1135549 1132986 1130399 1127955 1125541
58388 1125541 1122065 1117901 1115776 1117231 1120497 1123924 1128829 1136691 1146398 1156879 1169506 1184864 1200109
58375 1200109 1212733 1224124 1235937 1246001 1251654 1254408 1257255 1259995 1261465 1263776 1269582 1277233 1283355
58362 1283355 1288572 1296098 1306191 1316368 1325674 1334476 1341728 1346794 1352367 1361086 1370784 1377508 1381585
58349 1381585 1386037 1390827 1393802 1395962 1400356 1406612 1411575 1414606 1417176 1418024 1413964 1405308 1395554 1385911
58335 1385911 1374800 1362484 1351523 1342714 1334976 1328947 1326295 1325935 1325395 1325478 1329086 1336093 1344093 1353717
58321 1353717 1368119 1387216 1407081 1425035 1440934 1453966 1463067 1470431 1479804 1491240 1501924 1511734
58309 1511734 1523190 1536207 1547892 1557575 1567204 1576792 1584308 1590177 1597083 1605229 1612440 1618897 1627034
$$ packed form
58401A229300j5617j3952j4365j3973j1427q628o922n351l516k563k587k444k414
58388A125541l476m164k125J455L266L427M905P862R707J0481J2627J5358J5245
58375A200109J2624J1391J1813J0064N653K754K847K740J470K311N806P651O122
58362A283355N217P526J0093J0177R306Q802P252N066N573Q719R698O724M077
58349A381585M452M790K975K160M394O256M963L031K570Q48m060q656r754r643
58335A385911j1111j2316j0961q809p738o029k652l60n40Q3L608P007Q000R624
58321A353717J4402J9097J9865J7954J5899J3032R101P364R373J1436J0684R810
58309A511734J1456J3017J1685R683R629R588P516N869O906Q146P211O457Q137
$$ plain form
58296 1627034 1636835 1645986 1654536 1664575 1675511 1684691 1692502 1701824 1712608 1722121 1730299 1739420 1748541
58283 1748541 1753845 1754788 1754651 1754865 1754114 1753197 1755348 1761299 1769114 1778897 1792554 1809121 1825691 1842487
58269 1842487 1861448 1880625 1896402 1910729 1929217 1951969 1973329 1991296 2010126 2032682 2057084
58258 2057084 2082107 2109165 2137522 2164043 2189247 2217449 2249502 2281370 2310950 2340153 2369237
58247 2369237 2395431 2418454 2441321 2464615 2485947 2505861 2528106 2553432 2579335 2606162 2636897
58236 2636897 2670844 2704647 2739573 2780132 2825302 2869278 2911557 2957894 3010408 3065237 3121091
58225 3121091 3181274 3245571 3308847 3369825 3433142 3501065 3571399 3644960 3726319 3815524 3907794
58214 3907794 4002787 4105056 4213946 4322627 4428797 4536697 4647082 4755612 4862986 4975911
$$ packed form
58296A627034R801R151Q550J0039J0936R180P811R322J0784R513Q178R121R121
58283A748541N304R43j37K14p51r17K151N951P815R783J3657J6567J6570J6796
58269A842487J8961J9177J5777J4327J8488K2752K1360J7967J8830K2556K4402
58258B057084K5023K7058K8357K6521K5204K8202L2053L1868K9580K9203K9084
58247B369237K6194K3023K2867K3294K1332J9914K2245K5326K5903K6827L0735
58236B636897L3947L3803L4926M0559M5170M3976M2279M6337N2514N4829N5854
58225C121091O0183O4297O3276O0978O3317O7923P0334P3561Q1359Q9205R2270
58214C907794R4993J02269J08890J08681J06170J07900J10385J08530J07374J12925
$$ plain form
58204 4975911 5095770 5217055 5339165 5468405 5605943 5745771 5887668 6040117 6206949
58195 6206949 6383247 6568114 6768836 6988299 7220918 7465482 7729217 8014449 8314239
58186 8314239 8626130 8957122 9310234 9680037 10066911 10481660 10930107 11407043 11911021
58177 11911021 12450306 13028135 13637433 14276671 14955544 15678675 16440232 17241362 18095189
58168 18095189 19006715 19965920 20969310 22029836 23156852 24346142 25599671 26934675
58160 26934675 28362126 29876972 31481202 33194949 35032378 36988848 39064822 41279614
58152 41279614 43649214 46176621 48878420 51792910 54945623 58336402 61979096 65924033
58144 65924033 70224112 74915536 80055997 85745760 92087814 99171410 107128552 116167296
$$ packed form
58204D975911J19859J21285J22110J29240J37538J39828J41897J52449J66832
58195F206949J76298J84867K00722K19463K32619K44564K63735K85232K99790
58186H314239L11891L30992L53112L69803L86874M14749M48447M76936N03978
58177A1911021N39285N77829O09298O39238O78873P23131P61557Q01130Q53827
58168A8095189R11526R59205J003390J060526J127016J189290J253529J335004
58160B6934675J427451J514846J604230J713747J837429J956470K075974K214792
58152D1279614K369600K527407K701799K914490L152713L390779L642694L944937
58144F5924033M300079M691424N140461N689763O342054P083596P957142R038744
$$ plain form
58136 116167296 126521053 138416456 152124001 167971407 186252352 207195380 231103914
58129 231103914 258470001 289853927 325617218 365569264 408278797 450126602 485150777
58122 485150777 506795196 510963676 498072894 472415461 439593286 404221917 369167120
58115 369167120 335879927 304921483 276360696 250106023 226108340 204355407 184796001
58108 184796001 167350284 151948478 138493127 126808882 116680914 107927714 100405946
58101 100405946 93976859 88517886 83955856 80248027 77333812 75136268 73608239 72749050
58093 72749050 72576427 73105332 74338028 76195893 78375040 80254122 81028451 80071673 77275406
58084 77275406 73077521 68157838 63081403 58160740 53529905 49242966 45304046 41684167
$$ packed form
58136A16167296J0353757J1895403J3707545J5847406J8280945K0943028K3908534
58129B31103914K7366087L1383926L5763291L9952046M2709533M1847805L5024175
58122D85150777K1644419M168480j2890782k5657433l2822175l5371369l5054797
58115C69167120l3287193l0958444k8560787k6254673k3997683k1752933j9559406
58108A84796001j7445717j5401806j3455351j1684245j0127968q753200p521768
58101A00405946o429087n458973m562030l707829k914215k197544j528029q59189
58093G2749050j72623N28905J232696J857865K179147J879082P74329r56778k796267
58084G7275406m197885m919683n076435m920663m630835m286939l938920l619879
$$ plain form
58076 41684167 38361431 35337215 32608564 30150851 27938318 25958222 24192999 22609461
58068 22609461 21178257 19886778 18722634 17661885 16684413 15784727 14956784 14183124 13449493
58059 13449493 12756062 12104024 11484728 10892172 10332993 9813364 9327573 8869272 8442281
58050 8442281 8049918 7684101 7334828 7000884 6682391 6372762 6067227 5770197 5485542
58041 5485542 5208565 4936054 4675307 4434464 4212034 4003977 3812627 3640168 3481253
58032 3481253 3330550 3190379 3063112 2943434 2826018 2713800 2610999 2514823 2421534 2333698
58022 2333698 2253880 2177807 2101386 2028100 1962147 1900681 1840102 1783523 1734345 1688564 1641272
58011 1641272 1595143 1554717 1517530 1478587 1438980 1402795 1369842 1338091 1308926 1283601 1259080
$$ packed form
58076D1684167l322736l024216k728651k457713k212533j980096j765223j583538
58068B2609461j431204j291479j164144j060749r77472q99686q27943p73660p33631
58059A3449493o93431o52038o19296n92556n59179n19629m85791m58301m26991
58050H442281l92363l65817l49273l33944l18493l09629l05535k97030k84655
58041E485542k76977k72511k60747k40843k22430k08057j91350j72459j58915
58032C481253j50703j40171j27267j19678j17416j12218j02801r6176r3289q7836
58022B333698p9818p6073p6421p3286o5953o1466o0579n6579m9178m5781m7292
58011A641272m6129m0426l7187l8943l9607l6185l2953l1751k9165k5325k4521
$$ plain form
58000 1259080 1233405 1210404 1193021 1177066 1157771 1137289 1119291 1101467 1080313 1058363 1039574
57989 1039574 1022193 1003281 985786 973779 964794 954213 943414 936360 931838 926499 922206 922803 926280
57976 926280 927451 926153 926084 927776 929263 931544 936849 943352 947626 950451 954429 958051 957922 954861 952143
57961 952143 949794 946233 943232 943333 944442 942799 939335 937205 935024 928801 919170 910514 903798 895952
57947 895952 885609 874211 862124 848698 835463 824679 815482 805679 796088 788846 782992 776142 768934
57934 768934 763239 757738 749999 741275 734377 728603 721866 716238 715949 721071 728384 737236 749090 762280
57920 762280 772967 781001 789555 799136 807123 813124 819588 826756 831819 833653 833988 833366 830119 824119
57906 824119 817762 812504 807468 801683 794756 785582 773570 760792 749923 740681 731389 722902 717253
$$ packed form
58000A259080k5675k3001j7383j5955j9295k0482j7998j7824k1154k1950j8789
57989A039574j7381j8912j7495j2007q985j0581j0799p054m522n339m293N97L477
57976I26280J171j298o9J692J487K281N305O503M274K825L978L622j29l061k718
57961I52143k349l561l001J01J109j643l464k130k181o223r631q656o716p846
57947H95952j0343j1398j2087j3426j3235j0784r197r803r591p242n854o850p208
57934G68934n695n501p739q724o898n774o737n628k89N122P313Q852J1854J3190
57920G62280J0687Q034Q554R581P987O001O464P168N063J834L35o22l247o000
57906H24119o357n258n036n785o927r174j2012j2778j0869r242r292q487n649
$$ plain form
57893 717253 713366 708211 701714 696616 693795 691653 689833 689596 690588 691036 691258 693405 697690 702188 706257
57878 706257 710668 714533 715681 714138 711870 709046 703886 696169 687589 678550 667828 655426 642657
57865 642657 629495 615082 600768 589324 581036 573739 566737 561470 558237 555639 553707 554450 558657
57852 558657 564802 571533 578846 586629 594458 602881 612566 622396 630761 638311 646969 656670 665685 673602
57838 673602 681255 688267 693413 696889 699471 700139 697515 692845 688364 683433 675767 665943 657129 650640
57824 650640 645198 640250 636301 632171 625838 618332 613131 611195 609906 607346 604227 601278 598205 595901
57810 595901 596282 599056 601715 603523 606595 612247 619167 626014 633070 640401 647009 652687 658466 664490
57796 664490 669493 672805 674863 675743 675326 674666 674801 674584 672300 668904 666654 665006 661236 654826 647655
$$ packed form
57893G17253l887n155o497n098k821k142j820k37R92M48K22K147M285M498M069
57878G06257M411L865J148j543k268k824n160p717q580r039j0722j2402j2769
57865F42657j3162j4413j4314j1444q288p297p002n267l233k598j932P43M207
57852E58657O145O731P313P783P829Q423R685R830Q365P550Q658R701R015P917
57838F73602P653P012N146L476K582O68k624m670m481m931p666r824q814o489
57824F50640n442m948l949m130o333p506n201j936j289k560l119k949l073k304
57810E95901L81K774K659J808L072N652O920O847P056P331O608N678N779O024
57796F64490N003L312K058Q80m17o60J35k17k284l396k250j648l770o410p171
$$ plain form
57781 647655 640045 630587 620251 612476 608051 603638 596650 588246 580138 571743 562108 551889 541902 532103
57767 532103 523086 515961 509676 501143 489281 476537 465286 455177 445032 434764 424185 412369
57755 412369 399659 388271 379679 373124 367494 362682 358489 354276 350365 347719 345817 343019 339393 336817
57741 336817 335972 335864 336690 340331 347327 356033 365415 376012 387637 399037 410431 423261 436659
57728 436659 447414 454484 460216 465916 469556 469596 467866 466672 465830 464481 463209 462260 460018 455281 449099
57713 449099 442781 436193 429553 424467 421338 418002 412975 408015 405493 404969 404369 403069 402051 402330 404676
57698 404676 409608 416348 422986 428664 434374 441231 449659 460460 474183 488732 500276 507668 513585
57685 513585 520224 526483 530711 533712 537477 543193 551740 563682 577370 589622 599885 611288 626124
$$ packed form
57781F47655p610r458j0336p775m425m413o988q404q108q395r635j0219r987r799
57767E32103r017p125o285q533j1862j2744j1251j0109j0145j0268j0579j1816
57755D12369j2710j1388q592o555n630m812m193m213l911k646j902k798l626k576
57741C36817q45j08Q26L641O996Q706R382J0597J1625J1400J1394J2830J3398
57728D36659J0755P070N732N700L640M0j730j194q42j349j272r49k242m737o182
57713D49099o318o588o640n086l129l336n027m960k522n24o00j300j018K79K346
57698D04676M932O740O638N678N710O857Q428J0801J3723J4549J1544P392N917
57685E13585O639O259M228L001L765N716Q547J1942J3688J2252J0263J1403J4836
$$ plain form
57672 626124 642903 659403 675814 692930 710073 727070 745836 767714 791455 815902 842275
57661 842275 871657 902752 934444 968028 1004376 1041557 1078251 1117025 1160806 1208123 1255454
57650 1255454 1302822 1353538 1409475 1469861 1533941 1601662 1672405 1746047 1824867 1911716 2006626
57639 2006626 2107727 2215028 2330780 2456500 2592216 2738693 2898196 3072882 3264118
57630 3264118 3473169 3700855 3946871 4210987 4494347 4797800 5119210 5453792 5796179
57621 5796179 6140158 6476774 6794519 7081370 7325682 7516536 7646041 7712205 7719061 7674711
57611 7674711 7590089 7477921 7350120 7215478 7080155 6948705 6822102 6694632 6554433 6388292
57601 6388292 6187281 5950808 5687784 5413217 5141525 4882038 4639888 4418604 4220099
$$ packed form
57672F26124J6779J6500J6411J7116J7143J6997J8766K1878K3741K4447K6373
57661H42275K9382L1095L1692L3584L6348L7181L6694L8774M3781M7317M7331
57650A255454M7368N0716N5937O0386O4080O7721P0743P3642P8820Q6849R4910
57639B006626J01101J07301J15752J25720J35716J46477J59503J74686J91236
57630C264118K09051K27686K46016K64116K83360L03453L21410L34582L42387
57621E796179L43979L36616L17745K86851K44312J90854J29505O6164O856m4350
57611G674711q4622j12168j27801j34642j35323j31450j26603j27470j40199j66141
57601F388292k01011k36473k63024k74567k71692k59487k42150k21284j98505
$$ plain form
57592 4220099 4043746 3887698 3750813 3632422 3531518 3447483 3380295 3328805 3290292 3263094
57582 3263094 3247932 3245031 3252040 3267090 3292088 3330381 3382603 3447588 3525993 3619686 3728279
57571 3728279 3849621 3983896 4134382 4303720 4491709 4696948 4918325 5154216 5401883
57562 5401883 5658021 5918346 6176079 6421821 6644916 6834118 6977857 7066006 7092245 7054673
57552 7054673 6955491 6801341 6602614 6369911 6111144 5832994 5543918 5253287 4967883 4691195
57542 4691195 4425817 4174441 3938556 3718104 3512762 3322246 3145611 2981764 2830569
57533 2830569 2692058 2564858 2446879 2337246 2236128 2142998 2056662 1976706 1903351 1836129
57523 1836129 1774147 1717280 1665444 1616989 1569647 1523156 1479565 1440924 1407879 1380136 1356792
$$ packed form
57592D220099j76353j56048j36885j18391j00904q4035o7188n1490l8513k7198
57582C263094j5162k901P009J5050K4998L8293N2222O4985P8405R3693J08593
57571C728279J21342J34275J50486J69338J87989K05239K21377K35891K47667
57562E401883K56138K60325K57733K45742K23095J89202J43739Q8149K6239l7572
57552G054673r9182j54150j98727k32703k58767k78150k89076k90631k85404k76688
57542D691195k65378k51376k35885k20452k05342j90516j76635j63847j51195
57533B830569j38511j27200j17979j09633j01118r3130q6336p9956p3355o7222
57523A836129o1982n6867n1836m8455m7342m6491m3591l8641l3045k7743k3344
$$ plain form
57512 1356792 1336300 1317574 1301076 1287677 1276849 1267278 1258880 1252768 1249545 1249099 1251800 1258354 1268478
57499 1268478 1281020 1295398 1311923 1330988 1352982 1378593 1408108 1440774 1475809 1513491 1554510
57488 1554510 1599073 1647605 1701111 1759635 1821663 1886634 1956831 2035039 2121490 2215096 2316588
57477 2316588 2428137 2550469 2682498 2823434 2973506 3133125 3303025 3484482 3677409
57468 3677409 3878691 4083799 4288982 4490092 4680396 4851524 4995529 5104385 5169749 5186667
57458 5186667 5156803 5085449 4976783 4835066 4668615 4487708 4298475 4102741 3903896 3708611
57448 3708611 3521987 3345006 3178085 3023494 2882602 2753889 2635618 2528026 2431409 2344513
57438 2344513 2266502 2198343 2140747 2092688 2053192 2022507 2000185 1984123 1972922 1967308 1967887 1973506
$$ packed form
57512A356792k0492j8726j6498j3399j0828r571q398o112l223m46K701O554J0124
57499A268478J2542J4378J6525J9065K1994K5611K9515L2666L5035L7682M1019
57488A554510M4563M8532N3506N8524O2028O4971P0197P8208Q6451R3606J01492
57477B316588J11549J22332J32029J40936J50072J59619J69900J81457J92927
57468C677409K01282K05108K05183K01110J90304J71128J44005J08856O5364J6918
57458E186667k9864p1354j08666j41717j66451j80907j89233j95734j98845j95285
57448C708611j86624j76981j66921j54591j40892j28713j18271j07592r6617q6896
57438B344513p8011o8159n7596m8059l9496l0685k2322j6062j1201n614N79N619
$$ plain form
57426 1973506 1983421 1999186 2022684 2053728 2091165 2134928 2185444 2242420 2305959 2377893 2460447
57415 2460447 2554252 2658784 2774005 2900507 3038648 3188353 3349127 3519588 3697413 3879690
57405 3879690 4062139 4237749 4397555 4533174 4637713 4704680 4728452 4706788 4641373 4535447
57395 4535447 4392719 4219217 4023795 3815097 3599153 3380773 3165365 2957623 2759491
57386 2759491 2570932 2392080 2223653 2066273 1920477 1786753 1664671 1552740 1449788
57377 1449788 1355663 1269998 1191277 1117887 1049143 984624 923412 864840 809316 757827 711140
57366 711140 669596 632705 598742 565785 533437 502536 473207 444577 416568 390322 366459
57355 366459 344368 323630 304545 286653 268411 249218 230451 213718 199290 186755 175823
$$ packed form
57426A973506R915J5765K3498L1044L7437M3763N0516N6976O3539P1934Q2554
57415B460447R3805J04532J15221J26502J38141J49705J60774J70461J77825J82277
57405C879690J82449J75610J59806J35619J04539O6967K3772k1664o5415j05926
57395D535447j42728j73502j95422k08698k15944k18380k15408k07742j98132
57386B759491j88559j78852j68427j57380j45796j33724j22082j11931j02952
57377A449788r4125q5665p8721p3390o8744o4519o1212n8572n5524n1489m6687
57366G11140m1544l6891l3963l2957l2348l0901k9329k8630k8009k6246k3863
57355C66459k2091k0738j9085j7892j8242j9193j8767j6733j4428j2535j0932
$$ plain form
57344 175823 165825 155797 145791 136932 129647 123147 116975 111480 106351 100533 94344 89705 87268 85110
57330 85110 81532 77368 74143 71468 67938 63466 59084 55167 51190 46650 41225 34696 27598 21173
57316 21173 15828 10426 3810 -3756 -11338 -18652 -25935 -33271 -40635 -47917 -54576 -60096 -64942 -70016
57302 -70016 -75127 -79280 -82500 -85851 -89517 -92541 -94637 -96383 -97397 -96661 -95204 -95993 -100062 -105049 -108834
57287 -108834 -112218 -116332 -119695 -120128 -117939 -114987 -111857 -108062 -103931 -99960 -94848 -86190 -73062 -56652
57273 -56652 -38633 -19968 -779 19580 41654 64272 84710 101559 116517 132268 149383 166468
57261 166468 182577 198262 214741 233014 253257 274318 294373 312706 330264 348130 366465
57250 366465 385373 405423 426422 446838 465447 482868 500808 520572 542619 566503 590944
$$ packed form
57344A75823r998j0028j0006q859p285o500o172n495n129n818o189m639k437k158
57330H5110l578m164l225k675l530m472m382l917l977m540n425o529p098o425
57316B1173n345n402C810c756p582p314p283p336p364p282o659n520m846n074
57302g0016n111m153l220l351l666l024k096j746j014P36J457p89m069m987l785
57287a08834l384m114l363m33K189K952L130L795M131L971N112Q658J3128J6410
57273e6652J8019J8665g79A9580K2074K2618K0438J6849J4958J5751J7115J7085
57261A66468J6109J5685J6479J8273K0243K1061K0055J8333J7558J7866J8335
57250C66465J8908K0050K0999K0416J8609J7421J7940J9764K2047K3884K4441
$$ plain form
57239 590944 615163 640302 668122 698217 728420 758143 789041 821816 854897 887512 921700
57228 921700 959743 1001567 1046005 1092524 1140218 1187287 1233398 1280661 1330154 1379135 1423678
57217 1423678 1462577 1496650 1525679 1548226 1563338 1570404 1568301 1556607 1536939 1511566 1481535 1447420
57205 1447420 1410625 1372486 1333484 1294925 1259972 1231166 1207990 1188481 1171930 1158436 1147314
57194 1147314 1137970 1131247 1128098 1127904 1129690 1133752 1140454 1148786 1157843 1168390 1181116 1194750 1207858
57181 1207858 1221187 1236224 1252766 1270033 1288976 1311196 1336523 1363646 1392291 1422902 1455143
57170 1455143 1488476 1523108 1558631 1593055 1625141 1656538 1689841 1725975 1765373 1809953 1861406
57159 1861406 1918825 1980309 2045620 2114923 2186540 2258819 2333128 2412268 2496747 2585078 2676615
$$ packed form
57239E90944K4219K5139K7820L0095L0203K9723L0898L2775L3081L2615L4188
57228I21700L8043M1824M4438M6519M7694M7069M6111M7263M9493M8981M4543
57217A423678L8899L4073K9029K2547J5112P066k103j1694j9668k5373l0031l4115
57205A447420l6795l8139l9002l8559l4953k8806k3176j9509j6551j3494j1122
57194A147314r344o723l149j94J786M062O702Q332R057J0547J2726J3634J3108
57181A207858J3329J5037J6542J7267J8943K2220K5327K7123K8645L0611L2241
57170A455143L3333L4632L5523L4424L2086L1397L3303L6134L9398M4580N1453
57159A861406N7419O1484O5311O9303P1617P2279P4309P9140Q4479Q8331R1537
$$ plain form
57148 2676615 2771334 2867777 2964146 3060847 3159336 3259017 3357814 3455225 3552368 3649680 3747053
57137 3747053 3845673 3947324 4052407 4160630 4272539 4387865 4503496 4615967 4725264 4833575
57127 4833575 4941318 5047549 5153646 5263173 5377856 5496229 5616061 5735396 5851176
57118 5851176 5959411 6057353 6144027 6219153 6283452 6339556 6390766 6439330 6487307 6537773 6593082
57107 6593082 6652912 6715816 6781224 6847908 6912410 6971772 7026424 7077822 7124936 7166003 7202111
57096 7202111 7235892 7268187 7299277 7331928 7369473 7411674 7455670 7500001 7544686 7588689 7630682
57085 7630682 7671121 7710007 7743404 7765226 7771517 7760535 7730802 7682681 7620040 7546542 7461515
57074 7461515 7362291 7247866 7116171 6960182 6771272 6544554 6277134 5964363 5603252 5196999
$$ packed form
57148B676615R4719R6443R6369R6701R8489R9681R8797R7411R7143R7312R7373
57137C747053R8620J01651J05083J08223J11909J15326J15631J12471J09297J08311
57127D833575J07743J06231J06097J09527J14683J18373J19832J19335J15780
57118E851176J08235R7942Q6674P5126O4299N6104N1210M8564M7977N0466N5309
57107F593082N9830O2904O5408O6684O4502N9362N4652N1398M7114M1067L6108
57096G202111L3781L2295L1090L2651L7545M2201M3996M4331M4685M4003M1993
57085G630682M0439L8886L3397K1822O291j0982k9733m8121o2641p3498q5027
57074G461515r9224j14425j31695j55989j88910k26718k67420l12771l61111m06253
$$ plain form
57064 5196999 4750097 4260374 3720672 3125672 2471138 1748902 949291 66749 -903302 -1971407
57054 -1971407 -3151471 -4453383 -5884938 -7459157 -9192991 -11101581 -13202161 -15522293
57046 -15522293 -18096621 -20956867 -24131882 -27654704 -31561256 -35884409 -40656659 -45914334
57038 -45914334 -51690378 -58008234 -64893178 -72384212 -80525230 -89354949 -98921478 -109297175
57030 -109297175 -120558242 -132752358 -145893329 -159956224 -174836854 -190327844 -206158168
57023 -206158168 -221977260 -237141448 -250479657 -260478981 -266011685 -267061487 -264749175
57016 -264749175 -260602538 -255726492 -250503448 -244839148 -238532190 -231441420 -223443375 -214338461
57008 -214338461 -203843740 -191716018 -177936210 -162815249 -146935588 -130979380 -115562445
$$ packed form
57064E196999m46902m89723n39702n95000o54534p22236p99611F6749i03302j068105
57054a971407j180064j301912j431555j574219j733834j908590k100580k320132
57046a5522293k574328k860246l175015l522822l906552m323153m772250n257675
57038d5914334n776044o317856o884944p491034q141018q829719r566529j0375697
57030a09297175j1261067j2194116j3140971j4062895j4880630j5490990j5830324
57023b06158168j5819092j5164188j3338209r999324n532704j049802K312312
57016b64749175M146637M876046N223044N664300O306958P090770P998045R104914
57008b14338461J0494721J2127722J3779808J5120961J5879661J5956208J5416935
$$ plain form
57001 -115562445 -101139439 -87974093 -76156707 -65656815 -56382784 -48218467 -41038833
56994 -41038833 -34723896 -29170866 -24292356 -20006849 -16237516 -12917390 -9988514 -7397762
56986 -7397762 -5099449 -3059758 -1252365 349243 1771297 3035373 4160686 5168297
56978 5168297 6077279 6898682 7638950 8307860 8918008 9478191 9992865 10467346 10908435
56969 10908435 11319949 11701463 12050819 12364278 12635274 12857483 13030022 13157969 13249039
56960 13249039 13311720 13353977 13379513 13385613 13367288 13322753 13253331 13160712 13047834 12920868 12786646
56949 12786646 12648676 12507836 12365115 12220423 12070018 11908531 11733184 11543920 11340630
56940 11340630 11122617 10889278 10638720 10367474 10074681 9764868 9442258 9102264 8732050
$$ packed form
57001a15562445J4423006J3165346J1817386J0499892R274031Q164317P179634
56994d1038833O314937N553030M878510M285507L769333L320126K928876K590752
56986g397762K298313K039691a252365C49243J422054J264076J125313J007611
56978E168297R08982Q21403P40268O68910O10148N60183N14674M74481M41089
56969A0908435M11514L81514L49356L13459K70996K22209J72539J27947R1070
56960A3249039O2681M2257K5536O100j8325m4535o9422r2619j12878j26966j34222
56949A2786646j37970j40840j42721j44692j50405j61487j75347j89264k03290
56940A1340630k18013k33339k50558k71246k92793l09813l22610l39994l70214
$$ plain form
56931 8732050 8320901 7869566 7391115 6905352 6431433 5982174 5563241 5176987 4825180
56922 4825180 4506911 4216309 3945403 3688906 3444867 3212349 2991059 2782476 2588970
56913 2588970 2412064 2252857 2112861 1992403 1889087 1799822 1723594 1660559 1609459 1567931
56903 1567931 1534635 1509369 1491670 1480768 1475977 1475783 1477682 1480204 1483692 1487527 1488072 1481083 1464743
56890 1464743 1438956 1403931 1361741 1317220 1274429 1233471 1193246 1155587 1123481 1096498 1071551
56879 1071551 1047777 1027475 1012348 1001678 994219 989351 986372 985255 988089 997163 1011060 1024665
56867 1024665 1033194 1034309 1026628 1009077 982692 950912 917022 882521 848403 816436 788330 764574
56855 764574 744464 726580 709450 692995 679160 669806 663983 658624 651975 645082 639765 636355 633773
$$ packed form
56931H732050m11149m51335m78451m85763m73919m49259m18933l86254l51807
56922D825180l18269k90602k70906k56497k44039k32518k21290k08583j93506
56913B588970j76906j59207j39996j20458j03316q9265p6228o3035n1100m1528
56903A567931l3296k5266j7699j0902m791j94J899K522L488L835N45o989j6340
56890A464743k5787l5025m2190m4521m2791m0958m0225l7659l2106k6983k4947
56879A071551k3774k0302j5127j0670p459m868k979j117K834R074J3897J3605
56867A024665Q529J115p681j7551k6385l1780l3890l4501l4118l1967k8106k3756
56855G64574k0110j7884j7130j6455j3835r354n823n359o649o893n317l410k582
$$ plain form
56842 633773 630846 627206 623459 620642 619259 619116 620235 622985 626825 630149 632384 635104 639808 645723
56828 645723 651397 657604 666844 680190 695940 710832 721405 725034 721521 713595 704542 695680 687142
56815 687142 680107 676441 676621 679739 685222 692875 701608 710139 719150 731224 748267 770185 796045
56802 796045 825241 857382 892222 929893 970158 1011100 1048973 1079232 1097600 1101471 1091794 1073153
56790 1073153 1050716 1027282 1003919 982381 965208 953823 948013 947199 951106 959620 973226 993347
56778 993347 1021176 1056458 1098381 1147211 1204103 1269840 1344277 1425313 1506431 1576144 1622492
56767 1622492 1639083 1626774 1590941 1538816 1478208 1415804 1355635 1299780 1249969 1207244 1170953
56756 1170953 1139966 1114646 1096116 1084220 1078259 1079417 1090306 1111831 1142334 1180168 1225312 1277522
$$ packed form
56842F33773k927l640l747k817j383j43J119K750L840L324K235K720M704N915
56828F45723N674O207R240J3346J5750J4892J0573L629l513p926r053q862q538
56815F87142p035l666J80L118N483P653Q733Q531R011J2074J7043K1918K5860
56802G96045K9196L2141L4840L7671M0265M0942L7873L0259J8368L871r677j8641
56790A073153k2437k3434k3363k1538j7173j1385n810q14L907Q514J3606K0121
56778I93347K7829L5282M1923M8830N6892O5737P4437Q1036Q1118O9713M6348
56767A622492J6591j2309l5833n2125o0608o2404o0169n5855m9811m2725l6291
56756A170953l0987k5320j8530j1896n961J158J0889K1525L0503L7834M5144N2210
$$ plain form
56744 1277522 1333359 1385110 1422270 1435584 1422074 1386693 1338292 1284111 1228468 1174586 1124822
56733 1124822 1079499 1038092 1001754 972665 950942 934508 922431 916183 917008 923996 935646 951692
56721 951692 972490 997779 1026571 1056807 1084300 1103224 1108719 1098958 1075156 1040909 1001407 961423
56709 961423 923049 885990 850145 816821 787318 761588 738708 717804 698302 680170 664045
56698 664045 650385 638720 628509 620138 613824 608153 601415 594048 587987 583710 579884 575899 572641
56685 572641 570269 567180 561987 554948 546848 538063 529472 522789 518924 516990 515569 513886 511264 506843
56671 506843 500887 495366 492181 491211 490643 488702 484797 479657 474781 471260 468938 467132 465826 465354 465265
56656 465265 464712 463829 463476 463627 463337 462441 461935 462419 463334 464122 465016 466383 468235 470621 473478 476001 477237
$$ packed form
56744A277522N5837N1751L7160J3314j3510l5381m8401n4181n5643n3882m9764
56733A124822m5323m1407l6338k9089k1723j6434j2077o248Q25O988J1650J6046
56721I51692K0798K5289K8792L0236K7493J8924N495r761k3802l4247l9502l9984
56709I61423l8374l7059l5845l3324k9503k5730k2880k0904j9502j8132j6125
56698F64045j3660j1665j0211q371o314n671o738p367o061m277l826l985l258
56685E72641k372l089n193p039q100q785q591o683l865j934j421j683k622m421
56671E06843n956n521l185r70n68j941l905n140m876l521k322j806j306m72q9
56656D65265n53q83l53J51k90q96n06M84R15P88Q94J367J852K386K857K523J236
$$ plain form
56639 477237 477444 477814 478753 479534 479659 479463 479350 479657 481134 484095 487031 487649 485688 483287 482219 482114 481752
56622 481752 480601 478500 475244 471300 467974 466147 465537 465391 465036 463744 461289 458837 457938 458270 457645 454791
56606 454791 450934 448058 446617 445649 444299 442583 441108 440375 440049 439082 436927 434159 431262 427691 423383
56591 423383 420342 420946 424961 429906 434235 438560 444046 451300 460688 471902 483215 492804 500595 507156
56577 507156 511415 511867 509731 508069 507527 505704 501341 496384 492934 490701 488679 487013 485760 483807 480524
56562 480524 476886 473817 470963 468062 465690 463558 459947 454094 447514 441817 436814 431955 427915 425439
56548 425439 424153 423687 424416 425989 426769 425953 424651 423806 422852 421584 421307 422570 423694 423273 422334 422229 422170
56531 422170 420924 419298 418704 418683 418144 417888 419410 422132 424305 426108 429398 434562 439783 443544 446078
$$ packed form
56639D77237K07L70R39P81J25j96j13L07J477K961K936O18j961k401j068j05l62
56622D81752j151k101l256l944l326j827o10j46l55j292k455k452q99L32o25k854
56606D54791l857k876j441r68j350j716j475p33l26r67k155k768k897l571m308
56591D23383l041O04M015M945M329M325N486P254R388J1214J1313R589P791O561
56577E07156M259M52k136j662n42j823m363m957l450k233k022j666j253j953l283
56562D80524l638l069k854k901k372k132l611n853o580n697n003m859m040k476
56548D25439j286m66P29J573P80q16j302q45r54j268k77J263J124m21r39j05n9
56531D22170j246j626n94k1n39k56J522K722K173J803L290N164N221L761K534
$$ plain form
56516 446078 448189 450250 452632 455886 460171 465225 470748 476249 480941 484591 487956 491751 495883 500306
56502 500306 505620 511853 517677 521933 525125 528398 532005 535866 540601 546724 553670 560767 568247 576045
56488 576045 582706 587063 590204 594114 598939 602975 604811 604075 600696 595020 588393 582306 577088 572332
56474 572332 567951 563709 558473 551410 543552 536897 532192 528621 525187 521350 516767 511550 506452 501955
56460 501955 497716 493624 490479 488546 486481 483037 478941 475513 472233 467433 461076 455087 450988 448621
56446 448621 447180 446142 445090 443816 442862 443127 444786 447082 449029 449905 449584 448995 449684 452209 455493 458254
56430 458254 460276 461589 461573 460099 458660 459008 461144 463859 466783 470657 475844 481661 487024 491076 493524
56415 493524 495068 497138 500596 505142 510264 515812 521167 525065 527172 528805 531138 533705 535555 536812
$$ packed form
56516D46078K111K061K382L254M285N054N523N501M692L650L365L795M132M423
56502E00306N314O233N824M256L192L273L607L861M735O123O946P097P480P798
56488E76045O661M357L141L910M825M036J836p36l379n676o627o087n218m756
56474E72332m381m242n236p063p858o655m705l571l434l837m583n217n098m497
56460E01955m239m092l145j933k065l444m096l428l280m800o357n989m099k367
56446D48621j441j038j052j274r54K65J659K296J947Q76l21n89O89K525L284K761
56430D58254K022J313j6j474j439L48K136K715K924L874N187N817N363M052K448
56415D93524J544K070L458M546N122N548N355L898K107J633K333K567J850J257
$$ plain form
56401 536812 538085 539488 541448 545259 551392 558150 563302 566284 567726 568015 567718 568269 570535 573358 575084
56386 575084 575796 576688 578023 579278 580546 582249 584025 585381 586895 589399 592453 594874 596045 595562 592613
56371 592613 587280 581585 577555 574816 571591 567357 562835 558151 552873 547464 542882 538869 534176 528416
56357 528416 522433 517067 512680 509472 507108 504399 500346 495110 489300 483250 477866 474916 475076 476732
56343 476732 477931 478427 478638 478157 476946 476529 477956 479797 480197 479757 480284 481778 483008 484083 485917 487887
56327 487887 488555 488255 488552 489523 489936 489805 490416 492059 493955 496251 499823 504235 508115 511375 514930 518515
56311 518515 521161 523724 528271 534633 540114 543380 546439 551834 559544 567568 574195 578880 581892 583836
56297 583836 585082 585704 586357 588440 592373 596555 599289 600932 602776 604812 606434 608446 612288 617744 623346
$$ packed form
56401E36812J273J403J960L811O133O758N152K982J442K89k97N51K266K823J726
56386E75084P12Q92J335J255J268J703J776J356J514K504L054K421J171m83k949
56371E92613n333n695m030k739l225m234m522m684n278n409m582m013m693n760
56357E28416n983n366m387l208k364k709m053n236n810o050n384k950J60J656
56343D76732J199M96K11m81j211m17J427J841M00m40N27J494J230J075J834J970
56327D87887O68l00K97R71M13j31O11J643J896K296L572M412L880L260L555L585
56311E18515K646K563M547O362N481L266L059N395P710Q024O627M685L012J944
56297E83836J246O22O53K083L933M182K734J643J844K036J622K012L842N456N602
$$ plain form
56282 623346 628642 634211 639968 645360 650847 657331 664432 671097 677470 684509 692361 700810 710497 721818
56268 721818 733470 744165 754961 767763 782328 796938 811064 825102 838560 851151 864555
56257 864555 880109 895623 907754 916938 926563 937495 946952 953038 957020 960498 963395 965573 967839
56244 967839 970477 972836 974876 977302 980169 983302 987729 994447 1002290 1009573 1017305 1027901 1041152 1054526
56230 1054526 1067211 1080812 1096359 1113937 1135025 1161443 1191696 1221908 1250859 1280793 1313067
56219 1313067 1346798 1382421 1422623 1468458 1517984 1570022 1625989 1686772 1751054 1818294 1890488
56208 1890488 1969435 2054818 2146269 2244772 2350968 2464535 2586226 2718029 2860605 3013229
56198 3013229 3176795 3353851 3544834 3747302 3959634 4182244 4414111 4651394 4890586
$$ packed form
56282F23346N296N569N757N392N487O484P101O665O373P039P852Q449R687J1321
56268G21818J1652J0695J0796J2802J4565J4610J4126J4038J3458J2591J3404
56257H64555J5554J5514J2131R184R625J0932R457O086L982L478K897K178K266
56244I67839K638K359K040K426K867L133M427O718P843P283P732J0596J3251J3374
56230A054526J2685J3601J5547J7578K1088K6418L0253L0212K8951K9934L2274
56219A313067L3731L5623M0202M5835M9526N2038N5967O0783O4282O7240P2194
56208A890488P8947Q5383R1451R8503J06196J13567J21691J31803J42576J52624
56198C013229J63566J77056J90983K02468K12332K22610K31867K37283K39192
$$ plain form
56189 4890586 5129764 5365449 5591594 5803140 5997562 6171663 6320177 6439150 6527669 6585065
56179 6585065 6609985 6603958 6572447 6520359 6449486 6361866 6262025 6153633 6037153 5913047 5784178
56168 5784178 5652686 5517519 5377585 5234483 5089603 4941243 4787493 4629753 4470886
56159 4470886 4311818 4152084 3991704 3830625 3668684 3508056 3353401 3207546 3069226
56150 3069226 2936559 2809979 2689995 2575482 2466746 2367224 2279065 2199380 2123764 2051383
56140 2051383 1983901 1921676 1864032 1811388 1764194 1721118 1680756 1643619 1610312 1579540 1550182
56129 1550182 1523591 1501466 1483075 1466804 1452850 1442166 1434238 1428084 1424121 1423163 1424758 1428036 1432741
56116 1432741 1438267 1443566 1449211 1457479 1469094 1482133 1495237 1509209 1524005 1537254 1547781 1557739
$$ packed form
56189D890586K39178K35685K26145K11546J94422J74101J48514J18973Q8519N7396
56179F585065K4920o027l1511n2088p0873q7620r9841j08392j16480j24106j28869
56168E784178j31492j35167j39934j43102j44880j48360j53750j57740j58867
56159D470886j59068j59734j60380j61079j61941j60628j54655j45855j38320
56150C069226j32667j26580j19984j14513j08736r9522q8159p9685p5616p2381
56140B051383o7482o2225n7644n2644m7194m3076m0362l7137l3307l0772k9358
56129A550182k6591k2125j8391j6271j3954j0684p928o154l963r58J595L278M705
56116A432741N526N299N645Q268J1615J3039J3104J3972J4796J3249J0527R958
$$ plain form
56104 1557739 1569044 1580321 1589632 1597712 1606101 1614423 1621892 1629334 1637579 1646010 1654739 1666004 1681447
56091 1681447 1700191 1721331 1745808 1774103 1804922 1838265 1877119 1923937 1978074 2038742 2107706
56080 2107706 2186816 2275317 2371747 2476130 2588807 2710026 2842206 2989081 3150478 3320972
56070 3320972 3495165 3670323 3842039 4002141 4144440 4269185 4379444 4477070 4564743 4646854
56060 4646854 4723845 4789013 4834718 4858928 4863101 4848179 4816686 4774588 4726249 4670053 4602223
56049 4602223 4521318 4425460 4309916 4172810 4020367 3862093 3703680 3548411 3401311 3266357
56039 3266357 3142483 3027399 2922828 2831241 2750135 2674661 2603874 2539889 2482960 2431695 2385957
56028 2385957 2345536 2308172 2272592 2240881 2214391 2190536 2167498 2148478 2136939 2130974 2126745 2123999
$$ packed form
56104A557739J1305J1277R311Q080Q389Q322P469P442Q245Q431Q729J1265J5443
56091A681447J8744K1140K4477K8295L0819L3343L8854M6818N4137O0668O8964
56080B107706P9110Q8501R6430J04383J12677J21219J32180J46875J61397J70494
56070C320972J74193J75158J71716J60102J42299J24745J10259R7626Q7673Q2111
56060D646854P6991O5168M5705K4210M173j4922l1493m2098m8339n6196o7830
56049D602223q0905r5858j15544j37106j52443j58274j58413j55269j47100j34954
56039C266357j23874j15084j04571r1587q1106p5474p0787o3985n6929n1265m5738
56028B385957m0421l7364l5580l1711k6490k3855k3038j9020j1539n965m229k746
$$ plain form
56016 2123999 2123672 2123744 2122580 2123100 2128676 2137953 2148335 2161056 2177889 2196446 2213862 2231779 2252714
56003 2252714 2275134 2297072 2320572 2347288 2373883 2397522 2421820 2451396 2484598 2517659 2551886
55992 2551886 2590328 2631378 2672270 2715071 2762634 2812552 2861663 2912415 2967969 3025272 3080066
55981 3080066 3134514 3192729 3253349 3314228 3379798 3455300 3537767 3621020 3705636 3795709 3890064
55970 3890064 3985434 4084290 4190541 4301378 4412357 4526504 4649268 4778639 4909706 5044668
55960 5044668 5188395 5338279 5488816 5642405 5805322 5976967 6153648 6339062 6540204
55951 6540204 6756697 6984734 7227266 7489255 7767423 8056268 8359589 8684316 9028141
55942 9028141 9386001 9763691 10171574 10609564 11071946 11562033 12087722 12647572 13236077
$$ packed form
56016B123999l27P2j164N20N576R277J0382J2721J6833J8557J7416J7917K0935
56003B252714K2420K1938K3500K6716K6595K3639K4298K9576L3202L3061L4227
55992B551886L8442M1050M0892M2801M7563M9918M9111N0752N5554N7303N4794
55981C080066N4448N8215O0620O0879O5570P5502Q2467Q3253Q4616R0073R4355
55970C890064R5370R8856J06251J10837J10979J14147J22764J29371J31067J34962
55960E044668J43727J49884J50537J53589J62917J71645J76681J85414K01142
55951F540204K16493K28037K42532K61989K78168K88845L03321L24727L43825
55942I028141L57860L77690M07883M37990M62382M90087N25689N59850N88505
$$ plain form
55933 13236077 13857821 14521373 15224766 15962855 16743063 17576702 18460542 19384981 20354735
55924 20354735 21382712 22469743 23610769 24815473 26101641 27473600 28928993 30480782
55916 30480782 32149022 33936506 35836872 37861234 40032380 42360648 44853438 47540605
55908 47540605 50459697 53623335 57033415 60719675 64730577 69098299 73855820 79082365
55900 79082365 84890766 91382220 98665490 106913809 116350196 127189558 139661024 154079202
55892 154079202 170823183 190260076 212774822 238848434 268968300 303416318 342145483
55885 342145483 384542318 428633651 470133792 502738293 520409141 520283577 503848463
55878 503848463 475588659 440585094 402918770 365320622 329398057 295925935 265170538
$$ packed form
55933A3236077O21744O63552P03393P38089P80208Q33639Q83840R24439R69754
55924B0354735J027977J087031J141026J204704J286168J371959J455393J551789
55916C0480782J668240J787484J900366K024362K171146K328268K492790K687167
55908D7540605K919092L163638L410080L686260M010902M367722M757521N226545
55900G9082365N808401O491454P283270Q248319R436387J0839362J2471466J4418178
55892A54079202J6743981J9436893K2514746K6073612L0119866L4448018L8729165
55885C42145483M2396835M4091333M1500141L2604501J7670848j25564j6435114
55878E03848463k8259804l5003565l7666324l7598148l5922565l3472122l0755397
$$ plain form
55871 265170538 237204762 212045964 189632272 169821845 152451863 137342813 124249137
55864 124249137 112873857 102947441 94256214 86606688 79820626 73772377 68385795 63584577
55856 63584577 59277016 55387196 51862587 48646616 45677002 42915752 40351653 37969639
55848 37969639 35744000 33662562 31729164 29937576 28266505 26702814 25246752 23891944
55840 23891944 22622704 21433923 20332530 19316276 18370600 17488548 16673817 15920999 15211633
55831 15211633 14533737 13888445 13274567 12683558 12113436 11571904 11061588 10575765 10111123
55822 10111123 9670955 9253521 8850870 8461689 8092535 7744483 7411103 7091095 6790090
55813 6790090 6508254 6238688 5979856 5737103 5509802 5289202 5071369 4860626 4658129
$$ packed form
55871B65170538k7965776k5158798k2413692j9810427j7369982j5109050j3093676
55864A24249137j1375280r926416q691227p649526o786062o048249n386582m801218
55856F3584577m307561l889820l524609l215971k969614k761250k564099k382014
55848C7969639k225639k081438j933398j791588j671071j563691j456062j354808
55840B3891944j269240j188781j101393j016254r45676q82052q14731p52818p09366
55831A5211633o77896o45292o13878n91009n70122n41532n10316m85823m64642
55822A0111123m40168m17434m02651l89181l69154l48052l33380l20008l01005
55813F790090k81836k69566k58832k42753k27301k20600k17833k10743k02497
$$ plain form
55804 4658129 4458619 4260901 4070322 3888395 3710718 3537599 3376138 3229158 3092228
55795 3092228 2964151 2850465 2753850 2670400 2597648 2536905 2485331 2434932 2381977 2329031 2276147
55784 2276147 2219285 2159298 2103155 2053751 2007185 1961995 1921838 1886685 1850537 1810809 1771471
55773 1771471 1734264 1695472 1654256 1615481 1580845 1545416 1506572 1468654 1435187 1403885 1372861
55762 1372861 1344596 1320066 1295631 1269265 1243656 1220140 1195970 1170564 1147942 1129957 1113390
55751 1113390 1096751 1083570 1075804 1070209 1064467 1060842 1060486 1060043 1057387 1055109 1054993 1054355 1051058 1046795
55737 1046795 1042203 1034066 1020832 1005984 992652 979492 964913 950576 937646 924125 909021 894698
55725 894698 882167 868410 851366 833487 817548 802874 788259 774611 762242 749502 736363
$$ packed form
55804D658129j99510j97718j90579j81927j77677j73119j61461j46980j36930
55795C092228j28077j13686r6615q3450p2752o0743n1574n0399n2955n2946n2884
55784B276147n6862n9987n6143m9404m6566m5190m0157l5153l6148l9728l9338
55773A771471l7207l8792m1216l8775l4636l5429l8844l7918l3467l1302l1024
55762A372861k8265k4530k4435k6366k5609k3516k4170k5406k2622j7985j6567
55751A113390j6639j3181p766n595n742l625l56m43k656k278j16o38l297m263
55737A046795m592q137j3234j4848j3332j3160j4579j4337j2930j3521j5104j4323
55725H94698j2531j3757j7044j7879j5939j4674j4615j3648j2369j2740j3139
$$ plain form
55714 736363 725244 716157 705220 690256 673633 657358 639818 619911 600097 582548 566092 549428
55702 549428 533703 519694 506186 493181 482762 474886 466386 456061 446447 438610 429807 418753
55690 418753 408630 402102 397504 392771 389166 388358 389597 392376 398059 406311 413598 417751 420366 422579
55676 422579 422565 419682 416851 416108 415657 413950 412602 412535 411333 407364 402514 397991 391614 382439 373822 368255
55660 368255 363215 355958 348624 344340 341630 337134 331181 326550 323849 321893 320639 320419 320337 320467 323402
55645 323402 330650 339826 348290 357024 367783 378936 387538 393455 398283 402197 404896 407676 411559 415173
55631 415173 417232 419174 422688 426579 428697 428995 428270 426163 422964 421123 422192 424380 425652 426913 429539
55616 429539 432347 433966 435741 439136 442491 443701 444056 446088 449396 451865 453393 455269 457314 458669
$$ packed form
55714G36363j1119r087j0937j4964j6623j6275j7540j9907j9814j7549j6456j6664
55702E49428j5725j4009j3508j3005j0419p876q500j0325r614p837q803j1054
55690D18753j0123o528m598m733l605q08J239K779N683Q252P287M153K615K213
55676D22579j4k883k831p43m51j707j348o7j202l969m850m523o377r175q617n567
55660C68255n040p257p334m284k710m496n953m631k701j956j254k20q2J30K935
55645C23402P248R176Q464Q734J0759J1153Q602N917M828L914K699K780L883L614
55631D15173K059J942L514L891K118K98p25k107l199j841J069K188J272J261K626
55616D29539K808J619J775L395L355J210L55K032L308K469J528J876K045J355
$$ plain form
55602 458669 459937 461702 462354 460189 456313 452898 450101 447271 445402 445575 446553 446667 446495 446919 446269 442302
55586 442302 435533 427803 419196 409192 399159 390509 381872 371261 359686 349496 340467 330874 321282
55573 321282 313776 308030 301521 293351 284968 277330 269944 262491 255121 247548 239789 233076 228052 223059
55559 223059 216419 209307 204047 200641 197409 194019 191353 189311 187324 186217 187023 188614 188986 188222 187839
55544 187839 187887 187059 184992 182177 178372 173520 169570 168789 170602 172337 172750 172708 172910 173073 172960 172276 169976
55527 169976 165591 160666 157141 154992 153144 151735 151407 151303 150019 147963 146711 146646 147128 148261 150510
55512 150510 153232 155489 157619 160194 162328 162922 162751 163482 165511 168472 172571 177366 180619 180781 179549
55497 179549 179618 180984 181952 182530 183882 185248 184497 181561 178653 177194 176868 177390 178813 180247 180575 180362
$$ packed form
55602D58669J268J765O52k165l876l415k797k830j869J73R78J14j72M24o50l967
55586D42302o769p730q607j0004j0033q650q637j0611j1575j0190r029r593r592
55573C21282p506n746o509q170q383p638p386p453p370p573p759o713n024m993
55559B23059o640p112n260l406l232l390k666k042j987j107Q06J591L72p64l83
55544A87839M8q28k067k815l805m852l950p81J813J735M13m2K02J63j13o84k300
55527A69976m385m925l525k149j848j409l28j04j284k056j252o5M82J133K249
55512A50510K722K257K130K575K134N94j71P31K029K961M099M795L253J62j232
55497A79549O9J366R68N78J352J366p51k936k908j459l26N22J423J434L28k13
$$ plain form
55481 180362 181031 182476 183513 184256 185864 188250 190276 191941 194264 197187 199619 201408 203334 205369 206780
55466 206780 207738 209053 210625 211762 212590 213568 214185 213624 211902 209011 204247 198170 193558 192050 191208 187502
55450 187502 180915 173892 167145 159752 152401 146825 142315 136231 128063 119972 113212 107043 101363 97352
55436 97352 95071 93062 90769 88863 87027 84041 80439 78426 78688 79614 79992 80109 79907 78692 77129 76945
55420 76945 78001 78079 76206 73923 72552 71588 70539 70103 70530 70733 69983 68823 67717 66531 65798 66579 68444
55403 68444 69491 69002 68337 68564 69112 69509 70629 73101 75792 76816 75252 71510 66882 62764 59264 54862
55387 54862 48640 42346 38691 38163 39331 41634 45494 49949 52856 53750 54233 55156 55576 54854 53705 52772
55371 52772 52083 52163 53632 55455 55737 54571 54004 54899 56098 57014 58626 61159 63167 63767 63813 64049 64040 63703
$$ packed form
55481A80362O69J445J037P43J608K386K026J665K323K923K432J789J926K035J411
55466B06780R58J315J572J137Q28R78O17n61j722k891m764o077m612j508q42l706
55450A87502o587p023o747p393p351n576m510o084q168q091o760o169n680m011
55436I7352k281k009k293j906j836k986l602k013K62R26L78J17k02j215j563j84
55420G6945J056P8j873k283j371r64j049m36M27K03p50j160j106j186p33P81J865
55403F8444J047m89o65K27N48L97J120K472K691J024j564l742m628m118l500m402
55387E4862o222o294l655n28J168K303L860M455K907Q94M83R23M20p22j149r33
55371E2772o89Q0J469J823K82j166n67Q95J199R16J612K533K008O00M6K36rl37
$$ plain form
55353 63703 64038 65509 67391 69290 71637 74295 76492 78419 80824 82852 82640 80529 79159 79619 80002
55338 80002 78674 76484 74634 72875 71154 70627 71390 71297 68828 65313 62679 60751 58606 57011 57473 59802
55322 59802 62306 63684 63559 62010 59729 57890 56960 56448 56310 57330 59402 60847 60420 58766 56959 54860
55306 54860 52008 49080 47303 47143 48313 50386 52806 55029 56959 58463 58647 56953 54852 54687 56538
55291 56538 58059 57725 56342 54858 52849 50109 47851 47097 47345 47761 48257 48666 48464 48057 48716 50436 51517
55274 51517 51034 49841 48439 45984 42589 40427 40966 42878 44319 45633 48063 51178 53377 53986 53376
55259 53376 51903 50046 48732 48430 48684 49255 50501 51933 51945 50164 48626 49374 52068 55030 57297 58475
55243 58475 57998 55998 53912 52953 52812 52705 52549 52317 51618 50830 51188 52743 53780 53323 52641 53164 54554
$$ packed form
55353F3703L35J471J882J899K347K658K197J927K405K028k12k111j370M60L83
55338H0002j328k190j850j759j721n27P63r3k469l515k634j928k145j595M62K329
55322E9802K504J378j25j549k281j839r30n12j38J020K072J445m27j654j807k099
55306E4860k852k928j777j60J170K073K420K223J930J504J84j694k101j65J851
55291E6538J521l34j383j484k009k740k258p54K48M16M96M09k02m07O59J720J081
55274E1517m83j193j402k455l395k162N39J912J441J314K430L115K199O09o10
55259E3376j473j857j314l02K54N71J246J432J2j781j538P48K694K962K267J178
55243E8475m77k000k086r59j41j07j56k32o99p88L58J555J037m57o82N23J390
$$ plain form
55226 54554 56105 58252 61194 63619 64469 64476 64412 63442 60948 58381 57262 56804 55584 54300 54522 55721 55949
55209 55949 54909 54159 54603 55693 56859 57986 58755 59068 59876 62158 65432 68514 71178 73706 75389 75037
55193 75037 72640 69243 65664 62566 61079 61788 63395 63806 62391 60128 57992 56354 55532 55717 56602 57916
55177 57916 59860 62261 64121 64864 65177 65646 65663 64862 64479 65653 67228 66897 64160 60702 58339 57806 59004
55160 59004 61096 62697 63160 63346 64307 65929 67715 69913 72685 75137 76506 77444 78835 80162 80367 79451
55144 79451 77867 75395 72130 69543 68766 68708 67697 66226 66053 67077 67248 65501 62942 61036 60098 59689
55128 59689 59336 58880 58982 60824 64402 67786 69147 68807 68238 67985 67883 68183 68924 69186 68573 68381 69484
55111 69484 70292 68920 66287 64606 63705 61689 58841 57830 59773 62673 64336 64615 64268 63731 63682 64971
$$ packed form
55226E4554J551K147K942K425Q50Po4r70k494k567j119m58j220j284K22J199K28
55209E5949j040p50M44J090J166J127P69L13Q08K282L274L082K664K528J683l52
55193G5037k397l397l579l098j487P09J607M11j415k263k136j638q22J85Q85J314
55177E7916J944K401J860P43L13M69J7q01l83J174J575l31k737l458k363n33J198
55160E9004K092J601M63J86R61J622J786K198K772K452J369R38J391J327K05r16
55144G9451j584k472l265k587p77n8j011j471j73J024J71j747k559j906r38m09
55128E9689l53m56J02J842L578L384J361l40n69k53j02L00P41K62o13j92J103
55111F9484Q08j372k633j681r01k016k848j011J943K900J663K79l47n37m9J289
$$ plain form
55095 64971 67262 69175 70134 70679 70857 70064 68608 67614 67114 66063 64662 64698 66912 69748 71468 71976 71822
55078 71822 71025 69781 68958 68797 68141 65908 62635 59989 59356 61169 64770 68636 71584 73941 76787 80160
55062 80160 83108 85373 87613 89938 91678 92848 94395 96545 98312 99073 99369 99597 99233 98020 96746
55047 96746 96103 95670 94792 93712 93234 93736 94873 95738 95348 93685 92218 92503 94346 96324 97952 100082
55031 100082 103153 106390 108982 110811 111776 111676 111007 110643 110375 109077 106694 104790 104617 105795 107366 108898
55015 108898 110051 110407 110500 111817 114862 118078 119474 118623 116546 114557 113811 114917 117101 118537 118326 117544
54999 117544 117575 118079 117469 115027 111814 109682 109837 112103 115178 117746 119392 120250 120062 118471 116239 115058
54983 115058 115641 116779 116906 116051 115599 116557 118653 121083 123572 126460 129772 132489 133123 131151 127455 123337
$$ packed form
55095F4971K291J913R59N45J78p93j456r94n00j051j401L6K214K836J720N08j54
55078G1822p97j244q23j61o56k233l273k646o33J813L601L866K948K357K846L373
55062H0160K948K265K240K325J740J170J547K150J767P61K96K28l64j213j274
55047I6746o43m33q78j080m78N02J137Q65l90j663j467K85J843J978J628K130
55031A00082L071L237K592J829R65j00o69l64k68j298k383j904j73J178J571J532
55015A08898J153L56R3J317L045L216J396q51k077j989p46J106K184J436k11p82
54999A17544L1N04o10k442l213k132J55K266L075K568J646Q58j88j591k232j181
54983A15058N83J138J27q55m52R58K096K430K489K888L312K717O34j972l696m118
$$ plain form
54967 123337 119718 117382 116834 117349 117264 116181 115772 117191 118973 119167 118541 119376 121627 122826 121942 120873
54951 120873 121418 122890 123832 124319 125299 126815 128138 128835 128879 128323 127492 126748 125661 123305 119855 117003 116279
54934 116279 117765 120685 124203 127225 128612 128389 127923 128231 128800 128512 126973 124490 121621 119296 118630 119994
54918 119994 122728 125997 129313 132261 134664 137229 140990 145856 150651 154807 158859 163065 166887 170337
54904 170337 174546 180291 187076 194326 202242 210707 218597 225290 231880 239713 248540 257335 266416 277426
54890 277426 291301 307193 323426 338837 353139 366488 378806 389358 396983 400735 400096 394808
54878 394808 385088 372056 357427 342638 328464 315157 302357 289233 275601 262701 252063 243796
54866 243796 236844 230525 224759 219250 213943 210060 208997 210101 211202 211641 213050 216641 221417 225796
$$ packed form
54967A23337l619k336n48N15q5j083m09J419J782J94o26Q35K251J199q84j069
54951A20873N45J472R42M87R80J516J323O97M4n56q31p44j087k356l450k852p24
54934A16279J486K920L518L022J387k23m66L08N69k88j539k483k869k325o66J364
54918A19994K734L269L316K948K403K565L761M866M795M156M052M206L822L450
54904A70337M209N745O785P250P916Q465P890O693O590P833Q827Q795R081J1010
54890B77426J3875J5892J6233J5411J4302J3349J2318J0552P625L752o39n288
54878C94808r720j3032j4629j4789j4174j3307j2800j3124j3632j2900j0638q267
54866B43796o952o319n766n509n307l883j063J104J101M39J409L591M776M379
$$ plain form
54852 225796 229627 233699 238562 244713 252872 263218 275186 288472 303173 318449 332354 343813
54840 343813 353532 362102 368282 370150 367083 359737 348842 334890 318497 300498 282181 265543 252297
54827 252297 242148 232931 222857 211964 201439 192614 186557 183172 180618 177172 173705 172375 172682
54814 172682 171293 166626 161226 158217 157542 157289 156759 156251 155451 154125 153214 153218 152477 148948 142916 136261 129808
54797 129808 123148 116546 111354 108790 109325 112522 116428 118246 117075 115065 114501 114857 114324 113044 112729
54782 112729 113755 114778 114928 114529 113907 113183 112912 113345 113473 112537 112066 114442 119566 124784 128093 129588
54766 129588 129782 128610 126649 125471 125907 127158 128251 129359 131090 133360 135490 136902 137625 138636 141431
54751 141431 146320 151495 154914 156993 160119 165604 172502 179627 187190 195758 204858 213575 221943 230976
$$ packed form
54852B25796L831M072M863O151Q159J0346J1968J3286J4701J5276J3905J1459
54840C43813R719Q570O180J868l067p346j0895j3952j6393j7999j8317j6638j3246
54827B52297j0149r217j0074j0893j0525q825o057l385k554l446l467j330L07
54814A72682j389m667n400l009o75k53n30n08q00j326r11Mp41l529o032o655o453
54797A29808o660o602n192k564N35L197L906J818j171k010n64L56n33j280l15
54782A12729J026J023J50l99o22p24k71M33J28r36m71K376N124N218L309J495
54766A29588J94j172j961j178M36J251J093J108J731K270K130J412P23J011K795
54751A41431M889N175L419K079L126N485O898P125P563Q568R100Q717Q368R033
$$ plain form
54737 230976 241610 254075 268073 283292 299830 318109 338153 358906 378424 394626 405940
54726 405940 411822 412938 410400 404583 395246 382952 369410 356085 343516 332343 323518 316549 309139
54713 309139 300094 291399 285717 282775 280150 276932 274498 273892 274511 275603 277340 280020 283628 288518 295350
54698 295350 304113 314198 325436 338001 351471 365301 380161 397412 417126 437936 458938 480314
54686 480314 501751 521443 537161 547392 551317 548830 540871 528811 513227 494093 472128 448957
54674 448957 425934 403784 383295 365082 348526 332199 315682 300030 286360 274921 265435 257203
54662 257203 248983 240210 232450 228116 227375 227582 226115 222554 217855 212954 208746 205981 204292 202306 199419
54647 199419 196578 194846 194127 193742 193230 192244 190781 189835 190630 192702 194070 193837 193319 193938 195447 197075
$$ packed form
54737B30976J0634J2465J3998J5219J6538J8279K0044K0753J9518J6202J1314
54726D05940N882J116k538n817r337j2294j3542j3325j2569j1173q825o969p410
54713C09139r045q695n682k942k625l218k434o06O19J092J737K680L608M890O832
54698B95350Q763J0085J1238J2565J3470J3830J4860J7251J9714K0810K1002K1376
54686D80314K1437J9692J5718J0231L925k487p959j2060j5584j9134k1965k3171
54674D48957k3023k2150k0489j8213j6556j6327j6517j5652j3670j1439r486q232
54662B57203q220q773p760m334p41K07j467l561m699m901m208k765j689j986k887
54647A99419k841j732p19l85n12r86j463r46P95K072J368k33n18O19J509J628
$$ plain form
54631 197075 198842 200499 200619 198391 195416 193982 194110 193897 192419 190654 189573 189001 188851 190153 193919
54616 193919 199557 205146 209123 211316 212570 213894 216031 219329 223465 227405 230250 232377 235200 239494
54602 239494 244598 249807 255742 263266 271574 278636 283496 287005 290361 294148 298845 304862 311658 318039
54588 318039 323819 330141 337733 346037 354678 364490 376172 388937 401623 414418 428370 443656 459294
54575 459294 474236 487785 499055 506783 509844 507752 500920 490672 478499 464880 449217 431259
54563 431259 412063 393108 375024 357816 341850 327833 315940 305597 296234 287972 281500 277262
54551 277262 274595 271832 267722 262701 258195 254753 251677 248571 246104 244625 242940 239502 234477 229792
54537 229792 227199 226781 227317 227635 227508 227270 226610 224106 218504 210350 201666 193955 187257 181244 176249 172706
$$ packed form
54631A97075J767J657J20k228k975j434J28k13j478j765j081n72j50J302L766
54616A93919N638N589L977K193J254J324K137L298M136L940K845K127K823M294
54602B39494N104N209N935P524Q308P062M860L509L356L787M697O017O796O381
54588C18039N780O322P592Q304Q641R812J1682J2765J2686J2795J3952J5286J5638
54575D59294J4942J3549J1270P728L061k092o832j0248j2173j3619j5663j7958
54563D31259j9196j8955j8084j7208j5966j4017j1893j0343r363q262o472m238
54551B77262k667k763m110n021m506l442l076l106k467j479j685l438n025m685
54537B29792k593m18N36L18j27k38o60k504n602q154q684p711o698o013m995l543
$$ plain form
54521 172706 170286 168229 166093 163801 161429 159275 157581 155927 153589 150869 149202 149360 150294 150530 149970
54506 149970 149326 148357 146027 142429 139394 138674 140114 142105 143514 144627 146269 148499 150635 152391 154298
54491 154298 156704 158965 160313 161070 162138 163526 164441 164808 165590 167369 169658 172060 175015 178863 183090
54476 183090 187302 192169 198510 205976 213494 220658 227880 235471 243326 251406 259794 268198 275859 282061
54462 282061 286489 289056 289496 287137 281297 272333 262210 253353 246643 240934 234645 227328 219530 211810
54448 211810 204363 197165 190102 183190 176776 171276 166758 163185 160803 159563 158446 156413 154067 153140
54434 153140 154063 155267 155397 155097 155951 158649 162782 167372 170849 171737 170458 169519 170745 173080 174235 173678
54418 173678 172657 171950 171183 170180 169455 169207 169015 168761 168944 169957 171811 174560 178022 180973 181638 179505
$$ packed form
54521A72706k420k057k136k292k372k154j694j654k338k720j667J58R34K36n60
54506A49970o44r69k330l598l035p20J440J991J409J113J642K230K136J756J907
54491A54298K406K261J348P57J068J388R15L67P82J779K289K402K955L848M227
54476A83090M212M867O341P466P518P164P222P591P855Q080Q388Q404P661O202
54462B82061M428K567M40k359n840q964j0123q857o710n709o289p317p798p720
54448B11810p447p198p063o912o414n500m518l573k382j240j117k033k346r27
54434A53140R23J204J30l00Q54K698M133M590L477Q88j279r39J226K335J155n57
54418A73678j021p07p67j003p25k48j92k54J83J013J854K749L462K951O65k133
$$ plain form
54402 179505 176080 173434 172303 171788 170483 167733 164176 161247 160008 160291 161076 161541 161634 161823 162522 163576
54386 163576 164078 162877 159554 154849 150083 146401 144451 144210 144925 145730 146481 147440 148222 147962 146752 145714
54370 145714 145041 143269 139590 135846 134714 136461 138930 140492 141490 142741 144134 145254 146275 147516 148724
54355 148724 149402 149455 149181 148925 148953 149373 149946 150272 150301 150478 151348 153229 156274 160647 166552 174129 183120 192500
54337 192500 200736 206792 210882 214093 217369 220876 224073 226354 227881 229759 232892 236627 239188 239574
54323 239574 238325 236293 233713 230942 228952 228044 226859 223815 219180 214780 211978 210777 210531 210497 209766
54308 209766 207603 204078 199936 195885 192314 189349 186820 184578 183183 183491 185023 185772 184568 182837 182791
54293 182791 184623 186817 188638 190738 193596 196904 200445 204150 207331 209328 210853 213172 215844 217024
$$ packed form
54402A79505l425k646j131n15j305k750l557k929j239K83P85M65R3J89O99J054
54386A63576N02j201l323m705m766l682j950k41P15Q05P51R59P82k60j210j038
54370A45714o73j772l679l744j132J747K469J562R98J251J393J120J021J241J208
54355A48724O78N3k74k56K8M20N73L26K9J77Q70J881L045M373N905P577Q991R380
54337A92500Q236O056M090L211L276L507L197K281J527J878L133L735K561L86
54323B39574j249k032k580k771j990r08j185l044m635m400k802j201k46l4p31
54308B09766k163l525m142m051l571k965k529k242j395L08J532P49j204j731m6
54293A82791J832K194J821K100K858L308L541L705L181J997J525K319K672J180
$$ plain form
54279 217024 216298 215584 216637 219331 223066 228151 234502 240324 243471 243440 241105 237456 233672 231341 231067
54264 231067 231305 229902 226503 222391 218393 214225 209661 204936 199903 194050 187673 181971 177557 173737
54250 173737 169728 165723 162129 158435 153757 148294 143438 140205 137946 134944 130305 125196 122041 122315
54236 122315 125116 128087 129638 129903 129630 128858 127212 124970 123015 121695 120428 118682 116826 115699 115678
54221 115678 116547 117869 119073 119483 118926 118085 117737 117746 117525 117427 118691 121646 124780 126363 126500 126814 128228
54204 128228 129795 129967 128460 126452 125122 124443 123723 122964 123025 124274 125830 126799 127644 129406 131824 133445
54188 133445 133664 133465 133796 134329 134436 134283 134130 133425 131702 129788 129079 129885 131318 132456 132848 132262 130952
54171 130952 129977 130323 131712 133043 133838 134433 134839 134371 132660 130321 128351 127316 127145 127206 126510 124550 122218
$$ packed form
54279B17024p26p14J053K694L735N085O351N822L147l1k335l649l784k331k74
54264B31067K38j403l399m112l998m168m564m725n033n853o377n702m414l820
54250A73737m009m005l594l694m678n463m856l233k259l002m639n109l155K74
54236A22315K801K971J551K65k73p72j646k242j955j320j267j746j856j127k1
54221A15678Q69J322J204M10n57q41l48Rk21r8J264K955L134J583J37L14J414
54204A28228J567J72j507k008j330o79p20p59O1J249J556R69Q45J762K418J621
54188A33445K19j99L31N33J07j53j53p05j723j914p09Q06J433J138L92n86j310
54171A30952r75L46J389J331P95N95M06m68j711k339j970j035j71O1o96j960k332
$$ plain form
54154 122218 121533 123971 128998 134245 137300 137551 136323 134945 133088 129783 125838 123694 124340 125820 125914
54139 125914 125022 124922 125761 126255 126288 127132 129014 130423 130397 129820 129824 130342 130944 131798 132928 133595 133338 132727 132283
54120 132283 131521 129983 128386 127683 127583 127071 126032 125231 124855 124210 123059 122380 123275 125498 127499 127833 126359
54103 126359 124151 122404 121515 121122 120717 120012 118905 117521 116386 116254 117634 120448 123963 127005 128649
54088 128649 129067 129380 130284 131221 131459 131500 132473 134304 135554 135256 134065 133259 133228 133352 132892 131728 130526 130248
54070 130248 131129 132188 132196 131023 129525 128352 127581 127285 127459 127344 125925 123359 120940 119378 118121 116713
54054 116713 115703 115562 115793 115959 116643 118343 120060 120177 118406 115800 113071 110036 106813 104483 104069 105494
54038 105494 107986 111103 114775 118511 121174 121889 120985 119701 118856 118162 117115 116041 115698 116080 116465 116719
$$ packed form
54154A22218o85K438N027N247L055K51j228j378j857l305l945k144O46J480R4
54139A25914q92j00Q39M94L3Q44J882J409k6n77MN18O02Q54J130O67k57o11m44
54120A32283p62j538j597p03j00n12j039q01l76o45j151o79Q95K223K001L34j474
54103A26359k208j747q89l93m05p05j107j384j135j32J380K814L515L042J644
54088A28649M18L13R04R37K38M1R73J831J250k98j191q06l1J24m60j164j202k78
54070A30248Q81J059Qj173j498j173p71k96J74j15j419k566k419j562j257j408
54054A16713j010j41K31J66O84J700J717J17j771k606k729l035l223k330m14J425
54038A05494K492L117L672L736K663P15r04j284q45o94j047j074l43L82L85K54
$$ plain form
54022 116719 117653 119602 121370 121441 119995 118988 119981 122328 123803 122976 120702 119172 119618 121279 122645 123176
54006 123176 123447 124063 125066 126256 127361 127842 127165 125487 123738 122947 123710 126080 129434 132577 134701 136302
53990 136302 138551 141733 145028 147949 151151 155416 160474 165336 169295 172116 173669 174048 173979 174585 176579
53975 176579 179845 183890 188596 194316 201149 208289 214658 220242 226344 234154 243461 253070 262040 270143
53961 270143 277654 285207 293395 301954 309851 316586 322696 328386 332721 335197 337107 339926 343077 344897
53947 344897 345254 345446 345786 345161 342968 339686 335468 329986 323923 318748 314535 309752 303733 297666 292631
53932 292631 288351 284508 281423 278683 275047 270727 267828 267265 267073 265228 262429 260456 259466 258812 259087
53917 259087 261035 263381 263912 262169 259236 255557 251033 246748 244405 244037 244143 244093 244607 245790 246562 246455
$$ packed form
54022A16719R34J949J768P1j446j007R93K347J475q27k274j530M46J661J366N31
54006A23176K71O16J003J190J105M81o77j678j749p91P63K370L354L143K124J601
53990A36302K249L182L295K921L202M265N058M862L959K821J553L79o9O06J994
53975A76579L266M045M706N720O833P140O369N584O102P810R307R609Q970Q103
53961B70143P511P553Q188Q559P897O735O110N690M335K476J910K819L151J820
53947C44897L57J92L40o25k193l282m218n482o063n175m213m783o019o067n035
53932B92631m280l843l085k740l636m320k899n63j92j845k799j973r90o54K75
53917B59087J948K346N31j743k933l679m524m285k343l68J06n0N14J183P72j07
$$ plain form
53901 246455 246382 247024 247792 248026 248231 249476 252221 256050 260018 263095 264900 266028 267184 268264 268949 269770
53885 269770 271499 273726 275169 275497 275857 277434 280358 284121 288327 292918 298256 304898 312684 320294 326494
53870 326494 331495 336192 340490 343564 345547 347569 349988 351849 352427 352227 352062 352148 352563 353854 356658 361178
53854 361178 367176 373995 380599 386359 391845 398276 406169 415099 424449 433535 441353 447540 453481 461032
53840 461032 469828 477209 481338 483159 484625 486131 486649 485519 483099 480066 476865 473613 470015 465601
53826 465601 460370 454797 449012 442546 435258 427814 420736 413475 405047 395335 385263 375967 368111 361646
53812 361646 355719 349035 340865 331808 323241 315960 309447 302594 295112 288052 282617 278464 273805 267424
53798 267424 260041 253203 247583 243172 240370 239473 239257 237567 233672 228977 225104 222202 219486 216354 212490
$$ packed form
53901B46455p3O42P68K34K05J245K745L829L968L077J805J128J156J080O85Q21
53885B69770J729K227J443L28L60J577K924L763M206M591N338O642P786P610O200
53870C26494N001M697M298L074J983K022K419J861N78k00j65Q6M15J291K804M520
53854C61178N998O819O604N760N486O431P893Q930R350R086P818O187N941P551
53840D61032Q796P381M129J821J466J506N18j130k420l033l201l252l598m414
53826D65601n231n573n785o466p288p444p078p261q428r712j0072r296p856o465
53812C61646n927o684q170r057q567p281o513o853p482p060n435m153m659o381
53798B67424p383o838n620m411k802q97k16j690l895m695l873k902k716l132l864
$$ plain form
53783 212490 207822 203081 199695 198402 198467 198655 198476 198079 197633 197288 197164 196947 196105 194993 195046 197215 200655
53766 200655 203460 204275 202896 200105 197556 197078 199036 201775 203405 203864 204371 205333 205892 205619 205474 206548
53750 206548 208603 210559 212229 214772 219152 224597 229282 232527 235531 239418 243380 245883 247379 250378
53736 250378 256512 264709 272864 280222 287312 294446 301344 307713 313237 317405 320246 322847 326286 330370
53722 330370 334263 337952 341953 345862 348485 349570 350249 351463 352927 353992 354556 354574 353469 350808 347058
53707 347058 343094 339370 336100 333713 332290 330746 327497 322167 316170 311355 308274 305860 302629 298124
53693 298124 293243 289155 285951 282698 278890 275279 272755 270863 268357 265230 263242 263972 266908 269980
53679 269980 271574 271562 270784 270209 270394 271144 271697 271647 271585 272302 273520 274061 273259 271487 269166 266023 261752 256864
$$ packed form
53783B12490m668m741l386j293O5J88j79l97m46l45j24k17q42j112N3K169L440
53766B00655K805Q15j379k791k549m78J958K739J630M59N07R62N59k73j45J074
53750B06548K055J956J670K543M380N445M685L245L004L887L962K503J496K999
53736B50378O134Q197Q155P358P090P134O898O369N524M168K841K601L439M084
53722C30370L893L689M001L909K623J085O79J214J464J065N64J8j105k661l750
53707C47058l964l724l270k387j423j544l249n330n997m815l081k414l231m505
53693B98124m881m088l204l253l808l611k524j892k506l127j988P30K936L072
53679B69980J594j2p78n75J85P50N53n0o2P17J218N41q02j772k321l143m271m888
$$ plain form
53661 256864 252387 249112 247456 247612 249295 251525 253106 253296 252010 249800 247900 247670 249471 252361 255272
53646 255272 258174 261663 265778 269883 273477 276601 279552 282631 286059 289727 293203 296286 299253 302283
53632 302283 305124 307899 311693 317436 324469 331176 337040 343214 350894 359789 368367 375068 379273 381797
53618 381797 384612 389397 395992 402681 408080 412243 415820 418870 420984 422009 422138 421482 420011 417873 415498
53603 415498 413391 411961 411402 411639 412301 412759 412230 410200 406981 403648 401098 399227 397134 393980 389626
53588 389626 384889 381428 380747 382764 385704 387934 389437 390951 392351 392974 393133 394066 396254 398875 401131
53573 401131 403098 404909 406040 406077 405638 405880 407283 409199 410463 410359 409321 408718 409684 412173 415362 418668
53557 418668 421932 424982 427875 431421 436559 443018 449286 454108 457602 460984 465699 472603 481154 489436
$$ packed form
53661B56864m477l275j656J56J683K230J581J90j286k210j900k30J801K890K911
53646B55272K902L489M115M105L594L124K951L079L428L668L476L083K967L030
53632C02283K841K775L794N743P033O707N864O174P680Q895Q578O701M205K524
53618C81797K815M785O595O689N399M163L577L050K114J025J29o56j471k138k375
53603D15498k107j430n59K37O62M58n29k030l219l333k550j871k093l154m354
53588C89626m737l461o81K017K940K230J503J514J400O23J59R33K188K621K256
53573D01131J967J811J131L7m39K42J403J916J264j04j038o03R66K489L189L306
53557D18668L264L050K893L546N138O459O268M822L494L382M715O904Q551Q282
$$ plain form
53543 489436 495777 500449 505175 511155 518378 526570 535640 545217 554916 565137 576316 587262 595766
53530 595766 601447 606618 613543 622114 631155 640744 651785 663932 675375 684605 691532 697033 702218
53517 702218 708083 715196 723436 732117 740148 746312 750134 752678 755740 759863 763897 766814 768983 771105
53503 771105 772963 774232 775798 778976 783635 788015 790542 791264 791630 793186 796303 799841 802329 803701 805423
53488 805423 808716 813343 818458 823807 829356 834447 838231 840613 842088 843041 843883 845555 849019 854303 860477
53473 860477 866426 871383 875165 878407 882252 887295 893136 899294 906151 914535 924819 936767 949746
53460 949746 962605 973998 983635 993051 1004632 1020009 1039303 1061279 1084020 1106361 1129224 1154675
53448 1154675 1183109 1212333 1240244 1267498 1296429 1328053 1361400 1395387 1430108 1466349 1504773
$$ packed form
53543D89436O341M672M726N980P223Q192R070R577R699J0221J1179J0946Q504
53530E95766N681N171O925Q571R041R589J1041J2147J1443R230O927N501N185
53517G02218N865P113Q240Q681Q031O164L822K544L062M123M034K917K169K122
53503G71105J858J269J566L178M659M380K527P22L66J556L117L538K488J372J722
53488H05423L293M627N115N349N549N091L784K382J475R53Q42J672L464N284O174
53473H60477N949M957L782L242L845N043N841O158O857Q384J0284J1948J2979
53460I49746J2859J1393R637R416J1581J5377J9294K1976K2741K2341K2863K5451
53448A154675K8434K9224K7911K7254K8931L1624L3347L3987L4721L6241L8424
$$ plain form
53437 1504773 1545622 1588557 1632930 1678605 1726070 1775262 1824994 1874299 1923699 1974286 2026159
53426 2026159 2078725 2131905 2185917 2240357 2294630 2348814 2402946 2455836 2505947 2553360 2599759
53415 2599759 2646523 2693773 2741051 2787844 2833567 2877950 2921285 2963477 3003438 3040608 3076444
53404 3076444 3112800 3149061 3182514 3211553 3236908 3259620 3279626 3296783 3311676 3324600 3334915
53393 3334915 3342032 3345968 3346482 3342861 3335161 3324504 3311530 3295667 3276568 3255006 3231495 3205114
53381 3205114 3174793 3141055 3105501 3069222 3032460 2995120 2956665 2916168 2873438 2829642 2785916
53370 2785916 2741879 2696569 2650455 2605378 2562599 2521996 2483259 2446859 2413393 2382705 2354136
53359 2354136 2327231 2301840 2277981 2256137 2237420 2222868 2212364 2204713 2199091 2196167 2197333 2202982
$$ packed form
53437A504773M0849M2935M4373M5675M7465M9192M9732M9305M9400N0587N1873
53426B026159N2566N3180N4012N4440N4273N4184N4132N2890N0111M7413M6399
53415B599759M6764M7250M7278M6793M5723M4383M3335M2192L9961L7170L5836
53404C076444L6356L6261L3453K9039K5355K2712K0006J7157J4893J2924J0315
53393C334915P117L936N14l621p700j0657j2974j5863j9099k1562k3511k6381
53381C205114l0321l3738l5554l6279l6762l7340l8455m0497m2730m3796m3726
53370B785916m4037m5310m6114m5077m2779m0603l8737l6400l3466l0688k8569
53359B354136k6905k5391k3859k1844j8717j4552j0504p651n622k924J166N649
$$ plain form
53347 2202982 2212073 2223417 2236773 2252573 2271347 2293876 2321027 2352575 2386686 2421660 2458047
53336 2458047 2498171 2543643 2594085 2648190 2705107 2764604 2826696 2891344 2958233 3026917 3097645
53325 3097645 3171662 3249977 3332178 3417343 3505569 3597335 3691728 3787026 3883123 3981678 4083369
53314 4083369 4186625 4289763 4392751 4495802 4597779 4697431 4795141 4891886 4987227 5079901
53304 5079901 5169791 5257479 5341848 5419748 5488649 5548653 5601526 5648625 5690234 5726175 5756289
53293 5756289 5780385 5798020 5808332 5810142 5802592 5785899 5761334 5730234 5692856 5648129 5594720 5532589
53281 5532589 5463343 5388533 5307773 5219482 5123861 5024265 4924785 4826948 4729602 4631730 4534199
53270 4534199 4438486 4344584 4250967 4156509 4061970 3969359 3879921 3792975 3706983 3621659 3538671
$$ packed form
53347B202982R091J1344J3356J5800J8774K2529K7151L1548L4111L4974L6387
53336B458047M0124M5472N0442N4105N6917N9497O2092O4648O6889O8684P0728
53325C097645P4017P8315Q2201Q5165Q8226R1766R4393R5298R6097R8555J01691
53314D083369J03256J03138J02988J03051J01977R9652R7710R6745R5341R2674
53304E079901Q9890Q7688Q4369P7900O8901O0004N2873M7099M1609L5941L0114
53293E756289K4096J7635J0312J810p550j6693k4565l1100l7378m4727n3409o2131
53281E532589o9246p4810q0760q8291r5621r9596r9480r7837r7346r7872r7531
53270D534199r5713r3902r3617r4458r4539r2611q9438q6946q5992q5324q2988
$$ plain form
53259 3538671 3460155 3386868 3318015 3252490 3189869 3130394 3074524 3022631 2974854 2931043 2890829
53248 2890829 2853756 2819374 2787297 2757213 2728843 2702004 2676890 2654240 2635000 2619758 2608572
53237 2608572 2601060 2596420 2593589 2591925 2591710 2593650 2597877 2603774 2610675 2618436 2627588 2639345 2655065 2674822
53223 2674822 2696743 2718748 2741095 2766321 2796456 2831202 2869002 2908740 2949707 2990949 3031734
53212 3031734 3072326 3113464 3155257 3197070 3238139 3277815 3315592 3351471 3386005 3419465 3451121
53201 3451121 3479759 3504638 3525623 3542828 3556586 3567401 3575399 3580101 3581176 3579023 3574059 3565827
53189 3565827 3553442 3536699 3516148 3492203 3464702 3433213 3397369 3357217 3313737 3268627 3222872
53178 3222872 3175800 3126371 3075267 3024686 2975803 2927295 2876914 2824037 2770136 2717080 2665587
$$ packed form
53259C538671p8516p3287o8853o5525o2621n9475n5870n1893m7777m3811m0214
53248B890829l7073l4382l2077l0084k8370k6839k5114k2650j9240j5242j1186
53237B608572p512m640k831j664k15J940M227N897O901P761R152J1757J5720J9757
53223B674822K1921K2005K2347K5226L0135L4746L7800L9738M0967M1242M0785
53212C031734M0592M1138M1793M1813M1069L9676L7777L5879L4534L3460L1656
53201C451121K8638K4879K0985J7205J3758J0815P998M702J075k153m964q232
53189C565827j2385j6743k0551k3945k7501l1489l5844m0152m3480m5110m5755
53178C222872m7072m9429n1104n0581m8883m8508n0381n2877n3901n3056n1493
$$ plain form
53167 2665587 2615362 2566189 2518422 2472395 2427671 2383320 2339001 2295580 2254492 2216492 2180997
53156 2180997 2146487 2111626 2076257 2041347 2007702 1974886 1941896 1908903 1877536 1848993 1822390
53145 1822390 1795520 1766939 1736798 1705963 1674979 1643896 1612582 1581025 1549548 1518745 1489073
53134 1489073 1460520 1432784 1405677 1379238 1353603 1328792 1304366 1279258 1252351 1223521 1193867
53123 1193867 1164669 1136331 1108458 1080590 1052578 1024583 997043 970446 944896 920063 895717
53112 895717 872016 849177 827237 806371 787017 769374 753024 737251 721435 705081 688043
53101 688043 670977 655050 640815 627806 615407 603540 592218 581227 570759 561611 554008 546943
53089 546943 539458 531939 525177 518757 511637 503918 496639 489824 482243 473606 465716 460506 457638 454971
$$ packed form
53167B665587n0225m9173m7767m6027m4724m4351m4319m3421m1088l8000l5495
53156B180997l4510l4861l5369l4910l3645l2816l2990l2993l1367k8543k6603
53145A822390k6870k8581l0141l0835l0984l1083l1314l1557l1477l0803k9672
53134A489073k8553k7736k7107k6439k5635k4811k4426k5108k6907k8830k9654
53123A193867k9198k8338k7873k7868k8012k7995k7540k6597k5550k4833k4346
53112H95717k3701k2839k1940k0866j9354j7643j6350j5773j5816j6354j7038
53101F88043j7066j5927j4235j3009j2399j1867j1322j0991j0468r148p603p065
53089E46943p485p519o762o420p120p719p279o815p581q637p890n210k868k667
$$ plain form
53075 454971 451076 446418 442125 438488 435153 432290 430763 430958 432002 432653 432649 432596 432718 432574 432028 431539 431202
53058 431202 430505 429653 430193 433247 437747 441533 443945 446178 449099 451689 451939 448672 442345 434608 427215
53043 427215 420931 415304 409576 403579 397503 391333 385114 379405 374755 370919 367302 363758 360202 355721
53029 355721 349302 341548 334598 329844 326443 322519 317280 311521 306429 302433 299209 296492 294570 293673
53015 293673 293111 291763 289642 288066 287729 287499 286059 283824 281940 280197 277646 274881 273625 273838 273272
53000 273272 270594 267207 264918 263416 261426 259142 257894 258008 258509 258659 258468 257843 256461 254650 253393
52985 253393 253139 253245 252885 252046 251412 251497 251981 251814 250154 247401 245012 244060 244302 244986 246063 247982 250600
52968 250600 253043 254659 255535 255947 255692 254092 250616 245651 240834 238244 238792 241519 244777 247835 250905
$$ packed form
53075D54971l895m658m293l637l335k863j527J95J044O51mn3J22j44n46m89l37
53058D31202o97q52N40L054M500L786K412K233K921K590K50l267o327p737p393
53043D27215o284n627n728n997o076o170o219n709m650l836l617l544l556m481
53029C55721o419p754o950m754l401l924n239n759n092l996l224k717j922q97
53015B93673n62j348k121j576l37k30j440k235j884j743k551k765j256K13n66
53000B73272k678l387k289j502j990k284j248J14N01J50j91o25j382j811j257
52985B53393k54J06l60q39o34Q5M84j67j660k753k389r52K42O84J077J919K618
52968B50600K443J616Q76M12k55j600l476m965m817k590N48K727L258L058L070
$$ plain form
52953 250905 253971 256296 257056 255941 253214 249763 247047 246289 247402 249101 250200 250493 250395 250328 250651 251671
52937 251671 253288 254932 256116 256761 256763 255622 252968 249312 245969 244305 245125 248386 253077 257637 261011
52922 261011 263304 265152 266674 267619 268358 270013 273390 278363 284541 291872 300079 308113 314987 321006 327395
52907 327395 334607 341491 346348 348532 349017 349658 351733 354787 356997 357104 355736 354191 352308 348777 343799
52892 343799 340025 339891 342755 345686 346656 345963 344899 344169 343670 342909 341324 338746 335735 333092 331100 329771
52876 329771 329583 331090 333655 335387 334778 332011 328480 325557 323971 323713 324001 323803 322867 322000 322114 323272
52860 323272 324900 326367 326962 325880 322985 319435 316906 316053 316108 315942 315105 313855 312687 312055 312282 313436
52844 313436 315304 317570 319933 322076 323705 324740 325424 326222 327583 329640 331966 333724 334364 334263 334427
$$ packed form
52953B50905L066K325P60j115k727l451k716p58J113J699J099K93r8o7L23J020
52937B51671J617J644J184O45Kj141k654l656l343j664Q20L261M691M560L374
52922B61011K293J848J522R45P39J655L377M973O178P331Q207Q034O874O019O389
52907C27395P212O884M857K184M85O41K075L054K210J07j368j545j883l531m978
52892C43799l774j34K864K931R70o93j064p30m99p61j585k578l011k643j992j329
52876C29771j88J507K565J732o09k767l531k923j586k58K88j98r36q67J14J158
52860C23272J628J467N95j082k895l550k529q53N5j66q37j250j168o32K27J154
52844C13436J868K266K363K143J629J035O84P98J361K057K326J758O40j01J64
$$ plain form
52829 334427 335428 336788 337622 337679 337486 337588 338093 338989 340447 342525 344908 347288 349718 352194 354086 354538
52813 354538 353423 351476 349513 347967 347148 347346 348439 349898 351432 353201 355210 357018 358323 359436 360791
52798 360791 362445 364357 366737 369637 372594 375198 377810 381234 385839 391228 396530 400778 403428 404859
52784 404859 406106 407863 410212 413334 417542 422172 425556 427013 427872 429297 429952 427500 422019 416113 411524
52769 411524 407418 402532 397386 393414 391045 389625 388417 386768 384009 380133 376077 372476 368559 363168
52755 363168 356574 350381 345699 342211 339108 336154 333569 331417 329520 327720 325919 323949 321743 319566
52741 319566 317798 316323 314429 311728 309066 307884 308381 308800 306997 302465 296405 290276 284895 280598 277343
52726 277343 274599 271838 269212 267229 265739 263919 261326 258352 255530 253063 251153 250037 249439 248601 247145
$$ packed form
52829C34427J001J360Q34N7j93J02N05Q96J458K078K383K380K430K476J892M52
52813C54538j115j947j963j546q19J98J093J459J534J769K009J808J305J113J355
52798C60791J654J912K380K900K957K604K612L424M605N389N302M248K650J431
52784D04859J247J757K349L122M208M630L384J457Q59J425O55k452n481n906m589
52769D11524m106m886n146l972k369j420j208j649k759l876m056l601l917n391
52755C63168o594o193m682l488l103k954k585k152j897j800j801j970k206k177
52741C19566j768j475j894k701k662j182M97M19j803m532o060o129n381m297l255
52726B77343k744k761k626j983j490j820k593k974k822k467j910j116n98q38j456
$$ plain form
52711 247145 245330 243256 240493 236940 233405 230808 229141 227675 225858 223649 221313 219262 217879 217129
52697 217129 216418 215090 213036 210721 208735 207263 205862 203792 200779 197300 193973 190976 188300 186041
52683 186041 183942 181270 177949 175285 174526 175080 175289 174711 174213 173952 172872 170564 168188 166886 166462 166177
52667 166177 165718 164801 163081 161160 160490 161406 162337 161843 160327 158900 157740 156759 156731 158192 160050 160822 160780
52650 160780 161454 163404 165990 169006 172891 177248 180702 182738 184584 187659 191942 196433 200684 205173
52636 205173 210099 214216 215426 213010 208981 206284 205632 205152 203441 201562 201116 201659 201337 199197 195543
52621 195543 190741 185227 180212 176810 174663 172633 170540 168913 167463 165369 162838 160783 159120 157093
52607 157093 155287 155382 157495 159507 159621 158047 155512 151874 147303 143418 141847 142395 143589 144290 143998 142513
$$ packed form
52711B47145j815k074k763l553l535k597j667j466j817k209k336k051j383p50
52697B17129p11j328k054k315j986j472j401k070l013l479l327k997k676k259
52683A86041k099k672l321k664p59N54K09n78m98k61j080k308k376j302m24k85
52667A66177m59r17j720j921o70R16R31m94j516j427j160r81k8J461J858P72m2
52650A60780O74J950K586L016L885M357L454K036J846L075M283M491M251M489
52636B05173M926M117J210k416m029k697o52m80j711j879m46N43l22k140l654
52621A95543m802n514n015l402k147k030k093j627j450k094k531k055j663k027
52607A57093j806R5K113K012J14j574k535l638m571l885j571N48J194P01k92j485
$$ plain form
52591 142513 140345 138762 138416 138388 137412 135544 133910 133429 134526 137276 140803 143095 142664 140136 137345 135218
52575 135218 133597 132669 133050 134303 134785 133683 132292 132537 134728 137471 139477 140835 142482 144928 147740
52560 147740 150122 151709 152615 152795 151827 149636 147165 145786 145952 146801 147248 147225 147562 148767 150227 150730 149731
52543 149731 148017 147106 148028 150637 153948 156856 158519 158461 156821 154594 153260 153764 155853 158582 161357
52528 161357 164190 166965 169128 170465 171676 173479 175352 176004 175163 174076 173950 174657 175468 176319 177635 179368
52512 179368 181014 182356 183480 184320 184951 186186 188970 192980 196622 198806 200239 202452 205833 209126 211011
52497 211011 211845 213486 217330 222859 228461 233264 237423 240805 242599 242607 241874 241327 240701 239751 239606 241581
52481 241581 245076 248040 249482 250351 251904 254262 256637 258012 257529 255246 252712 251791 252740 254317 255784
$$ packed form
52591A42513k168j583l46k8r76j868j634m81J097K750L527K292m31k528k791k127
52575A35218j621r28L81J253M82j102j391K45K191K743K006J358J647K446K812
52560A47740K382J587R06J80r68k191k471j379J66Q49M47k3L37J205J460N03r99
52543A49731j714r11R22K609L311K908J663n8j640k227j334N04K089K729K775
52528A61357K833K775K163J337J211J803J873O52q41j087j26P07Q11Q51J316J733
52512A79368J646J342J124Q40O31J235K784M010L642K184J433K213L381L293J885
52497B11011Q34J641L844N529N602M803M159L382J794Qp33n47o26r50j45J975
52481B41581L495K964J442Q69J553K358K375J375m83k283k534r21R49J577J467
$$ plain form
52466 255784 257616 259941 261618 261610 260326 258946 258189 258393 259915 262529 264919 265672 264681 263084 262092 262266
52450 262266 263562 265546 267609 269176 269662 268488 265782 262897 261323 260926 260205 258620 257524 258161 259767
52435 259767 260699 260729 261047 262278 263645 264154 263753 263000 262173 261059 259467 257687 256323 255687 255566 255741 256398
52418 256398 257608 258873 259951 261746 265204 269309 271639 271343 270338 270860 272949 275210 276935 278355 279563
52403 279563 280409 280969 281181 280534 279193 278902 281512 286729 292313 296366 298548 299348 299323 299079 298999 298757 297830
52386 297830 296515 295683 295513 295274 294530 293917 294502 296784 300335 304012 306608 307841 308549 309446 310037 309509 308400
52369 308400 308253 309500 310611 309762 306759 303008 300032 298245 296802 294476 290883 286840 283361 280640 278446
52354 278446 276975 276506 276481 275901 274574 273182 272150 271354 270930 271370 272518 273300 272752 270758 267846 265112
$$ packed form
52466B55784J832K325J677qj284j380p57K04J522K614K390P53r91j597r92J74
52450B62266J296J984K063J567M86j174k706k885j574l97p21j585j096O37J606
52435B59767R32L0L18J231J367N09m01p53q27j114j592j780j364o36j21J75O57
52418B56398J210J265J078J795L458M105K330k96j005N22K089K261J725J420J208
52403B79563Q46N60K12o47j341k91K610N217N584M053K182Q00k5k44q0k42r27
52386B97830j315q32j70k39p44o13N85K282L551L677K596J233P08Q97N91n28j109
52369C08400j47J247J111q49l003l751k976j787j443k326l593m043l479k721k194
52354B78446j471m69k5n80j327j392j032p96m24M40J148P82n48j994k912k734
$$ plain form
52338 265112 264274 266411 270099 272081 270761 268229 267871 270602 274455 277409 279373 281369 283756 285861 286948
52323 286948 287182 287615 289278 292306 296004 299622 302809 305443 307567 309608 312162 315341 318694 321854 324820
52308 324820 327601 330256 333363 337579 342368 346060 347868 349091 351577 355595 360140 364753 369792 375136
52294 375136 379851 383453 386600 390171 394353 398965 404089 409925 416324 422732 428449 432947 436317 439435
52280 439435 443215 447649 452035 456112 460275 464593 468474 471734 475120 479132 483037 485963 488378 491382
52266 491382 494881 497824 500316 504077 510239 517934 525888 534283 543698 552963 559755 563502 566360 570972
52252 570972 578217 587426 597550 607476 616304 624432 633698 645404 658612 671416 683612 696893 712442
52239 712442 729490 746550 763107 779580 796519 814563 834609 857196 881794 907126 932138
$$ packed form
52338B65112q38K137L688J982j320k532l58K731L853K954J964J996K387K105J087
52323B86948K34M33J663L028L698L618L187K634K124K041K554L179L353L160K966
52308C24820K781K655L107M216M789L692J808J223K486M018M545M613N039N344
52294C75136M715L602L147L571M182M612N124N836O399O408N717M498L370L118
52280D39435L780M434M386M077M163M318L881L260L386M012L905K926K415L004
52266D91382L499K943K492L761O162P695P954Q395R415R265O792L747K858M612
52252E70972P245R209J0124R926Q828Q128R266J1706J3208J2804J2196J3281J5549
52239G12442J7048J7060J6557J6473J6939J8044K0046K2587K4598K5332K5012
$$ plain form
52228 932138 956449 980244 1004153 1029059 1055605 1083747 1112863 1142068 1170440 1197447 1223469
52217 1223469 1249658 1276846 1304710 1332195 1358454 1383141 1406171 1427661 1447939 1467140 1484953
52206 1484953 1501065 1515721 1529408 1542162 1553700 1564052 1573505 1581883 1588500 1593025 1595961 1598158
52194 1598158 1600246 1602663 1605679 1609064 1612105 1614240 1615447 1615860 1615435 1614324 1613241 1613060 1614239 1616868 1620885
52179 1620885 1625826 1630851 1635673 1641296 1649115 1659260 1670468 1681680 1693176 1705993 1720803 1737574
52167 1737574 1755672 1773967 1791427 1808155 1825336 1843565 1861652 1877771 1891504 1903940 1915852
52156 1915852 1926649 1935237 1941158 1944602 1946072 1946475 1946881 1947458 1946954 1943974 1938644 1932370 1925933 1918543 1909061
52141 1909061 1897575 1885126 1872167 1858092 1842454 1826037 1810188 1795419 1781296 1767564 1754585
$$ packed form
52228I32138K4311K3795K3909K4906K6546K8142K9116K9205K8372K7007K6022
52217A223469K6189K7188K7864K7485K6259K4687K3030K1490K0278J9201J7813
52206A484953J6112J4656J3687J2754J1538J0352R453Q378O617M525K936K197
52194A598158K088K417L016L385L041K135J207M13m25j111j083j81J179K629M017
52179A620885M941N025M822N623P819J0145J1208J1212J1496J2817J4810J6771
52167A737574J8098J8295J7460J6728J7181J8229J8087J6119J3733J2436J1912
52156A915852J0797Q588N921L444J470M03M06N77n04k980n330o274o437p390r482
52141A909061j1486j2449j2959j4075j5638j6417j5849j4769j4123j3732j2979
$$ plain form
52130 1754585 1742477 1730556 1718190 1705741 1694084 1683535 1673861 1665005 1657090 1649889 1643040 1636735
52118 1636735 1631378 1626678 1621949 1617341 1613680 1610851 1607481 1602820 1597908 1593969 1590511 1586117 1580554 1574913
52104 1574913 1569919 1565381 1561345 1558610 1557547 1557138 1555683 1552143 1546578 1539724 1532536 1525907 1520316 1515499
52090 1515499 1510466 1504141 1496434 1488679 1482495 1477976 1473589 1468201 1462401 1457190 1452071 1445645 1437808 1430179
52076 1430179 1424108 1419167 1413912 1407502 1400386 1393932 1389450 1386912 1384517 1380110 1373139 1364767 1356296 1348397
52062 1348397 1341735 1337113 1334494 1332794 1331083 1329199 1326906 1323586 1319466 1316087 1314551 1313993 1312845 1311086
52048 1311086 1310130 1310788 1312414 1314176 1316275 1319604 1324673 1331142 1338428 1346797 1357653 1372104 1389255 1406878
52034 1406878 1424133 1442470 1463148 1485179 1507120 1529815 1555396 1583983 1613463 1642683 1672821
$$ packed form
52130A754585j2108j1921j2366j2449j1657j0549r674q856p915p201o849o305
52118A636735n357m700m729m608l661k829l370m661m912l939l458m394n563n641
52104A574913m994m538m036k735j063m09j455l540n565o854p188o629n591m817
52090A515499n033o325p707p755o184m519m387n388n800n211n119o426p837p629
52076A430179o071m941n255o410p116o454m482k538k395m407o971q372q471p899
52062A348397o662m622k619j700j711j884k293l320m120l379j536n58j148j759
52048A311086r56O58J626J762K099L329N069O469P286Q369J0856J4451J7151J7623
52034A406878J7255J8337K0678K2031K1941K2695K5581K8587K9480K9220L0138
$$ plain form
52023 1672821 1704872 1737528 1768667 1797664 1825071 1851095 1875686 1899545 1923746 1948565 1973432
52012 1973432 1997506 2019547 2038016 2052562 2064961 2077122 2088398 2096354 2100327 2102531 2105037 2107120
52000 2107120 2106664 2103065 2097346 2090015 2080430 2068487 2055740 2044199 2034534 2025833 2016854 2007242 1997654
51987 1997654 1988889 1980949 1973136 1965155 1957704 1951696 1947325 1944451 1943320 1943851 1944521 1943436 1940887 1939590
51973 1939590 1941678 1946537 1952337 1958423 1964917 1971166 1976566 1982387 1990602 2000640 2009323 2014727 2018394 2022755
51959 2022755 2027906 2032294 2035349 2037731 2039600 2040231 2039149 2036302 2031236 2023309 2012732 2000460 1987106
51946 1987106 1972851 1958167 1943467 1928065 1910564 1890324 1867556 1842143 1813754 1783210 1752190
51935 1752190 1721108 1688679 1654233 1619035 1584468 1550160 1515052 1479202 1443365 1407663 1371913
$$ packed form
52023A672821L2051L2656L1139K8997K7407K6024K4591K3859K4201K4819K4867
52012A973432K4074K2041J8469J4546J2399J2161J1276P956L973K204K506K083
52000B107120m56l599n719p331r585j1943j2747j1541r665q701q979r612r588
51987A997654q765p940p813p981p451o008m371k874j131N31O70j085k549j297
51973A939590K088M859N800O086O494O249N400N821Q215J0038Q683N404L667M361
51959B022755N151M388L055K382J869O31j082k847n066p927j0577j2272j3354
51946A987106j4255j4684j4700j5402j7501k0240k2768k5413k8389l0544l1020
51935A752190l1082l2429l4446l5198l4567l4308l5108l5850l5837l5702l5750
$$ plain form
51924 1371913 1336505 1301598 1266202 1229557 1192958 1158640 1126998 1096339 1065290 1033995 1003004
51913 1003004 972544 943263 916170 891210 867037 842867 819569 798356 779319 761872 745678
51902 745678 730477 715785 701498 688133 675915 664390 653452 643775 635328 626456 615641 603601
51890 603601 592509 583558 576393 570538 565952 562117 557806 552240 545825 539560 534245 530242 527239 524177
51876 524177 520074 515123 510444 506793 504104 502164 500782 499171 496127 491299 485608 480103 475089 470749
51862 470749 467681 466037 464686 462116 458000 453194 448371 443454 438460 434253 431928 431568 431827 430904 428071
51847 428071 424259 420962 418518 415816 411925 407603 404554 403256 402170 399451 394931 389966 385694 382217
51833 382217 379492 378037 378224 379423 380656 381669 382554 382603 380767 377382 374310 372917 372896 373441 374376 375339
$$ packed form
51924A371913l5408l4907l5396l6645l6599l4318l1642l0659l1049l1295l0991
51913A003004l0460k9281k7093k4960k4173k4170k3298k1213j9037j7447j6194
51902G45678j5201j4692j4287j3365j2218j1525j0938r677q447q872j0815j2040
51890F03601j1092q951p165n855m586l835m311n566o415o265n315m003l003l062
51876E24177m103m951m679l651k689j940j382j611l044m828n691n505n014m340
51862D70749l068j644j351k570m116m806m823m917m994m207k325l60K59r23k833
51847D28071l812l297k444k702l891m322l049j298j086k719m520m965m272l477
51833C82217k725j455J87J199J233J013Q85M9j836l385l072j393k1N45R35R63
$$ plain form
51817 375339 375150 373420 371975 373115 376810 380976 384179 386549 388257 388900 388610 388102 387150 384648 380930
51802 380930 378468 379101 381733 383967 385120 386302 388136 389823 390368 389799 389061 389230 390629 392380 393258 393452
51786 393452 394879 399081 405305 411364 415941 419252 421827 423656 424489 424288 423322 422125 421154 420221 418782
51771 418782 417238 417200 419588 423024 425122 425050 423786 422176 420123 417915 416997 418609 422177 425796 428110
51756 428110 429342 430568 432309 433991 434723 434437 434056 434634 436620 439821 443441 446052 446386 444673 442703
51741 442703 442120 443008 444459 445844 447073 448189 449209 449904 449523 447596 445289 444822 446824 449467 451043
51726 451043 452026 453307 453840 452155 449362 448427 450600 454511 458647 462699 466135 467603 466698 464990 464400
51711 464400 465421 467363 469418 471148 472822 475480 479710 484320 487328 488300 488465 488586 488293 487749 488228 490415
$$ packed form
51817C75339j89j730j445J140L695M166L203K370J708O43k90n08r52k502l718
51802C80930k462O33K632K234J153J182J834J687N45n69p38J69J399J751Q78J94
51786C93452J427M202O224O059M577L311K575J829Q33k01r66j197r71r33j439
51771D18782j544l8K388L436K098p2j264j610k053k208r18J612L568L619K314
51756D28110J232J226J741J682P32k86l81N78J986L201L620K611L34j713j970
51741D42703n83Q88J451J385J229J116J020O95l81j927k307m67K002K643J576
51726D51043R83J281N33j685k793r35K173L911M136M052L436J468r05j708n90
51711D64400J021J942K055J730J674K658M230M610L008R72J65J21k93n44M79K187
$$ plain form
51695 490415 493554 496865 500287 503283 504720 504995 506631 511318 517633 523087 527368 532061 537891 543787
51681 543787 548291 550696 551069 550142 548939 547839 546274 543773 540614 537030 532738 527926 523698 520761 518709
51666 518709 517381 517639 519588 521301 520875 518861 517083 515882 514282 512154 510276 508602 506328 503546 501005
51651 501005 498222 493730 487505 481366 476472 472032 467170 462605 459545 457981 456998 455938 454433 451992
51637 451992 448477 444623 441312 438427 434928 430088 424578 420341 419096 420562 422429 422648 421579 421296 423044
51622 423044 426298 430235 435104 441800 450651 460799 470264 476796 479510 479831 480228 481990 484776 487953
51608 487953 491281 494485 497464 501158 506798 513772 519393 521532 520584 518225 515276 511676 507692 503885
51594 503885 500123 495701 490404 484795 479337 473708 467103 459161 450688 443272 437664 432661 426381 418718
$$ packed form
51695D90415L139L311L422K996J437K75J636M687O315N454M281M693N830N896
51681E43787M504K405L73r27j203j100j565k501l159l584m292m812m228k937k052
51666E18709j328K58J949J713m26k014j778j201j600k128j878j674k274k782k541
51651E01005k783m492o225o139m894m440m862m565l060j564r83j060j505k441
51637D51992l515l854l311k885l499m840n510m237j245J466J867K19j069k83J748
51622D23044L254L937M869O696Q851J0148R465O532K714L21L97J762K786L177
51608D87953L328L204K979L694N640O974N621K139r48k359k949l600l984l807
51594E03885l762m422n297n609n458n629o605p942q473p416n608n003o280p663
$$ plain form
51580 418718 411534 406088 401517 396665 392151 389323 387885 386120 383192 379768 376413 372834 369084 366148
51566 366148 364613 363662 362065 359445 355949 351596 346879 343315 342211 343072 344299 345337 347035 349804 352656
51551 352656 354603 355936 357364 358671 359156 358890 358545 358300 357822 357191 356889 356993 357226 357801 359358 362050 365538
51534 365538 369754 374595 379011 381837 383806 387134 392494 397978 402037 405956 412029 420546 430146 440068
51520 440068 450185 459615 467506 475010 484405 496028 507782 517888 526396 533607 538893 541909 543521
51507 543521 544552 544737 543746 542150 540539 538783 537052 536451 537439 538490 537693 535190 532841 531872 532039 532868
51491 532868 534457 536959 540318 544876 551502 560711 571914 583683 594559 603735 611406 618409 625182
51478 625182 631124 635312 637741 639379 641018 642472 643093 642745 641999 641484 641257 640965 640560 640688 642198 645378
$$ packed form
51580D18718p184n446m571m852m514k828j438j765k928l424l355l579l750k936
51566C66148j535r51j597k620l496m353m717l564j104Q61J227J038J698K769K852
51551C52656J947J333J428J307M85k66l45k45m78o31l02J04K33N75J557K692L488
51534C65538M216M841M416K826J969L328N360N484M059L919O073Q517R600R922
51520D40068J0117R430P891P504R395J1623J1754J0106Q508P211N286L016J612
51507E43521J031J85r91j596j611j756j731o01R88J051p97k503k349r69J67Q29
51491E32868J589K502L359M558O626R209J1203J1769J0876R176P671P003O773
51478F25182N942M188K429J638J639J454O21l48p46n15k27k92m05J28J510L180
$$ plain form
51462 645378 649739 654277 657782 659386 659505 659963 662251 665483 666883 664595 659358 653080 646616 639662 632157
51447 632157 624706 617631 610368 602102 592720 583025 574158 566791 560816 555794 551602 548288 545370 541861
51433 541861 537397 532979 530126 529359 529747 529841 528857 526986 524724 522119 518935 515587 513378 513265 514627 515919
51417 515919 516405 516596 517168 518344 520404 523804 528432 533552 538839 544699 551185 557493 563189 569221 576930
51402 576930 586481 596947 607564 618221 628937 639362 648756 656259 661684 666220 671730 678775 685791
51389 685791 690707 692988 693707 694082 694441 694264 692829 690172 687546 686376 686650 687145 687412 688277 689845 690304
51373 690304 687817 682651 676359 669775 662996 656327 649672 641653 630973 618338 605570 593189 580522
51360 580522 567820 556301 546024 535646 524849 515365 508778 504659 501508 498283 494386 489547 484739
$$ packed form
51462F45378M361M538L505J604J19M58K288L232J400k288n237o278o464o954p505
51447F32157p451p075p263q266r382r695q867p367n975n022m192l314k918l509
51433E41861m464m418k853p67L88R4r84j871k262k605l184l348k209j13J362J292
51417E15919M86J91N72J176K060L400M628N120N287N860O486O308N696O032P709
51402E76930R551J0466J0617J0657J0716J0425R394P503N425M536N510P045P016
51389F85791M916K281P19L75L59j77j435k657k626j170K74M95K67Q65J568M59
51373F90304k487n166o292o584o779o669o655q019j0680j2635j2768j2381j2667
51360E80522j2702j1519j0277j0378j0797r484o587m119l151l225l897m839m808
$$ plain form
51347 484739 482065 482619 485155 487750 489997 492651 495920 499294 502671 506565 511315 516720 522182 526619
51333 526619 528725 528141 526083 523995 521778 518027 511836 503615 494261 484260 473659 462320 450158
51320 450158 437639 425963 416174 408043 400305 391993 382989 373395 363147 352624 342971 335230 329315
51307 329315 324209 319016 313493 307750 302002 296739 292775 290638 289848 289049 287063 283794 280088 276864 274559
51292 274559 273161 272385 271697 270462 268324 265530 262905 261477 261839 263554 265368 266388 266994 268228 270294
51277 270294 272210 273052 273071 273374 274938 278091 282422 286861 290362 292919 295521 298663 301437 302759 303103
51262 303103 304189 307069 311372 316473 322486 329739 338035 346890 355990 364948 373093 380077 386339 392324
51248 392324 397465 400636 401540 400948 399401 396396 391251 384356 377034 370311 364151 357849 350897 343509 336328
$$ packed form
51347D84739k674N54K536K595K247K654L269L374L377L894M750N405N462M437
51333E26619K106n84k058k088k217l751o191q221r354j0001j0601j1339j2162
51320D50158j2519j1676r789q131p738q312r004r594j0248j0523r653p741n915
51307C29315n106n193n523n743n748n263l964k137p90p99j986l269l706l224k305
51292B74559j398p76o88j235k138k794k625j428L62J715J814J020O06J234K066
51277B70294J916Q42J9L03J564L153M331M439L501K557K602L142K774J322L44
51262C03103J086K880M303N101O013P253Q296Q855R100Q958Q145O984O262N985
51248C92324N141L171R04n92j547l005n145o895p322o723o160o302o952p388p181
$$ plain form
51233 336328 329608 322798 315280 307515 300864 296009 292103 287939 283445 279290 275449 271181 266410 262060
51219 262060 258686 255650 252237 248934 246856 246203 245968 245170 243908 243043 243049 243283 242509 240299 237761 236561
51203 236561 237277 239102 240987 242470 243431 243875 244097 244259 243707 241744 239377 238956 241273 244291 245912 246785
51187 246785 248709 251117 251358 248400 244221 240984 238621 236059 233426 231716 231077 230576 229391 227544 225720
51172 225720 224910 225807 228065 230395 231809 232492 233138 233909 234409 234377 234002 233852 234660 236711 239192 240733 240966
51155 240966 240945 241605 242442 242454 241765 241440 241966 242944 244333 247066 251898 258104 263866 267876 270222 271591 271927
51138 271927 270479 267307 264026 262204 261373 259769 257082 255120 255173 256081 256157 256073 258115 262653 266911 267816
51122 267816 265238 261861 260395 261343 263076 263655 262613 261129 260492 260735 261040 261073 261237 261798 262573 263591 265264
$$ packed form
51233C36328o720o810p518p765o651m855l906m164m494m155l841m268m771m350
51219B62060l374l036l413l303k078o53k35p98j262q65OK34p74k210k538j200
51203B36561P16J825J885J483R61M44K22J62n52j963k367m21K317L018J621Q73
51187B46785J924K408K41k958m179l237k363k562k633j710o39n01j185j847j824
51172B25720q10Q97K258K330J414O83O46P71N00l2l75j50Q08K051K481J541K33
51155B40966k1O60Q37J2o89l25N26R78J389K733M832O206N762M010K346J369L36
51138B71927j448l172l281j822q31j604k687j962N3R08P6q4K042M538M258R05
51122B67816k578l377j466R48J733N79j042j484o37K43L05L3J64N61P75J018J673
$$ plain form
51105 265264 267473 269038 268627 266027 262291 258935 257134 257156 258075 258188 256385 253274 250776 250345 251574 252539
51089 252539 251479 248150 243584 238866 234510 230948 228866 228499 228886 228596 227310 226210 226697 229056 232446
51074 232446 235726 238110 239421 240061 240547 240932 240924 240749 241533 244390 249115 254062 257403 258470 257910 256758
51058 256758 255524 254139 252535 250931 249494 248022 246204 243930 241152 237740 233938 230679 228918 228710
51044 228710 229374 230430 231738 232849 233059 232393 231794 231947 232516 232958 233512 234819 237025 239812 242767 245154
51028 245154 245915 244937 244076 245696 250015 254691 257320 257582 256677 255635 254962 255274 257139 260239 263396 265747
51012 265747 267532 269487 271668 273240 273510 272906 272614 273138 273637 273111 272001 271923 273677 276258 278225 279515
50996 279515 281262 284163 287780 291284 294141 295982 296559 296271 296191 297085 298632 300071 301367 303228 306062
$$ packed form
51105B65264K209J565m11k600l736l356j801K2R19J13j803l111k498m31J229R65
51089B52539j060l329m566m718m356l562k082l67L87k90j286j100M87K359L390
51074B32446L280K384J311O40M86L85qj75P84K857M725M947L341J067n60j152
51058B56758j234j385j604j604j437j472j818k274k778l412l802l259j761k08
51044B28710O64J056J308J111K10o66n99J53N69M42N54J307K206K787K955K387
51028B45154P61r78q61J620M319M676K629K62r05j042o73L12J865L100L157K351
51012B65747J785J955K181J572K70o04k92N24M99n26j110p8J754K581J967J290
50996B79515J747K901L617L504K857J841N77k88q0Q94J547J439J296J861K834
$$ plain form
50981 306062 309498 313047 316682 320374 323437 324989 324991 324255 323191 321131 317430 312994 309968 309727 311602
50966 311602 313790 315175 316032 317287 319554 322790 326379 329523 331814 333552 335415 337831 340876 344624
50952 344624 349279 354784 360540 365686 369638 372340 374176 375804 378118 382146 388557 396880 405342 412026
50938 412026 416627 420862 426956 435807 446783 458789 471106 483400 495548 507580 519605 531967
50926 531967 545666 562085 581549 602385 622337 641158 661170 685054 713470 744814 776626
50915 776626 807257 837174 869130 906297 949603 997284 1047324 1099626 1155469 1215759 1280771
50904 1280771 1350877 1426206 1505674 1587375 1670182 1754335 1840388 1928043 2016025 2102480 2185456
50893 2185456 2263477 2335825 2402037 2461357 2513162 2557643 2595345 2626045 2648854 2663567 2671281
$$ packed form
50981C06062L436L549L635L692L063J552Kp36j064k060l701m436l026k41J875
50966C11602K188J385Q57J255K267L236L589L144K291J738J863K416L045L748
50952C44624M655N505N756N146L952K702J836J628K314M028O411Q323Q462O684
50938D12026M601M235O094Q851J0976J2006J2317J2294J2148J2032J2025J2362
50926E31967J3699J6419J9464K0836J9952J8821K0012K3884K8416L1344L1812
50915G76626L0631K9917L1956L7167M3306M7681N0040N2302N5843O0290O5012
50904A280771P0106P5329P9468Q1701Q2807Q4153Q6053Q7655Q7982Q6455Q2976
50893B185456P8021P2348O6212N9320N1805M4481L7702L0700K2809J4713P714
$$ plain form
50882 2671281 2673417 2670685 2663309 2651828 2637308 2620953 2603642 2585720 2567253 2548668 2530720 2513236
50870 2513236 2494066 2470198 2440214 2405035 2366132 2323796 2277452 2226738 2171528 2111538 2046859
50859 2046859 1978642 1908484 1837272 1765306 1693368 1622884 1554862 1489426 1426699 1367574 1313112
50848 1313112 1263532 1218282 1176918 1139499 1106149 1076703 1050875 1028402 1008871 991716 976583
50837 976583 963485 952278 942351 933302 925845 921421 920637 922411 924869 926851 928362 929925 931947 934688
50823 934688 938528 943954 951115 959373 967723 976051 985754 998486 1014322 1031876 1050234 1069933 1091845
50810 1091845 1116070 1142462 1171282 1202469 1235034 1268208 1302752 1340129 1380752 1424138 1470530
50799 1470530 1521212 1577113 1638185 1704421 1776745 1856632 1945370 2043737 2151738 2268636 2393831
$$ packed form
50882B671281K136k732p376j1481j4520j6355j7311j7922j8467j8585j7948j7484
50870B513236j9170k3868k9984l5179l8903m2336m6344n0714n5210n9990o4679
50859B046859o8217p0158p1212p1966p1938p0484o8022o5436o2727n9125n4462
50848A313112m9580m5250m1364l7419l3350k9446k5828k2473j9531j7155j5133
50837I76583j3098j1207r927r049p457m424p84J774K458J982J511J563K022K741
50823I34688L840N426P161Q258Q350Q328R703J2732J5836J7554J8358J9699K1912
50810A091845K4225K6392K8820L1187L2565L3174L4544L7377M0623M3386M6392
50799A470530N0682N5901O1072O6236P2324P9887Q8738R8367J08001J16898J25195
$$ plain form
50788 2393831 2527684 2670934 2823457 2984373 3153208 3330107 3514873 3706513 3903348
50779 3903348 4102529 4299523 4489454 4669214 4837301 4991558 5128391 5244515 5338196 5408556
50769 5408556 5455347 5480303 5487248 5479683 5459219 5427449 5388273 5346826 5306568 5268565 5233123 5200769
50757 5200769 5171629 5144825 5118613 5090536 5057504 5016333 4964322 4899328 4819994 4726386 4619791
50746 4619791 4501298 4371125 4229818 4079369 3922480 3761468 3598790 3437874 3282276
50737 3282276 3134259 2994954 2865326 2745977 2636619 2536958 2447824 2370266 2303830 2247021
50727 2247021 2199324 2161516 2133968 2115852 2106113 2103895 2107601 2114702 2123207 2132624 2142955 2153272
50715 2153272 2161718 2166509 2166691 2162322 2154180 2143010 2128956 2111952 2092385 2070940 2048036 2023999
$$ packed form
50788B393831J33853J43250J52523J60916J68835J76899J84766J91640J96835
50779C903348J99181J96994J89931J79760J68087J54257J36833J16124R3681P0360
50769E408556M6791K4956O945p565k0464l1770l9176m1447m0258l8003l5442l2354
50757E200769k9140k6804k6212k8077l3032m1171n2011o4994p9334r3608j06595
50746D619791j18493j30173j41307j50449j56889j61012j62678j60916j55598
50737C282276j48017j39305j29628j19349j09358r9661q9134p7558o6436n6809
50727B247021m7697l7808k7548j8116r739k218L706P101Q505R417J0331J0317
50715B153272Q446M791J82m369q142j1170j4054j7004j9567k1445k2904k4037
$$ plain form
50703 2023999 1999531 1975239 1950841 1925616 1899645 1873904 1849258 1826124 1805045 1786696 1771400
50692 1771400 1759448 1751762 1749203 1751360 1757287 1767510 1783826 1806658 1834052 1864180 1897604 1935942
50680 1935942 1979202 2025737 2074350 2125180 2178771 2235525 2296389 2363187 2437749 2520998 2613053
50669 2613053 2713810 2822943 2939327 3060792 3184823 3309519 3433573 3555160 3671296
50660 3671296 3778775 3875399 3959724 4029922 4083759 4119737 4137646 4138104 4122375 4092700 4051888
50649 4051888 4002299 3945880 3885300 3824175 3765803 3712278 3664846 3624053 3589174 3558547 3531199
50638 3531199 3507218 3485829 3463929 3437467 3403805 3361999 3311551 3252039 3183836 3108264 3026971
50627 3026971 2941647 2854152 2766387 2680185 2597606 2520819 2451097 2388339 2332227 2283460 2243160
$$ packed form
50703B023999k4468k4292k4398k5225k5971k5741k4646k3134k1079j8349j5296
50692A771400j1952p686k559K157N927J0223J6316K2832K7394L0128L3424L8338
50680A935942M3260M6535M8613N0830N3591N6754O0864O6798P4562Q3249R2055
50669B613053J00757J09133J16384J21465J24031J24696J24054J21587J16136
50660C671296J07479R6624Q4325P0198N3837L5978J7909M58j5729k9675m0812
50649D051888m9589n6419o0580o1125n8372n3525m7432m0793l4879l0627k7348
50638C531199k3981k1389k1900k6462l3662m1806n0448n9512o8203p5572q1293
50627C026971q5324q7495q7765q6202q2579p6787o9722o2758n6112m8767m0300
$$ plain form
50616 2243160 2211489 2187652 2171148 2162374 2162388 2172727 2195017 2229692 2275161 2329029 2389925 2457334
50604 2457334 2529948 2605512 2682365 2759861 2836872 2910945 2979560 3041393 3095908 3142734 3182366
50593 3182366 3216710 3247729 3275646 3299275 3318084 3333204 3346346 3358306 3368720 3376925 3382858 3387425
50581 3387425 3392221 3398796 3408104 3420536 3436260 3455282 3477368 3502273 3530006 3560582 3593509 3627776
50569 3627776 3662396 3696688 3729919 3761028 3788954 3813006 3832600 3846862 3855037 3857409 3855381 3850356
50557 3850356 3842860 3833227 3823020 3815215 3812643 3816295 3825242 3838017 3853896 3872835 3894276 3916080
50545 3916080 3934931 3948114 3955058 3956903 3954259 3945614 3928344 3901307 3865873 3823858 3774635 3715011
50533 3715011 3642437 3557944 3465448 3368371 3267712 3163376 3056422 2949320 2844483 2743357
$$ packed form
50616B243160l1671k3837j6504q774J4J0339K2290L4675M5469N3868O0896O7409
50604B457334P2614P5564P6853P7496P7011P4073O8615O1833N4515M6826L9632
50593C182366L4344L1019K7917K3629J8809J5120J3142J1960J0414Q205N933M567
50581C387425M796O575R308J2432J5724J9022K2086K4905K7733L0576L2927L4267
50569C627776L4620L4292L3231L1109K7926K4052J9594J4262Q175K372k028n025
50557C850356p496r633j0207p805k572L652Q947J2775J5879J8939K1441K1804
50545C916080J8851J3183O944J845k644q645j7270k7037l5434m2015m9223n9624
50533C715011p2574q4493r2496r7077j00659j04336j06954j07102j04837j01126
$$ plain form
50523 2743357 2646725 2555181 2469147 2388848 2314364 2245525 2181905 2123295 2070058 2022632 1980937
50512 1980937 1944831 1914814 1891402 1873870 1860608 1850951 1845677 1845341 1849178 1856441 1867916 1884945
50500 1884945 1907353 1933514 1962491 1995087 2032598 2075377 2123096 2175791 2233930 2297609 2366219
50489 2366219 2439126 2516464 2599075 2687559 2781284 2878305 2976197 3072990 3167540 3259287 3347787
50478 3347787 3432442 3512784 3589135 3662725 3734751 3805477 3874760 3943392 4013105 4084923 4158172
50467 4158172 4231687 4305543 4381083 4459562 4541324 4626098 4713563 4803722 4897026 4993882 5093689
50456 5093689 5194606 5294622 5392313 5485929 5572364 5648179 5711557 5762114 5798660 5818432 5819219
50445 5819219 5801402 5766942 5716867 5650783 5568929 5473923 5370140 5261738 5151577 5041864
$$ packed form
50523B743357r6632r1544q6034q0299p4484o8839o3620n8610n3237m7426m1695
50512A980937l6106l0017k3412j7532j3262r657n274l36L837P263J1475J7029
50500A884945K2408K6161K8977L2596L7511M2779M7719N2695N8139O3679O8610
50489B366219P2907P7338Q2611Q8484R3725R7021R7892R6793R4550R1747Q8500
50478C347787Q4655Q0342P6351P3590P2026P0726O9283O8632O9713P1818P3249
50467D158172P3515P3856P5540P8479Q1762Q4774Q7465R0159R3304R6856R9807
50456E093689J00917J00016R7691R3616Q6435P5815O3378N0557L6546J9772P87
50445E819219j7817l4460n0075o6084q1854r5006j03783j08402j10161j09713
$$ plain form
50435 5041864 4935415 4835915 4746801 4670123 4606751 4557461 4523129 4503670 4497286 4501221 4512908
50424 4512908 4529892 4548924 4565829 4576423 4577145 4564802 4536243 4488715 4420509 4331412 4223097
50413 4223097 4099377 3965460 3826013 3683559 3538867 3392874 3247957 3107349 2973586
50404 2973586 2847650 2729288 2617990 2513944 2418345 2332757 2257848 2192653 2135143 2083626
50394 2083626 2037603 1997447 1963522 1935739 1913740 1897088 1885125 1877075 1872830 1873523 1880568 1893763
50382 1893763 1910940 1930047 1951087 1975171 2002164 2030588 2059989 2091993 2128235 2168256 2210396
50371 2210396 2254040 2299894 2348376 2398848 2450317 2502014 2553363 2604296 2655637 2708171 2761109
50360 2761109 2812327 2860536 2906593 2952196 2997753 3042038 3083788 3123348 3162767 3204271 3248420
$$ packed form
50435E041864j06449r9500q9114p6678o3372m9290l4332j9459o384L935J1687
50424D512908J6984J9032J6905J0594P22j2343k8559m7528o8206q9097j08315
50413D223097j23720j33917j39447j42454j44692j45993j44917j40608j33763
50404B973586j25936j18362j11298j04046r5599q5588p4909o5195n7510n1517
50394B083626m6023m0156l3925k7783k1999j6652j1963q050m245O93P045J3195
50382A893763J7177J9107K1040K4084K6993K8424K9401L2004L6242M0021M2140
50371B210396M3644M5854M8482N0472N1469N1697N1349N0933N1341N2534N2938
50360B761109N1218M8209M6057M5603M5557M4285M1750L9560L9419M1504M4149
$$ plain form
50349 3248420 3293824 3338873 3383626 3429632 3478110 3528732 3579950 3629982 3677596 3722411 3764277
50338 3764277 3801967 3833019 3855647 3870268 3877988 3877957 3867644 3845581 3812277 3768223 3712789 3645785
50326 3645785 3568570 3482656 3388572 3287301 3181794 3075815 2971936 2871599 2776292 2687525
50316 2687525 2606460 2534635 2474309 2426711 2390605 2363820 2345721 2336782 2336296 2342050 2351984 2364419
50304 2364419 2376704 2385359 2387984 2383846 2372397 2352701 2324654 2289409 2247921 2200325 2147433 2091690
50292 2091690 2035689 1980465 1925925 1872154 1819451 1767903 1717916 1670682 1627247 1587442 1550506
50281 1550506 1516442 1485962 1459340 1436129 1415915 1398576 1383858 1371458 1361664 1355245 1352390 1352208
50269 1352208 1353536 1355915 1359624 1365149 1372944 1383374 1396493 1411909 1429189 1448276 1469250 1491785
$$ packed form
50349C248420M5404M5049M4753M6006M8478N0622N1218N0032M7614M4815M1866
50338C764277L7690L1052K2628J4621P720l1j0313k2063l3304m4054n5434o7004
50326C645785p7215q5914r4084j01271j05507j05979j03879j00337r5307q8767
50316B687525q1065p1825o0326m7598l6106k6785j8099q939m86N754R934J2435
50304B364419J2285Q655K625m138j1449j9696k8047l5245m1488m7596n2892n5743
50292B091690n6001n5224n4540n3771n2703n1548m9987m7234m3435l9805l6936
50281A550506l4064l0480k6622k3211k0214j7339j4718j2400r794o419k855j82
50269A352208J328K379L709N525P795J0430J3119J5416J7280J9087K0974K2535
$$ plain form
50257 1491785 1515200 1539087 1563488 1588491 1614158 1641141 1670690 1703282 1737446 1770738 1801987
50246 1801987 1832060 1862445 1893692 1925324 1956432 1985936 2012843 2036767 2057770 2075465 2088880
50235 2088880 2097695 2103013 2106334 2108196 2108281 2106172 2101281 2092680 2080002 2064230 2046590 2026851 2003717
50222 2003717 1976814 1947298 1916377 1884210 1850539 1815602 1780043 1744583 1710077 1677227 1645722
50211 1645722 1614165 1581395 1547727 1514598 1483232 1453927 1426391 1400316 1375537 1351857 1329065
50200 1329065 1307345 1287470 1270153 1255223 1241981 1230458 1221496 1215150 1209861 1204088 1198256 1194213
50188 1194213 1193147 1194736 1197793 1200778 1202244 1202073 1201989 1203528 1205750 1206539 1206088 1207129 1211194 1216384 1219850
50173 1219850 1220960 1220754 1219480 1216354 1211133 1204482 1196905 1188570 1180151 1172716 1166577 1160964 1155041 1148686
$$ packed form
50257A491785K3415K3887K4401K5003K5667K6983K9549L2592L4164L3292L1249
50246A801987L0073L0385L1247L1632L1108K9504K6907K3924K1003J7695J3415
50235B088880Q815N318L321J862Q5k109m891q601j2678j5772j7640j9739k3134
50222B003717k6903k9516l0921l2167l3671l4937l5559l5460l4506l2850l1505
50211A645722l1557l2770l3668l3129l1366k9305k7536k6075k4779k3680k2792
50200A329065k1720j9875j7317j4930j3242j1523q962o346n289n773n832m043
50188A194213j066J589L057K985J466j71q4J539K222P89m51J041M065N190L466
50173A219850J110k06j274l126n221o651p577q335q419p435o139n613n923o355
$$ plain form
50159 1148686 1142104 1135143 1127279 1118167 1108269 1099019 1092072 1087999 1085890 1084536 1083843 1084772 1087986 1092923
50145 1092923 1098149 1102430 1105496 1107976 1110612 1113608 1116799 1120254 1124214 1128411 1131928 1134002 1134600 1134044
50131 1134044 1132483 1130039 1127125 1124230 1121511 1118665 1115044 1109910 1102990 1094881 1086438 1077658 1067685 1056098
50117 1056098 1043614 1031172 1018882 1006425 994111 982917 973461 965319 957434 949232 941440 935672
50105 935672 932820 931855 930651 928019 924485 921175 918731 917393 917122 917018 915337 910901 904214 896658 888952
50090 888952 880878 872265 863696 856290 850923 847426 844398 840353 835273 830638 827798 826840 827099 827866 828192
50075 828192 827005 824284 821496 820102 820167 821115 823179 827064 832599 838721 844678 850445 856164 862064 868767
50060 868767 876869 886179 895926 905486 914291 921519 926966 932081 938960 948132 958166 967545 975952 983549
$$ packed form
50159A148686o582o961p864r112r898r250o947m073k109j354o93R29L214M937
50145A092923N226M281L066K480K636K996L191L455L960M197L517K074N98n56
50131A134044j561k444k914k895k719k846l621n134o920q109q443q780r973j1587
50117A056098j2484j2442j2290j2457j2314j1194r456q142p885q202p792n768
50105I35672k852r65j204k632l534l310k444j338k71j04j681m436o687p556p706
50090H88952q074q613q569p406n367l497l028m045n080m635k840r58K59P67L26
50075H28192j187k721k788j394O5R48K064L885N535O122N957N767N719N900O703
50060H68767Q102R310R747R560Q805P228N447N115O879R172J0034R379Q407P597
$$ plain form
50046 983549 990186 995981 1001806 1008309 1014829 1019880 1022511 1022925 1022211 1021983 1023816 1028197 1033962 1039233 1043084
50031 1043084 1046188 1049962 1055341 1062194 1069499 1076095 1081779 1087927 1096712 1109311 1124872 1141488 1157989
50018 1157989 1174427 1190956 1207033 1222150 1236887 1252511 1269692 1288135 1307415 1327611 1349071
50007 1349071 1371926 1395831 1419846 1442795 1464290 1485235 1506627 1528057 1548309 1567359 1586650
49996 1586650 1607132 1628228 1649235 1670590 1692892 1715564 1737531 1758652 1779531 1800338 1820690
49985 1820690 1840466 1860016 1879796 1900240 1921597 1943516 1965498 1988323 2014073 2043910 2076695
49974 2076695 2110883 2146870 2186110 2228716 2273853 2322161 2375827 2435957 2501496 2570997 2643523
49963 2643523 2717018 2787412 2850778 2905644 2952249 2990456 3019626 3040105 3053764 3063090 3070390 3077602
$$ packed form
50046I83549O637N795N825O503O520N051K631M14p14k28J833M381N765N271L851
50031A043084L104L774N379O853P305O596N684O148Q785J2599J5561J6616J6501
50018A157989J6438J6529J6077J5117J4737J5624J7181J8443J9280K0196K1460
50007A349071K2855K3905K4015K2949K1495K0945K1392K1430K0252J9050J9291
49996A586650K0482K1096K1007K1355K2302K2672K1967K1121K0879K0807K0352
49985A820690J9776J9550J9780K0444K1357K1919K1982K2825K5750K9837L2785
49974B076695L4188L5987L9240M2606M5137M8308N3666O0130O5539O9501P2526
49963B643523P3495P0394O3366N4866M6605L8207K9170K0479J3659R326P300P212
$$ plain form
49951 3077602 3085926 3095263 3104198 3110516 3111715 3105512 3090325 3065163 3028866 2979880 2917407 2842773
49939 2842773 2759259 2670510 2579266 2487519 2397268 2310503 2228320 2150498 2076351 2005882 1939714
49928 1939714 1877972 1819940 1765044 1713453 1665272 1619754 1576026 1534201 1495138 1459399 1427087
49917 1427087 1398246 1372510 1348628 1325393 1303082 1282997 1265450 1249109 1232671 1216444 1201874
49906 1201874 1189953 1180298 1171352 1161519 1150620 1140382 1132965 1129048 1127733 1127959 1129076 1130321 1130988 1131350
49892 1131350 1132248 1133338 1132913 1130063 1126070 1122930 1121321 1120785 1121108 1122525 1125101 1128926 1134668 1143080 1154039
49877 1154039 1166670 1180297 1194680 1209584 1224854 1241007 1259180 1280381 1304984 1332902 1363813
49866 1363813 1397237 1432754 1470305 1510185 1552765 1598369 1647321 1700024 1757056 1819291 1887807
$$ packed form
49951C077602Q324R337Q935O318J199o203j5187k5162l6297m8986o2473p4634
49939B842773q3514q8749r1244r1747r0251q6765q2183p7822p4147p0469o6168
49928A939714o1742n8032n4896n1591m8181m5518m3728m1825l9063l5739l2312
49917A427087k8841k5736k3882k3235k2311k0085j7547j6341j6438j6227j4570
49906A201874j1921r655q946r833j0899j0238p417l917j315K26J117J245O67L62
49892A131350Q98J090m25k850l993l140j609n36L23J417K576L825N742Q412J0959
49877A154039J2631J3627J4383J4904J5270J6153J8173K1201K4603K7918L0911
49866A363813L3424L5517L7551L9880M2580M5604M8952N2703N7032O2235O8516
$$ [...]
##END NTUPLES=NMR SPECTRUM
##END=
