##TITLE=coffee_type TOFR01-ROVE100A_50-50%
COFFEE_meoh_noesyp64 COFFEE_meoh {C:\Bruker\TOPSPIN} Administrator 13
##JCAMPDX= 6.0         $$ Bruker NMR JCAMP-DX V2.0
##DATA TYPE= NMR SPECTRUM
##DATA CLASS= NTUPLES
##ORIGIN= Bruker BioSpin GmbH
##OWNER= Administrator
$$ 1.72 TOPSPIN		Version 2.1
$$ 2012-05-18 15:49:46.604 -0700  Administrator@X
$$ Compression mode = diff/dup
##.OBSERVE FREQUENCY= 400.13188235
##.OBSERVE NUCLEUS= ^1H
##.ACQUISITION MODE= SIMULTANEOUS (DQD)
##.ACQUISITION SCHEME= undefined
##.AVERAGES= 64
##.DIGITISER RES= 22
##SPECTROMETER/DATA SYSTEM= spect
##.PULSE SEQUENCE= noesygpps1d.comp
##.SOLVENT NAME= COFFEE_meoh
##.SHIFT REFERENCE= INTERNAL, COFFEE_meoh, 1, 14.98061
##AUDIT TRAIL= $$ (NUMBER, WHEN, WHO, WHERE, PROCESS, VERSION, WHAT)
$$ ##TITLE= Audit trail, TOPSPIN		Version 2.1
$$ ##JCAMPDX= 5.01
$$ ##ORIGIN= Bruker BioSpin GmbH
$$ ##OWNER= Administrator
$$ $$ C:\Bruker\TOPSPIN/data/Administrator/nmr/12-COFFEE-2502/72/pdata/1/auditp.txt
$$ ##AUDIT TRAIL=  $$ (NUMBER, WHEN, WHO, WHERE, PROCESS, VERSION, WHAT)
(   1,<2012-02-25 15:53:30.625 -0500>,<Administrator>,<TOPSPIN>,<go>,<TOPSPIN 2.1>,
      <created by zg
	started at 2012-02-25 15:42:00.391 -0500,
	POWCHK enabled, PULCHK disabled,
       configuration hash MD5:
       B0 76 FB 9C 50 81 44 7D 18 B3 26 32 4E 60 AD 96
       data hash MD5: 64K
       C3 A0 42 19 2D 83 70 94 A5 F4 CF 35 AB F2 32 C7>)
(   2,<2012-02-25 15:53:33.500 -0500>,<Administrator>,<TOPSPIN>,<proc1d>,<TOPSPIN 2.1>,
      <Start of raw data processing
       efp LB = 0.3 FT_mod = 6 PKNL = 1 PHC0 = 0 PHC1 = 0 SI = 128K 
       data hash MD5: 128K
       36 2D B6 FF 98 3E 8B 7C 36 97 13 5B 32 5F D2 A0>)
(   3,<2012-02-25 15:53:34.859 -0500>,<Administrator>,<TOPSPIN>,<proc1d>,<TOPSPIN 2.1>,
      <pk PHC0 = 24.60388 PHC1 = 0 
       data hash MD5: 128K
       68 13 A7 C7 1A C1 B1 38 A7 8A 9C 18 D7 3F 21 20>)
(   4,<2012-02-25 15:53:35.141 -0500>,<Administrator>,<TOPSPIN>,<proc1d>,<TOPSPIN 2.1>,
      <abs ABSG = 1 
       data hash MD5: 128K
       FB 01 7F 5C 94 79 B5 18 D7 3E 91 1C 71 D1 9C 58>)
(   5,<2012-02-25 15:53:35.219 -0500>,<Administrator>,<TOPSPIN>,<proc1d>,<TOPSPIN 2.1>,
      <abs ABSG = 2 
       data hash MD5: 128K
       FB C4 7A B1 2E A3 02 D3 89 2A 21 94 69 85 B0 72>)
(   6,<2012-02-25 15:53:35.437 -0500>,<Administrator>,<TOPSPIN>,<proc1d>,<TOPSPIN 2.1>,
      <abs ABSG = 3 
       data hash MD5: 128K
       BE 75 C8 1C 9E 43 79 C7 5C A6 0D 2B 0A EF FD 32>)
(   7,<2012-02-25 15:53:35.578 -0500>,<Administrator>,<TOPSPIN>,<proc1d>,<TOPSPIN 2.1>,
      <abs ABSG = 4 
       data hash MD5: 128K
       09 C6 7D 8A 24 F6 96 7D 9E 9B 3D 23 47 98 43 A5>)
(   8,<2012-02-25 15:53:35.641 -0500>,<Administrator>,<TOPSPIN>,<proc1d>,<TOPSPIN 2.1>,
      <abs ABSG = 5 
       data hash MD5: 128K
       60 C7 FC 16 0E E7 10 66 E6 B3 27 DE AB 6B 71 E3>)
(   9,<2012-02-25 15:53:35.781 -0500>,<Administrator>,<TOPSPIN>,<audit>,<TOPSPIN 2.1>,
      <user comment:
       ICON-NMR User ID: Administrator
$$ [...]
150 150 150 150 150 150 150 150
##$TP07= 0
##$TPNAME0= <>
##$TPNAME1= <>
##$TPNAME2= <>
##$TPNAME3= <>
##$TPNAME4= <>
##$TPNAME5= <>
##$TPNAME6= <>
##$TPNAME7= <>
##$TPOAL= (0..7)
0.5 0.5 0.5 0.5 0.5 0.5 0.5 0.5
##$TPOFFS= (0..7)
0 0 0 0 0 0 0 0
##$TUNHIN= 0
##$TUNHOUT= 0
##$TUNXOUT= 0
##$USERA1= <user>
##$USERA2= <user>
##$USERA3= <user>
##$USERA4= <user>
##$USERA5= <user>
##$V9= 5
##$VALIST= <valist>
##$VCLIST= <CCCCCCCCCCCCCCC>
##$VD= 0
##$VDLIST= <DDDDDDDDDDDDDDD>
##$VPLIST= <PPPPPPPPPPPPPPP>
##$VTLIST= <TTTTTTTTTTTTTTT>
##$WBST= 1024
##$WBSW= 4
##$XGAIN= (0..3)
0 0 0 0
##$XL= 0
##$YL= 0
##$YMAX_a= 10558065
##$YMIN_a= -9494210
##$ZGOPTNS= <>
##$ZL1= 120
##$ZL2= 120
##$ZL3= 120
##$ZL4= 120
##$ABSF1= 14.98061
##$ABSF2= -5.57192
##$ABSG= 5
##$ABSL= 3
##$ALPHA= 0
##$AQORDER= 0
##$ASSFAC= 0
##$ASSFACI= 0
##$ASSFACX= 0
##$ASSWID= 0
##$AUNMP= <proc_prof1d_extract>
##$AXLEFT= 0
##$AXNAME= <>
##$AXNUC= <1H>
##$AXRIGHT= 0
##$AXTYPE= 0
##$AXUNIT= <>
##$AZFE= 0.1
##$AZFW= 0.1
##$BCFW= 0
##$BC_mod= 0
##$BYTORDP= 0
##$COROFFS= 0
##$CY= 15
##$DATMOD= 1
##$DC= 0
##$DFILT= <>
##$DTYPP= 0
##$F1P= 0
##$F2P= 0
##$FCOR= 0.5
##$FTSIZE= 131072
##$FT_mod= 6
##$GAMMA= 0
##$GB= 0
##$INTBC= 1
##$INTSCL= 1
##$ISEN= 128
##$LB= 0.3
##$LEV0= 0
##$LPBIN= 0
##$MAXI= 10000
##$MC2= 0
##$MEAN= 0
##$ME_mod= 0
##$MI= 0
##$NCOEF= 0
##$NC_proc= -1
##$NLEV= 6
##$NOISF1= 0
##$NOISF2= 0
##$NSP= 0
##$NTH_PI= 0
##$NZP= 0
##$OFFSET= 14.98061
##$PC= 1
##$PHC0= 24.60388
##$PHC1= 0
##$PH_mod= 1
##$PKNL= yes
##$PPARMOD= 0
##$PPDIAG= 0
##$PPIPTYP= 0
##$PPMPNUM= 2147483647
##$PPRESOL= 1
##$PSCAL= 4
##$PSIGN= 0
##$PYNMP= <proc.py>
##$REVERSE= no
##$SF= 400.13
##$SI= 131072
##$SIGF1= 0
##$SIGF2= 0
##$SINO= 400
##$SIOLD= 131072
##$SPECTYP= <>
##$SREGLST= <1H.CDCl3>
##$SSB= 0
##$STSI= 131072
##$STSR= 0
##$SW_p= 8223.68421052632
##$SYMM= 0
##$S_DEV= 0
##$TDeff= 65536
##$TDoff= 0
##$TI= <>
##$TILT= no
##$TM1= 0
##$TM2= 0
##$TOPLEV= 0
##$USERP1= <user>
##$USERP2= <user>
##$USERP3= <user>
##$USERP4= <user>
##$USERP5= <user>
##$WDW= 1
##$XDIM= 131072
##$YMAX_p= 112259475
##$YMIN_p= -359162050
##$CURPLOT= <Network HP LaserJet P1505>
##$CURPRIN= <$Network HP LaserJet P1505>
##$DFORMAT= <normdp>
##$LAYOUT= <+/1D_H.xwp>
##$LFORMAT= <normlp>
##$PFORMAT= <normpl>
##$SURQMSG= 1
$$ End of Bruker specific parameters
$$ ---------------------------------
##NTUPLES= NMR SPECTRUM
##VAR_NAME=  FREQUENCY,     SPECTRUM/REAL,   SPECTRUM/IMAG
##SYMBOL=    X,             R,               I
##VAR_TYPE=  INDEPENDENT,   DEPENDENT,       DEPENDENT
##VAR_FORM=  AFFN,          ASDF,            ASDF
##VAR_DIM=   131072,        131072,          131072
##UNITS=     HZ,            ARBITRARY UNITS, ARBITRARY UNITS
##FACTOR=    0.0627417313425165, 1,          1
##FIRST=     8223.62146879498, 660,          -18083
##LAST=      0,             1708,            -18087
##MIN=       0,             -359162050,      0
##MAX=       8223.62146879498, 112259475,    0
$$ Real data points
##PAGE= N=1
##DATA TABLE= (X++(R..R)), XYDATA
$$ [...]
62305C18423J1980J3106J4205J5262J6308J7285J8082J8677J9141J9480J9588
$$ 318423 330403 343509 357714 372976 389284 406569 424651 443328 462469 481949 501537
62294E01537J9387J8820J7726J5879J3317J0434P636M946K149q22l749o368q593
$$ 501537 520924 539744 557470 573349 586666 597100 604736 609682 611831 611009 607260 600892 592299
62281E92299j0480j2081j3396j4467j5425j6365j7129j7367j6931j6124j5349
$$ 592299 581819 569738 556342 541875 526450 510085 492956 475589 458658 442534 427185
62270D27185j4576j3470j2038j0771j0001r456q730p859p092o356n420m483m037
$$ 427185 412609 399139 387101 376330 366329 356873 348143 340284 333192 326836 321416 316933 312896
62257C12896m093m058l517k735k145j723j245q44q52j192j380j158p91o62q40
$$ 312896 308803 304745 301228 298493 296348 294625 293380 292536 291684 290492 289112 287954 287163 286501 285661
62242B85661j154j432j538j389j127j068j312j541j445j148r65q79o16j81J07
$$ 285661 284507 283075 281537 280148 279021 277953 276641 275100 273655 272507 271542 270663 270047 269866 269973
62227B69973K17N42J281K039K393K531K921L560M055M298M611N147N629N824N939
$$ 269973 270190 270732 272013 274052 276445 278976 281897 285457 289512 293810 298421 303568 309197 315021 320960
62212C20960O331P103Q143R297J0384J1220J1827J2447J3230J4074J4853J5644
$$ 320960 327291 334394 342537 351834 362218 373438 385265 397712 410942 425016 439869 455513
62200D55513J6547J7503J8372J9106J9675K0015K0161K0180J9880J8794J6674
$$ 455513 472060 489563 507935 527041 546716 566731 586892 607072 626952 645746 662420
62189F62420J3866J0974Q255N522K544o14l633o179q215j0036j1891j3575j4647
$$ 662420 676286 687260 695515 701037 703581 702967 699334 693155 684940 674904 663013 649438 634791
62176F34791j5033j5102j5046j4652j3794j2776j1849j0816r458q000o782n760
$$ 634791 619758 604656 589610 574958 561164 548388 536539 525723 516265 508265 501483 495723
62164D95723m769l917l282k566j535n65j16N4N18J184J479J459J857K906L842
$$ 495723 490954 487037 483755 481189 479654 479089 478973 479027 479545 480729 482208 483667 485524 488430 492272
62149D92272L973L531L161L095L288L791M576N284N630N760N936O136O355O935
$$ 492272 496245 499776 502937 506032 509320 513111 517687 522971 528601 534361 540297 546433 552788 559723
62135E59723Q125R549J0546J0942J1133J1444J1822J2098J2315J2668J3281J3941
$$ 559723 567848 577397 587943 598885 610018 621462 633284 645382 657697 670365 683646 697587
62123F97587J4139J3542J2537J1929J1990J2090J1614J0814J0382J0507J0842
$$ 697587 711726 725268 737805 749734 761724 773814 785428 796242 806624 817131 827973
62112H27973J1219J1848J2774J3698J4471J5363J6640J8117J9302J9838J9692
$$ 827973 839192 851040 863814 877512 891983 907346 923986 942103 961405 981243 1000935
62101A000935J9077J8243J7293J6128J4611J2763J0751Q793P089N741M599L390
$$ 1000935 1020012 1038255 1055548 1071676 1086287 1099050 1109801 1118594 1125683 1131424 1136023 1139413
62089A139413K118J180P93N99J21n17p23k28O24J421K125K826L492M058M606N200
$$ 1139413 1141531 1142711 1143504 1144103 1144224 1143707 1142984 1142756 1143380 1144801 1146926 1149752 1153244 1157302 1161908 1167108
62073A167108N748O157O481O781P027P277P721Q391Q988R224R175R149R295R572
$$ 1167108 1172856 1179013 1185494 1192275 1199302 1206579 1214300 1222691 1231679 1240903 1250078 1259227 1268522 1278094
62059A278094R986J0562J1122J1369J1308J1288J1530J1804J1737J1325J0886
$$ 1278094 1288080 1298642 1309764 1321133 1332441 1343729 1355259 1367063 1378800 1390125 1401011
62048A401011J0613J0400J0162J0005R989R916R561R045Q730Q789R052R290R494
$$ 1401011 1411624 1422024 1432186 1442191 1452180 1462096 1471657 1480702 1489432 1498221 1507273 1516563 1526057
62035A526057R751J0004J0056R831R507R375R575R997J0449J0935J1615J2544
$$ 1526057 1535808 1545812 1555868 1565699 1575206 1584581 1594156 1604153 1614602 1625537 1637152 1649696
62023A649696J3514J4290J4850J5311J5649J5732J5498J4941J3999J2673J1242
$$ 1649696 1663210 1677500 1692350 1707661 1723310 1739042 1754540 1769481 1783480 1796153 1807395
62012A807395J0055R108Q075O824N640M781M089L167J789J4j960l852n410o596
$$ 1807395 1817450 1826558 1834633 1841457 1847097 1851878 1855967 1859134 1860923 1860937 1858977 1855125 1849715 1843119
61998A843119p637q785j0146j1708j3369j4874j6006j6862j7767j8773j9589k0127
$$ 1843119 1835482 1826697 1816551 1804843 1791474 1776600 1760594 1743732 1725965 1707192 1687603 1667476
61986A667476k0716k1550k2285k2515k2353k2184k2062k1742k1166k0472j9715
$$ 1667476 1646760 1625210 1602925 1580410 1558057 1535873 1513811 1492069 1470903 1450431 1430716
61975A430716j8916j8283j7928j7505j6641j5665j5292j5587j5789j5365j4702
$$ 1430716 1411800 1393517 1375589 1358084 1341443 1325778 1310486 1294899 1279110 1263745 1249043
61964A249043j4432j4548j4599j4414j4220j4175j4189j4116j3888j3474j2897
$$ 1249043 1234611 1220063 1205464 1191050 1176830 1162655 1148466 1134350 1120462 1106988 1094091
61953A094091j2244j1539j0726r902r328r075q813q208p368o625o017n327m563
$$ 1094091 1081847 1070308 1059582 1049680 1040352 1031277 1022464 1014256 1006888 1000263 994246 988919 984356
61940I84356m083m128m571n156n786o459p194q121r471j1250j3091j4587j5645
$$ 984356 980273 976145 971574 966418 960632 954173 946979 938858 929387 918137 905046 890459 874814
61927H74814j6389j6843j6930j6657j6101j5255j4194j3301j2945j2916j2538
$$ 874814 858425 841582 824652 807995 791894 776639 762445 749144 736199 723283 710745
61916G10745j1498j0288r543r244q888q251p553o964o392n795n338n045m642l917
$$ 710745 699247 688959 679416 670172 661284 653033 645480 638516 632124 626329 620991 615946 611304 607387
61902F07387l006k192j556j005m42J92R34J710K429L184M214N529O832P940R002
$$ 607387 604381 602189 600633 599628 599186 599378 600312 602022 604451 607635 611849 617378 624210 632150 641152
61887F41152J0179J1342J2356J3413J4723J6086J7101J7698J8207J8900J9753
$$ 641152 651331 662673 675029 688442 703165 719251 736352 754050 772257 791157 810910
61876H10910K0657K1553K2335K2838K3002K2943K2878K3008K3412K3909K4205
$$ 810910 831567 853120 875455 898293 921295 944238 967116 990124 1013536 1037445 1061650
61865A061650K4284K4535K5291K6461K7827K9567L2086L5510L9654M4402M9742
$$ 1061650 1085934 1110469 1135760 1162221 1190048 1219615 1251701 1287211 1326865 1371267 1421009
61854A421009N5432O1072O6617P2444P8833Q5573R2239R8578J04582J10358J16036
$$ 1421009 1476441 1537513 1604130 1676574 1755407 1840980 1933219 2031797 2136379 2246737 2362773
61843B362773J21634J26903J31434J34905J37038J37277J34748J28552J18009
$$ 2362773 2484407 2611310 2742744 2877649 3014687 3151964 3286712 3415264 3533273
61834C533273J02591Q1968N6208K5939p549m2209p5399j04691j28666j46915j59404
$$ 3533273 3635864 3717832 3774040 3799979 3792430 3750221 3674822 3570131 3441465 3294550 3135146
61823C135146j66306j68307j66540j61922j54908j46000j36014j25702j15415
$$ 3135146 2968840 2800533 2633993 2472071 2317163 2171163 2035149 1909447 1794032
61814A794032j05346r5761q6741p8047o9644o1992n5496m9836m4300l8624l3145
$$ 1794032 1688686 1592925 1506184 1428137 1358493 1296501 1241005 1191169 1146869 1108245 1075100
61803A075100k8189k3713j9503j5459j1611q103n107k624k92K282N057P532R306
$$ 1075100 1046911 1023198 1003695 988236 976625 968522 963415 960791 960499 962781 967838 975370 984676
61790I84676J0437J1246J1894J2297J2318J1934J1139R804P737M980J987o10k438
$$ 984676 995113 1006359 1018253 1030550 1042868 1054802 1065941 1075745 1083482 1088462 1090449 1089839 1087401
61777A087401l506m022m178m128l910l359k287p98P39K009K910L341L170K419
$$ 1087401 1083895 1079873 1075695 1071567 1067657 1064298 1062011 1061213 1061952 1063961 1066871 1070212 1073382 1075801
61763A075801J238l93k591n120p402r171j0722j2277j3461j3823j3501j2907j1996
$$ 1075801 1077039 1076646 1074055 1068935 1061533 1052362 1041640 1029363 1015902 1002079 988578 975671 963675
61750I63675j0408q215n932l774j428J314M192O922R664J2711J6000J9225K2276
$$ 963675 953267 945052 939120 935346 933918 935232 939424 946346 956010 968721 984721 1003946 1026222
61737A026222K5361K8717L2397L6263M0159M4102M8330N3080N8313O3817O9601
$$ 1026222 1051583 1080300 1112697 1148960 1189119 1233221 1281551 1334631 1392944 1456761 1526362
61726A526362P5938Q2992R0617R8667J07279J16652J26705J37223J48239J59954
$$ 1526362 1602300 1685292 1775909 1874576 1981855 2098507 2225212 2362435 2510674 2670628
61716B670628J72272J84731J97041K09381K21976K34427K45707K54715K60534
$$ 2670628 2842900 3027631 3224672 3434053 3656029 3890456 4136163 4390878 4651412
61707D651412K62101K57984K46739K27320J98998J61181J13862N8410k265o4442
$$ 4651412 4913513 5171497 5418236 5645556 5844554 6005735 6119597 6178007 6175742 6111300
61697F111300j24271j78087k22772k56532k79277k92020k95996k92499k83207
$$ 6111300 5987029 5808942 5586170 5329638 5050361 4758341 4462345 4169846 3886639
61688C886639k70109k54802k38182k20800k03302j86348j70291j55167j40965
$$ 3886639 3616530 3361728 3123546 2902746 2699444 2513096 2342805 2187638 2046673
61679B046673j27797j15818j05114r5646q7221p9543p2383o5726n9727n4446m9707
$$ 2046673 1918876 1803058 1697944 1602298 1515077 1435534 1363151 1297425 1237698 1183252 1133545
61668A133545m5280m1180l7602l4623l2037k9638k7470k5654k4138k2836k1905
$$ 1133545 1088265 1047085 1009483 974860 942823 913185 885715 860061 835923 813087 791182
61657G91182k1552k1564k1403k0780j9924j9151j8513j7951j7486j7013j6203
$$ 791182 769630 748066 726663 705883 685959 666808 648295 630344 612858 595845 579642
61646E79642j4914j3481j2349j1584j0996j0539j0230r869r222q477q099q239
$$ 579642 564728 551247 538898 527314 516318 505779 495549 485680 476458 467981 459882 451643
61634D51643q566q708q554q125p510o931o635o558o382n993n628n494n482n363
$$ 451643 443077 434369 425815 417690 410180 403249 396614 390056 383674 377681 372053 366559 361077 355714
61620C55714n054m583m023l546l317l191k789k025j293r45q56p34o02o46q10q97
$$ 355714 350660 346077 342054 338508 335191 332000 329211 327186 325893 324948 324092 323358 322756 322110 321300 320403
61604C20403r72j236j587j700j588j632j957k144j841j295r76q79o18q2L80N00
$$ 320403 319431 318195 316608 314908 313320 311688 309731 307587 305746 304451 303475 302596 301978 301896 302276 302776
61588C02776M52N23P35R26J036J060R02M88M7n5K63O47O80K98k02m74l86n4L25
$$ 302776 303228 303751 304486 305412 306448 307508 308410 308898 308945 308890 309153 309800 310480 310778 310576 310102 309716 309662 309987
61569C09987O40R09J162J384J575J794J980J863J214J43r60j812k433k996l652
$$ 309987 310627 311536 312698 314082 315657 317451 319431 321294 322508 322651 321691 319879 317446 314450 310798
61554C10798m415n082n309m963m361l934l698l371k963k842l103l276k911k160
$$ 310798 306383 301301 295992 291029 286668 282734 279036 275665 272702 269860 266757 263481 260570 258410
61540B58410j479j019o33k87j01p2n8QJ45M35R16J348J448J274J170J324J651
$$ 258410 256931 255912 255279 254992 254891 254819 254761 254769 254914 255349 256265 257613 259061 260335 261505 262829 264480
61523B64480K068K625L302L914M304M487M587M764N191N900O666P225P640Q233
$$ 264480 266548 269173 272475 276389 280693 285180 289767 294531 299722 305622 312288 319513 327153 335386
61509C35386R141J0110J0768J0982J0897J0760J0728J0732J0533J0012R341Q763
$$ 335386 344527 354637 365405 376387 387284 398044 408772 419504 430037 440049 449390 458153
61497D58153Q274P718P099O496N819M944M089L687L752L765L304K512J766J218
$$ 458153 466427 474145 481244 487740 493559 498503 502592 506279 510031 513796 517100 519612 521378 522596
61483E22596Q20N77M20Q8n62j276j686j797j877j953j761j211n77r9L88J192K317
$$ 522596 523416 523993 524413 524501 523939 522663 520977 519180 517303 515350 513589 512378 511801 511702 512090 513282 515599
61466E15599L448M409N402O744Q458J0281J2015J3726J5543J7440J9319K1204
$$ 515599 519047 523456 528858 535602 544060 554341 566356 580082 595625 613065 632384 653588
61454F53588K3192K5279K7444K9856L2729L5945L9034M1728M4299M7152N0238
$$ 653588 676780 702059 729503 759359 792088 828033 867067 908795 953094 1000246 1050484
61443A050484N3073N5296N6962N8187N8718N8017N5723N1886M6729M0303L2460
$$ 1050484 1103557 1158853 1215815 1274002 1332720 1390737 1446460 1498346 1545075 1585378 1617838
61432A617838K3195J2910K325p818j6989k4867l1316l6303l9835m1919m2626m2138
$$ 1617838 1641033 1653943 1656268 1648450 1631461 1606594 1575278 1538975 1499140 1457221 1414595 1372457
61420A372457m0722l8674l6224l3480l0403k6969k3350j9841j6570j3394j0187
$$ 1372457 1331735 1293061 1256837 1223357 1192954 1165985 1142635 1122794 1106224 1092830 1082643
61409A082643p077m264j735O77L040N281P346R234J0923J2431J3833J5124J6136
$$ 1082643 1075566 1071302 1069567 1070244 1073284 1078565 1085911 1095145 1106068 1118499 1132332 1147456 1163592
61396A163592J6722J7004J7165J7166J6879J6447J6227J6328J6468J6339J5939
$$ 1163592 1180314 1197318 1214483 1231649 1248528 1264975 1281202 1297530 1313998 1330337 1346276
61385A346276J5452J5048J4788J4587J4223J3535J2569J1409R962Q150O242M632
$$ 1346276 1361728 1376776 1391564 1406151 1420374 1433909 1446478 1457887 1467849 1475999 1482241 1486873
61373A486873L356K127Q39l55j471k726m022m915n290n644o429p454q297q868
$$ 1486873 1490229 1492356 1493195 1492840 1491369 1488643 1484621 1479706 1474416 1468772 1462343 1454889 1446592 1437724
61359A437724r250r306q955q524q324q105p420o414n660n301m919m348l984m091
$$ 1437724 1428474 1419168 1410213 1401689 1393365 1385260 1377840 1371426 1365766 1360465 1355546 1351198 1347214 1343123
61345A343123m289m097l597l230l122k998k594j878q53N68K488M941P876J1175
$$ 1343123 1338834 1334737 1331140 1327910 1324788 1321790 1319196 1317318 1316465 1317033 1319521 1324462 1332338 1343513
61331A343513J4667J8251K1954K5829K9824L3846L7937M2214M6631N0862N4537
$$ 1343513 1358180 1376431 1398385 1424214 1454038 1487884 1525821 1568035 1614666 1665528 1720065
61320A720065N7522N9941O1803O2788O2457O0672N7595N3185M7014L8812K9048
$$ 1720065 1777587 1837528 1899331 1962119 2024576 2085248 2142843 2196028 2243042 2281854 2310902
61309B310902J8618Q006k869j3870k4174l2900m0004m6129n1665n6336n9698o1700
$$ 2310902 2329520 2337526 2334657 2320787 2296613 2263713 2223709 2177580 2125915 2069579 2009881 1948181
61297A948181o2587o2547o1707o0250n8300n5769n2540m8822m5114m1760l8691
$$ 1948181 1885594 1823047 1761340 1701090 1642790 1587021 1534481 1485659 1440545 1398785 1360094
61286A360094l5647l2497k9381k6555k4214k2303k0486j8424j6054j3577j1130
$$ 1360094 1324447 1291950 1262569 1236014 1211800 1189497 1169011 1150587 1134533 1120956 1109826
61275A109826q647o038l351o99J813L998N645O780P709Q633R364R648R600R580
$$ 1109826 1101179 1095141 1091790 1091091 1092904 1096902 1102547 1109327 1117036 1125669 1135033 1144681 1154281 1163861
61261A163861R682R640R216Q478P619O738N845M930L950K860J737P60L6m89r16
$$ 1163861 1173543 1183183 1192399 1200877 1208496 1215234 1221079 1226009 1229959 1232819 1234556 1235316 1235352 1234863 1233947
61246A233947j303j703k175k727l306l921m661n620o843q348j0057j1724j3002
$$ 1233947 1232644 1230941 1228766 1226039 1222733 1218812 1214151 1208531 1201688 1193340 1183283 1171559 1158557
61233A158557j3700j3913j3947j4063j4215j4041j3239j2004j0877j0072r224
$$ 1158557 1144857 1130944 1116997 1102934 1088719 1074678 1061439 1049435 1038558 1028486 1019262
61222A019262p991o637n637m935m096l063k260j910j722j374q83l16M40J390K294
$$ 1019262 1011271 1004634 998997 994062 989966 986903 984643 982733 981011 979637 978754 978438 978878 980268 982562
61207I82562L048L884M940N949O705P516Q812J0466J1910J2840J3453J4021J4595
$$ 982562 985610 989494 994434 1000383 1007088 1014604 1023416 1033882 1045792 1058632 1072085 1086106 1100701
61194A100701J5176J5859J6681J7474J8012J8256J8411J8646J8746J8112J6257
$$ 1100701 1115877 1131736 1148417 1165891 1183903 1202159 1220570 1239216 1257962 1276074 1292331
61183A292331J3334R903O197J841l578r907j6552k2893k8430l2752l5714l7519
$$ 1292331 1305665 1315568 1321765 1323606 1320028 1310121 1293569 1270676 1242246 1209494 1173780 1136261
61171A136261l8462l8668l8197l7183l5682l3560l0830k7912k5331k3271k1627
$$ 1136261 1097799 1059131 1020934 983751 948069 914509 883679 855767 830436 807165 785538
61160G85538k0302j9181j7974j6455j4763j3178j1711j0212q741p492o412n238
$$ 785538 765236 746055 728081 711626 696863 683685 671974 661762 653021 645529 639117 633879
61148F33879l954k840k086j572j103n84L0P27J391J964K573L312L961M273M389
$$ 633879 629925 627085 624999 623427 622324 621740 621770 622497 623888 625852 628425 631737 635698 639971 644360
61133F44360M617M809M474L515K422J567P36l99j767l070m207n210o018o608p157
$$ 644360 648977 653786 658260 661775 664197 665764 666500 666101 664334 661264 657057 651847 645829 639221 632064
61118F32064p822q472q888r109r420j0032j0948j1965j2763j3056j2895j2598
$$ 632064 624242 615770 606882 597773 588353 578321 567373 555408 542645 529589 516694 504096
61106E04096j2330j1934j1314j0747j0461j0225r653q852q286q059p754p055o149
$$ 504096 491766 479832 468518 457771 447310 437085 427432 418580 410294 402235 394481 387426 381277
61093C81277n343m604l728k783k043j605j284r46o78o38q39j212j700k256k755
$$ 381277 375934 371330 367602 364819 362776 361171 359887 358941 358263 357625 356786 355574 353874 351618 348863
61078C48863l065l193l256l266l033k381j422n09J03M58P38R85J129J197J371
$$ 348863 345798 342605 339349 336083 333050 330669 329247 328738 328841 329299 330037 331022 332151 333348 334719
61063C34719J721K020J954J504R77O64N34L75R8j60k15j3L51O65O53K02m24p41
$$ 334719 336440 338460 340414 341918 342895 343559 344093 344468 344566 344406 344191 344178 344529 345194 345847 346049 345625 344884
61045C44884m99O9M92N16K55kq1r5l84j203k391l428l920l910l716l607l733m157
$$ 344884 344385 344454 344946 345462 345717 345715 345634 345539 345155 343952 341561 338133 334213 330303 326587 322980 319247 315090
61027C15090m734n044m761m043l364k953k642k215j708j291j074j093j264j352
$$ 315090 310356 305312 300551 296508 293144 290191 287549 285334 283626 282335 281261 280168 278904 277552
61013B77552j150q07o70p55o49j31L83L82K7QO22J374J608J225O93M79O78J042
$$ 277552 276402 275595 274925 274170 273521 273390 273773 274155 274182 274190 274812 276186 277794 279019 279712 280191 280869 281911
60995B81911J291J393J585K073K677L007K963K881L029L230L214L120L308L777
$$ 281911 283202 284595 286180 288253 290930 293937 296900 299781 302810 306040 309254 312374 315682 319459
60981C19459M153M283M427M757N024M964M798M942N436N929O141O080N866N642
$$ 319459 323612 327895 332322 337079 342103 347067 351865 356807 362243 368172 374313 380393 386259 391901
60967C91901N640O025O600O941O924O888P178P687Q045Q111Q113Q337Q856R517
$$ 391901 397541 403566 410166 417107 424031 430919 438097 445784 453829 461940 470053 478390 487246 496763
60953D96763J0102J0470J0668J0963J1680J2932J4471J5906J7124J8404K0061
$$ 496763 506865 517335 528003 538966 550646 563578 578049 593955 611079 629483 649544
60942F49544K2093K4316K6730K9450L2350L5143L7908M1091M4878M8895N2826
$$ 649544 671637 695953 722683 752133 784483 819626 857534 898625 943503 992398 1045224
60931A045224N6884O1381O6178P0974P5850Q1109Q6913R3552J01699J11821J23561
$$ 1045224 1102108 1163489 1229667 1300641 1376491 1457600 1544513 1638065 1739764 1851585 1975146
60920A975146J36275J49960J65023J81414J98781K17286K37540K59955K85088
$$ 1975146 2111421 2261381 2426404 2607818 2806599 3023885 3261425 3521380 3806468
60911C806468L14180L48170L86459M28081M73940N26157N85533O51956P26838
$$ 3806468 4120648 4468818 4855277 5283358 5757298 6283455 6868988 7520944 8247782
60902H247782Q10688Q96400R69928J022028J054328J064549J027134R03251O82281
$$ 8247782 9058470 9954870 10924798 11946826 13001154 14065703 15092837 15996088 16678369
60893A6678369M10132J64866J26q3750j15999j18609j04563j03604j66539l28592
$$ 16678369 17088501 17253367 17253493 17169743 17053744 16935135 16830572 16726968 16560429 16231837
60883A6231837n70778q26041j025371j136934j167295j138478j070622r79555
$$ 16231837 15661059 14835018 13809647 12672713 11505418 10366940 9296318 8316763
60875H316763q78818p78720o85143o00781n26481m61328m03438l51770l06562
$$ 8316763 7437945 6659225 5974082 5373301 4846820 4385492 3982054 3630284 3323722
60866C323722k67845k34747k06476j82894j63609j47513j33669j21847j11742
$$ 3323722 3055877 2821130 2614654 2431760 2268151 2120638 1986969 1865122 1753380
60857A753380j02516r3621q5395p8286p2077o6338o1107n6626n2842m9603m6915
$$ 1753380 1650864 1557243 1471848 1393562 1321485 1255147 1194040 1137414 1084572 1034969 988054
60846I88054m4660m2405l9864l7242l4842l2660l0577k8613k6731k4806k2950
$$ 988054 943394 900989 861125 823883 789041 756381 725804 697191 670460 645654 622704
60835F22704k1499k0476j9523j8476j7538j6737j5759j4614j3839j3665j3520
$$ 622704 601205 580729 561206 542730 525192 508455 492696 478082 464243 450578 437058
60824D37058j2817j1735j0763r926r028q302q164q471q587q154p404o760o407
$$ 437058 424241 412506 401743 391817 382789 374487 366323 357852 349265 341111 333707 326947 320540
60811C20540o223n910n255m389l650l148k698k182j692j205n76Q4M40M96O43R83
$$ 320540 314317 308407 303152 298763 295113 291965 289267 287085 285393 284188 283612 283696 284136 284632 285275 286258
60795B86258J151J083J268J864K203J767J131J207J942K464K325J893J625J543
$$ 286258 287409 288492 289760 291624 293827 295594 296725 297932 299874 302338 304663 306556 308181 309724
60781C09724J484J326R66M19n1k31k85n13r28j322j638j929k111k116k094k142
$$ 309724 311208 312534 313500 313919 313868 313637 313352 312839 311911 310589 308951 307022 304911 302795 300701 298559
60765B98559k069j724j420j529j887k033j868j685j612j496j275j068q92o73n09
$$ 298559 296490 294766 293346 291817 289930 287897 286029 284344 282732 281236 279961 278893 278001 277328 276819
60750B76819n60o61m26K22Q87J152R74P04Q09J463K284K673K530K393K650L011
$$ 276819 276259 275598 275172 275394 276281 277433 278407 279111 279920 281383 283667 286340 288870 291263 293913 296924
60734B96924L042K864K856K999L050L110L405L662L320K363J408R35Q37P96O32
$$ 296924 299966 302830 305686 308685 311735 314845 318250 321912 325232 327595 329003 329938 330775 331571 332203
60719C32203L06j20l95l44j79k63o14r34j062j021p71l21Oj24n19o70m49k16k41
$$ 332203 332509 332389 331994 331650 331471 331208 330594 329660 328598 327577 326806 326485 326491 326367 325848 325178 324729 324513 324272
60700C24272n01r27j417j587j105l06K2l94j042j382j385j185p63k22O9q1l61
$$ 324272 323771 322844 321427 319840 318735 318429 318451 318057 317015 315633 314248 313063 312300 312078 312147 312066 311705
60683C11705l29J20P82J345J460R52J02n22o59n57n09n02m84n78q89j282j600
$$ 311705 311376 311496 312278 313623 315083 316035 316137 315615 314956 314399 313890 313388 312904 312326 311437 310155 308555
60666C08555j871k173k430k535k492k382k251k126k008j883j809j887k043k002
$$ 308555 306684 304511 302081 299546 297054 294672 292421 290295 288287 286404 284595 282708 280665 278663
60652B78663j717j601j989k604k937l002l167l430l379k975k690k838l189l436
$$ 278663 276946 275345 273356 270752 267815 264813 261646 258216 254837 251862 249172 246334 243145 239709
60638B39709l513l356k882k319k107k234k171j721j365j483j739j624j206q78
$$ 239709 236196 232840 229958 227639 225532 223298 221127 219406 218041 216558 214819 213195 211989 211111
60624B11111o83l77O8L96M74M16L85M81P38J090J367J474J453J338J183J171J474
$$ 211111 210428 210051 210119 210515 210989 211405 211790 212271 213009 214099 215466 216940 218393 219731 220914 222085 223559
60607B23559J924K188K275K531L019L378L419L404L549L684L722L947M492M945
$$ 223559 225483 227671 229946 232477 235496 238874 242293 245697 249246 252930 256652 260599 265091 270036
60593B70036M896M588M510M670M716M564M404M262L988L652L422L167K608J875
$$ 270036 274932 279520 284030 288700 293416 297980 302384 306646 310634 314286 317708 320875 323483 325358
60579C25358J465J565J743J520R35L68Ok97p11j192j584j872k208k673l139l446
$$ 325358 326823 328388 330131 331651 332586 332954 332960 332663 331952 330760 329176 327304 325096 322423 319284 315838
60563C15838l605l659l518l145k799k754k838k623k138j847j894j789j164l46
$$ 315838 312233 308574 305056 301911 299112 296358 293520 290897 288759 286912 285018 283229 282065 281719
60549B81719J31K77M89R40J507K132K823L427L728L770L801L954M174M360M424
$$ 281719 281850 282127 282616 283556 285063 287195 290018 293445 297173 300943 304744 308698 312872 317232 321656
60534C21656M316M087L803L350K544J610J106J204J367J086N74L32L61L10J74
$$ 321656 325972 330059 333862 337212 339756 341366 342472 343676 345043 346129 346703 347035 347396 347706 347880
60519C47880K22L29lq77j812k389k713l016l261l318l255l228l231l186l114l096
$$ 347880 348102 348431 348428 347551 345739 343350 340637 337621 334360 331042 327787 324559 321328 318142 315028 311932
60503C11932l153l228l215k974k439j746j141p38m91l32k15l6L04P35J097J396
$$ 311932 308779 305551 302336 299362 296923 295177 294036 293298 292807 292475 292260 292224 292528 293263 294360 295756
60487B95756J787K287K712L005L410M182N229O202O882P363P858Q470R174R947
$$ 295756 297543 299830 302542 305547 308957 313139 318368 324570 331452 338815 346673 355143 364317 374264
60473C74264J0809J1795J2939J4271J5764J7267J8591J9671K0576K1289K1621
$$ 374264 385073 396868 409807 424078 439842 457109 475700 495371 515947 537236 558857
60462E58857K1421K0666J9254J6982J3907J0543P354M265J106j674l262l513l152
$$ 558857 580278 600944 620198 637180 651087 661630 668984 673249 674355 672681 669419 665906 662754
60449F62754k820k461j890j375j243j342j385j498j919k320k010p72R04K495M010
$$ 662754 659934 657473 655583 654208 652965 651623 650238 648740 646821 644501 642491 641719 642623 645118 649128
60434F49128N789Q030J0597J3173J5538J7762K0140K2861K5809K8758L1523L3900
$$ 649128 654917 662947 673544 686717 702255 720017 740157 763018 788827 817585 849108 883008
60422H83008L5621L6652L7348L8151L9226M0607M2519M5306M9147N4049O0051
$$ 883008 918629 955281 992629 1030780 1070006 1110613 1153132 1198438 1247585 1301634 1361685
60411A361685O7193P5307Q4052R3115J02252J11132J19210J25776J29970J30839
$$ 1361685 1428878 1504185 1588237 1681352 1783604 1894736 2013946 2139722 2269692 2400531
60401B400531J27348J18304J02490P9367M9860J6197j9148n4136q6850j15079
$$ 2400531 2527879 2646183 2748673 2828040 2877900 2894097 2874949 2820813 2733963 2618884
60391B618884j36826j51141j58261j59146j55115j47664j38140j27483j16332
$$ 2618884 2482058 2330917 2172656 2013510 1858395 1710731 1572591 1445108 1328776
60382A328776j05167r4294q3906p4336o6014n8953n2687m6909m1838l7633l3901
$$ 1328776 1223609 1129315 1045409 971073 905059 846106 793419 746510 704672 667039 633138
60371F33138l0195k6708k3939k1901k0161j8495j7005j5713j4498j3357j2339
$$ 633138 602943 576235 552296 530395 510234 491739 474734 459021 444523 431166 418827
60360D18827j1322j0246r350q851q514q002p456p169o942o327n424m765m456m075
$$ 418827 407505 397259 387909 379058 370544 362542 355086 347917 340975 334648 329224 324459 320003 315928
60346C15928l491l126l224l434l326k910k443k087j911j871j714j233o27k82j95
$$ 315928 312437 309311 306087 302653 299327 296417 293974 291887 289976 288105 286391 285158 284531 284249 284054
60331B84054l6K34K92P7q8j09k96p91j282j510j581j586j368r44p14r08j226j364
$$ 284054 284018 284252 284544 284621 284533 284424 284128 283337 282055 280545 278964 277378 276010 275066 274352 273444 272218 270854
60313B70854j472j776k074j996j531r87n95m28m51m51j50L62O00L22n9k3L97P39
$$ 270854 269382 267606 265532 263536 262005 261018 260423 259995 259544 259093 258943 259305 259905 260227 260168 260145 260542 261281
60295B61281P12L81m2k94j25M31J005J297J381J435J404J235J109J201J363J371
$$ 261281 261993 262374 262332 262038 261913 262344 263349 264646 266027 267462 268866 270101 271210 272411 273774 275145
60279B75145J289J307J398J422J433J551J712J802J927K216K531K634K616K741
$$ 275145 276434 277741 279139 280561 281994 283545 285257 287059 288986 291202 293733 296367 298983 301724
60265C01724L001L156L163L215L345L337L070K676K214J503M14q55j935k610k874
$$ 301724 304725 307881 311044 314259 317604 320941 324011 326687 328901 330404 330818 329963 328028 325418 322544
60250C22544k836k655k508k491k569k608k481k142j692j343j238j317j365j208
$$ 322544 319708 317053 314545 312054 309485 306877 304396 302254 300562 299219 297981 296664 295299 294091
60236B94091q25l26J54N39Q28J004R83P06L42J68K70M33M21K50J37K46O34J261
$$ 294091 293266 292940 293094 293633 294461 295465 296448 297154 297496 297664 297934 298367 298788 299038 299175 299421 300055 301316
60218C01316J980K584K927L005K872K593K340K370K797L431L915M039L872L659
$$ 301316 303296 305880 308807 311812 314684 317277 319617 321987 324784 328215 332130 336169 340041 343700
60204C43700L633L859M237M705N354O256P263Q129Q825R484J0112J0637J1203
$$ 343700 347333 351192 355429 360134 365488 371744 379007 387136 395961 405445 415557 426194 437397
60191D37397J2114J3381J4646J5708J6825J8291J9980K1625K3228K4877K6370
$$ 437397 449511 462892 477538 493246 510071 528362 548342 569967 593195 618072 644442
60180F44442K7387K8039K8848L0130L1626L2809L3334L3171L2497L1583L0608
$$ 644442 671829 699868 728716 758846 790472 823281 856615 889786 922283 953866 984474
60169I84474K9494K7967K5821K3069J9853J6368J2875R656O812M174J461j401
$$ 984474 1013968 1041935 1067756 1090825 1110678 1127046 1139921 1149577 1156389 1160563 1162024 1160623
60157A160623m113o187p289p440o889n867m517k991j447J29K010M520P719J1293
$$ 1160623 1156510 1150323 1143034 1135594 1128705 1122838 1118321 1115330 1113883 1114012 1116022 1120542 1128261 1139554
60143A139554J4738J7704K0220K2574K4965K7264K9129L0332L0874L0889L0449
$$ 1139554 1154292 1171996 1192216 1214790 1239755 1267019 1296148 1326480 1357354 1388243 1418692
60132A418692K9422K7527K4644K1075J7338J3616R629N237Q17l193o887j0573
$$ 1418692 1448114 1475641 1500285 1521360 1538698 1552314 1561943 1567180 1567997 1564804 1557917 1547344
60120A547344j4054j6745j8404j9248j9380j8598j6932j4780j2323r247n348j014
$$ 1547344 1533290 1516545 1498141 1478893 1459513 1440915 1423983 1409203 1396880 1387633 1382285 1381271
60108A381271L208P161J0899J4322J7373K0281K3168K5615K6996K7115K6169K4218
$$ 1381271 1384479 1391640 1402539 1416861 1434234 1454515 1477683 1503298 1530294 1557409 1583578 1607796
60096A607796K1168J7222J2972Q940N256J833j334m022n858o563o249n345m079
$$ 1607796 1628964 1646186 1659158 1668098 1673354 1675187 1673853 1669831 1663973 1657410 1651161 1645816 1641737
60083A641737k151Q86N055R957J5169K0465K5735L1025L6579M2585M8916N5289
$$ 1641737 1639586 1640472 1645527 1655484 1670653 1691118 1716853 1747878 1784457 1827042 1875958 1931247
60071A931247O1584O7851P4052Q0074Q5884R1411R6314J00213J03042J04932J05700
$$ 1931247 1992831 2060682 2134734 2214808 2300692 2392103 2488417 2588630 2691672 2796604 2902304
60060B902304J04797J01856R7002R0502Q2339P2325O0521M7353L3376J9000M357
$$ 2902304 3007101 3108957 3205959 3296461 3378800 3451125 3511646 3558999 3592375 3611375 3615732
60049C615732j0562k5629m0356n4006o5975p5946q3725q9080r1905r2403r0968
$$ 3615732 3605170 3579541 3539185 3485179 3419204 3343258 3259533 3170453 3078548 2986145 2895177
60038B895177q7822q2978p6536o8896o0514n1587m2201l2763k3944j6066q766
$$ 2895177 2807355 2724377 2647841 2578945 2518431 2466844 2424643 2391880 2367936 2351870 2343104
60027B343104j589N293J1174J5588J8636K0572K1438K1156J9718J7180J3646R398
$$ 2343104 2341515 2346808 2357982 2373570 2392206 2412778 2434216 2455372 2475090 2492270 2505916 2515314
60015B515314M840K88m120q315j2375j6588k1147k5781l0021l3843l7577m1195
$$ 2515314 2520154 2520442 2516322 2508007 2495632 2479044 2457897 2432116 2402095 2368252 2330675 2289480
60003B289480m4101m5875m6696m6819m6097m4364m1880l9005l5763l2110k8286
$$ 2289480 2245379 2199504 2152808 2105989 2059892 2015528 1973648 1934643 1898880 1866770 1838484
59992A838484k4494k0501j6026j1271o609k041K600P145J1288J5120J8834K2086
$$ 1838484 1813990 1793489 1777463 1766192 1759583 1757542 1760142 1767287 1778575 1793695 1812529 1834615
59980A834615K4252K5252K5526K5188K3898K1588J8632J5124J0601M897j340p324
$$ 1834615 1858867 1884119 1909645 1934833 1958731 1980319 1998951 2014075 2024676 2029573 2028233 2020909
59968B020909j2914j8314k3390k7781l1414l4428l6662l7753l7656l6723l5152
$$ 2020909 2007995 1989681 1966291 1938510 1907096 1872668 1836006 1798253 1760597 1723874 1688722
59957A688722l2777k9487k5571k1457j7260j2850q233l636P86N159R611J4014
$$ 1688722 1655945 1626458 1600887 1579430 1562170 1549320 1541087 1537451 1538237 1543396 1553007 1567021
59945A567021J8179K2203K6354L0582L4433L7584M0153M2337M3913M4398M3507
$$ 1567021 1585200 1607403 1633757 1664339 1698772 1736356 1776509 1818846 1862759 1907157 1950664
59934A950664M1248L7734L3140K7796K1981J5709Q916J846n047j1515j7527k2947
$$ 1950664 1991912 2029646 2062786 2090582 2112563 2128272 2137188 2139034 2133987 2122472 2104945 2081998
59922B081998k7479l0992l3548l5056l5182l3793l1261k8128k4649k0802j6566
$$ 2081998 2054519 2023527 1989979 1954923 1919741 1885948 1854687 1826559 1801910 1781108 1764542
59911A764542j2030p312k538K159O685J1012J5076J8766K1985K4765K7244K9546
$$ 1764542 1752512 1745200 1742662 1744821 1751506 1762518 1777594 1796360 1818345 1843110 1870354 1899900
59899A899900L1629L3187L3870L3647L2871L1808L0339K8273K5864K3662K1953
$$ 1899900 1931529 1964716 1998586 2032233 2065104 2096912 2127251 2155524 2181388 2205050 2227003
59888B227003K0631J9637J9160J9358K0166K1577K3820K7124L1430L6491M2111
$$ 2227003 2247634 2267271 2286431 2305789 2325955 2347532 2371352 2398476 2429906 2466397 2508508
59877B508508M8175N4601O1381O8529P5818Q2667Q8480R3036R6381R8346R8315
$$ 2508508 2556683 2611284 2672665 2741194 2817012 2899679 2988159 3081195 3177576 3275922 3374237
59866C374237R5523Q9535Q0372O8302N3600L6557J7611k583k3165m3059o1067
$$ 3374237 3469760 3559295 3639667 3707969 3761569 3798126 3815737 3813154 3789989 3746930 3685863
59855C685863p6216q8120r6911j02743j05534j05255j02233r7051r0255q2335
$$ 3685863 3609647 3521527 3424616 3321873 3216339 3111084 3008851 2911800 2821545 2739210
59845B739210p3783o4947n5946m6851l7856k9082k0412j1746l391M145J0681J6489
$$ 2739210 2665427 2600480 2544534 2497683 2459827 2430745 2410333 2398587 2395196 2399341 2410022 2426511
59833B426511K1863K6748L0743L3281L3872L2391K9144K4498J8441J0653R84j0221
$$ 2426511 2448374 2475122 2505865 2539146 2573018 2605409 2634553 2659051 2677492 2688145 2689129 2678908
59821B678908k2198l4033m5021n4907o3730p1336p7224q1033q2960q3413q2502
$$ 2678908 2656710 2622677 2577656 2522749 2459019 2387683 2310459 2229426 2146466 2063053 1980551
59810A980551q0198p6794p2782o8336o3406n8240n3348m8878m4437l9698l4838
$$ 1980551 1900353 1823559 1750777 1682441 1619035 1560795 1507447 1458569 1414132 1374434 1339596
59799A339596l0254k6160k2604j9589j7051j4879j3086j1753j0775r913r148q664
$$ 1339596 1309342 1283182 1260578 1240989 1223938 1209059 1195973 1184220 1173445 1163532 1154384 1145720
59787A145720q438q101p394o461n635n055m713m563m566m737n281o411q002r597
$$ 1145720 1137282 1129181 1121787 1115326 1109691 1104636 1099923 1095360 1090794 1086057 1080776 1074365 1066363 1056766
59773A056766j0896j1942j2802j3356j3557j3606j3592j3245j2254j0689q909
$$ 1056766 1045870 1033928 1021126 1007770 994213 980607 967015 953770 941516 930827 921918
59762I21918p145n453l857k354p74J124L382N820Q232J0537J2718J4754J6595
$$ 921918 914773 909320 905463 903109 902335 903459 906841 912661 920893 931430 944148 958902 975497
59749I75497J8228J9662K0828K1495K1439K0724J9671J8475J7015J5235J3457
$$ 975497 993725 1013387 1034215 1055710 1077149 1097873 1117544 1136019 1153034 1168269 1181726
59738A181726J2045J0902R698Q419P361O628O073N797O275P808J0204J3111J6410
$$ 1181726 1193771 1204673 1214371 1222790 1230151 1236779 1242852 1248649 1254924 1262732 1272936 1286047 1302457
59725A302457K0101K4144K8505L3184L8073M2991M7920N2963N8076O3105O8123
$$ 1302457 1322558 1346702 1375207 1408391 1446464 1489455 1537375 1590338 1648414 1711519 1779642
59714A779642P3335P8524Q2893Q5648Q6415Q4905Q0539P2597O0611M4526K4905
$$ 1779642 1852977 1931501 2014394 2100042 2186457 2271362 2351901 2424498 2485109 2529635 2554540
59703B554540L274j8025l6708n1436o1836o8057p0426o9428o5648n9816n2800
$$ 2554540 2557814 2539789 2503081 2451645 2389809 2321752 2251326 2181898 2116250 2056434 2003634
59692B003634m5315l7574k9509k1418j3982p449j246N310J2169J8798K4978L0993
$$ 2003634 1958319 1920745 1891236 1869818 1855836 1848387 1847141 1852451 1864620 1883418 1908396 1939389
59680A939389L7100M3268M9432N5705O2242O9062P6077Q3251R0682R8501J06671
$$ 1939389 1976489 2019757 2069189 2124894 2187136 2256198 2332275 2415526 2506208 2604709 2711380
59669B711380J14960J23261J31836J40970J50519J60071J69461J78733J87610
$$ 2711380 2826340 2949601 3081437 3222407 3372926 3532997 3702458 3881191 4068801
59660D068801J95549K02362K08225K12880K15416K15180K12439K07839K01673
$$ 4068801 4264350 4466712 4674937 4887817 5103233 5318413 5530852 5738691 5940364
59651E940364J94205J86217J78672J72024J66366J61986J59234J57893J57160
$$ 5940364 6134569 6320786 6499458 6671482 6837848 6999834 7159068 7316961 7474121
59642G474121J56197J54267J50557J44344J35349J23595J09037R1733P2313N1887
$$ 7474121 7630318 7784585 7935142 8079486 8214835 8338430 8447467 8539200 8611513 8663400
59632H663400L1476J1919n782k0496l1448l8362m1128l9678l4215k5186j3036
$$ 8663400 8694876 8706795 8701013 8680517 8649069 8610707 8569579 8529901 8495686 8470500 8457464
59621H457464J796J8625L6694N5617P5314R5521J15676J35271J53889J70804J85006
$$ 8457464 8459260 8477885 8514579 8570196 8645510 8741031 8856707 8991978 9145867 9316671 9501677
59610I501677J95723K02500K04536K00406J88739J68934J40956J04801O0746J0055
$$ 9501677 9697400 9899900 10104436 10304842 10493581 10662515 10803471 10908272 10969018 10979073
59600A0979073m4885j01216j56112k06820k50727k85842l11283l27191l34318
$$ 10979073 10934188 10832972 10676860 10470040 10219313 9933471 9622188 9294997 8960679
59591H960679l33705l26684l14875l00017k83803k67817k53461k41810k33567
$$ 8960679 8626974 8300290 7985415 7685398 7401595 7133778 6880317 6638507 6404940
59582F404940k29208k28946k32293k37711k43012k46312k46569k43403k36760
$$ 6404940 6175732 5946786 5714493 5476782 5233770 4987458 4740889 4497486 4260726
59573D260726k26935k14668k00963j86764j72735j59161j45980j33118j20898
$$ 4260726 4033791 3819123 3618160 3431396 3258661 3099500 2953520 2820402 2699504
59564B699504j09825r9971r0918q2418p4756o8152o2178n6260n0527m5603m1680
$$ 2699504 2589679 2489708 2398790 2316372 2241616 2173464 2111286 2055026 2004499 1958896 1917216
59553A917216l8280l5024l2142l0022k8622k7623k6933k6767k7256k8188k9155
$$ 1917216 1878936 1843912 1811770 1781748 1753126 1725503 1698570 1671803 1644547 1616359 1587204
59542A587204k9851l0201l0322l0369l0411l0330k9840k8685k6910k4918k3102
$$ 1587204 1557353 1527152 1496830 1466461 1436050 1405720 1375880 1347195 1320285 1295367 1272265
59531A272265k1450j9632j7439j4990j2505j0125p958o049m238k296k42J690L433
$$ 1272265 1250815 1231183 1213744 1198754 1186249 1176124 1168166 1162117 1157879 1155583 1155341 1157031 1160464
59518A160464N165O874Q244R135R885J0823J1819J2600J3265J4137J5254J6413
$$ 1160464 1165629 1172503 1180747 1189882 1199767 1210590 1222409 1235009 1248274 1262411 1277665 1294078
59506A294078J7585J8996K0783K2857K5048K7250K9433L1744L4453L7643M1060
$$ 1294078 1311663 1330659 1351442 1374299 1399347 1426597 1456030 1487774 1522227 1559870 1600930
59495A600930M4460M7917N1615N5518N9460O3387O7215P0661P3525P5943P8032
$$ 1600930 1645390 1693307 1744922 1800440 1859900 1923287 1990502 2061163 2134688 2210631 2288663
59484B288663P9514Q0052P9783P9013P7532P4781P0708O5887O0698N4950M8560
$$ 2288663 2368177 2448229 2528012 2607025 2684557 2759338 2830046 2895933 2956631 3011581 3060141
59473C060141M2094L6166L0584K4562J7800J0984N185R44j915l696m329l490j109
$$ 3060141 3102235 3138401 3168985 3193547 3211347 3222331 3227516 3228460 3226545 3222849 3218520 3215030 3213921
59460C213921K464O759J1497J6526K1664K6643L1080L4376L5856L5085L1929K6250
$$ 3213921 3216385 3223144 3234641 3251167 3272831 3299474 3330554 3364930 3400786 3435871 3467800 3494050
59448C494050J7816O689o561k1190l6622n2280o7372q1117r3021j02689j09628
$$ 3494050 3511866 3518555 3511994 3490804 3454182 3401902 3334530 3253413 3160392 3057703 2948075
59437B948075j13522j14546j13127j09547j04060r7188q9597q1706p3663o5554
$$ 2948075 2834553 2720007 2606880 2497333 2393273 2296085 2206488 2124782 2051119 1985565
59427A985565n7442m9356m1486l4181k7509k1096j4639q309k385L240Q808J4232
$$ 1985565 1928123 1878767 1837281 1803100 1775591 1754495 1739856 1731547 1729162 1732402 1741210 1755442
59415A755442J9337K4300K9374L4380L8959M3113M7018N0442N2945N4508N5423
$$ 1755442 1774779 1799079 1828453 1862833 1901792 1944905 1991923 2042365 2095310 2149818 2205241
59404B205241N5589N4443N1594M7055M0895L3149K4038J3785K364j0108k2772
$$ 2205241 2260830 2315273 2366867 2413922 2454817 2487966 2512004 2525789 2528153 2518045 2495273
59393B495273l4496m4905n4372o2993p0230p5627p9196q0968q0827p9097p6613
$$ 2495273 2460777 2415872 2361500 2298507 2228277 2152650 2073454 1992486 1911659 1832562 1755949
59382A755949p3921p0863o7178o3050n8755n4341m9944m5971m2573l9313l5718
$$ 1755949 1682028 1611165 1543987 1480937 1422182 1367841 1317897 1271926 1229353 1190040 1154322
59371A154322l1828k7976k4361k1117j8375j6013j3695j1350r269p562n925m216
$$ 1154322 1122494 1094518 1070157 1049040 1030665 1014652 1000957 989607 980338 972776 966851 962635
59359I62635k682j386J04J997L815N088O091P322Q701R845J0853J2076J3321J3910
$$ 962635 959953 958567 958671 960668 964483 969571 975662 982984 991685 1001530 1012383 1024459 1037780 1051690
59345A051690J3581J2743J1960J1637J2203J3967J6689J9688K2597K5596K8834
$$ 1051690 1065271 1078014 1089974 1101611 1113814 1127781 1144470 1164158 1186755 1212351 1241185
59334A241185L1971L4524L6405L7968L9708M2119M5574N0152N5547O1364O7437
$$ 1241185 1273156 1307680 1344085 1382053 1421761 1463880 1509454 1559606 1615153 1676517 1743954
59323A743954P3863Q0732Q7956R5373J02942J10755J18877J27263J35856J44602
$$ 1743954 1817817 1898549 1986505 2081878 2184820 2295575 2414452 2541715 2677571 2822173
59313B822173J53215J61048J67391J71922J74635J75406J73840J69660J62974
$$ 2822173 2975388 3136436 3303827 3475749 3650384 3825790 3999630 4169290 4332264
59304D332264J54184J43814J32466J20692J08724R6526Q4243P2330O1163N0616
$$ 4332264 4486448 4630262 4762728 4883420 4992144 5088670 5172913 5245243 5306406 5357022
59294E357022M0190K9383J7821N273q218k2353l6876n1733o6794q1510r5115j07100
$$ 5357022 5397212 5426595 5444416 5449689 5441471 5419118 5382242 5330509 5263715 5182205 5087090 4979990
59282D979990j17341j25827j32400j36872j39282j39934j39120j36861j33071
$$ 4979990 4862649 4736822 4604422 4467550 4328268 4188334 4049214 3912353 3779282
59273C779282j27981j22191j16173j09973j03573r7296r1544q6274q1143p6143
$$ 3779282 3651301 3529110 3412937 3302964 3199391 3102095 3010551 2924277 2843134 2766991
59263B766991p1703o8128o5334o3105o1214n9321n7122n4772n2664n0736m8403
$$ 2766991 2695288 2627160 2561826 2498721 2437507 2378186 2321064 2266292 2213628 2162892 2114489
59252B114489m5416m2324l9734l7526l5100l2226k9218k6373k3609k0645j7401
$$ 2114489 2069073 2026749 1987015 1949489 1914389 1882163 1852945 1826572 1802963 1782318 1764917
59241A764917j4111j1139q550n996l144j47K576M992P526J0408J3361J6028J8434
$$ 1764917 1750806 1739667 1731117 1725121 1721977 1721830 1724406 1729398 1736924 1747332 1760693 1776721 1795155
59228A795155K0817K3305K5876K8451L0887L3092L5163L7166L8778L9596L9731
$$ 1795155 1815972 1839277 1865153 1893604 1924491 1957583 1992746 2029912 2068690 2108286 2148017
59217B148017L9724L9735L9257L7766L5228L1795K7538K2633J7316J1457M635
$$ 2148017 2187741 2227476 2266733 2304499 2339727 2371522 2399060 2421693 2439009 2450466 2455101
59206B455101l092j0999j8617k6207l3925m1046m6644n0604n3467n5488n6478
$$ 2455101 2452009 2441010 2422393 2396186 2362261 2321215 2274571 2223967 2170500 2115012 2058534
59195B058534n6315n5178n3374n1360m9724m8684m7806m6488m4481m1672l7805
$$ 2058534 2002219 1947041 1893667 1842307 1792583 1743899 1696093 1649605 1605124 1563452 1525647
59184A525647l2981k7972k3416j8998j4118r052m659j008K777P262J2053J6601
$$ 1525647 1492666 1464694 1441278 1422280 1408162 1399110 1394451 1393443 1396220 1403482 1415535 1432136
59172A432136K0966K5517L0401L5621M1201M6954N2531N7918O3537O9601P5737
$$ 1432136 1453102 1478619 1509020 1544641 1585842 1632796 1685327 1743245 1806782 1876383 1952120
59161A952120Q1554Q7156R2736R7915J01960J04457J05381J04544J01377R5364
$$ 1952120 2033674 2120830 2213566 2311481 2413441 2517898 2623279 2727823 2829200 2924564
59151B924564Q6361P4503O0016M3318K5002N614j4445l4495n3278o9430q2383
$$ 2924564 3010925 3085428 3145444 3188762 3213764 3219378 3204933 3170438 3117160 3047730 2965347
59140B965347r2410r9721j03900j04600j02403r8472r3479q7374q0210p2557o4983
$$ 2965347 2872937 2773216 2669316 2564716 2462313 2363841 2270362 2182988 2102778 2030221 1965238
59129A965238n7633n0601m4222l8684l3683k8881k4380k0440j6961j3651j0498
$$ 1965238 1907605 1857004 1812782 1774098 1740415 1711534 1687154 1666714 1649753 1636102 1625604
59118A625604p704n338l326j744p17j67J10J37k52j170k609m472o545q540j0355
$$ 1625604 1617900 1612562 1609236 1607492 1606775 1606608 1606718 1606855 1606603 1605433 1602824 1598352 1591807 1583267 1572912
59103A572912j2168j4099j5961j7420j8298j8599j8469j8234j8170j8132j7647
$$ 1572912 1560744 1546645 1530684 1513264 1494966 1476367 1457898 1439664 1421494 1403362 1385715
59092A385715j6581j5291j4008j2503j0628q710p033n362l429j495R8J643L626
$$ 1385715 1369134 1353843 1339835 1327332 1316704 1307994 1300961 1295599 1292170 1290675 1290773 1292416 1296042
59079A296042N853P666Q940J0226J1874J3613J5111J6454J7868J9350K0747K2011
$$ 1296042 1301895 1309561 1318501 1328727 1340601 1354214 1369325 1385779 1403647 1422997 1443744 1465755
59067A465755K3208K4472K5878K7295K8417K9072K9362K9338K8834K7835K6732
$$ 1465755 1488963 1513435 1539313 1566608 1595025 1624097 1653459 1682797 1711631 1739466 1766198
59056A766198K5836K4909K3578K2022K0762J9896J9031J7908J6669J5548J4709
$$ 1766198 1792034 1816943 1840521 1862543 1883305 1903201 1922232 1940140 1956809 1972357 1987066
59045A987066J4330J4419J4578J4367J3859J3474J3247J2697J1389R174N876J175
$$ 1987066 2001396 2015815 2030393 2044760 2058619 2072093 2085340 2098037 2109426 2118600 2124476 2125651
59033B125651n048j2558k0993k9989l9040m7562n5194o1772o7074p0794p2836
$$ 2125651 2120603 2108045 2087052 2057063 2018023 1970461 1915267 1853495 1786421 1715627 1642791
59022A642791p3351p2564p0769o8388o5671o2421n8363n3743m9238m5295m1895
$$ 1642791 1569440 1496876 1426107 1357719 1292048 1229627 1171264 1117521 1068283 1022988 981093
59011I81093l8877l6127l3440l0617k7769k5219k3084k1190j9415j7795j6332
$$ 981093 942216 906089 872649 842032 814263 789044 765960 744770 725355 707560 691228
59000F91228j4985j3828j2890j1925j0665r305q322p864p572p044o239n387m740
$$ 691228 676243 662415 649525 637600 626935 617630 609308 601444 593872 586828 580589 575202 570462
58987E70462m410m194l722k969k379k230k099j396k38P57J328J735K153K472K657
$$ 570462 566052 561858 558136 555167 552788 550558 548459 547063 546825 547582 548910 550645 552798 555270 557927
58972E57927K814K878K690K397K289K308K190K069K343K909L110K619J840J285
$$ 557927 560741 563619 566309 568706 570995 573303 575493 577562 579905 582814 585924 588543 590383 591668
58958E91668R88P60N98N70O09N57L07j16m57l41K25O37M38J6M9M05L00n32j547
$$ 591668 592656 593416 594014 594584 595193 595750 596057 595941 595484 595143 595368 596005 596443 596459 596508 596913 597213 596681 595134
58939E95134k359l200m217n028n332n351n328n094m554m070l936l849l339k405
$$ 595134 592775 589575 585358 580330 574998 569647 564319 559225 554671 550601 546665 542816 539477 537072
58925E37072j395m82L51J072J649K207K858L536M167M836N594O254O639O814P022
$$ 537072 535677 535195 535546 536618 538267 540474 543332 546868 551035 555871 561465 567719 574358 581172 588194
58910E88194P467Q165Q895R279R182Q969R135R694J0265J0669J1031J1349J1402
$$ 588194 595661 603826 612721 622000 631182 640151 649286 658980 669245 679914 690945 702294 713696
58897G13696J1192J1072J1275J1713J2290J3048J3918J4696J5365J6108J6928
$$ 713696 724888 735960 747235 758948 771238 784286 798204 812900 828265 844373 861301
58886H61301J7653J8369J9411K0908K2677K4587K6561K8296K9551L0773L2799
$$ 861301 878954 897323 916734 937642 960319 984906 1011467 1039763 1069314 1100087 1132886
58875A132886L5755L8847M1459M3877M6636M9813N3266N7037O1117O5211O9216
$$ 1132886 1168641 1207488 1248947 1292824 1339460 1389273 1442539 1499576 1560693 1625904 1695120
58864A695120P3558P8695Q4593R0922R7461J04039J10489J16935J23853J31462
$$ 1695120 1768678 1847373 1931966 2022888 2120349 2224388 2334877 2451812 2575665 2707127
58854B707127J39376J47071J54391J61364J67868J73745J78896J83005J85435
$$ 2707127 2846503 2993574 3147965 3309329 3477197 3650942 3829838 4012843 4198278
58845D198278J85624J83293J78079J69416J56964J40782J20838R6826O8881L8089
$$ 4198278 4383902 4567195 4745274 4914690 5071654 5212436 5333274 5430100 5498981 5537070
58835E537070N929k6486n8288q8363j15528j38996j58349j73212j83358j89061
$$ 5537070 5542999 5516513 5458225 5369862 5254334 5115338 4956989 4783777 4600419 4411358
58825D411358j91045j90096j86794j81543j74687j66668j58039j49195j40223
$$ 4411358 4220313 4030217 3843423 3661880 3487193 3320525 3162486 3013291 2873068
58816B873068j31258j22787j15165j08008j00650r3198q6452q0754p5599p0564
$$ 2873068 2741810 2619023 2503858 2395850 2295200 2202002 2115550 2034796 1959197 1888633
58806A888633o5851o1633n7594n3503m9692m6417m3319l9975l6572l3540l0893
$$ 1888633 1822782 1761149 1703555 1650052 1600360 1553943 1510624 1470649 1434077 1400537 1369644
58795A369644k8355k5825k3296k0687j8034j5568j3261j0722p828n066k831q29
$$ 1369644 1341289 1315464 1292168 1271481 1253447 1237879 1224618 1213896 1206068 1201002 1198171 1197342
58783A197342J418L916O401Q868J1441J4053J6665J9422K2283K4858K7043K9395
$$ 1197342 1198760 1202676 1209077 1217945 1229386 1243439 1260104 1279526 1301809 1326667 1353710 1383105
58771A383105L2476L6147L9958M3809M7805N1784N5589N9500O3938O8900P4093
$$ 1383105 1415581 1451728 1491686 1535495 1583300 1635084 1690673 1750173 1814111 1883011 1957104
58760A957104P9381Q4768R0209R5779J01791J08415J15444J22673J30163J37822
$$ 1957104 2036485 2121253 2211462 2307241 2409032 2517447 2632891 2755564 2885727 3023549
58750C023549J45208J52051J58595J64962J70560J74572J76658J76763J74552
$$ 3023549 3168757 3320808 3479403 3644365 3814925 3989497 4166155 4342918 4517470
58741D517470J69494J61163J49098J32738J11953Q7348N9720K9585k411l5051
$$ 4517470 4686964 4848127 4997225 5129963 5241916 5329264 5388984 5418569 5416158 5381107
58731E381107o6974r7120j24380j47443j65576j79163j88883j94779j96711j95284
$$ 5381107 5314133 5217013 5092633 4945190 4779614 4600451 4411568 4216789 4020078 3824794
58721C824794j91558j86119j79113j70913j62098j52977j43667j34512j25849
$$ 3824794 3633236 3447117 3268004 3097091 2934993 2782016 2638349 2503837 2377988
58712B377988j17618j09724j02508r6281r0680q5059p9340p3855o8638o3507n8668
$$ 2377988 2260370 2150646 2048138 1951857 1861177 1776118 1696778 1622923 1554285 1490778 1432110
58701A432110n4541n1034m7617m4082m0659l7463l4306l1150k8225k5695k3449
$$ 1432110 1377569 1326535 1278918 1234836 1194177 1156714 1122408 1091258 1063033 1037338 1013889
58690A013889k1276j9021j6702j4609j3054j1878j0586r061p735o812n950n051
$$ 1013889 992613 973592 956890 942281 929227 917349 906763 897702 889967 883155 877205 872154
58678H72154m718n380o566p621q569r687j0786j1594j2373j3408j4326j4664j4648
$$ 872154 867436 862056 855490 847869 839300 829613 818827 807233 794860 781452 767126 752462 737814
58665G37814j4732j4838j4761j4859j5451j6045j6031j5713j5726j5847j5431
$$ 737814 723082 708244 693483 678624 663173 647128 631097 615384 599658 583811 568380
58654E68380j4670j4298j4269j3860j2977j2251j1826j1176j0132r175q535p938
$$ 568380 553710 539412 525143 511283 498306 486055 474229 463053 452921 443746 435211 427273
58642D27273p348p084p077o815o195n604n146m538l945l940m467m689m175l470
$$ 427273 419925 412841 405764 398949 392754 387150 382004 377466 373521 369581 365114 360425 356250 352780
58628C52780l173l116k801k124j353p59m58k79J73R90J639J635J341J456J926
$$ 352780 349607 346491 343690 341566 340213 339454 338996 338717 338890 339880 341519 343154 344495 345951 347877
58613C47877K107J864J682J714J592J284J245J585J788J539J137Q98P09M13K5
$$ 347877 349984 351848 353530 355244 356836 358120 359365 360950 362738 364277 365414 366312 367021 367434 367459
58598C67459n12j302k149k712k998l211l197k692j949j486j231o85J57Q36J321
$$ 367459 366947 365645 363496 360784 357786 354575 351378 348686 346737 345251 344020 343335 343492 344328 345649
58583C45649K057L057L833M299M917N807O558P072P804Q926J0017J0818J1596
$$ 345649 347706 350763 354596 358895 363812 369619 376177 383249 391053 399979 409996 420814 432410
58570D32410J2539J3483J4432J5679J7177J8483J9480K0611K2125K3803K5488
$$ 432410 444949 458432 472864 488543 505720 524203 543683 564294 586419 610222 635710
58559F35710K7330K9335L1301L3334L5753L8439M0893M2974M4955M6826M8311
$$ 635710 663040 692375 723676 757010 792763 831202 872095 915069 960024 1006850 1055161
58548A055161M9493N0619N1230N0400M7953M4526M0324L4717K7352J8725R394
$$ 1055161 1104654 1155273 1206503 1256903 1304856 1349382 1389706 1424423 1451775 1470500 1479894
58537A479894n44j0787k0520k9121l6523m2574m6786m9064m9985n0003m9033m7016
$$ 1479894 1479350 1468563 1448043 1418922 1382399 1339825 1293039 1243975 1193990 1143987 1094954 1047938
58525A047938m4296m1164l7684l4140l0943k8023k4909k1565j8392j5452j2563
$$ 1047938 1003642 962478 924794 890654 859711 831688 806779 785214 766822 751370 738807
58514G38807j0116q748q102p018n197l568k695j999r74n1L00L18J85n32k115m188
$$ 738807 728691 719943 711841 704823 699626 696058 693363 691364 690390 690339 690639 690957 691142 690610 688495 684307
58498F84307o498r310j2539j5408j7497j9211k0674k1202k0516j9487j8904j8410
$$ 684307 677809 668499 655960 640552 623055 603844 583170 561968 541452 521965 503061 484651
58486D84651j7417j6182j5152j4011j2395j0826r961r510q735p585o546n766n110
$$ 484651 467234 451052 435900 421889 409494 398668 388707 379197 370462 362877 356331 350565 345455
58473C45455m674m565m490m203l962m034m115l822l310k930k700k515k465k499
$$ 345455 340781 336216 331726 327523 323561 319527 315412 311590 308280 305350 302650 300135 297670 295171
58459B95171k274j733j304j178r78n13j74j81r6M05R88J346J733K291K609K512
$$ 295171 292897 291164 289860 288682 287704 287191 287017 286836 286740 287145 288133 289479 291212 293503 296112 298624
58443B98624K561L115L631L541L188L220L647M167M813N528N756N189M464M369
$$ 298624 301185 304300 307931 311472 314660 317880 321527 325694 330507 336035 341791 346980 351444 355813
58429C55813M756M928M665M223L689K937J941O87r08k618l940m777n603o609p365
$$ 355813 360569 365497 370162 374385 378074 381011 382952 383639 382731 380113 376173 371396 365793 359184 351819
58414C51819p671p999q625r037q753q051p347o539n515m633m153l755l180k676
$$ 351819 344148 336149 327524 318487 309734 301683 294336 287797 282282 277649 273496 269741 266561 263885
58400B63885k409k053j460r60o60j59N62Q74O19N60J172J842J934J757J794J903
$$ 263885 261476 259423 257963 257003 256343 256184 256746 257620 258239 258799 259971 261813 263747 265504 267298 269201
58384B69201J908K141K659K867K577K578L323M023L882L289K987K876K569K236
$$ 269201 271109 273250 275909 278776 281353 283931 287254 291277 295159 298448 301435 304311 306880 309116
58370C09116K034J481K86r59j716k327l084l453l045k452k219j933j234p35q68
$$ 309116 311150 312631 312917 311958 310242 307915 304831 301378 298333 295881 293662 291729 290495 289760 288892
58355B88892q94j29Q09J106J172J720K328K270J954K233K934L296L276L211K874
$$ 288892 287998 287869 288678 289784 290956 292676 295004 297274 299228 301461 304395 307691 310967 314178 317052
58340C17052J997J098O81K55o99j594j728j587k008k670k773k462k330k231j777
$$ 317052 319049 320147 320828 321083 320384 318790 317062 315475 313467 310797 308024 305562 303232 301001 299224
58325B99224j404j666k108k066j875k084k230j660q56n69l93M30J492J939K043
$$ 299224 297820 296154 294046 291980 290105 288021 285791 284131 283275 282706 282313 282743 284235 286174 288217
58310B88217K594L370L615L513L770M238M294M050L982L914L619L620M225M630
$$ 288217 290811 294181 297796 301309 305079 309317 313611 317661 321643 325557 329176 332796 337021 341651
58296C41651M232L929M649N648N796N563N921O336N719M578M187M271L546K060
$$ 341651 345883 349812 354461 360109 365905 371468 377389 383725 389444 394022 398209 402480 406026 408086
58282D08086J017O97L89K5P5J92k76q32n22L43Q16J089J938L019L459L589M273
$$ 408086 409103 409800 410189 410214 410289 410481 410205 409373 408851 409194 410010 411099 413037 416056 419515 423104 427377
58265D27377N128N270N148N809O915P463P742Q582R353Q929P960P984Q830R094
$$ 427377 432505 437775 442923 448732 455647 463110 470852 479434 488787 497716 505676 513660 522490 531584
58251E31584Q695Q606Q599P662O255N786O082N748M769M392M743M883M953N885
$$ 531584 540279 548885 557484 565146 571401 577187 583269 589017 593786 598178 602921 607804 612757 618642
58237F18642P238P753P772Q718J0379J1201J1104J1492J2649J3499J3922J4772
$$ 618642 625880 633633 641405 650123 660502 671703 682807 694299 706948 720447 734369 749141
58225G49141J5817J6062J5993J7068J9078K0457K0992K1804K2927K3423K3673
$$ 749141 764958 781020 797013 814081 833159 853616 874608 896412 919339 942762 966435
58214I66435K4928K6821K7867K8062K8458K8642K7394K5321K4033K3233K1547
$$ 966435 991363 1018184 1046051 1074113 1102571 1131213 1158607 1183928 1207961 1231194 1252741
58203A252741J9653J9397K0370K0657K0501K1819K4555K6954K9043L2314L6406
$$ 1252741 1272394 1291791 1312161 1332818 1353319 1375138 1399693 1426647 1455690 1488004 1524410
58192A524410L9659M2513M6614N1196N4294N6949O1978O9011P5126P9965Q5615
$$ 1524410 1564069 1606582 1653196 1704392 1758686 1815635 1877613 1946624 2021750 2101715 2187330
58181B187330R1876R6526J00103J05426J12311J17924J22350J28635J37141J45234
$$ 2187330 2279206 2375732 2475835 2581261 2693572 2811496 2933846 3062481 3199622 3344856
58171C344856J52842J62833J75472J88121K00826K16617K35781K55593K76019
$$ 3344856 3497698 3660531 3836003 4024124 4224950 4441567 4677348 4932941 5208960
58162E208960K99699L26005L51474L76418M04569M36022M67739N01193N41980
$$ 5208960 5508659 5834664 6186138 6562556 6967125 7403147 7870886 8372079 8914059
58153H914059N91468O46870P09867P86329Q76501R74292J077239J188314J308019
$$ 8914059 9505527 10152397 10862264 11648593 12525094 13499386 14576625 15764939 17072958
58144A7072958J435460J578144J749562J955567K192906K458760K747252L039096
$$ 17072958 18508418 20086562 21836124 23791691 25984597 28443357 31190609 34229705
58136C4229705L315477L587158L894708M279857M771985N387509O097286O787540
$$ 34229705 37545182 41132340 45027048 49306905 54078890 59466399 65563685 72351225
58128G2351225P300265P527895P408953O796833N423201L126366J43342k905242
$$ 72351225 79651490 87179385 94588338 101385171 106808372 109934738 110078080 107172838
58120A07172838n379653o973196p744677p913532p687558p225106o645860o026743
$$ 107172838 101793185 94819989 87075312 79161780 71474222 64249116 57603256 51576513
58112E1576513n406285m807967m250806l741247l274675k849807k471226k138748
$$ 51576513 46170228 41362261 37111455 33370208 30095533 27245726 24774500 22635752
58104B2635752j846182j590500j372249j187413j027694q88452p68993o66131
$$ 22635752 20789570 19199070 17826821 16639408 15611714 14723262 13954269 13288138
58096A3288138n73961m88754m08760l30961k52338j71949q8738j246Q7861J72107
$$ 13288138 12714177 12225423 11816663 11485702 11233364 11061415 10972677 10971431 11059292 11231399
58086A1231399K49084L23115L99360M82355N79584O94959Q17656R29984J022976
$$ 11231399 11480483 11803598 12202958 12685313 13264897 13959856 14777512 15707496 16730472
58077A6730472J078316J029059P77310K90477l28017q94996j278530j461946j497785
$$ 16730472 17808788 18837847 19615157 19905634 19577617 18682621 17404091 15942145 14444360
58068A4444360j439759j326025j190212j057299r34792q21908p21824o37326n63540
$$ 14444360 13004601 11678576 10488364 9431065 8496273 7674365 6952541 6315215 5751675
58059E751675m94667m32142l79256l33791k92493k57146k30041k08437j88937
$$ 5751675 5257008 4824866 4445610 4111819 3819326 3562180 3332139 3123702 2934765
58050B934765j72647j61021j51165j40019j28928j19807j10894j00413r0400q2865
$$ 2934765 2762118 2601097 2449932 2309913 2180985 2061178 1950284 1849871 1759471 1676606
58040A676606p5964o7799o0267n5481n1903m7656m4217m3284m3189m1900m0545
$$ 1676606 1600642 1532843 1472576 1417095 1365192 1317536 1273319 1230035 1186846 1144946 1104401
58029A104401m0677m0968l9759l8138l7401l6282l3585l0897k9808k9031k7093
$$ 1104401 1063724 1022756 982997 944859 907458 871176 837591 806694 776886 747855 720762
58018G20762k5196k4616k3884k1447j8714j7609j7326j6312j5217j5146j5109
$$ 720762 695566 670950 647066 625619 606905 589296 571970 555658 540441 525295 510186
58007E10186j3912j2621j2536j2622j1502j0135r922j0020r045p728p390p394
$$ 510186 496274 483653 471117 458495 446993 436858 426936 416916 407871 400143 392753 385359
57995C85359o556n634n916o771o860o481o497o315n108l770l552l858l450k679
$$ 385359 378803 373169 367253 360482 353622 347141 340644 334329 329221 325451 321899 318041 314591 311912
57981C11912k601k980l015l000l447l692l081k367k379k456j844j314j771k461
$$ 311912 309311 306331 303316 300316 296869 293177 290096 287729 285350 282894 281050 279736 277965 275504
57967B75504k285j670j515j482r59n31p95r52k05O38O01L15P40J334J195Q49J140
$$ 275504 273219 271549 270034 268552 267593 267062 266267 265315 265110 265748 266349 266664 267404 268738 269933 270782 271922
57950B71922J517J167P29J130J785J740J510K038K801K768K284K237K308J820
$$ 271922 273439 274606 275335 276465 278250 279990 281500 283538 286339 289107 291391 293628 295936 297756
57936B97756J359J674J936R77o07j474j837k811m176m844m964n559o460o568n870
$$ 297756 299115 300789 302725 303702 303095 301621 299784 296973 292797 287953 282989 277430 270970 264402 258532
57921B58532n376n251m748l862l358l276k881k044j319p92j56L56L11O6K55O31
$$ 258532 253156 247905 243157 239295 235937 232661 229780 227736 226417 225625 225469 225825 226136 226202 226457 227088
57905B27088O03M46P20J018O37lj7L42J73m09o51p70j590k796l187k592k043k040
$$ 227088 227691 228137 228857 229875 230512 230509 230492 230834 231007 230598 229947 229177 227587 224791 221604 219012 216969 214929
57887B14929k048j770j578j539j250p25l86j26N21J337J596J283J124J379J650
$$ 214929 212881 211111 209533 207994 206744 206019 205633 205507 206028 207365 208961 210244 211368 212747 214397
57872B14397J800K069K254J814P91j79q30j405j947k276k550l066l635l899m016
$$ 214397 216197 218266 220520 222334 223125 222946 222116 220711 218764 216488 213938 210872 207237 203338 199322
57857A99322m336m654m586m281m028l549k612j798j706j829j306l78L6j32j87
$$ 199322 194986 190332 185746 181465 177437 173888 171276 169478 167772 165943 164637 164259 164295 164163 163976
57842A63976Lm4k96k47M4M9j90j45J70K98L62Q72J630J928J753J715J860J623
$$ 163976 163979 163935 163639 163392 163436 163485 163295 163150 163320 163618 163980 164852 166482 168410 170163 171878 173738 175361
57824A75361J005P01R06J049P91M27J53k04o38r22j153j638k218k433k261k032
$$ 175361 176366 177067 177973 179022 179813 180240 180393 180189 179551 178629 177476 175838 173620 171187 168926 166894
57808A66894j758j330j054j222j380r35j87J75L15R20J869K358K246K151K283
$$ 166894 165136 163806 162752 161530 160150 159215 159028 159203 159518 160438 162307 164665 166911 169062 171345
57793A71345K207J820J518J377J125Q89J011J233R60L04j50m32r80j539j441r05
$$ 171345 173552 175372 176890 178267 179392 180281 181292 182525 183485 183789 183639 183207 182227 180688 179247 178342
57777A78342q43j347j600j375j317j630j709j372j242j536j653j297r65r32q41
$$ 178342 177499 176152 174552 173177 171860 170230 168521 167149 165907 164371 162718 161421 160456 159524 158683
57762A58683o01p09j272j658j527j272j152q99n43o29j229j638j484j244j307
$$ 158683 158082 157373 156101 154443 152916 151644 150492 149593 149050 148421 147192 145554 144070 142826 141519
57747A41519j392j309j410j780j901j526j145j121j142r15o66n30k23L08O32O29
$$ 141519 140127 138818 137408 135628 133727 132201 131056 129935 128793 127878 127212 126682 126459 126767 127399 128028
57731A28028P54J211J576J639J801K296K778L027L285L553L375K701K120J882
$$ 128028 128782 129993 131569 133208 135009 137305 140083 143110 146395 149948 153323 156024 158144 160026
57717A60026J533R28O35Q83J055P32L57K82P2n70j133j231j339j904k433k344
$$ 160026 161559 162487 163122 164005 165060 165792 166149 166431 166503 165933 164800 163569 162230 160326 157893 155549
57701A55549j964j846j762j278p25p29j156j355j153q64o51m55l14j70K24Q10
$$ 155549 153585 151739 149977 148699 147974 147245 146089 144734 143581 142717 142066 141611 141297 141127 141351 142161
57685A42161J075Q31O06P78R52P73O39R47J240R65N03N78J096J467J656K001K336
$$ 142161 143236 144067 144673 145451 146403 147176 147815 148762 150002 150967 151470 152048 153144 154611 156267 158268 160604
57668A60604K225J877J918K338K569K467K469K723K884K809K822L163L692M207
$$ 160604 162829 164706 166624 168962 171531 173998 176467 179190 182074 184883 187705 190868 194560 198767
57654A98767M585M629M296M021M326N131N893O331O567O671O622O679P274Q443
$$ 198767 203352 207981 212277 216298 220624 225755 231648 237979 244546 251217 257839 264518 271792 280235
57640B80235R777J0974J2036J2953J3596J3974J4287J4673J5175J5914J6968J8155
$$ 280235 290012 300986 313022 325975 339571 353545 367832 382505 397680 413594 430562 448717
57628D48717J9192K0048K0921K1989K3398K5326K7769L0411L2992L5625L8487
$$ 448717 467909 487957 508878 530867 554265 579591 607360 637771 670763 706388 744875
57617G44875M1375M3918M6005M7629M8522M8350M7168M5289M2734L9197L4469
$$ 744875 786250 830168 876173 923802 972324 1020674 1067842 1113131 1155865 1195062 1229531
57606A229531K8579K1676J4073O232j767j0584k0935l2441m3492n2315n7910o0150
$$ 1229531 1258110 1279786 1293859 1300091 1298324 1287740 1266805 1234364 1190872 1138557 1080647 1020497
57594A020497n9534n6951n3314m9116m4475l9624l5075l1191k7848k4626k1258
$$ 1020497 960963 904012 850698 801582 757107 717483 682408 651217 623369 598743 577485
57583E77485j7844j4705j2139j0158q471o741m802k695n87J276K715L851N056
$$ 577485 559641 544936 532797 522639 514168 507427 502625 499930 499343 500619 503334 507185 512241
57570E12241O577Q317J0030J1565J2934J4282J5888J7937K0242K2394K4258K6039
$$ 512241 518818 527135 537165 548730 561664 575946 591834 609771 630013 652407 676665 702704
57558G02704K7824K9367L0501L1356L2010L2216L1715L0482K8476K5418K1120
$$ 702704 730528 759895 790396 821752 853762 885978 917693 948175 976651 1002069 1023189
57547A023189J5719R411K245n540j3289k0370k6563l1764l5653l8037l9259l9873
$$ 1023189 1038908 1048319 1050564 1045024 1031735 1011365 984802 953038 917385 879348 840089 800216
57535H00216m0039l9562l8342l6501l4260l1956k9940k8215k6347k4091k1777
$$ 800216 760177 720615 682273 645772 611512 579556 549616 521401 495054 470963 449186
57524D49186j9818j8129j6424j4843j3746j3097j2470j1609j0561r395q171p131
$$ 449186 429368 411239 394815 379972 366226 353129 340659 329050 318489 309094 300923 293792
57512B93792o515o184n791n250m787m496m178l641k908k183j724j682j901j993
$$ 293792 287277 281093 275302 270052 265265 260769 256591 252950 250042 247859 246135 244453 242552 240559
57498B40559j779j451j168p74j36N67J184J885K787L538L780L791M156M927N563
$$ 240559 238780 237329 236161 235387 235251 235818 237002 238887 241674 245212 248992 252783 256939 261866 267429
57483B67429N741N763O071O697P335P794Q214Q900R905J0875J1503J2065J3112
$$ 267429 273170 278933 285004 291701 299036 306830 315044 323944 333849 344724 356227 368292 381404
57470C81404J4588J5791J6393J6932J7981J9367K0658K1907K3262K4335K4635
$$ 381404 395992 411783 428176 445108 463089 482456 503114 525021 548283 572618 597253
57459E97253K4409K4266K4131K3272K1274J8324J4577R957M608r90o510j1901
$$ 597253 621662 645928 670059 693331 714605 732929 747506 757463 762071 761081 754571 742670
57447G42670j6926k1098k4127k6113k7239k7657k7644k7418k6820k5549k3700
$$ 742670 725744 704646 680519 654406 627167 599510 571866 544448 517628 492079 468379
57436D68379k1682j9717j7821j6197j5051j4100j2809j1129r504q117o700n161
$$ 468379 446697 426980 409159 392962 377911 363811 351002 339873 330369 322252 315552 310391
57424C10391l752k547j218L56J796K760L360L901M582N566O972Q613J0095J1314
$$ 310391 306639 304092 302874 303230 305026 307786 311146 315047 319629 325195 332167 340780 350875 362189
57410C62189J2514J3759J4809J5596J6392J7341J8262J9067J9929K0870K1544
$$ 362189 374703 388462 403271 418867 435259 452600 470862 489929 509858 530728 552272
57399E52272K1709K1509K1119K0449J9291J7421J4496J0288N184l7n110j0395
$$ 552272 573981 595490 616609 637058 656349 673770 688266 698554 703738 703701 698591 688196
57387F88196j5923k0921k4659k7249k9133l0287l0422k9661k8451k7021k5405
$$ 688196 672273 651352 626693 599444 570311 540024 509602 479941 451490 424469 399064
57376C99064k3777k2293k0809j9139j7469j6107j4973j3796j2661j1851j1272
$$ 399064 375287 352994 332185 313046 295577 279470 264497 250701 238040 226189 214917
57365B14917j0475r314q120p175o394n645n039m694m470m145l702l317l078k856
$$ 214917 204442 195128 187008 179833 173439 167794 162755 158061 153591 149446 145744 142427 139349 136493
57351A36493k475j922j424j210j259j307j191j014r46r92j065j189j410j627j633
$$ 136493 134018 132096 130672 129462 128203 126896 125705 124691 123745 122753 121688 120499 119089 117462 115829
57336A15829j381j034p73o41n77n34m72l32p1K30L38R9l12m72j88K59M76M24L39
$$ 115829 114448 113414 112641 112000 111423 110889 110417 110085 110014 110244 110582 110681 110369 109897 109709 109968 110444 110868 111207
57317A11207L45L69M04N49P98J054J318J614J779J639J378J355J523J465J102
$$ 111207 111552 111921 112325 112874 113672 114726 116044 117658 119437 121076 122454 123809 125332 126797 127899
57302A27899R19J237J668J690J338J024Q37N17L4k78j66K36O34Q64Q95P56N49
$$ 127899 128818 130055 131723 133413 134751 135775 136612 137129 137163 136885 136719 136955 137589 138453 139348 140104 140653
57285A40653M40N06O63P74P99Q27R80J250J541J834K241K772L174L190K910K696
$$ 140653 141093 141599 142262 143036 143835 144662 145642 146892 148433 150267 152508 155280 158454 161644 164554 167250
57269A67250K735K914L070L131L071K947K951L145L213K828K281K233K794L313
$$ 167250 169985 172899 175969 179100 182171 185118 188069 191214 194427 197255 199536 201769 204563 207876
57255B07876L297L020K974L155L316L509L884M297M544M816N402O133O597O782
$$ 207876 211173 214193 217167 220322 223638 227147 231031 235328 239872 244688 250090 256223 262820 269602
57241B69602O994P266P335P224P291P623P850P750P648P997Q841R898J0925J1782
$$ 269602 276596 283862 291197 298421 305712 313335 321185 328935 336583 344580 353421 363319 374244 386026
57227C86026J2367J2699J2919J3127J3302J3512J3901J4446J4870J4989J4917
$$ 386026 398393 411092 424011 437138 450440 463952 477853 492299 507169 522158 537075
57216E37075J4788J4472J3790J2808J1713J0419Q655O392L991J863J54j166k114
$$ 537075 551863 566335 580125 592933 604646 615065 623720 630112 634103 635966 636120 634954 632840
57203F32840k720l143l612m236m987n782o522p004o976o358n356m264l197k102
$$ 632840 630120 626977 623365 619129 614142 608360 601838 594834 587858 581500 576144 571880 568683 566581
57189E66581j017j28M54Q62J293J763K151K414K674L072L609M158M522M511M042
$$ 566581 565564 565436 565890 566752 568045 569808 571959 574373 577047 580119 583728 587886 592408 596919 600961
57174F00961L240K386J751J437J367J412J544J876K587L766N348P186R095J0851
$$ 600961 604201 606587 608338 609775 611142 612554 614098 615974 618561 622327 627675 634861 643956 654807
57160F54807J2200J3004J3364J3567J3851J4246J4650J5019J5458J6087J6793
$$ 654807 667007 680011 693375 706942 720793 735039 749689 764708 780166 796253 813046
57149H13046J7204J6972J6121J5045J4099J3275J2282J0899R166P312N593M165
$$ 813046 830250 847222 863343 878388 892487 905762 918044 928943 938109 945421 951014 955179
57137I55179K991J876O46o82j988l283m666o058p147p813q381r281j0468j1467
$$ 955179 958170 960046 960692 960010 958022 954739 950073 944015 936868 929055 920674 911393 900925 889458
57123H89458j1976j2145j2186j1999j1412j0563r790r187q585p937p426p184p161
$$ 889458 877482 865337 853151 841152 829740 819177 809387 800200 791615 783678 776252 769068 761907
57110G61907p376q100r590j1779j4357j7086j9959k3050k6317k9544l2504l5214
$$ 761907 754531 746431 736841 725062 710705 693619 673660 650610 624293 594749 562245 527031
57098E27031l8014m1179m4540m7600n0117n2419n4999n7926o0773A6348d8659
$$ 527031 489017 447838 403298 355698 305581 253162 198163 140237 79464 16348 -48659
57086a15662o9656p3169p7362q1917q6596r1307r6291j02207j09750j19047j29669
$$ -115662 -185318 -258487 -335849 -417766 -504362 -595669 -691960 -794167 -903917 -1022964 -1152633
57075a152633j41339j54194j68195j82706j97151k11705k26866k42672k58961
$$ -1152633 -1293972 -1448166 -1616361 -1799067 -1996218 -2207923 -2434789 -2677461 -2936422
57066b936422k76101k94758l15104l36980l60809l87556m17814m51679m89613
$$ -2936422 -3212523 -3507281 -3822385 -4159365 -4520174 -4907730 -5325544 -5777223 -6266836
57057f266836n32742n82222o39118p04909p81290q69295r69424j082827j211619
$$ -6266836 -6799578 -7381800 -8020918 -8725827 -9507117 -10376412 -11345836 -12428663 -13640282
57048a3640282j358049j524602j715233j935610k192069k491877k845043l264373
$$ -13640282 -14998331 -16522933 -18238166 -20173776 -22365845 -24857722 -27702765 -30967138
57040c0967138l762738m350591n035268n819148o696292p653688q680906r780660
$$ -30967138 -34729876 -39080467 -44115735 -49934883 -56631175 -64284863 -72965769 -82746429
57032h2746429j0966938j2245872j3590074j4928388j6170264j7259918j8219899
$$ -82746429 -93713367 -105959239 -119549313 -134477701 -150647965 -167907883 -186127782
57025a86127782j9132585k0050439k0893356k1415340k1274112k0163442j7933388
$$ -186127782 -205260367 -225310806 -246204162 -267619502 -288893614 -309057056 -326990444
57018c26990444j4641945j0523862n903335j102464L609525Q020289J1961055
$$ -326990444 -341632389 -352156251 -358059586 -359162050 -355552525 -347532236 -335571181
57011c35571181J5303222J7964091J9908516K1144408K1718256K1709193K1215751
$$ -335571181 -320267959 -302303868 -282395352 -261250944 -239532688 -217823495 -196607744
57004a96607744K0338978J9172258J7800116J6299172J4737418J3174127J1660398
$$ -196607744 -176268766 -157096508 -139296392 -122997220 -108259802 -95085675 -83425277
56997h3425277J0237121Q931364P756239O715005N804487N015984M336823L753754
$$ -83425277 -73188156 -64256792 -56500553 -49785548 -43981061 -38965077 -34628254 -30874500
56989c0874500L254894K829019K465187K154129J888785J662807J469633J303538
$$ -30874500 -27619606 -24790587 -22325400 -20171271 -18282486 -16619679 -15150046 -13846508
56981a3846508J160398J036796R29424Q35823P54611O84327O22813N68270N20008
$$ -13846508 -12686110 -11649314 -10719890 -9884067 -9129456 -8445129 -7822316 -7254046 -6734038
56972f734038M77601M40105M06576L76582L49692L25107L02247K81077K61479
$$ -6734038 -6256437 -5816332 -5409756 -5033174 -4683482 -4358375 -4056128 -3775051 -3513572
56963c513572K42946K25204K08394J92443J76870J61582J47062J33396J19838
$$ -3513572 -3270626 -3045422 -2837028 -2644585 -2467715 -2306133 -2159071 -2025675 -1905837
56954a905837J05728R1223P6770O2573M8907L6274K4828J4252M574l564r867j4849
$$ -1905837 -1800109 -1708886 -1632116 -1569543 -1520636 -1484362 -1459534 -1445282 -1440708 -1444272 -1454139 -1468988
56942a468988j8930k1635k2263k0808j7762j3542q571l438J489O251J0819J4941
$$ -1468988 -1487918 -1509553 -1531816 -1552624 -1570386 -1583928 -1592499 -1595937 -1594448 -1588197 -1577378 -1562437
56930a562437J8683K2496K6265K8990K9923K9552K8955K8632K8433K8174K7704
$$ -1562437 -1543754 -1521258 -1494993 -1466003 -1436080 -1406528 -1377573 -1348941 -1320508 -1292334 -1264630
56919a264630K6718K5048K2896K0527J8011J5573J3682J2471J1529J0686J0418
$$ -1264630 -1237912 -1212864 -1189968 -1169441 -1151430 -1135857 -1122175 -1109704 -1098175 -1087489 -1077071
56908a077071J1036J1998J2602J2938J3529J4425J5256J5923J6587J7176J7410
$$ -1077071 -1066035 -1054037 -1041435 -1028497 -1014968 -1000543 -985287 -969364 -952777 -935601 -918191
56897i18191J7207J6694J5980J5222J4655J4196J3352J1921J0502R835R933J0238
$$ -918191 -900984 -884290 -868310 -853088 -838433 -824237 -810885 -798964 -788462 -778627 -768694 -758456
56885g58456J0410J0460J0423J0347J0435J0751J0990J0941J0919J1324J1976
$$ -758456 -748046 -737586 -727163 -716816 -706381 -695630 -684640 -673699 -662780 -651456 -639480
56874f39480J2381J2476J2645J3095J3608J3836J3464J2271J0415Q511P115O195
$$ -639480 -627099 -614623 -601978 -588883 -575275 -561439 -547975 -535704 -525289 -516778 -509663 -503468
56862e03468N400M689M308M367M726N203N586N609N214M679M239L838L436L276
$$ -503468 -498068 -493379 -489071 -484704 -479978 -474775 -469189 -463580 -458366 -453687 -449448 -445610 -442174 -438898
56848d38898L481L716L626L401L471L850M148M099L728L182K748K781L284L761
$$ -438898 -435417 -431701 -428075 -424674 -421203 -417353 -413205 -409106 -405378 -402196 -399448 -396667 -393383 -389622
56834c89622L800L545L330L145K911K887L316L889M116M032M055M331M708N164
$$ -389622 -385822 -382277 -378947 -375802 -372891 -370004 -366688 -362799 -358683 -354651 -350596 -346265 -341557 -336393
56820c36393N728O143O120N813N608N537N457N555O138O988P547P712P849Q012
$$ -336393 -330665 -324522 -318402 -312589 -306981 -301444 -295987 -290432 -284294 -277306 -269759 -262047 -254198 -246186
56806b46186P846P309O978P314Q067Q671Q906Q930Q830Q350P090M962K506N26
$$ -246186 -238340 -231031 -224053 -216739 -208672 -200001 -191095 -182165 -173335 -164985 -157895 -152933 -150427 -149901
56792a49901o85j513k247k520j898o23O66J727K711L610M328N108O320P882R417
$$ -149901 -150586 -152099 -154346 -156866 -158764 -159387 -158721 -156994 -154283 -150673 -146345 -141237 -134917 -127035 -117618
56777a17618J0843J2246J3322J3653J3452J3314J3078J1695g507c462n92m638
$$ -117618 -106775 -94529 -81207 -67554 -54102 -40788 -27710 -16015 -7507 -3462 -4054 -8692
56765h692p694r497j0064r746q834p385n582l851k415j070L89J806K964L971N065
$$ -8692 -16386 -25883 -35947 -45693 -54527 -61912 -67494 -71345 -73760 -74830 -74441 -72635 -69671 -65700 -60635
56750f0635O241P248P848P974P747P344O670d343a757r25m365o931q335q638q094
$$ -60635 -54394 -47146 -39298 -31324 -23577 -16233 -9563 -4343 -1757 -2682 -7047 -13978 -22313 -30951 -39045
56735c9045p176o331n543m496l187j992j109k84P23J815K776L510L950M077M078
$$ -39045 -46221 -52552 -58095 -62591 -65778 -67770 -68879 -69163 -68440 -66625 -63849 -60339 -56389 -52312 -48234
56720d8234M198M320M040L177J871K24j716l571m757n160n266n447n516n221m689
$$ -48234 -44036 -39716 -35676 -32499 -30628 -30404 -32120 -35691 -40448 -45608 -50874 -56321 -61837 -67058 -71747
56705g1747m147l568k905k333j998j712j236o21j15J09pl84p70q63o27k87K1K93
$$ -71747 -75894 -79462 -82367 -84700 -86698 -88410 -89646 -90267 -90382 -90273 -90280 -90664 -91434 -92297 -92924 -93211 -93190 -92897
56687i2897M08J94k23m70m16k58j22K9P5j79m67k37N36J175J203Q92O62M99L12
$$ -92897 -92489 -92295 -92518 -92988 -93404 -93662 -93784 -93755 -93680 -93859 -94326 -94563 -94027 -92852 -91649 -90757 -90095 -89596 -89284
56668h9284L35P03J057J019P77P22Q18P76N36K51m8l05k73J08L99J96k35l05O6
$$ -89284 -88949 -88246 -87189 -86170 -85393 -84671 -83853 -83077 -82541 -82290 -82338 -82643 -82916 -82808 -82409 -82213 -82448 -82753 -82687
56649h2687M33N55O32Q18R44P99L91j12n20o78n74m02l16k24JK55L30K48J85K28
$$ -82687 -82254 -81699 -81067 -80249 -79305 -78506 -78115 -78227 -78747 -79425 -79999 -80401 -80717 -80941 -80940 -80685 -80355 -80107 -79922 -79694
56629g9694L68O59J148J682K044K209K314K407K424K322K105J807J511J352J302
$$ -79694 -79326 -78667 -77519 -75837 -73793 -71584 -69270 -66863 -64439 -62117 -60012 -58205 -56694 -55342 -54040
56614e4040J203J042J097J491J881J806J259O93M93O67R67J109R26M92J23Q1K97
$$ -54040 -52837 -51795 -50698 -49207 -47326 -45520 -44261 -43568 -43075 -42408 -41441 -40332 -39406 -38914 -38791 -38710 -38413
56597c8413M44K88j25n13n76k32K74N58M88K33oj78k70k51j79j88k50k19j01n4
$$ -38413 -37969 -37681 -37806 -38319 -38895 -39127 -38853 -38295 -37807 -37574 -37580 -37758 -38028 -38279 -38458 -38646 -38896 -39115 -39216 -39270
56577c9270r2n4J3j57n91r01q54p19q08r78q96n99l77l01j93j4L9j34l17j89L50
$$ -39270 -39362 -39416 -39403 -39560 -40151 -41052 -41906 -42625 -43433 -44411 -45307 -45906 -46283 -46584 -46777 -46791 -46752 -46886 -47203 -47392 -47042
56556d7042J003J272R61M26J72K01R4k95n83m59r2J83K86K87K31K41N29R96J252
$$ -47042 -46039 -44767 -43806 -43380 -43208 -43007 -42913 -43208 -43791 -44250 -44342 -44159 -43873 -43586 -43355 -43114 -42585 -41589 -40337
56537d0337J153J030J100J121R30Q52J172J529J415R54O53O23N55L72L10M73P23
$$ -40337 -39184 -38154 -37054 -35933 -35003 -34151 -32979 -31450 -30035 -29081 -28428 -27805 -27250 -26878 -26568 -26095 -25372
56520b5372J008J359J590J442J032P60P71Q30P95Q44J098J353J338J074Q52R35
$$ -25372 -24364 -23005 -21415 -19973 -18941 -18181 -17410 -16580 -15785 -14941 -13843 -12490 -11152 -10078 -9226 -8291
56504h291J309J693J819J723g1A762K060K234K401K553K514K258K070K152K280
$$ -8291 -6982 -5289 -3470 -1747 -71 1762 3822 6056 8457 11010 13524 15782 17852 20004 22284
56489B2284K131J777J556J596J705J632J294Q40N66O30P61N66Q2k53k95l75o58
$$ 22284 24415 26192 27748 29344 31049 32681 33975 34815 35381 36011 36772 37338 37420 37167 36872 36497 35839
56472C5839q76r01r95j218j160p20n18r67j552j632j478j651j881j494p04m77
$$ 35839 34963 34062 33067 31849 30689 29969 29451 28484 26932 25300 23822 22171 20290 18796 18092 17615
56456A7615j110j864k073j831j425q55k12J28j4l66o31p75p55m73j04m4l10m40
$$ 17615 16505 14641 12568 10737 9312 8457 8245 8373 8359 7993 7362 6587 5832 5359 5255 5211 4901 4461
56438D461j21L59N50L52m6m52p25p99p83q32q99B95a10OB03M45L52M9k51l06j51
$$ 4461 4340 4699 5249 5601 5555 5103 4378 3579 2796 1964 1065 295 -110 -104 203 648 1000 1049 798 492 341
56417C41N8L32P10R76R28P73Q60J106J094P65N18O53J041J400J599J649J662J791
$$ 341 399 731 1441 2417 3345 4118 4978 6084 7178 7943 8461 9114 10155 11555 13154 14803 16465 18256
56399A8256J962J823J234O45O02J007J301J252J130J196J429J717J905J747J180
$$ 18256 20218 22041 23275 23920 24522 25529 26830 28082 29212 30408 31837 33554 35459 37206 38386
56384C8386N70L31L84L92L14L23L51K50J97M38P45P15M05J48j11n81r70p99k99
$$ 38386 38956 39287 39671 40063 40377 40700 41051 41301 41498 41936 42681 43396 43801 43949 43838 43257 42287 41488 41189
56365D1189k21p14j171j214j119j131j106j000j031j149j016o55m93n95n52k59
$$ 41189 40968 40254 39083 37869 36750 35619 34513 33513 32482 31333 30317 29662 29169 28574 28022 27763
56349B7763j52m12o68o80o75p24m83P3L33p3o76q73p41o96p80p37m77q2L43N99
$$ 27763 27611 27199 26531 25851 25176 24452 23969 24042 24375 24302 23626 22753 22012 21316 20536 19799 19322 19240 19583 20182
56329B0182M67N1k48k54j71j16L1K50L27K66L13M47M02K56M28Q77J023O16J11
$$ 20182 20649 20700 20452 20198 20027 19911 19942 20192 20519 20785 21098 21545 21947 22203 22631 23508 24531 25147 25258
56310B5258p8n2K5K63O04P11N67N79P98P50L40K09P11J262J229Q51O88P05N61
$$ 25258 25180 25128 25153 25416 26020 26731 27298 27877 28675 29425 29765 29974 30685 31947 33176 34027 34715 35420 35981
56291C5981L38L41M91N46O01Q86J269J407J195P47K03j64k3N41R47P98L71J56
$$ 35981 36319 36660 37151 37697 38298 39184 40453 41860 43055 43802 44005 43841 43818 44359 45306 46104 46475 46631
56273D6631L25Q28J600K391K834K913K934K919K571K045K001K546K872K389J641
$$ 46631 46956 47784 49384 51775 54609 57522 60456 63375 65946 67991 69992 72538 75410 77799 79440
56258G9440J462J864K312K611K875L015K892K679K601K570K455K383K426K365
$$ 79440 80902 82766 85078 87689 90564 93579 96471 99150 101751 104321 106776 109159 111585 113950
56244A13950K122K006K154K195J839J333R70O62L58L74Q16J192J080P21N23M79
$$ 113950 116072 118078 120232 122427 124266 125599 126569 127231 127589 127963 128779 129971 131051 131772 132295 132774
56228A32774M78P31J353J986K248K233K159K061K087K542L308L844M104M693N741
$$ 132774 133252 133983 135336 137322 139570 141803 143962 146023 148110 150652 153960 157804 161908 166601 172342
56213A72342O475O491O556P449Q723R525R879J0379J1164J2059J3200J4682J6052
$$ 172342 178817 185308 191864 199313 208036 217561 227440 237819 248983 261042 274242 288924 304976
56200C04976J6930J7715J8943K0423K1720K2987K4543K6101K7174K7822K8320
$$ 304976 321906 339621 358564 378987 400707 423694 448237 474338 501512 529334 557654
56189E57654K8547K8380K8129K7867K6925K4865K2303J9976J7612J4617J1238
$$ 557654 586201 614581 642710 670577 697502 722367 744670 764646 782258 796875 808113
56178H08113Q059M872J180k643n795q297j0724j3016j4567j5304j5679j5838j5641
$$ 808113 816172 821044 822224 819581 813786 805489 794765 781749 767182 751878 736199 720361 704720
56165G04720j5346j5325j5412j5349j5536j6443j7573j7993j7656j7296j7276
$$ 704720 689374 674049 658637 643288 627752 611309 593736 575743 558087 540791 523515
56154E23515j7417j7643j7943j7941j7378j6712j6456j6267j5566j4546j3706
$$ 523515 506098 488455 470512 452571 435193 418481 402025 385758 370192 355646 341940
56143C41940j2866j1667j0532j0043r786q964p762o995o716o375n906n583n105
$$ 341940 329074 317407 306875 296832 287046 278082 270320 263325 256609 250234 244328 238745 233640
56130B33640m107l142k959l146k771j992j696j866j710j226j056j045m20O73J259
$$ 233640 229533 226391 223432 220286 217515 215523 213827 211961 210251 209025 207969 206924 206504 207177 208436
56115B08436J182J237J628J783J661J868K373K528K422K785L472L543K977K855
$$ 208436 209618 210855 212483 214266 215927 217795 220168 222696 225118 227903 231375 234918 237895 240750
56101B40750L516M058L969L854M140M355M182M067M295M569M791N262N863O092
$$ 240750 244266 248324 252293 256147 260287 264642 268824 272891 277186 281755 286546 291808 297671 303763
56087C03763O041O315O916P278P473Q163R390J0587J1818J3699J6135J8422K0649
$$ 303763 309804 316119 323035 330313 337786 345949 355339 365926 377744 391443 407578 426000 446649
56074D46649K3548K7006L0215L3284L7131M1673M5754M9048N2368N5848N8553
$$ 446649 470197 497203 527418 560702 597833 639506 685260 734308 786676 842524 901077
56063I01077O0139O1193O1540N9975N6211N1344M5930L9371L1809K4779J9117
$$ 901077 961216 1022409 1083949 1143924 1200135 1251479 1297409 1336780 1368589 1393368 1412485
56052A412485J3779P652J039n435j1852j8059k3084k6424k8847l1186l3534l6165
$$ 1412485 1426264 1433916 1434955 1429520 1417668 1399609 1376525 1350101 1321254 1290068 1256534 1220369
56040A220369l9808m4325m8342n0898n2271n2683n1587m8861m5377m1715l7563
$$ 1220369 1180561 1136236 1087894 1036996 984725 932042 880455 831594 786217 744502 706939
56029G06939l2937k8686k5292k2393j9867j8076j6686j4807j2569j1018j0186
$$ 706939 674002 645316 620024 597631 577764 559688 543002 528195 515626 504608 494422
56018D94422q966p220o045n611m703l018j816j647j424n55J61M64J353K947L794
$$ 494422 485456 478236 472191 466580 461877 458859 457043 455396 453972 453417 453578 454042 455395 458342 462136
56003D62136L322K897L486M234M473M990O145O834O532O400P178P986Q326R129
$$ 462136 465458 468355 471841 476075 480548 485538 491683 498517 505049 511449 518627 526613 534939 544068
55989E44068J0650J1522J1198J1110J2096J2863J2462J1976J2338J2657J2278
$$ 544068 554718 566240 577438 588548 600644 613507 625969 637945 650283 662940 675218
55978F75218J2252J3206J3961J3836J4095J5520J6886J7420J8339K0301K1829
$$ 675218 687470 700676 714637 728473 742568 758088 774974 792394 810733 831034 852863
55967H52863K2063K2515K4241K5881K6372K7045K8938L0695L1308L2244L4636
$$ 852863 874926 897441 921682 947563 973935 1000980 1029918 1060613 1091921 1124165 1158801
55956A158801L7016L8199L9608M2405M5084M6458M8231N1936N6137N9321O2801
$$ 1158801 1195817 1234016 1273624 1316029 1361113 1407571 1455802 1507738 1563875 1623196 1685997
55945A685997O7900P3238P7548Q2326Q8708R4760R8924J03017J08748J14488J18829
$$ 1685997 1753897 1827135 1904683 1987009 2075717 2170477 2269401 2372418 2481166 2595654 2714483
55934B714483J23954J31925J40985J49132J57976J69304J81456J93052K06600
$$ 2714483 2838437 2970362 3111347 3260479 3418455 3587759 3769215 3962267 4168867
55925D168867K24303K44042K63714K85445L10996L37323L61677L86757M15796
$$ 4168867 4393170 4637212 4900926 5186371 5497367 5834690 6196367 6583124 6998920
55916F998920M47093M78918N14991N59255O10264O66859P33941Q15719R08678
$$ 6998920 7446013 7924931 8439922 8999177 9609441 10276300 11010241 11825960 12734638
55907A2734638J008398J117634J240456J375122J520929J684860J872239K078367
$$ 12734638 13743036 14860670 16101126 17476248 18997177 20682037 22554276 24632643
55899B4632643K298693K538586K803534L092072L411521L787136M239009M762395
$$ 24632643 26931336 29469922 32273456 35365528 38777049 42564185 46803194 51565589
55891E1565589N342773N961219O555777P012915P251867P285604P102901O482304
$$ 51565589 56908362 62869581 69425358 76438273 83690140 90975744 98078645 104560949
55883A04560949N051227K647299l95034l391283n749333p255515q004119q180866
$$ 104560949 109612176 112259475 111864441 108473158 102723825 95468310 87464191 79283325
55875G9283325p951995p464139o842887o172501n502268m868823m295444l781639
$$ 79283325 71331330 63867191 57024304 50851803 45349535 40480712 36185268 32403629
55867C2403629l315878k896236k527370k206251j925205j682992j480573j311003
$$ 32403629 29087751 26191515 23664145 21457894 19532689 17849697 16369124 15058121
55859A5058121j164384j038289r33754q45718p66468o94534o31752n75507n21767
$$ 15058121 13893737 12855448 11921694 11075976 10309508 9614974 8983222 8407715 7885948
55850G885948m72082m29992l93763l59544l28483l03848k84074k65119k47140
$$ 7885948 7413866 6983874 6590111 6230567 5902084 5598236 5314162 5049043 4801903
55841D801903k32624k20416k07554j94844j84934j76806j67494j57348j48633
$$ 4801903 4569279 4348863 4141309 3946465 3761531 3584725 3417231 3259883 3111250
55832C111250j40784j31902j23096j16675j11642j05609r9334r5044r1853q7339
$$ 3111250 2970466 2838564 2715468 2598793 2487151 2381542 2282208 2187164 2095311 2007972
55822B007972q2100p8436p5923p2456o8403o5588o3363n9769n5460n2551n0585
$$ 2007972 1925872 1847436 1771513 1699057 1630654 1565066 1501703 1441934 1386474 1333923 1283338
55811A283338m7446m3360m0243l7950l4838l1287k9073k7964k6426k4985k5413
$$ 1283338 1235892 1192532 1152289 1114339 1079501 1048214 1019141 991177 964751 939766 914353
55800I14353k7101k7756k7224k7347k8244k8123k6570k4979k3738k1910j9686
$$ 914353 887252 859496 832272 804925 776681 748558 721988 697009 673271 651361 631675
55789F31675j8304j7589j6123j3861j2047j0675q576n920m143l416k560j527j591
$$ 631675 613371 595782 579659 565798 553751 543076 534500 528580 524437 521021 518461 516934 515343
55776E15343l048m840o484q242r574r531q662q441q920q920q353q277q743q811
$$ 515343 512295 507455 500971 492729 483155 473624 464962 456521 447601 438681 430328 422051 413308 404497
55762D04497q556q994r952j0098r285q812r163r365q827q142p741p339o885o636
$$ 404497 395941 386947 376995 366897 357612 348800 339637 330272 321445 313303 305562 298223 291338 284702
55748B84702o282n364m385m087l966l024j668j123j300j063m03l47r16j064p36
$$ 284702 278420 273056 268671 264584 260618 257594 255926 254803 253503 252440 252037 251690 250774 249710 248974
55733B48974j009k052k795k815k812l014k878k581l016m034m380l769l297l449
$$ 248974 247965 245913 243118 240303 237491 234477 231599 229018 226002 221968 217588 213819 210522 207073
55719B07073l304k289j141n94m29l87p61j554k235k718l499m509m976m679m277
$$ 207073 203769 201480 200339 199745 199316 198929 198168 196614 194379 191661 188162 183653 178677 173998 169721
55704A69721m107l840l458l404l534l130k236j755j952k101j864j778k068k171
$$ 169721 165614 161774 158316 154912 151378 148248 146012 144257 142305 140204 138340 136562 134494 132323
55690A32323j857j632j673j498j075j148j971k790l034l047l203l248l016k860
$$ 132323 130466 128834 127161 125663 124588 123440 121469 118679 115645 112598 109395 106147 103131 100271
55676A00271k948k883k490k119j888j439p68m88q60j329j394j243j220j317j451
$$ 100271 97323 94440 91950 89831 87943 86504 85736 85248 84388 83059 81665 80422 79202 77885 76434
55661G6434j686j897j840j613j507j393r12k23J18L0r1j43l00l58M2N76N81J81
$$ 76434 74748 72851 71011 69398 67891 66498 65586 65363 65481 65511 65420 65277 64977 64619 64661 65237 65818 65999
55643F5999J19M82N89K07j33j12kN0K02L45K23J42O10J278J308P81O33J108J431
$$ 65999 66118 66600 67189 67396 67263 67151 67149 67199 67401 67746 67969 68111 68721 69999 71307 72088 72721 73829 75260
55624G5260J235J122J464J771J608J250R59N50j6m43p23j206j809k056j962k038
$$ 75260 76495 77617 79081 80852 82460 83710 84669 85219 85203 84760 84037 82831 81022 78966 77004 74966
55608G4966k274k149j701j530j574j105j67K02l54q81o32j12J9j9J77L81L38L29
$$ 74966 72692 70543 68842 67312 65738 64633 64466 64668 64314 63433 62801 62689 62708 62689 62866 63247 63585 63914
55590F3914N27N00m0o22p39n39l86l44m61q78j333j259p46o06j163j793j980j997
$$ 63914 64441 64941 64901 64279 63540 63001 62615 62271 61810 60932 59599 58340 57594 56988 55825 54032 52052 50055
55572E0055k115k039j601j215j159j135r96j071j393j389q86n40p71j079r56p00
$$ 50055 47940 45901 44300 43085 41926 40791 39795 38724 37331 35942 35056 34516 33745 32666 31710 31010
55556C1010p00p19m74k39k49j81J79M42L21J90L77N26K87p2k06l09n75p21n32
$$ 31010 30310 29591 29117 28878 28629 28448 28627 29069 29390 29580 29957 30483 30770 30698 30492 30183 29608 28887 28355
55537B8355l03k19%M02M74M9k45OL10K18J71O69J316J475J261J161J195J223J459
$$ 28355 28052 27833 27833 28235 28709 28758 28513 28519 28829 29047 29218 29887 31203 32678 33939 35100 36295 37518 38977
55518C8977K024K465K476K518L043L641L744L598L767M205M563M970N648O208
$$ 38977 41001 43466 45942 48460 51503 55144 58888 62486 66253 70458 75021 79991 85639 91847
55504I1847O162N793N674N669N195M176K934J463l85k234l547m449n451o500p070
$$ 91847 98009 103802 109476 115145 120340 124516 127450 128913 128528 126294 122747 118298 112847 106347 99277
55489I9277p078o968o957o813o385n802n174m526l975l541k968k131j412j224
$$ 99277 92199 85231 78274 71461 65076 59274 54100 49574 45599 42058 39090 36959 35547 34323
55475C4323j395j457j305j124r00n20j59r2k58l96m51m58l22m6Q4r0k86k50j47
$$ 34323 32928 31471 30166 29042 28142 27622 27463 27371 27113 26717 26266 25808 25486 25440 25524 25434 25148 24898 24751
55456B4751j79j82o1j33n84j002r73p09n85m76j85o2m87j085j194q52o21o67o95
$$ 24751 24572 24390 24329 24196 23612 22610 21637 20928 20343 19867 19682 19620 19133 18048 16854 16002 15381 14714 14019
55437A4019o30o70p56o20l33k44l83m69m35m90o70q06q58q97q38n51j44J91M51
$$ 14019 13389 12719 11963 11343 11010 10766 10383 9914 9479 8989 8319 7513 6655 5758 4920 4369 4225 4416 4867
55418D867O36N42P4m20n70m89n13o33o04l71r2J11J32r1l55l14n6n2l46l83M4
$$ 4867 5503 6045 6119 5699 5129 4640 4127 3494 2890 2519 2427 2538 2670 2579 2224 1910 1854 1802 1456 1073 1117
55397A117L42J15j45M3K69K0l08j01L18K16k75m25j63o4k24j77J48K39j09C04
$$ 1117 1459 1574 1429 1472 1741 1761 1453 1352 1670 1886 1611 1186 1023 959 735 558 706 945 836 304
55376d54q65q73o78m22l26k50PK10L8k21n0M34P11P45Q59b39B11A9b63i9B55J
$$ -454 -1319 -2192 -2870 -3292 -3618 -3868 -3861 -3651 -3613 -3834 -3884 -3450 -2739 -1994 -1135 -239 211 19 -263 -99 255 256
55354B56DK7M09M49M24P07J062J029O16J97J7J07L85O51O65L97rm28p43p02k02
$$ 256 4 31 440 889 1313 2020 3082 4111 4727 4924 4941 5048 5433 6084 6749 7146 7137 6709 5966 5264 5062
55333E062L78N35K33j90n28p80q18n56k74k84m07k55J22L71M49N12M29K2l96l99
$$ 5062 5440 5975 6208 6018 5490 4710 3892 3336 3062 2778 2371 2116 2238 2609 3058 3570 3999 4021 3625 3226
55313C226k11l55p17p43m31k92A17f3A65L02p4B8c44m83p43o47j15J60j57m45
$$ 3226 3015 2660 1943 1200 769 477 117 -63 165 467 393 28 -344 -827 -1570 -2217 -2332 -2172 -2329 -2774
55293b774j54L33L92R9j17j67j37N9L71L78j12o09n86k02Nj35l96n64n26j87L15
$$ -2774 -2928 -2595 -2203 -2104 -2221 -2388 -2525 -2466 -2095 -1717 -1829 -2438 -3024 -3226 -3221 -3356 -3752 -4316 -4842 -5029 -4714
55272d714O21N97M97M61K94n7k21N1L93L18r3l79l39j70j00k01l74m06j53K16
$$ -4714 -4093 -3496 -2999 -2538 -2244 -2301 -2522 -2471 -2078 -1760 -1853 -2232 -2571 -2741 -2841 -3042 -3416 -3822 -3975 -3759
55252c759L50J79k1r7j69k47j48J40L50L73L76M24L86L22M48d56fp2l21p2J06
$$ -3759 -3409 -3230 -3251 -3348 -3517 -3764 -3912 -3772 -3422 -3049 -2673 -2249 -1863 -1541 -1093 -456 -6 -78 -399 -471 -365
55231c65k02n22k51L50d35b08j07o0a35C56N33L51J16N3J18n2o09b99j256q77
$$ -365 -567 -1089 -1340 -990 -435 -208 -315 -375 -135 356 889 1240 1356 1409 1527 1475 866 -299 -1555 -2432
55211b432l13K74P76h08M01m12j019j157q98l72K62P33Q45O99M91K51m0j94n1
$$ -2432 -2745 -2471 -1695 -808 -407 -819 -1838 -2995 -3893 -4265 -4003 -3270 -2425 -1726 -1235 -984 -1024 -1218 -1269
55192a269J80J11l06o78o18j44L98O78O40M73a94Bb1k11k18j61k42l59k10J74
$$ -1269 -1089 -978 -1284 -1962 -2580 -2724 -2326 -1648 -1008 -535 -194 2 -21 -232 -450 -611 -853 -1212 -1422 -1248
55172a248L96K47o0k84l72k66J12N16M65q4n59n02j35J03K08M12c83C19M76K34
$$ -1248 -852 -605 -665 -949 -1321 -1587 -1475 -959 -494 -578 -1137 -1639 -1774 -1671 -1463 -1051 -383 319 795 1029
55152A029J76L13N39O56M35j04o33q49G76A08d86n05l28n7K24L33J48j80m04m80
$$ 1029 1205 1518 2057 2713 3148 3044 2411 1562 776 108 -486 -991 -1319 -1376 -1152 -819 -671 -851 -1255 -1735
55132a735m97m25j72R7J29M8K17O19Q12c35J67j21k83l14j28J23J00j80l59l53
$$ -1735 -2232 -2657 -2829 -2732 -2603 -2555 -2338 -1719 -907 -335 -168 -289 -572 -886 -1014 -891 -791 -971 -1330 -1683
55112a683n01q39q83l92K02M71N36N81M00j33o17o48l86j73L0K98L48k9m23l72
$$ -1683 -2184 -3023 -3906 -4298 -4096 -3625 -3089 -2508 -2108 -2241 -2858 -3506 -3892 -4065 -4035 -3737 -3389 -3418 -3841 -4213
55092d213r9j35m33m92j60K27M30M82L77Q3j88j05L33Q02J040R32M53j76m55j34
$$ -4213 -4312 -4447 -4880 -5372 -5532 -5305 -4875 -4393 -4016 -3933 -4121 -4226 -3893 -3091 -2051 -1119 -666 -842 -1297 -1431
55072a431L74M55N9l29l55m3M30C5J050Q32M27J16k3KK58O41P76N04K09K66M61
$$ -1431 -1057 -602 -543 -872 -1227 -1270 -840 35 1085 1917 2344 2460 2437 2439 2697 3338 4114 4618 4827 5093 5554
55051E554L61M3j08n6o5j30l3J54J28n0%L41N88M66J52m7m6O4J38M7j59k41r3
$$ 5554 5915 5958 5850 5794 5729 5599 5566 5720 5848 5798 5798 6139 6727 7193 7345 7298 7252 7316 7454 7501 7342 7101 7008
55028G008J6j82n03n66l42p6J76M83O73M88N5j98j07J22L03M03L31om02n41m19
$$ 7008 7024 6842 6339 5773 5431 5355 5531 6014 6687 7175 7230 7032 6925 7047 7350 7753 8084 8078 7676 7135 6716
55007F716l13l33l67l92m59l90J4N05N81J70k64l79k73j34L1J92K28J99L21N64
$$ 6716 6403 6070 5703 5311 4852 4462 4476 4981 5562 5732 5468 5089 4816 4682 4713 4905 5133 5332 5653 6217
54987F217O00K81j68m96o99q03p07l69O4M49P30Q38O96M26K66K40J77J08L00P76
$$ 6217 6817 7098 6930 6434 5735 4932 4225 3856 3920 4369 5099 5937 6633 7059 7325 7565 7742 7850 8150 8926
54967H926J099Q75K22l87o41n57l11p2N1O3L4K3L9P7J40K35M15O94Q99P87M04
$$ 8926 10025 10900 11122 10735 10094 9537 9226 9154 9205 9268 9302 9325 9364 9441 9581 9816 10231 10925 11824 12611 13015
54946A3015J55K99N81N61J47l84p51p94m46R5L62J14l01m23k94k70l80l41j58
$$ 13015 13170 13469 14050 14611 14758 14374 13623 12829 12383 12478 12840 12954 12653 12230 11936 11666 11286 10945 10787
54927A0787j41l52m33j50K75M59K78r1l25j94J42K03j79m96j98M96Q75P26N02
$$ 10787 10646 10294 9861 9711 9986 10445 10723 10632 10307 10113 10255 10458 10279 9783 9585 10081 10956 11682 12184
54908A2184N35O49O40O02O60P42Q05Q89Q90O81M56N57R04J043Q65P92J070J419
$$ 12184 12719 13368 14008 14610 15270 16012 16817 17706 18596 19277 19733 20290 21194 22237 23102 23894 24964 26383
54890B6383J579J706J979K199K182K143K361K714K910K890K787K652K512K460
$$ 26383 27962 29668 31647 33846 36028 38171 40532 43246 46156 49046 51833 54485 56997 59457
54876E9457K432K132J399M68l56j037j677k233k650l034l450l717l644l305k907
$$ 59457 61889 64021 65420 65888 65532 64495 62818 60585 57935 54901 51451 47734 44090 40785 37878
54861C7878k509k085j726j532j434j312j172j045q28m26M9L73M78M92N77Q12J131
$$ 37878 35369 33284 31558 30026 28592 27280 26108 25063 24235 23809 23858 24231 24709 25201 25778 26590 27721
54844B7721J352J344J266J429J909K433K713K763K760K804K854K795K466J785
$$ 27721 29073 30417 31683 33112 35021 37454 40167 42930 45690 48494 51348 54143 56609 58394
54830E8394R01P9o05j266j941k507k921l229l360l161k757k518k560k553k231
$$ 58394 59295 59374 58769 57503 55562 53055 50134 46905 43545 40384 37627 35109 32549 29996 27765
54815B7765j779j491j325j077p85o62p04o65l90O3N07P52O48K34k14l95k84j38
$$ 27765 25986 24495 23170 22093 21308 20646 19942 19277 18887 18950 19457 20209 20857 21091 20877 20482 20198 20060
54797B0060k03m38n21k05L23N41K03k90l33J44O35P43N46K73m3m54q80j172j259
$$ 20060 19857 19419 18898 18693 19016 19557 19760 19470 19137 19281 19916 20659 21205 21478 21435 20981 20101 18929 17670
54778A7670j143r16p62p54o80l45Rn2m81p48o02m05n20p81q26o35m06j87K6J18
$$ 17670 16527 15611 14849 14095 13415 13070 13079 13027 12546 11798 11196 10791 10271 9490 8664 8029 7623 7436 7462 7580
54758G580O5J61O38J204J328R24M58L60O22R62J157J101P87L42M7J44N68R16Q44
$$ 7580 7645 7806 8444 9648 10976 11900 12358 12718 13340 14302 15459 16560 17347 17689 17736 17880 18448 19364 20208
54739B0208M87L23N60R13J143J453K035K510K363J877J914K770L766M208M159
$$ 20208 20695 21018 21578 22491 23634 25087 27122 29632 31995 33872 35786 38556 42322 46530 50689
54724E0689L995L764L350K907K626K359J840J096L32m00j084j556j700j696j753
$$ 50689 54684 58448 61798 64705 67331 69690 71530 72626 72958 72558 71474 69918 68218 66522 64769
54709F4769j801j704j604j647j630j227n15J20N06Q00J108J308J299J207J276
$$ 64769 62968 61264 59660 58013 56383 55156 54641 54761 55267 56067 57175 58483 59782 60989 62265
54694F2265J671K337L005L393L455L377L241K957K574K313K205J946J328N67l1
$$ 62265 63936 66273 69278 72671 76126 79503 82744 85701 88275 90588 92793 94739 96067 96634 96603
54679I6603m34p17q23p85q96j398k150k911l670m394m775m616m232m012l815l306
$$ 96603 96169 95452 94629 93844 92948 91550 89400 86489 82819 78425 73650 69034 64802 60790 56975 53669
54663E3669k694k532k859l082k831k359k020j772j468j204j135j166j076p89l99
$$ 53669 50975 48443 45584 42502 39671 37312 35292 33520 32052 30848 29713 28547 27471 26682 26283
54648B6283l8J26k1l70o27o21n10n29o82p22m51L8M26M62K51J37K85M92M55J66
$$ 26283 26245 26371 26350 25980 25353 24732 24222 23693 23011 22289 21838 21876 22302 22764 23015 23152 23437 23929 24384 24550
54628B4550j07j42O1L35N05N13M60M62N17O03Q41J309J704J592J042O96R29J357
$$ 24550 24443 24301 24362 24697 25202 25715 26175 26637 27154 27757 28598 29907 31611 33203 34245 34941 35870 37227
54610C7227J471J358J392J559J548J375J336J426J284Q35M54M67P63J056J237
$$ 37227 38698 40056 41448 43007 44555 45930 47266 48692 49976 50811 51265 51732 52495 53551 54788
54595E4788J349J478J752K209K640K796K785K993L561M162M432M392M295M273
$$ 54788 56137 57615 59367 61576 64216 67012 69797 72790 76351 80513 84945 89337 93632 97905
54581I7905M286M287M264M149L807L181K344J423M20q01k255l618m485m840n042
$$ 97905 102191 106478 110742 114891 118698 121879 124223 125646 126066 125265 123010 119392 114907 110067 105025
54566A05025n285n372n127m764m539m335l898l270k703k258j831j443j195j050
$$ 105025 99740 94368 89241 84477 79938 75603 71705 68435 65732 63474 61643 60200 59005 57955
54552E7955r47j038j432j830j771j240p03n05n92p55q59q17o69o77j021j422j430
$$ 57955 57008 55970 54538 52708 50937 49697 48994 48489 47897 47142 46283 45466 44797 44120 43099 41677 40247
54535D0247j110j017j404j825j703j029k97L4j56o35j034j116r64q02o60m13j29
$$ 40247 39137 38120 36716 34891 33188 32159 31862 31896 31740 31105 30071 28955 27991 27189 26529 26116 25987
54518B5987p7l37o59p42n43k31l1q6l37n12m41l06l26l14J13Q95J480J455R64
$$ 25987 25910 25573 24914 24172 23629 23398 23367 23281 22944 22432 21991 21685 21359 21045 21158 22053 23533 24988 25952
54499B5952M15Q7Q3L46N95N53L25K82M84O00M62L51M98O92O22L83L07M98Q19J165
$$ 25952 26367 26454 26537 26883 27478 28031 28356 28638 29122 29722 30184 30535 31033 31725 32347 32730 33037 33535 34354 35519
54479C5519J506J750J812J762J744J839K099K541K965L034K665K177J866J635
$$ 35519 37025 38775 40587 42349 44093 45932 48031 50572 53537 56571 59236 61413 63279 64914
54465F4914J247P09J52m95j330k109k414k223k009k151k509k682k478k044j661
$$ 64914 66161 66870 67022 66527 65197 63088 60674 58451 56442 54291 51782 49100 46622 44578 42917
54450D2917j503j516j481j261j000r53j066r37l16M65P75L97k62o53o46m81l53
$$ 42917 41414 39898 38417 37156 36156 35203 34137 33200 32884 33349 34124 34521 34259 33606 32960 32479 32126
54433C2126k50j11N8K40M33N89O48O51O63N91L09o6k03JK54K72J43J23K59L99
$$ 32126 31876 31765 31823 32063 32496 33085 33733 34384 35047 35638 35947 35881 35678 35679 35933 36205 36348 36471 36730 37129
54413C7129M20L05J16lP5K20J46j43k81p3J92K19J39J63J29j42l43q6L96N00J49
$$ 37129 37549 37854 37970 37967 38042 38262 38408 38265 37984 37911 38103 38322 38461 38624 38753 38611 38268 38182 38578 39078 39227
54392C9227j77k64m24p95j006p87m05k47k87k67j23K2Q7K9j63m03n46n98o84p86
$$ 39227 39050 38786 38362 37567 36561 35774 35369 35122 34835 34568 34445 34467 34554 34583 34420 34017 33471 32873 32189 31403
54372C1403p53o02m99m56l08o8R3K06N18R97J233R71M00j72n84o47j85N45R21
$$ 31403 30650 30048 29549 29093 28785 28717 28810 29016 29534 30531 31764 32735 33135 32963 32379 31732 31547 32092 33013
54353C3013P21M15M54O58O71O30Q55J229J299R56N42L95N44P96R02P53N97Q70
$$ 33013 33734 34149 34603 35261 35932 36562 37417 38646 39945 40901 41443 41838 42382 43178 44080 44833 45430 46300
54335D6300J579K118J946J231M95n2n04p98p75n95o43r84j295j325j120q05m84
$$ 46300 47879 49997 51943 53174 53669 53617 53113 52315 51540 50945 50302 49318 48023 46698 45578 44773 44289
54318D4289l78o70j172j395j113o08k87k42l16l74l44k07j3J33J67J60K05K96
$$ 44289 43911 43241 42069 40674 39561 38953 38666 38424 38108 37734 37390 37183 37170 37303 37470 37630 37835 38131
54300C8131L61L66L34K72J41k8n7K07N87O67L28pQ9M30N14L21L23O84R75Q56N29
$$ 38131 38492 38858 39192 39464 39605 39577 39520 39727 40314 40981 41309 41302 41391 41821 42335 42656 42979 43663 44638 45494 46023
54279D6023K58m8m38n62k08J84N0n01r20j020j025j002q30o68q68j314j415r01
$$ 46023 46281 46233 45795 45233 45025 45209 45259 44758 43838 42818 41793 40791 39961 39293 38425 37111 35696 34795
54261C4795k01Q4j74p04j192j424j341j133j034j026q93o41n22n89n74l22j16
$$ 34795 34594 34678 34504 33800 32608 31184 29843 28710 27676 26650 25757 25116 24594 24005 23431 23109 22993
54244B2993k82p39j114j182j012q14p77r12r42n56J29N53L48j93m66k91m7j65
$$ 22993 22711 21972 20858 19676 18664 17850 17073 16161 15219 14663 14792 15345 15693 15500 15034 14743 14696 14531
54226A4531o76j227j396j004k66L53N28L58J47Nj64l11j88K51O03M34j46n71m93
$$ 14531 13855 12628 11232 10228 9962 10315 10843 11201 11348 11353 11189 10878 10690 10941 11544 11978 11832 11261 10768
54207A0768j28J46K31K54K62K55L52O23Q22O18R0l00l01j28m2J2J76L57L71K47
$$ 10768 10640 10786 11017 11271 11533 11788 12140 12763 13585 14203 14293 13993 13692 13564 13522 13534 13710 14067 14438 14685
54187A4685J17kj79l66m79n32n46m05o0K99M25L35J94M4j88m37m99l02L7L36M64
$$ 14685 14802 14800 14621 14255 13776 13244 12698 12293 12233 12532 12957 13292 13486 13530 13342 12905 12406 12104 12141 12477 12941
54166A2941L44N7j23l3J40Q5k02m19m01k90k75l57m34m62m30l39k07p5O0J76J69
$$ 12941 13285 13342 13219 13186 13326 13411 13209 12790 12389 12099 11824 11467 11033 10571 10141 9802 9595 9520 9580 9756 9925
54145I925l1k92l99l42l19m75o90p13m13P2M04L13o4k76m7L30L58l6m38m94k98
$$ 9925 9894 9602 9203 8861 8542 8067 7377 6664 6251 6323 6727 7040 6976 6700 6653 6983 7341 7305 6867 6373 6075
54124F075j41j03n0Q5J69P5r5o4K95P20P96M37k6k56k91l32l56k24j7k4k98n17
$$ 6075 5934 5831 5781 5866 6035 6110 6015 5951 6246 6966 7762 8199 8173 7917 7626 7294 6938 6714 6697 6673 6375 5858
54102E858l18K63Q12R43O21J63j03j58k14l47l54l3M92Q74R06O70M15L08K65J7
$$ 5858 5540 5803 6615 7558 8179 8342 8239 8081 7867 7520 7166 7133 7625 8499 9405 10075 10490 10798 11063 11080
54082A1080m90q77p15j67J38j3j45J59N94O61M32L26L73K68j2j38J2K48M36N50
$$ 11080 10590 9713 8998 8831 8969 8956 8811 8970 9564 10225 10657 10983 11356 11624 11612 11474 11486 11734 12170 12720
54062A2720M11j57q41j076p89m80m22l40n7J44N1l5J68L97K43j53k99j01O6l0
$$ 12720 13131 12974 12133 11057 10268 9788 9366 9026 8969 9113 9164 9129 9297 9694 9937 9784 9485 9384 9450 9420
54042I420j77q2J99L60K15n9p4L28P94P99K78k11j30M19Q42P35K40j87k50n1P1
$$ 9420 9243 9161 9360 9720 9935 9876 9802 10130 10924 11723 12001 11790 11660 12079 12921 13656 13896 13709 13459 13408 13479
54021A3479n0j80J4M84P59N07p6n02m99j98M5k2l14m31q1N04P62M85N6n7J71M79
$$ 13479 13429 13249 13263 13747 14506 15013 14937 14435 13936 13738 13783 13761 13447 13016 12935 13439 14201 14686 14742 14685 14856 15335
53999A5335P12Q42P89N43L13L30M94M71J43k23k97k4L46N18M05K12K31N22Q37
$$ 15335 16047 16889 17678 18221 18534 18864 19358 19829 19972 19749 19452 19428 19774 20292 20697 20909 21140 21662 22499
53980B2499R15P32M51K10Q2R8K37M45P08J045J350J410J200J002J103J471J875
$$ 22499 23414 24146 24597 24807 24889 24987 25224 25669 26377 27422 28772 30182 31382 32384 33487 34958 36833
53963C6833K177K328K250J917J547J407J478J507J405J346J414J358R20K43k60
$$ 36833 39010 41338 43588 45505 47052 48459 49937 51444 52849 54195 55609 56967 57887 58130 57870
53948E7870l61j90J3J38J51ol14o03p52r07j313j847k025j613j023q65j190j471
$$ 57870 57509 57319 57332 57470 57621 57615 57301 56698 55946 55039 53726 51879 49854 48241 47218 46353 45163 43692
53930D3692j336j009r10j057j067p08k20l7l24p96j003p73l12N3J54l4m61r22
$$ 43692 42356 41347 40437 39380 38313 37605 37385 37348 37024 36228 35225 34452 34140 34193 34347 34313 33852 32930
53912C2930j037o37o2J62m3k79k28nJ56K12J77k6l52n08k95P7K65K77L79O42Q40
$$ 32930 31893 31256 31194 31356 31313 31034 30806 30801 30957 31169 31346 31320 30968 30460 30165 30242 30507 30784 31163 31805 32645
53891C2645Q34P60P83Q68R27R99J131J160Q76L77J19M06R63J230J059Q90J081
$$ 32645 33479 34239 35022 35890 36817 37816 38947 40107 40983 41360 41479 41885 42848 44078 45137 46027 47108
53874D7108J366J265Q46O64R34J226J140R05R50J186J148P18L13K53L19J44k03
$$ 47108 48474 49739 50585 51249 52183 53409 54549 55454 56404 57590 58738 59456 59769 60022 60341 60485 60282
53857F0282l05P2P25J293J622J748J737J646J608J744K002K171K098J848J610
$$ 60282 59977 60049 60774 62067 63689 65437 67174 68820 70428 72172 74174 76345 78443 80291 81901
53842H1901J498J486J488J462J421J390J276R06K88k23k57P3K31p5n63q15q00
$$ 81901 83399 84885 86373 87835 89256 90646 91922 92828 93116 92893 92636 92709 92940 92865 92302 91487 90687
53825I0687p54q07r69j306j772k080k010j762j675j744j727j601j573j688j812
$$ 90687 89933 89126 88157 86851 85079 82999 80989 79227 77552 75808 74081 72480 70907 69219 67407
53810F7407j958k197k275j831j034n58p70j342j763j874j740j425j101j047j267
$$ 67407 65449 63252 60977 59146 58112 57554 56784 55442 53679 51805 50065 48640 47539 46492 45225
53795D5225j371j092o53m57o11r22j137j049o47k48k21m86o17n08n13p90r77p95
$$ 45225 43854 42762 42109 41652 41041 40119 38982 37933 37286 37038 36817 36331 35714 35206 34693 33903 32926 32131
53777C2131n36n45o42m73j30M5Pl8n3j03p1J66M49N38N16N61N56K83j04k31l6
$$ 32131 31595 31050 30408 29935 29805 29850 29857 29819 29766 29663 29592 29758 30207 30745 31261 31822 32378 32661 32557 32326 32290
53756C2290K42M33M78K39k41m72k4P63J093P95N13P59J250J441J239R58Q52R74
$$ 32290 32532 32965 33443 33682 33441 32969 32945 33708 34801 35596 36109 36868 38118 39559 40798 41756 42608 43582
53738D3582J252J518J613J587J600J616J454J200J253J781K395K576K233J680
$$ 43582 44834 46352 47965 49552 51152 52768 54222 55422 56675 58456 60851 63427 65660 67340
53724F7340J208Q58N39K32L3O6K86M68M22K04k2k42n46r21j261j501j550j209
$$ 67340 68548 69406 69945 70177 70210 70276 70562 71030 71452 71656 71634 71392 70846 69925 68664 67163 65613 64404
53706F4404m67J95J70n62j353j634j422j072p88o12n76o83q21q67p79n55k07J51
$$ 64404 63937 64132 64302 63740 62387 60753 59331 58259 57471 56859 56283 55600 54779 53912 53133 52578 52371 52522
53688E2522L59L74K63Jm91j097j473j400j005n86l49l32m30m29k44q2j65l62l44
$$ 52522 52881 53255 53518 53519 53028 51931 50458 49058 48053 47467 47118 46786 46356 45927 45683 45601 45436 45074 44730
53669D4730j06J8j03k35k62m02p29q56m92N7K76J85K37N69P95N65J7m32n09k47
$$ 44730 44624 44642 44539 44304 44042 43640 42911 42055 41563 41620 41896 42081 42318 42887 43682 44247 44264 43832 43323 43076
53649D3076J16L24K89J84K48N11Q11J050J262J452J470J224Q98Q14J025J167Q48
$$ 43076 43192 43516 43805 43989 44237 44748 45559 46609 47871 49323 50793 52017 52915 53729 54754 55921 56769
53632E6769J91k04J04Q90J569J828J771J555J249J014J085J388J506J171O31L06
$$ 56769 56960 56756 56860 57750 59319 61147 62918 64473 65722 66736 67821 69209 70715 71886 72517 72823
53616G2823L20N26P79R03O77J15l45k73J74N07N71O45Q59R36O34J21k77m68n24
$$ 72823 73143 73669 74448 75351 76028 76143 75798 75525 75699 76206 76777 77422 78281 79217 79851 79972 79695 79227 78703
53597G8703m32j88K0l5k82m34l53j56N7L20N67N50J79k40l39j77j45l84n93n23
$$ 78703 78271 78083 78103 78068 77786 77352 76999 76843 76900 77220 77787 78337 78516 78276 77937 77760 77615 77231 76638 76115
53577G6115l45l32l60j15L37N54L12p1j68O8M01O51P42O34L78J93K23L75M93N88
$$ 76115 75770 75438 75078 74963 75300 75854 76166 76095 75927 75995 76396 77047 77789 78423 78801 78994 79217 79592 80085 80673
53557H0673P07P29O02O41J189K031K498K292J851J707J854J962J919J821J649
$$ 80673 81380 82109 82711 83352 84541 86572 89070 91362 93213 94920 96774 98736 100655 102476 104125
53542A04125J341J101J226J628J887J821J678J688J780J863K052K381K602K487
$$ 104125 105466 106567 107793 109421 111308 113129 114807 116495 118275 120138 122190 124571 127173 129660
53528A29660K149J807J457J066Q85J145J581J680J373J080J040J011P57M67L97
$$ 129660 131809 133616 135073 136139 137024 138169 139750 141430 142803 143883 144923 145934 146691 147158 147555
53513A47555M33L16R2O1L13N91O02L12n8k31j14J19K15J21k3j44l40o34q26p32
$$ 147555 147988 148304 148396 148457 148770 149361 149963 150275 150217 149986 149872 149991 150206 150327 150304 150160 149820 149186 148360 147628
53493A47628m01l1K08J82j50n65o46k38L25O09N74M76M34L61K39K14M01P94J280
$$ 147628 147227 147196 147404 147586 147436 146871 146225 145987 146312 146921 147495 147971 148405 148766 149005 149219 149620 150414 151694
53474A51694J695J859J804J791K026K356K511K486K515K695K887K985L062L217
$$ 151694 153389 155248 157052 158843 160869 163225 165736 168222 170737 173432 176319 179304 182366 185583
53460A85583L435L626L757L912M300N083O127P000P394P417P397P508P735Q068
$$ 185583 189018 192644 196401 200313 204613 209696 215823 222823 230217 237634 245031 252539 260274 268342
53446B68342Q460Q739Q838R010R563J0411J1158J1593J1868J2162J2432J2568
$$ 268342 276802 285541 294379 303389 312952 323363 334521 346114 357982 370144 382576 395144
53434C95144J2587J2622J2800J3167J3653J4084J4371J4570J4698J4621J4249
$$ 395144 407731 420353 433153 446320 459973 474057 488428 502998 517696 532317 546566
53423E46566J3764J3454J3448J3706J4144J4588J4798J4707J4525J4391J4154
$$ 546566 560330 573784 587232 600938 615082 629670 644468 659175 673700 688091 702245
53412G02245J3702J3224J2846J2246J1125R818Q960Q648Q404P911P245O440N401
$$ 702245 715947 729171 742017 754263 765388 775206 784166 792814 801218 809129 816374 822814 828215
53399H28215M310L591L331L171K896K633K329J555J20j527k805l612m275n111
$$ 828215 832525 836116 839447 842618 845514 848147 850476 852031 852151 850624 847819 844207 839932 834821
53385H34821o262p659q964r797j0198j0607j1260j1935j2329j2453j2441j2379
$$ 834821 828559 820900 811936 802139 791941 781334 770074 758139 745810 733357 720916 708537
53373G08537j2380j2554j2773j2745j2458j2181j1988j1688j1274j0968j0647
$$ 708537 696157 683603 670830 658085 645627 633446 621458 609770 598496 587528 576881
53362E76881r844q533p353o711o202n352m328l441k465j098L23J246J817K662
$$ 576881 567037 558504 551151 544440 538238 532886 528558 525117 522652 521554 521877 523123 524940 527602
53348E27602L954N309O551P842R154J0190J0930J1725J2695J3560J4194J4909
$$ 527602 531556 536865 543416 551258 560412 570602 581532 593257 605952 619512 633706 648615
53336F48615J5966J7179J8200J8951J9578K0236K1049K2108K3322K4411K5172
$$ 648615 664581 681760 699960 718911 738489 758725 779774 801882 825204 849615 874787
53325H74787K5748K6449K7450K8602K9608L0315L0866L1437L1921L2043L1875
$$ 874787 900535 926984 954434 983036 1012644 1042959 1073825 1105262 1137183 1169226 1201101
53314A201101L1849L2144L2386L2150L1526L0821K9975K8684K6915K4955K2997
$$ 1201101 1232950 1265094 1297480 1329630 1361156 1391977 1421952 1450636 1477551 1502506 1525503
53303A525503K1093J9378J7949J6538J4701J2394J0014P868N946M203K674J176
$$ 1525503 1546596 1565974 1583923 1600461 1615162 1627556 1637570 1645438 1651384 1655587 1658261 1659437
53291A659437p24l219o022q788j1545j4529j7759k0966k3928k6677k9291l1603
$$ 1659437 1658713 1655494 1649472 1640684 1629139 1614610 1596851 1575885 1551957 1525280 1495989 1464386
53279A464386l3202l3905l4101l4454l5136l5642l5453l4715l3927l3309l2762
$$ 1464386 1431184 1397279 1363178 1328724 1293588 1257946 1222493 1187778 1153851 1120542 1087780
53268A087780l2306l2051l1836l1309l0465k9656k9048k8337k7213k5778k4338
$$ 1087780 1055474 1023423 991587 960278 929813 900157 871109 842772 815559 789781 765443
53257G65443k2962k1473j9757j7903j6115j4574j3340j2320j1344j0257q970p533
$$ 765443 742481 721008 701251 683348 667233 652659 639319 626999 615655 605398 596428 588895
53245E88895o153n045m147l210k215j434r28l21O27J577K092K384K991L907M618
$$ 588895 582742 577697 573550 570340 568125 566691 565763 565442 566069 567646 569738 572122 575113 579020 583638
53230E83638M987N484O409P431Q138Q632R219R907J0512J1062J1732J2529J3296
$$ 583638 588625 594109 600518 607949 616087 624719 633938 643845 654357 665419 677151 689680 702976
53217G02976J3896J4253J4316J4160J4007J3942J3764J3245J2502J1834J1371
$$ 702976 716872 731125 745441 759601 773608 787550 801314 814559 827061 838895 850266
53206H50266J0967J0483R903R247Q482P588O665N858N169M396L354K104Q59l41
$$ 850266 861233 871716 881619 890866 899348 906936 913601 919459 924628 929024 932378 934482 935341 935000
53192I35000j700l320m995o510p933r411j0870j2145j3349j4739j6286j7665j8694
$$ 935000 933300 929980 924985 918475 910542 901131 890261 878116 864767 850028 833742 816077 797383
53179G97383j9476k0113k0549k0736k0741k0605k0279j9766j9125j8378j7591
$$ 797383 777907 757794 737245 716509 695768 675163 654884 635118 615993 597615 580024
53168E80024j7000j6795j6807j6659j6237j5776j5482j5355j5360j5431j5320
$$ 580024 563024 546229 529422 512763 496526 480750 465268 449913 434553 419122 403802
53157D03802j4759j3903j3219j2841j2384j1524j0448r506q765q137p660p354
$$ 403802 389043 375140 361921 349080 336696 325172 314724 305218 296453 288316 280656 273302
53145B73302p026o482n847n404n232n184n132n051m912m694m459m299m264m371
$$ 273302 266276 259794 253947 248543 243311 238127 232995 227944 223032 218338 213879 209580 205316 200945
53131B00945m599m808m752m333l740l268l104l291l716m116m226m033l806l768
$$ 200945 196346 191538 186786 182453 178713 175445 172341 169050 165334 161218 156992 152959 149153 145385
53117A45385l843l793l476k979k555k406k458k398k094j858k015k385k481k182
$$ 145385 141542 137749 134273 131294 128739 126333 123875 121477 119383 117525 115510 113125 110644 108462
53103A08462j837j684j594j469j461j618j695j561j451j547j628j429j096r58
$$ 108462 106625 104941 103347 101878 100417 98799 97104 95543 94092 92545 90917 89488 88392 87434
53089H7434j078j263j394j385j075m36J61K71j04n23o69o83q11j015j005o62k87
$$ 87434 86356 85093 83699 82314 81239 80803 80964 81235 81131 80608 79939 79256 78445 77430 76425 75763 75476
53072G5476l11p65j135r48l53P9P7j02j81j96k32j92l2O9m5k71m53n90o53m69
$$ 75476 75165 74400 73265 72317 71964 72043 72120 72018 71837 71641 71409 71217 71185 71254 71209 70938 70485 69895 69242 68773
53052F8773l2L09K44r0l02k19L7K69L44K36J07J54L18L63L39N67J029J186P25
$$ 68773 68741 69050 69294 69204 68902 68683 68720 68989 69333 69569 69676 69830 70148 70511 70850 71417 72446 73632 74357
53033G4357J02j02mj18m93o74m40q0Q7L2j24k61k51r9p3l51p06q14p49q47j114
$$ 74357 74459 74357 74353 74235 73742 73068 72628 72548 72635 72667 72543 72282 72031 71932 71859 71508 70802 69988 69239 68392 67278
53012F7278j253j187j133j137j004p66p58j096j455j556j518j547j580j435j084
$$ 67278 66025 64838 63705 62568 61564 60798 60040 58944 57489 55933 54415 52868 51288 49853 48769
52997D8769o02p2L30L69Q0j70j19Q7J50K6j53l85p48j123j208q85m13k06m05p66
$$ 48769 48167 48095 48425 48794 48874 48704 48585 48672 48822 48848 48695 48310 47562 46439 45231 44346 43933 43727 43322 42556
52977D2556r00o92l54j53j65l09m81n90n20l09j97l64o90r28j034j102j078q18
$$ 42556 41656 40964 40610 40457 40292 39983 39502 38912 38392 38083 37886 37522 36832 35904 34870 33768 32690 31872
52959C1872m26k22l12m36l80k55k63l73m13l57l54m81o20n91l69j28o7j97l33
$$ 31872 31446 31224 30912 30476 30096 29841 29578 29205 28792 28435 28081 27600 26980 26389 26020 25892 25825 25628 25295
52940B5295l30j79J21N92J066J178P75K12n1k3j9j10p7O3Kl02m35j19L19L64%
$$ 25295 24965 24786 24907 25499 26565 27743 28518 28730 28679 28656 28637 28527 28450 28513 28515 28213 27778 27659 27978 28342 28342
52919B8342l44l65j72m6j13k86l37q3L98P64P44M61K47K54L04K09M6P4L70P34
$$ 28342 27998 27633 27461 27415 27302 27016 26679 26596 26994 27758 28502 28963 29210 29464 29768 29977 30023 30097 30467 31201
52899C1201R13Q97Q56Q46P73O79Q14J216J433J018K30j39L10J133J646J658J423
$$ 31201 32114 33011 33867 34713 35486 36165 36979 38195 39628 40646 40876 40737 41047 42180 43826 45484 46907
52882D6907J173R70Q87R41R57P28L61K18M44P68Q22N58K21j0k00m90q76j221j422
$$ 46907 48080 49050 49937 50878 51835 52563 52924 53142 53586 54354 55176 55734 55955 55945 55745 55255 54379 53158 51736
52863E1736j491j431j228r48p82q11q33o03k18l3k18n51p22o71m98k76p1m7k81
$$ 51736 50245 48814 47586 46638 45856 45045 44212 43609 43391 43358 43140 42589 41867 41196 40698 40422 40351 40304 40023
52844D0023n89o87n45m01m09m63l98k25n8P5K02K86K52J43P7Q1K2j66l51l57j92
$$ 40023 39434 38747 38202 37801 37392 36929 36531 36306 36248 36323 36525 36811 37063 37206 37283 37364 37386 37220 36869 36512 36320
52823C6320LJ36K48L72M48M25L39K77K82L31L80L86L34K20J2k55m10k45J74M88
$$ 36320 36323 36459 36707 37079 37527 37952 38291 38568 38850 39181 39561 39947 40281 40501 40513 40258 39848 39603 39777 40265
52803D0265M48K28J29J63J45J09K02K90P1l38m39n3L76M48L48M40O91P93O73N15
$$ 40265 40713 40941 41070 41233 41378 41487 41689 41979 42050 41712 41273 41220 41596 42044 42392 42832 43523 44316 44989 45504
52783D5504M90O94J139J503J265M34j77R4P81Q96L14j12J39N72N41J95J40N21
$$ 45504 45994 46688 47827 49330 50595 51029 50852 50946 51727 52623 52937 52825 52964 53536 54077 54272 54412 54933
52765E4933R05Q89N15J08q3n3K5Qn9p9p6j27j87j38kR9J03Jk71o72r27q54p18
$$ 54933 55838 56727 57242 57350 57267 57214 57239 57247 57188 57109 57033 56906 56719 56581 56579 56678 56781 56782 56511 55839 54912 54058 53340
52742E3340r13j348j514j234r02q91j101j235j215j127r92q34p16o35m84k78j74
$$ 53340 52427 51079 49565 48331 47429 46538 45437 44202 42987 41860 40868 40034 39318 38683 38199 37921 37747
52725C7747k06k43k29k73m03n15o00p43q38o53k50j0r3j93l8K09K60Q8j82m65
$$ 37747 37541 37298 37069 36796 36393 35878 35278 34535 33697 33044 32794 32784 32691 32498 32460 32669 32929 33017 32835 32370
52705C2370o17m81k61m53j103j487j014j05L23M3l63m18k85k77l89m41l92l43
$$ 32370 31753 31272 31011 30558 29455 27968 26954 26849 27172 27215 26852 26434 26149 25872 25483 25042 24650 24307
52687B4307l93n70p50o76k44K71M41K11p6j21%M6j00l75o48p75o73l84m9K02L09
$$ 24307 23914 23344 22594 21918 21674 21945 22386 22597 22521 22400 22400 22446 22346 21971 21323 20548 19875 19491 19442 19644 19953
52666A9953K66J08r3k81l80k44K05P18Q14K98m51q54p34l61l1J37Q7j70m71n93
$$ 19953 20219 20327 20234 19953 19573 19329 19534 20252 21066 21364 20913 20059 19325 18964 18933 19070 19157 18987 18516 17923
52646A7923n03l64k78j63O2L60O20P69P45M94O9l21m17j35L42P09Q22P83P14N33
$$ 17923 17420 17056 16778 16615 16677 17037 17657 18426 19171 19665 19734 19413 18996 18861 19203 19912 20734 21517 22231 22764
52626B2764J50k28k43J30N16O40O39P24Q16P54O22O02O64O79O87P84Q64P57N59
$$ 22764 22914 22686 22443 22573 23089 23729 24368 25092 25908 26662 27284 27886 28550 29229 29916 30700 31564 32321 32880
52607C2880N09N99N76L17n5l99o39o72m70k41k45m01l79j34n4m06r35j185j019
$$ 32880 33389 33988 34564 34881 34826 34427 33788 33116 32646 32405 32160 31759 31380 31246 31192 30786 29851 28666 27647
52588B7647o59l67k38k40k75k51k59n12j010j376j238p21l21k50j69K89R67J351
$$ 27647 26988 26621 26383 26143 25868 25617 25358 24846 23836 22460 21222 20501 20180 19930 19761 20050 21017 22368
52570B2368J224Q33M73J83m1o8R3J36j49m81m38j14Nk46n17n60n79p45p90m14
$$ 22368 23592 24425 24898 25081 25040 24972 25065 25201 25052 24571 24133 24019 24024 23778 23261 22701 22122 21377 20587 20173
52550B0173J78N14M89L96M69O08O30N11L81L15K41K6l04m70k53J49L41K68K22
$$ 20173 20351 20865 21354 21750 22219 22827 23457 23968 24349 24664 24905 24931 24627 24157 23904 24053 24394 24662 24884
52531B4884K85K10l9p8K53M88K04k71l00J71O40P76O54M16J66J23M12P36O72K80
$$ 24884 25169 25379 25340 25262 25515 26003 26207 25936 25636 25807 26447 27223 27877 28293 28459 28582 28994 29730 30402 30682
52511C0682m5j76l21m87m31j68j3m9OK55M40M21M21N80O63M70J87J14K69M66N34
$$ 30682 30637 30461 30140 29653 29222 29054 29041 28992 28998 29253 29693 30114 30535 31115 31778 32248 32435 32549 32818 33284 33818
52490C3818L62k9l32j92K37M00P0l37m19l33l76l85m6M73O45K73k63m79k30K64
$$ 33818 34180 34151 33819 33627 33864 34264 34334 33997 33578 33245 32869 32484 32438 32911 33556 33829 33566 33087 32857 33121
52470C3121O70P41N30L31L81O06P77Q02P58P11O61N55L30l2l94n47m36j74J47
$$ 33121 33791 34532 35062 35393 35774 36380 37157 37959 38717 39428 40089 40644 40974 40942 40548 40001 39565 39391 39538
52451C9538M76O31M01p0l40k25l3n9j51n8R0k0l48n33m01q8K74O28Q31O96K85
$$ 39538 40014 40645 41046 40976 40636 40411 40378 40319 40168 40110 40200 40180 39832 39299 38898 38810 39084 39712 40543 41239 41524
52430D1524q5k02j36n0LL1N6J57M31P89R56P46L12K0P2K78K78l6l82m42k43m3
$$ 41524 41439 41237 41101 41051 41054 41085 41141 41298 41729 42518 43474 44220 44532 44552 44624 44902 45180 45144 44762 44320 44077 44034
52408D4034P9K51M69N13L43K24L04L57J56j21k15k16l24m21k64KJk26k48Q3L79
$$ 44034 44113 44364 44833 45346 45689 45913 46217 46574 46730 46609 46394 46178 45854 45433 45169 45171 45172 44946 44698 44781 45160
52387D5160L47J79J32Q5j86n20n52k57P8K82M38N94N93L02j70n78p42o45m31l12
$$ 45160 45507 45686 45818 45903 45717 45197 44645 44388 44466 44748 45186 45780 46373 46675 46505 45927 45185 44540 44109 43797
52367D3797l67l95j32L58O92O00K44k6r2r5j56k31k46j87m0K03M50N80O13O86
$$ 43797 43430 43035 42903 43261 43953 44553 44797 44771 44679 44584 44428 44197 43951 43764 43724 43927 44377 44957 45570 46256
52347D6256P97P60M62M0k83l99l01l4K13J97k2p3K17N09L99J6j91r8P6K12L69
$$ 46256 47053 47813 48275 48315 48032 47633 47332 47298 47511 47708 47686 47613 47830 48339 48738 48754 48563 48465 48541 48753 49122
52326D9122M30J63k55l06J48N98O08L47J47k4k87l76J5O61R99Q54N41L42K48K03
$$ 49122 49552 49715 49460 49154 49302 49900 50508 50855 51002 50978 50691 50315 50330 50991 51990 52844 53385 53727 53975 54178
52306E4178K42K91J66j26l50l11o2K62N19N72M04K65M26P71Q93O50L62L13L80
$$ 54178 54420 54711 54877 54751 54401 54090 54028 54290 54809 55381 55785 56050 56476 57247 58140 58790 59152 59465 59845
52287E9845L14J84K37N11P77Q86Q82Q30O54L38O6P5L44N52M01k3k84k8O24J182
$$ 59845 60159 60343 60580 61091 61868 62754 63636 64466 65120 65458 65524 65599 65943 66495 66896 66873 66589 66561 67185 68367
52267F8367J293J030P55O83P26P00N81M64L96L42L24M68P95J088J114Q92O52N47
$$ 68367 69660 70690 71445 72128 72854 73554 74135 74599 74995 75337 75661 76129 76924 78012 79126 80018 80670 81217
52249H1217N70O50P29P45P30Q64J246J641J716J509J399J547J688J607J469J493
$$ 81217 81787 82437 83166 83911 84641 85505 86751 88392 90108 91617 93016 94563 96251 97858 99327 100820
52233A00820J605J662J757J987K153K053J913K106K542K740K491K104J947K033
$$ 100820 102425 104087 105844 107831 109984 112037 113950 116056 118598 121338 123829 125933 127880 129913
52219A29913K185K311K393K394K319K226K154K124K202K393K523K420K225K287
$$ 129913 132098 134409 136802 139196 141515 143741 145895 148019 150221 152614 155137 157557 159782 162069
52205A62069K730L290L600L469K913K171J676J728K097K252J985J642J542J581
$$ 162069 164799 168089 171689 175158 178071 180242 181918 183646 185743 187995 189980 191622 193164 194745
52191A94745J459J123P37M48L46M49O34P13P53J029J511J724J383Q94Q23J061
$$ 194745 196204 197327 198064 198512 198858 199307 199941 200654 201407 202436 203947 205671 207054 207948 208771 209832
52175B09832J028N90K64L97O62O33M71O56J260J839K080K155K428K992L621L986
$$ 209832 210860 211450 211714 212111 212773 213406 213877 214533 215793 217632 219712 221867 224295 227287 230908 234894
52159B34894L882L351K758K513K670K800K489J875J513J703K147K305J937J237
$$ 234894 238776 242127 244885 247398 250068 252868 255357 257232 258745 260448 262595 264900 266837 268074
52145B68074O09L62N05P48P64N67M47N05M66R5m51q85j159j347j370j184j077
$$ 268074 268683 269045 269550 270298 271062 271629 272076 272581 273047 273142 272691 271806 270647 269300 267930 266746 265669
52128B65669j305j599j481j081j060j624k146k052j579j324j389j445j351j239
$$ 265669 264364 262765 261284 260203 259143 257519 255373 253321 251742 250418 249029 247584 246233 244994
52114B44994j155j014q81q89r51q73p30p90j027j116r31p25p34q87j053j282j601
$$ 244994 243839 242825 241944 241055 240104 239231 238501 237711 236684 235568 234637 233912 233178 232291 231238 229956 228355
52097B28355j825j762j484j205j011r03r13j083j309j415j345j188j059j019j054
$$ 228355 226530 224768 223284 222079 221068 220165 219252 218169 216860 215445 214100 212912 211853 210834 209780
52082B09780j027p85m06j87l60p62j032j034r64j023j151j175j081j016j068j150
$$ 209780 208753 207968 207562 207375 207015 206253 205221 204187 203223 202200 201049 199874 198793 197777 196709 195559
52066A95559j121r47p52o75p45q35p81n56l36l51o08q33p72m94l04l39m53n35
$$ 195559 194438 193491 192739 192064 191319 190484 189703 189147 188811 188460 187852 187019 186247 185753 185449 185110 184657 184122
52048A84122o96r47r43l71M60Q53O32M10P52J412J732J567J363J455J702J861
$$ 184122 183426 182479 181536 181165 181625 182478 183110 183520 184272 185684 187416 188983 190346 191801 193503 195364
52032A95364J950K040K064K052K237K725L207L311L113L058L385L876M171M150
$$ 195364 197314 199354 201418 203470 205707 208432 211639 214950 218063 221121 224506 228382 232553 236703
52018B36703L922L692L660L909M298M506M306L752L121K734K760L078L301L088
$$ 236703 240625 244317 247977 251886 256184 260690 264996 268748 271869 274603 277363 280441 283742 286830
52004B86830K508J961J720J694J655J552J427J237R03M88J18k20n91q70q06m53
$$ 286830 289338 291299 293019 294713 296368 297920 299347 300584 301487 301975 302093 301873 301282 300412 299606 299153
51988B99153k91p22j516j968j678j000o37q88j388j590j367j087j161j636k166
$$ 299153 298862 298140 296624 294656 292978 291978 291341 290453 289065 287475 286108 285021 283860 282224 280058
51973B80058k321j939j236o28l73l99m73m81m58l94j78K46O89Q50N81M7l99m77
$$ 280058 277737 275798 274562 273934 273561 273162 272689 272208 271750 271356 271178 271424 272113 272963 273544 273591 273192 272715
51955B72715k43l6r9k68j74K52O23N42N0m79p93r91j294j751k202k457k508k525
$$ 272715 272472 272436 272337 272069 271895 272147 272770 273312 273362 272883 272090 271099 269805 268054 265852 263395 260887 258362
51937B58362k670k916l086l092l052l148l486m040m648n068n205n287n615o093
$$ 258362 255692 252776 249690 246598 243546 240398 236912 232872 228224 223156 217951 212664 207049 200956
51923B00956o249n869n324n084n128n122m953m782m674m571m574m889n364n514
$$ 200956 194707 188838 183514 178430 173302 168180 163227 158445 153771 149200 144626 139737 134373 128859
51909A28859n092m375l746l272k871k604k549k582k536k468k492k496k290j967
$$ 128859 123767 119392 115646 112374 109503 106899 104350 101768 99232 96764 94272 91776 89486 87519
51895H7519j844j990k085j821j316r42r18j131j333j386j294j130r54q39q63r91
$$ 87519 85675 83685 81600 79779 78463 77521 76603 75472 74139 72753 71459 70329 69375 68536 67673 66682
51879F6682j013p51l37j61m14q64j178j304j357j246p91j60J20j73o37p55n45
$$ 66682 65669 64918 64581 64420 64006 63142 61964 60660 59303 58057 57266 57106 57226 57053 56416 55661 55116
51862E5116l74l23j18K91M94J65m60q41p66m97l83n01o43n36j46K25K27q1k69
$$ 55116 54742 54419 54301 54592 55086 55251 54791 53950 53184 52687 52304 51803 51160 50624 50478 50703 50930 50849 50580
51843E0580j75j62n34r63r07m58k13m09o59o54n39m65k83O1K65J53K5J46K98K28
$$ 50580 50405 50243 49709 48746 47839 47381 47168 46759 46100 45446 44907 44442 44159 44220 44485 44638 44663 44809 45107 45335
51823D5335J70M05O39M00j08k61J6J67n2k33o1K02K78L50O18Q48P06L10J5p3q2
$$ 45335 45505 45910 46549 46949 46841 46580 46596 46763 46711 46478 46417 46619 46897 47247 47865 48713 49419 49729 49744 49671 49589
51802D9589m2J09L08M23M32L52J48j30k75j91p4j22k33k09l6J70L71M78K83k12
$$ 49589 49547 49656 49964 50387 50819 51171 51319 51189 50914 50723 50649 50527 50294 50085 50049 50219 50590 51068 51351 51139
51782E1139n64l58K08N65N16L44K79K13O5pJ30L28L84L19K76L12L50K79L7k87
$$ 51139 50575 50217 50425 50990 51506 51850 52129 52342 52407 52400 52530 52858 53242 53561 53837 54149 54499 54778 54815 54528
51762E4528m22j73K78N38N03M66O16O91L80j33l39o9K93L32J43J08L47N80N32
$$ 54528 54106 53933 54211 54749 55252 55718 56334 57025 57405 57272 56933 56864 57157 57489 57632 57740 58087 58667 59199
51743E9199K77J00J48L49N80P70Q53Q05P22P62R55J184J360J504J632J716J779
$$ 59199 59476 59576 59724 60073 60653 61423 62276 63081 63803 64565 65520 66704 68064 69568 71200 72916 74695
51726G4695J874J908J711J328J089J191J425J463J274J007P23M51L77N96Q05N27
$$ 74695 76569 78477 80188 81516 82605 83796 85221 86684 87958 88965 89688 90139 90516 91112 91917 92444
51710I2444k24r24j168j082r88r64q85p02n00l98n15q44j140j067n85n3K24L05
$$ 92444 92220 91296 90128 89046 88058 87094 86209 85507 85007 84609 84094 83250 82110 81043 80458 80405 80629 80934
51692H0934L76L81J87o5o8J88L77K92J33J57L25M01L15J87O1j86n85r34j016q88
$$ 80934 81310 81691 81878 81813 81745 81933 82310 82602 82735 82892 83217 83618 83933 84120 84181 83995 83410 82476 81460 80572
51672H0572p67p08n48k25P1J39L0r2k07l57m09j79J99L09J9k81j69K40N01M52
$$ 80572 79805 79097 78549 78324 78395 78534 78564 78472 78265 77908 77499 77320 77519 77828 77847 77566 77397 77637 78138 78590
51652G8590L10K38J26j11k85j79J34M12N50O22P01P86Q51Q21N47Mn21o27k93P2
$$ 78590 78900 79138 79264 79153 78868 78689 78823 79235 79785 80407 81108 81894 82745 83566 84113 84117 83596 82969 82676 82748
51632H2748J09j10k99l57l86l90k57QJ58k9m83q49q08l76L2nm58q80r46q34q47
$$ 82748 82857 82747 82448 82091 81705 81315 81058 81066 81224 81195 80712 79863 79055 78679 78711 78706 78248 77368 76422 75588 74741
51611G4741r24q01n37n12q47j188j195r25o49n20n87q28r84o72O0N45K20n92j059
$$ 74741 73817 73016 72479 71967 71120 69932 68737 67812 67163 66643 66056 65228 64244 63572 63632 64177 64397 63805 62746
51592F2746q31l29m9l5j06k54n15o79m82lL44K59j00l18j50K68O32P76P11M82
$$ 62746 61915 61586 61537 61502 61396 61142 60627 59948 59466 59463 59807 60066 59966 59648 59498 59766 60398 61174 61885 62367
51572F2367J10k88m95m29k61k27l44m08k50J04M51N46L47J01J39M61P28P11O09
$$ 62367 62477 62189 61694 61265 61004 60777 60433 60025 59775 59879 60330 60876 61223 61324 61463 61924 62652 63363 63972
51553F3972P40J053J204J009O38L87M15O63R28J019R83J079J372J545J285P60
$$ 63972 64712 65765 66969 67978 68616 69003 69418 70081 71009 72028 73011 74090 75462 77007 78292 79052
51537G9052M08L59L67K20m2l17n27n20k04K00L22J52M3K13M62N57N73O86R07J142
$$ 79052 79460 79819 80186 80406 80364 80047 79520 79000 78796 78996 79318 79470 79513 79726 80188 80745 81318 82004 82911 84053
51517H4053J309J288J006O69O53R63J071N93k07p86r25p36l18K07N11L86Q2k9
$$ 84053 85362 86650 87656 88325 88978 89941 91012 91605 91398 90612 89687 88951 88633 88840 89351 89737 89819 89790
51499H9790n4m04j030j394j235r53j002j300j513j553j494j266q02l59k71m63
$$ 89790 89736 89332 88302 86908 85673 84720 83718 82418 80905 79352 77858 76592 75790 75431 75160 74697
51483G4697n49m15l58n39o43l28K35N31L14j62m74m19p4L54O58P61P16O19N20
$$ 74697 74148 73733 73375 72836 72193 71865 72100 72631 72945 72783 72309 71890 71816 72170 72828 73589 74305 74924 75444
51464G5444M58M84N32M01N4j73P8O58J025R25O33M47L39K81M83R65J205O92k54
$$ 75444 75902 76386 76918 77319 77373 77200 77278 77936 78961 79886 80519 80966 81305 81586 82069 83034 84239 84931 84677
51445H4677p48l52N07J111J143P18K12P7M99J098J314J110R79J139J210R06N90
$$ 84677 83929 83577 84084 85195 86338 87056 87268 87345 87844 88942 90256 91366 92345 93484 94694 95600 96190
51428I6190P52J192J287Q61L86K70M10N16N47O21P16O42L33Mm2K17M11J58m59
$$ 96190 96942 98134 99421 100282 100668 100938 101348 101864 102411 103032 103748 104390 104723 104727 104685 104902 105313 105471 105012
51409A05012r78j130j080j028q51m36j03l22j013j551j516j169j011j139j235
$$ 105012 104034 102904 101824 100796 99945 99509 99406 99084 98071 96520 95004 93835 92824 91685 90450
51394I0450j033o12k37r3j96m42o25n67k49Q7J47j06l90m29k75j89k65l48k80
$$ 90450 89417 88805 88568 88475 88279 87837 87212 86645 86396 86483 86630 86524 86134 85705 85430 85241 84976 84628 84348
51375H4348j02K7n8m38j001j403j362j023q22r78j294j520j587j454j017m38k19
$$ 84348 84246 84273 84215 83777 82776 81373 80011 78988 78166 77188 75894 74374 72787 71333 70316 69878 69659
51358F9659o27j247j391q64r4M11M70K20m9j23p3j74m68o26m50k66m85r19r92
$$ 69659 69032 67785 66394 65530 65436 65847 66317 66537 66488 66365 66292 66118 65650 65024 64574 64308 63823 62904 61912
51339F1912n37K0K37P5k96p14j009j074j049j114j123p51p0M13L89Q0j75l14l85
$$ 61912 61375 61395 61632 61707 61411 60697 59688 58614 57565 56451 55328 54577 54507 54920 55309 55389 55214 54900 54515
51320E4515k91QL05L71K20m2l70o60o83m20k11l54o66p31m08Q8N31Q13Q72P01
$$ 54515 54224 54232 54537 54908 55128 55086 54716 54056 53373 52953 52742 52388 51722 50991 50583 50671 51202 52015 52887 53588
51300E3588M40K39R1p6j80q4J86M36N31M42J82j63l78l13j20j04l49o07o66o34
$$ 53588 54028 54267 54358 54282 54102 54018 54204 54640 55171 55613 55795 55632 55254 54941 54821 54717 54368 53761 53095 52461
51280E2461p64j097j347j215p49l60m03p73j035r58p41p25r56j189j170q34l48
$$ 52461 51697 50600 49253 48038 47289 46929 46526 45753 44718 43760 43019 42294 41338 40149 38979 38145 37797
51263C7797J2P6m6j44k25m49p16o56k07J59M2l20m61l75l57l75j29K87L82K4k54
$$ 37797 37809 37885 37839 37695 37470 37021 36305 35649 35442 35601 35643 35323 34862 34487 34130 33755 33626 33913 34295 34319 34065
51242C4065RN91R62R74Q52P08M34K2l35m82m60l91l25k11k0J52J26j33m09m55
$$ 34065 34074 34665 35627 36601 37453 38161 38595 38617 38282 37800 37340 36949 36624 36413 36393 36545 36671 36538 36129 35674
51222C5674k95j39n5O3J93J29j45l58l30k53l34m67m49l46l21l11j80p1k16m84
$$ 35674 35379 35240 35185 35248 35441 35570 35425 35067 34737 34484 34150 33683 33234 32888 32567 32256 32076 32005 31789 31305
51202C1305m61o7K97K96N7j29k00k27j88n3M8j8j31m2K38L93J76k81n69m01J06
$$ 31305 30844 30777 31074 31370 31427 31298 31098 30871 30683 30630 30678 30660 30529 30487 30725 31118 31294 31013 30444 30043 30149
51181C0149N37N66K78K3K9K11L87M86N08L92J01k46m70n26n25n07l84r9K33L83
$$ 30149 30686 31252 31530 31553 31582 31793 32180 32666 33174 33566 33667 33421 32951 32425 31900 31393 31009 30910 31143 31526
51161C1526K34p9k69j41J94M18L25P1j0K49O94J030J095R45P61O59O18N51M22
$$ 31526 31760 31681 31412 31271 31465 31883 32208 32279 32269 32518 33212 34242 35337 36282 37043 37702 38320 38871 39293
51142C9293K89K04J88K44L42L48J38j81k95n8K66L06N8j54j24K6J04J06R0Pj76
$$ 39293 39582 39786 39974 40218 40560 40908 41046 40865 40570 40512 40778 41084 41142 40988 40864 40890 40994 41100 41190 41197 41021
51121D1021l58m08l38k44j48m3rj08j90l7K85M15J19l71o40n96n16o07o96n23
$$ 41021 40663 40255 39917 39673 39525 39482 39473 39365 39175 39138 39423 39838 39957 39586 38946 38350 37834 37227 36531 36008
51101C6008j74oj53l53k76N7L43L66J71o5k26k96l43m17m51k93Q7M54N16K34j54
$$ 36008 35834 35828 35675 35322 35046 35103 35446 35812 35983 35918 35692 35396 35053 34636 34185 33892 33979 34433 34949 35183 35029
51080C5029l79l18J1M76Q12P98M57J8l32n09m25p7K67K64o5l44l79m42p47j016
$$ 35029 34650 34332 34343 34819 35631 36429 36886 36904 36572 36063 35638 35561 35828 36092 36027 35683 35304 34862 34115 33099
51060C3099q38l02J48L41N00P28P32K72l99p43m68K11Q40J122J115J019Q79N73
$$ 33099 32261 31959 32107 32448 32948 33676 34408 34680 34281 33538 33070 33281 34121 35243 36358 37377 38256 38829
51042C8829J35j33j3L10M70L92K73K15J97K80N55Q44Q23N23L39M73O72O35M00
$$ 38829 38964 38831 38818 39128 39598 39990 40263 40478 40675 40955 41510 42354 43177 43700 44039 44512 45184 45819 46219
51023D6219J35r8k07PM55O28K05m10n61j81K50M27M69M34J38l80o87m53O5L68
$$ 46219 46354 46256 46049 46056 46511 47139 47344 46934 46373 46192 46442 46869 47338 47772 47910 47530 46843 46390 46455 46823
51003D6823K93P5n2r1j38k16k50j67k4nk39o18q94r93j031j000o94p4M90N85K40
$$ 46823 47116 47191 47139 47048 46910 46694 46444 46277 46253 46248 46009 45391 44497 43504 42473 41473 40779 40705 41195 41780 42020
50982D2020j42l09l54m06l97j69K59O76Q42O61L06J24L52Q26J103R17M82K26L08
$$ 42020 41878 41569 41215 40809 40412 40243 40502 41178 42020 42681 42987 43111 43463 44289 45392 46309 46791 47017 47325
50963D7325M82M55K59J96M41P90Q94O66L31R5r8l37n01l28K21Q25J086R11N94
$$ 47325 47807 48262 48521 48717 49158 49948 50842 51508 51839 51934 51836 51499 50998 50670 50891 51716 52802 53713 54307
50944E4307N53R14J365J461J133P79P69J000J098R72Q91J062J350J579J778K029
$$ 54307 54860 55774 57139 58600 59733 60512 61281 62281 63379 64351 65242 66304 67654 69233 71011 73040
50928G3040K227K253K250K521L104L637L710L255K601K210K370L014L802M428
$$ 73040 75267 77520 79770 82291 85395 89032 92742 95997 98598 100808 103178 106192 109994 114422
50914A14422M837N163N497N822O126O493O981P510P902Q102Q260Q611R214R870
$$ 114422 119259 124422 129919 135741 141867 148360 155341 162851 170753 178855 187115 195726 204940 214810
50900B14810J0359J0701J1041J1333J1367J1107J0782J0519J0147R502Q755Q128
$$ 214810 225169 235870 246911 258244 269611 280718 291500 302019 312166 321668 330423 338551
50888C38551P493O571N484M667M246L819K978J779N97k93p88q87p25n50n56p49
$$ 338551 346044 352615 358099 362766 367012 370831 373809 375588 376185 375892 375104 374217 373492 372942 372386 371637
50872C71637j090j570k101k510k790l165l744m345m807n302o091p113q057q733
$$ 371637 370547 368977 366876 364366 361576 358411 354667 350322 345515 340213 334122 327009 318952 310219
50858C10219r136r258r148r014r067r165r013q613q271q068p662o767n573m519
$$ 310219 301083 291825 282677 273663 264596 255431 246418 237805 229534 221466 213804 207037 201464 196945
50844A96945l800l297k871k519k247j992j661j213o56p4L73N79N90O31Q94J332
$$ 196945 193145 189848 186977 184458 182211 180219 178558 177345 176689 176615 176988 177567 178157 178788 179682 181014
50828A81014J677J730J584J453J310R13K83j15J16P67J253J323J260J363J535
$$ 181014 182691 184421 186005 187458 188768 189681 189964 189849 189965 190732 191985 193308 194568 195931 197466
50813A97466J540J387J313J480J855K295K667K917L109L364L752M253M813N367
$$ 197466 199006 200393 201706 203186 205041 207336 210003 212920 216029 219393 223145 227398 232211 237578
50799B37578N876O437P244Q287R194R649R901J0579J1922J3519J4894J6031J7157
$$ 237578 243454 249891 257135 265422 274616 284265 294166 304745 316667 330186 345080 361111 378268
50786C78268J8313J9406K0474K1606K2674K3464K3977K4383K4711K4768K4393
$$ 378268 396581 415987 436461 458067 480741 504205 528182 552565 577276 602044 626437
50775F26437K3564K2340K0828J9160J7381J5360J2976J0341P722N288L118J367
$$ 626437 650001 672341 693169 712329 729710 745070 758046 768387 776109 781397 784515 785882
50763G85882J91m82r03j207j329j241j077r49q01n37k63l05j026k553m630o771
$$ 785882 786073 785591 784688 783481 782152 780911 779834 778885 778084 777547 777284 776979 775953 773400 768770 761999
50747G61999q646j0315j1956j3498j4675j5402j5852j6132j6110j5641j4756j3547
$$ 761999 753353 743038 731082 717584 702909 687507 671655 655523 639413 623772 609016 595469
50735E95469j2019j0202q244o286m318k287j83J987M228O420Q311R734J0812J1786
$$ 595469 583450 573248 565004 558718 554400 552113 551930 553917 558145 564565 572876 582610 593422 605208
50721F05208J2772J3718J4469J4790J4427J3323J1709R841P789N607L564J923
$$ 605208 617980 631698 646167 660957 675384 688707 700416 710257 718046 723653 727217 729140
50709G29140N54r85k906m977o876q577j0258j1965j3560j4894j5957j6829j7528
$$ 729140 729694 728709 725803 720826 713950 705373 695115 683150 669590 654696 638739 621910 604382
50696F04382j7963j8007j7678j7162j6607j5908j4885j3590j2281j1069r798q329
$$ 604382 586419 568412 550734 533572 516965 501057 486172 472582 460301 449232 439434 431105
50684D31105o776n304l863k317p00Q26K221L590M983O326P549Q628R596J0562
$$ 431105 424329 419025 415162 412845 412145 412971 415192 418782 423765 430091 437640 446268 455864 466426
50670D66426J1711J3094J4448J5409J5928J6248J6524J6608J6335J5788J5155
$$ 466426 478137 491231 505679 521088 537016 553264 569788 586396 602731 618519 633674
50659F33674J4461J3544J2222J0442Q338O164M134K255M45j238k653l828m905
$$ 633674 648135 661679 673901 684343 692681 698845 702979 705234 705679 704441 701788 697960 693055
50646F93055n819o263o135n682n116m345l301k244j429p11J74J019J333J020N07
$$ 693055 687236 680973 674838 669156 664040 659695 656394 654150 652721 652010 652184 653203 654536 655556 656063
50631F56063J11l14r70j647j963j834j538j312j036l74Q66K480M060N476O966
$$ 656063 656174 655860 654890 653243 651280 649446 647908 646596 645560 645186 646052 648532 652592 658068 665034
50616F65034Q693J0353J1522J2285J3210J4708J6735J9078K1570K3991K6090K7871
$$ 665034 673727 684080 695602 707887 721097 735805 752540 771618 793188 817179 843269 871140
50604H71140K9571L1216L2499L3172L3220L2572L0998K8555K5754K2961K0002
$$ 871140 900711 931927 964426 997598 1030818 1063390 1094388 1122943 1148697 1171658 1191660
50593A191660J6661J3329J0563Q268N777K781l23l003n148o950q624j0333j2069
$$ 1191660 1208321 1221650 1232213 1240481 1246258 1249039 1248716 1245713 1240565 1233615 1224991 1214658 1202589
50580A202589j3453j3960j3504j2588j1737j0943r875q380o637m905l357k090
$$ 1202589 1189136 1175176 1161672 1149084 1137347 1126404 1116529 1108149 1101512 1096607 1093250 1091160
50568A091160j153n44k73m01r38j757k684l634m628n625o493p075p313p270p052
$$ 1091160 1090007 1089463 1089190 1088789 1087851 1086094 1083410 1079776 1075148 1069523 1063030 1055955 1048642 1041372 1034320
50553A034320o700o169n373m268k905j462j94P05J220J453J388Q75j98j748l620
$$ 1034320 1027620 1021451 1016078 1011810 1008905 1007443 1007249 1007954 1009174 1010627 1012015 1012890 1012692 1010944 1007324
50538A007324n726q040j0485j2969j5455j7892k0161k2157k3847k5152k5905k6038
$$ 1007324 1001598 993558 983073 970104 954649 936757 916596 894439 870592 845440 819535 793497
50526G93497k5768k5368k4839k3949k2574k0903j9230j7680j6123j4320j2201
$$ 793497 767729 742361 717522 693573 670999 650096 630866 613186 597063 582743 570542
50515E70542j0038q264p024o014m862l556k278j027L44J742K811L363L629M006
$$ 570542 560504 552240 545216 539202 534340 530784 528506 527479 527823 529565 532376 535739 539368 543374
50501E43374M657N421O030O418O900P947R644J1485J2902J3941J5191J7079J9495
$$ 543374 548031 553452 559482 565900 572800 580747 590391 601876 614778 628719 643910 660989 680484
50488F80484K2084K4516K6534K8022K9145L0175L1096L1619L1599L1154L0326
$$ 680484 702568 727084 753618 781640 810785 840960 872056 903675 935274 966428 996754
50477I96754K9009K7381K5991K5182K4694K4136K3541K3150K2949K2809K2817
$$ 996754 1025763 1053144 1079135 1104317 1129011 1153147 1176688 1199838 1222787 1245596 1268413
50466A268413K3102K3371K3159K2519K2079K2301K3066K4027K5061K6149K7058
$$ 1268413 1291515 1314886 1338045 1360564 1382643 1404944 1428010 1452037 1477098 1503247 1530305
50455A530305K7414K6968K5706K3726K1142J8021J4328R978N019l37n827j1227
$$ 1530305 1557719 1584687 1610393 1634119 1655261 1673282 1687610 1697588 1702607 1702270 1696443 1685216
50443A685216j6314k0897k4972k8674l1967l4457l5717l5682l4680l3011l0648
$$ 1685216 1668902 1648005 1623033 1594359 1562392 1527935 1492218 1456536 1421856 1388845 1358197
50432A358197k7415k3339j8757j4141r875o196l246j102K53Q36N17r83l848p934
$$ 1358197 1330782 1307443 1288686 1274545 1264670 1258474 1255228 1254126 1254379 1255215 1255732 1254749 1250901 1242967
50418A242967j2819j8077k3383k8406l2774l6229l8802m0678m1923m2426m2104
$$ 1242967 1230148 1212071 1188688 1160282 1127508 1091279 1052477 1011799 969876 927450 885346
50407H85346m1079l9543l7612l5381l3085l0987k9118k7232k5122k2883k0735
$$ 885346 844267 804724 767112 731731 698646 667659 638541 611309 586187 563304 542569
50396E42569j8714j6674j4584j2631j1006r694q540p420o298n146l984k923k115
$$ 542569 523855 507181 492597 479966 468960 459266 450726 443306 437008 431862 427878 424955 422840
50383D22840j556j004j96Q87J966K809L496M254N084N766O245O844P872R186J0363
$$ 422840 421284 420280 420084 420971 422937 425746 429242 433496 438580 444346 450591 457435 465307 474493 484856
50368D84856J1215J1930J2681J3361J3796J4086J4584J5499J6655J7632J8180
$$ 484856 496071 508001 520682 534043 547839 561925 576509 592008 608663 626295 644475
50357F44475J8445J8715J9019J9156J9066J8999J9138J9320J9350J9370J9659
$$ 644475 662920 681635 700654 719810 738876 757875 777013 796333 815683 835053 854712
50346H54712K0181K0677K1055K1338K1268K0455J8970J7340J5818J4083J1872
$$ 854712 874893 895570 916625 937963 959231 979686 998656 1015996 1031814 1045897 1057769
50335A057769R507P377N261K598p12m201p476j0603j3829j7181k0436k3293k5531
$$ 1057769 1067276 1074653 1079914 1082512 1081800 1077599 1070123 1059520 1045691 1028510 1008074 984781 959250
50322I59250k7054k7833k7773k6819k5223k3491k1852j9954j7392j4356j1495
$$ 959250 932196 904363 876590 849771 824548 801057 779205 759251 741859 727503 716008
50311G16008r130p031m925k987j624j059j183j770k697m039n930q287j0684j2705
$$ 716008 706878 699847 694922 691935 690311 689252 688069 686299 683602 679563 673633 665346 654662 641957
50297F41957j4345j5874j7319j8309j8555j8240j7826j7553j7305j6820j5917
$$ 641957 627612 611738 594419 576110 557555 539315 521489 503936 486631 469811 453894
50286D53894j4604j3112j1826j1036j0687j0399r804q833p714o725n928n182m362
$$ 453894 439290 426178 414352 403316 392629 382230 372426 363593 355879 349154 343226 338044 333682
50273C33682l482k643j906j311q93o12l22R3N98J114J636K169K563K679K619K684
$$ 333682 330200 327557 325651 324340 323447 322835 322513 322606 323204 324318 325954 328123 330686 333365 335984 338668
50257C38668L026L480L765L755L571L468L620L977M289M408M501M807N268N561
$$ 338668 341694 345174 348939 352694 356265 359733 363353 367330 371619 376027 380528 385335 390603 396164
50243C96164N508N279N122N074M992M750M290L613K799J979J179L44n13j230j731
$$ 396164 401672 406951 412073 417147 422139 426889 431179 434792 437591 439570 440749 441093 440580 439350 437619
50228D37619k164k724l415m086m692n262n743o029o213o588p304q087q467q261
$$ 437619 435455 432731 429316 425230 420538 415276 409533 403504 397291 390703 383399 375312 366845 358584
50214C58584p705p166o806o562o339o088n788n433n079m807m617m389l998l483
$$ 358584 350879 343713 336907 330345 324006 317918 312130 306697 301618 296811 292194 287805 283807 280324
50200B80324l033k828k847k888k737k382j949j518j099p89p49r25r72p08m65o66
$$ 280324 277291 274463 271616 268728 265991 263609 261660 260142 259043 258254 257505 256580 255608 254900 254435 253769
50184B53769j165j369j073o95o00n53j81M06Q20R88J111J180R49M43K8p4m3q6
$$ 253769 252604 251235 250162 249467 248867 248314 248133 248539 249359 250347 251458 252638 253587 254030 254058 253984 253941 253855
50166B53855j02P6K96K15k81r51j472j689j602j263q17n52p23j215j551j372q89
$$ 253855 253753 253829 254125 254340 254059 253108 251636 249947 248345 247082 246265 245713 244990 243775 242224 240852 239963
50149B39963o08o93q07o44k94J0K20L66L89L03L37O37J002J178J207J248J252
$$ 239963 239355 238662 237855 237211 236917 236927 237147 237513 237902 238205 238542 239179 240181 241359 242566 243814 245066
50132B45066J123J000J043J062Q02M61M49P53R37P84M91K10j32m89o17m80l40
$$ 245066 246189 247189 248232 249294 250096 250557 251006 251759 252696 253480 253971 254181 254049 253560 252943 252463 252123
$$ [...]
##END NTUPLES=NMR SPECTRUM
##END=
