##TITLE=coffee_type TOFR01-ROVE100A_60-40%
COFFEE_meoh_noesyp64 COFFEE_meoh {C:\Bruker\TOPSPIN} Administrator 15
##JCAMPDX= 6.0         $$ Bruker NMR JCAMP-DX V2.0
##DATA TYPE= NMR SPECTRUM
##DATA CLASS= NTUPLES
##ORIGIN= Bruker BioSpin GmbH
##OWNER= Administrator
$$ 1.72 TOPSPIN		Version 2.1
$$ 2012-05-18 15:49:02.932 -0700  Administrator@X
$$ Compression mode = diff/dup
##.OBSERVE FREQUENCY= 400.13188235
##.OBSERVE NUCLEUS= ^1H
##.ACQUISITION MODE= SIMULTANEOUS (DQD)
##.ACQUISITION SCHEME= undefined
##.AVERAGES= 64
##.DIGITISER RES= 22
##SPECTROMETER/DATA SYSTEM= spect
##.PULSE SEQUENCE= noesygpps1d.comp
##.SOLVENT NAME= COFFEE_meoh
##.SHIFT REFERENCE= INTERNAL, COFFEE_meoh, 1, 14.98061
##AUDIT TRAIL= $$ (NUMBER, WHEN, WHO, WHERE, PROCESS, VERSION, WHAT)
$$ ##TITLE= Audit trail, TOPSPIN		Version 2.1
$$ ##JCAMPDX= 5.01
$$ ##ORIGIN= Bruker BioSpin GmbH
$$ ##OWNER= Administrator
$$ $$ C:\Bruker\TOPSPIN/data/Administrator/nmr/12-COFFEE-2402/172/pdata/1/auditp.txt
$$ ##AUDIT TRAIL=  $$ (NUMBER, WHEN, WHO, WHERE, PROCESS, VERSION, WHAT)
(   1,<2012-02-25 00:32:06.875 -0500>,<Administrator>,<TOPSPIN>,<go>,<TOPSPIN 2.1>,
      <created by zg
	started at 2012-02-25 00:20:36.734 -0500,
	POWCHK enabled, PULCHK disabled,
       configuration hash MD5:
       B0 76 FB 9C 50 81 44 7D 18 B3 26 32 4E 60 AD 96
       data hash MD5: 64K
       6D B6 33 73 22 7A B9 F5 17 84 58 DB 93 5E E1 A7>)
(   2,<2012-02-25 00:32:09.562 -0500>,<Administrator>,<TOPSPIN>,<proc1d>,<TOPSPIN 2.1>,
      <Start of raw data processing
       efp LB = 0.3 FT_mod = 6 PKNL = 1 PHC0 = 0 PHC1 = 0 SI = 128K 
       data hash MD5: 128K
       17 09 1D A6 4F 7D F7 EB B1 8C A3 C5 B1 88 4E 2E>)
(   3,<2012-02-25 00:32:10.844 -0500>,<Administrator>,<TOPSPIN>,<proc1d>,<TOPSPIN 2.1>,
      <pk PHC0 = 25.1532 PHC1 = 0 
       data hash MD5: 128K
       85 95 18 28 17 80 DA AE 08 61 F2 8B CC 49 12 00>)
(   4,<2012-02-25 00:32:11.062 -0500>,<Administrator>,<TOPSPIN>,<proc1d>,<TOPSPIN 2.1>,
      <abs ABSG = 1 
       data hash MD5: 128K
       58 A9 45 F1 0F 71 B1 9A 25 D7 85 BB 1E D8 17 B1>)
(   5,<2012-02-25 00:32:11.141 -0500>,<Administrator>,<TOPSPIN>,<proc1d>,<TOPSPIN 2.1>,
      <abs ABSG = 2 
       data hash MD5: 128K
       CC 92 D3 61 02 2D 49 F0 51 62 C4 B7 57 70 F4 65>)
(   6,<2012-02-25 00:32:11.203 -0500>,<Administrator>,<TOPSPIN>,<proc1d>,<TOPSPIN 2.1>,
      <abs ABSG = 3 
       data hash MD5: 128K
       B1 B0 34 34 F2 FF 84 05 B3 9B EB 7C 3F C8 10 00>)
(   7,<2012-02-25 00:32:11.437 -0500>,<Administrator>,<TOPSPIN>,<proc1d>,<TOPSPIN 2.1>,
      <abs ABSG = 4 
       data hash MD5: 128K
       D0 A1 CE A0 32 36 7C 22 93 EF 69 11 32 96 A9 F8>)
(   8,<2012-02-25 00:32:11.484 -0500>,<Administrator>,<TOPSPIN>,<proc1d>,<TOPSPIN 2.1>,
      <abs ABSG = 5 
       data hash MD5: 128K
       B5 5F C0 FE 1C 17 53 0C 83 A4 BD E6 58 2C 1F B8>)
(   9,<2012-02-25 00:32:11.609 -0500>,<Administrator>,<TOPSPIN>,<audit>,<TOPSPIN 2.1>,
      <user comment:
       ICON-NMR User ID: Administrator
$$ [...]
150 150 150 150 150 150 150 150
##$TP07= 0
##$TPNAME0= <>
##$TPNAME1= <>
##$TPNAME2= <>
##$TPNAME3= <>
##$TPNAME4= <>
##$TPNAME5= <>
##$TPNAME6= <>
##$TPNAME7= <>
##$TPOAL= (0..7)
0.5 0.5 0.5 0.5 0.5 0.5 0.5 0.5
##$TPOFFS= (0..7)
0 0 0 0 0 0 0 0
##$TUNHIN= 0
##$TUNHOUT= 0
##$TUNXOUT= 0
##$USERA1= <user>
##$USERA2= <user>
##$USERA3= <user>
##$USERA4= <user>
##$USERA5= <user>
##$V9= 5
##$VALIST= <valist>
##$VCLIST= <CCCCCCCCCCCCCCC>
##$VD= 0
##$VDLIST= <DDDDDDDDDDDDDDD>
##$VPLIST= <PPPPPPPPPPPPPPP>
##$VTLIST= <TTTTTTTTTTTTTTT>
##$WBST= 1024
##$WBSW= 4
##$XGAIN= (0..3)
0 0 0 0
##$XL= 0
##$YL= 0
##$YMAX_a= 13703751
##$YMIN_a= -6314944
##$ZGOPTNS= <>
##$ZL1= 120
##$ZL2= 120
##$ZL3= 120
##$ZL4= 120
##$ABSF1= 14.98061
##$ABSF2= -5.57192
##$ABSG= 5
##$ABSL= 3
##$ALPHA= 0
##$AQORDER= 0
##$ASSFAC= 0
##$ASSFACI= 0
##$ASSFACX= 0
##$ASSWID= 0
##$AUNMP= <proc_prof1d_extract>
##$AXLEFT= 0
##$AXNAME= <>
##$AXNUC= <1H>
##$AXRIGHT= 0
##$AXTYPE= 0
##$AXUNIT= <>
##$AZFE= 0.1
##$AZFW= 0.1
##$BCFW= 0
##$BC_mod= 0
##$BYTORDP= 0
##$COROFFS= 0
##$CY= 15
##$DATMOD= 1
##$DC= 0
##$DFILT= <>
##$DTYPP= 0
##$F1P= 0
##$F2P= 0
##$FCOR= 0.5
##$FTSIZE= 131072
##$FT_mod= 6
##$GAMMA= 0
##$GB= 0
##$INTBC= 1
##$INTSCL= 1
##$ISEN= 128
##$LB= 0.3
##$LEV0= 0
##$LPBIN= 0
##$MAXI= 10000
##$MC2= 0
##$MEAN= 0
##$ME_mod= 0
##$MI= 0
##$NCOEF= 0
##$NC_proc= -3
##$NLEV= 6
##$NOISF1= 0
##$NOISF2= 0
##$NSP= 0
##$NTH_PI= 0
##$NZP= 0
##$OFFSET= 14.98061
##$PC= 1
##$PHC0= 25.1532
##$PHC1= 0
##$PH_mod= 1
##$PKNL= yes
##$PPARMOD= 0
##$PPDIAG= 0
##$PPIPTYP= 0
##$PPMPNUM= 2147483647
##$PPRESOL= 1
##$PSCAL= 4
##$PSIGN= 0
##$PYNMP= <proc.py>
##$REVERSE= no
##$SF= 400.13
##$SI= 131072
##$SIGF1= 0
##$SIGF2= 0
##$SINO= 400
##$SIOLD= 131072
##$SPECTYP= <>
##$SREGLST= <1H.CDCl3>
##$SSB= 0
##$STSI= 131072
##$STSR= 0
##$SW_p= 8223.68421052632
##$SYMM= 0
##$S_DEV= 0
##$TDeff= 65536
##$TDoff= 0
##$TI= <>
##$TILT= no
##$TM1= 0
##$TM2= 0
##$TOPLEV= 0
##$USERP1= <user>
##$USERP2= <user>
##$USERP3= <user>
##$USERP4= <user>
##$USERP5= <user>
##$WDW= 1
##$XDIM= 131072
##$YMAX_p= 487651544
##$YMIN_p= -282337965
##$CURPLOT= <Network HP LaserJet P1505>
##$CURPRIN= <$Network HP LaserJet P1505>
##$DFORMAT= <normdp>
##$LAYOUT= <+/1D_H.xwp>
##$LFORMAT= <normlp>
##$PFORMAT= <normpl>
##$SURQMSG= 1
$$ End of Bruker specific parameters
$$ ---------------------------------
##NTUPLES= NMR SPECTRUM
##VAR_NAME=  FREQUENCY,     SPECTRUM/REAL,   SPECTRUM/IMAG
##SYMBOL=    X,             R,               I
##VAR_TYPE=  INDEPENDENT,   DEPENDENT,       DEPENDENT
##VAR_FORM=  AFFN,          ASDF,            ASDF
##VAR_DIM=   131072,        131072,          131072
##UNITS=     HZ,            ARBITRARY UNITS, ARBITRARY UNITS
##FACTOR=    0.0627417313425165, 1,          1
##FIRST=     8223.62146879498, -2669,        -85225
##LAST=      0,             -2009,           -87419
##MIN=       0,             -282337965,      0
##MAX=       8223.62146879498, 487651544,    0
$$ Real data points
##PAGE= N=1
##DATA TABLE= (X++(R..R)), XYDATA
$$ [...]
62996A469419J6544J7487J8497K1305K5554K9244L1501L3270L5300L7036L7762
62985A772919L7839L8398M0230M2968M5119M5292M3738M2211M1897M2132M1668
62974B234411M0392L9098L8223L7664L7228L6470L4655L1629K8152K4551J9774
62963B602247J2727L922n244j4113k2586k9989l5619m0033m4357m8342n0455m9931
62951B278227m7648m4951m2520m0297l7605l3437k7578k1300j5998j1545p107
62940A948241l068m32J433M530R282J3535J5306J5153J5028J5944J7663J9669
62928B072284K1355K1944K1133J9518J7741J5695J3067J0153P474M778J014m735
62916B221421j2366k0543k7476l2410l6369m0920m6360n1711n6211n9699o1616
$$ plain form
62996 1469419 1485963 1503450 1521947 1543252 1568806 1598050 1629551 1662821 1698121 1735157 1772919
62985 1772919 1810758 1849156 1889386 1932354 1977473 2022765 2066503 2108714 2150611 2192743 2234411
62974 2234411 2274803 2313901 2352124 2389788 2427016 2463486 2498141 2529770 2557922 2582473 2602247
62963 2602247 2614974 2618896 2613652 2599539 2576953 2546964 2511345 2471312 2426955 2378613 2328158 2278227
62951 2278227 2230579 2185628 2143108 2102811 2065206 2031769 2004191 1982891 1966893 1955348 1948241
62940 1948241 1945173 1944741 1946174 1950704 1959986 1973521 1988827 2003980 2019008 2034952 2052615 2072284
62928 2072284 2093639 2115583 2136716 2156234 2173975 2189670 2202737 2212890 2220364 2225142 2226156 2221421
62916 2221421 2209055 2188512 2161036 2128626 2092257 2051337 2004977 1953266 1897055 1837356 1775740
62905A775740o1106n8538n5725n3916n2506n0332m7336m4178m1163l8356l6064
62894A236520l4288l2406l0086k7910k6254k4384k1572j8558j6716j6190j5905
62883I72251j5176j4217j3251j2165j1107j0550j0576j0723j0555r898q724p382
62871H37927o708p189q215q875r119r324r094p747n807m658m503m039k673j632
62857G48344k036l019l021k137j709j941j442N71K816L395J988j9j262j499j219
62842G37810p77k35L39Q05J195J715K395K951L089K811K168R91o83k032j919k63
62826G50360J551K081J346M78J70J91K87O73J369J837J792J768K201K517J930
62811G70551Q72N37J018J018k22j760k435k654l625n220n797m381k054p29j095
$$ plain form
62905 1775740 1714634 1656096 1600371 1546455 1493949 1443617 1396281 1352103 1310940 1272584 1236520
62894 1236520 1202232 1169826 1139740 1111830 1085576 1061192 1039620 1021062 1004346 988156 972251
62883 972251 957075 942858 929607 917442 906335 895785 885209 874486 863931 854033 845309 837927
62871 837927 831219 824030 815815 806940 797821 788497 779403 771656 765849 761191 756688 752649 749976 748344
62857 748344 746308 743289 740268 738131 736422 734481 733039 733610 736426 739821 741809 741790 740528 739029 737810
62842 737810 737033 736798 737137 737942 739137 740852 743247 746198 749287 752098 754266 755257 754574 752542 750623 750360
62826 750360 751911 753992 755338 755816 755986 756177 756464 757137 758506 760343 762135 763903 766104 768621 770551
62811 770551 771423 771960 772978 773996 773774 772014 769579 766925 763300 758080 752283 747902 745848 745119 744024
62796G44024k231k960l011k821k614k031p73P43J656J548P41k93j238j572o57
62781G28511J252K683K414R72j15k46l1J90R90K698M544N512N409M637L470K073
62765G64963Q18J9l47l90l2N90Q88M63k20k49O98K061K988K929J872L66p29q46
62747G75842j50P30J353J774K289K941L350L200K982L856O290R178J0964J1474
62733H36073J1818J2546J3078J3175J3807J5754J8380K0587K2232K3694K4882
62722A026026K5757K7210L0055L3477L5917L7400L9575M3297M7597N1471N5355
62711A453137N9940O4414O6937O6525O3779O0155N6866N4113N0779M5221L6916
62700B078782K7061J7180P447l049j4609k6103l5983m3712n0071n6076o1662o5614
$$ plain form
62796 744024 741793 738833 735822 733001 730387 728356 727583 728326 729982 731530 732271 731978 730740 729168 728511
62781 728511 729763 732446 734860 735832 735717 735471 735440 735630 736620 739318 743862 749374 754783 759420 762890 764963
62765 764963 765781 765800 765453 765063 765031 765621 766509 766972 766752 766503 767201 769262 772250 775179 777051 777417 776688 775842
62747 775842 775692 776422 777775 779549 781838 784779 788129 791329 794311 798167 804457 813635 824599 836073
62733 836073 847891 860437 873515 886690 900497 916251 934631 955218 977450 1001144 1026026
62722 1026026 1051783 1078993 1109048 1142525 1178442 1215842 1255417 1298714 1346311 1397782 1453137
62711 1453137 1513077 1577491 1644428 1710953 1774732 1834887 1891753 1945866 1996645 2041866 2078782
62700 2078782 2105843 2123023 2130470 2127421 2112812 2086709 2050726 2007014 1956943 1900867 1839205 1773591
62688A773591o7081o6828o6442o6285o5124o2042n7843n4082n1331m9129m6912
62677A120492m4184m0339l5326l0324k6754k4710k3178k1588k0188j9029j7677
62666H17195j6032j4383j2545j0118p734o647o561n451k473L43P78l73m83J270
62652G36786L465N269P488J0388J2614J3283J3655J5382J8192K0614K2279K4107
62640I03522K6519K8777L0262L1420L3131L5755L8973M2203M4986M7274M9357
62629A312179N1351N2878N3478N3159N2232N0698M8040M3542L6790K8247J9314
62618A801908J1241L684m917j5013k4810l2248l7494m2433m8119n3845n8459o1297
62606A438198o1828n9768n6084n2710n0640m8955m6310m2655l8945l5773l3053
$$ plain form
62688 1773591 1706510 1639682 1573240 1506955 1441831 1379789 1321946 1267864 1216533 1167404 1120492
62677 1120492 1076308 1035969 1000643 970319 943565 918855 895677 874089 853901 834872 817195
62666 817195 801163 786780 774235 764117 756383 749736 743175 737724 735251 735594 736372 735999 735516 736786
62652 736786 740251 745520 753008 763396 776010 789293 802948 818330 836522 857136 879415 903522
62640 903522 930041 958818 989080 1020500 1053631 1089386 1128359 1170562 1215548 1262822 1312179
62629 1312179 1363530 1416408 1469886 1523045 1575277 1625975 1674015 1717557 1754347 1782594 1801908
62618 1801908 1813149 1816833 1811916 1796903 1772093 1739845 1702351 1659918 1611799 1557954 1499495 1438198
62606 1438198 1376370 1316602 1260518 1207808 1157168 1108213 1061903 1019248 980303 944530 911477
62595I11477l0639k8582k6840k5196k3385k1153j8436j5675j3757j3274j3927
62584F80613j4646j4258j2239r229o720n762o021o458o709p106p603p544o566
62571E69752m910k833o17Q98R42J35o7M82M03p30j310m7K027L101K960K446J702
62554E74334P29Q47L443P469J0020R690P957P046P743R490J1412J2698J2981J2736
62540F88595J2811J3530J4829J6811J9165K0581K0199J9419K0629K3969K6997
62529H97535K7923K7570K7629K8637L0320L2327L3649L2808K9817K6654K4584
62518A219453K2285J7927J1880N752j52o547j3088j8574k2911k6940l0423l2120
62506A126542l2178l2433l3624l3956l1627k7679k4993k4919k5980k5876k3980
$$ plain form
62595 911477 880838 852256 825416 800220 776835 755682 737246 721571 707814 694540 680613
62584 680613 665967 651709 639470 630241 623521 617759 611738 605280 598571 591465 583862 576318 569752
62571 569752 564842 562009 561392 562290 563232 563367 563300 563782 564185 563455 562145 562098 564125 567226 570186 572632 574334
62554 574334 575063 575910 579353 586822 596842 606532 614489 621535 629278 638768 650180 662878 675859 688595
62540 688595 701406 714936 729765 746576 765741 786322 806521 825940 846569 870538 897535
62529 897535 925458 953028 980657 1009294 1039614 1071941 1105590 1138398 1168215 1194869 1219453
62518 1219453 1241738 1259665 1271545 1277297 1277145 1270598 1257510 1238936 1216025 1189085 1158662 1126542
62506 1126542 1094364 1061931 1028307 994351 962724 935045 910052 885133 859153 833277 809297
62495H09297k1598k0120j9295j7705j4880j2299j1619j2412j2680j1430r747r080
62483F36432r544j0250j0451r863q594p351o966p109o121k983R82L326L277K440
62469E67225K662L970N060N185M862M852N180N553O220P745R884J1499J1897J1745
62455F63539J2092J3085J4336J6031J8615K1563K3644K4619K5584K7265K9024
62444H89397L0050L0586L1231L1640L0865K8570K5264K1530J7491J2853P182N53
62432A157212n858j0575j3540j6243j9595k2622k4051k4248k4460k4932k5130
62421I45958k5168k5460k5281k3422k0245j7477j5824j4348j2561j1299j0770
62410G44103r501o521l322k065k685l180k286m94J250K480K827K049P65K40J126
$$ plain form
62495 809297 787699 767579 748284 730579 715699 703400 691781 679369 666689 655259 645512 636432
62483 636432 626888 616638 606187 596324 587730 580379 573413 566304 560183 557200 558182 561508 564785 567225
62469 567225 569887 573857 578917 584102 588964 593816 598996 604549 610769 618514 628398 639897 651794 663539
62455 663539 675631 688716 703052 719083 737698 759261 782905 807524 833108 860373 889397
62444 889397 919447 950033 981264 1012904 1043769 1072339 1097603 1119133 1136624 1149477 1156659 1157212
62432 1157212 1151354 1140779 1127239 1110996 1091401 1068779 1044728 1020480 996020 971088 945958
62421 945958 920790 895330 870049 846627 826382 808905 793081 778733 766172 754873 744103
62410 744103 734602 728081 724759 722694 720009 716829 714543 714049 715299 717779 720606 722655 723420 723660 724786
62395G24786K915M763O145O702O195N021M176M293N055N741N979N743N054M075
62381G96643L191K601J911M80j801m342o452p975r189j0278j1068j1327j1005
62368G31389j0160q864p343o004n024m242l729m011n014n195k864J491N255O510
62354F82195N890N142M979N251O189Q014R659R525P740O484P477R926J1597J1464
62340G91532J0684J1039J2758J4157J3575J1341R393Q892R054Q702P918P272O267
62327I22584M059J342k1N75J794K387K584K917L042K820L558O767J1937J6710
62313I83055J9420K0648K2141K4787K8066L1114L3863L6942M0794M5216M9846
62302A335892N4693N9870O5088O9832P3793P6673P7865P6933P4300P0644O5712
$$ plain form
62395 724786 727701 732464 738609 745311 751506 756527 760703 764996 770051 775792 781771 787514 792568 796643
62381 796643 799834 802435 804346 804826 803025 798683 792231 784256 775067 764789 753721 742394 731389
62368 731389 721229 712365 705022 699018 693994 689752 686023 682012 676998 671803 668939 670430 675685 682195
62354 682195 688085 693227 698206 703457 709646 717660 727319 736844 744584 751068 758545 768471 780068 791532
62340 791532 802216 813255 826013 840170 853745 865086 874479 883371 892425 901127 909045 916317 922584
62327 922584 926643 927985 927964 928539 930333 932720 935304 938221 941263 944083 947641 954408 966345 983055
62313 983055 1002475 1023123 1045264 1070051 1098117 1129231 1163094 1200036 1240830 1286046 1335892
62302 1335892 1390585 1450455 1515543 1585375 1659168 1735841 1813706 1890639 1964939 2035583 2101295
62291B101295N8478M8588L6987K5007J3509K963o490j5291k4083l2726m0363m6645
62279B121229n2016n6584n9690o1070o1505o1611o0815n8382n4738n0904m7113
62268A496801m2955l8560l4699l1758k9408k7227k5118k3073k1027j9012j7084
62257A186880j5181j3182j1043q753o414m387k953j807o52j81j441l844m986l388
62243A108668n26Q98P3j698l197m271m877m678l968l728m163m060k287M44K134
62228A074764J726L62J43J809M104N543O258P332Q905J0208J1447J3935J7731
62215A164267K0749K1428K1058K2030K4693K7600L0027L2516L5280L7930M0766
62204A478344M4554M8890N2428N5038N8269O3133O8800P3930P7987Q0594Q0916
$$ plain form
62291 2101295 2159773 2208361 2245348 2270355 2283864 2286827 2280337 2265046 2240963 2208237 2167874 2121229
62279 2121229 2069213 2012629 1952939 1891869 1830364 1768753 1707938 1649556 1594818 1543914 1496801
62268 1496801 1453846 1415286 1380587 1348829 1319421 1292194 1267076 1244003 1222976 1203964 1186880
62257 1186880 1171699 1158517 1147474 1138721 1132307 1127920 1124967 1123160 1122508 1122327 1120886 1117042 1112056 1108668
62243 1108668 1108142 1109040 1109113 1107415 1104218 1099947 1095070 1090392 1086424 1082696 1078533 1074473 1072186 1072630 1074764
62228 1074764 1076490 1076852 1076995 1078804 1082908 1088451 1094709 1102041 1110946 1121154 1132601 1146536 1164267
62215 1164267 1185016 1206444 1227502 1249532 1274225 1301825 1331852 1364368 1399648 1437578 1478344
62204 1478344 1522898 1571788 1624216 1679254 1737523 1800656 1869456 1943386 2021373 2101967 2182883
62193B182883P8553P4116O8176O0440N0645L9389K7423J4958K385r125j8711k6885
62181B544247l4651m1998m8043n2322n5190n7055n7819n7126n4862n1502m7979
62170A985700m4831m1461l6827l1062k5682k1806j8798j5233j0609n672j462J453
62158A733710L157M243N264O162O559O644P122Q113Q960R437J0251J1861J3613
62145A835096J4785J5727J7196J9103K0737K1893K3070K4837K7395L0298L2319
62134B082456L2437L1527L2051L5146L8914M0900M1417M2848M5982M8860M9387
62123B521925M7465M4214M0555L7307L5265L4194L2666L0020K7776K7956L0465
62112B909808L3426L5950L9186M4217N0105N5052N8773O2456O6376O8837O8127
$$ plain form
62193 2182883 2261436 2335552 2403728 2464168 2514813 2554202 2581625 2596583 2598968 2589843 2571132 2544247
62181 2544247 2509596 2467598 2419555 2367233 2312043 2254988 2197169 2140043 2085181 2033679 1985700
62170 1985700 1940869 1899408 1862581 1831519 1805837 1784031 1765233 1750000 1739391 1733719 1732257 1733710
62158 1733710 1736867 1741110 1746374 1752536 1759095 1765739 1772861 1780974 1789934 1799371 1809622 1821483 1835096
62145 1835096 1849881 1865608 1882804 1901907 1922644 1944537 1967607 1992444 2019839 2050137 2082456
62134 2082456 2114893 2146420 2178471 2213617 2252531 2293431 2334848 2377696 2423678 2472538 2521925
62123 2521925 2569390 2613604 2654159 2691466 2726731 2760925 2793591 2823611 2851387 2879343 2909808
62112 2909808 2943234 2979184 3018370 3062587 3112692 3167744 3226517 3288973 3355349 3424186 3492313
62101C492313O4703O0526N6626N2386M7173M1516L6169L0935K5272J9626J5212
62090C942457J2445J0293P556M340J900J108J532K312L554O141R990J3466J5294
62077D032388J6386J8537K1688K3986K4682K5281K7085K9165L0008L0035L0874
62066D310115L2810L4562L5447L6240L7785L9917M2065M3906M5156M5588M5624
62055D749215M6147M7349M8442M8808M8808M9107M9759N0421N0938N1281N1250
62044E291525N0678M9769M8983M8712M9179N0364N1922N3357N4434N5188N5624
62033E859735N5808N6230N7552N9804O2243O4221O5818O7450O9316P1374P3419
62022F562970P4738P4105P0682O4941N8426N2786M9029M7240M6497M5256M2455
$$ plain form
62101 3492313 3557016 3617542 3674168 3726554 3773727 3815243 3851412 3882347 3907619 3927245 3942457
62090 3942457 3954902 3965195 3972751 3977091 3978991 3980099 3981631 3983943 3987497 3993638 4003628 4017094 4032388
62077 4032388 4048774 4067311 4088999 4112985 4137667 4162948 4190033 4219198 4249206 4279241 4310115
62066 4310115 4342925 4377487 4412934 4449174 4486959 4526876 4568941 4612847 4658003 4703591 4749215
62055 4749215 4795362 4842711 4891153 4939961 4988769 5037876 5087635 5138056 5188994 5240275 5291525
62044 5291525 5342203 5391972 5440955 5489667 5538846 5589210 5641132 5694489 5748923 5804111 5859735
62033 5859735 5915543 5971773 6029325 6089129 6151372 6215593 6281411 6348861 6418177 6489551 6562970
62022 6562970 6637708 6711813 6782495 6847436 6905862 6958648 7007677 7054917 7101414 7146670 7189125
62011G189125L8236L3317K7734K0947J3196O029R55k080m350o803r516j2520j6294
61998G277976k1093k6358l1210l5224l8423m1010m3540m6812n1004n5211n8557
61987F829534o1293o4027o6159o6368o4606o2435o1110o0380n9590n8735n7838
61976F146993n6422n4524n3224n3182n3364n2396n0426m8584m7333m6697m7501
61965E583340n0526n4572n7159n7524n7353n8110n9097n8928n7610n6114n4894
61954D961453n3896n3190n2472n0572m6740m2129l8781l7184l5904l3699l0851
61943D486035k8035k4968k1140j7333j5370j6290j9399k3289k7293l1648l6632
61932D224638m2079m7642n3020n7763o1247o3174o3975o4367o4563o4148o2735
$$ plain form
62011 7189125 7227361 7260678 7288412 7309359 7322555 7328584 7329539 7327459 7323109 7316306 7306790 7294270 7277976
61998 7277976 7256883 7230525 7199315 7164091 7125668 7084658 7041118 6994306 6943302 6888091 6829534
61987 6829534 6768241 6704214 6638055 6571687 6507081 6444646 6383536 6323156 6263566 6204831 6146993
61976 6146993 6090571 6036047 5982823 5929641 5876277 5823881 5773455 5724871 5677538 5630841 5583340
61965 5583340 5532814 5478242 5421083 5363559 5306206 5248096 5188999 5130071 5072461 5016347 4961453
61954 4961453 4907557 4854367 4801895 4751323 4704583 4662454 4623673 4586489 4550585 4516886 4486035
61943 4486035 4458000 4433032 4411892 4394559 4379189 4362899 4343500 4320211 4292918 4261270 4224638
61932 4224638 4182559 4134917 4081897 4024134 3962887 3899713 3835738 3771371 3706808 3642660 3579925
61921C579925o0534n8130n5793n3233n0133m6816m4062m2158m0420l8016l5066
61910C055564l2438l0613k9283k8087k7057k6106k4732k2655k0213j7829j5406
61899B781145j2670r625o328k674J160M615P558J0652J4395J8409K2288K6513
61887B855438L1607L7003M1848M6494N1930N7943O3150O6976P0301P3837P7063
61876C473590P9338Q1047Q2973Q5225Q7479Q9555R1130R1454R0180Q8312Q7681
61865D427964Q9363R2884R6954J00875J05313J11761J21156J33131J46851J62248
61855E588500J79908J99912K21562K44379K68644K94615L21693L48750L75163
61846H043126M01413M28783M58276M89534N21013N51544N81043O08845O31695
$$ plain form
61921 3579925 3519391 3461261 3405468 3352235 3302102 3255286 3211224 3169066 3128646 3090630 3055564
61910 3055564 3023126 2992513 2963230 2935143 2908086 2881980 2857248 2834593 2814380 2796551 2781145
61899 2781145 2768475 2758850 2752522 2749848 2751008 2755623 2763181 2773833 2788228 2806637 2828925 2855438
61887 2855438 2887045 2924048 2965896 3012390 3064320 3122263 3185413 3252389 3322690 3396527 3473590
61876 3473590 3552928 3633975 3716948 3802173 3889652 3979207 4070337 4161791 4251971 4340283 4427964
61865 4427964 4517327 4610211 4707165 4808040 4913353 5025114 5146270 5279401 5426252 5588500
61855 5588500 5768408 5968320 6189882 6434261 6702905 6997520 7319213 7667963 8043126
61846 8043126 8444539 8873322 9331598 9821132 10342145 10893689 11474732 12083577 12715272
61837A2715272O44225O41046O17291N67771M87943L77008K39458Q3497q0937k42608
61827A6049966l89896n13609o09214o76190p16249p32864p31062p15828o90446
61818A0274608o56907o17259n73725n28115m82089m37667l96509l58891l24086
61809E899360k91499k60881k32094k05472j81819j61104j41664j21882j02212
61800D200733q4417o8991n4685m0519k6974j4938m565M461J2479J9988K7363L3966
61788D003901L8292L9449L7950L4752L0090K3757J5975P573m91p475j2938j6793
61776D194042j9061j9589j8126j4647r357k649M566J0776J4814J6786J7463J6904
61764D191922J4468J0051M293k535j0650j9381k6695l1099l3233l4774l6144l6164
$$ plain form
61837 12715272 13359497 14000543 14617834 15185605 15673548 16050556 16290014 16373511 16292574 16049966
61827 16049966 15660070 15146461 14537247 13861057 13144808 12411944 11680882 10965054 10274608
61818 10274608 9617701 9000442 8426717 7898602 7416513 6978846 6582337 6223446 5899360
61809 5899360 5607861 5346980 5114886 4909414 4727595 4566491 4424827 4302945 4200733
61800 4200733 4116316 4047325 3992640 3952121 3925147 3910209 3905644 3910105 3922584 3942572 3969935 4003901
61788 4003901 4042193 4081642 4119592 4154344 4184434 4208191 4224166 4231739 4231248 4223773 4210835 4194042
61776 4194042 4174981 4155392 4137266 4122619 4113262 4110613 4115179 4125955 4140769 4157555 4175018 4191922
61764 4191922 4206390 4216441 4220734 4218199 4207549 4188168 4161473 4130374 4097141 4062367 4026223 3990059
61752C990059l3661k8576k1603j3510m908L932J3311K3810L5575M8020O0158P1107
61740D143714Q0605Q9470R9376J11516J25383J39276J52126J64420J77332J91515
61730E474733K07120K24367K43484K64249K86287L09870L35842L64675L96256
61721H106883M30908M69825N13741N61542O11227O62219P15862P73466Q34727
61712A3680400Q98479R63887J029793J093294J149801J194017J219412J216584
61704B2445667J173667J079960R29989P25069M72948J87359j12666m05367o70481
61695B5826145q93039j065155j185884j259614j293350j294052j267713j220229
61687A6347109j158150j087707j013203r36886q60401p85891p15534o50566n91169
$$ plain form
61752 3990059 3956398 3927822 3906219 3892709 3887801 3891733 3905044 3928854 3964429 4012449 4072607 4143714
61740 4143714 4224319 4313789 4413165 4524681 4650064 4789340 4941466 5105886 5283218 5474733
61730 5474733 5681853 5906220 6149704 6413953 6700240 7010110 7345952 7710627 8106883
61721 8106883 8537791 9007616 9521357 10082899 10694126 11356345 12072207 12845673 13680400
61712 13680400 14578879 15542766 16572559 17665853 18815654 20009671 21229083 22445667
61704 22445667 23619334 24699294 25629283 26354352 26827300 27014659 26901993 26496626 25826145
61695 25826145 24933106 23867951 22682067 21422453 20129103 18835051 17567338 16347109
61687 16347109 15188959 14101252 13088049 12151163 11290762 10504871 9789337 9138771 8547602
61678H547602n37052m87792m42854m01764l64259l30109k98995k70912k46311
61669E167554k25247k06545j88580j70952j54737j40981j29679j20460j13380
61660C716993j08371j04598j01205r8198r5793r3223q9294q4175p9510p6317p3623
61649B712686o9826o4869o0204n6811n4195n1547m9096m7521m6507m4851m2104
61638B125155l9297l7516l6521l5466l4423l4170l4599l4512l3168l1124k9287
61627A745072k7920k6919k6206k5417k4001k2184k0977k0628k0036j8477j6920
61616A495387j6447j6287j4910j2529j0790j0134r239p400n683n049m841m177
61604A377901l612m128n268n760n587o021p446q455p591n215k959j866j681j714
$$ plain form
61678 8547602 8010550 7522758 7079904 6678140 6313881 5983772 5684777 5413865 5167554
61669 5167554 4942307 4735762 4547182 4376230 4221493 4080512 3950833 3830373 3716993
61660 3716993 3608622 3504024 3402819 3304621 3208828 3115605 3026311 2942136 2862626 2786309 2712686
61649 2712686 2642860 2577991 2517787 2460976 2406781 2355234 2306138 2258617 2212110 2167259 2125155
61638 2125155 2085858 2048342 2011821 1976355 1941932 1907762 1873163 1838651 1805483 1774359 1745072
61627 1745072 1717152 1690233 1664027 1638610 1614609 1592425 1571448 1550820 1530784 1512307 1495387
61616 1495387 1478940 1462653 1447743 1435214 1424424 1414290 1405051 1397651 1391968 1386919 1382078 1377901
61604 1377901 1374289 1370161 1364893 1359133 1353546 1347525 1340079 1331624 1324033 1318818 1315859 1313993 1312312 1310598
61590A310598j610j150PJ811L422L881L198K282J738J278M78n06j443k607m259
61575A317118n875o494n731l817j021K295N137O386O055N419N496N941N676M237
61561A340822K138J57j488l363o261j0243j4219j6802j7551j7157j6548j6186
61549A223299j6040j5629j4204j1559q775p455p922q744q415o978n566m745l911
61536A103356k215K49K337K734J188j034k033r24J417L276L771L590M119O006
61522A125837Q686J1405J4213J7481K0553K1999K1506K0786K1891K5193K9522
61511A339072L3621L6676L8181L8538L9330M1780M5034M7097M7245M6306M4823
61500A797703M2482L9439L6711L4783L3122L1453L0159K9061K7240K4720K2899
$$ plain form
61590 1310598 1308988 1307838 1307845 1309656 1313078 1316959 1320157 1322439 1324177 1325455 1325933 1325427 1323984 1321377 1317118
61575 1317118 1311243 1304749 1299018 1295201 1294180 1296475 1301612 1307998 1314053 1319472 1324968 1330909 1336585 1340822
61561 1340822 1342960 1343117 1341629 1338266 1332005 1321762 1307543 1290741 1273190 1256033 1239485 1223299
61549 1223299 1207259 1191630 1177426 1165867 1157092 1149637 1141715 1132971 1124556 1117578 1112012 1107267 1103356
61536 1103356 1101141 1101390 1103727 1106461 1107649 1106615 1104582 1103658 1105075 1108351 1112122 1115712 1119831 1125837
61522 1125837 1134523 1145928 1160141 1177622 1198175 1220174 1241680 1262466 1284357 1309550 1339072
61511 1339072 1372693 1409369 1447550 1486088 1525418 1567198 1612232 1659329 1706574 1752880 1797703
61500 1797703 1840185 1879624 1916335 1951118 1984240 2015693 2045852 2074913 2102153 2126873 2149772
61489B149772K2416K1939K0055J7218J4698J2704J0677Q488O103K894j359n421
61477B280184p760q264p834p028o178n930o230n456k143K869P506J1241J5236
61464B260213K0086K5201L0318L5844M1672M7195N2720N9206O6540P3828Q1623
61453B794446R1840J04727J17944J29633J40726J52864J65708J77985J89885K02582
61443D268340K16073K29328K42065K54394K64753K69938K67639K57671K40417
61434F510618K15474J82582J42859R8259N0511J572m5357q6564j19968j46045
61424F803941j66220j80764j88691j89688j85400j78418j70184j60406j48379
61415E235791j34252j18828j02811q6721p1206n6762m3157k9653j6023l067Q101
$$ plain form
61489 2149772 2172188 2194127 2214182 2231400 2246098 2258802 2269479 2277967 2284070 2286964 2285605 2280184
61477 2280184 2272424 2264160 2256326 2249298 2243120 2237190 2230960 2225504 2223361 2226230 2233736 2244977 2260213
61464 2260213 2280299 2305500 2335818 2371662 2413334 2460529 2513249 2572455 2638995 2712823 2794446
61453 2794446 2886286 2991013 3108957 3238590 3379316 3532180 3697888 3875873 4065758 4268340
61443 4268340 4484413 4713741 4955806 5210200 5474953 5744891 6012530 6270201 6510618
61434 6510618 6726092 6908674 7051533 7149792 7200303 7201875 7156518 7069954 6949986 6803941
61424 6803941 6637721 6456957 6268266 6078578 5893178 5714760 5544576 5384170 5235791
61415 5235791 5101539 4982711 4879900 4793179 4721973 4665211 4622054 4592401 4576378 4573311 4581412
61404D581412J7276K5434L3717M2202M9873N5885O0503O4463O7815O9940P0716
61393E139236P0846P0858P0373O8939O7138O6281O7075O8997P0871P1665P0809
61382E903088O8210O4266N9737N5307N1115M6681M1383L5183K8735K2598J6586
61371F392889J0218L711k077o780j1057j5690k0684k5536k9979l3967l7232l9373
61359F184443m0262m0074l9051l7369l5059l1875k7617k2851j8878j6547j5356
61348E859504j4243j2891j1725j0975j0450j0238j0766j1972j3044j3242j2505
61337E727453j0873p696j846P207J8753L1291M3722N6189O9729Q5079J02043J20091
61325F241142J39004J58547J77955J96529K14484K32331K49419K63905K74223
$$ plain form
61404 4581412 4598688 4624122 4657839 4700041 4749914 4805799 4866302 4930765 4998580 5068520 5139236
61393 5139236 5210082 5280940 5351313 5420252 5487390 5553671 5620746 5689743 5760614 5832279 5903088
61382 5903088 5971298 6035564 6095301 6150608 6201723 6248404 6289787 6324970 6353705 6376303 6392889
61371 6392889 6403107 6406818 6404741 6397961 6386904 6371214 6350530 6324994 6295015 6261048 6223816 6184443
61359 6184443 6144181 6104107 6065056 6027687 5992628 5960753 5933136 5910285 5891407 5874860 5859504
61348 5859504 5845261 5832370 5820645 5809670 5799220 5788982 5778216 5766244 5753200 5739958 5727453
61337 5727453 5716580 5708884 5707038 5714245 5732998 5764289 5808011 5864200 5933929 6019008 6121051 6241142
61325 6241142 6380146 6538693 6716648 6913177 7127661 7359992 7609411 7873316 8147539
61316H147539K79803K80065K73839K60222K39168K10630J73996J29461P9393K7519
61306A0101635k2949o9734j11089j46549j77774k06789k33001k53416k66392k73702
61296H340240k77860k78804k74773k65692k53823k41119k27600k12798j97444
61287F110327j82778j69030j55599j42371j29958j18702j08080r7342q6274p5168
61277D845025o4222n3176m1673k9905j8788r247j219O404J4629K3274L1151L7236
61265D739489M1503M4632M7034M8257M7432M4424M0346L6638L3640L0567K6895
61254E180857K3240K0337J7674J3967R004M269J464P95R49L46j864n589j0074
61241E255375j4561j9146k4841l2299m0633m8087n3913n8798o3180o6103o6497
$$ plain form
61316 8147539 8427342 8707407 8981246 9241468 9480636 9691266 9865262 9994723 10074116 10101635
61306 10101635 10078686 10008952 9897863 9751314 9573540 9366751 9133750 8880334 8613942 8340240
61296 8340240 8062380 7783576 7508803 7243111 6989288 6748169 6520569 6307771 6110327
61287 6110327 5927549 5758519 5602920 5460549 5330591 5211889 5103809 5006467 4920193 4845025
61277 4845025 4780803 4727627 4685954 4656049 4637261 4628014 4626795 4633199 4647828 4671102 4702253 4739489
61265 4739489 4780992 4825624 4872658 4920915 4968347 5012771 5053117 5089755 5123395 5153962 5180857
61254 5180857 5204097 5224434 5242108 5256075 5265079 5269348 5270812 5271607 5272556 5272902 5271038 5265449 5255375
61241 5255375 5240814 5221668 5196827 5164528 5123895 5075808 5021895 4963097 4899917 4833814 4767317
61230D767317o4955o2983o0760n7040n1630m6470m3224m0802l6693l0422k4248
61219D248090k0283j8139j5931j2667r003o262n314o065p397p736o172l027P42
61206D130836M435P843J1081J4583J8964K4497L0830L7319M3362M8378N1968N4490
61194D478586N7071O0684O5393P0619P5717Q0176Q3832Q7198R0779R3635R3337
61183E337027Q8043P7878O3490M4188J8938j1164m2965p3865j03001j29611j51631
61172E117327j66810j74543j76032j73201j67811j60901j52512j42377j31242
61163C671898j20921j12565j05498r8314r0626q3119p6259o9736o3123n6315m9344
61152B746078m2191l5020k8298k2588j8260j5319j3257j1210q458m896j053K429
$$ plain form
61230 4767317 4702362 4639379 4578619 4521579 4469949 4423479 4380255 4339453 4302760 4272338 4248090
61219 4248090 4227807 4209668 4193737 4181070 4172067 4165805 4160491 4154426 4147029 4139293 4133121 4130094 4130836
61206 4130836 4135271 4143114 4154195 4168778 4187742 4212239 4243069 4280388 4323750 4372128 4424096 4478586
61194 4478586 4535657 4596341 4661734 4732353 4808070 4888246 4972078 5059276 5150055 5243690 5337027
61183 5337027 5425070 5502948 5566438 5610626 5629564 5618400 5575435 5501570 5398569 5268958 5117327
61172 5117327 4950517 4775974 4599942 4426741 4258930 4098029 3945517 3803140 3671898
61163 3671898 3550977 3438412 3332914 3234600 3143974 3060855 2984596 2914860 2851737 2795422 2746078
61152 2746078 2703887 2668867 2640569 2617981 2599721 2584402 2571145 2559935 2551477 2546581 2545528 2547957
61140B547957N366Q207J1473J4978J7851J9613K0774K1906K2491K1493J8889J5633
61128B746631J2006P073K47p412j4162j9189k2634k4731k5770k6621k8398l1531
61116B565509l5618l9978m3869m6455m7328m7089m6878m7269m7986m8609m9012
61105B065418m9015m8270m6743m4931m3301m1702l9685l7182l4522l1821k8827
61094A619419k5631k3047k1608k0334j7442j2660p987n417m656m199m020n596
61082A466822r247j3088j5373j6406j7218j7527j6265j3474j0393p940o143m786
61070A318962l588j823J101M601P187Q059P850P676P995Q538Q866Q650P754O314
61056A398142M718L508L158L704M493M640L919K953K533L040M366N683N456K854
$$ plain form
61140 2547957 2553323 2561530 2573003 2587981 2605832 2625445 2646219 2668125 2690616 2712109 2730998 2746631
61128 2746631 2758637 2765710 2765957 2758545 2744383 2725194 2702560 2677829 2652059 2625438 2597040 2565509
61116 2565509 2529891 2489913 2446044 2399589 2352261 2305172 2258294 2211025 2163039 2114430 2065418
61105 2065418 2016403 1968133 1921390 1876459 1833158 1791456 1751771 1714589 1680067 1648246 1619419
61094 1619419 1593788 1570741 1549133 1528799 1511357 1498697 1490710 1485293 1480637 1476438 1472418 1466822
61082 1466822 1457575 1444487 1429114 1412708 1395490 1377963 1361698 1348224 1337831 1329891 1323748 1318962
61070 1318962 1315374 1313551 1314652 1319253 1326440 1334499 1342349 1350025 1358020 1366558 1375424 1384074 1391828 1398142
61056 1398142 1402860 1406368 1409526 1413230 1417723 1422363 1426282 1429235 1431768 1434808 1439174 1444857 1450313 1453167
61042A453167n51j861l91J098k62l999p454r430j0974j3008j5041j6240j6478
61029A358576j6059j5490j5404j5769j5426j3590j1454j0796j1219j0519q002
61018A214848n655n379o608p447o988n578l900k578j980j730j121l16k83j088
61004A164197j453n72O75J128R72J128J821K711L790N241O887Q487J0175J2038
60990A217225J3645J4423J4090J2590J0427R136J0223J3161J5598J6203J6103
60979A362824J6768J7930J8672J9255K0372K1681K2684K4112K6570K8621K8398
60968A607887K6946K7668L1906L7009L9833M0640M2123M5389M8573M9552M8902
60957B046428M9265N2041N5796N8396N9982O2622O7389P3242P9080Q5285R2415
$$ plain form
61042 1453167 1452616 1450755 1450364 1451462 1451200 1447201 1439747 1430317 1419343 1406335 1391294 1375054 1358576
61029 1358576 1342517 1327027 1311623 1295854 1280428 1266838 1255384 1244588 1233369 1222850 1214848
61018 1214848 1209193 1203814 1197206 1189759 1182771 1177193 1173293 1170715 1168735 1167005 1165884 1165568 1165285 1164197
61004 1164197 1162744 1162172 1162847 1163975 1164947 1166075 1167896 1170607 1174397 1179638 1186525 1195012 1205187 1217225
60990 1217225 1230870 1245293 1259383 1271973 1282400 1291536 1301759 1314920 1330518 1346721 1362824
60979 1362824 1379592 1397522 1416194 1435449 1455821 1477502 1500186 1524298 1550868 1579489 1607887
60968 1607887 1634833 1662501 1694407 1731416 1771249 1811889 1854012 1899401 1947974 1997526 2046428
60957 2046428 2095693 2147734 2203530 2261926 2321908 2384530 2451919 2525161 2604241 2689526 2781941
60946B781941R9779J06687J14069J23451J34796J46757J58628J70887J84079J98260
60936D219334K13476K29872K47304K65305K83135K99871L15346L31371L50755
60927F755769L74516M01615M32168M68807N13282N63690O17069O73052P32772
60918A1532740P96476Q65450R44568J039187J150599J278114J424186J593077
60910B0624397J786449K006069K259413K555097K894514L278208L714456M188525
60902D3307128M595850M724832M364692L478353K274607J092676K04496k85575
60894F3757059l97244k05460J49292M24130L35316k75820j319978k508719l533055
60885E6425521m214209m528707m544125m352553m039076l670779l291821k926157
$$ plain form
60946 2781941 2881720 2988407 3102476 3225927 3360723 3507480 3666108 3836995 4021074 4219334
60936 4219334 4432810 4662682 4909986 5175291 5458426 5758297 6073643 6405014 6755769
60927 6755769 7130285 7531900 7964068 8432875 8946157 9509847 10126916 10799968 11532740
60918 11532740 12329216 13194666 14139234 15178421 16329020 17607134 19031320 20624397
60910 20624397 22410846 24416915 26676328 29231425 32125939 35404147 39118603 43307128
60902 43307128 47902978 52627810 56992502 60470855 62745462 63838138 64042634 63757059
60894 63757059 63359815 63154355 63303647 63727777 64063093 63787273 62467295 59958576 56425521
60885 56425521 52211312 47682605 43138480 38785927 34746851 31076072 27784251 24858094
60877B4858094k585963k276566j997156j744157j516550j316008j142549r93559
60869A1285586q66936p61539o74265o00333n37296m85525m43662m06867l71202
60860F137961l37109l06717k80052k55969k34933k18312k05872j95935j87335
60851C915727j79519j71215j60858j48511j36128j25617j17177j09578j01684
60842B665440r3584q6337q0478p5138o9300o3573n9512n7137n4593n0812m7070
60831A927906m4990m4140m2852m0636l8432l6932l5837l4753l3725l2845l2058
60820A510706l1463l1175l0842k9836k8112k6440k5534k5226k4708k3503k1980
60809A211887k0774j9856j8536j6517j4461j2999j1584r082n462k157m90k80l7
$$ plain form
60877 24858094 22272131 19995565 17998409 16254252 14737702 13421694 12279145 11285586
60869 11285586 10418650 9657111 8982846 8382513 7845217 7359692 6916030 6509163 6137961
60860 6137961 5800852 5494135 5214083 4958114 4723181 4504869 4298997 4103062 3915727
60851 3915727 3736208 3564993 3404135 3255624 3119496 2993879 2876702 2767124 2665440
60842 2665440 2571856 2485519 2405041 2329903 2260603 2197030 2137518 2080381 2025788 1974976 1927906
60831 1927906 1882916 1838776 1795924 1755288 1716856 1679924 1644087 1609334 1575609 1542764 1510706
60820 1510706 1479243 1448068 1417226 1387390 1359278 1332838 1307304 1282078 1257370 1233867 1211887
60809 1211887 1191113 1171257 1152721 1136204 1121743 1108744 1097160 1088078 1082616 1080459 1079969 1079689 1079652
60796A079652J733N259R033J0839R990Q331Q188R549J0505J0335J0518J2142J3897
60783A199971J3869J2201J0577R741Q966P767O720O383O336N687L936J128k269
60770A291013n402p376p993p968q240r113j0094j0498j0060r091q174p826q265
60757A180913r285j0303j0831j0920j0800j0089q137n484l939m387n262m414j909
60744A085153M08J787L225N148O400O318O169P329R117R841R332R207J0886J4154
60730A184474J7497J9288J8981J7642J6894J7036J6769J5135J2825J0963R592
60719A357096Q227P021O230N254L469J612J024J687K160J522K88o74j231j688
60705A391997k229k831l305l342k901k499k662l263l817m216m621m950n100n343
$$ plain form
60796 1079652 1081385 1086644 1095677 1106516 1116506 1124837 1133025 1142574 1153079 1163414 1173932 1186074 1199971
60783 1199971 1213840 1226041 1236618 1246359 1255325 1263092 1269812 1276195 1282531 1288218 1292154 1293282 1291013
60770 1291013 1285611 1278235 1270242 1262274 1254034 1244921 1234827 1224329 1214269 1205178 1197004 1189178 1180913
60757 1180913 1171628 1161325 1150494 1139574 1128774 1118685 1110548 1105064 1101125 1096738 1091476 1087062 1085153
60744 1085153 1085561 1087348 1090573 1095721 1102121 1108439 1114608 1121937 1131054 1140895 1150227 1159434 1170320 1184474
60730 1184474 1201971 1221259 1240240 1257882 1274776 1291812 1308581 1323716 1336541 1347504 1357096
60719 1357096 1365323 1372344 1378574 1383828 1387297 1388909 1389933 1391620 1393780 1395302 1395590 1394916 1393685 1391997
60705 1391997 1389768 1386937 1383632 1380290 1377389 1374890 1372228 1368965 1365148 1360932 1356311 1351361 1346261 1340918
60691A340918n810n929n222m374m524n524n919m815k919j525j217j809k837l674
60677A284820l742k969j838p98P4P37R51M82o70k253l739m562m705m886n583o216
60661A245103n878m802m227m707n413n396m868m625m708m364l350k708l754o397
60647A179906q949r918r652r657j0567j1609j2082j2273j2535j2546j2202j2322
60635A045594j3470j4786j4960j3929j2622j1619j0992j0864j0942j0015p369
60624I14026m314k917l349l939l771l592l927l977l019j631o73K0J242L353N931
60609H89463P945Q252O807N338N725P637R035R024Q780R360J0353J1232J2242
60596A001193J3203J3192J2617J3785J7686K1654K2260J9610J6823J5909J6248
$$ plain form
60691 1340918 1335108 1329179 1323957 1319583 1315059 1309535 1303616 1298801 1295882 1294357 1293140 1291331 1288494 1284820
60677 1284820 1281078 1278109 1276271 1275473 1275547 1276284 1277235 1277717 1277047 1274794 1271055 1266493 1261788 1256902 1251319 1245103
60661 1245103 1239225 1234423 1230196 1225489 1220076 1214680 1209812 1205187 1200479 1196115 1192765 1190057 1186303 1179906
60647 1179906 1170957 1161039 1151387 1141730 1131163 1119554 1107472 1095199 1082664 1070118 1057916 1045594
60635 1045594 1032124 1017338 1002378 988449 975827 964208 953216 942352 931410 921395 914026
60624 914026 909712 906795 903446 899507 895736 892144 888217 884240 881221 879590 878917 878937 880179 883532 889463
60609 889463 897408 905660 912467 917805 923530 931167 940202 949226 958006 967366 977719 988951 1001193
60596 1001193 1014396 1027588 1040205 1053990 1071676 1093330 1115590 1135200 1152023 1167932 1184180
60585A184180J6725J7143J7295J6577J5163J4169J4019J3809J2833J1655J1109
60574A344677J1099J0940J0091Q118M864J180j368k341l203n431q446j0468j1033
60561A348679j1359j2238j2889j2515j1885j2236j3168j2946j0988q801p929p973
60549A213752p532o180m425k197J129N162Q404J0141J1299J2816J4238J4641J4038
60536A285286J2945J1307Q903O292M403L413K849K529K562K769K898L178L864
60523A353198M566M944N633P250Q734Q160N402K543J170N62o22k130k773k521
60509A394116k653m021o301q738j0696j1441j0517q710p803q672j0138j0244q437
60496A285745n935m144l355k957k347j207O04K960N395P583R730J2077J4123J5091
$$ plain form
60585 1184180 1200905 1218048 1235343 1251920 1267083 1281252 1295271 1309080 1321913 1333568 1344677
60574 1344677 1355776 1366716 1376807 1384925 1389789 1390969 1389601 1387260 1384057 1378626 1370180 1359712 1348679
60561 1348679 1337320 1325082 1312193 1299678 1287793 1275557 1262389 1249443 1238455 1229654 1221725 1213752
60549 1213752 1206220 1200040 1195615 1193418 1194547 1199709 1208113 1218254 1229553 1242369 1256607 1271248 1285286
60536 1285286 1298231 1309538 1318441 1324733 1329136 1332549 1335398 1337927 1340489 1343258 1346156 1349334 1353198
60523 1353198 1357764 1362708 1368341 1375591 1384325 1392485 1397887 1400430 1401600 1402162 1401540 1399410 1396637 1394116
60509 1394116 1391463 1387442 1381141 1372403 1361707 1350266 1339749 1331039 1323236 1314564 1304426 1294182 1285745
60496 1285745 1279810 1275666 1272311 1269354 1267007 1265800 1266404 1269364 1274759 1282342 1292072 1304149 1318272 1333363
60482A333363J5317J6418J9582K4160K8583L2253L5763L9626M3816M8641N4859
60471A692381O2339O9536P5176P9838Q4729Q9121R0310Q6356P7902O6740N3623
60460B528051L8433K1920O185o513j4713j7898j6770j3396r897o623k462K707
60448B509024O960Q392P315N587M552M553N729Q025J0800J3641J7354K3080L0716
60435B655728L9306M8654N9033O9612P9031Q7793R8089J10453J22368J31308J37636
60424C639011J43011J47383J49613J50517J53147J59949J71170J86230K05270
60415E105301K28824K57182K90621L29396L72734M18293M63040N04033N37418
60406H506842N56786N53460N19488M51073L49710K20741P1837q6690k41344l77824
$$ plain form
60482 1333363 1348680 1365098 1384680 1408840 1437423 1469676 1505439 1545065 1588881 1637522 1692381
60471 1692381 1754720 1824256 1899432 1979270 2063999 2153120 2243430 2329786 2407688 2474428 2528051
60460 2528051 2566484 2588404 2594589 2588076 2573363 2555465 2538695 2525299 2515402 2508779 2506317 2509024
60448 2509024 2515984 2524376 2531691 2537278 2541830 2546383 2552112 2560137 2570937 2584578 2601932 2625012 2655728
60435 2655728 2695034 2743688 2802721 2872333 2951364 3039157 3137246 3247699 3370067 3501375 3639011
60424 3639011 3782022 3929405 4079018 4229535 4382682 4542631 4713801 4900031 5105301
60415 5105301 5334125 5591307 5881928 6211324 6584058 7002351 7465391 7969424 8506842
60406 8506842 9063628 9617088 10136576 10587649 10937359 11158100 11229937 11143247 10901903 10524079
60396A0524079m85900n62209o08398o27624o23616o01724n68389n28818m85907
60387E431494m41582l98041l57098l19178k83786k50845k21079j95216j73198
60378B791471j54147j37060j21579j08060r6831q7456p9008p0987o3745n8021
60368A814577n4154n1621m9204m5893m1912l8535l6544l5257l3397l0605k7441
60357A370014k4291k1120j8243j6337j5484j4958j4265j3763j3785j3785j3007
60346A190976j1626j0545j0053r354p568m893k452j109p78q14q03p46p24p10o05
60331A128196j55J062L023M650M442K149n46j532l64J391J824M04j835l631m820
60316A134258o228q255j0075j0617r916q767p382n379l029j333o17j01P38J344
$$ plain form
60396 10524079 10038179 9475970 8867572 8239948 7616332 7014608 6446219 5917401 5431494
60387 5431494 4989912 4591871 4234773 3915595 3631809 3380964 3159885 2964669 2791471
60378 2791471 2637324 2500264 2378685 2270625 2173794 2086338 2007330 1936343 1872598 1814577
60368 1814577 1760423 1708802 1659598 1613705 1571793 1533258 1496714 1461457 1428060 1397455 1370014
60357 1370014 1345723 1324603 1306360 1290023 1274539 1259581 1245316 1231553 1217768 1203983 1190976
60346 1190976 1179350 1168805 1158752 1149398 1141830 1136937 1134485 1133376 1132598 1131784 1130981 1130235 1129511 1128801 1128196
60331 1128196 1128041 1129103 1132126 1136776 1141218 1143367 1142821 1141289 1140925 1142316 1144140 1144544 1142709 1139078 1134258
60316 1134258 1128030 1119775 1109700 1099083 1089167 1080400 1073018 1067639 1064610 1063277 1062660 1062559 1063297 1064641
60302A064641J098J72r85j962j866J10K953M263L421K663L658M799L910K056K005
60287A090936L785M792M092L582M406N104M416L621M497O691Q608R545R631Q813
60273A172519P436O825P926R848J0982J1019J0753J0476R809Q942Q830R987J1700
60260A297052J2629J1826R295N852K374r41m378p862j0776j2570j3033j2098j0142
60247A267228q368p827q051p729o729o098n854m644k219l78j84k8J892M436N013
60232A220460L364J706J439J722J450P71K26o7J86J660M237O639P903Q536R679
60217A269911J1622J3609J4822J5156J5224J5661J6257J6060J4753J3605J4217
60206A430897J6496J8723J9691J9966K0726K2260K3973K5434K6899K9045L2414
$$ plain form
60302 1064641 1065739 1065911 1064926 1062964 1061098 1061208 1064161 1068424 1071845 1074508 1078166 1082965 1086875 1088931 1090936
60287 1090936 1094721 1099513 1103605 1107187 1111593 1116697 1121113 1124734 1129231 1135922 1144530 1154075 1163706 1172519
60273 1172519 1179955 1186780 1194706 1204554 1215536 1226555 1237308 1247784 1257593 1266535 1275365 1285352 1297052
60260 1297052 1309681 1321507 1330802 1336654 1339028 1338087 1333709 1325847 1315071 1302501 1289468 1277370 1267228
60247 1267228 1258860 1251033 1242982 1235253 1228524 1222426 1216572 1211928 1209709 1209331 1209147 1209119 1211011 1215447 1220460
60232 1220460 1223824 1225530 1226969 1228691 1230141 1230912 1231138 1231071 1231257 1232917 1237154 1243793 1251696 1260232 1269911
60217 1269911 1281533 1295142 1309964 1325120 1340344 1356005 1372262 1388322 1403075 1416680 1430897
60206 1430897 1447393 1466116 1485807 1505773 1526499 1548759 1572732 1598166 1625065 1654110 1686524
60195A686524L6829M1382M5338M8962N2946N7187O0976O4540O9330P6174Q3805
60184B323993R0151R4791R9374J05528J13047J20440J26784J32451J37996J42975
60174C487530J46322J47601J47166J44947J40044J32061J22198J11985J01351
60165D681205Q9010P4778O0195M6396L2587J7516J797j2338k3212l0628l4874
60154D902432l6058l4767l2198k8803k3456j4954l996P389J8343K9984M3358N7731
60142D885005P1691Q5032R8332J11101J21821J29911J36244J41207J43426J41274
60132F065044J34776J25055J12604R7265P9574O0844M1815K2176J784j8465l7293
60121F685179n3908o7905p8865q6553r1036r2170q9406q2637p2820o1086m7407
$$ plain form
60195 1686524 1723353 1764735 1810073 1859035 1911981 1969168 2030144 2094684 2164014 2240188 2323993
60184 2323993 2414144 2508935 2608309 2713837 2826884 2947324 3074108 3206559 3344555 3487530
60174 3487530 3633852 3781453 3928619 4073566 4213610 4345671 4467869 4579854 4681205
60165 4681205 4770215 4844993 4905188 4951584 4984171 5001687 5003484 4991146 4967934 4937306 4902432
60154 4902432 4866374 4831607 4799409 4770606 4747150 4732196 4728200 4735589 4753932 4783916 4827274 4885005
60142 4885005 4956696 5041728 5140060 5251161 5372982 5502893 5639137 5780344 5923770 6065044
60132 6065044 6199820 6324875 6437479 6534744 6614318 6675162 6716977 6739153 6740937 6722472 6685179
60121 6685179 6631271 6563366 6484501 6397948 6306912 6214742 6125336 6042699 5969879 5908793 5861386
60110E861386l0922j1648Q903K9061M8226O6271Q2391R5429J05065J11792J15575
60099F481529J15397J10356J00661Q7328P1615N4985L8873K3923J0082k238j2064
60088G080447j9395k5442l0160l0738k4520j2765O49J4071K9433M8545P0404R3197
60076G193726J16697J41138J65494J88891K12680K39042K67984K97330L25404
60067I148386L52141L77699M01445M22358M39327M51017M56468M55773M49071
60058A2953685M34937M11038L76734L34059K85904K33950J78504J19507N7316
60049A5385634o737p0410j31586j89308k43146k91714l32607l63890l84897l95607
60039A2975732l96228l87543l70823l47148l17578k83972k48529k12084j73881
$$ plain form
60110 5861386 5830464 5818816 5827719 5856780 5905006 5971277 6053668 6149097 6254162 6365954 6481529
60099 6481529 6596926 6707282 6807943 6895271 6966886 7021871 7060744 7084667 7094749 7092511 7080447
60088 7080447 7061052 7035610 7005450 6974712 6950192 6937427 6938076 6952147 6981580 7030125 7100529 7193726
60076 7193726 7310423 7451561 7617055 7805946 8018626 8257668 8525652 8822982 9148386
60067 9148386 9500527 9878226 10279671 10702029 11141356 11592373 12048841 12504614 12953685
60058 12953685 13388622 13799660 14176394 14510453 14796357 15030307 15208811 15328318 15385634
60049 15385634 15378897 15308487 15176901 14987593 14744447 14452733 14120126 13756236 13371339 12975732
60039 12975732 12579504 12191961 11821138 11473990 11156412 10872440 10623911 10411827 10237946
60030A0237946j33608r2815n3729j7393J6230M6900P3649R5361J11217J20715
60020A0404473J23780J20765J12046R7873P8760N5735K9927K280k6171n4172q0820
60009A0864476j05885j29309j50779j70009j86901k01042k11493k17627k19770
60000I271661k18561k14110k06420j96211j84429j71063j55325j37085j17342
59991G671115r6974p5814n3510l0725q623J2471L3108N3266P1837Q7882J01731
59980G765764J14012J23964J29520J29093J22607J10767R4209P3737N0660K6232
59970H740565R70k4988n1147p6600j00496j22188j41052j56332j67035j72104
59960G729593j71269j65730j57268j46511j32970j16910r9846q2546o3954m3360
$$ plain form
60030 10237946 10104338 10011523 9957794 9940401 9956631 10003531 10077180 10172541 10283758 10404473
60020 10404473 10528253 10649018 10761064 10858937 10937697 10993432 11023359 11025639 10999468 10945296 10864476
60009 10864476 10758591 10629282 10478503 10308494 10121593 9920551 9709058 9491431 9271661
60000 9271661 9053100 8838990 8632570 8436359 8251930 8080867 7925542 7788457 7671115
59991 7671115 7574141 7498327 7444817 7414092 7405469 7417940 7451048 7504314 7576151 7664033 7765764
59980 7765764 7879776 8003740 8133260 8262353 8384960 8495727 8589936 8663673 8714333 8740565
59970 8740565 8741535 8716547 8665400 8588800 8488304 8366116 8225064 8068732 7901697 7729593
59960 7729593 7558324 7392594 7235326 7088815 6955845 6838935 6739089 6656543 6592589 6549229
59950F549229k2262k499J6483L6549N7674P8042R7093J16131J35630J54048J70071
59939G386189J83980J95761K03577K05330K00645J90147J74036J52546J26865
59930I019076R8542O8666L8379Q998j9294m7660p6287j02858j24645j41094j52938
59919H568885j59863j60936j56599j48270j36318j20344j01288q1240o1023l9777
59909G403227j7284N139K6489M7133O7134Q5175J00207J13028J25050J36252J45219
59898H236769J50601J51825J49027J43095J35204J25768J14363J01228Q8013P6358
59888I472251O6476N7963N1355M7985M8727N3681O2626P5141R0737J09704J33132
59877A0269778J61229J92279K24361K57443K92376L28350L62988L94760M23323
$$ plain form
59950 6549229 6526967 6524468 6540951 6577500 6635174 6713216 6810309 6926440 7062070 7216118 7386189
59939 7386189 7570169 7765930 7969507 8174837 8375482 8565629 8739665 8892211 9019076
59930 9019076 9117618 9186284 9224663 9233661 9214367 9166707 9090420 8987562 8862917 8721823 8568885
59919 8568885 8409022 8248086 8091487 7943217 7806899 7686555 7585267 7504027 7443004 7403227
59909 7403227 7385943 7391082 7417571 7464704 7531838 7617013 7717220 7830248 7955298 8091550 8236769
59898 8236769 8387370 8539195 8688222 8831317 8966521 9092289 9206652 9307880 9395893 9472251
59888 9472251 9538727 9596690 9648045 9696030 9744757 9798438 9861064 9936205 10026942 10136646 10269778
59877 10269778 10431007 10623286 10847647 11105090 11397466 11725816 12088804 12483564 12906887
59868A2906887M47134M62550M66235M57105M34874L98151L45370K76937J95281
59859A6390524J03583N929r1799j83026k63155l30499l84720m25335m51877m64512
59849A3905113m63981m51667m29990m02037l70161l35266k97677k58146k17653
59840A0678535j76781j36015r6419n9175k4339R315M2775P5140J04021J27529
59830A0544586J45485J58253J64862J63143J51775J31365J03045O6863K2566k8427
59820A1623516q2726j36717j87943k34923k76426l11105l37481l54537l62800
59811I338858l64426l61232l52966l38644l19341k98188k77281k56094k33534
59802F537152k10129j87304j65637j45106j26186j09528r5066q2543p2455o5341
$$ plain form
59868 12906887 13354021 13816571 14282806 14739911 15174785 15572936 15918306 16195243 16390524
59859 16390524 16494107 16500036 16408237 16225211 15962056 15631557 15246837 14821502 14369625 13905113
59849 13905113 13441132 12989465 12559475 12157438 11787277 11452011 11154334 10896188 10678535
59840 10678535 10501754 10365739 10269320 10210145 10185806 10195121 10237896 10313036 10417057 10544586
59830 10544586 10690071 10848324 11013186 11176329 11328104 11459469 11562514 11629377 11651943 11623516
59820 11623516 11540790 11404073 11216130 10981207 10704781 10393676 10056195 9701658 9338858
59811 9338858 8974432 8613200 8260234 7921590 7602249 7304061 7026780 6770686 6537152
59802 6537152 6327023 6139719 5974082 5828976 5702790 5593262 5498196 5415653 5343198 5277857
59792E277857o0453n6202n1853m7937m5106m3370m2246m0811l7791l2546k6118
59781D793424k0611j7464j6715j7789k0246k3886k8741l4935m2022m8607n3343
59770D469065n6120n7706n8339n7450n4679n0390m5091l8954l2042k4529j6666
59759C977099q730q59P408J6945K7948L9308M9613N8289O5222P0072P2886P4781
59747D449982P6821P8742P9976Q1242Q3441Q5181Q3344P6523O6307N4847M2904
59736E259310L1038K1008J4581J1897J2218J5487K1893L0492L9661M9060O0090
59725E566735P4175R1168J09742J28965J49023J70417J92896K15808K39414K65012
59715G203355K93145L22465L51072L78144M02731M21059M26425M12032L73410
$$ plain form
59792 5277857 5217404 5161202 5109349 5061412 5016306 4972936 4930690 4889879 4852088 4819542 4793424
59781 4793424 4772813 4755349 4738634 4720845 4700599 4676713 4647972 4613037 4571015 4522408 4469065
59770 4469065 4412945 4355239 4296900 4239450 4184771 4134381 4089290 4050336 4018294 3993765 3977099
59759 3977099 3968369 3967510 3974918 3991863 4019811 4059119 4108732 4167021 4232243 4302315 4375201 4449982
59747 4449982 4526803 4605545 4685521 4766763 4850204 4935385 5018729 5095252 5161559 5216406 5259310
59736 5259310 5290348 5311356 5325937 5337834 5350052 5365539 5387432 5417924 5457585 5506645 5566735
59725 5566735 5640910 5732078 5841820 5970785 6119808 6290225 6483121 6698929 6938343 7203355
59715 7203355 7496500 7818965 8170037 8548181 8950912 9371971 9798396 10210428 10583838
59706A0583838L09108K21556J18224J0440r0492j76310k41945k85047l06493l10119
59696I832760l00490k81056k54588k24106j92229j60181j28275r6956o6732l7543
59686H090604q835J9980M9220P8497J06481J31994J55616J79254K03931K29156
59676I235898K54710K81565L10238L39727L69189L99512M31963M66253N01353
59667A2590408N37452N75657O16152O57916P00016P42056P83476Q23178Q59604
59658A8885915Q90446R12748R24243R24365R13415Q91425Q59082Q19561P78374
59649B6799574P41014P10969O89582O77024O73016O76519O84690O92819O96388
59640C3041595O93000O80990O56599O14938N54694M79795L95252L03451K06323
$$ plain form
59706 10583838 10892946 11114502 11232726 11243166 11152674 10976364 10734419 10449372 10142879 9832760
59696 9832760 9532270 9251214 8996626 8772520 8580291 8420110 8291835 8194879 8128147 8090604
59686 8090604 8081769 8101749 8150969 8229466 8335947 8467941 8623557 8802811 9006742 9235898
59676 9235898 9490608 9772173 10082411 10422138 10791327 11190839 11622802 12089055 12590408
59667 12590408 13127860 13703517 14319669 14977585 15677601 16419657 17203133 18026311 18885915
59658 18885915 19776361 20689109 21613352 22537717 23451132 24342557 25201639 26021200 26799574
59649 26799574 27540588 28251557 28941139 29618163 30291179 30967698 31652388 32345207 33041595
59640 33041595 33734595 34415585 35072184 35687122 36241816 36721611 37116863 37420314 37626637
59631C7626637J09144J9239n8356j21645j68821j97396k06367j97095j71471j30665
59621C6503204p5982r610O5792J47509K33154L21837M14309N10322O06208O96577
59611C9413320P78062Q49446R08141R48325R62630R44035Q86266P84869O38964
59602D7114058M51292K27009k5490k92651n57327q03658j019797j196815j328393
59593D2568228j413133j455129j460576j435084j384805j317804j242316j165273
59585C1694108j094140j038373j006241j000062j015631j045199j079618j109067
59577B3305777j125019j122893j102427j065966j017288r61054r01192q39470
59569A5170468p76546p14082o54501n98867n46648m97684m52854m12428l75202
$$ plain form
59631 37626637 37735781 37755020 37696664 37575019 37406198 37208802 37002435 36805340 36633869 36503204
59621 36503204 36427222 36417612 36483404 36630913 36864067 37185904 37600213 38110535 38716743 39413320
59611 39413320 40191382 41040828 41948969 42897294 43859924 44803959 45690225 46475094 47114058
59602 47114058 47565350 47792359 47766869 47474218 46916891 46113233 45093436 43896621 42568228
59593 42568228 41155095 39699966 38239390 36804306 35419501 34101697 32859381 31694108
59585 31694108 30599968 29561595 28555354 27555292 26539661 25494462 24414844 23305777
59577 23305777 22180758 21057865 19955438 18889472 17872184 16911130 16009938 15170468
59569 15170468 14393922 13679840 13025339 12426472 11879824 11382140 10929286 10516858 10141656
59560A0141656l40055l07321k77831k51465k27385k05126j84698j66183j49897
59551H031695j36543j26537j19378j14267j11124j10308j11590j14185j17775
59542F969988j22527j27835j31953j33549j33087j31891j30227j27253j22524
59533E809142j16463j09246j00395q9978p9215o9190n9784n0464m1390l2767k3864
59522E036386j3886l563N371J2236J7948K3502K8814L3372L7219M0926M4958M9214
59510E312497N2977N5565N7403O0044O4530P0190P5907Q2046R0007J00159J11396
59499F132721J22715J34064J45657J57652J70651J85368K01509K18078K34840
59490G703255K52400K70591K88099L04102L18999L32972L44871L53200L57323
$$ plain form
59560 10141656 9801601 9494280 9216449 8964984 8737599 8532473 8347775 8181592 8031695
59551 8031695 7895152 7768615 7649237 7534970 7423846 7313538 7201948 7087763 6969988
59542 6969988 6847461 6719626 6587673 6454124 6321037 6189146 6058919 5931666 5809142
59533 5809142 5692679 5583433 5483038 5393060 5313845 5244655 5184871 5134407 5093017 5060250 5036386
59522 5036386 5022500 5018937 5024308 5036544 5054492 5077994 5106808 5140180 5177399 5218325 5263283 5312497
59510 5312497 5365474 5421039 5478442 5538486 5603016 5673206 5749113 5831159 5921166 6021325 6132721
59499 6132721 6255436 6389500 6535157 6692809 6863460 7048828 7250337 7468415 7703255
59490 7703255 7955655 8226246 8514345 8818447 9137446 9470418 9815289 10168489 10525812
59481A0525812L57230L53039L45061L33422L17355K96245K71713K46788K22104
59472A3268769J94629J61839J25827R1481O1470L5096J1729o905j8575k3078k1945
59461A3880337j6273n816R989L0788N5348Q2476J11142J39351J63496J79577J84910
59450A4815325J78064J57916J24168P8540K3687l9219j10022j86199k61876l31162
59440A4449222l90980m39800m75745m97748n07060n05619m94095m73267m46065
59431A0218843m15941l83917l49453l13584k78739k45641k12862j79797j47985
59422G690924j18856r1979o6224m1210j6957O642K9644N2318P5573R9676J22854
59411G742405J43023J60993J79758K00074K19051K33926K44865K52659K55902
$$ plain form
59481 10525812 10883042 11236081 11581142 11914564 12231919 12528164 12799877 13046665 13268769
59472 13268769 13463398 13625237 13751064 13842545 13904015 13939111 13950840 13943935 13925360 13902282 13880337
59461 13880337 13864064 13858248 13868237 13899025 13954373 14036849 14147991 14287342 14450838 14630415 14815325
59450 14815325 14993389 15151305 15275473 15354013 15377700 15338481 15228459 15042260 14780384 14449222
59440 14449222 14058242 13618442 13142697 12644949 12137889 11632270 11138175 10664908 10218843
59431 10218843 9802902 9418985 9069532 8755948 8477209 8231568 8018706 7838909 7690924
59422 7690924 7572068 7480089 7413865 7372655 7355698 7362340 7391984 7444302 7519875 7619551 7742405
59411 7742405 7885428 8046421 8226179 8426253 8645304 8879230 9124095 9376754 9632656
59402I632656K52537K42329K25627K00991J66687J23794P5449K3397l2283r0007
59392A0821177j45722j95874k39509k76734l06754l28636l42799l50472l52277
59383H282400l48265l38938l25578l09693k92559k74931k56853k38091k18925
59374E678567k00147j82217j65149j49285j35281j22855j10485r7102q3365p0628
59364D362053n9341m9232m0234l2036k3459j3758m271K942Q151J3887K1304K8482
59352D214488L3546L7892M4220N1997N7089N6341N1068M5371M2355M2909M7033
59341D724309N4579O4692P5844Q7178R9068J11653J23264J31302J34957J36536
59331E743382J39794J47271J59480J75833J95393K16798K38619K60420K83154
$$ plain form
59402 9632656 9885193 10127522 10353149 10554140 10720827 10844621 10920070 10943467 10911184 10821177
59392 10821177 10675455 10479581 10240072 9963338 9656584 9327948 8985149 8634677 8282400
59383 8282400 7934135 7595197 7269619 6959926 6667367 6392436 6135583 5897492 5678567
59374 5678567 5478420 5296203 5131054 4981769 4846488 4723633 4613148 4516046 4432681 4362053
59364 4362053 4302712 4253480 4213246 4181210 4157751 4143993 4139722 4142664 4150815 4164702 4186006 4214488
59352 4214488 4248034 4285926 4330146 4382143 4439232 4495573 4546641 4592012 4634367 4677276 4724309
59341 4724309 4778888 4843580 4919424 5006602 5105670 5217323 5340587 5471889 5606846 5743382
59331 5743382 5883176 6030447 6189927 6365760 6561153 6777951 7016570 7276990 7560144
59322G560144L08065L35511L65124L96772M30793M67388N06061N45732N85284
59313A1500874O24064O61639O96778P26764P48256P58909P57727P44042P17345
59304A7936398O78727O31622N80114N26789M72679M18813L66845L18229K73219
59295B2203435K30603J88119J43533R5713M4432j0794p0751j35039k01615k68428
59285B2219208l34284l97214m53466m99972n37070n67004n90333o05747o12927
59276A7621191o13318o07780n95722n77122n53574n26516m96093m62703m28166
59267A2760197l94400l62008l31086l02218k75764k51332k28931k09723j94672
59258A0210063j83363j74969j69294j65858j63061j59638j56257j54417j54154
$$ plain form
59322 7560144 7868209 8203720 8568844 8965616 9396409 9863797 10369858 10915590 11500874
59313 11500874 12124938 12786577 13483355 14210119 14958375 15717284 16475011 17219053 17936398
59304 17936398 18615125 19246747 19826861 20353650 20826329 21245142 21611987 21930216 22203435
59295 22203435 22434038 22622157 22765690 22861403 22905835 22895041 22824290 22689251 22487636 22219208
59285 22219208 21884924 21487710 21034244 20534272 19997202 19430198 18839865 18234118 17621191
59276 17621191 17007873 16400093 15804371 15227249 14673675 14147159 13651066 13188363 12760197
59267 12760197 12365797 12003789 11672703 11370485 11094721 10843389 10614458 10404735 10210063
59258 10210063 10026700 9851731 9682437 9516579 9353518 9193880 9037623 8883206 8729052
59249H729052j53821j51766j47338j40796j33109j25398j17735j08949r8260q6490
59239G465390p4894o3614n2290m1316l1252k1516j1045J17J1108K1849L3145M5398
59227G281080N8306P1707Q5502R8859J10859J22133J34620J49150J64063J76872
59217H453151J86642J94383K01326K07332K10919K10588K05770J96254J81133
59208A0247498J59345J31447R9694O5736K9273j0017n0202q8207j22718j54680
59198A0307169j85044k13264k38046k58331k73291k82229k84791k80924k70855
59189H020394k55734k37890k19423k00657j80980j60824j41584j23592j05709
59180F394001q7277o9129n2013l5136j7235J677K0551L8789N6637P4428R2388
$$ plain form
59249 8729052 8575231 8423465 8276127 8135331 8002222 7876824 7759089 7650140 7551880 7465390
59239 7465390 7390496 7326882 7274592 7233276 7202024 7180508 7169463 7169580 7180688 7202537 7235682 7281080
59227 7281080 7339386 7411093 7496595 7595454 7706313 7828446 7963066 8112216 8276279 8453151
59217 8453151 8639793 8834176 9035502 9242834 9453753 9664341 9870111 10066365 10247498
59208 10247498 10406843 10538290 10637984 10703720 10732993 10722976 10672774 10584567 10461849 10307169
59198 10307169 10122125 9908861 9670815 9412484 9139193 8856964 8572173 8291249 8020394
59189 8020394 7764660 7526770 7307347 7106690 6925710 6764886 6623302 6499710 6394001
59180 6394001 6306724 6237595 6185582 6150446 6133211 6134888 6155439 6194228 6250865 6325293 6417681
59169F417681J11180J31860J54948J79886K05701K32029K59220K87537L16572
59160H296614L45588L74115M01774M27528M49337M64653M71039M66475M49436
59151A2146559M18782L73492L13030K38615J53832O3143l0136j23497k13309k94690
59141A3045821l63693m18403m57698m80637m88052m83211m69588m48739m21358
59132I014442l89285l55169l20912k87599k56185k27081j99832j74426j52083
59123F651870j33334j16322r8719q0734o4409n0449l7791k5985j5863p537K55
59112F020982Q226J5467K0947K4801K7572K9326K9995K9579K7594K3314J6937
59101F274740R559J724o942j6383k5644l4182m2558n1125n8916o4511o7344o7629
$$ plain form
59169 6417681 6528861 6660721 6815669 6995555 7201256 7433285 7692505 7980042 8296614
59160 8296614 8642202 9016317 9418091 9845619 10294956 10759609 11230648 11697123 12146559
59151 12146559 12565341 12938833 13251863 13490478 13644310 13707453 13677317 13553820 13340511 13045821
59141 13045821 12682128 12263725 11806027 11325390 10837338 10354127 9884539 9435800 9014442
59132 9014442 8625157 8269988 7949076 7661477 7405292 7178211 6978379 6803953 6651870
59123 6651870 6518536 6402214 6303495 6222761 6158352 6107903 6070112 6044127 6028264 6020727 6020982
59112 6020982 6029208 6044675 6065622 6090423 6117995 6147321 6177316 6206895 6234489 6257803 6274740
59101 6274740 6284299 6286023 6279081 6262698 6237054 6202872 6160314 6109189 6050273 5985762 5918418 5850789
59089E850789o5722o2195n8054n4173n0591m6657m1749l5855k9624k3604j7380
59078E365185r897j013Q039J6250K4077L2172L9876M6388N2540N9777O7820P5247
59066E776461Q2075Q9776R8697J07431J15079J22196J29109J35233J40720J46759
59056F943536J53180J57528J57870J55207J51836J48485J44320J38880J32585
59047H283427J25886J19044J12330J05716R8801R1694Q5296Q0148P5696P1194
59037I249232O6294N9844M9037L1016N096k7212o3917j03476j44606j85985k25982
59026H709341k62241k91951l13119l25495l30134l28665l23056l15034l05004
59017E914642k92136k76115k58229k40179k22456k04647j86894j70296j55970
$$ plain form
59089 5850789 5785067 5722872 5664818 5610645 5560054 5513397 5471648 5435793 5406169 5382565 5365185
59078 5365185 5355288 5354275 5362314 5378564 5402641 5434813 5474689 5521077 5573617 5633394 5701214 5776461
59066 5776461 5858536 5948312 6047009 6154440 6269519 6391715 6520824 6656057 6796777 6943536
59056 6943536 7096716 7254244 7412114 7567321 7719157 7867642 8011962 8150842 8283427
59047 8283427 8409313 8528357 8640687 8746403 8845204 8936898 9022194 9102342 9178038 9249232
59037 9249232 9315526 9375370 9424407 9455423 9460519 9433307 9369390 9265914 9121308 8935323 8709341
59026 8709341 8447100 8155149 7842030 7516535 7186401 6857736 6534680 6219646 5914642
59017 5914642 5622506 5346391 5088162 4847983 4625527 4420880 4233986 4063690 3907720
59008C907720j44121j33876j23881j13420j03078r4011q6564q0143p4260o8864
58998B885502o3628n7934n1837m6178m1495l7694l4922l3575l3096l1906k9259
58987B423978k6123k3538k1055j7786j4260j2133j2165j3134j2837r996n369r66
58975B254616K003M107O268Q082Q536P854P264P240P363P630Q310Q736Q091P264
58961B353364P846R163Q709N920L131K016J595R37J088K594L504K124j29q50o
58946B401006J109K666N327P524O614K505k244n773q278j0256j1607j2655j4258
58933B361680j6397j7957j8107j6892j4593j1651q885o695m381j310J803M005
58921B250620N700P725R574J0350J0866J2823J6244J9643K2494K5599K9128L2387
$$ plain form
59008 3907720 3763599 3629723 3505842 3392422 3289344 3195333 3108769 3028626 2954366 2885502
58998 2885502 2821874 2763940 2712103 2665925 2624430 2586736 2551814 2518239 2485143 2453237 2423978
58987 2423978 2397855 2374317 2353262 2335476 2321216 2309083 2296918 2283784 2270947 2260951 2255582 2254616
58975 2254616 2256619 2260726 2266994 2275076 2283612 2291466 2298730 2305970 2313333 2320963 2329273 2338009 2346100 2353364
58961 2353364 2361210 2370373 2379082 2385002 2388133 2390149 2391744 2392681 2393769 2396363 2399867 2401991 2401862 2401012 2401006
58946 2401006 2402115 2404781 2410108 2417632 2424246 2426751 2424507 2418734 2410456 2400200 2388593 2375938 2361680
58933 2361680 2345283 2327326 2309219 2292327 2277734 2266083 2257198 2250503 2246122 2244812 2246615 2250620
58921 2250620 2256320 2264045 2273619 2283969 2294835 2307658 2323902 2343545 2366039 2391638 2420766 2453153
58909B453153L5552L9354M2867M3889M2336M1001M1933M3994M5165M5510M6369
58898B921123M8073N0016N1989N3927N5174N5562N6596O0063O5683P1481P6314
58887C566001Q0634Q4808Q8273R0934R4149R9213J05618J11961J18261J25977
58877D565829J35432J44682J51926J58316J66909J78971J92588K05183K16328
58868F116164K27629K40735K56058K72745K89544L06266L24560L46406L71600
58859H751707L97953M24237M51554M81120N12281N43942N76463O10529O45136
58850A3394922O78490P10240P40975P69855P94332Q11962Q20825Q18292Q01093
58841B0340986P66947P14973O44395N54233M44613L17638J76989K7877j22791
$$ plain form
58909 2453153 2488705 2528059 2570926 2614815 2657151 2698152 2740085 2784079 2829244 2874754 2921123
58898 2921123 2969196 3019212 3071201 3125128 3180302 3235864 3292460 3352523 3418206 3489687 3566001
58887 3566001 3646635 3731443 3819716 3910650 4004799 4104012 4209630 4321591 4439852 4565829
58877 4565829 4701261 4845943 4997869 5156185 5323094 5502065 5694653 5899836 6116164
58868 6116164 6343793 6584528 6840586 7113331 7402875 7709141 8033701 8380107 8751707
58859 8751707 9149660 9573897 10025451 10506571 11018852 11562794 12139257 12749786 13394922
58850 13394922 14073412 14783652 15524627 16294482 17088814 17900776 18721601 19539893 20340986
58841 20340986 21107933 21822906 22467301 23021534 23466147 23783785 23960774 23988651 23865860
58832B3865860k67735m01525n21003o23761p07381p70364q12794q35894q41817
58823A8083586q33877q15728p89881p57695p20890o81937o42674o03519n64569
58814A1672816n26665m90876m57469m26043l96390l68891l44105l21901l00992
58805H039484k79813k58269k38054k20722k05925j92186j78628j65077j51224
58796F149586j37058j23609j11805j00855q9297p7382o6789n7866m8831l8190
58786E297904k6449j4936m245N567J4587K3660L4245M6636N9137O9920P9099Q8228
58774E673353R8322J09175J20332J31792J43769J56272J69078J82092J95753K10775
58764G190713K27196K44045K60506K77216K95503L15635L36826L59014L83306
$$ plain form
58832 23865860 23598125 23196600 22675597 22051836 21344455 20574091 19761297 18925403 18083586
58823 18083586 17249709 16433981 15644100 14886405 14165515 13483578 12840904 12237385 11672816
58814 11672816 11146151 10655275 10197806 9771763 9375373 9006482 8662377 8340476 8039484
58805 8039484 7759671 7501402 7263348 7042626 6836701 6644515 6465887 6300810 6149586
58796 6149586 6012528 5888919 5777114 5676259 5586962 5509580 5442791 5384925 5336094 5297904
58786 5297904 5271455 5256519 5252274 5257841 5272428 5296088 5330333 5376969 5436106 5506026 5585125 5673353
58774 5673353 5771675 5880850 6001182 6132974 6276743 6433015 6602093 6784185 6979938 7190713
58764 7190713 7417909 7661954 7922460 8199676 8495179 8810814 9147640 9506654 9889960
58755I889960M10178M38513M67316M97488N30576N66168O01805O35566O67615
58746A4705185O98703P27959P52972P71577P82403P83503P71359P41935O92373
58737B1427969O21476N29429M18054K90889J52061N390j44475k90735m25878n44765
58727B2039415o45260p26205p86639q27232q50563q59105q54257q37839q12769
58718A4839546p81498p45291p05719o65103o24651n84184n44654n08660m77051
58709I202735m47366m17572l89086l63869l40800l17717k95221k75329k57708
58700F098067k40505k23812k09006j95374j80872j65784j52280j40543j28665
58691D461226j16428j05717r6862q7963p8558p0616o4850n9189n2162m4951l8759
$$ plain form
58755 9889960 10300138 10738651 11205967 11703455 12234031 12800199 13402004 14037570 14705185
58746 14705185 15403888 16131847 16884819 17656396 18438799 19222302 19993661 20735596 21427969
58737 21427969 22049445 22578874 22996928 23287817 23439878 23445268 23300793 23010058 22584180 22039415
58727 22039415 21394155 20667950 19881311 19054079 18203516 17344411 16490154 15652315 14839546
58718 14839546 14058048 13312757 12607038 11941935 11317284 10733100 10188446 9679786 9202735
58709 9202735 8755369 8337797 7948711 7584842 7244042 6926325 6631104 6355775 6098067
58700 6098067 5857562 5633750 5424744 5229370 5048498 4882714 4730434 4589891 4461226
58691 4461226 4344798 4239081 4142219 4054256 3975698 3905082 3840232 3781043 3728881 3683930 3645171
58680C645171l2972k7493k4244k4389k6252k7921l0045l4119l9577m4495m8048
58669C285616n0615n2434n3583n4495n5439n6130n6566n7213n8037n8510n8969
58658B673625o0351o2218o2893o2063o1344o1475o1089n9242n7008n5249n2872
58647B017821m8979m4840m1994l9947l7409l4486l1928k9580k7198k5578k5147
58636A630735k4652k2945k0966k0285k0651k0679k0022j9105j7587j4934j1883
58625A417026r614q006o216m395l220k129K23L870P273R126R328Q422P083O039
58611A434810N584N423N546O595Q503R618Q501O018M354M202M194K937N18k106
58597A504697m232n689o595p149p492p802q320q821q273n777j882J976N281Q534
$$ plain form
58680 3645171 3612199 3584706 3560462 3536073 3509821 3481900 3451855 3417736 3378159 3333664 3285616
58669 3285616 3235001 3182567 3128984 3074489 3019050 2962920 2906354 2849141 2791104 2732594 2673625
58658 2673625 2613274 2551056 2488163 2426100 2364756 2303281 2242192 2182950 2125942 2070693 2017821
58647 2017821 1968842 1924002 1882008 1842061 1804652 1770166 1738238 1708658 1681460 1655882 1630735
58636 1630735 1606083 1583138 1562172 1541887 1521236 1500557 1480535 1461430 1443843 1428909 1417026
58625 1417026 1407412 1399406 1393190 1388795 1385575 1383446 1383669 1387539 1394812 1403938 1413266 1421688 1428771 1434810
58611 1434810 1440394 1445817 1451363 1457958 1466461 1476079 1484580 1490598 1494952 1499154 1503348 1506285 1506803 1504697
58597 1504697 1500465 1494776 1488181 1481032 1473540 1465738 1457418 1448597 1440324 1434547 1432665 1434641 1439922 1448456
58583A448456J1552J3306J3970J5426J8822K2984K6252K8576L0733L2733L4385
58572A697195L6509M0197M5386N1154N6797O1831O5829O9220P3460P9399Q6296
58561B363273R3178J00224J07764J15117J21779J29048J38796J50967J63477J74560
58551C658183J84275J93814K03996K14437K23690K30302K33573K32864K26504
58542E601638K12532J90581J61802J26894Q5831L9900p731n4220r8233j38229
58532F120765j71485j96100k12629k22465k25958k23377k16342k06810j95494
58523D250105j82522j68551j54128j38982j23274j08537r6041q5120p4366o3737
58513C054847n4295m6586m0330l5172l0762k6651k2650j8693j4269r094m464k339
$$ plain form
58583 1448456 1460008 1473314 1487284 1502710 1521532 1544516 1570768 1599344 1630077 1662810 1697195
58572 1697195 1733704 1773901 1819287 1870441 1927238 1989069 2054898 2124118 2197578 2276977 2363273
58561 2363273 2456451 2556675 2664439 2779556 2901335 3030383 3169179 3320146 3483623 3658183
58551 3658183 3842458 4036272 4240268 4454705 4678395 4908697 5142270 5375134 5601638
58542 5601638 5814170 6004751 6166553 6293447 6379278 6419178 6411447 6357227 6258994 6120765
58532 6120765 5949280 5753180 5540551 5318086 5092128 4868751 4652409 4445599 4250105
58523 4250105 4067583 3899032 3744904 3605922 3482648 3374111 3278070 3192950 3118584 3054847
58513 3054847 3000552 2953966 2913636 2878464 2847702 2821051 2798401 2779708 2765439 2756345 2751881 2749542
58501B749542k809m366p064j3096k3251l5172m6378n6613o5742p1862p3759p3202
58489B276228p2444p1106o7863o3609o0285n7894n5137n1990m9153m5868m0959
58478A639920l5441l1664l0053k8848k6905k4735k2981k1565k0376j9276j7544
58467A360532j4670j1579r943j0367j1997j3468j3697j2536j1192j1021j1544
58456A228518j1056r499q667q907q090n131k056q05m00P21J914K158K591M538
58442A185829O891P999Q554J0063J2102J3559J4973J7088J8854J9496K0634K3448
58430A359490K5709K4923K2617K1830K1886J9596J4557R254M572p33o400j0461
58418A506840j2919j6085k0859k5531k8553k9897k9796k8745k8274k9012k8711
$$ plain form
58501 2749542 2746733 2742367 2735303 2722207 2698956 2663784 2617406 2560793 2495051 2423189 2349430 2276228
58489 2276228 2203784 2132678 2064815 2001206 1940921 1883027 1827890 1775900 1726747 1680879 1639920
58478 1639920 1604479 1572815 1542762 1513914 1487009 1462274 1439293 1417728 1397352 1378076 1360532
58467 1360532 1345862 1334283 1324340 1313973 1301976 1288508 1274811 1262275 1251083 1240062 1228518
58456 1228518 1217462 1207963 1199296 1190389 1182299 1177168 1175112 1174307 1173907 1174628 1176542 1178700 1181291 1185829
58442 1185829 1192720 1200719 1209273 1219336 1231438 1244997 1259970 1277058 1295912 1315408 1336042 1359490
58430 1359490 1385199 1410122 1432739 1454569 1476455 1496051 1510608 1519862 1524434 1523701 1517301 1506840
58418 1506840 1493921 1477836 1456977 1431446 1402893 1372996 1343200 1314455 1286181 1257169 1228458
58407A228458k5166k0277j7755j7523j6381j3804j2641j3617j3610j0787p542
58396A059355o401o179m354r50J947L103L046L095M308O550Q427Q972Q917R172
58382A099008R099Q001P151Q137J0248J1895J3441J5950J8270J8490J7416J7184
58370A254290J7250J5185J0902O466K203l087q323j0725j0523j1048j3428j4997
58358A234165j3810j1218q893o667m421k969j996N0L052N020N566O745R596J2459
58344A226679J3708J3735J3547J3550J3956J4173J2088O639N56k572l456n709
58332A316894r672j1826j0664q796q348q263p474p057p685p988o740m185n83L778
58318A221391P064P418O182O261P485P318N895N995P855Q787Q437R502J2277J3508
$$ plain form
58407 1228458 1203292 1183015 1165260 1147737 1131356 1117552 1104911 1091294 1077684 1066897 1059355
58396 1059355 1052954 1046775 1042421 1041471 1043418 1046521 1049567 1052662 1056970 1063520 1071947 1080919 1089836 1099008
58382 1099008 1108107 1116108 1123259 1131396 1141644 1153539 1166980 1182930 1201200 1219690 1237106 1254290
58370 1254290 1271540 1286725 1297627 1304093 1306296 1303209 1294886 1284161 1273638 1262590 1249162 1234165
58358 1234165 1220355 1209137 1200244 1193577 1189156 1186187 1184191 1184241 1187293 1192313 1197879 1204624 1214220 1226679
58344 1226679 1240387 1254122 1267669 1281219 1295175 1309348 1321436 1328075 1328631 1326059 1322603 1316894
58332 1316894 1307222 1295396 1284732 1275936 1267588 1259325 1251851 1244794 1237109 1229121 1222381 1218196 1217613 1221391
58318 1221391 1228455 1235873 1242055 1248316 1255801 1263119 1269014 1275009 1282864 1291651 1300088 1309590 1321867 1335375
58304A335375J2071J1002J2197J3775J4488J6029J8813K0076J8679J7563J8839
58293A508907K0396J9959J8789J8632J8631J7830J7478J8229J8151J5825J2641
58282A705468R998P181L922J969K194K996L136L323L809L663L434N030P954R513
58268A773590R652J1333J5017J7405J7187J7269J9474K1694K2327K3061K5129
58257A973138K7138K8487L0529L2773L2757L1226L2117L5502L6331L2598K8857
58246B321453K8738K9687K8451K6310K5295K4429K3281K4225K7696L0104K9793
58235B619462L0006L2701L4908L4634L4947L8313M2328M4784M7591N1835N4609
58224C066118N4768N6128O0843O5413O7508P0703P7661Q4664Q7997R0112R4343
$$ plain form
58304 1335375 1347446 1358448 1370645 1384420 1398908 1414937 1433750 1453826 1472505 1490068 1508907
58293 1508907 1529303 1549262 1568051 1586683 1605314 1623144 1640622 1658851 1677002 1692827 1705468
58282 1705468 1715466 1722647 1726569 1728538 1730732 1733728 1736864 1740187 1743996 1747659 1751093 1756123 1764077 1773590
58268 1773590 1783242 1794575 1809592 1826997 1844184 1861453 1880927 1902621 1924948 1948009 1973138
58257 1973138 2000276 2028763 2059292 2092065 2124822 2156048 2188165 2223667 2259998 2292596 2321453
58246 2321453 2350191 2379878 2408329 2434639 2459934 2484363 2507644 2531869 2559565 2589669 2619462
58235 2619462 2649468 2682169 2717077 2751711 2786658 2824971 2867299 2912083 2959674 3011509 3066118
58224 3066118 3120886 3177014 3237857 3303270 3370778 3441481 3519142 3603806 3691803 3781915 3876258
58213C876258R9018J01961J05219J10121J13118J11587J08414J06076J02158R5618
58203D929548R1162R1978R4401R5150R7425J04374J13238J21707J33184J49798
58193F021965J67151J82029J97999K17520K36474K52976K73048L00248L28142
58184H177552L50840L72420L97986M24397M48590M75957N11133N49313N85963
58175A2294151O25727O72031P18070P59007Q02792Q57166R15970R70593J024771
58166A9640278J085304J148550J209742J275021J349920J426673J497995J572524
58158C0206007J661389J761362J867261J987426K128384K278226K426274K586470
58150D6902799K779429L004497L252865L534766L868633M256269M693853N192550
$$ plain form
58213 3876258 3975276 4077237 4182456 4292577 4405695 4517282 4625696 4731772 4833930 4929548
58203 4929548 5020710 5112688 5207089 5302239 5399664 5504038 5617276 5738983 5872167 6021965
58193 6021965 6189116 6371145 6569144 6786664 7023138 7276114 7549162 7849410 8177552
58184 8177552 8528392 8900812 9298798 9723195 10171785 10647742 11158875 11708188 12294151
58175 12294151 12919878 13591909 14309979 15068986 15871778 16728944 17644914 18615507 19640278
58166 19640278 20725582 21874132 23083874 24358895 25708815 27135488 28633483 30206007
58158 30206007 31867396 33628758 35496019 37483445 39611829 41890055 44316329 46902799
58150 46902799 49682228 52686725 55939590 59474356 63342989 67599258 72293111 77485661
58142G7485661N762108O393257P087596P884849Q825605R908009J1115653J2455363
58134A46918101J3923021J5482533J7162851J9149840K1690894K4909739K8738156
58127B87975135L2840293L6281624L7265831L3703128K4643094J1362498l096849
58120D60974754j5632580k4525208k9634690l1718169l1746006l0566159k8773667
58113B68378275k6687554k4454403k2183639j9973262j7862124j5841166j3918201
58106A27457926j2130239j0500648r029049p721445o590854n626160m793374m070563
58098F6995594l453474k925874k454048k016194j611173j230423q44724m28850
58090E2030834K0444M99560J006501J517866J986073K399114K829319L352936
$$ plain form
58142 77485661 83247769 89641026 96728622 104613471 113439076 123347085 134462738 146918101
58134 146918101 160841122 176323655 193486506 212636346 234327240 259236979 287975135
58127 287975135 320815428 357097052 394362883 428066011 452709105 464071603 460974754
58120 460974754 445342174 420816966 391182276 359464107 327718101 297151942 268378275
58113 268378275 241690721 217236318 195052679 175079417 157217293 141376127 127457926
58106 127457926 115327687 104827039 95797990 88076545 81485691 75859531 71066157 66995594
58098 66995594 63542120 60616246 58162198 56146004 54534831 53304408 52459684 52030834
58090 52030834 52051278 52550838 53557339 55075205 57061278 59460392 62289711 65642647
58082F5642647L868564M024610L415164J915864j63743k270177l947350n019664
58074F7465915n531904n608938n384465m986200m515139m028477l555796l122055
58066C0732941k742509k411068k114244j850631j624330j429196j255003j102251
58058A6203709r76688q74792p87801p15176o61406o23031n90308n58722n28946
58049I886839m98746m64835m29843l98663l70493l42116l15404k93973k76463
58040F496303k60701k49811k46052k43226k33959k20398k09106j99560j87133
58031D446357j73633j64877j60126j53530j44485j37597j33598j28717j22249
58022C127545j16886j12383j06256r9760r6030r3414q7837q0625p6679p5589p1926
$$ plain form
58082 65642647 69511211 73535821 76950985 78866849 78703106 76432929 72485579 67465915
58074 67465915 61934011 56325073 50940608 45954408 41439269 37410792 33854996 30732941
58066 30732941 27990432 25579364 23465120 21614489 19990159 18560963 17305960 16203709
58058 16203709 15227021 14352229 13564428 12849252 12187846 11564815 10974507 10415785 9886839
58049 9886839 9388093 8923258 8493415 8094752 7724259 7382143 7066739 6772766 6496303
58040 6496303 6235602 5985791 5739739 5496513 5262554 5042156 4833050 4633490 4446357
58031 4446357 4272724 4107847 3947721 3794191 3649706 3512109 3378511 3249794 3127545
58022 3127545 3010659 2898276 2792020 2692260 2596230 2502816 2414979 2334354 2257675 2182086 2110160
58011B110160o4074n6135n1035m7915m6040m5330m3470l8336l2782l1334l2889
58000A620820l2466k9315k7122k6913k6127k4499k4551k5976k5549k3059k1774
57989A333469k2464k2394k0797k0123k1049k1189j9628j8301j8031j7420j6107
57978A115966j5223j4266j1478p521m982m305l941m009n751p856p793o484p078
57965A015279r181r121o122l549l293l428k398j399j398j359n26M54J311K314
57951I77584K624J394K72J647M653O210N718N340O007O661P148Q256R166Q464
57937A051144P303P835Q925P425L362k57k527n202q229r358q626q783j0451j1103
57923A021458r825q991j0083j1612j2481j3708j5545j6179j4618j2069r569p053
$$ plain form
58011 2110160 2046086 1989951 1938916 1891001 1844961 1799631 1756161 1717825 1685043 1653709 1620820
58000 1620820 1588354 1559039 1531917 1505004 1478877 1454378 1429827 1403851 1378302 1355243 1333469
57989 1333469 1311005 1288611 1267814 1247691 1226642 1205453 1185825 1167524 1149493 1132073 1115966
57978 1115966 1100743 1086477 1074999 1067478 1062496 1058191 1054250 1050241 1044490 1036634 1028841 1022357 1015279
57965 1015279 1006098 996977 990855 987306 984013 980585 978187 976788 975390 974031 973505 973959 975270 977584
57951 977584 980208 981602 981874 983521 988174 994384 1000102 1005442 1011449 1018110 1025258 1033514 1042680 1051144
57937 1051144 1058447 1066282 1075207 1082632 1085994 1085737 1083210 1078008 1069779 1060421 1051795 1043012 1032561 1021458
57923 1021458 1011633 1002642 992559 980947 968466 954758 939213 923034 908416 896347 886778 879725
57911H79725n227n153n574l940o21J312Q98L04N83L11o83k56K096L895L668K687
57895H74025J440j764o874j0418j0147q332q098r112r155p738n872m066k474j590
57881G89825j333p02O95K221L715N592P188P290O660P536J0001J1385R929O489
57867H66491K109l189q439j1624j2741j4224j7105j9398j9497j8412j7304j5583
57855G11084j3078j1408j1403j1419r976q033o995o358n059l408k216j372m64
57842F19895N73K122M543O718O944N727N311N989N590L476K116L344N719O993
57828F85060O894O076M731L549L689M477L593Q21j151j040j207l693o906q457
57814F96436q711r042q916p393n580m989m914l863k218j302r83l02P48J838L474
$$ plain form
57911 879725 874498 869345 863771 859831 859210 860522 861420 861724 862307 862618 861935 861679 863775 867670 871338 874025
57895 874025 875465 873701 866827 856409 846262 837930 829832 820720 811565 803827 797955 793889 791415 789825
57881 789825 788492 787790 788485 790706 794421 800013 807201 814491 821151 828687 838688 850073 860002 866491
57867 866491 868600 865411 856972 845348 832607 818383 801278 781880 762383 743971 726667 711084
57855 711084 698006 686598 675195 663776 653800 645767 638772 632414 627355 623947 621731 620359 619895
57842 619895 620468 622590 627133 633851 640795 646522 651833 657822 663412 666888 669004 672348 678067 685060
57828 685060 691954 698030 702761 706310 709999 714476 718069 718890 717739 716699 715492 711799 704893 696436
57814 696436 687725 678683 669767 662374 656794 651805 646891 643028 640810 639508 638525 638223 638971 640809 644283
57799F44283N835P736Q416Q853R777R973Q342O074M904M635M166L450K663J028
57785G30135j592l532l798l952n478p000o601n288n345o434o382n040m503n687
57771F59503p278p991p623o111l640j623j511k697l351l158l395m460n434o098
57757E95133p381r325j0442r761q300p742q577j0061j1249j1663j1347j0604r511
57744D69170p857n682l473j594q7P77N16n36j076k45J528L450N317P048Q317R141
57728D84714J0015J1042J1946J3007J4605J5610J4160J0625P824P323P514O609
57716F14994N315M878M519L024J259O47L54j537m778p214p826p422o784o183o421
57701E86825q106r968r839p590n385m789n133n103m423l446k139k68K000M105
$$ plain form
57799 644283 650118 657854 666270 675123 684900 694873 703215 709289 714193 718828 722994 726444 729107 730135
57785 730135 728543 725011 721213 717261 711783 704783 698182 692894 687549 681115 674733 669693 665190 659503
57771 659503 652225 644234 636611 630500 626860 625237 623726 621029 617678 614520 611125 606665 601231 595133
57757 595133 587752 578427 567985 558224 549924 542182 533605 523544 512295 500632 489285 478681 469170
57744 469170 461313 455631 452158 450564 450477 451254 451770 451234 450158 449913 451441 454891 460208 467256 475573 484714
57728 484714 494729 505771 517717 530724 545329 560939 575099 585724 593548 600871 608385 614994
57716 614994 620309 625187 629706 632730 633989 634636 634990 633453 628675 621461 613635 606213 599429 593246 586825
57701 586825 578719 568751 558912 551322 545937 541148 536015 530912 526489 523043 520904 520636 522636 526741
57687E26741N536O188O413O445N956M796M064N164P474Q493P072N017M422M874
57673F08655M732L886L567M310N660P317R126J0566J1536J2801J4456J5024J3626
57660G25262J2043J2687J5298J7546J8465J9178K0468K1718K2425K3015K3735
57649I31840K4114K3955K3885K4727K7006L0775L5039L7893L8473L8400M0027
57638A276134M3597M7473N0692N3683N6563N8644N9981O1796O4766O8103P1077
57627A912509P4497P9825Q7443R6498J06156J16437J27737J39902J52212J64388
57617C057604J77194J91264K05554K17832K26810K32810K36031K35160K28201
57608E008460K13901J92264J64696J33417R8991N8132O379n5555j19634j75923
$$ plain form
57687 526741 532277 538465 544878 551323 557279 562075 566139 571303 578777 587270 594342 599359 603781 608655
57673 608655 613387 617273 620840 625150 630810 638127 647253 657819 669355 682156 696612 711636 725262
57660 725262 737305 749992 765290 782836 801301 820479 840947 862665 885090 908105 931840
57649 931840 955954 979909 1003794 1028521 1055527 1086302 1121341 1159234 1197707 1236107 1276134
57638 1276134 1319731 1367204 1417896 1471579 1528142 1586786 1646767 1708563 1773329 1841432 1912509
57627 1912509 1987006 2066831 2154274 2250772 2356928 2473365 2601102 2741004 2893216 3057604
57617 3057604 3234798 3426062 3631616 3849448 4076258 4309068 4545099 4780259 5008460
57608 5008460 5222361 5414625 5579321 5712738 5811729 5869861 5876240 5820685 5701051 5525128
57598E525128k18906k47811k63367k66824k60832k48568k32111k12967j93231
57589C380511j74492j56504j38626j21672j06663r2835p9080o6392n6561m8919
57579B338767m0810l1250k1950j4641r206m603Q5N714J2703K0415K7937L5215
57567B318376M2435M8954N4320N9646O6455P4758Q3792R3649J04377J14507J22808
57556C184077J30624J39707J48393J52949J52720J50494J47167J39267J23342
57547D468740J00169P2718M2015P279l0739o8574j02219j29609j51064j67741
57537D040975j79720j85900j86119j82425j77225j70885j62675j53339j44664
57528B498023j36740j27873j17404j06737r7118q8306q0022p2869o6997o1436
$$ plain form
57598 5525128 5306222 5058411 4795044 4528220 4267388 4018820 3786709 3573742 3380511
57589 3380511 3206019 3049515 2910889 2789217 2682554 2589719 2510639 2444247 2387686 2338767
57579 2338767 2297957 2266707 2244757 2230116 2220910 2216307 2216392 2222106 2234809 2255224 2283161 2318376
57567 2318376 2360811 2409765 2464085 2523731 2590186 2664944 2748736 2842385 2946762 3061269 3184077
57556 3184077 3314701 3454408 3602801 3755750 3908470 4058964 4206131 4345398 4468740
57547 4468740 4568909 4641627 4683642 4690921 4660182 4591608 4489389 4359780 4208716 4040975
57537 4040975 3861255 3675355 3489236 3306811 3129586 2958701 2796026 2642687 2498023
57528 2498023 2361283 2233410 2116006 2009269 1912151 1823845 1743823 1670954 1603957 1542521
57518A542521n5544m9883m4987m0534l6290l2624k9553k6485k3493k1512k0667
57507A160949j9678j7579j5027j3182j2185j1349j0052p973n152k219P7J641K838
57494A051109L845M936O915R987J2697J3467J2976J3306J5030J6873J8131J9463
57482A198735K1099K2378K3542K6081L0551L5576L9672M2601M4674M6425M9254
57471A580588N4423O0809O5656O8357P1461P6887Q3260Q8460R2915R8453J05141
57460B446410J11246J15540J17988J18466J16267J10784J01583Q7973O9316M5952
57450C441525J9496p846l4289n8965q1318r9960j12983j20091j23390j24805j23805
57439B573569j19283j12581j06203j00168r2482q3199p4916o8661o2326n4288
$$ plain form
57518 1542521 1486977 1437094 1392107 1351573 1315283 1282659 1253106 1226621 1203128 1181616 1160949
57507 1160949 1141271 1123692 1108665 1095483 1083298 1071949 1061897 1053924 1048772 1046553 1046630 1048271 1051109
57494 1051109 1054954 1059890 1066805 1076792 1089489 1102956 1115932 1129238 1144268 1161141 1179272 1198735
57482 1198735 1219834 1242212 1265754 1291835 1322386 1357962 1397634 1440235 1484909 1531334 1580588
57471 1580588 1635011 1695820 1761476 1829833 1901294 1978181 2061441 2149901 2242816 2341269 2446410
57460 2446410 2557656 2673196 2791184 2909650 3025917 3136701 3238284 3326257 3395573 3441525
57450 3441525 3461021 3453175 3418886 3359921 3278603 3178643 3065660 2945569 2822179 2697374 2573569
57439 2573569 2454286 2341705 2235502 2135334 2042852 1959653 1884737 1816076 1753750 1699462
57429A699462m5852l8683l2363k6227k1312j8395j5939j2089p328l280j71K688
57417A480511N199P117R404J3084J7611K1967K6589L2480L9176M5320N0713N6292
57405A805463O2379O8400P4074P9740Q5691R2025R8666J04828J09007J10092J07752
57394B798117J01294Q9420P2052N1122K8400L741k3176n0529p5361r6071j12574
57383B786435j24670j31969j34975j34831j32197j27406j21293j14862j08378
57374A655854j01685r4854q7857q0360p2709o6237o1562n7408n2318m6747m2179
57363H91938l8880l5966l3252l1446l0594k9498k7082k3610k0476j8925j8857
57352E83352j8802j7580j5827j4913j4573j3232j0797r138r097r087p859o640
$$ plain form
57429 1699462 1653610 1614927 1582564 1556337 1535025 1516630 1500691 1488602 1481274 1477994 1477823 1480511
57417 1480511 1485710 1492827 1502231 1515315 1532926 1554893 1581482 1613962 1653138 1698458 1749171 1805463
57405 1805463 1867842 1936242 2010316 2090056 2175747 2267772 2366438 2471266 2580273 2690365 2798117
57394 2798117 2899411 2988831 3060883 3112005 3140405 3144146 3120970 3070441 2995080 2899009 2786435
57383 2786435 2661765 2529796 2394821 2259990 2127793 2000387 1879094 1764232 1655854
57374 1655854 1554169 1459315 1371458 1291098 1218389 1152152 1090590 1033182 980864 934117 891938
57363 891938 853058 817092 783840 752394 721800 692302 665220 641610 621134 602209 583352
57352 583352 564550 546970 531143 516230 501657 488425 477628 468490 459393 450306 442447 435807
57340D35807o875p584p004n466m553m371l830k946k801l580m358m536m009k485
57326C71409j47J484J060o96k058k688l325l749l001j341j61j0k92q08j873k959
57310C50845l020k373k513l658m031k346K14J351K68j636k400j363M03J437J511
57295C32689J586K151K513K022J000n1j150k063k003r60k13m58n78N32K075K610
57279C39702K135J486P96J04L59J985L392K985J853K437M985P510Q848R602J0118
57264C98297R790Q654P878Q245R444J0975J2433J2893J1624R542Q608R584J1369
57251E29336J2485J2202J0617Q781Q372R991J2245J3718J5080J7736K1246K4042
57239F95851K6030K8382L1116L3138L4538L6566L9226M1098M1817M2568M3770
$$ plain form
57340 435807 428932 421348 414344 408878 404325 399954 396124 393178 390377 386797 382439 377903 373894 371409
57326 371409 371262 372746 373806 373110 371052 368364 365039 361290 358289 356948 356787 356777 356485 355677 353804 350845
57310 350845 347825 345452 342939 339281 335250 332904 333118 334469 334737 333101 330701 329338 329741 331178 332689
57295 332689 334275 336426 338939 340961 341961 341910 340760 338697 336694 335734 335521 335063 334485 335017 337092 339702
57279 339702 341837 343323 344119 344223 344582 346567 349959 352944 354797 357234 362219 369729 378577 388179 398297
57264 398297 408087 416741 424619 432864 442308 453283 465716 478609 490233 499775 508383 517967 529336
57251 529336 541821 554023 564640 573421 581793 591784 604029 617747 632827 650563 671809 695851
57239 695851 721881 750263 781379 814517 849055 885621 924847 965945 1007762 1050330 1094100
57228A094100M4362M3919M3667M4680M6741M9427N2596N5296N5983N4582N2802
57217A638155N1836N1187N0199M8933M6851M2439L5223K6740J8603J0824K969
57206B023959m360j0367j5313j9734k3140k4607k4286k3418k2878k2153j9865
57195A813838j5325r691n102k399l55K277M968O857Q841J2380J6819J9951K1095
57182A874154K1702K2834K4083K5221K6945K9360L1428L2615L3492L3995L2713
57171B188542K8950K4442K1843K2139K4191K6298K7766K9336L2417L7624M4179
57160B507727N0884N7036O2078O5490O7912P1126P5347P7734P5423O9086O1518
57149C241361N3663M4427L3796K3415J4240O105l56l897m774m253j808M639J5335
$$ plain form
57228 1094100 1138462 1182381 1226048 1270728 1317469 1366896 1419492 1474788 1530771 1585353 1638155
57217 1638155 1689991 1741178 1791377 1840310 1887161 1929600 1964823 1991563 2010166 2020990 2023959
57206 2023959 2019599 2009232 1993919 1974185 1951045 1926438 1902152 1878734 1855856 1833703 1813838
57195 1813838 1798513 1788822 1783720 1781321 1780966 1783243 1788211 1795068 1803909 1816289 1833108 1853059 1874154
57182 1874154 1895856 1918690 1942773 1967994 1994939 2024299 2055727 2088342 2121834 2155829 2188542
57171 2188542 2217492 2241934 2263777 2285916 2310107 2336405 2364171 2393507 2425924 2463548 2507727
57160 2507727 2558611 2615647 2677725 2743215 2811127 2882253 2957600 3035334 3110757 3179843 3241361
57149 3241361 3295024 3339451 3373247 3396662 3410902 3417007 3416651 3412754 3407980 3403727 3401919 3406558 3421893
57136C421893K8130M1650N6377P1877Q5625R5835J03250J09072J13096J14832
57126D241637J14528J12066J06726R8937R0662Q3220P6486P0738O7275O6229O5755
57115E194259O4372O2610O1512O1070O0666N9449N5980M9453M1661L5704L2227
57104E778963K9011K4654K0236J6760J3420R294M544q82p517j4616k0298k4250
57092E829319k7962l1761l4030l4140l3516l3046l1938k9961k8045k6089k3085
57081E495746k0495k2238l0012m1433n3901o7226q1220r4141j05370j16659j29109
57070D733942j41725j54517j69883j89258k11389k35648k64062k98413l38407
57061B730640l84168m37232m97350n61623B21718d78251p78071q64181r61414
$$ plain form
57136 3421893 3450023 3491673 3548050 3619927 3705552 3801387 3904637 4013709 4126805 4241637
57126 4241637 4356165 4468231 4574957 4673894 4764556 4847776 4924262 4995000 5062275 5128504 5194259
57115 5194259 5258631 5321241 5382753 5443823 5504489 5563938 5619918 5669371 5711032 5746736 5778963
57104 5778963 5807974 5832628 5852864 5869624 5883044 5892338 5896882 5896000 5888483 5873867 5853569 5829319
57092 5829319 5801357 5769596 5735566 5701426 5667910 5634864 5602926 5572965 5544920 5518831 5495746
57081 5495746 5475251 5453013 5423001 5381568 5327667 5260441 5179221 5085080 4979710 4863051 4733942
57070 4733942 4592217 4437700 4267817 4078559 3867170 3631522 3367460 3069047 2730640
57061 2730640 2346472 1909240 1411890 850267 221718 -478251 -1256322 -2120503 -3081917
57052c081917j073879j202042j343722j500861j679642j882335k105437k348129
57044a6217964k615778k912660l239635l603702m022040m510606n075043n717560
57036d7914988o444839p262186q164205r131957j0128936j1102805j2018361j2900405
57028a25068682j3804199j4690240j5331326j5405863j4740917j3479117j2001564
57021b24521908j0678353r662547q866103q085660p147632n963025m480595k624496
57013b82030319l07646K488592N663639R027669J2357635J5412396J7929403J9667463
57005a99791168K0490139K0416249J9595971J8244988J6584614J4802655J3033007
56998g6623545J1356515R817746Q439703P228267O175682N268806M494497L838282
$$ plain form
57052 -3081917 -4155796 -5357838 -6701560 -8202421 -9882063 -11764398 -13869835 -16217964
57044 -16217964 -18833742 -21746402 -24986037 -28589739 -32611779 -37122385 -42197428 -47914988
57036 -47914988 -54359827 -61622013 -69786218 -78918175 -89047111 -100149916 -112168277 -125068682
57028 -125068682 -138872881 -153563121 -168894447 -184300310 -199041227 -212520344 -224521908
57021 -224521908 -235200261 -244862808 -253728911 -261814571 -268962203 -274925228 -279405823 -282030319
57013 -282030319 -282337965 -279849373 -274185734 -265158065 -252800430 -237388034 -219458631 -199791168
57005 -199791168 -179301029 -158884780 -139288809 -121043821 -104459207 -89656552 -76623545
56998 -76623545 -65267030 -55449284 -47009581 -39781314 -33605632 -28336826 -23842329 -20004047
56990b0004047L283873K817183K427996K106499J841223J621412J438207J282716
56982c184938J146285a014644i9481G19729P33808O57097N89208N30296M79431
56973C709569M35951L99677L69273L42509L18375K96948K77169K57163K36792
56964F643426K17536J99645J81727J63232J44963J26888J07747Q7184O6025M4323
56954G982696K1515j111k0442l4773m5255n3972o2456p2063q3541r5692j06370
56943G428536j15081j22947j30356j36712j42278j47678j51550j51276j46429
56934F184229j39095j30616j20642j09192r5883p6928m8629j7905n682l3397j03964
56923E302296j97113k83336l42019l69078l72180l61396l43262l20798k96309
$$ plain form
56990 -20004047 -16720174 -13902991 -11474995 -9368496 -7527273 -5905861 -4467654 -3184938
56982 -3184938 -2038653 -1014644 -99481 719729 1453537 2110634 2699842 3230138 3709569
56973 3709569 4145520 4545197 4914470 5256979 5575354 5872302 6149471 6406634 6643426
56964 6643426 6860962 7060607 7242334 7405566 7550529 7677417 7785164 7872348 7938373 7982696
56954 7982696 8004211 8003100 7982658 7947885 7902630 7848658 7786202 7714139 7630598 7534906 7428536
56943 7428536 7313455 7190508 7060152 6923440 6781162 6633484 6481934 6330658 6184229
56934 6184229 6045134 5914518 5793876 5684684 5588801 5511873 5463244 5445339 5439657 5406260 5302296
56923 5302296 5105183 4821847 4479828 4110750 3738570 3377174 3033912 2713114 2416805
56914B416805k72255k49749k28145k06891j86668j67988j50073j32081j14507
56905G08448r8252q3217o9009n6302m6114l8033l0334k1951j3455o168j118R85
56893B45480m24n355j2614j9852k4517k5288k2850j9261j6396j4943j4411j3564
56881E6005j1002o197l23M403O665P199P913J0074J3584J7544K1043K3325K3568
56868A73801K0961J5315P535q01q364j4386j8267j9540j8548j6616j5038j4101
56856I1951j3254j1904r773p077m649l443l340k988j342R78K443K388J442N23
56842D1955J19L95J395K952M797O752Q642J0108J0759J0470R531Q594Q291Q625
56828A33385Q953R031R614J1211J2558J1632Q055L344j250n558r005j0176q708
$$ plain form
56914 2416805 2144550 1894801 1666656 1459765 1273097 1105109 955036 822955 708448
56905 708448 610196 526979 457970 401668 355554 317521 287187 265236 251781 245613 244495 245480
56893 245480 245056 239701 227087 207235 182718 157430 134580 115319 98923 83980 69569 56005
56881 56005 45003 38806 38483 42886 49551 56750 64663 74737 88321 105865 126908 150233 173801
56868 173801 194762 210077 217612 216811 208447 194061 175794 156254 137706 121090 106052 91951
56856 91951 78697 66793 57020 49943 45294 41851 38511 35523 34181 35159 37602 39990 41432 41955
56842 41955 42074 42469 43864 46816 51613 58365 67007 77115 87874 98344 107875 116469 124760 133385
56828 133385 142338 151369 160983 172194 184752 196384 204439 207783 206533 200975 191970 181794 173086
56815A73086o175m141k635j255k38O70K893P138J2170J6784K1635K7535L3355
56802B80822L7567M0849M4960M9588N2239N0902M5156L5255K2215Q612k656j0596
56790F54913j5825j8566j8533j6445j3550r771m182K621Q619J3098J7452K2868
56778F22699K8936L5108M1871M9807N8737O7974P5797P8223P0489N1295K4810
56767A205746k373k5640m3351n5284o1627o3085o0742n5691m9028m1828l4715
56756G12382k7721k0694j3434n606K916J1621J9995K8447L7567M6372N2292N3068
56744H97205M7893L6633J9619r54k0605l5127m3618m8137n0550n0613m7479m2171
56732F62096l7321l4180l1033k5516j7924j0836n740j656K634P013J1408J6611
$$ plain form
56815 173086 166911 162770 160135 158880 158642 159312 162205 169343 181513 198297 219932 247467 280822
56802 280822 318389 359238 404198 453786 506025 556927 602083 637338 659553 668165 665509 654913
56790 654913 639088 620522 601989 585544 571994 562223 558041 560662 569281 582379 599831 622699
56778 622699 651635 686743 728614 778421 837158 905132 980929 1059152 1129641 1180936 1205746
56767 1205746 1203373 1177733 1134382 1079098 1017471 954386 893644 837953 788925 747097 712382
56756 712382 684661 663967 650533 644927 647843 659464 679459 707906 745473 791845 844137 897205
56744 897205 945098 981731 1001350 1000396 979791 944664 901046 852909 802359 751746 704267 662096
56732 662096 624775 590595 559562 534046 516122 505286 499546 497890 500524 507537 518945 535556
56720E35556K2087K4675K1567J3710M335m858j4004k2528k8841l2489l4279l4375
56708D50556l2355k9182k6775k5313k3211k0197j8074j7624j7051j4716j1539
56697B14519r251p812o188m458l629l934m638n118n216m845l992k894j825r68
56683A49751n73o03l43Q54K376K893K228J534J505J549J138O67M74N3j034k322
56667A60147l054k954k034n07Q00Q08n63k188l053k970k060o04M29l1j504k100
56651A38562q35J147K101J506j25k203m094n014m625l326j796p67j120l187n795
56636A10429p049o420n169m587m787n350n918n834m399k021j75K88N8K88J371
56621F0725K892M062M222L627L497M425N253M758L723L730M509M574M044M339
$$ plain form
56720 535556 557643 582318 603885 617595 621930 617072 603068 580540 551699 519210 484931 450556
56708 450556 418201 389019 362244 336931 313720 293523 275449 257825 240774 226058 214519
56697 214519 205268 197456 191268 186810 183181 179247 174609 169491 164275 159430 155438 152544 150719 149751
56683 149751 149178 148575 148232 149086 151462 154355 156583 158117 159622 161171 162309 162976 163450 163503 162469 160147
56667 160147 157093 154139 152105 151598 152398 153206 152643 150455 147402 144432 142372 141768 142197 142166 140662 138562
56651 138562 137727 138874 140975 142481 142356 140153 136059 131045 126420 123094 121298 120531 119411 116224 110429
56636 110429 103380 96960 91791 87204 82417 77067 71149 65315 60916 58895 58720 59008 59066 59354 60725
56621 60725 63617 67679 71901 75528 79025 83450 88703 93461 97184 100914 105423 109997 114041 118380
56607A18380N156M455J922j26j49P87J494K514M191N196M531L145K074P95j127
56592A53238k469k066n72Q32K017K866K476R35K09J532L304L421K239J462J402
56577A70826J314J257J703K101J565L27q89k007k891k730j509p72j371j918j240
56562A63766p66k312m821n769m765l371k152m89J171J384R2j127j226m44P78K038
56546A41987K538K001J586K249K993K479J542J809K721K470J417J760L691M745
56532A75988L495J424L72K83M33R03J759K286K050J540J096M25l27l07O63J628
56516A93711J972K248K933L486L211K371J974K900N234P757Q441O481L659K585
56502B48963L847O052Q088R809J0684R928Q182P229P633Q233Q376Q856R962J0357
$$ plain form
56607 118380 123536 127991 129913 129787 129638 130425 131919 134433 138624 143820 148351 151496 153570 154365 153238
56592 153238 150769 148703 148131 148963 150980 153846 156322 157257 157466 158998 162302 165723 167962 169424 170826
56577 170826 172140 173397 175100 177201 178766 179093 178204 176197 173306 170576 169067 168295 166924 165006 163766
56562 163766 163000 160688 155867 150098 145333 141962 139810 139321 140492 141876 141968 140841 139615 139171 139949 141987
56546 141987 144525 146526 148112 150361 153354 155833 157375 159184 161905 164375 165792 167552 171243 175988
56532 175988 179483 180907 181279 181562 181995 182898 184657 186943 188993 190533 191629 192054 191727 191420 192083 193711
56516 193711 195683 197931 200864 204350 207561 209932 211906 214806 220040 227797 236238 242719 246378 248963
56502 248963 252810 258862 266950 276759 287443 297371 305553 312782 320415 328648 337024 345880 355842 366199
56488C66199Q897O243L769K043J183J476K646L492L242K544K200J764K57k378
56474D03577n249p374p964o597l965j924j978l873o174p755q272p653o047m192
56460C24560l260l952n817p534p981p172n940m791l530k204j524j705j764j049
56446B66337p05k216m861o309n768m877n066n523m761k965j573j230j267j060
56432B18156q68j073j230m70J178K440K262J302J109J949K559K418K722M221N423
56417B42098M568K393J184J555K058J758J396J762K669L872N501P098P559O660
56403B92131N522N145N391N780O134O099N245M144M131N339O133N337M001L938
56389C64470N182O051N461M091L156K730J707o12l289m512l638j858m16J022L229
$$ plain form
56488 366199 375096 381339 385108 387151 388334 389810 392456 395948 399190 401734 403934 405698 405955 403577
56474 403577 398328 390954 382990 376393 372428 370504 368526 364653 358479 350724 342452 334799 328752 324560
56460 324560 321300 317348 311531 303997 296016 288844 282904 278113 274583 272379 270855 269150 267386 266337
56446 266337 265632 263416 258555 252246 246478 241601 236535 231012 226251 223286 221713 220483 219216 218156
56432 218156 217288 216215 214985 214515 215693 218133 220395 221697 222806 224755 227314 229732 232454 236675 242098
56417 242098 246666 249059 250243 251798 253856 255614 257010 258772 261441 265313 270814 277912 285471 292131
56403 292131 297653 302798 308189 313969 320103 326202 331447 335591 339722 345061 351194 356531 360532 364470
56389 364470 369652 375703 381164 385255 388411 391141 392848 392236 388947 384435 380797 378939 378523 379545 382774
56374C82774N239M880J700k002l730l425k897l335m291m799m649m309m055l679
56360C53422l084k741l075l643l582k886k404k506k666k670l046l759l811k893
56346C10656k282l039m371n006n099n354n262l943k000q66p42p49o66q70r69j49
56330B69289J282K258K572K767K800K475K605L905N122M335J913O6l87o17j037
56315B99348n34J070K091J561P82J156K129K432K101K093K837M023N062N214M086
56300C35451K403J424J380J390R39M11K16N98K215N307Q284Q905P141N236M495
56285C85795L893K474J344K052M351O682Q158R036R804J0435J0329Q971O914N656
56271D75894N790O114N575N117N953P088O783N737O123P742Q171O895O340P968
$$ plain form
56374 382774 388013 392893 394593 392591 388861 385436 382539 379204 374913 370114 365465 361156 357101 353422
56360 353422 350338 347597 344522 340879 337297 334411 332007 329501 326835 324165 321119 317360 313549 310656
56346 310656 308374 305335 300964 295958 290859 285505 280243 276300 274300 273434 272692 271943 271277 270407 269438 269289
56330 269289 270571 272829 275401 278168 280968 283443 286048 289953 295075 299410 301323 301389 301002 300385 299348
56315 299348 298814 299884 301975 303536 304318 305474 307603 310035 312136 314229 317066 321089 326151 331365 335451
56300 335451 337854 339278 340658 342048 342987 343398 343614 344212 346427 351734 360018 368923 376064 381300 385795
56285 385795 389688 392162 393506 395558 399909 406591 414749 423785 433589 444024 454353 463324 470238 475894
56271 475894 481684 487798 493373 498490 504443 511531 518314 524051 530174 537916 546087 552982 559322 567290
56257E67290J0211J1339J1795J2407J2715J2522J2880J3991J4039J1849Q941P474
56245G07453P639Q394R163R354P914N003K698K479L343L733L842M354M457L172
56231G82998J621J859L942N828O001M945M234N200Q205J2299J5827J7884J8876
56218H89719J9656K0744K2511K4951K7193K8438K9548L2246L6531M0542M3311
56207A215390M5931M9468N3636N8144O3392O9034P3854P7983Q3271R0359R7389
56196A977851J02885J07912J13949J20327J25465J29058J31620J33203J33969
56187C076239J34464J33898J29657J20147J06879R2351P7171O0609M2629K3926
56177C997970N191j2317k6817l7998m7598n6708o4032o8255p0504p2693p4837
$$ plain form
56257 567290 577501 588840 600635 613042 625757 638279 651159 665150 679189 691038 699979 707453
56245 707453 715092 723486 732649 742003 749917 754920 757618 760097 763440 767173 771015 775369 779826 782998
56231 782998 784619 786478 790420 796248 802249 807194 811428 816628 824833 837132 852959 870843 889719
56218 889719 909375 930119 952630 977581 1004774 1033212 1062760 1095006 1131537 1172079 1215390
56207 1215390 1261321 1310789 1364425 1422569 1485961 1554995 1628849 1706832 1790103 1880462 1977851
56196 1977851 2080736 2188648 2302597 2422924 2548389 2677447 2809067 2942270 3076239
56187 3076239 3210703 3344601 3474258 3594405 3701284 3793635 3870806 3931415 3974044 3997970
56177 3997970 4003161 3990844 3964027 3926029 3878431 3821723 3757691 3689436 3618932 3546239 3471402
56166C471402p5980p6581p7908p9825q1035q1208q1450q2823q5329q7938q9198
56155B572127q8554q7381q7495q8455q7874q4748q0540p6528p2285o7598o3491
56144A687178o0210n6392n1583m7354m4534m1670l7774l4224l2155l0238k7031
56133A224013k3445k0878j8919j6898j5629j5543j5046j2930j0543r401q519o326
56121A049936l412j273nP21M39l32P30M451Q253R876J0645J2466J4110J3755J2892
56106A133252J4052J6419J7414J7166J7792J9324J9996J9701J9751J9856J8679
56095A333402J6852J6359J7354J8385J9223K0700K2393K3285K4137K6494K9891
56084A568475L2771L5535L9929M5873N1775N7565O4786P3862Q3685R3639J03846
$$ plain form
56166 3471402 3395422 3318841 3240933 3161108 3080073 2998865 2917415 2834592 2749263 2661325 2572127
56155 2572127 2483573 2396192 2308697 2220242 2132368 2047620 1967080 1890552 1818267 1750669 1687178
56144 1687178 1626968 1570576 1518993 1471639 1427105 1385435 1347661 1313437 1281282 1251044 1224013
56133 1224013 1200568 1179690 1160771 1143873 1128244 1112701 1097655 1084725 1074182 1064781 1056262 1049936
56121 1049936 1046524 1045251 1045246 1045967 1046406 1046074 1046804 1051255 1059508 1069384 1080029 1092495 1106605 1120360 1133252
56106 1133252 1147304 1163723 1181137 1198303 1216095 1235419 1255415 1275116 1294867 1314723 1333402
56095 1333402 1350254 1366613 1383967 1402352 1421575 1442275 1464668 1487953 1512090 1538584 1568475
56084 1568475 1601246 1636781 1676710 1722583 1774358 1831923 1896709 1970571 2054256 2147895 2251741
56073B251741J13909J23715J35034J49969J68149J87149K05010K20387K31234
56064C786297K35549K33023K24356K09989J91176J70978J52091J34552J16808
56055E454819R7591P5401M8485J7439j3992m2327o6554q5693r7884j04428j11410
56044E171447j23747j40250j57305j73947j89625k00548k03165j99012j91777
56035C592071j81891j68222j52513j37437j22437j06223r1153q0284p2215o3878
56025B415818n6242n1911m9142m4183l8017l4644l3705l0847k5043j9715j6584
56014B015785j3701r820n932k375J411M547N994P272J0084J2766J3325J3888J7361
56001B070605K1867K3782K4173K6513L0101L1820L2331L4260L6239L5454L4177
$$ plain form
56073 2251741 2365650 2489365 2624399 2774368 2942517 3129666 3334676 3555063 3786297
56064 3786297 4021846 4254869 4479225 4689214 4880390 5051368 5203459 5338011 5454819
56055 5454819 5552410 5627811 5676296 5693735 5679743 5637416 5570862 5485169 5387285 5282857 5171447
56044 5171447 5047700 4907450 4750145 4576198 4386573 4186025 3982860 3783848 3592071
56035 3592071 3410180 3241958 3089445 2952008 2829571 2723348 2632195 2551911 2479696 2415818
56025 2415818 2359576 2307665 2258523 2214340 2176323 2141679 2107974 2077127 2052084 2032369 2015785
56014 2015785 2002084 1992264 1986332 1983957 1985368 1989915 1995909 2003181 2013265 2026031 2039356 2053244 2070605
56001 2070605 2092472 2116254 2140427 2166940 2197041 2228861 2261192 2295452 2331691 2367145 2401322
55990B401322L6581M0830M1789M0041M0452M3179M4282M4190M6828N1034N1741
55979B882269M9592N0402N4849N7830N8537O1765O8057P2092P2654P4996Q1015
55968C584058Q6100Q8319R1970R8862J04488J06212J07765J12472J18990J26292
55958D625528J35884J46936J56227J64668J76655J91752K04761K15083K27704
55949F245198K43975K60222K76595K97670L22690L44971L62972L82316M05275
55940I141884M28387M52270M82828N20371N58338N95209O36615O83457P29723
55931A4229082P74583Q24435Q79990R34071R85262J040843J102807J164494J224561
55922B3160128J290525J364694J440977J519302J608386J710563J819446J935553
$$ plain form
55990 2401322 2437903 2478733 2520522 2560563 2601015 2644194 2688476 2732666 2779494 2830528 2882269
55979 2882269 2931861 2982263 3037112 3094942 3153479 3215244 3283301 3355393 3428047 3503043 3584058
55968 3584058 3670158 3758477 3850447 3949309 4053797 4160009 4267774 4380246 4499236 4625528
55958 4625528 4761412 4908348 5064575 5229243 5405898 5597650 5802411 6017494 6245198
55949 6245198 6489173 6749395 7025990 7323660 7646350 7991321 8354293 8736609 9141884
55940 9141884 9570271 10022541 10505369 11025740 11584078 12179287 12815902 13499359 14229082
55931 14229082 15003665 15828100 16708090 17642161 18627423 19668266 20771073 21935567 23160128
55922 23160128 24450653 25815347 27256324 28775626 30384012 32094575 33914021 35849574
55914C5849574K067273K213547K364913K525723K714775K939543L191815L473963
55906E7341126L805567M197765M646004N153780N735507O390102P104508P892330
55898A02266689Q795162R838264J1024224J2376431J3938072J5717832J7697544
55891A91654218J9908277K2424883K5268366K8403804L1802364L5204713L7562383
55884C92229008L6910575L1355118K0602319O554524p702485j9573049k7878995
55877D32497015l2677086l4632518l4563916l3215346l1132242k8651734k5995533
55870B11628640k3335363k0776695j8354614j6089249j4020144j2175838j0549952
55863I6326785r127781p906932o876678o005651n266515m650061m143122l716010
$$ plain form
55914 35849574 37916847 40130394 42495307 45021030 47735805 50675348 53867163 57341126
55906 57341126 61146693 65344458 69990462 75144242 80879749 87269851 94374359 102266689
55898 102266689 111061851 120900115 131924339 144300770 158238842 173956674 191654218
55891 191654218 211562495 233987378 259255744 287659548 319461912 354666625 392229008
55884 392229008 429139583 460494701 481097020 487651544 479949059 460376010 432497015
55877 432497015 399819929 365187411 330623495 297408149 266275907 237624173 211628640
55870 211628640 188293277 167516582 149161968 133072719 119052575 106876737 96326785
55863 96326785 87199004 79292072 72415394 66409743 61143228 56493167 52350045 48634035
55855D8634035l344463l023448k748539k503749k278709k078972j908056j755781
55847B8992318j614125j488357j382368j287713j196819j113442j041061r73611
55839A8894822r06369q44233p91212p42588o94596o51126o14082n77731n39229
55830A2533656n04580m77851m54110m29082m06247l88629l72753l56225l42236
55821H801943l31255l17415k98454k80296k66710k53375k37267k22640k12222
55812F382309k01560j87871j75730j67981j59823j48358j39652j39311j43603
55803D918420j46748j49842j55441j60140j60062j57967j57756j56967j51490
55794C522007j43070j35604j28281j18584j08091r9447r1174q0906p0317o1853
$$ plain form
55855 48634035 45289572 42266124 39517585 37013836 34735127 32656155 30748099 28992318
55847 28992318 27378193 25889836 24507468 23219755 22022936 20909494 19868433 18894822
55839 18894822 17988453 17144220 16353008 15610420 14915824 14264698 13650616 13072885 12533656
55830 12533656 12029076 11551225 11097115 10668033 10261786 9873157 9500404 9144179 8801943
55821 8801943 8470688 8153273 7854819 7574523 7307813 7054438 6817171 6594531 6382309
55812 6382309 6180749 5992878 5817148 5649167 5489344 5340986 5201334 5062023 4918420
55803 4918420 4771672 4621830 4466389 4306249 4146187 3988220 3830464 3673497 3522007
55794 3522007 3378937 3243333 3115052 2996468 2888377 2788930 2697756 2616850 2546533 2484680
55784B484680n4255m6193m0874m2028m8170n5035o0667o4344o4063n9214n2797
55773A897040m7494m2534l7189l3384l1726k9349k5071k2264k2985k3949k2437
55762A558658k1545k4823k9888l2377l2541l2968l3158l1487k9607k9978l1221
55751A229065l0496k8218k6391k4625k1730j8893j7475j6048j3249j0961j0824
55740A010155j0434p035k484m51r64j804k916n308p637q153q225j0035j2509j3317
55726I18883j3090j3728j4313j2757j0083r114j0017j0698j0481j0056r028o932
55714G88586n373o014p678q435r098j1317j3886j4404j3286j2666j2450j1007
55702F62972q688p397p435p896r048j1210j2438j0788q062p810j0089j1462r869
$$ plain form
55784 2484680 2430425 2384232 2343358 2301330 2253160 2198125 2137458 2073114 2009051 1949837 1897040
55773 1897040 1849546 1807012 1769823 1736439 1704713 1675364 1650293 1628029 1605044 1581095 1558658
55762 1558658 1537113 1512290 1482402 1450025 1417484 1384516 1351358 1319871 1290264 1260286 1229065
55751 1229065 1198569 1170351 1143960 1119335 1097605 1078712 1061237 1045189 1031940 1020979 1010155
55740 1010155 999721 992686 990202 989751 988787 986983 984067 978759 971122 962969 954744 944709 932200 918883
55726 918883 905793 892065 877752 864995 854912 845798 835781 825083 814602 804546 795518 788586
55714 788586 783213 777199 769521 761086 751988 740671 726785 712381 699095 686429 673979 662972
55702 662972 654284 646887 639452 631556 622508 611298 598860 588072 580010 572200 562111 550649 540780
55689E40780o605l745k263k447l763m593m118l686m612n888o187o364p586q648
55675D70275q117p380q345r635q640o130n067n703n659m419l914m760n513n760
55661C81233o498p178n891l137k183m559p758q579o625l720j689j459k592l144
55647C16221j348K267N513P116P282O296M305K164P24m85k268l949m250l435k718
55632C33435k105p27J076K079K276K768L780M591N003N277N078M249L925N011
55618C75716O316N980M004J471j546n003p196o868o058p531j0191j0424p619m774
55604C26277l608k816j675j576k759l063j470j9l33r43pJ529J687N82k09k14r6
55587C11287j16j61n14j275j772j670j979l789o586q797r512q924p617o258n614
$$ plain form
55689 540780 534175 530430 528167 525720 521957 517364 513246 509560 504948 499060 492873 486509 478923 470275
55675 470275 462158 454778 446433 436798 428158 422028 416961 411258 405599 401180 397266 392506 386993 381233
55661 381233 374735 367557 361666 358529 356346 351787 344029 335450 328825 325105 323416 321957 319365 316221
55647 316221 314873 317140 322653 329769 337051 343347 347652 349816 350540 350055 347787 343838 339588 336153 333435
55632 333435 331330 330603 331679 333758 336034 338802 342582 347173 352176 357453 362531 366780 370705 375716
55618 375716 382032 388012 392016 393487 391941 386938 379742 372874 366816 359285 349094 338670 331051 326277
55604 326277 322669 319853 318178 316602 313843 310780 309310 309291 308958 308015 308008 309537 311224 311806 311597 311383 311287
55587 311287 311171 311010 310496 309221 307449 305779 303800 300011 293425 284628 275116 266192 258575 252317 246703
55572B46703o018o861p062o091m492l479l890n242o122n774m808l957l000j792
55558A78115j318k408l970m178k989j988j811j539o50L4j22n38n38m12p37j409
55542A53542j802j402k36Q84P97n57j665j248j04L2j027j929j911j451q94o1P77
55525A41745R95R18J641L238M451M535M207M411N167O009O678P027P044P114P669
55510B12849Q585R616J1070J3211J5332J6416J6373J5665J4279J2295J0709J0060
55498C66460Q805M958q69o060r468j2213j4930j6516j6295j5350j4756j4145j2947
55485B46674j1572j0486r477q632q574q915q052n552l318l062l867l673k244j016
55471A58234o82o01n12j235l195n237n597l782j137N01N57O9K47J128J912K150
$$ plain form
55572 246703 240685 233824 226762 220671 216179 212700 208810 203568 197446 191672 186864 182907 179907 178115
55558 178115 176797 174389 170419 166241 163252 161264 159453 157914 157264 157298 157176 156638 156100 155688 154951 153542
55542 153542 151740 150338 150102 150986 151783 151226 149561 148313 148209 148241 147214 145285 143374 141923 141029 140968 141745
55525 141745 142740 143658 145299 148537 152988 157523 161730 166141 171308 177317 183995 191022 198066 205180 212849
55510 212849 221434 231050 242120 255331 270663 287079 303452 319117 333396 345691 356400 366460
55498 366460 375265 380223 379354 373294 363826 351613 336683 320167 303872 288522 273766 259621 246674
55485 246674 235102 224616 215139 206507 197933 189018 180966 175414 172096 169034 165167 161494 159250 158234
55471 158234 157552 156951 156439 155204 152009 146772 141175 137393 136256 136757 137314 137383 137630 138758 140670 142820
55455A42820J916J053p69l141m823m834l320j316n6k76j557k495k147j055k34
55440A19766L99J559K889L029J491o59k251l215m037m856n572o143o450o249n490
55425H4211m345l027j949j749k580l560l710l090k439j962j303l71N79J421J981
55410E8107J837R89K02j14n48j315j350j53O36m99k049j267J582L293K193k4j380
55393F0140k069k928l653l784l706l440k020O62K767K690J236L69P01J392J697
55378E0054J394L40j230k291j897l64J066J498J022L25JJ5k15q73j138k00J363
55361D8870K175J788Q66j62j301j993j401J12J186J415J681K376K817K805L023
55346F4257L342K455J09j844j715o0J448K025J770Q71j86n74k29n1l97o46p41
$$ plain form
55455 142820 144736 145789 145020 141879 137056 132222 128902 127586 127530 127254 125697 123202 121055 120000 119766
55440 119766 120165 121724 124613 127642 129133 128474 126223 123008 118971 114115 108543 102400 95950 89701 84211
55425 84211 79866 76839 74890 73141 70561 67001 63291 60201 57762 55800 54497 54126 54705 56126 58107
55410 58107 59944 60933 61135 61021 60473 59158 57808 57655 58291 57792 55743 54476 56058 59351 61544 61520 60140
55393 60140 58071 55143 51490 47706 44000 40560 38540 39202 41969 44659 45895 46264 46965 48357 50054
55378 50054 51448 51788 50558 48267 46370 46006 47072 48570 49592 49917 49918 49933 49718 48845 47707 47507 48870
55361 48870 51045 52833 53699 53537 52236 50243 48842 48954 50140 51555 53236 55612 58429 61234 64257
55346 64257 67599 70054 70163 68319 66604 66544 67992 70017 71787 72658 72472 71898 71669 71618 71221 70575 69834
55329F9834j619l116l309j356O74N97o31n26J106K229J912J340J452J606R14n80
55313G0527k455m284n172m229k034o22j372l507n143n231m048k436j082l76l45
55298B8191o18o91m29k64o84j524k017j809j336r31j51J317K680K973K563K442
55282B9712K402J354o02k032k309k197j967q43R66J681N43p18l90P10Q88L66M89
55265B8053J166J122K89k8P23J687K092K056J771J177M90M9l61j163k037k252
55249C4834j776j111l40O08J064L10r25j087m0P02L25r6O01J789K035J105O9k23
55231C7844J07N54Q02P13K40l95p36m41L75J147J177J73j305j998r70J269K835
55214D1391K152l32k461k544r44O86J214P00k55j124j578j609j450j035L4J494
$$ plain form
55329 69834 68215 65099 61790 60434 61108 61705 61074 60548 61654 63883 65795 67135 68587 70193 71107 70527
55313 70527 68072 63788 58616 54387 52353 51731 50359 46852 41709 36478 32430 29994 28912 28536 28191
55298 28191 27573 26882 26453 26189 25505 23981 21964 20155 18819 17888 17737 19054 21734 24707 27270 29712
55282 29712 32114 33468 32866 30834 28525 26328 24361 23518 24484 26165 26708 25990 25600 26310 27198 27564 28053
55265 28053 29219 30341 30630 30602 31325 33012 35104 37160 38931 40108 40598 40647 40286 39123 37086 34834
55249 34834 33058 31947 31607 32215 33279 33589 32664 31577 31537 32239 32564 32468 33069 34858 36893 37998 38067 37844
55231 37844 37951 38505 39307 40020 40260 39865 39129 38688 39063 40210 41387 41560 40255 38257 37287 38556 41391
55214 41391 43543 43211 40750 38206 37262 37948 39162 39862 39607 38483 36905 35296 33846 32811 32845 34339
55198C4339K076J059l68m95N13R72K42o77j094j466j896j612o57m19j304j521
55182B7692M50L289M374L083J023m85j521k293k299j153O48K144K645J945L86
55167C9928j231k159k189j625q93k56L60J249K255K523J535J51l87l01q46k006
55151C6108k172n86J474K607K907K796J827j8j212n17R63J195Q1o89j85Q50J435
55134D6864J395Q88K6r59j737k102j849q81K59O15J21k24J60P12J016J420J573
55117D7297J48k692m251k708k03j21k192k905n75K593L832K959J515N34Q2j73
55101D3140o47j353j581p79L71P31L76K09J84n65j821k163j147j17k86j151j440
55084C1961q00N0J99o11j576j384Q0J051K6j825j968RJ936K266J900K276L220
$$ plain form
55198 34339 36415 37474 37106 36611 37124 38096 38338 37661 36567 35101 33205 31593 30936 30517 29213 27692
55182 27692 28142 31431 35805 38888 39911 39426 37905 35612 33313 32160 32808 34952 37597 39542 39928
55167 39928 38697 36538 34349 32724 31831 31575 31935 33184 35439 37962 39497 39648 39261 38960 38114 36108
55151 36108 33936 33350 34824 37431 40338 43134 44961 44943 43731 43214 44177 45372 45453 44764 44579 45429 46864
55134 46864 48259 49147 49173 48214 46477 44375 42526 41645 41904 42519 42640 42416 42576 43288 44304 45724 47297
55117 47297 47445 44753 40502 37794 37591 37470 35278 32373 31798 34391 38223 41182 42697 43231 43313 43140
55101 43140 42493 41140 39559 38780 39151 39882 40258 40467 40651 40086 38265 36102 34955 34838 34552 33401 31961
55084 31961 31161 31211 31410 30799 29223 27839 27919 28970 28996 27171 25203 25212 27148 29414 31314 33590 36810
55067C6810L677L255K164O74m95k77J359K882K890J734P99Q17J536K441L143L444
55051F6853L533L778M078L761K370J67k130l631l523j965o20j053k550k838j225
55036F5005M09L68n91p80q0M49N94J043J827K101J530Q10N42M14j08q36j051m55
55018G1191L90P04M09J17J07j55j027j714j259k42k68j606k438j140J560L385
55002F8014K897M48k485m250l795j503Q70J772J405J188J854K588K258R49r9p6
54986G2035L08l18k035l189k296J27K282L259L452L110J778l63j858j571j42R70
54970G5549J411J886K550K569J464O1m10K42J079J169M14o04j152o85P31K001
54954H8275J625n03k268j425J540L761L523K095J405J363P73k57o08k13pr3J96
$$ plain form
55067 36810 40487 43742 45906 46580 46085 45808 47167 50049 52939 54673 55472 56289 57825 60266 63409 66853
55051 66853 70386 74164 78242 82003 84373 84540 82410 78779 75256 73291 72671 71618 69068 66230 65005
55036 65005 65414 65782 65191 64411 64331 64780 65374 66417 68244 70345 71875 72685 73227 73641 73533 72697 71646 71191
55018 71191 71581 72285 72694 72811 72918 72763 71736 70022 68763 68521 68253 66647 64209 63069 64629 68014
55002 68014 70911 71359 68874 64624 60829 59326 60196 61968 63373 64561 66415 69003 71261 72210 72111 72035
54986 72035 72343 72025 69990 66801 64505 64632 66914 70173 73625 76735 78513 78150 76292 74721 74579 75549
54970 75549 76960 78846 81396 83965 85429 85490 85080 85322 86401 87570 87984 87380 86228 85543 86274 88275
54954 88275 89900 89397 87129 85704 87244 91005 94528 96623 98028 99391 100164 99907 99299 99086 99079 98986 99182
54937I9182N18k10j441j047J475L592K875Q6k203k951k972k811k168j207p40q30
54921H9148m70Q57K243K556J842R72L66k39r26j140l47J215K643L095K368R65
54905A05148j80j97J054K812M139M785M950M503L254K001K231M176O049O080M720
54890A55525L889M510N823O923P828Q934J0167J1063J1292J1086J1270J2449J3866
54877B74625J3699J1137P575M939L384J426k076o951j2036j5564j6046j4030j2277
54864B37805j2698j3816j2908j0008p596o701n807m015k618k618k837j905m64
54851A53814J07j49l75n07q61q46M26K671M641N598N872O282P525R699J1939J3058
54835B18894J2879J2232J1338R311N837K272P8j033k472m884p715j0148j1629
$$ plain form
54937 99182 99700 99490 98049 97002 98477 102069 104944 105030 102827 99876 96904 94093 91925 90718 89978 89148
54921 89148 88678 89535 91778 94334 96176 97148 97514 97275 96349 95209 94862 96077 98720 101815 104183 105148
54905 105148 104968 104771 105825 108637 112776 117561 122511 127014 130268 132269 134500 138676 144725 150805 155525
54890 155525 159414 163924 169747 176670 184498 193432 203599 214662 225954 237040 248310 260759 274625
54877 274625 288324 299461 307036 311975 315359 316785 314709 307758 295722 280158 264112 250082 237805
54864 237805 225107 211291 198383 188375 180779 174078 168271 164256 161638 159020 156183 154278 153814
54851 153814 153921 153772 153397 152890 152029 151183 151609 154280 158921 164519 170391 176673 184198 193897 205836 218894
54835 218894 231773 244005 255343 264654 270491 272763 272841 271808 269336 264452 256737 246589 234960
54822B34960j1900j1318j0784j0738j0612r719q290p089o479o292o281o140n508
54809A23810m326k998j994j538j520j298l3J957K720Q67k070l100j549L71R44
54794A10243P45N56j60j487j850l42J323R98r26k372k517k195k105k225k400k246
54778I3040j111P17J578M24j625k941l572m276m488l177j038K02L59P79J942K748
54762G9561K365J289L98O4K48O71R47J258K213L387L125R85q17j71J845K663K131
54745A02162K221L415M080L548L183L802M374M226M368N554O741O782O340O834
54731A67630Q429J0036J0763J0630J0487J1420J3637J5798J6313J5262J3997J2940
54719C17342J1130Q068M503J032k643o526r739j1632j2366j1995j0358q162o753
$$ plain form
54822 234960 223060 211742 200958 190220 179608 169889 161599 154510 148031 141739 135458 129318 123810
54809 123810 119484 116486 114492 112954 111434 110136 110103 112060 114780 115647 113577 110477 108928 109299 110243
54794 110243 110988 111544 111384 109897 108047 107705 109028 110026 109100 106728 104211 102016 99911 97686 95286 93040
54778 93040 91929 92646 94224 94648 93023 90082 86510 82234 77746 74569 73531 73733 74092 74871 76813 79561
54762 79561 81926 83215 83613 83677 83925 84596 85543 86801 89014 92401 95526 96511 95694 95523 97368 100031 102162
54745 102162 104383 107798 111878 115426 118609 122411 126785 131011 135379 140933 147674 154456 160796 167630
54731 167630 176059 186095 196858 207488 217975 229395 243032 258830 275143 290405 304402 317342
54719 317342 328472 336540 341043 342075 339432 332906 323167 311535 299169 287174 276816 268654 261901
54706B61901o237n252l197j168j56J83K73p0k93J079M094O704P801R086J2083
54691B86831J5074J5370J3407J2010J2258J2727J2561J2648J3312J3170J1194
54680D30562Q259N697L639J540p29l145o014r507j3295j6998k0282k2303k2152
54667C35272k0316j8606j7945j7182j5076j2454j1128j1160j0714q654o038m578
54655A81421m557m897m603l568k301j545j832k837l283k092L06K320K796J805
54641A57133j5k103l694l882k636j177n57l62L91J487J849J421J440K425L149
54626A54869K379Q01J55R52K026K301K043K140K852L683M164M310M351M429M614
54611A96069N019N658O262O406N932N125M398L956L832M000M294M391M141L731
$$ plain form
54706 261901 255664 250412 247215 246047 245891 246074 246347 246277 245984 247063 251157 257861 265662 274748 286831
54691 286831 301905 317275 330682 342692 354950 367677 380238 392886 406198 419368 430562
54680 430562 438821 444518 448157 449697 448968 445823 439809 430302 417007 400009 379727 357424 335272
54667 335272 314956 296350 278405 261223 246147 233693 222565 211405 200691 192037 185999 181421
54655 181421 176864 171967 167364 163796 161495 159950 158118 155281 151998 149906 150212 152532 155328 157133
54641 157133 157118 155015 151321 147439 144803 143626 143069 142707 143098 144585 146434 147855 149295 151720 154869
54626 154869 157248 158049 158204 159156 161182 163483 165526 167666 170518 174201 178365 182675 187026 191455 196069
54611 196069 201088 206746 213008 219414 225346 230471 234869 238825 242657 246657 250951 255342 259483 263214
54597B63214L353K894K287J837J864K124K171K167K891M860P762J0871J3573J5530
54583C37398J6659J7176J7507J8049J8990K0197K1114K1005J9527J6827J2897
54572E37346P392N41o262j1544j5129j7694j9290j9356j8158j7089j7146j7803
54560C85808j7807j6623j4783j3236j2489j2082j0960q762o482n265m953m653
54548B57713m354m738n538n693n248n419o247n959l660j167p55k322m146n364
54534A97103o027n705m022k177j868k759k890j798j372k929n209o152n409l951
54520A44835k334o74M23K38q36j462q63L89J082M46j308l046l491k336n25Q13
54504A31351J481J941K385K503K010R65l27j343j548q61K83J481K562L097K509
$$ plain form
54597 263214 266567 269461 271748 273585 275449 277573 279744 281911 284802 289662 297424 308295 321868 337398
54583 337398 354057 371233 388740 406789 425779 445976 467090 488095 507622 524449 537346
54572 537346 544738 545279 539017 527473 512344 494650 475360 456004 437846 420757 403611 385808
54560 385808 368001 351378 336595 323359 310870 298788 287828 279066 272584 267319 262366 257713
54548 257713 253359 248621 243083 237390 232142 226723 220476 214517 210857 209690 208935 206613 202467 197103
54534 197103 191076 185371 181349 179172 177304 174545 171655 169857 168485 165556 160347 154195 148786 144835
54520 144835 142501 141827 142250 142488 141652 140190 139327 139716 140798 141244 139936 136890 133399 131063 130538 131351
54504 131351 132832 134773 137158 139661 141671 142636 142309 140966 139418 138557 138840 140321 142883 145980 148489
54489A48489J233Q96K320M054M151K879K176K673L187L214L939N859P373P070
54475A99513O033O204P532Q408Q258P942P894P619P043O818P105P206O577N165
54461B99317K851l48l585n990p957j0334j2507j2942j1668j0275r257p477m856
54448B04972l318l819m554l696k207k034l048l767l912m010l403j200J231J281
54434A68516j190l366l238j818r40o32J62J540K580K711K227J702J549J838K224
54419A73865K208J619P02j52n05N0J321K293K019O73p35j484j515j128q02q49
54403A77580p62L56K074K415M65j810j958l89N50K25K17J235J971J506O90J91
54387A84556q61l022m883m769l039j419p91p56p28m60J32P15M75r87k910m039
$$ plain form
54489 148489 149722 150618 152938 156992 161143 164022 166198 168871 172058 175272 179211 185070 192443 199513
54475 199513 205546 211750 219282 227690 235948 243890 251784 259403 266446 273264 280369 287575 294152 299317
54461 299317 302168 301820 298235 292245 284288 273954 261447 248505 236837 226562 217305 209828 204972
54448 204972 201654 197835 193281 189585 187378 185344 182296 178529 174617 170607 167204 166004 167235 168516
54434 168516 167326 163960 160722 158904 157964 157332 157494 159034 161614 164325 166552 168254 169803 171641 173865
54419 173865 176073 177692 178394 178242 177737 177787 179108 181401 183420 184093 183358 181874 180359 179231 178429 177580
54403 177580 176818 177174 179248 181663 182128 180318 178360 177971 178521 178746 178963 180198 182169 183675 184365 184556
54387 184556 183695 180673 175790 171021 167982 166563 165772 165016 164288 163828 163960 164675 165150 164163 161253 157214
54371A57214l842k768j630r03l43P06K200K993K316J316J721L157L430J724k11
54356A67080p16l83m87p54p6J460K713L142L188L364L780M317M725M840M954N384
54340B06531N622M940L923M067N377O013N026L809L671L645K237j9j558k234k847
54325B48203l154k417j459j985l911n310n225m720m830n068m592l601k857k680
54311A96394k841k889k290r26M46R08N17J3m37j192j921j544K26K156K775J848
54295A91243L66m03K03J726K842K668J800J531K127K642K387J713J154O92K65
54280B12956L06J195K516L259K661Q33j271k488k473k139k743m429n998o205n036
54265A90944l640l121l503l907l782l600m022m654m554l829l629m227m327l055
$$ plain form
54371 157214 153372 150604 148974 148071 147728 148434 150634 153627 155943 157259 158980 162137 165567 167291 167080
54356 167080 166364 165981 165494 164740 164664 166124 168837 171979 175167 178531 182311 186628 191353 196193 201147 206531
54340 206531 212153 217093 221016 225083 230460 236473 241499 245308 248979 252624 254861 254842 253284 251050 248203
54325 248203 245049 242632 241173 239188 235277 229967 224742 220022 215192 210124 205532 201931 199074 196394
54311 196394 193553 190664 188374 187448 187894 188802 189319 189332 188895 187703 185782 184238 184464 186620 189395 191243
54295 191243 191609 191206 191409 193135 195977 198645 200445 201976 204103 206745 209132 210845 211999 212691 212956
54280 212956 213262 214457 216973 220232 222893 223726 222455 219967 217494 215355 212612 208183 202185 195980 190944
54265 190944 187304 184183 180680 176773 172991 169391 165369 160715 156161 152332 148703 144476 140149 137094
54251A37094j504j279k336l340l571l296k841k445k609l438l943l153j540l19
54237A01480K36O04O45j14j164j509j362j766k605k643j727j144j432j542q11
54222H5146j08j90m24j57k1o55j273p77M79J286J275Q97L51l48o69q1R61J561
54204H7253J671J834J962J444M38j42k1O3l14n00R4R67J307J186J163J087L24
54187I9816q37j089Q4J350J186k2n71L2M32l99j568j602m89N34O00k79j664k677
54169I2837k091K87K675L107J931J166J456J451L80o21o35n85j469k289j523K13
54153I6290P89m22j856k188j806j494j007J51J483K068J917J816J995J767O36
54138A00139r67k328l282l924l823k392J3J939K284J442N50j8p39j647j868q15
$$ plain form
54251 137094 135590 134311 131975 128635 125064 121768 118927 116482 113873 110435 106492 103339 101799 101480
54237 101480 101716 102320 102965 102851 101687 100178 98816 97050 94445 91802 90075 88931 87499 85957 85146
54222 85146 85038 84848 84424 84267 84246 83591 82318 81541 82020 83306 84581 85478 85829 85481 84812 84731 85692 87253
54204 87253 88924 90758 92720 94164 94602 94460 94439 94502 94188 93688 93782 94749 96056 97242 98405 99492 99816
54187 99816 98979 97890 97974 99324 100510 100488 99917 99949 100381 99982 98414 96812 96323 96857 97457 97178 95514 92837
54169 92837 90746 91033 93708 96815 98746 99912 101368 102819 103199 102578 101943 101358 99889 97600 96077 96290
54153 96290 97079 96657 94801 92613 90807 89313 88306 88457 89940 92008 93925 95741 97736 99503 100139
54138 100139 99172 96844 93562 89638 85815 83423 83436 85375 87659 89101 89651 89633 88894 87247 85379 84564
54122H4564P03J206J87j318j888j099K84J244J416J073M82l32j174j500j111p21
54106H2016j242k469l080k250p36R8n1k95K6N72Q31J010J533K160K347K246K476
54089H5192K811K222O71k28O83K192K180M94j033j246p79l65K69J203J503O16
54073I6385n46r39r78j585k482k598j786q65k67L40J093J568J466J006N33Q9n86
54056H9848j699k819k816j219M52N7k099l164j552Q41J634J449K420M306M712
54041I0351K753J39j425j789j166M63K163K170J19k250l222k723j375N46K482
54026H7236L277K446Q46n85j808k779k687j038J251K628K407J050m48j123n64
54011I0109P14J822K595L506M586N176M838L657J807k50j265k08K101L577L298
$$ plain form
54122 84564 85267 86473 86660 85342 83454 82355 82639 83883 85299 86372 86854 86522 85348 83848 82737 82016
54106 82016 80774 78305 75225 72975 72239 72337 72286 71991 72017 72589 73420 74430 75963 78123 80470 82716 85192
54089 85192 88003 90225 90896 90668 91351 93543 95723 96217 95184 93938 93159 92794 93063 94266 95769 96385
54073 96385 95839 94900 93922 92337 89855 87257 85471 84606 84339 84679 85772 87340 88806 89812 90345 90434 89848
54056 89848 88149 85330 82514 81295 81747 81804 79705 76541 74989 75830 77464 78913 81333 85639 90351
54041 90351 93104 93243 91818 90029 88863 89326 91489 93659 93778 91528 88306 85583 84208 84754 87236
54026 87236 90513 92959 93805 93220 91412 88633 85946 84908 86159 88787 91194 92244 91796 90673 90109
54011 90109 90823 92645 95240 98746 103332 108508 113346 117003 118810 118560 117295 117087 119188 122765 126063
53996A26063K094Q13n37j664j746q67j91j08L11J345J779R19l6K53J391K232K594
53979A34645K930L296L690M445N436N823N379N018N249N317M703M090L975L776
53965A97772L307L577M851N524M512L284L727N320O345O579O750O347M438K006
53951B64339J077J705K063J348N55K92j45j195k279k909l229l301l128l304m266
53936B47623n160m926m185m297m824m089k295j752l409n259n169l489j840q33
53922A96096k75l03j008j722j805j548j518j666j720j758j774j371n48j32p11
53907A78237j757k253j791o04Q06J737J606O86K8L15J255K261K975K998K034O15
53891A89148j40Q1M62M77O17J348K338L257M272N097M700K924J393J602K921L717
$$ plain form
53996 126063 128157 128970 128433 126769 125023 124156 123965 123857 124168 125513 127292 128211 128175 128428 129819 132051 134645
53979 134645 137575 140871 144561 149006 154442 160265 165644 170662 175911 181228 185931 190021 193996 197772
53965 197772 201079 204656 209507 215031 219543 222827 226554 231874 238219 244798 251548 257895 262333 264339
53951 264339 265416 267121 269184 270532 271087 271379 271234 270039 267760 264851 261622 258321 255193 251889 247623
53936 247623 242463 237537 233352 229055 224231 220142 217847 216095 212686 207427 202258 198769 196929 196096
53922 196096 195821 195518 194510 192788 190983 189435 187917 186251 184531 182773 180999 179628 179080 178948 178237
53907 178237 176480 174227 172436 171832 172638 174375 175981 176667 176695 177010 178265 180526 183501 186499 188533 189148
53891 189148 189008 189089 189551 190028 190645 191993 194331 197588 201860 206957 211657 214581 215974 217576 220497 224214
53875B24214L785M188N182N792N552N116M931M574L809L155K756J745k92k030
53861B72477j771K42K016K366K160K777M281N752O648O938O524N631N441O975
53847C28457R199R676P646N264M980O672Q348Q733Q034O790N426M475L971K874
53833D20545M11k225l058k188j803l119m905n666n681n984o628p119p647q547
53819C56386r262r074q419q383r044r376q676p301n916m833m122l838l975m523
53805B59644n446o370o496n454m125l934n216o789p324o721n837n234m648l661
53791A82389k467j628j272r14k49L20K26m20r43r81p49m82j20L48O05L16m95j443
53773A72041j987j816j209q67r94r10l9J035J287P85N51Q95J000M09j01K72J236
$$ plain form
53875 224214 227999 232187 237369 243161 248713 253829 258760 263334 267143 270298 273054 274799 274507 272477
53861 272477 270706 270948 272964 275330 277490 280267 284548 290300 296948 303886 310410 316041 321482 328457
53847 328457 337656 347332 354978 360242 365222 371894 380242 388975 397009 403799 409225 413700 417671 420545
53833 420545 420956 418731 415673 413485 411682 408563 403658 397992 392311 386327 379699 372580 364933 356386
53819 356386 347124 338050 329631 321248 312204 302828 294152 286851 280935 276102 271980 268142 264167 259644
53805 259644 254198 247828 241332 235878 231753 227819 222603 215814 208490 201769 195932 190698 186050 182389
53791 182389 179922 178294 177022 176108 175859 176179 176405 175985 175042 174061 173312 172830 172710 173058 173663 173979 173484 172041
53773 172041 170054 168238 167029 166162 165168 164258 164219 165254 166541 167326 167877 168772 169772 170181 170080 170352 171588
53756A71588K027K423K374J445l79j857j584K31J917K372K139K367L419M734N565
53741A98781N487M577L426K899L516M969O348O976O993O974P034O828O614P494
53727B78916R830J1800J0948P234L371J673J659J583J080J001J287P06j201l210
53713C26677l870l101k009j678k492m000n096m794l258j758j434k312l638m606
53699B82631m565l221j259k82j354l608n038m729l652l156l278l111k301j470
53685B41607j281j675k179k510k727l004l369l522k954j601j84M94N86Q52J293
53670B19826R84l42j383q22P36J404M23r92j384p80k90n12r54q85k87K48M51Q38
53652B16279J923L182L375K144O27P0M32R04J236J685K073J877J222Q45J067J560
$$ plain form
53756 171588 173615 176038 178412 179857 179478 177621 176037 176268 178185 180557 182696 185063 188482 193216 198781
53741 198781 204268 208845 212271 215170 218686 223655 230003 236979 243972 250946 257980 264808 271422 278916
53727 278916 288746 300546 311494 318728 322099 323772 325431 327014 328094 329095 330382 331088 329887 326677
53713 326677 322807 319706 317697 316019 313527 309527 304431 299637 296379 294621 293187 290875 287237 282631
53699 282631 278066 274845 273586 273304 271950 268342 263304 258575 254923 251767 248489 245378 243077 241607
53685 241607 240326 238651 236472 233962 231235 228231 224862 221340 218386 216785 216601 217095 217681 218533 219826
53670 219826 220810 220468 219085 218263 218999 220403 220826 219834 218450 217670 217380 216868 215914 215029 214742 214990 215441 216279
53652 216279 218202 221384 224759 226903 227530 227600 228032 228936 230172 231857 233930 235807 237029 237874 238941 240501
53636B40501K190L242M562N270M734L469K706L270M802N909N327L492K513L790
53622B95777O087O942N730M063L141K368J074N6M40J996L581M527M694L944K526
53607C46946J385J084Q46l80k209l198k792j865j391j380j221m59Q62K100K349
53592C40677J406L37L82J366J933J353L01m51j132k216l127k688p84J177J701
53577C40235P55m66r20n09K36P29O25L0k98M37K036L280L339K839K957L862M673
53560C63840M762M356L920L672L782M334M947M973M306L554L341L842M929O166
53546D24724O759O207N219N246O775Q624R168P930N802M115L672M253N027N606
53532E09127O427P721Q683Q484P698P580Q192Q465P987P355O724N514L873K985
$$ plain form
53636 240501 242691 245933 250495 255765 260499 263968 266674 269944 274746 280655 285982 289474 291987 295777
53622 295777 301864 308806 314536 318599 321740 324108 325182 325238 325678 327674 331255 335782 340476 344420 346946
53607 346946 348331 349415 350261 349881 347672 344474 341682 339817 338426 337046 335825 335366 336228 338328 340677
53592 340677 342083 342420 342802 344168 346101 347454 347755 347304 346172 343956 340829 338141 337357 338534 340235
53577 340235 340990 340524 339604 339095 339331 340060 340685 340715 340417 340854 342890 346170 349509 352348 355305 359167 363840
53560 363840 368602 372958 376878 380550 384332 388666 393613 398586 402892 406446 409787 413629 418558 424724
53546 424724 431483 437690 442909 448155 454930 463554 472722 480652 486454 490569 494241 498494 503521 509127
53532 509127 515554 523275 531958 540442 548140 555720 563912 572377 580364 587719 594443 599957 603830 606815
53518F06815L253L559K977K095J936K632L755M876N179L807J238q21j597j979
53504F37725k558k490j239J24N71N44N50l5j387k130j559j239k372l162j406J633
53488F21570K826J810J027J510J799J151Q30J470J901J538J634L096M988O282
53474F53432P179P800P418O122N601O943R094J0551J1242J1677J1800J1828J2853
53461G73540J5209J7489J8556J9333K1155K3461K4798K5218K6003K7504K8904
53450A021170K9739L0228L0346K9891K9436L0092L2336L5778L9661M2889M4247
53439A395813M3777M3394M4864M7571M9505N0091N0530N1577N2511N2575N2048
53428A934256N1558N1398N1802N2836N3821N3918N3566N4136N5775N6757N5697
$$ plain form
53518 606815 610068 613627 616604 618699 620635 623267 627022 631898 637077 640884 642122 641301 639704 637725
53504 637725 635167 632677 631438 631562 632133 632677 633227 633192 631805 629675 628116 626877 624505 621343 619937 621570
53488 621570 624396 626206 627233 628743 630542 631693 632523 633993 635894 637432 639066 642162 647150 653432
53474 653432 660611 668411 675829 681951 687552 694495 703589 714140 725382 737059 748859 760687 773540
53461 773540 788749 806238 824794 844127 865282 888743 913541 938759 964762 992266 1021170
53450 1021170 1050909 1081137 1111483 1141374 1170810 1200902 1233238 1269016 1308677 1351566 1395813
53439 1395813 1439590 1482984 1527848 1575419 1624924 1675015 1725545 1777122 1829633 1882208 1934256
53428 1934256 1985814 2037212 2089014 2141850 2195671 2249589 2303155 2357291 2413066 2469823 2525520
53417B525520N3326N1304N0086M8977M7589M6246M5151M4061M2712M0942L8484
53406C034398L5186L1452K8007K5235K3055K1346K0091J9106J7918J5980J2900
53395C284674Q744M268N55k053m526q147j3048j8126k2333k5541k8188l0690l3395
53382C112194l6499l9618m1804m2591m2759m3647m5688m7960m9183m8902m7795
53371B625748m7039m7194m7505m6508m3659m0170l7680l6375l5005l2585k9335
53360B182693k5895k2581j9535j6692j3232q189k235K349M566O502J0785J6813
53348B115349K1511K3651K5483K9490L5266M0702M4827M8107N0814N2709N4166
53337B542075N6269N9640O3903O8361P2484P5797P8170Q0267Q3065Q6685R0379
$$ plain form
53417 2525520 2578846 2630150 2680236 2729213 2776802 2823048 2868199 2912260 2954972 2995914 3034398
53406 3034398 3069584 3101036 3129043 3154278 3177333 3198679 3218770 3237876 3255794 3271774 3284674
53395 3284674 3293418 3297686 3298241 3296188 3291662 3283515 3270467 3252341 3230008 3204467 3176279 3145589 3112194
53382 3112194 3075695 3036077 2994273 2951682 2908923 2865276 2819588 2771628 2722445 2673543 2625748
53371 2625748 2578709 2531515 2484010 2437502 2393843 2353673 2315993 2279618 2244613 2212028 2182693
53360 2182693 2156798 2134217 2114682 2097990 2084758 2076569 2074334 2076683 2081249 2087751 2098536 2115349
53348 2115349 2136860 2160511 2185994 2215484 2250750 2291452 2336279 2384386 2435200 2487909 2542075
53337 2542075 2598344 2657984 2721887 2790248 2862732 2938529 3016699 3096966 3180031 3266716 3357095
53326C357095R3778R7407J01564J05477J08194J09906J11611J13714J15637J16898
53316D431281J17836J18945J19891J19695J17832J14802J11555J08517J05279
53307E465633J01050R5422Q8709Q1523P4147O6409N8357N0764M4540L9640L4904
53296F201098K9172K2136J4041N101m228j2990k0622k8144l7531m9563o2950p5943
53284E979577q8125r9920j10909j19655j25165j27780j28445j27937j27052j26632
53274D797957j26641j25853j23377j20227j18380j18249j18154j16544j13804
53265C716728j11222j09008j06312j02688r8552r4300q9879q5187q0097p4081
53255B765402o6741n8833n1984m7023m3302l9812l6147l2044k7072k1528j6806
$$ plain form
53326 3357095 3450873 3548280 3649844 3755321 3863515 3973421 4085032 4198746 4314383 4431281
53316 4431281 4549117 4668062 4787953 4907648 5025480 5140282 5251837 5360354 5465633
53307 5465633 5566683 5662105 5750814 5832337 5906484 5972893 6031250 6082014 6126554 6166194 6201098
53296 6201098 6230270 6252406 6266447 6271548 6267320 6254330 6233708 6205564 6168033 6118470 6055520 5979577
53284 5979577 5891452 5791532 5680623 5560968 5435803 5308023 5179578 5051641 4924589 4797957
53274 4797957 4671316 4545463 4422086 4301859 4183479 4065230 3947076 3830532 3716728
53265 3716728 3605506 3496498 3390186 3287498 3188946 3094646 3004767 2919580 2839483 2765402
53255 2765402 2698661 2639828 2587844 2540821 2497519 2457707 2421560 2389516 2362444 2340916 2324110
53244B324110j3969j2336j0318p276l837p51J711L544N052O965R648J2297J3720
53231B328560J4018J4741J7160K0996K4976K8174L0613L2986L5904L9203M2154
53220B629485M4557M7180N0490N3427N4422N3421N1879N0805M9961M9165M8981
53209C183773M9398M8874M5818M0585L5135L0905K7773K4945K2080J9356J6858
53198C545500J4312J1380Q028M370J61n169j1625j8150k3721k8731l4438m0958
53186C420959m6835n1064n4536n8667o3390o7500p0521p3004p4998p5554p4262
53175B710628p2259p0914p0079o8607o6290o4226o3178o2628o1866o1153o0925
53164A988503o0648n9503n7892n6901n6383n4932n2023m8798m6173m3597m0562
$$ plain form
53244 2324110 2310141 2297805 2287487 2280211 2276374 2275623 2277334 2280878 2285930 2292895 2302543 2314840 2328560
53231 2328560 2342578 2357319 2374479 2395475 2420451 2448625 2479238 2512224 2548128 2587331 2629485
53220 2629485 2674042 2721222 2771712 2825139 2879561 2932982 2984861 3035666 3085627 3134792 3183773
53209 3183773 3233171 3282045 3327863 3368448 3403583 3434488 3462261 3487206 3509286 3528642 3545500
53198 3545500 3559812 3571192 3579220 3583590 3583751 3578582 3566957 3548807 3525086 3496355 3461917 3420959
53186 3420959 3374124 3323060 3268524 3209857 3146467 3078967 3008446 2935442 2860444 2784890 2710628
53175 2710628 2638369 2567455 2497376 2428769 2362479 2298253 2235075 2172447 2110581 2049428 1988503
53164 1988503 1927855 1868352 1810460 1753559 1697176 1642244 1590221 1541423 1495250 1451653 1411091
53153A411091l7949l6563l5400l3059l0086k8086k7002k5292k2789k1340k1962
53142A091563k3145k2919k1344j9886j9344j9284j8965j8001j6592j5592j5794
53131H80697j6841j7483j7291j7182j7779j8210j7294j5216j3197j2139j2230
53120G05835j3338j4902j5906j5695j4633j3424j2248j1082j0310j0363j0950
53109E62984j1381j1324j0865j0172r523r289r370r119q260p386p018o705n813
53096D46759m671m200m727n800o870p513p339o422n519n267n353n105m494l961
53082C69518l597l152k683k519k733l152l568l588k757j351m40n44q30n23k94
53067C37787j138k454k668j581o79j033k177l078l182k169l9K182K903J771K10
$$ plain form
53153 1411091 1373142 1336579 1301179 1268120 1238034 1209948 1182946 1157654 1134865 1113525 1091563
53142 1091563 1068418 1045499 1024155 1004269 984925 965641 946676 928675 912083 896491 880697
53131 880697 863856 846373 829082 811900 794121 775911 758617 743401 730204 718065 705835
53120 705835 692497 677595 661689 645994 631361 617937 605689 594607 584297 573934 562984
53109 562984 551603 540279 529414 519242 509719 500430 491060 481941 473681 466295 459277 452572 446759
53096 446759 442088 437888 433161 427361 420491 412978 405639 399217 393698 388431 383078 377973 373479 369518
53082 369518 365921 362769 360086 357567 354834 351682 348114 344526 341769 340418 339978 339434 338604 338081 337787
53067 337787 336649 334195 331527 329946 329267 328234 326057 322979 319797 317628 317589 319771 322674 324445 324655
53052C24655l04K24Q62J009N71l51j185j057O7R24L99q81j273k14J205J716J274
53035C27641O89N43Q08J238J679K031K169K024J672J275R80Q19N97n0j231k394
53019C40490k682k047j532k036l069l561l562m132n395o016n206m201m712o568
53005B85771p986p852o676n463m553l801l105k566k374k526k507j626o9R11M17
52990B35995r38j942k327k586k806k722k692l398m606n227m675l368j893n27L07
52975A96595J84o98j701k603l476l932l513k641k063j532l33R42Q05p73k075k172
52959A71014j994k315k434j828j342j463j133J41O02j208l547l592j703q89k145
52944A46164l112j933J6M86m58j187j084p99o12j8J174K398K921K367Q88o54j105
$$ plain form
53052 324655 324351 324575 325437 326446 327017 326666 325481 324424 324491 325415 325814 324933 323660 323446 324651 326367 327641
53035 327641 328330 328873 329681 330919 332598 334629 336798 338822 340494 341769 342749 343568 344165 344115 342884 340490
53019 340490 337808 335761 334229 332193 329124 325563 322001 317869 312474 306458 301252 297051 292339 285771
53005 285771 277785 269933 263257 257794 253241 249440 246335 243769 241395 238869 236362 234736 234667 235578 235995
52990 235995 235057 233115 230788 228202 225396 222674 219982 216584 211978 206751 202076 198708 196815 196288 196595
52975 196595 196779 196081 194380 191777 188301 184369 180856 178215 176152 174620 174287 175229 176034 175261 173186 171014
52959 171014 169020 166705 164271 162443 161101 159638 158505 158646 159248 158040 154493 150901 149198 148309 146164
52944 146164 143052 141119 141135 141621 141163 139976 138892 138093 137481 137463 138637 141035 143956 146323 147211 146557 145452
52927A45452j84J053J489J189Q07L25p00j956k437j798p07J46O81R39Q74R11J861
52910A47945L730N221N057L392J434J04l87j04N84Q35J25p97m66J480L812N175
52894A77140N439N276N068M787M479M279M204M378N168O550P648P538O487N642
52880B54083N477N163L824J902P40J011J957K183R41j335l558m889n223m945m451
52865B52880l905l314k693k092j582j237j130j304j742k272k652k747k607k279
52851B21324j742j206j264k252l514l785k536o77L97K31l80l42N62J438J311M45
52835B08010K18J252K190J286r93k361j799q58j099j769j256J98R66O35L85Q22
52819B05827J155Q43O12J145J951K259K133J923J333p4j863l055l173k451j223
$$ plain form
52927 145452 145268 146321 147810 148999 149806 150131 149431 147475 145038 143240 142533 142679 143360 144299 145173 146084 147945
52910 147945 151675 156896 161953 165345 166779 166883 166496 166392 166976 167811 167936 167139 166673 168153 171965 177140
52894 177140 182579 187855 192923 197710 202189 206468 210672 215050 220218 226768 234416 241954 248441 254083
52880 254083 259560 264723 268547 270449 271189 272200 274157 276340 277281 275946 272388 267499 262276 257331 252880
52865 252880 248975 245661 242968 240876 239294 238057 236927 235623 233881 231609 228957 226210 223603 221324
52851 221324 219582 218376 217112 214860 211346 207561 205025 204348 204745 204976 204596 204254 204816 206254 207565 208010
52835 208010 208228 209480 211670 212956 211963 209602 207803 206945 205846 204077 202821 203019 203985 204620 205005 205827
52819 205827 206982 207825 208437 209582 211533 213792 215925 217848 219181 219107 217244 214189 211016 208565 207342
52804B07342K45J494K033J815J178M90J90Q93K798M934N610M049J298p88j280
52789B32301o22L38J123J461J077J97j78O98K219L082L010L063L984N159N575
52774B62487N014L761J937q8j269r62j9J56n43r97o49j55p3Q6R75K309L145K951
52756B78066K032J065M09k17j319k767l675l461k648k102j807j142j44L25k95
52741B62320j727l389m814n454n001m014l588m058m724m967n017n290n550n129
52727A99598l672j478N62J325L02j764l412l744k912j591m60q5n89j380j788j881
52711A77031k114k278j646j96J092J314M37j006k329k869k488j877j690j512n91
52696A59278P10J246P62J2o97j692k609k468j548j572l286n177n451m111k276
$$ plain form
52804 207342 207587 209081 211114 212929 214107 214597 214787 215680 218478 223412 229022 233071 234369 233581 232301
52789 232301 231679 232017 233140 234601 235678 235875 235697 236395 238614 241696 244706 247769 251753 256912 262487
52774 262487 267501 271262 273199 273111 271842 270880 270861 271017 270474 269477 268828 268673 268600 268686 269661 271970 275115 278066
52756 278066 280098 281163 281572 281355 280036 277269 273594 270133 267485 265383 263576 262434 262290 262615 262320
52741 262320 260593 257204 252390 246936 241935 237921 234333 230275 225551 220584 215567 210277 204727 199598
52727 199598 195926 194448 195010 196335 196637 194873 191461 187717 184805 183214 182754 182669 182080 180700 178912 177031
52711 177031 174917 172639 170993 170797 171889 173203 173640 172634 170305 167436 164948 163071 161381 159869 159278
52696 159278 159988 161234 161996 162008 161311 159619 157010 154542 152994 151422 148136 142959 137508 133397 131121
52681A31121o54L84M00l31n61K63R22M8j919l398l573k703j357l39n29j658k026
52664A14090o08J238J481J38r90p63N29K257L743L880K134j03q31j56j35j628
52648A24276l000k557q35L87L76j99n35l28L69J204J572J193N57M38R73J490J250
52631A26631K73o10o35kK41o06k027k659j436J542M824O375N298K992J866K531
52615A44598L205K400J089J150K626L943M336M491M844M702L508J829N48k17r71
52600A82081k053l257l962l633k580k069l030m778n596m644k768j397j192j767
52586A39355k270k108j344m84J39L62k41j910l475k865K07L106L127O57j858l206
52570A27192l849l641j596J875M525M893L709K101J28j907k588j244N12P31k40
$$ plain form
52681 131121 130467 130851 131251 130920 130359 130622 131544 131592 129673 126275 122702 119999 118642 118303 117774 116116 114090
52664 114090 113482 114720 116201 116339 115349 114586 115115 117372 121115 124995 127129 127026 126195 126039 125904 124276
52648 124276 121276 118719 117884 118271 118647 118448 117913 117585 117954 119158 120730 121923 122480 122918 123891 125381 126631
52631 126631 126904 126294 125659 125657 125898 125292 123265 120606 119170 120712 125536 131911 137209 140201 142067 144598
52615 144598 147803 150203 151292 152442 155068 159011 163347 167838 172682 177384 180892 182721 183269 183052 182081
52600 182081 180028 176771 172809 169176 166596 164527 161497 156719 151123 146479 143711 142314 141122 139355
52586 139355 137085 134977 133633 133149 133288 133650 133409 131499 128024 125159 125366 128472 131599 132256 130398 127192
52570 127192 123343 119702 118106 119981 124506 129399 133108 135209 135337 133430 130842 129598 130110 130841 130601
52555A30601o71j86J25LM21J490J755M14j206j549j210j776k882k281P21L676
52539A27445M064K656K077K750K553O00r91k78J529K006J105Q20J895K952K766
52524A53949J647L73p00j093k70J303K255J933R99K38k93o08m06L00J096J945
52508A62668L071L907L303J259o45j078l11O82J465J902J702Q93P0l45m09m3R08
52491A78999J726J197m87j452n55J068J677J071J15p68j468j446l70J025J740
52476A82072J635R95j54j386j484RJ628J742P71K89N90Q02Q47J459K372K383J499
52459A96069J229K262L329L092J813M50p46j851k466k233j479o03M76J598J911
52444B02851J051J18K72Q94M33j043j641l75J217J160j48m93R66K563K524J371
$$ plain form
52555 130601 129930 129744 129869 129872 130293 131783 133538 133952 132746 131197 129987 128211 125329 123048 123769 127445
52539 127445 131509 134165 136242 138992 141545 142145 141154 140876 142405 144411 145516 146336 148231 151183 153949
52524 153949 155596 155969 155269 154176 153906 155209 157464 159397 160396 160634 160341 159733 159327 159627 160723 162668
52508 162668 165739 169646 172949 174208 173563 172485 172174 172856 174321 176223 177925 178818 178888 178543 178134 178091 178999
52491 178999 180725 181922 181435 179983 179428 180496 182173 183244 183359 182591 181123 179677 179307 180332 182072
52476 182072 183707 184702 184548 183162 181678 181687 183315 185057 185828 186117 186707 187509 188356 189815 192187 194570 196069
52459 196069 197298 199560 202889 205981 207794 208244 207498 205647 203181 200948 199469 198866 199342 200940 202851
52444 202851 203902 204020 204292 205186 205619 204576 202935 202560 203777 204937 204789 204296 205262 207825 210349 211720
52428B11720Q52J231J017n40k148k211r57K05Q10J638K996L869L260J674O19Q14
52412B24849J416J109k59j399j012O32J898J687P13N36J582K647K369P73q29j191
52396B35521k12J176K042K291K441K654K366J120n27j425j115k44L89O60O87O9
52380B47893j721m152n515m496j735O05Q74o27k184k369j194J00L96p2rJ153K199
52363B29146J651M9o02J85M84r70k368j185J942L760K658L85p70o51l93m95p59
52346B32067j004q65J88J784K540J841Q82R67J595J397K47p06o34L90J971L454
52330B46114L847K817J512J204J356L76j762l080k132K38K291L505M460N254N118
52315B71118L562J179q47j771j602p16M92J538J905J557J137J192J403J232J028
$$ plain form
52428 211720 212572 213803 214820 214280 212132 209921 208964 209169 209979 211617 214613 218482 221742 223416 224035 224849
52412 224849 226265 227374 227115 225716 224704 225336 227234 228921 229634 230170 231752 234399 236768 237541 236712 235521
52396 235521 235309 236485 238527 240818 243259 245913 248279 249399 248872 247447 246332 246088 246477 247137 247824 247893
52380 247893 246172 242020 236505 232009 230274 230879 231753 231126 228942 226573 225379 225479 225875 225803 225794 226947 229146
52363 229146 230797 230846 230244 230429 230913 229943 227575 226390 228332 232092 234750 235135 234365 233714 233321 232826 232067
52346 232067 231063 230198 230386 232170 234710 236551 237433 238400 239995 241392 241639 240933 240299 240689 242660 246114
52330 246114 249961 252778 254290 255494 256850 257226 255464 252384 250252 250490 252781 256286 260746 266000 271118
52315 271118 274680 275859 275012 273241 271639 270923 271415 272953 274858 276415 277552 278744 280147 281379 282407
$$ [...]
##END NTUPLES=NMR SPECTRUM
##END=
