##TITLE=coffee_type TOFR01-ROVE100A_70-30%
COFFEE_meoh_noesyp64 COFFEE_meoh {C:\Bruker\TOPSPIN} Administrator 5
##JCAMPDX= 6.0         $$ Bruker NMR JCAMP-DX V2.0
##DATA TYPE= NMR SPECTRUM
##DATA CLASS= NTUPLES
##ORIGIN= Bruker BioSpin GmbH
##OWNER= Administrator
$$ 1.72 TOPSPIN		Version 2.1
$$ 2012-05-18 15:46:57.011 -0700  Administrator@X
$$ Compression mode = diff/dup
##.OBSERVE FREQUENCY= 400.13188235
##.OBSERVE NUCLEUS= ^1H
##.ACQUISITION MODE= SIMULTANEOUS (DQD)
##.ACQUISITION SCHEME= undefined
##.AVERAGES= 64
##.DIGITISER RES= 22
##SPECTROMETER/DATA SYSTEM= spect
##.PULSE SEQUENCE= noesygpps1d.comp
##.SOLVENT NAME= COFFEE_meoh
##.SHIFT REFERENCE= INTERNAL, COFFEE_meoh, 1, 14.98061
##AUDIT TRAIL= $$ (NUMBER, WHEN, WHO, WHERE, PROCESS, VERSION, WHAT)
$$ ##TITLE= Audit trail, TOPSPIN		Version 2.1
$$ ##JCAMPDX= 5.01
$$ ##ORIGIN= Bruker BioSpin GmbH
$$ ##OWNER= Administrator
$$ $$ C:\Bruker\TOPSPIN/data/Administrator/nmr/12-COFFEE-2402/72/pdata/1/auditp.txt
$$ ##AUDIT TRAIL=  $$ (NUMBER, WHEN, WHO, WHERE, PROCESS, VERSION, WHAT)
(   1,<2012-02-24 20:40:18.609 -0500>,<Administrator>,<TOPSPIN>,<go>,<TOPSPIN 2.1>,
      <created by zg
	started at 2012-02-24 20:28:48.391 -0500,
	POWCHK enabled, PULCHK disabled,
       configuration hash MD5:
       B0 76 FB 9C 50 81 44 7D 18 B3 26 32 4E 60 AD 96
       data hash MD5: 64K
       8A 11 50 0D 11 F6 BC 7B 8A 9C 4D 00 FB 52 4A CC>)
(   2,<2012-02-24 20:40:21.406 -0500>,<Administrator>,<TOPSPIN>,<proc1d>,<TOPSPIN 2.1>,
      <Start of raw data processing
       efp LB = 0.3 FT_mod = 6 PKNL = 1 PHC0 = 0 PHC1 = 0 SI = 128K 
       data hash MD5: 128K
       53 CE 8C B3 21 57 2F 14 6B 60 78 3D 61 85 A5 17>)
(   3,<2012-02-24 20:40:22.766 -0500>,<Administrator>,<TOPSPIN>,<proc1d>,<TOPSPIN 2.1>,
      <pk PHC0 = 25.34546 PHC1 = 0 
       data hash MD5: 128K
       1E CA A1 27 0A A3 4E C4 13 36 3C 19 A3 2E BC A5>)
(   4,<2012-02-24 20:40:23.047 -0500>,<Administrator>,<TOPSPIN>,<proc1d>,<TOPSPIN 2.1>,
      <abs ABSG = 1 
       data hash MD5: 128K
       E0 D1 61 D5 F9 24 68 86 17 B5 58 BE F2 5D 26 0C>)
(   5,<2012-02-24 20:40:23.125 -0500>,<Administrator>,<TOPSPIN>,<proc1d>,<TOPSPIN 2.1>,
      <abs ABSG = 2 
       data hash MD5: 128K
       3F D5 DE E4 2E 48 E2 8A CF 9D 7E B0 9D 6D 6B B6>)
(   6,<2012-02-24 20:40:23.187 -0500>,<Administrator>,<TOPSPIN>,<proc1d>,<TOPSPIN 2.1>,
      <abs ABSG = 3 
       data hash MD5: 128K
       7D 5C 08 1B 64 DD BB E1 09 41 C1 8A 17 02 88 04>)
(   7,<2012-02-24 20:40:23.266 -0500>,<Administrator>,<TOPSPIN>,<proc1d>,<TOPSPIN 2.1>,
      <abs ABSG = 4 
       data hash MD5: 128K
       76 6E AA D5 A4 C9 9B 2D 39 E6 4D 6D 79 79 11 2D>)
(   8,<2012-02-24 20:40:23.516 -0500>,<Administrator>,<TOPSPIN>,<proc1d>,<TOPSPIN 2.1>,
      <abs ABSG = 5 
       data hash MD5: 128K
       70 6E 00 F1 D4 14 22 74 3E F5 2A 8F 0D 63 B6 05>)
(   9,<2012-02-24 20:40:23.641 -0500>,<Administrator>,<TOPSPIN>,<audit>,<TOPSPIN 2.1>,
      <user comment:
       ICON-NMR User ID: Administrator
$$ [...]
150 150 150 150 150 150 150 150
##$TP07= 0
##$TPNAME0= <>
##$TPNAME1= <>
##$TPNAME2= <>
##$TPNAME3= <>
##$TPNAME4= <>
##$TPNAME5= <>
##$TPNAME6= <>
##$TPNAME7= <>
##$TPOAL= (0..7)
0.5 0.5 0.5 0.5 0.5 0.5 0.5 0.5
##$TPOFFS= (0..7)
0 0 0 0 0 0 0 0
##$TUNHIN= 0
##$TUNHOUT= 0
##$TUNXOUT= 0
##$USERA1= <user>
##$USERA2= <user>
##$USERA3= <user>
##$USERA4= <user>
##$USERA5= <user>
##$V9= 5
##$VALIST= <valist>
##$VCLIST= <CCCCCCCCCCCCCCC>
##$VD= 0
##$VDLIST= <DDDDDDDDDDDDDDD>
##$VPLIST= <PPPPPPPPPPPPPPP>
##$VTLIST= <TTTTTTTTTTTTTTT>
##$WBST= 1024
##$WBSW= 4
##$XGAIN= (0..3)
0 0 0 0
##$XL= 0
##$YL= 0
##$YMAX_a= 14363793
##$YMIN_a= -6776968
##$ZGOPTNS= <>
##$ZL1= 120
##$ZL2= 120
##$ZL3= 120
##$ZL4= 120
##$ABSF1= 14.98061
##$ABSF2= -5.57192
##$ABSG= 5
##$ABSL= 3
##$ALPHA= 0
##$AQORDER= 0
##$ASSFAC= 0
##$ASSFACI= 0
##$ASSFACX= 0
##$ASSWID= 0
##$AUNMP= <proc_prof1d_extract>
##$AXLEFT= 0
##$AXNAME= <>
##$AXNUC= <1H>
##$AXRIGHT= 0
##$AXTYPE= 0
##$AXUNIT= <>
##$AZFE= 0.1
##$AZFW= 0.1
##$BCFW= 0
##$BC_mod= 0
##$BYTORDP= 0
##$COROFFS= 0
##$CY= 15
##$DATMOD= 1
##$DC= 0
##$DFILT= <>
##$DTYPP= 0
##$F1P= 0
##$F2P= 0
##$FCOR= 0.5
##$FTSIZE= 131072
##$FT_mod= 6
##$GAMMA= 0
##$GB= 0
##$INTBC= 1
##$INTSCL= 1
##$ISEN= 128
##$LB= 0.3
##$LEV0= 0
##$LPBIN= 0
##$MAXI= 10000
##$MC2= 0
##$MEAN= 0
##$ME_mod= 0
##$MI= 0
##$NCOEF= 0
##$NC_proc= -3
##$NLEV= 6
##$NOISF1= 0
##$NOISF2= 0
##$NSP= 0
##$NTH_PI= 0
##$NZP= 0
##$OFFSET= 14.98061
##$PC= 1
##$PHC0= 25.34546
##$PHC1= 0
##$PH_mod= 1
##$PKNL= yes
##$PPARMOD= 0
##$PPDIAG= 0
##$PPIPTYP= 0
##$PPMPNUM= 2147483647
##$PPRESOL= 1
##$PSCAL= 4
##$PSIGN= 0
##$PYNMP= <proc.py>
##$REVERSE= no
##$SF= 400.13
##$SI= 131072
##$SIGF1= 0
##$SIGF2= 0
##$SINO= 400
##$SIOLD= 131072
##$SPECTYP= <>
##$SREGLST= <1H.CDCl3>
##$SSB= 0
##$STSI= 131072
##$STSR= 0
##$SW_p= 8223.68421052632
##$SYMM= 0
##$S_DEV= 0
##$TDeff= 65536
##$TDoff= 0
##$TI= <>
##$TILT= no
##$TM1= 0
##$TM2= 0
##$TOPLEV= 0
##$USERP1= <user>
##$USERP2= <user>
##$USERP3= <user>
##$USERP4= <user>
##$USERP5= <user>
##$WDW= 1
##$XDIM= 131072
##$YMAX_p= 506947464
##$YMIN_p= -264657186
##$CURPLOT= <Network HP LaserJet P1505>
##$CURPRIN= <$Network HP LaserJet P1505>
##$DFORMAT= <normdp>
##$LAYOUT= <+/1D_H.xwp>
##$LFORMAT= <normlp>
##$PFORMAT= <normpl>
##$SURQMSG= 1
$$ End of Bruker specific parameters
$$ ---------------------------------
##NTUPLES= NMR SPECTRUM
##VAR_NAME=  FREQUENCY,     SPECTRUM/REAL,   SPECTRUM/IMAG
##SYMBOL=    X,             R,               I
##VAR_TYPE=  INDEPENDENT,   DEPENDENT,       DEPENDENT
##VAR_FORM=  AFFN,          ASDF,            ASDF
##VAR_DIM=   131072,        131072,          131072
##UNITS=     HZ,            ARBITRARY UNITS, ARBITRARY UNITS
##FACTOR=    0.0627417313425165, 1,          1
##FIRST=     8223.62146879498, 1643,         -95553
##LAST=      0,             5301,            -96239
##MIN=       0,             -264657186,      0
##MAX=       8223.62146879498, 506947464,    0
$$ Real data points
##PAGE= N=1
##DATA TABLE= (X++(R..R)), XYDATA
$$ [...]
62957B930334l6161m2765m8046n1828n3981n4865n4814n3753n1619m8599m4589
$$ 2930334 2894173 2851408 2803362 2751534 2697553 2642688 2587874 2534121 2482502 2433903 2389314
62946B389314l9219l2922k7120k2655j8742j4236r206m351L14N083R476J2827
$$ 2389314 2350095 2317173 2290053 2267398 2248656 2234420 2225214 2220863 2221177 2226260 2235736 2248563
62934B248563J5495J8155K0230K0618J9939K0319K2393K4064K3126K0025J6962
$$ 2248563 2264058 2282213 2302443 2323061 2343000 2363319 2385712 2409776 2432902 2452927 2469889
62923B469889J5058J3517J1293Q367N111J091m746j2643k1116k8021l2627l6284
$$ 2469889 2484947 2498464 2509757 2518124 2523235 2524326 2519580 2506937 2485821 2457800 2425173 2388889
62911B388889m0844m6900n3734o0176o4863o6548o5277o2872o1145n9917n7851
$$ 2388889 2348045 2301145 2247411 2187235 2122372 2055824 1990547 1927675 1866530 1806613 1748762
62900A748762n4765n1713m8992m5828m2175l9143l7023l4477l0675k6932k5076
$$ 1748762 1693997 1642284 1593292 1547464 1505289 1466146 1429123 1394646 1363971 1337039 1311963
62889A311963k5098k5458k5078k4005k2637k1307k0336j9755j9136j8127j6849
$$ 1311963 1286865 1261407 1236329 1212324 1189687 1168380 1148044 1128289 1109153 1091026 1074177
62878A074177j5433j3773j2052j0798j0067r388q877r383j0846j1738j1131j0142
$$ 1074177 1058744 1044971 1032919 1022121 1012054 1002666 993789 984406 973560 961822 950691 940549
62866I40549j0091j0266r137p041n699n476n081l996l305l645m065l628k697j874
$$ 940549 930458 920192 911055 904014 898315 892839 887758 883762 880457 876812 872747 869119 866422 864548
62852H64548r55J57O50k3j096j639j940k673l406l256k505k241k474k037m48J321
$$ 864548 863593 863750 864400 864377 863281 861642 859702 857029 853623 850367 847862 845621 843147 841110 840662 841983
62836H41983K321K735K929K374M31k301m337m869m287l294k169j028j94M3k24
$$ 841983 844304 847039 849968 852342 852773 850472 846135 841266 836979 833685 831516 830488 830294 830337 830113
62821H30113o31q45o91k37J67K72M34J329K862L857L347J893R44R99J248J107
$$ 830113 829482 828637 827946 827709 827876 828148 828582 829911 832773 836630 839977 841870 842814 843813 845061 846168
62805H46168J081J505J346n27l305m758m028k688k594l658m541m604m130l180
$$ 846168 847249 848754 850100 849573 846268 841510 837482 834794 832200 828542 824001 819397 815267 812087
62791H12087j570J26Q05L59q5K97J100J633J814J647Q09m83j064k13J199J945
$$ 812087 810517 810643 811448 811807 811722 812019 813119 814752 816566 818213 819022 818539 817475 817262 818461 820406
62775H20406K139K662L434L616L117K535J775K35j580k209j340l26r6j1N93J109
$$ 820406 822545 825207 828641 832257 835374 837909 839684 839919 838339 836130 834790 834464 834368 834357 834950 836059
62759H36059R15N81O84N90k75q70P3J814K394J400M23O71J573J940J443O66N94
$$ 836059 836974 837555 838239 838829 838554 837684 837757 839571 841965 843365 843788 844459 846032 847972 849415 850081 850675
62742H50675K053M769O966P057N856N921Q301J1147J2200J1633J1441J2802J5066
$$ 850675 852728 857497 864463 871520 877376 883297 891598 902745 914945 926578 938019 950821 965887
62729I65887J7107J8583J9740K0770K1850K3475K6263L0225L4437L7794M0179
$$ 965887 982994 1001577 1021317 1042087 1063937 1087412 1113675 1143900 1178337 1216131 1256310
62718A256310M2550M5764M9619N3364N6807O0437O4619O9165P3502P6834P8291
$$ 1256310 1298860 1344624 1394243 1447607 1504414 1564851 1629470 1698635 1772137 1848971 1927262
62707A927262P7602P5557P3228P0555O6120N8607M8166L6261K4344J2771R47j1506
$$ 1927262 2004864 2080421 2153649 2224204 2290324 2348931 2397097 2433358 2457702 2470473 2471420 2459914
62695B459914k3979l5504m5875n5389o3526o9040p1789p3399p5228p6641p6323
$$ 2459914 2435935 2400431 2354556 2299167 2235641 2166601 2094812 2021413 1946185 1869544 1793221
62684A793221p4406p1983o9252o5697o1630n7964n4634n0922m7211m4635m2822
$$ 1793221 1718815 1646832 1577580 1511883 1450253 1392289 1337655 1286733 1239522 1194887 1152065
62673A152065l9838l5048l0254k7215k5536k3950k2259k0786j9103j6724j4244
$$ 1152065 1112227 1077179 1046925 1019710 994174 970224 947965 927179 908076 891352 877108
62662H77108j2454j0912q702o212m792m701m552l063m60K050L688M680N778P419
$$ 877108 864654 853742 845040 838828 834036 829335 824783 821720 821260 823310 826998 831678 837456 844875
62648H44875R298J0756J1590J2271J3381J5204J7893K1548K5936L0501L4758L8282
$$ 844875 854173 864929 876519 888790 902171 917375 935268 956816 982752 1013253 1048011 1086293
62636A086293M0541M1472M2319M4846M9245N3599N6037N6803N7572N9226O0931
$$ 1086293 1126834 1168306 1210625 1255471 1304716 1358315 1414352 1471155 1528727 1587953 1648884
62625A648884O1120N8924N4778M9793M4375L7518K8143J6988O180l208j2066k1305
$$ 1648884 1710004 1768928 1823706 1873499 1917874 1955392 1983535 2000523 2006703 2003495 1991429 1970124
62613A970124l0330l8202m5169n1835n7612o1310o2769o2834o2039o0400n8253
$$ 1970124 1939794 1901592 1856423 1804588 1746976 1685666 1622897 1560063 1498024 1437624 1379371
62602A379371n6194n4180n1631m8488m5395m2698l9974l6663l2742k8796k5694
$$ 1379371 1323177 1268997 1217366 1168878 1123483 1080785 1040811 1004148 971406 942610 916916
62591I16916k4048k3536k2888k1016j8075j5212j3518j3351j4188j4764j4030
$$ 916916 892868 869332 846444 825428 807353 792141 778623 765272 751084 736320 722290
62580G22290j2410j1445j1746j2132j1524j0577j0202r485o837k873j91r5j250
$$ 722290 709880 698435 686689 674557 663033 652456 642254 632769 625932 623059 622868 622773 621523
62567F21523k013k485l334m042l609k215r13j16N42J154J408J469J959K957L877
$$ 621523 619510 617025 613691 609649 606040 603825 602912 602796 603338 604492 605900 607369 609328 612285 616162
62552F16162M584N762P666R277R505Q751Q432R099J0027J0717J1726J3510J5338
$$ 616162 620746 626508 634174 643451 652956 661707 670139 679238 689265 699982 711708 725218 740556
62539G40556J6229J6456J7205J9023K1395K3622K5342K6355K6918K8110L0950
$$ 740556 756785 773241 790446 809469 830864 854486 879828 906183 933101 961211 992161
62528I92161L4967L8367L9853L9588L8461L7196L6197L5281L3491L0127K5903
$$ 992161 1027128 1065495 1105348 1144936 1183397 1220593 1256790 1292071 1325562 1355689 1381592
62517A381592K2025J8089J2469M966k614r108j5404k2211k8203l1977l4357l6883
$$ 1381592 1403617 1421706 1434175 1439141 1436527 1427419 1412015 1389804 1361601 1329624 1295267 1258384
62505A258384l9044l9034l6738l4022l2181l0837k9390k8004k6936k6139k5640
$$ 1258384 1219340 1180306 1143568 1109546 1077365 1046528 1017138 989134 962198 936059 910419
62494I10419k5291k4190k1588j8422j6575j6481j6669j5953j4786j4013j3469
$$ 910419 885128 860938 839350 820928 804353 787872 771203 755250 740464 726451 712982
62483G12982j2588j1483j0668j0259j0005r664q921p374n064k692r56Q0Q12J508
$$ 712982 700394 688911 678243 667984 657979 648315 639394 632020 626956 624264 623308 623388 624200 625708
62469F25708K032K073J631J381K226M220O279P401P837Q433R342J0083J0674J1792
$$ 625708 627740 629813 631444 632825 635051 639271 645550 652951 660788 669221 678563 688646 699320 711112
62455G11112J3766J6076J7901J8834J9197K0064K2512K6220K9377L0724L1228
$$ 711112 724878 740954 758855 777689 796886 816950 839462 865682 895059 925783 957011
62444I57011L2654L4985L6503L6225L4893L3429L1519K8118K2548J5095P189P45
$$ 957011 989665 1024650 1061153 1097378 1132271 1165700 1197219 1225337 1247885 1262980 1270169 1270914
62432A270914l661p633j2927j8963k3777k6955k9614l1619l1243k8289k5282k4241
$$ 1270914 1267253 1259620 1246693 1227730 1203953 1176998 1147384 1115765 1084522 1056233 1030951 1006710
62420A006710k4128k2987k0995j9531j8550j6930j4676j2814j1431r696p671o370
$$ 1006710 982582 959595 938600 919069 900519 883589 868913 856099 844668 834972 827301 820931
62408H20931n806m669k401k56L46n70k078l412l837k497N47L623M890M372L802
$$ 820931 815125 810456 808055 807799 808145 807575 805497 802085 798248 795751 796298 799921 804811 809183 812985
62393H12985M532O248P799Q531Q483P864O942O136N725N447M817L811K791J777
$$ 812985 817517 823765 831564 840095 848578 856442 863384 869520 875245 880692 885509 889320 892111 893888
62379H93888L21j645l488m827o320q829j2022j4457j5111j4264j2917j1796j1073
$$ 893888 894209 892564 889076 884249 877929 869100 857078 842621 827510 813246 800329 788533 777460
62366G77460j0563r872q593o575m023j492J98L80p19j838j715k84J484K738L379
$$ 777460 766897 757025 748432 741857 737834 736342 736540 736920 736201 734363 732648 732364 733848 736586 739965
62351G39965L832M668O423R133J1953J3636J3602J2341J0867J0009R978J0261
$$ 739965 743797 748465 754888 764021 775974 789610 803212 815553 826420 836429 846407 856668
62339H56668J0110R468R109R483R836R179P743O537N726M480K527P61o3m04j135
$$ 856668 866778 876246 885355 894838 904674 913853 921596 928133 933859 938339 940866 941627 941564 941160 940025
62324I40025k238k810k133l71J624L159M516O727J0135J3454J5086J5316J6282
$$ 940025 937787 934977 932844 932473 934097 937256 941772 948499 958634 972088 987174 1002490 1018772
62311A018772J9486K4146K8543L2222L6111M0794M5500M9090N1680N4810N9791
$$ 1018772 1038258 1062404 1090947 1123169 1159280 1200074 1245574 1294664 1346344 1401154 1460945
62300A460945O6048P1565P4948P6506P7052P6421P3729O8522O0893N1093L9893
$$ 1460945 1526993 1598558 1673506 1750012 1827064 1903485 1977214 2045736 2106629 2157722 2197615
62289B197615K8919J9447J1023K175p555j7113k5383l2336l8733m5305n2025n7546
$$ 2197615 2226534 2245981 2257004 2259179 2251624 2234511 2209128 2176792 2138059 2092754 2040729 1983183
62277A983183n9921n8714n5864n3562n1978n0130m7969m5825m2736l7668l2048
$$ 1983183 1923262 1864548 1808684 1755122 1703144 1653014 1605045 1559220 1516484 1478816 1446768
62266A446768k8574k7465k6426k4549k3361k3260k2011j8376j4532j2824j2262
$$ 1446768 1418194 1390729 1364303 1339754 1316393 1293133 1271122 1252746 1238214 1225390 1213128
62255A213128j0658q332p035o564n291l389k699l604m448m269l924m155m469m514
$$ 1213128 1202470 1194138 1187103 1180539 1175248 1171859 1169160 1165556 1161108 1156839 1152915 1148760 1144291 1139777
62241A139777m912o083p392q147q428q461q004o857n337l955l052k747k685j919
$$ 1139777 1134865 1128782 1121390 1113243 1104815 1096354 1088350 1081493 1076156 1072201 1069149 1066402 1063717 1061798
62227A061798K40L263N933P680Q729R215R095Q893R566J1317J3276J4575J5276
$$ 1061798 1062038 1065301 1071234 1078914 1087643 1096858 1105953 1114846 1124412 1135729 1149005 1163580 1178856
62214A178856J6137J7861K0601K3840K6830K9383L1880L4312L6112L7475L9945
$$ 1178856 1194993 1212854 1233455 1257295 1284125 1313508 1345388 1379700 1415812 1453287 1493232
62203A493232M4534M9973N4239N7429O1444O6883P1906P4756P5878P6632P6817
$$ 1493232 1537766 1587739 1641978 1699407 1760851 1827734 1899640 1974396 2050274 2126906 2203723
62192B203723P4583O8478N8910M7666L6452K5831J5342M587o093j6137k5447l4031
$$ 2203723 2278306 2346784 2405694 2453360 2489812 2515643 2530985 2535572 2529479 2513342 2487895 2453864
62180B453864m1285m6511m9974n2588n4544n5085n3776n1239m8387m5489m2197
$$ 2453864 2412579 2366068 2316094 2263506 2208962 2153877 2100101 2048862 2000475 1954986 1912789
62169A912789l8048l2942k7621k3404k0769j8472j5020j0867p892o651n559l255
$$ 1912789 1874741 1841799 1814178 1790774 1770005 1751533 1736513 1725646 1717754 1711103 1705544 1702289
62157A702289l60J840L251M380N064N077N288O693Q602R344Q744Q509R802J1767
$$ 1702289 1701929 1703769 1707020 1711400 1716464 1721541 1726829 1733522 1742124 1751468 1760212 1768721 1778523 1790290
62143A790290J3107J3975J5449J7778K0175K1919K2913K3486K4403K6737L0683
$$ 1790290 1803397 1817372 1832821 1850599 1870774 1892693 1915606 1939092 1963495 1990232 2020915
62132B020915L4705L6928L7478L8376M0842M3842M5731M6137M5424M3518M0459
$$ 2020915 2055620 2092548 2130026 2168402 2209244 2253086 2298817 2344954 2390378 2433896 2474355
62121B474355L7282L4929L2931L0495K8327K7732K8297K8429K8112K9116L2077
$$ 2474355 2511637 2546566 2579497 2609992 2638319 2666051 2694348 2722777 2750889 2780005 2812082
62110B812082L5423L8009M0941M5630N1586N7268O1719O4092O3115N8761N3335
$$ 2812082 2847505 2885514 2926455 2972085 3023671 3080939 3142658 3206750 3269865 3328626 3381961
62099C381961M9107M5652M1151L5573L0621K7077K4129K1204J8554J5856J2037
$$ 3381961 3431068 3476720 3517871 3553444 3584065 3611142 3635271 3656475 3675029 3690885 3702922
62088C702922O968K171o94j131M71L445P033J0774J4698J8505K1131K2168K3028
$$ 3702922 3709890 3712061 3711367 3710236 3710707 3714152 3721185 3731959 3746657 3765162 3786293 3808461 3831489
62075C831489K5089K7249K7303K5554K4869K6689K9250L0613L1419L3239L5894
$$ 3831489 3856578 3883827 3911130 3936684 3961553 3988242 4017492 4048105 4079524 4112763 4148657
62064D148657L7993L9078L9734M0296M0807M1667M3145M4677M5746M6942M9093
$$ 4148657 4186650 4225728 4265462 4305758 4346565 4388232 4431377 4476054 4521800 4568742 4617835
62053D617835N1711N3453N3863N3604N3127N2238N1043N0327N0664N1817N3275
$$ 4617835 4669546 4722999 4776862 4830466 4883593 4935831 4986874 5037201 5087865 5139682 5192957
62042E192957N4839N6481N8081N9636O1425O3658O6125O8315O9810P0501P0622
$$ 5192957 5247796 5304277 5362358 5421994 5483419 5547077 5613202 5681517 5751327 5821828 5892450
62031E892450P0748P1669P3978P7536Q1489Q5124Q8659R2708R6695R8445R5973
$$ 5892450 5963198 6034867 6108845 6186381 6267870 6352994 6441653 6534361 6631056 6729501 6825474
62020F825474Q9590Q1697P4734O9694O6284O3662O1015N8097N5169N2001M7212
$$ 6825474 6915064 6996761 7071495 7141189 7207473 7271135 7332150 7390247 7445416 7497417 7544629
62009G544629L9607L0082K1118J4231Q866M065n9l161n902r342j3603j7982k2116
$$ 7544629 7584236 7614318 7635436 7649667 7658533 7662598 7662539 7659378 7653476 7644134 7630531 7612549 7590433
61996G590433k6169l0092l3462l6137l8595m1500m5097m8995n2390n4638n5712
$$ 7590433 7564264 7534172 7500710 7464573 7425978 7384478 7339381 7290386 7237996 7183358 7127646
61985G127646n5984n5590n4386n2519n0629m9168m7901m6302m4182m1815l9649
$$ 7127646 7071662 7016072 6961686 6909167 6858538 6809370 6761469 6715167 6670985 6629170 6589521
61974F589521l7969l6696l5537l4584l4504l5648l7332l8633l9673m1261m3471
$$ 6589521 6551552 6514856 6479319 6444735 6410231 6374583 6337251 6298618 6258945 6217684 6174213
61963F174213m5564m7334m9306n1463n3043n4053n5488n7341n7785n5688n2801
$$ 6174213 6128649 6081315 6032009 5980546 5927503 5873450 5817962 5760621 5702836 5647148 5594347
61952E594347n1772n2431n1791m7936m2517l8821l8118l8598l7556l4202l0217
$$ 5594347 5542575 5490144 5438353 5390417 5347900 5309079 5270961 5232363 5194807 5160605 5130388
61941E130388k7696k6920k6561k5916k5984k7954l1570l5748m0180m5367n1320
$$ 5130388 5102692 5075772 5049211 5023295 4997311 4969357 4937787 4902039 4861859 4816492 4765172
61930D765172n7144o1887o5204o7257o8407o8902o8481o6702o3995o1758o0724
$$ 4765172 4708028 4646141 4580937 4513680 4445273 4376371 4307890 4241188 4177193 4115435 4054711
61919D054711n9805n7570n4331n1571m9626m7355m4221m1316l9832l9594l9657
$$ 4054711 3994906 3937336 3883005 3831434 3781808 3734453 3690232 3648916 3609084 3569490 3529833
61908C529833l9301l7869l4716l0383k6986k6175k6898k6328k3118j8797j5798
$$ 3529833 3490532 3452663 3417947 3387564 3360578 3334403 3307505 3281177 3258059 3239262 3223464
61897C223464j4798j4412j2838r350m432R08N925J0460J4733J8845K2727K6566
$$ 3223464 3208666 3194254 3181416 3172066 3167634 3168542 3174467 3184927 3199660 3218505 3241232 3267798
61885C267798L0994L6542M2965M9309N4694N8818O1796O3933O5849O8528P2734
$$ 3267798 3298792 3335334 3378299 3427608 3482302 3541120 3602916 3666849 3732698 3801226 3873960
61874C873960P8272Q3935Q8271R0439R0589Q9758Q9381R0528R3320R7096J01233
$$ 3873960 3952232 4036167 4124438 4214877 4305466 4395224 4484605 4575133 4668453 4765549 4866782
61863D866782J05815J11562J19239J29283J41846J57055J75103J96040K19535
$$ 4866782 4972597 5084159 5203398 5332681 5474527 5631582 5806685 6002725 6222260
61854F222260K44928K71566K99123L27642L57434L88855M22057M56927M93295
$$ 6222260 6467188 6738754 7037877 7365519 7722953 8111808 8533865 8990792 9484087
61845I484087N31115N70244O10418O51603O93822P35493P71769P95292P98722
$$ 9484087 10015202 10585446 11195864 11847467 12541289 13276782 14048551 14843843 15642565
61836A5642565P75745P19946O25132M89062L17038J21271q2701k78790m52206
$$ 15642565 16418310 17138256 17763388 18252450 18569488 18690759 18608058 18329268 17877062
61827A7877062n92479o96218p66088q06795q22821q19043q00740p71616p33209
$$ 17877062 17284583 16588365 15822277 15015482 14192661 13373618 12572878 11801262 11068053
61818A1068053o87225o37278n87238n39089m93405m50825m11669l74991l39713
$$ 11068053 10380828 9743550 9156312 8617223 8123818 7672993 7261324 6886333 6546620
61809F546620l06382k76486k50313k26685k04488j83256j62476j41917j22670
$$ 6546620 6240238 5963752 5713439 5486754 5282266 5099010 4936534 4794617 4671947
61800D671947j06326r2644p9288o4611m9576l6168k4822j4423m227N349J3560
$$ 4671947 4565621 4472977 4393689 4329078 4279502 4243334 4218512 4204089 4199862 4205211 4218771
61789D218771K0029K4506K6743K6834K5162K1794J6363Q836J28q197j4727j8762
$$ 4218771 4238800 4263306 4290049 4316883 4342045 4363839 4380202 4389038 4389166 4380969 4366242 4347480
61777D347480k0485k0842k0728j9866j6797j0558k361N042R828J2464J4464J6320
$$ 4347480 4326995 4306153 4285425 4265559 4248762 4238204 4235843 4240885 4250713 4263177 4277641 4293961
61765D293961J7050J5266J0260K457o635j5179k2312k8480l3993l7720l8086l5285
$$ 4293961 4311011 4326277 4336537 4338994 4332359 4317180 4294868 4266388 4232395 4194675 4156589 4121304
61753D121304l1317k7509k2889j5730o071M147J3379K2191L2336M4498N7413O9359
$$ 4121304 4089987 4062478 4039589 4023859 4017788 4021935 4035314 4057505 4089841 4134339 4191752 4261111
61741D261111Q0133R1086J03371J16901J31153J45987J61165J75963J90390K06036
$$ 4261111 4341244 4432330 4535701 4652602 4783755 4929742 5090907 5266870 5457260 5663296
61731E663296K24443K45029K66052K87576L11839L40350L72238M06167M42642
$$ 5663296 5887739 6132768 6398820 6686396 6998235 7338585 7710823 8116990 8559632
61722H559632M83301N28831N78679O32236O89398P50318Q15469Q85749R61804
$$ 8559632 9042933 9571764 10150443 10782679 11472077 12222395 13037864 13923613 14885417
61713A4885417J043076J127791J213433J296776J373439J437320J479708J488504
$$ 14885417 15928493 17056284 18269717 19566493 20939932 22377252 23856960 25345464
61705B5345464J449013J347075J173351R27038O18099K66866r9640m53231p69303
$$ 25345464 26794477 28141552 29314903 30241941 30860040 31126906 31027266 30574035 29804732
61696B9804732j029992j226448j359360j435972j465301j455960j417120j358496
$$ 29804732 28774740 27548292 26188932 24752960 23287659 21831699 20414579 19056083
61688A9056083j287696j208767j124568j039235r57023q79792q07382p39710o77074
$$ 19056083 17768387 16559620 15435052 14395817 13438794 12559002 11751620 11011910 10334836
61679A0334836o19079n65027n15199m70386m30388l94224l61565l32641l06838
$$ 10334836 9715757 9150730 8635531 8165145 7734757 7340533 6978968 6646327 6339489
61670F339489k82754k59626k37634k17024j98065j81685j68669j58192j48632
$$ 6339489 6056735 5797109 5559475 5342451 5144386 4962701 4794032 4635840 4487208
61661D487208j39889j33457j29765j26899j22683j16921j10844j05260j00081
$$ 4487208 4347319 4213862 4084097 3957198 3834515 3717594 3606750 3501490 3401409
61652C401409r5032r0018q5028q0095p5222p0274o5382o1275n8594n6760n4415
$$ 3401409 3306377 3216359 3131331 3051236 2976014 2905740 2840358 2779083 2720489 2663729 2609314
61641B609314n1091m7774m5664m5041m5414m5985m5717m3887m1007l8507l7169
$$ 2609314 2558223 2510449 2464785 2419744 2374330 2328345 2282628 2238741 2197734 2159227 2122058
61630B122058l6502l5854l5314l5023l4524l3390l1953l0749k9672k8201k6178
$$ 2122058 2085556 2049702 2014388 1979365 1944841 1911451 1879498 1848749 1819077 1790876 1764698
61619A764698k3946k2005k0801k0374j9987j8600j6158j3916j3034j3264j3374
$$ 1764698 1740752 1718747 1697946 1677572 1657585 1638985 1622827 1608911 1595877 1582613 1569239
61608A569239j2428j0287p490n192m714o238q147q393o661m678m279n515o735
$$ 1569239 1556811 1546524 1539034 1533842 1529128 1522890 1514743 1506350 1499689 1495011 1490732 1485217 1478482
61595A478482o286l960r39J476K822L231K825J980J764L074N105N673L570l0l113
$$ 1478482 1472196 1468236 1467297 1468773 1471595 1474826 1477651 1479631 1481395 1484469 1489574 1495247 1498817 1498787 1495674
61580A495674m896n734n758m888l808l526l829l340j570K38R16J148K456M888
$$ 1495674 1490778 1485044 1479286 1474398 1470590 1467064 1463235 1459895 1458325 1458563 1459479 1460627 1463083 1467971
61566A467971O827P007N824M456L363K000m98m467r166j2935j4504j4409j4481
$$ 1467971 1474798 1481805 1487629 1492085 1495448 1497448 1496950 1492483 1483317 1470382 1455878 1441469 1426988
61553A426988j5551j6424j5703j3891j2666j2589j2604j1768j0196q214n881l700
$$ 1426988 1411437 1395013 1379310 1365419 1352753 1340164 1327560 1315792 1305596 1297382 1291501 1287801
61541A287801k786l538m978o001o524o723o088m241k097j048j216j412p21P86
$$ 1287801 1285015 1281477 1276499 1270498 1263974 1257251 1251163 1246922 1244825 1243777 1242561 1241149 1240428 1241214
61527A241214K800N251P823R778J0687J1090J2093J4337J7241J9368J9887J9808
$$ 1241214 1244014 1249265 1257088 1266866 1277553 1288643 1300736 1315073 1332314 1351682 1371569 1391377
61515A391377K1137K4583K8760L2092L4668L7448M0431M2724M4004M4821M5668
$$ 1391377 1412514 1437097 1465857 1497949 1532617 1570065 1610496 1653220 1697224 1742045 1787713
61504A787713M6720M8237N0085N1015M9584M5924M1609L7792L4492L1741L0070
$$ 1787713 1834433 1882670 1932755 1983770 2033354 2079278 2120887 2158679 2193171 2224912 2254982
61493B254982K9447K8828K7433K5633K4100K2816K1421J9736J7503J4304J0292
$$ 2254982 2284429 2313257 2340690 2366323 2390423 2413239 2434660 2454396 2471899 2486203 2496495
61482B496495O394L221M12k492n295p825j0551j3645j6001j6213j4197j0969p060
$$ 2496495 2502889 2506110 2506522 2504030 2498735 2490910 2480359 2466714 2450713 2434500 2420303 2409334 2402274
61469B402274k274L100P967J1754J5217J9398K4406K9755L5427M1877M9271N7407
$$ 2402274 2400000 2403100 2411067 2422821 2438038 2457436 2481842 2511597 2547024 2588901 2638172 2695579
61457B695579O6227P5712Q5305R4378J03344J13456J25117J37413J49867J63537
$$ 2695579 2761806 2837518 2922823 3017201 3120545 3234001 3359118 3496531 3646398 3809935
61447C809935J79220J95581K10795K25465K41832K60076K77584K92384L04929
$$ 3809935 3989155 4184736 4395531 4620996 4862828 5122904 5400488 5692872 5997801
61438E997801L15124L19584L13835K96279K68211K30966J85142J32455P6394K0719
$$ 5997801 6312925 6632509 6946344 7242623 7510834 7741800 7926942 8059397 8135791 8156510
61428H156510l1692p8701j19010j52310j78410j96416k05837k08066k05422j99083
$$ 8156510 8124818 8046117 7927107 7774797 7596387 7399971 7194134 6986068 6780646 6581563
61418F581563j89235j76795j63219j48697j32441j14929r8153q3175o9074n4926
$$ 6581563 6392328 6215533 6052314 5903617 5771176 5656247 5558094 5474919 5405845 5350919
61408E350919m1161k8224j5399k161J0448K1033K9754L7980M6442N4531O1110
$$ 5350919 5309758 5281534 5266135 5263974 5274422 5295455 5325209 5363189 5409631 5464162 5525272
61397E525272O5507O7965O9564P1431P3693P5395P5458P3664P0947O9079O9525
$$ 5525272 5590779 5658744 5728308 5799739 5873432 5948827 6024285 6097949 6168896 6237975 6307500
61386F307500P1985P4556P5950P6794P7755P7534P4357O8806O3172N8285N3006
$$ 6307500 6379485 6454041 6529991 6606785 6684540 6762074 6836431 6905237 6968409 7026694 7079700
61375G079700M6600L9528L1854K3205J4569P698K152m589j3261k1550k7725l2998
$$ 7079700 7126300 7165828 7197682 7220887 7235456 7243154 7245306 7240717 7227456 7205906 7178181 7145183
61363G145183l8698m3617m6208m7388m8846n0088m9438m6800m3203l8707l2992
$$ 7145183 7106485 7062868 7016660 6969272 6920426 6870338 6820900 6774100 6730897 6692190 6659198
61352F659198k7216k3036k0293j7580j4738j2774j1787j0820r686r231r852j1172
$$ 6659198 6631982 6608946 6588653 6571073 6556335 6543561 6531774 6520954 6511268 6502037 6492185 6481013
61340F481013j2949j4862j5685j4104j0108m301L643J4312K6888L9984N3879P0102
$$ 6481013 6468064 6453202 6437517 6423413 6413305 6409004 6412647 6426959 6453847 6493831 6547710 6617812
61328F617812Q8854J08689J28834J49997J72520J95446K18001K40469K62954K84405
$$ 6617812 6706666 6815355 6944189 7094186 7266706 7462152 7680153 7920622 8183576 8467981
61318H467981L03462L19132L30153L34694L31364L19572K98399K66150K22113
$$ 8467981 8771443 9090575 9420728 9755422 10086786 10406358 10704757 10970907 11193020
61309A1193020J68461J09772N0672n969n8922j07360j50273j87314k19627k48664
$$ 11193020 11361481 11471253 11521925 11515956 11457034 11349674 11199401 11012087 10792460 10543796
61299A0543796k73894k92857l04183l09404l10924l09267l03523k93535k80212
$$ 10543796 10269902 9977045 9672862 9363458 9052534 8743267 8439744 8146209 7865997
61290G865997k64481k47391k30648k15512k01536j87738j74395j62231j50642
$$ 7865997 7601516 7354125 7123477 6907965 6706429 6518691 6344296 6182065 6031423
61281F031423j38458j25795j13182r9734q4518o9232n6631m6190l4319j9571m863
$$ 6031423 5892965 5767170 5653988 5554254 5469736 5400504 5343873 5297683 5263364 5243793 5238930
61270E238930O698J5668K4332L3019M0233M5078M7724M8477M8016M7644M7905
$$ 5238930 5245628 5261296 5285628 5318647 5358880 5403958 5451682 5500159 5548175 5595819 5643724
61259E643724M7448M4520L9202L3260K8307K4849K2588K0804J8845J6681J4588
$$ 5643724 5691172 5735692 5774894 5808154 5836461 5861310 5883898 5904702 5923547 5940228 5954816
61248E954816J2194Q855N076K236L87k314p231j3714k0839k9143l9132m9356n7565
$$ 5954816 5967010 5975865 5980941 5983177 5983564 5981250 5974019 5960305 5939466 5910323 5871191 5821835 5764270
61235E764270o3221o7390p0786p3279p4946p6109p6422p5017p1527o6190n9353
$$ 5764270 5701049 5633659 5562873 5489594 5414648 5338539 5262117 5187100 5115573 5049383 4990030
61224D990030n1732m4706l9328l5119l0835k6193k2034j8941j6641j4543j2187
$$ 4990030 4938298 4893592 4854264 4819145 4788310 4762117 4740083 4721142 4704501 4689958 4677771
61213D677771r318o367m559m651n564n105k209K132O125Q945J1289J4663K0040
$$ 4677771 4668453 4662086 4657527 4652876 4647312 4642207 4639998 4642130 4648255 4657200 4668489 4683152 4703192
61200D703192K6850L3440L8707M2950M6942N1006N5481O1267O8961P7899Q6882
$$ 4703192 4730042 4763482 4802189 4845139 4892081 4943087 4998568 5059835 5128796 5206695 5293577
61189E293577R5484J03887J11832J18540J23138J24330J20146J09143R1622O8621
$$ 5293577 5389061 5492948 5604780 5723320 5846458 5970788 6090934 6200077 6291699 6360320
61179F360320M0141N788l2778p1473j06366j35839j59933j78608j91340j97689
$$ 6360320 6400461 6406249 6373471 6301998 6195632 6059793 5899860 5721252 5529912 5332223
61169E332223j97782j92512j83595j73074j62457j52454j43294j34743j26017
$$ 5332223 5134441 4941929 4758334 4585260 4422803 4270349 4127055 3992312 3866295
61160C866295j16523j06893r8380r0998q3104p3513o3346n4903m9048m4560l9989
$$ 3866295 3749772 3642879 3544499 3453501 3370397 3296884 3233538 3178635 3129587 3085027 3045038
61149C045038l5257l1041k7340k3385j8788j4004r524n203p15L815Q049J1887
$$ 3045038 3009781 2978740 2951400 2928015 2909227 2895223 2885699 2880496 2879781 2883596 2891645 2903532
61137B903532J5190J7546J8971K0339K2165K3252K1777J7605J2212O355n42q284
$$ 2903532 2918722 2936268 2955239 2975578 2997743 3020995 3042772 3060377 3072589 3078944 3078402 3070118
61125C070118j5025j9536k2906k6672l0587l3710l6524m0065m3694m5796m6477
$$ 3070118 3055093 3035557 3012651 2985979 2955392 2921682 2885158 2845093 2801399 2755603 2709126
61114B709126m7585m9907n2106n2856n2543n2223n2082n1561n0225m8113m5899
$$ 2709126 2661541 2611634 2559528 2506672 2454129 2401906 2349824 2298263 2248038 2199925 2154026
61103B154026m4786m5426m6784m6983m5326m2650l9744l6521l2852k9019k5110
$$ 2154026 2109240 2063814 2017030 1970047 1924721 1882071 1842327 1805806 1772954 1743935 1718825
61092A718825k1080j7499j5137j3530j1371q653p056p737j0157j3509j7601k1517
$$ 1718825 1697745 1680246 1665109 1651579 1640208 1631555 1624499 1616762 1606605 1593096 1575495 1553978
61080A553978k3225k2004j9801j8653j7906j5728j2230r090o706l921m53K437
$$ 1553978 1530753 1508749 1488948 1470295 1452389 1436661 1424431 1415341 1408635 1404714 1404261 1406698
61068A406698M029N163O644Q110R029R679J0434J1045J1215J1099J0681R486P442
$$ 1406698 1410727 1415890 1422534 1430644 1439673 1449352 1459786 1470831 1482046 1493145 1503826 1513312 1520754
61055A520754N316L732K469J295Q35J819L860N781O881P280P136O251M532K349
$$ 1520754 1526070 1529802 1532271 1533566 1534401 1536220 1540080 1545861 1552742 1560022 1567158 1573409 1577941 1580290
61041A580290K20j647l492n745q528j1245j2955j3423j3560j4481j6230j7833
$$ 1580290 1580510 1578863 1575371 1569626 1561098 1549853 1536898 1523475 1509915 1495434 1479204 1461371
61029A461371j8451j7984j6689j4926j3516j3499j4882j6063j5392j3176j1411
$$ 1461371 1442920 1424936 1408247 1393321 1379805 1366306 1351424 1335361 1319969 1306793 1295382
61018A295382j1465j2759j3875j4045j3134j0982p668m018j052Q47J732J542N27
$$ 1295382 1283917 1271158 1257283 1243238 1230104 1219122 1211454 1207436 1206384 1207231 1208963 1210505 1211032
61005A211032k22L03J681K641K820K980L525M028M321M799N409N557N491O398
$$ 1211032 1210810 1211113 1212794 1215435 1218255 1221235 1224760 1228788 1233109 1237908 1243317 1248874 1254365 1260763
60991A260763Q500J0322J0761J0658J1234J2019J1848J1147J1613J3779J6150
$$ 1260763 1269263 1279585 1290346 1301004 1312238 1324257 1336105 1347252 1358865 1372644 1388794
60980A388794J6990J6124J4853J4614J5681J7014J7601J7898J9145K1315K3066
$$ 1388794 1405784 1421908 1436761 1451375 1467056 1484070 1501671 1519569 1538714 1560029 1583095
60969A583095K4146K6117K9708L3080L4258L3847L3600L3590L2906L2127L2725
$$ 1583095 1607241 1633358 1663066 1696146 1730404 1764251 1797851 1831441 1864347 1896474 1929199
60958A929199L4520L5975L6737L7768L9328M1011M3479M7742N2783N6423N8843
$$ 1929199 1963719 1999694 2036431 2074199 2113527 2154538 2198017 2245759 2298542 2354965 2413808
60947B413808O2757O9604P7900Q5952R4068J03375J14418J27421J41978J56122
$$ 2413808 2476565 2546169 2624069 2710021 2804089 2907464 3021882 3149303 3291281 3447403
60937C447403J68009J79068J93006K11098K30717K49045K65638K81006K95883
$$ 3447403 3615412 3794480 3987486 4198584 4429301 4678346 4943984 5224990 5520873
60928E520873L12863L35503L64397L97146M33274M75706N25840N80937O38344
$$ 5520873 5833736 6169239 6533636 6930782 7364056 7839762 8365602 8946539 9584883
60919I584883O98632P62787Q30620R04605R91028J094912J218443J366282J545343
$$ 9584883 10283515 11046302 11876922 12781527 13772555 14867467 16085910 17452192 18997535
60910A8997535J756051J992709K258258K568254K933072L350959L828519M372402
$$ 18997535 20753586 22746295 25004553 27572807 30505879 33856838 37685357 42057759
60902D2057759M903777N181765M894991L918267K491040J095286J28066l04556
$$ 42057759 46961536 52143301 57038292 60956559 63447599 64542885 64670951 64366395
60894F4366395l06622o863M69198Q84448Q83846K12844j045043k487896l671770
$$ 64366395 64059773 64052910 64522108 65406556 66290402 66503246 65458203 62970307 59298537
60885E9298537m373370m624392m569643m338033m014021l655607l298448k954488
$$ 59298537 54925167 50300775 45731132 41393099 37379078 33723471 30425023 27470535
60877B7470535k626514k322279k049143j804405j581405j380875j208457j064653
$$ 27470535 24844021 22521742 20472599 18668194 17086789 15705914 14497457 13432804
60869A3432804r44387q43798p60908o91589o31008n78002n33049m93144m53605
$$ 13432804 12488417 11644619 10883711 10192122 9561114 8983112 8450063 7956919 7503314
60860G503314m13879l77033l44412l15124k89829k70328k55640k42657k30398
$$ 7503314 7089435 6712402 6367990 6052866 5763037 5492709 5237069 4994412 4764014
60851D764014k19840k09874j97673j83136j69215j57510j46919j36754j27601
$$ 4764014 4544174 4334300 4136627 3953491 3784276 3626766 3479847 3343093 3215492
60842C215492j18894j09199r9340r1905q7095q2406p6948p2641p0245o7555o3013
$$ 3215492 3096598 2987399 2888059 2796154 2709059 2626653 2549705 2477064 2406819 2339264 2276251
60831B276251n8199n5230n3946n3000n1653m9471m6103m2319l9503l7651l5602
$$ 2276251 2218052 2162822 2108876 2055876 2004223 1954752 1908649 1866330 1826827 1789176 1753574
60820A753574l3554l3139l4611l6281l7096l7438l6957l4331l0007k6595k5423
$$ 1753574 1720020 1686881 1652270 1615989 1578893 1541455 1504498 1470167 1440160 1413565 1388142
60809A388142k4894k3233k0732j8403j6531j5416j5346j5098j2676q286m230j339
$$ 1388142 1363248 1340015 1319283 1300880 1284349 1268933 1253587 1238489 1225813 1217527 1213297 1211958
60797A211958J803N424P593P900Q839J1642J3871J3346J1711J1593J2646J3082
$$ 1211958 1213761 1219185 1226778 1234678 1243517 1255159 1269030 1282376 1294087 1305680 1318326 1331408
60785A331408J2962J3275J3485J2734J1958J2166J2099J0150P386N930N476M142
$$ 1331408 1344370 1357645 1371130 1383864 1395822 1407988 1420087 1430237 1437623 1443553 1449029 1453171
60773A453171J842J27p80k096l962n254n775o468p521q150q150q069q157q677
$$ 1453171 1455013 1455140 1454360 1452264 1448302 1443048 1437273 1430805 1423284 1415134 1406984 1398915 1390758 1382081
60759A382081j0554j3880j6456j5997j3266j0995j0139r472q530q355r058r045
$$ 1382081 1371527 1357647 1341191 1325194 1311928 1300933 1290794 1281322 1272792 1264437 1255379 1246334
60747A246334p375m999l051j506p3J100K159L649N534P272Q904J0704J1831J1140
$$ 1246334 1238959 1233960 1230909 1229403 1229330 1230430 1232589 1236238 1241772 1249044 1257948 1268652 1280483 1291623
60733A291623R585R816J2760J6337J8397J9208K0014K0674K0163J8314J5788J3030
$$ 1291623 1301208 1311024 1323784 1340121 1358518 1377726 1397740 1418414 1438577 1456891 1472679 1485709
60721A485709J0409Q666Q076P663O342M447L173K819K708K564K819L480L739L170
$$ 1485709 1496118 1504784 1512860 1520523 1526865 1531312 1534485 1537304 1540012 1542576 1545395 1548875 1552614 1555784
60707A555784K457K387K704K622K118J908K058J489o67l728n997o505n742m887
$$ 1555784 1558241 1560628 1563332 1565954 1568072 1569980 1572038 1573527 1572860 1569132 1563135 1556630 1550888 1546001
60693A546001m861n974p792r183r087p510n461l866k955k668k920l330l337k962
$$ 1546001 1541140 1535166 1527374 1518191 1509104 1501594 1496133 1492267 1489312 1486644 1483724 1480394 1477057 1474095
60679A474095k924l696m781n236m662l577k953l299m003m011l446l828n869p953
$$ 1474095 1471171 1467475 1462694 1457458 1452796 1449219 1446266 1442967 1438964 1434953 1431507 1427679 1421810 1413857
60665A413857q122o883o368p134p756p438o827o024m229j989j387k801l782k656
$$ 1413857 1405735 1398852 1392484 1385350 1377594 1370156 1363329 1357305 1353076 1351087 1349700 1346899 1343117 1340461
60651A340461j099j437l298n018o599q875j0989j1369j0437j0035j0682j1566
$$ 1340461 1339362 1337925 1334627 1329609 1323010 1314135 1303146 1291777 1281340 1271305 1260623 1249057
60639A249057j2697j4871j7580j9179j9200j8677j8112j6844j4534j1831r513
$$ 1249057 1236360 1221489 1203909 1184730 1165530 1146853 1128741 1111897 1097363 1085532 1076019
60628A076019q238q779j0865j2234j0727p305m978m761m835l906l028l212l356
$$ 1076019 1067781 1059002 1048137 1035903 1025176 1017871 1012893 1008132 1003297 999391 996363 993151 989795
60615I89795k027J76J533J698K011L619O137Q118Q536P959Q157J0025J2269J2955
$$ 989795 987768 987944 989477 991175 993186 996805 1002942 1011060 1019596 1027555 1035712 1045737 1058006 1070961
60601A070961J1988J1034J1157J1866J2417J2705J2660J2039J1275J1446J2948
$$ 1070961 1082949 1093983 1105140 1117006 1129423 1142128 1154788 1166827 1178102 1189548 1202496
60590A202496J5001J6696J7715J8020J7881J8186J9436K0417J9285J6311J3981
$$ 1202496 1217497 1234193 1251908 1269928 1287809 1305995 1325431 1345848 1365133 1381444 1395425
60579A395425J3851J4761J4864J3952J2815J1624J0251R167Q696P997O072L252
$$ 1395425 1409276 1424037 1438901 1452853 1465668 1477292 1487543 1496710 1505406 1513403 1519475 1522727
60567A522727N88j835m718p873j0037j0660j0812j1899j4156j6771j8938k0129
$$ 1522727 1523315 1521480 1516762 1508889 1498852 1488192 1477380 1465481 1451325 1434554 1415616 1395487
60555A395487j9879j8106j5605j3457j1727r446o246l249j536m22J638M817P924
$$ 1395487 1375608 1357502 1341897 1328440 1316713 1307267 1301021 1297772 1296236 1295814 1297452 1302269 1310193
60542A310193J0384J2730J4921J5931J5601J5223J5373J4804J2533R436O527L318
$$ 1310193 1320577 1333307 1348228 1364159 1379760 1394983 1410356 1425160 1437693 1447129 1453656 1456974
60530A456974m31k912k382L6J928L095N073P881R803J0137R718Q798O821M364
$$ 1456974 1456543 1453631 1451249 1451285 1453213 1456308 1461381 1469262 1479065 1489202 1498920 1507718 1514539 1518903
60516A518903K838J998J57k731m734n224n926p811r546j0260j1265j3355j4685
$$ 1518903 1521741 1523739 1523896 1521165 1516431 1511207 1505281 1497470 1487924 1477664 1466399 1453044 1438359
60503A438359j3613j1753j1782j3392j3811j1812q934o945n948n086l689j498
$$ 1438359 1424746 1412993 1401211 1387819 1374008 1362196 1353262 1346317 1340369 1335283 1331594 1330096
60491A330096J161L274M083M203N095P429J0552J3425J5547J7116J8770K1131
$$ 1330096 1331257 1334531 1338614 1342817 1347912 1355341 1365893 1379318 1394865 1411981 1430751 1451882
60479A451882K4218K7487L0658L4290L9132M5237N1850N8079O3604O8940P4902
$$ 1451882 1476100 1503587 1534245 1568535 1607667 1652904 1704754 1762833 1826437 1895377 1970279
60468A970279Q1346Q6652Q8893Q7264Q1738P1892N7357L9347K0611L744r598j8218
$$ 1970279 2051625 2138277 2227170 2314434 2396172 2468064 2525421 2564768 2585379 2589123 2579525 2561307
60456B561307k1714k1331j8896j4730q214o16M835O514O196O143O229N416M434
$$ 2561307 2539593 2518262 2499366 2484636 2476422 2475806 2480641 2487155 2493351 2499494 2505723 2511139 2515573
60443B515573M979P254J0156J3375J7638K3129K9261L5873M3438N2150O1831P2566
$$ 2515573 2520552 2527806 2537962 2551337 2568975 2592104 2621365 2657238 2700676 2752826 2814657 2887223
60431B887223Q4492R7136J09817J22496J35282J47358J57333J64680J70085J74615
$$ 2887223 2971715 3068851 3178668 3301164 3436446 3583804 3741137 3905817 4075902 4250517
60421D250517J79447J86274J96939K12505K33267K59714K92666L32226L77074
$$ 4250517 4429964 4616238 4813177 5025682 5258949 5518663 5811329 6143555 6520629
60412F520629M24986M73390N18906N56290N78026N75201N39639M66522L56428
$$ 6520629 6945615 7419005 7937911 8494201 9072227 9647428 10187067 10653589 11010017
60403A1010017K15929N6570j07385k61741l94550m97269n65638o00633o08201
$$ 11010017 11225946 11282516 11175131 10913390 10518840 10021571 9455933 8855300 8247099
60394H247099n96458n72108n39115n00095m57909m15669l75775l39166l05269
$$ 8247099 7650641 7078533 6539418 6039323 5581414 5165745 4789970 4450804 4145535
60385D145535k73032k42603k15584j93018j73650j55359j37910j22869j11061
$$ 4145535 3872503 3629900 3414316 3221298 3047648 2892289 2754379 2631510 2520449
60376B520449j01512r3033q5265p7982p0870o4475n9861n6844n3928n0462m7329
$$ 2520449 2418937 2325904 2240639 2162657 2091787 2027312 1967451 1910607 1856679 1806217 1758888
60365A758888m4954m2217l8381l4561l2059l0466k8574k6130k3610k1198j9130
$$ 1758888 1713934 1671717 1633336 1598775 1566716 1536250 1507676 1481546 1457936 1436738 1417608
60354A417608j8079j7977j7360j5097j2065r918q865p889o605n590n132m910m698
$$ 1417608 1399529 1381552 1364192 1349095 1337030 1327112 1318247 1310358 1303753 1298163 1293031 1288121 1283423
60341A283423m494m082l257k323j617p83P63K755M084L965K844K077K644L863
$$ 1283423 1278929 1274847 1271590 1269267 1267650 1266867 1267630 1270385 1274469 1278434 1281278 1283355 1285999 1289862
60327A289862L750J340j648k609j322j36p71k522m017n132o248p102p411p586
$$ 1289862 1293612 1294952 1293304 1290695 1289373 1289237 1288466 1285944 1281927 1276795 1270547 1263445 1256034 1248448
60313A248448p809p421o085m607l746l211k569k144k130j936j194l59L93J599
$$ 1248448 1240639 1233218 1227133 1222526 1218780 1215569 1213000 1210856 1208726 1206790 1205596 1205237 1205630 1207229
60299A207229L041L273J746K3l06L67R76J727L271M989N767N582N097M524M012
$$ 1207229 1210270 1213543 1215289 1215312 1215006 1215373 1216349 1218076 1221347 1226336 1232103 1237685 1242782 1247306 1251318
60284A251318M216N295O365O937P648Q579Q571P447P053Q422R786R536R070J0179
$$ 1251318 1255534 1260829 1267194 1274131 1281779 1290358 1298929 1306376 1313429 1321851 1331637 1341173 1350243 1360422
60270A360422J1369J0011P004N904P933J1023J3504J5487J6623J5683J2973J0458
$$ 1360422 1371791 1381802 1388806 1394710 1402643 1413666 1427170 1442657 1459280 1474963 1487936 1498394
60258A498394Q743O288K250k213o032r394j2171j3432j3320j3281j3647j3014
$$ 1498394 1507137 1513425 1515675 1513462 1507430 1498036 1485865 1472433 1459113 1445832 1432185 1419171
60246A419171j0967r291r323r927r340p493n322l227j454o31o42k07J298K671
$$ 1419171 1408204 1398913 1389590 1379663 1370323 1362830 1357508 1354281 1352827 1352196 1351554 1351347 1352645 1355316
60232A355316K614J652J221J808K943M154M821M095K233J253K939O534R540J0562
$$ 1355316 1357930 1359582 1360803 1362611 1365554 1369708 1374529 1378624 1380857 1382110 1385049 1391583 1401123 1411685
60218A411685J0437J0714J1919J3364J4107J3844J3182J3015J3689J4941J6472
$$ 1411685 1422122 1432836 1444755 1458119 1472226 1486070 1499252 1512267 1525956 1540897 1557369
60207A557369J8073J9251J9605J9697K0793K3322K6291K8661L0743L3601L7491
$$ 1557369 1575442 1594693 1614298 1633995 1654788 1678110 1704401 1733062 1763805 1797406 1834897
60196A834897M1570M5041M8087N1475N5626O0415O5738P1713P8039Q3763Q8663
$$ 1834897 1876467 1921508 1969595 2021070 2076696 2137111 2202849 2274562 2352601 2436364 2525027
60185B525027R4447J03164J14208J24362J31492J36871J42945J50172J57330J63585
$$ 2525027 2619474 2722638 2836846 2961208 3092700 3229571 3372516 3522688 3680018 3843603
60175C843603J68524J71025J70087J66369J61234J54630J45497J33925J21053
$$ 3843603 4012127 4183152 4353239 4519608 4680842 4835472 4980969 5114894 5235947
60166E235947J07027R0952P2943N4457L6408J8645J604j3197k4739l3106l8246
$$ 5235947 5342974 5433926 5506869 5561326 5597734 5616379 5617983 5604786 5580047 5546941 5508695
60155E508695l9776l8381l5696l2060k5947j6468m925P118J9974L4761N1163O7597
$$ 5508695 5468919 5430538 5394842 5362782 5336835 5320367 5315442 5322560 5342534 5377295 5428458 5496055
60143E496055Q3111R7978J12634J26864J39957J51075J59385J64263J65381J62554
$$ 5496055 5579166 5677144 5789778 5916642 6056599 6207674 6367059 6531322 6696703 6859257
60133F859257J55669J44770J30240J12836R3411P2216M8784K3307j926k3978m2571
$$ 6859257 7014926 7159696 7289936 7402772 7496183 7568399 7617183 7640490 7638564 7614586 7572015
60122G572015o0207p8043r3419j03138j07508j08786j06921r9841q7508p2739
$$ 7572015 7511808 7433765 7340346 7237208 7129700 7020914 6913993 6814152 6726644 6653905
60112F653905n7608m1516k3382l513J7315L8640N9351P7734R3118J05955J15861
$$ 6653905 6596297 6554781 6531399 6527886 6545201 6583841 6643192 6720926 6814044 6919999 7035860
60101G035860J21288J21549J17363J08962R5757P8628O0489M3452K7174J0997
$$ 7035860 7157148 7278697 7396060 7505022 7600779 7679407 7739896 7783348 7810522 7821519
60091G821519m036j6544k6410l3740l7531l6750l1507k2060q005J0284L0739N1562
$$ 7821519 7817483 7800939 7774529 7740789 7703258 7666508 7635001 7612941 7604936 7615220 7645959 7697521
60079G697521P3025R6056J20212J44539J69598J96853K26486K57239K88192L19603
$$ 7697521 7770546 7866602 7986814 8131353 8300951 8497804 8724290 8981529 9269721 9589324
60069I589324L51979L85114M17932M48678M75540M97347N13371N22542N23749
$$ 9589324 9941303 10326417 10744349 11193027 11668567 12165914 12679285 13201827 13725576
60060A3725576N16923N02553M79814M46762M03235L52143K96739K37740J74307
$$ 13725576 14242499 14745052 15224866 15671628 16074863 16427006 16723745 16961485 17135792
60051A7135792J06830L7170l3215j03696j72904k37916k95464l43486l81433m09377
$$ 17135792 17242622 17279792 17246577 17142881 16969977 16732061 16436597 16093111 15711678 15302301
60041A5302301m27056m33881m29957m16541l95069l66252l30965k91389k49927
$$ 15302301 14875245 14441364 14011407 13594866 13199797 12833545 12502580 12211191 11961264
60032A1961264k07288j63097j18231p4909l4358L831L9716P1960R9227J20898
$$ 11961264 11753976 11590879 11472648 11397739 11363381 11367212 11406928 11478888 11578115 11699013
60022A1699013J35865J42394J40100J30551J15038R3335O5594L3999J243l1460
$$ 11699013 11834878 11977272 12117372 12247923 12362961 12456296 12521890 12555889 12557132 12525672
60012A2525672o3853r5286j25003j52874j78766k01845k21108k35879k45448k49424
$$ 12525672 12461819 12366533 12241530 12088656 11909890 11708045 11486937 11251058 11005610 10756186
60002A0756186k48781k45280k39424k30413k18363k04778j90163j73219j53321
$$ 10756186 10507405 10262125 10022701 9792288 9573925 9369147 9178984 9005765 8852444
59993H852444j31917j10393q8364o5289m1966j8974M443K8528N1731P2863R2768
$$ 8852444 8720527 8610134 8521770 8456481 8414515 8395541 8399984 8428512 8480243 8553106 8645874
59982H645874J12019J28575J39728J44983J45063J39463J27156J08796Q6227O0699
$$ 8645874 8757893 8886468 9026196 9171179 9316242 9455705 9582861 9691657 9777884 9838583
59972I838583L3256N637k1370m9340p9648j10241j37108j58283j74256j85160
$$ 9838583 9871839 9877476 9856106 9806766 9727118 9616877 9479769 9321486 9147230 8962070
59962H962070j90174j89593j85137j77848j67355j53324j36199j16661r5673p4819
$$ 8962070 8771896 8582303 8397166 8219318 8051963 7898639 7762440 7645779 7550106 7475287
59952G475287n5011l5281j4185Q052L0332N2854P6564J00922J24333J46584J68680
$$ 7475287 7420276 7384995 7370810 7378862 7409194 7462048 7538612 7639534 7763867 7910451 8079131
59941H079131J90160K08649K22371K31205K34837K31749K20851K02755J78856
$$ 8079131 8269291 8477940 8700311 8931516 9166353 9398102 9618953 9821708 10000564
59932A0000564J50407J19007Q6593N4023K0504j4784n0957q5676j16619j42447
$$ 10000564 10150971 10269978 10356571 10410594 10431098 10416314 10365357 10279681 10163062 10020615
59922A0020615j62776j77524j86319j88640j84614j75120j60970j42779j21826
$$ 10020615 9857839 9680315 9493996 9305356 9120742 8945622 8784652 8641873 8520047
59913H520047r9925p7816n4794l0593o296J7506M1765O6658Q9715J08310J22944
$$ 8520047 8420122 8342306 8287512 8256919 8250623 8268129 8309894 8376552 8466267 8574577 8697521
59902H697521J35949J47754J56640J61607J63125J61126J54688J44076J31298
$$ 8697521 8833470 8981224 9137864 9299471 9462596 9623722 9778410 9922486 10053784
59893A0053784J18214J05401R2960Q1123P0059O0324N3218M9514M8553N0163N6618
$$ 10053784 10171998 10277399 10370359 10451482 10521541 10581865 10635083 10684597 10733150 10783313 10839931
59882A0839931P0363R0310J13009J37437J65970K00115K38051K77426L18155L60831
$$ 10839931 10910294 11000604 11113613 11251050 11417020 11617135 11855186 12132612 12450767 12811598
59872A2811598M04117M45271M82108N13118N36476N49980N51172N36979N04244
$$ 12811598 13215715 13660986 14143094 14656212 15192688 15742668 16293840 16830819 17335063
59863A7335063M51600L80239K92615J91580Q1399l1637j40794k40733l27649l98799
$$ 17335063 17786663 18166902 18459517 18651097 18732496 18700859 18560065 18319332 17991683 17592884
59853A7592884m52805m89785n10558n16216n08740m90985m65356m33082l95270
$$ 17592884 17140079 16650294 16139736 15623520 15114780 14623795 14158439 13725357 13330087
59844A3330087l53873l10866k67116k22641j77636j32749q8753m6330n962L2260
$$ 13330087 12976214 12665348 12398232 12175591 11997955 11865206 11776453 11730123 11724161 11756421
59834A1756421O8266J01415J30689J55396J75111J88709J94213J89853J74868
$$ 11756421 11824687 11926102 12056791 12212187 12387298 12576007 12770220 12960073 13134941
59825A3134941J49108J12513O5464R412n2971j18031j81603k39835k90131l31470
$$ 13134941 13284049 13396562 13462026 13471438 13418467 13300436 13118833 12878998 12588867 12257397
59815A2257397l63936l87873m03154m09273m06538l97049l83679l67766l48719
$$ 12257397 11893461 11505588 11102434 10693161 10286623 9889574 9505895 9138129 8789410
59806H789410l26232l01844k77495k53608k29559k05293j81520j59011j38678
$$ 8789410 8463178 8161334 7883839 7630231 7400672 7195379 7013859 6854848 6716170
59797F716170j21594j08044r7277q8994q3945q1940q0522p7237p2216o6839o0950
$$ 6716170 6594576 6486532 6389255 6300261 6216316 6134376 6053854 5976617 5904401 5837562 5776612
59786E776612n3441m4859l7039l0445k4139j8326j4751j4450j7087k2743l2083
$$ 5776612 5723171 5678312 5641273 5610828 5586689 5568363 5553612 5539162 5522075 5499332 5467249
59775E467249m4161n6060o5606p2899p8487q1597q1243p7850p2785o7008o0819
$$ 5467249 5423088 5367028 5301422 5228523 5150036 5068439 4987196 4909346 4836561 4769553 4708734
59764D708734n4123m6460l7398k7329j7250p758J223R947J8985K9540M2359N6281
$$ 4708734 4654611 4608151 4570753 4543424 4526174 4518416 4519639 4529586 4548571 4578111 4620470 4676751
59752D676751O8979P9043Q6305R0574R1712R0972R0497R0964R1021Q9313Q5720
$$ 4676751 4745730 4824773 4911078 5001652 5093364 5184336 5274833 5365797 5456818 5546131 5631851
59741E631851Q0100P1360N8818M3950K9958J9733J4156J2032J1862J4040K0562
$$ 5631851 5711951 5783311 5842129 5886079 5916037 5935770 5949926 5961958 5973820 5987860 6008422
59730F008422L2028M6103O0272P5035R2565J12980J34198J55321J77878K03371
$$ 6008422 6040450 6086553 6146825 6221860 6314425 6427405 6561603 6716924 6894802 7098173
59720G098173K31474K61174K92267L25056L59641L95658M31621M64354M89610
$$ 7098173 7329647 7590821 7883088 8208144 8567785 8963443 9395064 9859418 10349028
59711A0349028N02392M95617M60209L89866K86813J62000L0203r4060j98349k74941
$$ 10349028 10851420 11347037 11807246 12197112 12483925 12645925 12676128 12582068 12383719 12108778
59701A2108778l23366l48362l54728l45615l24910k97726k67442k34754k00392
$$ 12108778 11785412 11437050 11082322 10736707 10411797 10114071 9846629 9611875 9411483
59692I411483j66290j33236j00017o6284l4125n336K1056M7344P4696J03044J31824
$$ 9411483 9245193 9111957 9011940 8945656 8911531 8906195 8927251 8974595 9049291 9152335 9284159
59681I284159J59955J86743K13319K41614K71632L01852L32511L65772M01988
$$ 9284159 9444114 9630857 9844176 10085790 10357422 10659274 10991785 11357557 11759545
59672A1759545M38834M75302N13666N55795O00354O45587O92253P41416P91579
$$ 11759545 12198379 12673681 13187347 13743142 14343496 14989083 15681336 16422752 17214331
59663A7214331Q40482Q87803R33409R74281J005735J024741J030112J020812R96790
$$ 17214331 18054813 18942616 19876025 20850306 21856041 22880782 23910894 24931706 25928496
59654B5928496R60955R18368Q73780Q31269P95073P68870P54487P52355P62089
$$ 25928496 26889451 27807819 28681599 29512868 30307941 31076811 31831298 32583653 33345742
59645C3345742P81185Q04320Q25598Q40768Q46268Q37598Q10483P62851O94475
$$ 33345742 34126927 34931247 35756845 36597613 37443881 38281479 39091962 39854813 40549288
59636D0549288O06289N01749L87521K70684J56198M8556m5769j20219j71854k01111
$$ 40549288 41155577 41657326 42044847 42315531 42471729 42520285 42474516 42354297 42182443 41981332
59626D1981332k08666j94790j61160j10814m6211L0955J18280K12931L13377M19116
$$ 41981332 41772666 41577876 41416716 41305902 41259691 41290646 41408926 41621857 41935234 42354350
59616D2354350N28771O39862P50269Q58270R60818J052728J127255J176483J191846
$$ 42354350 42883121 43522983 44273252 45131522 46092340 47145068 48272323 49448806 50640652
59607E0640652J165735J092516R67381P86154N49084K65370m7546l69246o80293
$$ 50640652 51806387 52898903 53866284 54652438 55201522 55466892 55419346 55050100 54369807
59598E4369807r63003j202526j389493j521141j599475j629191j617245j572538
$$ 54369807 53406804 52204278 50814785 49293644 47694169 46064978 44447733 42875195
59590D2875195j504542j422266j334763j252205j185929j146609j140558j165979
$$ 42875195 41370653 39948387 38613624 37361419 36175490 35028881 33888323 32722344
59582C2722344j212319j264239j307403j332283j335051j316669j280768j231111
$$ 32722344 31510025 30245786 28938383 27606100 26271049 24954380 23673612 22442501
59574B2442501j170563j102110j029609r56660q85448q17222p53073o93477o37901
$$ 22442501 21271938 20169828 19140219 18183559 17298111 16480889 15727816 15034339 14396438
59565A4396438n85762n37153m92034m49765m10166l74108l42052l12876k85155
$$ 14396438 13810676 13273523 12781489 12331724 11921558 11547450 11205398 10892522 10607367
59556A0607367k58786k34521k12784j93868j78330j66289j57144j50714j47546
$$ 10607367 10348581 10114060 9901276 9707408 9529078 9362789 9205645 9054931 8907385
59547H907385j47382j48753j51041j55307j61700j67701j70673j70842j69954
$$ 8907385 8760003 8611250 8460209 8304902 8143202 7975501 7804828 7633986 7464032
59538G464032j68292j64916j59800j53482j45402j34780j22733j11508j01800
$$ 7464032 7295740 7130824 6971024 6817542 6672140 6537360 6414627 6303119 6201319
59529F201319r2416q2280p1210n9304m7128l5992k6491j7386p588J722Q807J4330
$$ 6201319 6108903 6026623 5955413 5896109 5848981 5812989 5786498 5769112 5761524 5763246 5772053 5786383
59517E786383K0247K6414L1003L4153L8333M4457N0141N3036N4038N6044O0799
$$ 5786383 5806630 5833044 5864047 5898200 5936533 5980990 6031131 6084167 6138205 6194249 6255048
59506F255048O8046P6735Q6091R6030J07125J19816J33611J47691J62156J77715
$$ 6255048 6323094 6399829 6485920 6581950 6689075 6808891 6942502 7090193 7252349 7430064
59496G430064J94269K10935K27706K45953K66649K88884L10701L31062L50440
$$ 7430064 7624333 7835268 8062974 8308927 8575576 8864460 9175161 9506223 9856663
59487I856663L69585L87982M03847M15549M22576M24691M21001M10977L95971
$$ 9856663 10226248 10614230 11018077 11433626 11856202 12280893 12701894 13112871 13508842
59478A3508842L78085L57710L33916L07167K79182K49615K15742J77059J37908
$$ 13508842 13886927 14244637 14578553 14885720 15164902 15414517 15630259 15807318 15945226
59469A5945226J03616P5804N3315L5805K4061J8413J9281K8121M5389O8565R4465
$$ 15945226 16048842 16124646 16177961 16213766 16237827 16256240 16275521 16303642 16349031 16417596 16512061
59458A6512061J22279J51804J79637J99937K08538K03889J84653J49418R8933
$$ 16512061 16634340 16786144 16965781 17165718 17374256 17578145 17762798 17912216 18011149
59449A8011149L6256l5605j14406j97248k80319l59970m32446m93304n39210n70024
$$ 18011149 18047405 18011800 17897394 17700146 17419827 17059857 16627411 16134107 15594897 15024873
59439A5024873n87282n91422n82624n63357n37284n05994m69549m29812l90331
$$ 15024873 14437591 13846169 13263545 12700188 12162904 11656910 11187361 10757549 10367218
59430A0367218l52785l16334k80612k46538k14011j81658j49499j19262r1363
$$ 10367218 10014433 9698099 9417487 9170949 8956938 8775280 8625781 8506519 8415156
59421H415156o4104l6543r777J5397L9758O3894Q7453J10933J35783J61820J86709
$$ 8415156 8351052 8314509 8304732 8320129 8359887 8423781 8511234 8622167 8757950 8919770 9106479
59410I106479K09150K30368K51364K70641K85972K96569L02084L00938K91085
$$ 9106479 9315629 9545997 9797361 10068002 10353974 10650543 10952627 11253565 11544650
59401A1544650K71526K42270K03727J56613J01549L8938k9227r7737j60700k16098
$$ 11544650 11816176 12058446 12262173 12418786 12520335 12559273 12530046 12432309 12271609 12055511
59391A2055511k65672l10006l46271l71702l86791l93688l93705l87846l77895
$$ 12055511 11789839 11479833 11133562 10761860 10375069 9981381 9587676 9199830 8821935
59382H821935l65222l49823l31814l12449k92572k71711k49978k29340k11375
$$ 8821935 8456713 8106890 7775076 7462627 7170055 6898344 6648366 6419026 6207651
59373F207651j94980j77988j60137j43064j27975j14571j01887q9296p6940o5578
$$ 6207651 6012671 5834683 5674546 5531482 5403507 5288936 5187049 5097753 5020813 4955235
59363D955235n5633m6452l7123k7838j9383j1614l675M479J2250J9629K6693L2666
$$ 4955235 4899602 4853150 4816027 4788189 4768806 4757192 4753517 4757996 4770246 4789875 4816568 4849234
59351D849234L7640M4080N3372O1264O1131N2673M3562M0900M4714N1706O1225
$$ 4849234 4886874 4930954 4984326 5045590 5106721 5159394 5202956 5243856 5288570 5340276 5401501
59340E401501P4318Q9985J06324J23226J40336J54130J61151J63400J67093J76300
$$ 5401501 5475819 5565804 5672128 5795354 5935690 6089820 6250971 6414371 6581464 6757764
59330F757764J90821K09715K33237K60814K90278L20340L51887L86110M23164
$$ 6757764 6948585 7158300 7391537 7652351 7942629 8262969 8614856 9000966 9424130
59321I424130M63061N05898N50524N94911O38768O84093P31751P78689Q19594
$$ 9424130 9887191 10393089 10943613 11538524 12177292 12861385 13593136 14371825 15191419
59312A5191419Q50422Q69166Q74126Q63309Q36027P94227P41733O82480O19660
$$ 15191419 16041841 16911007 17785133 18648442 19484469 20278696 21020429 21702909 22322569
59303B2322569N56084M94392M36319L81936L30152K79990K30951J82068J31301
$$ 22322569 22878653 23373045 23809364 24191300 24521452 24801442 25032393 25214461 25345762
59294B5345762P6287J5672n0349j20411j92607k64815l34520l98507m53446m97577
$$ 25345762 25422049 25437721 25387372 25266961 25074354 24809539 24475019 24076512 23623066 23125489
59284B3125489n31896n59271n82361o02259o18494o29731o34921o34345o29162
$$ 23125489 22593593 22034322 21451961 20849702 20231208 19601477 18966556 18332211 17703049
59275A7703049o19487o03796n81090n52797n21481m88484m54105m19341l85633
$$ 17703049 17083562 16479766 15898676 15345879 14824398 14335914 13881809 13462468 13076835
59266A3076835l53253l21586k90853k62175k36196k13136j93778j78576j66161
$$ 13076835 12723582 12401996 12111143 11848968 11612772 11399636 11205858 11027282 10861121
59257A0861121j54738j44954j39296j38521j40560j43131j45417j47035j47512
$$ 10861121 10706383 10561429 10422133 10283612 10143052 9999921 9854504 9707469 9559957
59248I559957j47301j47209j46327j42665j36298j29618j23653j16548j06815
$$ 9559957 9412656 9265447 9119120 8976455 8840157 8710539 8586886 8470338 8363523
59239H363523r5823q5515p5574o4586n2524m0438k8644j6583l587J1051K7684
$$ 8363523 8267700 8182185 8106611 8042025 7989501 7949063 7920419 7903836 7900249 7911300 7938984
59228G938984M5135O1273P5701R0534J07542J25874J43621J60293J76465J92077
$$ 7938984 7984119 8045392 8121093 8211627 8319169 8445043 8588664 8748957 8925422 9117499
59218I117499K06515K19614K31540K42096K50746K56579K57816K52381K39506
$$ 9117499 9324014 9543628 9775168 10017264 10268010 10524589 10782405 11034786 11274292
59209A1274292K19895J94152J62150J24231Q1703L6017j1187n7162r9000j35981
$$ 11274292 11494187 11688339 11850489 11974720 12056423 12092440 12081253 12024091 11925091 11789110
59199A1789110j69439k00155k27689k52166k74210k92365l03092l04515k98321
$$ 11789110 11619671 11419516 11191827 10939661 10665451 10373086 10069994 9765479 9467158
59190I467158k87235k72642k55443k36774k16676j94263j70332j47641j27399
$$ 9467158 9179923 8907281 8651838 8415064 8198388 8004125 7833793 7686152 7558753
59181G558753j07841q7476o7201m7713k7424m910J8804M2357O6314R1452J17044
$$ 7558753 7450912 7363436 7296235 7248522 7221098 7216188 7234992 7277349 7343663 7435115 7552159
59170G552159J42928J71031K02471K35185K66984K98992L33462L69892M06123
$$ 7552159 7695087 7866118 8068589 8303774 8570758 8869750 9203212 9573104 9979227
59161I979227M41656M76683N08735N33195N46721N47836N34794N05277M58038
$$ 9979227 10420883 10897566 11406301 11939496 12486217 13034053 13568847 14074124 14532162
59152A4532162L93218L11723K16060J10897J232j09188k16284l14290l98093m65760
$$ 14532162 14925380 15237103 15453163 15564060 15565292 15456104 15239820 14925530 14527437 14061677
59142A4061677n16907n50132n64575n62705n48870n25915m95536m60819m25439
$$ 14061677 13544770 12994638 12430063 11867358 11318488 10792573 10297037 9836218 9410779
59133I410779l90743l56114l21856k89422k59222k30686k04344j81564j62228
$$ 9410779 9020036 8663922 8342066 8052644 7793422 7562736 7358392 7176828 7014600
59124G014600j44563j27246j10091r3044p6216o0593m7138l5535k5024j5734p732
$$ 7014600 6870037 6742791 6632700 6539656 6463440 6402847 6355709 6320174 6295150 6279416 6271684
59113F271684M0Q313J6210K3131L0284L8182M4279M6054M5102M4987M5791M4289
$$ 6271684 6271724 6280037 6296247 6319378 6349662 6387844 6432123 6478177 6523279 6568266 6614057 6658346
59101F658346L9107L2252K5247J7089O827m551j5866k7157l8426m8794n7638o4980
$$ 6658346 6697453 6729705 6754952 6772041 6778868 6774317 6758451 6731294 6692868 6644074 6586436 6521456
59089F521456p0258p2348p1278o8542o5317o1506n6574n0258m2550l4189k6661
$$ 6521456 6451198 6378850 6307572 6239030 6173713 6112207 6055633 6005375 5962825 5928636 5901975
59078E901975k0471j3931n321M517J3471K1397K9864L9285M8600N7605O7193P7232
$$ 5901975 5881504 5867573 5862252 5866769 5880240 5901637 5931501 5970786 6019386 6076991 6144184 6221416
59066F221416Q6463R4906J04366J16022J29058J41957J53659J63579J72084J80816
$$ 6221416 6307879 6402785 6507151 6623173 6752231 6894188 7047847 7211426 7383510 7564326
59056G564326J90811K00440K07008K10136K11636K12304K11180K08128K04653
$$ 7564326 7755137 7955577 8162585 8372721 8584357 8796661 9007841 9215969 9420622
59047I420622K01432J97042J90138J81294J71821J62088J51812J40881J28934
$$ 9420622 9622054 9819096 10009234 10190528 10362349 10524437 10676249 10817130 10946064
59038A0946064J14573R5513O9409L5051o750n3791j04320j57330k10466k59426
$$ 10946064 11060637 11156150 11225559 11260610 11253860 11200069 11095749 10938419 10727953 10468527
59028A0468527l00854l34472l60837l78708l86997l87777l84362l77083l63967
$$ 10468527 10167673 9833201 9472364 9093656 8706659 8318882 7934520 7557437 7193470
59019G193470l45285l24428l04061k84090k63941k44416k26405k09635j93666
$$ 7193470 6848185 6523757 6219696 5935606 5671665 5427249 5200844 4991209 4797543
59010D797543j78747j65255j53213j42496j32585j22606j12654j04237r8137r2802
$$ 4797543 4618796 4453541 4300328 4157832 4025247 3902641 3789987 3685750 3587613 3494811
59000C494811q6504p9862p4254o9072o3002n6868n2417m9239m5749m2404m0722
$$ 3494811 3408307 3328445 3254191 3185119 3122117 3065249 3012832 2963593 2917844 2875440 2834718
58989B834718l9761l7060l2851k9802k8520k6888k4250k2508k2225k1070j7432
$$ 2834718 2794957 2757897 2725046 2695244 2666724 2639836 2615586 2593078 2570853 2549783 2532351
58978B532351j2570q027l732M2J809J477J301K656M167M518M746O103P762Q528
$$ 2532351 2519781 2511754 2508022 2508064 2509873 2511350 2512651 2515307 2519474 2523992 2528738 2534841 2542603 2551131
58964B551131R157J1060J3901J5993J6328J5155J3402J2058J1222R657O458K930
$$ 2551131 2560288 2571348 2585249 2601242 2617570 2632725 2646127 2658185 2669407 2679064 2685522 2688452
58952B688452J074M93p99k577k375J06J735N69j061j11K555L469J105k893o257
$$ 2688452 2689526 2690019 2689220 2686643 2684268 2684374 2686109 2686678 2685617 2685506 2688061 2691530 2692635 2689742 2683485
58937B683485q237r531j1280j3794j5818j5609j2971r484o563m400k812j864j205
$$ 2683485 2675248 2665717 2654437 2640643 2624825 2609216 2596245 2586761 2580198 2575798 2572986 2571122 2569917
58924B569917J30K821O639J0581J3083J3100J1877J2507J6165K0166K1720K2048
$$ 2569917 2570047 2572868 2579507 2590088 2603171 2616271 2628148 2640655 2656820 2676986 2698706 2720754
58912B720754K4161K7932L0821L2453L4788L8061M0558M2412M5653M9873N1953
$$ 2720754 2744915 2772847 2803668 2836121 2870909 2908970 2949528 2991940 3037593 3087466 3139419
58901C139419N1116N0430N1850N3620N4261N5476N8737O2245O4006O5325O8598
$$ 3139419 3190535 3240965 3292815 3346435 3400696 3456172 3514909 3577154 3641160 3706485 3775083
58890C775083P3592P8418Q2621Q7119R2351R8188J04511J10723J16037J21261
$$ 3775083 3848675 3927093 4009714 4096833 4189184 4287372 4391883 4502606 4618643 4739904
58880D739904J28546J38473J49195J59310J69549J80697J92330K04623K18925
$$ 4739904 4868450 5006923 5156118 5315428 5484977 5665674 5858004 6062627 6281552
58871F281552K35111K50908K65386K80791K99121L19361L40047L62262L87781
$$ 6281552 6516663 6767571 7032957 7313748 7612869 7932230 8272277 8634539 9022320
58862I022320M16114M45668M76424N09399N44655N81618O20180O60101P00510
$$ 9022320 9438434 9884102 10360526 10869925 11414580 11996198 12616378 13276479 13976989
58853A3976989P41261P83287Q26358Q68040R05945R39209R66459R84157R88372
$$ 13976989 14718250 15501537 16327895 17195935 18101880 19041089 20007548 20991705 21980077
58844B1980077R76499R45981Q93239Q15531P12531N85216M35386K67736R0421
$$ 21980077 22956576 23902557 24795796 25611327 26323858 26909074 27344460 27612196 27702617
58835B7702617q8101k61414m23605n68046o89627p86682q59436r08523r36111
$$ 27702617 27614516 27353102 26929497 26361451 25671824 24885142 24025706 23117183 22181072
58826B2181072r46031r41090r22273q91865q54769q14973p73127p29426o86161
$$ 22181072 21235041 20293951 19371678 18479813 17625044 16810071 16036944 15307518 14621357
58817A4621357o45221o05661n66376n29058m95906m66382m38719m12728l88533
$$ 14621357 13976136 13370475 12804099 12275041 11779135 11312753 10874034 10461306 10072773
58808A0072773l64585l39891l16525k96940k80019k62643k44013k25763k08863
$$ 10072773 9708188 9368297 9051772 8754832 8474813 8212170 7968157 7742394 7533531
58799G533531j93107j78801j66257j54114j40613j26153j12620j00616q9153p7461
$$ 7533531 7340424 7161623 6995366 6841252 6700639 6574486 6461866 6361250 6272097 6194636
58789F194636o5526n3380m1306k9997j9369q234L860J5900K7538M0082N3950O7259
$$ 6194636 6129110 6075730 6034424 6004427 5985058 5976824 5980684 5996584 6024122 6064204 6118154 6185413
58777F185413P8716Q9908J02790J16767J30363J43774J57550J70831J83455J97924
$$ 6185413 6264129 6354037 6456827 6573594 6703957 6847731 7005281 7176112 7359567 7557491
58767G557491K16352K37004K56772K75703K96163L18866L42788L68052L95609
$$ 7557491 7773843 8010847 8267619 8543322 8839485 9158351 9501139 9869191 10264800
58758A0264800M24779M54177M84854N19423N58057N98160O38271O79736P23768
$$ 10264800 10689579 11143756 11628610 12148033 12706090 13304250 13942521 14622257 15346025
58749A5346025P68972Q12517Q52328Q87312R16227R36754R45445R38543R12947
$$ 15346025 16114997 16927514 17779842 18667154 19583381 20520135 21465580 22404123 23317070
58740B3317070Q65839P93953O95122N70984M26491K66408R4599q2763k56396m18114
$$ 23317070 24182909 24976862 25671984 26242968 26669459 26935867 27030466 26947703 26691307 26273193
58730B6273193n63649o89967p92777q69240r21013r52038r65060r62183r46707
$$ 26273193 25709544 25019577 24226800 23357560 22436547 21484509 20519449 19557266 18610559
58721A8610559r21787q88827q49406q06822p63616p19634o74913o32206n93931
$$ 18610559 17688772 16799945 15950539 15143717 14380101 13660467 12985554 12353348 11759417
58712A1759417n58841n24781m92622m64172m38101m11734l85567l62239l41870
$$ 11759417 11200576 10675795 10183173 9719001 9280900 8869166 8483599 8121360 7779490
58703G779490l21950l01441k81659k63366k45960k29332k14020j99685j85565
$$ 7779490 7457540 7156099 6874440 6611074 6365114 6135782 5921762 5722077 5536512
58694E536512j72000j59496j47148j33972j20854j09200r8818q9221q1421p5987
$$ 5536512 5364512 5205016 5057868 4923896 4803042 4693842 4595024 4505803 4424382 4348395
58684D348395p0829o3635n5292m8310m3148l8785l5500l4274l4619l5767l8719
$$ 4348395 4277566 4213931 4158639 4110329 4067181 4028396 3992896 3958622 3924003 3888236 3849517
58673C849517m4302n0533n4791n7276n9509o0976o0554n9652o0462o2281o3164
$$ 3849517 3805215 3754682 3699891 3642615 3583106 3522130 3461576 3401924 3341462 3279181 3216017
58662C216017o3825o6092o8649o8564o6420o5674o7014o7472o5370o2435o0500
$$ 3216017 3152192 3086100 3017451 2948887 2882467 2816793 2749779 2682307 2616937 2554502 2494002
58651B494002n9350n8407n7578n5969n2404m7494m2993l9305l5849l3232l2379
$$ 2494002 2434652 2376245 2318667 2262698 2210294 2162800 2119807 2080502 2044653 2011421 1979042
58640A979042l2176l0800k8804k8022k8106k7236k5605k4935k5010k3930k1522
$$ 1979042 1946866 1916066 1887262 1859240 1831134 1803898 1778293 1753358 1728348 1704418 1682896
58629A682896j9245j7033j3554r474p087o668o223m874l544k412q87l0j729n130
$$ 1682896 1663651 1646618 1633064 1623590 1616503 1609835 1603612 1598738 1595194 1592782 1591895 1591865 1590136 1585006
58615A585006o894n545k880q59M56J578K537L439M169L892K531J905L352N391
$$ 1585006 1578112 1572567 1569687 1568828 1569284 1570862 1573399 1576838 1581007 1584899 1587430 1589335 1592687 1598078
58601A598078N954N461N117L932P02k683l617l176m400p135q448p327n149k279
$$ 1598078 1604032 1609493 1614610 1618542 1619244 1616561 1612944 1609768 1605368 1598233 1589785 1582458 1577309 1575030
58587A575030J904O213Q758J0247J2657J5453J6972J8437K2322K7589L1017L2658
$$ 1575030 1576934 1583147 1591905 1602152 1614809 1630262 1647234 1665671 1687993 1715582 1746599 1779257
58575A779257L5385L9678M3536M7054N2158N7995O1781O4281O9265P7153Q4374
$$ 1779257 1814642 1854320 1897856 1944910 1997068 2055063 2116844 2181125 2250390 2327543 2411917
58564B411917Q9776R6491J06264J16878J26614J36859J48656J60749J72433J84667
$$ 2411917 2501693 2598184 2704448 2821326 2947940 3084799 3233455 3394204 3566637 3751304
58554C751304J97372K09228K20753K33829K47694K59367K68190K75535K79737
$$ 3751304 3948676 4157904 4378657 4612486 4860180 5119547 5387737 5663272 5943009
58545E943009K76227K63415K43404K16127J78084J28609P2478J4576m3265r8551
$$ 5943009 6219236 6482651 6726055 6942182 7120266 7248875 7321353 7335929 7292664 7194113
58535G194113j46362j83983k13196k35642k49769k54558k52422k46049k35672
$$ 7194113 7047751 6863768 6650572 6414930 6165161 5910603 5658181 5412132 5176460
58526E176460k21427k05239j88654j71784j55573j41760j29704j16832j03192
$$ 5176460 4955033 4749794 4561140 4389356 4233783 4092023 3962319 3845487 3742295
58517C742295r1671q2833p3876o3831n5421n0261m6501m2731l9879l7785l4234
$$ 3742295 3650624 3567791 3493915 3430084 3374663 3324402 3277901 3235170 3195291 3157506 3123272
58506C123272k9017k4628k1527j7393j2687j1788j6420k2883k8364l5107m5346
$$ 3123272 3094255 3069627 3048100 3030707 3018020 3006232 2989812 2966929 2938565 2903458 2858112
58495B858112n6554o5093p0718p4429p5408p3202o9807o6888o3748o0110n7628
$$ 2858112 2801558 2736465 2665747 2591318 2515910 2442708 2372901 2306013 2242265 2182155 2124527
58484B124527n6614n4697n0767m6914m4643m2573l9500l6173l2552k7367k1893
$$ 2124527 2067913 2013216 1962449 1915535 1870892 1828319 1788819 1752646 1720094 1692727 1670834
58473A670834j9806k1505k2939k1807k0332k0037j8789j5490j2773j2399j2503
$$ 1670834 1651028 1629523 1606584 1584777 1564445 1544408 1525619 1510129 1497356 1484957 1472454
58462A472454j2035j3060j5999j7406j5545j3338j2759j1315p489m545m891n406
$$ 1472454 1460419 1447359 1431360 1413954 1398409 1385071 1372312 1360997 1353508 1348963 1344072 1338666
58450A338666k781P32J420K17L31J895L178M300O071P699Q674J0263J2606J3624
$$ 1338666 1335885 1336617 1338037 1338254 1338585 1340480 1343658 1347958 1354029 1361728 1370402 1380665 1393271 1406895
58436A406895J3028J3632J6321J7988J7062J6479J8123J9121J7096J4371J3165
$$ 1406895 1419923 1433555 1449876 1467864 1484926 1501405 1519528 1538649 1555745 1570116 1583281
58425A583281J1317O905K589R49m25m626j0102j3976j7127k1395k5220k6419k6315
$$ 1583281 1594598 1601503 1604092 1605041 1604616 1599990 1589888 1575912 1558785 1537390 1512170 1485751 1459436
58412A459436k7058k7642k6298k3850k1496j8500j5038j3619j4662j4762j2213
$$ 1459436 1432378 1404736 1378438 1354588 1333092 1314592 1299554 1285935 1271273 1256511 1244298
58401A244298r866r449q246m890k939m430n372k420J199J593Q16K177L825L019
$$ 1244298 1234432 1224983 1216737 1211847 1208908 1204478 1199106 1196686 1197885 1199478 1200294 1202471 1206296 1209315
58387A209315K184M540P663P516N358M852N759O159P392J1053J4454J4748J4300
$$ 1209315 1211499 1216039 1223702 1231218 1236576 1241428 1247187 1253346 1260738 1271791 1286245 1300993 1315293
58374A315293J6521J9672K0201J8619J6659J2480M646k894o016p203j0954j5762
$$ 1315293 1331814 1351486 1371687 1390306 1406965 1419445 1424091 1421197 1415181 1407978 1397024 1381262
58362A381262j7004j4876j3007j1881r786p736p505p166m276q92oJ99K956O910
$$ 1381262 1364258 1349382 1336375 1324494 1314708 1306972 1299467 1292301 1288025 1287133 1287127 1287326 1290282 1297192
58348A297192R025J0394J3413J6431J6901J6566J7721J7831J3837Q267M899K066
$$ 1297192 1306217 1316611 1330024 1346455 1363356 1379922 1397643 1415474 1429311 1437578 1442477 1444543
58336A444543l298q696j0076r252j0358j2156j1071q866r960j3699j6247j7606
$$ 1444543 1441245 1432549 1422473 1413221 1402863 1390707 1379636 1370770 1360810 1347111 1330864 1313258
58324A313258j9945k1693k0052j6615j3946r715j084Q435J3604J5590J8421K0909
$$ 1313258 1293313 1271620 1251568 1234953 1221007 1211292 1210208 1218643 1232247 1247837 1266258 1287167
58312A287167J9770J7302J7906K0021J9436J7536J8249J9919J8496J5825J6304
$$ 1287167 1306937 1324239 1342145 1362166 1381602 1399138 1417387 1437306 1455802 1471627 1487931
58301A487931J8233J7151J4865J6249J9684J9739J7122J6885J8886J9021J7871
$$ 1487931 1506164 1523315 1538180 1554429 1574113 1593852 1610974 1627859 1646745 1665766 1683637
58290A683637J9150K1463K0460J7285J6061J5236J0504M112J807K457L23m062
$$ 1683637 1702787 1724250 1744710 1761995 1778056 1793292 1803796 1807908 1809715 1812172 1812495 1808433
58278A808433m923j774N01R07K520M926N438O259J1351J8048K0724K0618K2688
$$ 1808433 1803510 1801736 1802237 1803144 1805664 1810590 1816028 1822287 1833638 1851686 1872410 1893028 1915716
58265A915716K5514K4307K1438K3353K9031L1971L1657L2557L3985L1906K8816
$$ 1915716 1941230 1965537 1986975 2010328 2039359 2071330 2102987 2135544 2169529 2201435 2230251
58254B230251L0546L5139L5901L3542L3852L5666L3041K7352K4988K4934K1140
$$ 2230251 2260797 2295936 2331837 2365379 2399231 2434897 2467938 2495290 2520278 2545212 2566352
58243B566352J5304J4304J6734J5373J1528J3040J9220K1840K0524K2830K9344
$$ 2566352 2581656 2595960 2612694 2628067 2639595 2652635 2671855 2693695 2714219 2737049 2766393
58232B766393L3028L3446L7321M4653M8391M8230N0796N6059N7825N7412O2221
$$ 2766393 2799421 2832867 2870188 2914841 2963232 3011462 3062258 3118317 3176142 3233554 3295775
58221C295775P0780P4292P2941P5353Q2079Q5544Q6160R1804J01052J04137J01175
$$ 3295775 3366555 3440847 3513788 3589141 3671220 3756764 3842924 3934728 4035780 4139917 4241092
58210D241092J02045J07273J06914R9631R4732R3925Q9489Q2146Q1726Q8176R1100
$$ 4241092 4343137 4450410 4557324 4656955 4751687 4845612 4935101 5017247 5098973 5187149 5278249
58199E278249R0031R5320J07041J13697J14445J21133J35302J45164J49065J59383
$$ 5278249 5368280 5463600 5570641 5684338 5798783 5919916 6055218 6200382 6349447 6508830
58189F508830J78790J95398K06329K22910K47264K67292K80612K99640L27124
$$ 6508830 6687620 6883018 7089347 7312257 7559521 7826813 8107425 8407065 8734189
58180H734189L50994L69365L95438M31356M63312M89121N23332N67800O05573
$$ 8734189 9085183 9454548 9849986 10281342 10744654 11233775 11757107 12324907 12930480
58171A2930480O32112O63689P06400P47120P84365Q36385R08044R81672J051273
$$ 12930480 13562592 14226281 14932681 15679801 16464166 17300551 18208595 19190267 20241540
58162B0241540J132361J227070J315727J395886J492242J613539J738213J857715
$$ 20241540 21373901 22600971 23916698 25312584 26804826 28418365 30156578 32014293
58154C2014293J993401K154055K319736K485906K679207K910985L163081L439526
$$ 32014293 34007694 36161749 38481485 40967391 43646598 46557583 49720664 53160190
58146E3160190L779987M199556M670634N187336N785097O470506P204167P988571
$$ 53160190 56940177 61139733 65810367 70997703 76782800 83253306 90457473 98446044
58138I8446044Q897854R981393J1218111J2602602J4176933J5939703J7865985
$$ 98446044 107343898 117325291 128543402 141146004 155322937 171262640 189128625
58131A89128625K0097976K2960050K6659803L1098165L5994745M0759434M3808082
$$ 189128625 209226601 232186651 258846454 289944619 325939364 366698798 410506880
58124D10506880M2375674L4032208J9037178R95524j5264341k6624629l2752834
$$ 410506880 452882554 486914762 505951940 506947464 491683123 465058494 432305660
58117D32305660l4988972l4830566l3339733l1211602k8840593k6354699k3795863
$$ 432305660 397316688 362486122 329146389 297934787 269094194 242739495 218943632
58110B18943632k1272902j8899174j6690723j4626271j2743117j1093622r662986
$$ 218943632 197670730 178771556 162080833 147454562 134711445 123617823 113954837
58103A13954837q404525p312274o393279n607701m901396m269122l727710l252106
$$ 113954837 105550312 98238038 91844759 86237058 81335662 77066540 73338830 70086724
58095G0086724k794377k345641j922336j504875j047035n40498j4824N24242J095074
$$ 70086724 67292347 64946706 63024370 61519495 60472460 59931962 59917138 60441380 61536454
58086F1536454J675528K220009K775960L478209M293512M788715M321360K596055
$$ 61536454 63211982 65431991 68207951 71686160 75979672 80768387 85089747 87685802
58078H7685802K0142k558394m464612n537817n970624n986962n726088n301185
$$ 87685802 87705944 85147550 80682938 75145121 69174497 63187535 57461447 52160262
58070E2160262m817839m328856l842778l381967k984498k653701k356467k076155
$$ 52160262 47342423 43013567 39170789 35788822 32804324 30150623 27794156 25718001
58062B5718001j827256j616025j427343j257221j121778j024429r45376q72449
$$ 25718001 23890745 22274720 20847377 19590156 18468378 17443949 16498573 15626124
58054A5626124q13859p71931p31688o85051o41701o06784n70742n29793m94170
$$ 15626124 14812265 14040334 13308646 12623595 11981894 11375110 10804368 10274575 9780405
58045I780405m67316m37832m00543l65917l40903l19874l01585k94838k98991
$$ 9780405 9313089 8875257 8474714 8108797 7767894 7448020 7146435 6851597 6552606
58036F552606k98321k84692k67919k55622k41351k21556k05902k00192j95569
$$ 6552606 6254285 5969593 5701674 5446052 5204701 4983145 4777243 4577051 4381482
58027D381482j84858j74212j68728j61752j48704j37253j33391j30536j22184
$$ 4381482 4196624 4022412 3853684 3691932 3543228 3405975 3272584 3142048 3019864
58018C019864j12977j07889j02567r3430q5608q2183p7134o7323o0036o0144o1029
$$ 3019864 2906887 2798998 2696431 2603001 2517393 2435210 2358076 2290753 2230717 2170573 2109544
58007B109544n6693n1839n1513n1575m7889m4574m4830m3689l7996l3550l4427
$$ 2109544 2052851 2001012 1949499 1897924 1850035 1805461 1760631 1716942 1678946 1645396 1610969
57996A610969l5178l1515k8680l0935l2733k8924k4258k4149k5058k2593k0329
$$ 1610969 1575791 1544276 1515596 1484661 1451928 1423004 1398746 1374597 1349539 1326946 1306617
57985A306617k1950k3058j9364j4939j4186j3595r633o682q752j1196r187o759
$$ 1306617 1284667 1261609 1242245 1227306 1213120 1199525 1189892 1183210 1174458 1163262 1154075 1147316
57973A147316q742j1086q278l613l014m734l919j947k820n159n629n502o898p326
$$ 1147316 1138574 1127488 1119210 1115597 1112583 1107849 1103930 1101983 1099163 1094004 1088375 1082873 1075975 1068649
57959A068649m571j859k016k028O33K464Q55k4L207O294M940K642L710N126L079
$$ 1068649 1064078 1062219 1060203 1058175 1058808 1061272 1062127 1062103 1065310 1071604 1076544 1079186 1082896 1088022 1091101
57944A091101J231M286R069J0340J0051J2504J5390J4214J1111J0843J2011J0359
$$ 1091101 1092332 1096618 1105687 1116027 1126078 1138582 1153972 1168186 1179297 1190140 1202151 1212510
57932A212510P039N792N393K557j109k440l675q738j5744k0142k2201k4609k5935
$$ 1212510 1219549 1225341 1230734 1233291 1232182 1229742 1226067 1217329 1201585 1181443 1159242 1134633 1108698
57919A108698k3407j9141j6863j5466j2128q576p807p814n196j791j265k213j173
$$ 1108698 1085291 1066150 1049287 1033821 1021693 1013117 1005310 997496 992300 990509 989244 987031 985858
57906I85858P56P35L35K327M595L970K735M518O947N393J098j540k809n691q877
$$ 985858 986614 987349 987684 990011 994606 998576 1001311 1005829 1012776 1018169 1019267 1017727 1014918 1009227 1000350
57891A000350r191q447j0339j2835j1332p326o066p169n575r58J737J007P73L194
$$ 1000350 991159 982712 972373 959538 948206 940880 934814 927645 922070 921112 922849 923856 924629 927823
57877I27823N962P297Q074Q691Q676R028J0369R869M766k505p708j1288j6033
$$ 927823 933785 941082 949156 957847 966523 975551 985920 995789 1000555 998050 990342 979054 963021
57864I63021k0458k1008j9199j9765k2514k2780j9650j7217j7445j7856j6823
$$ 963021 942563 921555 902356 882591 860077 837297 817647 800430 782985 765129 748306
57853G48306j5461j3818j0346n853l169k457j173J262K981L567M266M699L579
$$ 748306 732845 719027 708681 702828 699659 697202 696029 697291 700272 703839 708105 712804 716383
57840G16383K094K412L649L445K455K934M188M068L704N696Q781R391P543O061
$$ 716383 718477 720889 724538 727983 730438 733372 737560 741628 745332 751028 759809 769200 776743 782804
57826G82804N068K538n89j472q51j965m502n244m286m855p111p916o903p005q481
$$ 782804 787872 790410 789821 788349 787498 785533 781031 775787 771501 766646 759535 751619 744716 737711 729230
57811G29230q173n459l537l716l565j827l32J50J316L454M514M155M611O527P907
$$ 729230 721057 715598 712061 708345 704780 702953 702621 702771 704087 707541 712055 716210 720821 727348 735255
57796G35255P994Q332R272R173P713O391N324L191N70m49r0n79k150l070l374
$$ 735255 743249 751581 760853 770026 777739 784130 789454 792645 793215 792766 792676 792097 789947 786877 783503
57781G83503m459n439m303k360k765m863m935k631j622l363n356o120o899p698
$$ 783503 779044 773605 769302 766942 764177 759314 754379 751748 750126 746763 741407 735287 728388 720690
57767G20690o733m763m991p492q649p375o876q713j0149r376q733j0341j2571
$$ 720690 713957 709194 704203 696711 688062 680687 673811 665098 654949 645573 636840 626499 613928
57754F13928j3253j2848j2428j1678j0563r999r603p872n403m599n473n387l684
$$ 613928 600675 587827 575399 563721 553158 543159 533556 525684 520281 515682 510209 504822 501138
57741E01138k582k834k686k001k881m967m756j194K411L762M600O621Q707J0303
$$ 501138 498556 495722 493036 491035 488154 483187 478431 477237 479648 483410 488010 494631 503338 513641
57727E13641J3173J7463K0149J9880J9524K1218K2633K1046J7786J5566J4264
$$ 513641 526814 544277 564426 584306 603830 625048 647681 668727 686513 702079 716343
57716G16343J2193R279O367L374K22k308m082n889p356p274o670q222j1503j2629
$$ 716343 728536 737815 744182 747556 747778 745470 741388 735499 728143 720869 714199 705977 694474 681845
57702F81845j0153p457p277p755o370m206l372l249k165l77J219L007M972N484
$$ 681845 671692 664235 656958 649203 642833 638627 635255 632006 629841 629464 630683 633690 638662 644146
57688F44146L993K668L253M540M949N147O081O773O258N501N464N312M427M040
$$ 644146 648139 650807 654060 658600 663549 668696 674777 681550 687808 693309 698773 704085 708512 712552
57674G12552N118O643P502P955Q044O980N347N244O947Q288Q605J0087J3619J6689
$$ 712552 717670 724313 731815 739770 747814 754794 760141 765385 772332 780620 789225 799312 812931 829620
57660H29620J7434J7489J8652J9914K0182K0797K2770K4420K4366K4172K5427
$$ 829620 847054 864543 883195 903109 923291 944088 966858 991278 1015644 1039816 1065243
57649A065243K6965K7533K8534L1359L4554L6478L8320M1704M5685M8898N2357
$$ 1065243 1092208 1119741 1148275 1179634 1214188 1250666 1288986 1330690 1376375 1425273 1477630
57638A477630N7336O2611O6626P0257P4795P9318Q2733Q6287R1343R6983J02535
$$ 1477630 1534966 1597577 1664203 1734460 1809255 1888573 1971306 2057593 2148936 2245919 2348454
57627B348454J10084J21490J35081J48357J61862J77292J93918K10056K26046
$$ 2348454 2458538 2580028 2715109 2863466 3025328 3202620 3396538 3606594 3832640
57618C832640K42371K56895K67417K74972K80762K81508K72069K51636K23387
$$ 3832640 4075011 4331906 4599323 4874295 5155057 5436565 5708634 5960270 6183657
57609F183657J89168J49054J05978O5978L1978j48l7916q5813j41967j98840k46847
$$ 6183657 6372825 6521879 6627857 6693835 6725813 6725665 6687749 6601936 6459969 6261129 6014282
57598F014282k79177k94484k95344k85559k69279k50339k30324k08569j85416
$$ 6014282 5735105 5440621 5145277 4859718 4590439 4340100 4109776 3901207 3715791
57589C715791j63741j45603j29588j13552r8042q4656p2975o1787n1686m3583
$$ 3715791 3552050 3406447 3276859 3163307 3065265 2980609 2907634 2845847 2794161 2750578
57579B750578l6077k7160j7356q590j041O372J3718K0874K9377M0556N2810O3428
$$ 2750578 2714501 2687341 2669985 2661395 2660354 2666726 2680444 2701318 2730695 2771251 2824061 2887489
57567B887489P2280Q1286R1145J01195J11588J23070J35262J47352J59611J72161
$$ 2887489 2959769 3041055 3132200 3233395 3344983 3468053 3603315 3750667 3910278 4082439
57557D082439J83418J91786J97509K00611J98608J88756J71009J46097J12717
$$ 4082439 4265857 4457643 4655152 4855763 5054371 5243127 5414136 5560233 5672950
57548E672950O9941K1127k7963p3952j15824j51628j78987j98184k11333k19038
$$ 5672950 5742891 5764018 5736055 5662103 5546279 5394651 5215664 5017480 4806147 4587109
57538D587109k20859k18188k13167k05560j94197j80917j69304j59735j49495
$$ 4587109 4366250 4148062 3934895 3729335 3535138 3354221 3184917 3025182 2875687
57529B875687j37803j27116j18917j11723j03989r6097q8727q1759p5364o9865
$$ 2875687 2737884 2610768 2491851 2380128 2276139 2180042 2091315 2009556 1934192 1864327
57519A864327o4435n8151n2229m8634m6726m3893l9459l5223l2248k9817k7551
$$ 1864327 1799892 1741741 1689512 1640878 1594152 1550259 1510800 1475577 1443329 1413512 1385961
57508A385961k5760k3694k0261j6461j4340j3538j1779q794o665o028n080k853
$$ 1385961 1360201 1336507 1316246 1299785 1285445 1271907 1260128 1251334 1244669 1238641 1233561 1230708
57496A230708n00J348L609O500Q869J0473J2478J5152J7424J9143K1323K3922
$$ 1230708 1230208 1231556 1235165 1241665 1250534 1261007 1273485 1288637 1306061 1325204 1346527 1370449
57484A370449K5847K7432L0202L4108L7701M1176M6106N1940N6204N8747O2412
$$ 1370449 1396296 1423728 1453930 1488038 1525739 1566915 1613021 1664961 1721165 1779912 1842324
57473A842324O8470P4837P9968Q5274R2110R9482J06397J13764J22138J30047
$$ 1842324 1910794 1985631 2065599 2150873 2242983 2342465 2448862 2562626 2684764 2814811
57463B814811J36296J41707J46964J50759J51420J48182J39713J23838J00375
$$ 2814811 2951107 3092814 3239778 3390537 3541957 3690139 3829852 3953690 4054065
57454D054065P2042M1149P685k7770o1730r0457j12983j29824j40669j45398j45721
$$ 4054065 4126107 4167256 4174941 4147171 4085441 3994984 3882001 3752177 3611508 3466110 3320389
57443C320389j43788j40307j35376j29592j22954j14365j03787r3293q4561p6921
$$ 3320389 3176601 3036294 2900918 2771326 2648372 2534007 2430220 2336927 2252366 2175445
57433B175445o9384o2746n7746n2890m6205l8080l0379k3786j7868j2821r197
$$ 2175445 2106061 2043315 1985569 1932679 1886474 1848394 1818015 1794229 1776361 1763540 1754343
57422A754343o446l304P51N557J1096J7181K3099K8649L4797M2206N0031N7187
$$ 1754343 1747897 1744593 1745344 1750901 1761997 1779178 1802277 1830926 1865723 1907929 1957960 2015147
57410B015147O3947P1227P9027Q6863R4860J03330J11707J19092J25400J31089
$$ 2015147 2079094 2150321 2229348 2316211 2411071 2514401 2626108 2745200 2870600 3001689
57400C001689J35987J38984J38639J33667J23167J06721Q4117N5427K1910j3577
$$ 3001689 3137676 3276660 3415299 3548966 3672133 3778854 3862971 3918398 3940308 3926731
57390C926731m8114q0217j08879j32072j48108j57921j63766j65929j63176j56310
$$ 3926731 3878617 3798400 3689521 3557449 3409341 3251420 3087654 2921725 2758549 2602239
57380B602239j48494j41378j33694j24522j15335j07550j00446r2976q5533p8591
$$ 2602239 2453745 2312367 2178673 2054151 1938816 1831266 1730820 1637844 1552311 1473720
57370A473720p1731o5281o0802n8359n5517n0763m5851m2762m0359l6492l1876
$$ 1473720 1401989 1336708 1275906 1217547 1162030 1111267 1065416 1022654 982295 945803 913927
57359I13927k9117k8768k8753k7494k5553k4156k3538k2973k1650j9563j7730
$$ 913927 884810 856042 827289 799795 774242 750086 726548 703575 681925 662362 644632
57348F44632j6969j6415j4570j1798j0155j0204j0026q374o719o718p397o590
$$ 644632 627663 611248 596678 584880 574725 564521 554495 546121 539402 532684 525287 518697
57336E18697m064j518l94q59k206l309l479l445m444o025o349n073l967m079m426
$$ 518697 514633 513115 512721 511862 509656 506347 502868 499423 494979 488954 482605 477532 473565 469486 465060
57321D65060m376m831n771n207k422on99l363n704o613o364m745j999Mk33j814
$$ 465060 460684 455853 450082 444875 442453 442447 441848 438485 432781 426168 419804 415059 413060 413064 412831 411017
57305D11017l228m582o168o596m787k356j515j841j518n87m51j145j636k018k925
$$ 411017 407789 403207 397039 390443 385656 383300 381785 379944 378426 377839 377388 376243 374607 372589 369664
57290C69664l560k754j318r20j264o42J117K635L379L883M034L303K351K277K619
$$ 369664 366104 363350 362032 361112 359848 359206 360323 362958 366337 370220 374254 377557 379908 382185 384804
57275C84804K121J128J146K302L315L659L886M144M250M843O505Q137Q235P341
$$ 384804 386925 388053 389199 391501 394816 398475 402361 406505 410755 415598 422103 430240 438475 445816
57261D45816P213P964Q228P799P892Q817R624J0150J1317J3231J4937J6344J8566
$$ 445816 453029 460993 469221 477020 484912 493729 503353 513503 524820 538051 552988 569332 587898
57248E87898K1936K5196K7021K7141K6049K4838K5061K7284K9932L0985L0459
$$ 587898 609834 635030 662051 689192 715241 740079 765140 792424 822356 853341 883800
57237H83800K9894K9797K9339K8287K7409K7010K6663K6526K7525L0099L3696
$$ 883800 913694 943491 972830 1001117 1028526 1055536 1082199 1108725 1136250 1166349 1200045
57226A200045L7367L9996M0594L9363L7795L6745L5404L3208L1227L0199K8689
$$ 1200045 1237412 1277408 1318002 1357365 1395160 1431905 1467309 1500517 1531744 1561943 1590632
57215A590632K5218K0874J7552J4847J1153O790L306L41l990r846j5288j9010
$$ 1590632 1615850 1636724 1654276 1669123 1680276 1687066 1690372 1690713 1686723 1676877 1661589 1642579
57203A642579k1246k2178k1638k0190j8540j6308j3115j0129q405o703l484J6
$$ 1642579 1621333 1599155 1577517 1557327 1538787 1522479 1509364 1499235 1490830 1484127 1480643 1480659
57191A480659J451J306K035L893M830M344M087M730N361O192Q525J1699J3263
$$ 1480659 1482110 1483416 1485451 1489344 1494174 1498518 1502605 1507335 1512696 1518888 1527413 1539112 1552375
57178A552375J2826J2690J3967J5008J4641J4178J5002J6618J8256K0284K2919
$$ 1552375 1565201 1577891 1591858 1606866 1621507 1635685 1650687 1667305 1685561 1705845 1728764
57167A728764K5334K6890K7799K8100K7465K6291K5453K5161K5465K7230L0681
$$ 1728764 1754098 1780988 1808787 1836887 1864352 1890643 1916096 1941257 1966722 1993952 2024633
57156B024633L3857L4958L5397L7886M2245M5998M8338N0201N1152M9874M7470
$$ 2024633 2058490 2093448 2128845 2166731 2208976 2254974 2303312 2353513 2404665 2454539 2502009
57145B502009M6556M7139M7105M6526M7361M8876M7819M3756L9934L8047L6463
$$ 2502009 2548565 2595704 2642809 2689335 2736696 2785572 2833391 2877147 2917081 2955128 2991591
57134B991591L4620L4761L7711M1089M3411M6214N0578N5350O0322O7199P5639
$$ 2991591 3026211 3060972 3098683 3139772 3183183 3229397 3279975 3335325 3395647 3462846 3538485
57123C538485Q2178Q5050Q6318Q7601Q7651Q6210Q6054Q8607R1195R1422R0811
$$ 3538485 3620663 3705713 3792031 3879632 3967283 4053493 4139547 4228154 4319349 4410771 4501582
57112D501582R1438R2105R0585Q6703Q0886P2755O3543N6785N3873N1695M7085
$$ 4501582 4593020 4685125 4775710 4862413 4943299 5016054 5079597 5136382 5190255 5241950 5289035
57101E289035M0885L5487L1217K7439K4450K2131J9348J6247J4258J2588Q217
$$ 5289035 5329920 5365407 5396624 5424063 5448513 5470644 5489992 5506239 5520497 5533085 5541302
57090E541302Q19o310j1563j6963k3157k7431k8865l0444l3494l5063l3714l2628
$$ 5541302 5542121 5535811 5524248 5507285 5484128 5456697 5427832 5397388 5363894 5328831 5295117 5262489
57078E262489l3688l3879l1353k9851l3048l9428m6935n7644p3399r1742j10932
$$ 5262489 5228801 5194922 5163569 5133718 5100670 5061242 5014307 4956663 4883264 4791522 4680590
57067D680590j34042j63157j94189k22269k47804k72575k95258l15926l39805
$$ 4680590 4546548 4383391 4189202 3966933 3719129 3446554 3151296 2835370 2495565
57058B495565l70945m07014m45512m89561B40288c61003o65617p41071q33629
$$ 2495565 2124620 1717606 1272094 782533 240288 -361003 -1026620 -1767691 -2601320
57049b601320r42894j068828j217814j395002j597666j823687k078902k367802
$$ -2601320 -3544214 -4613042 -5830856 -7225858 -8823524 -10647211 -12726113 -15093915
57041a5093915k684745l023118l385465l776537m196426m651107n160541n745080
$$ -15093915 -17778660 -20801778 -24187243 -27963780 -32160206 -36811313 -41971854 -47716934
57033d7716934o408982p139952p914140q709887r547246j0497961j1568636j2529671
$$ -47716934 -54125916 -61265868 -69180008 -77889895 -87437141 -97935102 -109503738 -122033409
57025a22033409j2965162j2647712j1875707j1308974j1391216j1978673j2551688
$$ -122033409 -134998571 -147646283 -159521990 -170830964 -182222180 -194200853 -206752541
57018b06752541j2681388j2214330j1124793r390331p051190m259644j182969
$$ -206752541 -219433929 -231648259 -242773052 -252163383 -259214573 -263474217 -264657186
57011b64657186K089827N484292Q821890J1827696J4252924J5965006J6946368
$$ -264657186 -262567359 -257083067 -248261177 -236433481 -222180557 -206215551 -189269183
57004a89269183J7259417J7018355J6356455J5394433J4236349J2982954J1727269
$$ -189269183 -172009766 -154991411 -138634956 -123240523 -109004174 -96021220 -84293951
56997h4293951J0533250R428851Q419404P499376O656575N880537N171646M536823
$$ -84293951 -73760701 -64331850 -55912446 -48413070 -41756495 -35875958 -30704312 -26167489
56989b6167489L977518L487873L061781K693951K375849K098335J857766J653354
$$ -26167489 -22189971 -18702098 -15640317 -12946366 -10570517 -8472182 -6614416 -4961062
56981d961062J479412J326117i68470I2370R46461Q42646P50909O73682O09352
$$ -4961062 -3481650 -2155533 -968470 92370 1038831 1881477 2632386 3306068 3915420
56972C915420N53249N03015M59140M20959L86106L53570L23722K95821K68589
$$ 3915420 4468669 4971684 5430824 5851783 6237889 6591459 6915181 7211002 7479591
56963G479591K42484K18384J94961J70271J44999J21346R9847Q0135O3639N2262
$$ 7479591 7722075 7940459 8135420 8305691 8450690 8572036 8671883 8752018 8815657 8867919
56953H867919M5173L9583L3823K7239J8492P031m827j4451k3077l4711n1344p1526
$$ 8867919 8913092 8952675 8986498 9013737 9032229 9039260 9034433 9019982 8996905 8962194 8910850 8839324
56941H839324r2976j13950j32631j47694j59542j69439j77691j83692j86602j84929
$$ 8839324 8746348 8632398 8499767 8352073 8192531 8023092 7845401 7661709 7475107 7290178
56931G290178j77050j63005j43449j16657q2382n2647n2898j02834j94619k95165
$$ 7290178 7113128 6950123 6806674 6690017 6607635 6554988 6502090 6399256 6204637 5909472
56921E909472l71606m11901m22740m15302l96966l71872l43199l13613k85164
$$ 5909472 5537866 5125965 4703225 4287923 3890957 3519085 3175886 2862273 2577109
56912B577109k58858k34246k10328j87183j65795j46494j28795j12540r7797q3997
$$ 2577109 2318251 2084005 1873677 1686494 1520699 1374205 1245410 1132870 1035073 951076
56902I51076p0821n9594n1800m6412m0731l3871k7516k3379k2130k4744l2148
$$ 951076 880255 820661 768861 722449 681718 647847 620331 596952 574822 550078 517930
56891E17930m2632n1771n6210n6145n3632n0096m6243m2635l9132l4880A4922
$$ 517930 475298 423527 367317 311172 257540 207444 161201 118566 79434 44554 14922
56879i263j9156j4298r546n411k056J016M099P249J0979J5486a867A6973J4031
$$ -9263 -28419 -42717 -52263 -57674 -59730 -58714 -54615 -47366 -36387 -20901 -1867 16973 31004
56866C1004O310k561j2081A415b6213k9484k7736k4601k1354j8340j5907j4188
$$ 31004 37314 34753 22672 1415 -26213 -55697 -83433 -108034 -129388 -147728 -163635 -177823
56854a77823j2730j1312j0411j0149r590p894n558l874l707m984o709p327o111
$$ -177823 -190553 -201865 -212276 -222425 -232015 -239909 -245467 -249341 -253048 -258032 -264741 -272068 -278179
56841b78179m323l789m331m139k772j810j840j083J786N413Q011J0130J3191J6768
$$ -278179 -282502 -286291 -290622 -294761 -297533 -299343 -301183 -302266 -300480 -295067 -287056 -276926 -263735 -246967
56827b46967J9469K1569K4421K7635K9002K7383K4007K0804J8727a6186A204J6883
$$ -246967 -227498 -205929 -181508 -153873 -124871 -97488 -73481 -52677 -33950 -16186 1204 18087
56815A8087J5944J4988J4117J2492R772P496P663J0363J4019J7618K1288K5046
$$ 18087 34031 49019 63136 75628 85400 92896 100559 110922 124941 142559 163847 188893
56803A88893K8516L1805L5349L9009M2393M5470M7312M4877L5353K0035L994q541
$$ 188893 217409 249214 284563 323572 365965 411435 458747 503624 538977 559012 563006 554465
56791E54465j6868k1879k3811k2886k0307j7163j3378q702l643J367O675J2393
$$ 554465 537597 515718 491907 469021 448714 431551 418173 409471 405828 407195 413870 426263
56779D26263J7846K2936K8986L7239M7387N8335O9224P8402Q2274P6864O0666
$$ 426263 444109 467045 496031 533270 580657 638992 708216 786618 868892 945756 1006422
56768A006422L5727O696k0630m1188n2843n6934n6240n2828m8007m2869l7725
$$ 1006422 1042149 1048845 1028215 987027 934184 877250 821010 768182 720175 677306 639581
56757F39581l1810k4666j7118j0003k883M942J3069K0960K9287L8808M8477N6071
$$ 639581 607771 583105 565987 555984 553101 558043 571112 592072 621359 660167 708644 764715
56745G64715N9966N8840N0474L3329R704j4394l3279m4887n0453n2335n2238n0398
$$ 764715 824681 883521 933995 967324 977028 962634 929355 884468 834015 781680 729442 679044
56733F79044m6140l9696l2982k7626k2972j7463j1446o796l932j092L240Q853
$$ 679044 632904 593208 560226 532600 509628 492165 480719 473923 469991 468899 472139 480992
56721D80992J4958K0957K5488K6257K1798J2657O68j1820k2160k8534l1426l2721
$$ 480992 495950 516907 542395 568652 590450 603107 603775 591955 569795 541261 509835 477114
56709D77114l3119l1846k8971k5985k3615k0920j7481j4605j3174j2055j0006
$$ 477114 443995 412149 383178 357193 333578 312658 295177 280572 267398 255343 245337
56698B45337p831p057p474p634p031o447o503o992p329o989n923m913m879n491
$$ 245337 237506 230449 222975 215341 208310 201863 195360 188368 181039 174050 168127 163214 158335 152844
56684A52844n468m602m060m201l742k026m29j56k52N27J252K61j914l173k792
$$ 152844 147376 142774 138714 134513 130771 128745 128316 128160 127908 128435 129687 129948 128034 124861 122069
56669A22069j812r75j69K57m08j704k299k042k236l422m336l595j443O75J560
$$ 122069 120257 119282 119113 119370 118962 117258 114959 112917 110681 107259 102923 99328 97885 98560 100120
56654A00120R63l97j221o11J085K691L352K953J827O28K08Q35J786K242K327K613
$$ 100120 101083 100686 99465 98854 99939 102630 105982 108935 110762 111390 111598 112433 114219 116461 118788 121401
56638A21401K969K799K122J636J768K350L023L461L404K998K717K495J444r03
$$ 121401 124370 127169 129291 130927 132695 135045 138068 141529 144933 147931 150648 153143 154587 153684
56624A53684l604n242n459m963m629n095o587q306q688p065m607k901k297k334
$$ 153684 150080 144838 139379 134416 129787 124692 118105 109799 101111 94046 89439 86538 84241 81907
56610H1907k905l944m802m962m694m105k592l84O29q46l229l936k842k028k504
$$ 81907 79002 75058 70256 65294 60600 56495 53903 53519 54148 53302 50073 46137 43295 41267 38763
56595C8763l180l035k458k107j958j894k070k455k950l837n255A137e273n336
$$ 38763 35583 32548 30090 27983 26025 24131 22061 19606 16656 12819 7564 1137 -5273 -10609
56581a0609l859j952M40K327K767K621L510E34O321O156O034O650P297P489P798
$$ -10609 -14468 -16420 -15980 -13653 -10886 -8265 -4755 534 6855 13011 19045 25695 32992 40481 48279
56566D8279Q491Q778P951O205M048K020R54J342K361K691K236J814J445N28n56
$$ 48279 56770 65548 73499 79704 83752 85772 86726 88068 90429 93120 95356 97170 98615 99143 98587
56551I8587p55k42j79n74k23R49J491P86k2mM68J075K197L504L737K795K305L209
$$ 98587 97832 97590 97411 96837 96614 97563 99054 99840 99818 99814 100282 101357 103554 107058 110795 113590 115895 119104
56533A19104M330M294L368K447J652R70R39J565J771J032L87Q09J730K280K854
$$ 119104 123434 127728 131096 133543 135195 136165 137104 138669 140440 141472 141859 142668 144398 146678 149532
56518A49532M079N153M672K655O35j5Q61K497L911M646N171O100P057P096O322
$$ 149532 153611 158764 163436 166091 166726 166711 167572 170069 173980 178626 183797 189897 196954 204050 210372
56503B10372N935O420O907O798O617O663O136M616L262L393M663N652N671N195
$$ 210372 216307 222727 229634 236432 243049 249712 255848 260464 263726 267119 271782 277434 283105 288300
56489B88300M961N389O354P004O293M229K031Q35P48J369K238K544J448o78k348
$$ 288300 293261 298650 305004 312008 318301 322530 324561 325396 326144 327513 329751 332295 333743 333065 330717
56474C30717k846l165m399o103o996o600n547m671m436m768n123n069m927n276
$$ 330717 327871 324706 320307 314204 307208 300608 295061 290390 285954 281186 276063 270994 266067 260791
56460B60791n892n950n310m627m175l543k769k615l344m168m319l942l608l637
$$ 260791 254899 248949 243639 239012 234837 231294 228525 225910 222566 218398 214079 210137 206529 202892
56446B02892m039m399l835j970O5N44q72k907m324m855m601l692k543j575p16
$$ 202892 198853 194454 190619 188649 188714 189258 188386 185479 181155 176300 171699 168007 165464 163889 163173
56431A63173R7M40L69J027K951M683M656L578L184L536L722M169N563O341M500
$$ 163173 163270 163710 164079 165106 168057 172740 177396 180974 184158 187694 191416 195585 201148 207489 211989
56416B11989J559J198L743N565M630L055K983L400K813K078K502L509M068M363
$$ 211989 213548 214746 218489 224054 228684 231739 234722 238122 240935 243013 245515 249024 253092 257455
56402B57455M479L530J661Q15J942L366L449K873K909L406L968M951N910N237
$$ 257455 261934 265464 267125 267940 269882 273248 276697 279570 282479 285885 289853 294804 300714 305951
56388C05951K917J383K011L103L063L099M534N868N029K709R16p3r31j035L08
$$ 305951 308868 310251 312262 315365 318428 321527 326061 331929 336958 339667 340583 340510 339579 338544 338852
56373C38852J758J485p4j094j117r48q85p79j044j950k886l396l766l693k230
$$ 338852 340610 342095 342021 340927 339810 338862 337977 337198 336154 334204 331318 327922 324156 320463 318233
56358C18233j81j78k806n078m744l555l911m751l868k120k052l631m623m230l479
$$ 318233 318052 317874 315068 309990 305246 301691 297780 293029 289161 287041 284989 281358 276735 272505 269026
56343B69026k767j809j252j892k865k793k060j961k537l060l475l534k011J102
$$ 269026 266259 264450 263198 261306 258441 255648 253588 251627 249090 246030 242555 239021 237010 238112
56329B38112L270K556M92n76j113k559l681k208J073L199L338L126L394L487L271
$$ 238112 241382 243938 244430 243854 242741 240182 236501 234293 235366 238565 241903 245029 248423 251910 255181
56314B55181L136K563J156J84O69J152J02q72O19L428M479L647L326L837L338
$$ 255181 258317 260880 262036 262220 262889 264041 264143 263271 263890 267318 271797 275444 278770 282607 285945
56299B85945K000K157M007N006M232L769M815N777N405M885N416O226O450O919
$$ 285945 287945 290102 294109 299115 303347 307116 311931 317708 323113 327998 333414 339640 346090 353009
56285C53009Q761J1668J4430J5997J5573J2985R365O356M660M284N365P422Q574
$$ 353009 361770 373438 387868 403865 419438 432423 441788 448144 452804 457088 462453 469875 478449
56272D78449P444N167L773L348K751K188K791M338N659O680P953Q954R068R272
$$ 478449 485893 491060 494833 498181 500932 503120 505911 510249 515908 522588 530541 539495 548563 557835
56258E57835J0459J1147R622P419P616J0281J2635J3184J2671J1390Q858O152
$$ 557835 568294 579441 589063 596482 604098 614379 627014 640198 652869 664259 673117 679269
56246F79269N344O422P393P484P529P251N163J541j181j489j54J603L230M223
$$ 679269 684613 691035 698428 705912 713441 720692 725855 727396 726215 724726 724572 726175 729405 733628
56232G33628M449M900O310P587P544P144P815Q824R031R732J2653J6310J7993
$$ 733628 738077 742977 749287 756874 764418 771562 779377 788201 797232 806964 819617 835927 853920
56219H53920J8328K0172K3688K6446K7956L0009L2727L4386L5395L8439M4079
$$ 853920 872248 892420 916108 942554 970510 1000519 1033246 1067632 1103027 1141466 1185545
56208A185545M9753N3852N7466O1624O6045P0989P7288Q4207R0327R6461J04472
$$ 1185545 1235298 1289150 1346616 1408240 1474285 1545274 1622562 1706769 1797096 1893557 1998029
56197A998029J13441J20716J26744J34708J44865J53342J57594J59308J60659
$$ 1998029 2111470 2232186 2358930 2493638 2638503 2791845 2949439 3108747 3269406
56188C269406J61053J59025J54463J47482J37272J23093J04922Q3195N9694L7795
$$ 3269406 3430459 3589484 3743947 3891429 4028701 4151794 4256716 4339911 4399605 4437400
56178D437400J9325K283j5570l2441m5368n5499o5879p5349q0075q0581q1550
$$ 4437400 4456725 4459008 4443438 4410997 4365629 4310130 4244251 4168902 4088827 4008246 3926696
56167C926696q4463q6091q5076q4288q5349q6220q6059q7530r1903r6310r8209
$$ 3926696 3842233 3756142 3671066 3586778 3501429 3415209 3329150 3241620 3149717 3053407 2955198
56156B955198r8780r9809j00711j00535r9726r8297r5275r1162q7821q5148q1082
$$ 2955198 2856418 2756609 2655898 2555363 2455637 2357340 2262065 2170903 2083082 1997934 1916852
56145A916852p5381o9896o4850n8971n3388n0778n0065m6901m0393l4474l1375
$$ 1916852 1841471 1771575 1706725 1647754 1594366 1543588 1493523 1446622 1406229 1371755 1340380
56134A340380k8758k4887k1649k0476j9814j8661j8255j8491j7021j3724j1744
$$ 1340380 1311622 1286735 1265086 1244610 1224796 1206135 1187880 1169389 1152368 1138644 1126900
56123A126900j2256j2466j0572q314o974n136k238M4J495L983O987P357N079M333
$$ 1126900 1114644 1102178 1091606 1083292 1076318 1071182 1068944 1068988 1070483 1074466 1081453 1088810 1093889 1098222
56109A098222O966R990J1438J3286J6360J7752J6081J4282J4329J4075J2076J0677
$$ 1098222 1105188 1115178 1126616 1139902 1156262 1174014 1190095 1204377 1218706 1232781 1244857 1255534
56097A255534J1364J1692R780P503O622O186O179Q790J3606J6451J5799J5455
$$ 1255534 1266898 1278590 1288370 1295873 1302495 1308681 1314860 1323650 1337256 1353707 1369506 1384961
56085A384961J8086K1206K2482K4118K8920L6610M6717O0139P5319Q8029R7626
$$ 1384961 1403047 1424253 1446735 1470853 1499773 1536383 1583100 1643239 1718558 1806587 1904213
56074A904213J08332J21921J35173J47152J62325J82643K02978K18413K29897
$$ 1904213 2012545 2134466 2269639 2416791 2579116 2761759 2964737 3183150 3413047
56065C413047K38215K38799K28082K10005J91132J73711J57720J44521J33509
$$ 3413047 3651262 3890061 4118143 4328148 4519280 4692991 4850711 4995232 5128741
56056E128741J19576R8635P1953M1869Q516k5521n3029o9518p8354q5007r1445
$$ 5128741 5248317 5346952 5418905 5460774 5469290 5443769 5390740 5321222 5242868 5157861 5066416
56045E066416r9596j13821j34962j57092j74672j87824j96881j98252j90490j78339
$$ 5066416 4966820 4852999 4718037 4560945 4386273 4198449 4001568 3803316 3612826 3434487
56035C434487j65834j51291j33789j18127j07840r9328q8454p7240o8766o1393
$$ 3434487 3268653 3117362 2983573 2865446 2757606 2658278 2569824 2492584 2423818 2362425
56025B362425n3329m6920m3222l8588l1732k7390k7652k6858k0907j4379j2158
$$ 2362425 2309096 2262176 2218954 2180366 2148634 2121244 2093592 2066734 2045827 2031448 2019290
56014B019290j1378q299n635n895m902M87N220M476K329M230P766Q782R822J4116
$$ 2019290 2007912 1999613 1993978 1988083 1983181 1983668 1988888 1993364 1995693 1999923 2007689 2016471 2026293 2040409
56000B040409J7935J7388J6387J9372K2747K2029K0894K4343K9320L0941L1583
$$ 2040409 2058344 2075732 2092119 2111491 2134238 2156267 2177161 2201504 2230824 2261765 2293348
55989B293348L5065L8275L7465L6350L9224M2697M2885M3668M8915N3968N3899
$$ 2293348 2328413 2366688 2404153 2440503 2479727 2522424 2565309 2608977 2657892 2711860 2765759
55978B765759N2650N4872N6860N4966N4251N8739O2305N9864N8206O4237P2172
$$ 2765759 2818409 2873281 2930141 2985107 3039358 3098097 3160402 3220266 3278472 3342709 3414881
55967C414881P4615P6543Q5141R5240R8863J00251J07045J15279J17734J18676
$$ 3414881 3489496 3566039 3651180 3746420 3845283 3945534 4052579 4167858 4285592 4404268
55957D404268J25293J32998J34482J35020J43193J54635J60709J64990J75199
$$ 4404268 4529561 4662559 4797041 4932061 5075254 5229889 5390598 5555588 5730787
55948E730787J87387J94628K02645K19956K41065K56505K70456K91353L14727
$$ 5730787 5918174 6112802 6315447 6535403 6776468 7032973 7303429 7594782 7909509
55939G909509L33227L53267L83107M15224M40026M65493N02502N42569N72098
$$ 7909509 8242736 8596003 8979110 9394334 9834360 10299853 10802355 11344924 11917022
55930A1917022N96921O30056O67787P01889P42344Q01942Q71051R34176R98248
$$ 11917022 12513943 13143999 13811786 14513675 15256019 16057961 16929012 17863188 18861436
55921A8861436J076955J161800J238644J317983J417061J527146J631942J742248
$$ 18861436 19938391 21100191 22338835 23656818 25073879 26601025 28232967 29975215
55913B9975215J876733K025706K172486K333013K533492K767998L022390L319272
$$ 29975215 31851948 33877654 36050140 38383153 40916645 43684643 46707033 50026305
55905E0026305L690538M126694M604956N142484N763903O444952P156992P941700
$$ 50026305 53716843 57843537 62448493 67590977 73354880 79799832 86956824 94898524
55897I4898524Q870272R960129J1211270J2681722J4427503J6416310J8622158
$$ 94898524 103768796 113728925 124940195 137621917 152049420 168465730 187087888
55890A87087888K1149253K4113192K7475426L1175038L5204244L8979960M0512310
$$ 187087888 208237141 232350333 259825759 291000797 326205041 365185001 405697311
55883D05697311L6918871K6627714J1235266n165651j8663321k7565705l2266109
$$ 405697311 442616182 469243896 480479162 475313511 456650190 429084485 396818376
55876C96818376l3919536l3565119l2006656k9836973k7379747k4770510k2140925
$$ 396818376 362898840 329333721 297327065 267490092 240110345 215339835 193198910
55869A93198910j9642823j7341364j5219553j3286429j1588420j0128552q863936
$$ 193198910 173556087 156214723 140995170 127708741 116120321 105991769 97127833
55862I7127833p777353o877907o139814n508819m962988m508072m122029l762099
$$ 97127833 89350480 82472573 76332759 70823940 65860952 61352880 57230851 53468752
55854E3468752l420487l120272k861862k622202k400579k216932k067898j928112
$$ 53468752 50048265 46927993 44066131 41443929 39043350 36826418 34758520 32830408
55846C2830408j792357j675983j576564j474156j367697j274802j196980j118899
$$ 32830408 31038051 29362068 27785504 26311348 24943651 23668849 22471869 21352970
55838B1352970j039957r73851r18683q59056p96338p46767p10926o73970o34555
$$ 21352970 20313013 19339162 18420479 17561423 16765085 16018318 15307392 14633422 13998867
55829A3998867o05298n85777n62619n35526n16500n03697m82240m51142m24249
$$ 13998867 13393569 12807792 12245173 11709647 11193147 10689450 10207210 9756068 9331819
55820I331819m03993l78754l47198l21520l04657k86709k65623k50091k40245
$$ 9331819 8927826 8549072 8201874 7880354 7575697 7288988 7023365 6773274 6533029
55811F533029k26219k07680j94961j89303j81213j69728j64259j65785j64955
$$ 6533029 6306810 6099130 5904169 5714866 5533653 5363925 5199666 5033881 4868926
55802D868926j60356j60470j65787j66975j62658j61403j64163j61934j52991
$$ 4868926 4708570 4548100 4382313 4215338 4052680 3891277 3727114 3565180 3412189
55793C412189j45625j41537j33016j19007j07727j00725r0127p4395o1480n3662
$$ 3412189 3266564 3125027 2992011 2873004 2765277 2664552 2574425 2500030 2438550 2384888
55783B384888m4637l4549l2581m0852n0006n4285n7387o0395n7985n0312m5264
$$ 2384888 2340251 2305702 2273121 2232269 2182263 2127978 2070591 2010196 1952211 1901899 1856635
55772A856635m5147m3639l9061l7791m1293m2717l9920l9177m2313m2765l8568
$$ 1856635 1811488 1767849 1728788 1690997 1649704 1606987 1567067 1527890 1485577 1442812 1404244
55761A404244l6747m0289m2562l9472l5974l5582l4289k9797k6575k6919k6407
$$ 1404244 1367497 1327208 1284646 1245174 1209200 1173618 1139329 1109532 1082957 1056038 1029631
55750A029631k2709j9670j8709j5536r392o218q449j0562q736o214n334l054J584
$$ 1029631 1006922 987252 968543 953007 943615 937397 928948 918386 909650 903436 898102 895048 896632
55737H96632M105K622J117J243r21o426j0147r690r564j2643j5325j4959j4371
$$ 896632 900737 903359 904476 905719 904798 898372 888225 878535 868971 856328 841003 826044 811673
55724H11673j5274j4582j1000q080p333n419j398N41j151k345j256k084p059j2085
$$ 811673 796399 781817 770817 762737 755404 749985 748587 749128 747977 745632 744376 742292 735233 723148
55710G23148j4011j5202j7235j7056j3502j0958j2303j4139j2964j0459r094p948
$$ 723148 709137 693935 676700 659644 646142 635184 622881 608742 595778 585319 576225 568277
55698E68277o218n573o133n259k661j362j732m18L128N307N285O320Q213N782
$$ 568277 562059 556486 550353 545094 542433 541071 539339 538921 542049 547356 552641 558961 567174 572956
55684E72956k325j0382j4289j6771k0617k3460k2897k0765j8810j5808j1896r991
$$ 572956 570631 560249 545960 529189 508572 485112 462215 441450 422640 406832 394936 384945
55672C84945j0232q896n325l604n012n610m013m326q048j0377q369o010o961q790
$$ 384945 374713 365817 360492 356888 351876 346266 342253 337927 329879 319502 311133 305123 298162 289372
55658B89372q572p903q170p049l972k956n506o874l735K42J164J207L362N639
$$ 289372 280800 272897 264727 257678 253706 250750 245244 238370 234635 234877 236041 237248 240610 246249
55644B46249N622N525P474Q726O660L822L140K756L84j753j303o09k195l677k037
$$ 246249 251871 257396 264870 273596 280256 284078 287218 289974 290358 288605 287302 286693 284498 280821 278784
55629B78784R68K484L609O033P559N943L614L707M663L375N96j118j892k904l351
$$ 278784 279752 282236 285845 291878 299437 305380 308994 312701 317364 320739 321335 320217 318325 315421 312070
55614C12070k799l366n912p505o193m567m926n023k636k50o14j487L22L137L563
$$ 312070 309271 305905 299993 292488 286295 281728 276802 271779 269143 268893 268279 266792 267114 270251 273814
55599B73814K405K644M102M741M777N254M971K880J174J983L395K547K38j198
$$ 273814 276219 278863 282965 287706 292483 297737 302708 305588 306762 308745 312140 314687 314925 313727
55585C13727k107l989o058o942p435q496q939p925p017o992n927l327k281m315
$$ 313727 311620 307631 301573 294631 287196 278700 269761 261836 254819 247827 241900 238573 236292 231977
55571B31977o112n062l920n729q249q164p060p941r207p592m436l583n092o029
$$ 231977 225865 220803 216883 211154 202905 194741 187681 179740 170533 162941 158505 154922 149830 143801
55557A43801n651n090l866j363K20j054k730j500J085J112j261k691k439k480
$$ 143801 138150 133060 129194 127831 128051 126997 124267 122767 123852 124964 123703 121012 118573 116093
55543A16093l012k523j526j879l050k972j845j434j537q10n2r92k634k446n33
$$ 116093 113081 110558 109032 107153 104103 101131 99286 97852 96315 95505 95453 94461 91827 89381 88848
55528H8848O47J63p85j379j523n92J619L642M218M164M489M511L807L722M764
$$ 88848 89495 89658 88873 87494 85971 85379 86998 90640 94858 99022 103511 108022 111829 115551 120315
55513A20315N167M357M807P744J0407J0711J1105J4005J7022J6988J5438J5244
$$ 120315 125482 129839 134646 142390 152797 163508 174613 188618 205640 222628 238066 253310
55501B53310J4840J1184N859K606P05l522r907j4657j6561j7804j9140j9110j7837
$$ 253310 268150 279334 285193 287799 288504 284982 275075 260418 243857 226053 206913 187803 169966
55488A69966j7126j6854j5154j1899q453m857p57K091K126J572L531O750P510
$$ 169966 152840 135986 120832 108933 100480 95623 94866 96957 99083 100655 104186 110936 118446
55475A18446N645M095L497J921m81j347m26K30K62J047K022J173q58j262L62J721
$$ 118446 124091 128186 131683 133604 133123 131776 131350 131580 131842 132889 134911 136084 135226 133964 134326 136047
55459A36047J968K209K187N44j617j525P35K349K509L003L998L287N09j758k011
$$ 136047 138015 140224 142411 142955 141338 139813 140548 142897 145406 148409 152407 155694 156203 154445 152434
55444A52434j714k463m054n852p417p685o253n147o454q674q563o090m154l888
$$ 152434 150720 148257 144203 138351 130934 123249 116996 111849 105395 96721 88158 82068 77914 74026
55430G4026l858l588m022m594l718k211k525m271m450k401p50q46j021k42N1j083
$$ 74026 70168 66580 62558 57964 54246 52035 49510 45239 40789 38388 37638 36792 35771 35529 35580 34497
55414C4497k305k230j065O18K341K839J268q12j284r90k284m624n124l372j967
$$ 34497 32192 29962 28897 29515 31856 34695 35963 35151 33867 32877 30593 25969 20845 17473 15506
55399A5506j979j612N0J397J251L99m80j554k191j363R4M49J82J084K521K176
$$ 15506 13527 11915 11965 13362 14613 15012 14532 12978 10787 9424 9518 9967 10149 11233 13754 15930
55383A5930K99o13l85j304l339l628j552p4o86j120L02J786J463M03L05Q88J324
$$ 15930 16229 15616 15231 13927 10588 6960 5408 5334 4648 3528 3830 5616 7079 7482 7787 8675 9999
55366I999J726J898J028l32n11L23K24q67q09O95J255J94%J774K954J719L25J381
$$ 9999 11725 13623 14651 14319 13808 14131 14355 13488 12679 13374 14629 14823 14823 16597 19551 21270 21595 22976
55348B2976L633M214K964J770J328R24L03k50o87q01o4J238J950J706J129O2k293
$$ 22976 26609 30823 33787 35557 36885 37809 38112 37862 37175 36374 36310 37548 39498 41204 42333 42395 40102
55331D0102n008n554l260m39P87O64P5q55j485m92J660K421P30j222j189J64R34
$$ 40102 35094 29540 26280 25841 26628 27292 27367 26512 25027 24535 26195 28616 29346 28124 26935 27099 28033
55314B8033O71n9j044j900j706n01K82j45p76n86n8p3o60j431j990j612r6J034
$$ 28033 28704 28645 27601 25701 23995 23494 23776 23631 22855 22269 22211 22138 21478 20047 18057 16445 16349 17383
55296A7383P0k040k633j259j62m75o72L54J338R86o6q36j548k457k932B365A30
$$ 17383 17453 15413 12780 11521 11359 10884 10212 10566 11904 12890 12824 11988 10440 7983 5051 2365 130
55278a468l75P27e28L3C56K293J723o85j453P09K499J081j672B395A052D22c76
$$ -1468 -1843 -1116 -528 -495 356 2649 4372 3687 2234 2943 5442 6523 4851 2395 1052 422 -376
55260i70J59L46l41r17n28O32a52F53d78k206p63J699E42R60M10J642K488J386
$$ -970 -811 -465 -806 -1723 -2251 -1619 -152 653 -478 -2684 -3447 -1748 542 1502 1912 3554 6042 7428
55242G428k44n95M5O22R21P45l16j407r75M03L56j323j838K85K941L882L670L584
$$ 7428 7184 6589 6634 7256 8177 8922 8606 7199 6224 6627 6983 5660 3822 4107 7048 10930 14600 18184
55224A8184L235J981M77p77k205l358k930j620j982m036B585A041J246J026l54
$$ 18184 21419 23400 23877 23100 20895 17537 14607 12987 11005 6969 2585 1041 2287 3313 2959
55209B959K79K251K717J392K83J15L4k25l24n19q99n52P64J634J176N20O29P27
$$ 2959 3238 5489 8206 9598 9881 9996 10030 9805 9481 8962 8063 7511 8275 9909 11085 11605 12234 12961
55191A2961N00J348L394L860J064k317k824j065l8n13j174j720k574k839j677
$$ 12961 13461 14809 18203 22063 23127 20810 17986 16921 16883 16370 15196 13476 10902 8063 6386
55176F386o63j683E60b708j099M62L57p9J13N15R72B16J972J088M9M30J742K154
$$ 6386 5723 4040 560 -2708 -3807 -3345 -2988 -3067 -2954 -2439 -1467 216 2188 3276 3325 3755 5497 7651
55158G651J482J287K143K908K729J926Q90k90j175j379j389j628j316L23K230
$$ 7651 9133 10420 12563 15471 18200 20126 21016 20726 19551 18172 16783 15155 13839 14162 16392
55143A6392K607J418K85J11L01J92r9k58j99j7J4l34o38k99J67l96j669j851m30
$$ 16392 18999 20417 20702 20813 21114 21306 21207 20949 20750 20733 20747 20413 19775 19476 19643 19247 17578 15727 15297
55124A5297Q95R77Q28J259J102m69j887j541m17l20r78j127j095j877k778k347
$$ 15297 16192 17169 17997 19256 20358 19889 18002 16461 16044 15724 14746 13619 12524 10647 7869 5522
55108E522q36K86N65M78k9j038j559p21O21J068N87o2o54r03Q4K088L056J823
$$ 5522 4686 4972 5537 6015 5986 4948 3389 2668 3289 4357 4944 4882 4228 3325 3409 5497 8553 10376
55090A0376M9l78k37j110k302k070o77L00P15J453K201J882O74l63r03r49K3J784
$$ 10376 10425 10047 9810 8700 6398 4328 3651 3951 4666 6119 8320 10202 10876 10513 9610 8661 8684 10468
55072A0468K647J835R60J255J294j95j453m57J422J878J833L446N512M972K226
$$ 10468 13115 14950 15910 17165 18459 18264 16811 16354 17776 19654 21487 24933 30445 35417 37643
55057C7643O83J453K397K400K539K756J316j541k890j245J347K402J692J19j678
$$ 37643 38326 39779 42176 44576 47115 49871 51187 49646 46756 45511 46858 49260 50952 51071 49393
55042D9393k814k404j073m15o74p89o28r22j232m56O87L90q95p10J423L167L159
$$ 49393 46579 44175 43102 42687 42013 41224 40596 39674 38442 37986 38673 39063 38168 37458 38881 42048 45207
55025D5207K805L309L633K691J297N70K01l84p65n41k13j70%N19Q83P64M15L2
$$ 45207 48012 51321 54954 57645 58942 59512 59713 59329 58564 58023 57810 57640 57640 58159 59042 59806 60221 60253
55007F0253j46O18K456L703K637J22j407j382j258j440o70J169K229J412j82j239
$$ 60253 60107 60725 63181 66884 69521 69643 68236 66854 65596 64156 63486 64655 66884 68296 68114 66875
54991F6875j696j549k67J733K771K018N02n28q92q19n05o21j590k217q23J994
$$ 66875 65179 63630 63363 65096 67867 69885 70387 69859 68967 68148 67643 67022 65432 63215 62392 64386
54975F4386L666L020J483O02L33K24L89O56M63L7R9K42n29j605j248M48J403P84
$$ 64386 68052 71072 72555 73157 73490 73714 74103 74759 75222 75259 75358 75600 75071 73466 72218 72666 74069 74853
54957G4853P5L27P78R33J595K813L092J854N09j3o34j824k237j176k29p26j482
$$ 74853 74928 75255 76033 76966 78561 81374 84466 86320 86829 86816 86182 84358 82121 80945 80716 79990 78508
54940G8508j032k59o72j539j145J31L37q52j592o34J032J623O44q08j262k61J190
$$ 78508 77476 77217 76545 75006 73861 73992 74329 73477 71885 71251 72283 73906 74550 73742 72480 72219 73409
54923G3409J747J290Q86J110J248N16o97j291o99O13J546J235j9q38k67J099K146
$$ 73409 75156 76446 77332 78442 79690 80206 79509 78218 77519 78132 79678 80913 80894 80056 79789 80888 83034
54906H3034K754L380L747L304K518K406L028L697M280M957N207M611M146M949
$$ 83034 85788 89168 92915 96219 98737 101143 104171 107868 112148 117105 122312 126923 131069 136018
54892A36018O297O658O321O891Q528R943J0920J2383J3907J3742J1741R995R886
$$ 136018 142315 148973 155294 162185 170713 180656 191576 203959 217866 231608 243349 253344 263230
54879B63230J0609J0881J0013P058J358n394j0001j1373j1350j1541j1781j2011
$$ 263230 273839 284720 294733 301791 303149 297755 287754 276381 265031 253490 241709 229698
54867B29698j2964j4158j3847j2012j0738j0655r720o884m043k799j965l26P41
$$ 229698 216734 202576 188729 176717 165979 155324 145604 138720 134677 131878 129913 129587 130328
54854A30328k24j789j722l45O60J271K598M386N437N761O352P444Q601R826J1180
$$ 130328 130104 128315 126593 126248 126908 128179 130777 135163 140600 146361 152713 160157 168758 178584 189764
54839A89764J2096J2319J2615J3231J2832J0365O764L327m11n273r981j2176j1617
$$ 189764 201860 214179 226794 240025 252857 263222 269986 273313 272902 267629 257648 245472 233855
54826B33855j0465j0464j1161j1118r818q152p448p965q380p327n358m302m811
$$ 233855 223390 212926 201765 190647 180829 172677 165229 157264 148884 141557 136199 131897 127086
54813A27086n703n903n486m597l055j471r61j226p75M91J026N54P25J844J730
$$ 127086 121383 115480 109994 105397 102342 100871 99910 98684 97909 98400 99426 99980 100705 102549 104279
54798A04279o79l074l153j965j581j520j44J929K507J093q09j948k014r87M21
$$ 104279 103600 100526 97373 95408 93827 92307 92163 94092 96599 97692 96883 94935 92921 91934 92355
54783I2355N42j268l300l733l001k500k222j621j383k173k845k159j118j279j862
$$ 92355 92897 91629 88329 84596 81595 79095 76873 75252 73869 71696 68851 66692 65574 64295 62433
54768F2433j117L82O29k47k99O88R20O3K6J608L017K674J389O59N91O56J023J908
$$ 62433 61316 61698 62327 62080 61781 62469 63389 63452 63478 65086 68103 70777 72166 72825 73416 74072 75095 77003
54750G7003K590K205R91O7K78J575L149M174M665N383O399O538N189L963N090
$$ 77003 79593 81798 82789 82856 83134 84709 87858 92032 96697 102080 108479 115017 120206 124169 129259
54735A29259Q388J1284J2042J1607J1844J3161J4572J5273J5317J4995J4303J3147
$$ 129259 137647 148931 160973 172580 184424 197585 212157 227430 242747 257742 272045 285192
54723B85192J1679J0040P798M222m52m623o975q056r171j0152r777q226p105o803
$$ 285192 296871 306911 314709 318931 318479 313856 306881 298825 289654 279502 269725 261499 254394 247591
54709B47591n903m000k890l654m459l018J91K887M059M342M368M484N382P341
$$ 247591 241688 237688 234798 231144 226685 223667 223858 226745 230804 235146 239514 243998 249380 256721
54695B56721R301J0151J0437J1553J3750J6099J7855J8719J8437J7267J6203J5663
$$ 256721 266022 276173 286610 298163 311913 328012 345867 364586 383023 400290 416493 432156
54683D32156J4696J2374R088N463J177l891q482j1447j3483j5916j8564k0341
$$ 432156 446852 459226 468314 473777 474954 471063 462581 451134 437651 421735 403171 382830
54671C82830k0978k0815j9768j8058j7004j7338j7566j5727j2238r220p694o975
$$ 382830 361852 341037 321269 303211 286207 268869 251303 235576 223338 214118 206424 199449
54659A99449o326n719n257n174n809o574n942l687j895k238l532l750k951k314
$$ 199449 193123 187404 182147 176973 171164 164590 158648 154961 153066 150828 147296 143546 140595 138281
54645A38281j620j79R11J60j376j352K33J245Q90L70K64m7l81J78J104Q12n59
$$ 138281 136661 136482 137393 137553 136177 134825 135058 136303 137193 137563 137827 137780 137399 137577 138681 139493 138934
54628A38934j190o73m98j020n93J480L540M179M091M242M173L471L210M377O073
$$ 138934 137744 137071 136573 135553 134960 136440 139980 144159 148250 152492 156665 160136 163346 167723 173796
54613A73796O643N886M998M871N303N591N456N386O020P055P346O584N945O150
$$ 173796 180439 186325 191323 196194 201497 207088 212544 217930 223950 231005 238351 244935 250880 257030
54599B57030N966M097J693J065K503M154M803M918N215N956P476R658J1152J0913
$$ 257030 262996 267093 268786 269851 272354 276508 281311 286229 291444 297400 304876 314534 325686 336599
54585C36599J0238J1330J4116J6538J7746J8780K0167K1186K1536K1415J9705
$$ 336599 346837 358167 372283 388821 406567 425347 445514 466700 488236 509651 529356
54574E29356J4683O999l79n824j0431j5176j9076k1101k1727k1648k0828j9717
$$ 529356 544039 551038 550659 544835 534404 519228 500152 479051 457324 435676 414848 395131
54562C95131j9379j9471j8011j4257j0073p471o450o198o544p116o863n590m534
$$ 395131 375752 356281 338270 324013 313940 306469 300019 293821 287277 280161 273298 267708 263174
54549B63174m327l958k798k033k758m119m595m009l130k497k561l745n452o204
$$ 263174 258847 254889 252091 250058 247300 243181 238586 234577 231447 228950 226389 222644 217192 210988
54535B10988n618n009n250n593n421n480o189o352n060l513l449m681n650n488
$$ 210988 205370 200361 195111 189518 184097 178617 172428 166076 161016 157503 154054 149373 143723 138235
54521A38235m475l130j998j499j284n96J80l23k061k931j675P8Q5j445k482j843
$$ 138235 133760 130630 128632 127133 125849 125253 125433 125110 123049 120118 118443 118521 118606 117161 114679 112836
54505A12836Q7K431M241M670L873L105L046K862J786M51l28q27j395j368l28P54
$$ 112836 112923 115354 119595 124265 128138 131243 134289 137151 138937 139388 139060 138233 136838 135470 135142 135896
54489A35896R66R40J502K033J806J801L341N777P342P645P463O823N253L557L271
$$ 135896 136862 137802 139304 141337 143143 144944 148285 154062 161404 169049 176512 183335 188588 192145 195416
54474A95416M486O008P608J0107J2995J4053J2108Q685O070M811L869K254k54
$$ 195416 199902 205910 213518 223625 236620 250673 262781 271466 277536 282347 286216 288470 288216
54461B88216l264n908p267p309p133p741q890r521r171q462q188q332q252p655
$$ 288216 284952 279044 271777 264468 257335 249594 240704 231183 222012 213550 205362 197030 188778 181123
54447A81123o902o260n382l918k247j060n37m81q86j603j851j134k85m91j415
$$ 181123 174221 167961 162579 158661 156414 155354 154817 154336 153450 151847 149996 148862 148577 148086 146671
54432A46671j557n31N17Q18Q06P09q2j504k182j176P19K174K716K311Q83q83j551
$$ 146671 145114 144583 145100 145918 146724 147433 147351 145847 143665 142489 143208 145382 148098 150409 151292 150409 148858
54415A48858p18K91M33M07J099J829J547P49P47J716K684K864J930j77k636l698
$$ 148858 148140 148431 148864 149271 150370 152199 153746 154495 155242 156958 159642 162506 164436 164259 161623 157925
54399A57925k596q81n62j517j960j046L07R87Q42L61J21L82O55kj723l341l859
$$ 157925 155329 154448 153886 152369 150409 149363 149670 150657 151499 151860 151981 152363 153018 153016 151293 147952 144093
54382A44093l640l408k907j592P4J108J303R95K01r79j634r27N31J307R39K71
$$ 144093 140453 137045 134138 132546 132620 133728 135031 136026 136227 135248 133614 132687 133218 134525 135464 135735
54366A35735J78O83J146Q39k53j045m27R61J241L5p70P5J224J025L18R34K586
$$ 135735 135913 136596 137742 138581 138328 137283 136856 137817 139058 139093 138323 138398 139622 140647 140965 141899 144485
54349A44485L398K943K603L102L704L878M002M231M151L837L997M851N899O745
$$ 144485 147883 150826 153429 156531 160235 164113 168115 172346 176497 180334 184331 189182 195081 201826
54335B01826P116O447M657L052K977L734L312J223r05j667j370r56q07j059j975
$$ 201826 208942 215389 220046 223098 226075 229809 233121 234344 233439 231772 230402 229446 228639 227580 225605
54320B25605l480m933n734n567m412k939k495l591m896m816l647k847k692k360
$$ 225605 222125 217192 211458 205891 201479 198540 196045 192454 187558 182742 179095 176248 173556 171196
54306A71196j854j926k121j018J246K615J952M73k36l9N44J294J671R44k53r2
$$ 171196 169342 167416 165295 164277 165523 168138 170090 170563 170327 170288 170832 172126 173797 174741 174488 174396
54290A74396J737L230L239L531N760Q069P186L242j07m26R25J525J123J002J520
$$ 174396 176133 179363 182602 186133 191893 199962 207148 210390 210283 209857 210782 212307 213430 214432 215952
54275B15952J797J360P59L66l83k114m299n608n432m603m309m714n071m873m271
$$ 215952 217749 219109 219868 220234 219851 217737 213438 207830 202398 197795 193486 188772 183701 178828 174557
54260A74557l367k035p05o14k450n092o452n729m262l882m736n267m298k626k026
$$ 174557 171190 169155 168450 167836 165386 160294 153842 148113 143851 139969 135233 129966 125668 123042 121016
54245A21016k962m012l772k549j625j460j512j544k015k905l183k122n87k23j369
$$ 121016 118054 114042 110270 107721 106096 104636 103124 101580 99565 96660 93477 91355 90768 90545 89176
54230H9176k533k217q56k56j130j942q87J383K235N02j707j542J001L198K965
$$ 89176 86643 84426 83570 83314 82184 80242 79355 80738 82973 83475 81768 80226 81227 84425 87390
54215H7390Q28j511l201m164m042k474j86J337J521J336J732K104J156q40j822
$$ 87390 88218 86707 83506 79342 75300 72826 72640 73977 75498 76834 78566 80670 81826 80986 79164
54200G9164n01J769K607J565K67j59l06q28j003O3J781K701K393J671J214R13
$$ 79164 78663 80432 83039 84604 84871 84712 84406 83578 82575 82638 84419 87120 89513 91184 92398 93311
54184I3311N12J33k0qp2m46j115j643j511p88j56O6L28J004J628J520P20k97j370
$$ 93311 93823 93956 93936 93928 93856 93410 92295 90652 89141 88353 88197 88263 88591 89595 91223 92743 93463 93166 91796
54165I1796k446k990k384r17K18R8r74j690r79P78J854J044o82j220j01R19M06
$$ 91796 89350 86360 83976 83059 83277 83375 82401 80711 79732 80510 82364 83408 82726 81506 81405 82324 82730
54148H2730q87j497j429j571j786j124L33J168L90j347k480j986j90J525J910
$$ 82730 81843 80346 78917 77346 75560 74436 74769 75937 76327 74980 72500 70514 70324 71849 73759
54133G3759R69l76j556k486k549r64J319J916K77r99K23K310K304M83k00J173
$$ 73759 74728 74352 72796 70310 67761 66797 68116 70032 70309 69310 69533 71843 74147 74630 74430 75603
54117G5603K279J285p39k054k651l175l146j854J2J088J116R43J063J132Q63N72
$$ 75603 77882 79167 78428 76374 73723 70548 67402 65548 65560 66648 67764 68707 69770 70902 71765 72337
54101G2337P10J140J113P5j523k476k094q32N59J865K971L338K695J691R58J59
$$ 72337 73047 74187 75300 75375 73852 71376 69282 68450 69009 70874 73845 77183 79878 81569 82527 82686
54085H2686j083j944j343L16J593J761Q91j103l847n390l915o11J242M83n96K20
$$ 82686 81603 79659 78316 78632 80225 81986 82877 81774 77927 72537 68622 68011 69253 69736 69140 69360
54069F9360K119K927K116Q67K54N41J412K024J492J13p80p18p18j333j470k43
$$ 69360 71479 74406 76522 77389 77643 78184 79596 81620 83112 83225 82445 81727 81009 79676 78206 77963
54053G7963J142Q70r34k525k933k593k063j444r95j024j117o20J08N7o33m66J277
$$ 77963 79105 79975 79041 76516 73583 70990 68927 67483 66488 65464 64347 63727 63835 63892 63259 62793 64070
54036F4070L168L318J816N25O11J230Q90n06j605j287J18J349J495O28m60r78
$$ 64070 67238 70556 72372 72897 73508 74738 75628 75122 73517 72230 72348 73697 75192 75820 75360 74382
54020G4382q06o10r55j333n98J381L133L138J498m88j850k361j917n34J193K400
$$ 74382 73576 72966 72011 70678 70080 71461 74594 77732 79230 78742 76892 74531 72614 72080 73273 75673
54004G5673K821K767K366J589R08J124K342L745M476M333L518K293R44j89p98
$$ 75673 78494 81261 83627 85216 86124 87248 89590 93335 97811 102144 105662 107955 108899 108710 107912
53989A07912n44P27K439L367K840J577Q92J356K593L835M240L402K055J586K215
$$ 107912 107368 108095 110534 113901 116741 118318 119210 120566 123159 126994 131234 134636 136691 138277 140492
53974A40492K615K126K109L801N991O620N976O169P783R069Q550O667M663L434
$$ 140492 143107 145233 147342 151143 157134 163754 169730 175899 183682 192751 201301 207968 212631 216065
53960B16065L629N184O564O113M429L773M830N813N177L510K102J248P44N47J96
$$ 216065 219694 224878 231442 237555 241984 245757 250587 256400 261577 265087 267189 268437 269181 269728 269924
53945B69924r88k474k707j368k4J96r9l01j142l103n057n785n592n181m307k862
$$ 269924 268936 266462 263755 262387 262363 262559 262460 262159 261017 257914 252857 247072 241480 236299 231992 229130
53929B29130k003k522l164k345p50m37j750k886k531j489j428k891m842n661m584
$$ 229130 227127 224605 221441 219096 218346 217909 216159 213273 210742 209253 207825 204934 200092 194431 189847
53914A89847k435p62k03k20l62p91j340j309o58k70m46m00Q2O8n89m02J326K819
$$ 189847 187412 186650 186447 186227 185865 185074 183734 182425 181767 181497 181051 180651 180733 180801 180212 179810 181136 183955
53896A83955K228M24n47o00j055j768j306K62J146O67K43R36J910K062J786K238
$$ 183955 186183 186607 186060 185460 184405 182637 181331 181593 182739 183406 183649 184585 186495 188557 190343 192581
53880A92581L854O193Q309Q886P104M019K121K756M682N753N357M425L706L035
$$ 192581 196435 202628 210937 219823 226927 230946 233067 235823 240505 246258 251615 256040 259746 262781
53866B62781K087R84N5m82n50k65j9O9P08K809N828P494O152L220K082M213P474
$$ 262781 264868 265852 265907 265425 264875 264610 264591 264660 265368 268177 274005 281499 287651 290871 292953 297166 304640
53849C04640Q898Q016O501N508N063N318O611Q204Q785Q382Q216Q314P229M731
$$ 304640 313538 321554 328055 333563 338626 343944 350555 358759 367544 375926 384142 392456 399685 404416
53835D04416K839L029L926L212O18k296m377n446n463m596l707l576l925m084
$$ 404416 407255 410284 414210 417422 418040 415744 411367 405921 400458 395862 392155 388579 384654 380570
53821C80570m168m755n913p350q814r718r163p306n818n882o647o735o333o384
$$ 380570 376402 371647 365734 358384 349570 339852 330689 323383 317565 311683 305036 298301 291968 285584
53807B85584o597n986m876m611n439o227o217n738n233m827m765n122n187m385
$$ 285584 278987 273001 268125 263514 258075 251848 245631 239893 234660 229833 225068 219946 214759 210374
53793B10374l496l766m997n852n784n271m402k972j877k403l888m032k219o52
$$ 210374 206878 203112 198115 192263 186479 181208 176806 173834 171957 169554 165666 161634 159415 158763
53779A58763j084k207j734K08J457R55k54r01r16o86j43P87J559J479O41r6j49
$$ 158763 157679 155472 153738 153946 155403 156358 156104 155203 154287 153601 153458 154245 155804 157283 157924 157828 157679
53762A57679J85K49o6l64n00p83j235j287n41O04J636K693M043N092M754K853
$$ 157679 157864 158113 158047 157683 157183 156400 155165 153878 153337 153941 155577 158270 162313 167405 172159 175012
53746A75012O01m75K63K354M663O058O050N112M214M093M801N710N932N185M420
$$ 175012 175613 175138 175401 177755 182418 188476 194526 199638 203852 207945 212746 218456 224388 229573 233993
53731B33993N047P289R752J0867J0295Q701O925N724N515N688M903K772O51L8
$$ 233993 239040 246329 256081 266948 277243 285944 292869 298593 304108 309796 314699 317471 318122 318160
53717C18160Q17J820K419K611K233J187N2o56j445k980m656n243m774m488m855
$$ 318160 318977 320797 323216 325827 328060 329247 329299 328643 327198 324218 319562 314319 309545 305057 300202
53702C00202m973m103k697j598j223j869l852o703q878r005p255n046l530k689
$$ 300202 295229 291126 288429 286831 285608 283739 279887 273184 264306 255301 248046 243000 239470 236781
53688B36781j877j025r65k199l726l833k217n03k02r59j481j376j232j385j525
$$ 236781 234904 233879 232914 230715 226989 223156 220939 220436 220234 219275 217794 216418 215186 213801 212276
53673B12276j307o96K4J95p04j944j782L79K824L544K663J766J447R42j54j223
$$ 212276 210969 210273 210297 210492 209788 207844 206062 206441 209265 212809 215472 217238 218685 219627 219473 218250
53657B18250j724j779j526q28K18J163J636J562J141J051K032L765M927M904M480
$$ 218250 216526 214747 213221 212393 212611 213774 215410 216972 218113 219164 221196 224961 229888 234792 239272
53642B39272M024K499m21k544j582J460L491L454L105L758M568M429L609K792
$$ 239272 243296 245795 245374 242830 241248 242708 246199 249653 252758 256516 261084 265513 269122 271914
53628B71914K095J605J703K290K764K975L208L237K679K120K501L443L718L376
$$ 271914 274009 275614 277317 279607 282371 285346 288554 291791 294470 296590 299091 302534 306252 309628
53614C09628L525M009L379J585N91J414K645K893K859L540M030K883O43p31l84
$$ 309628 313153 317162 320541 322126 322717 324131 326776 329669 332528 336068 340098 342981 343624 342893 342509
53599C42509P39J443J437J101Q79Q17M53m91j371j354r40j572l403m694m075k273
$$ 342509 343248 344691 346128 347229 348108 348925 349378 348887 347516 346162 345222 343650 340247 335553 331478 329205
53583C29205q95m12j97K61J061K155L216L639L104J737l21k695m138l386q83J464
$$ 329205 328310 327898 327701 327962 329023 331178 334394 338033 341137 342874 342553 339858 335720 332334 331451 332915
53567C32915K588L067L407L172K411K213K869L040J926Q44J233K442K990K895
$$ 332915 335503 338570 341977 345149 347560 349773 352642 355682 357608 358452 359685 362127 365117 368012
53553C68012L158L872M492N250O606P887Q069P481P256P430P165O512O358O838
$$ 368012 371170 375042 379534 384784 391390 399277 407346 414827 422083 429513 436678 443190 449548 456386
53539D56386P372Q098R561J1043J0871Q818O552N369N008N176O445Q633R920R057
$$ 456386 463758 471856 481417 492460 503331 512149 518701 524070 529078 534254 540699 549332 559252 568309
53525E68309P348O896P621P732O652N664N451M926L262J713K056M050N716N814
$$ 568309 575657 582553 590174 597906 604558 610222 615673 620599 623861 625574 627630 631680 637396 643210
53511F43210M800L572K448J526Q96J71j174k626k799j398L5N5r08j562j596j509
$$ 643210 648010 651582 654030 655556 656452 656623 655449 652823 650024 648626 648661 648716 647808 646246 644650 643141
53495F43141j358r99q70j318j519n55Q91J362Q76Q01J490J718Q11k34k81M97J212
$$ 643141 641783 640784 639914 638596 637077 636522 637413 638775 639651 640452 641942 643660 644471 644237 643956 644453 645665
53478F45665J293N65o78j304p2K874O036Q244R393R588Q835P896Q008R262J0414
$$ 645665 646958 647523 646845 645541 645469 648343 654379 662623 672016 681604 690439 698335 706343 715605 726019
53463G26019J0720J0907J1840J3384J5012J6454J7423J7802J8338J9916K1922
$$ 726019 736739 747646 759486 772870 787882 804336 821759 839561 857899 877815 899737
53452H99737K2869K2864K3698K6012K8318K9570L0692L2424L3678L3597L3583
$$ 899737 922606 945470 969168 995180 1023498 1053068 1083760 1116184 1149862 1183459 1217042
53441A217042L5442L8760M1811M3946M5535M6552M6954M7567M8873M9701M8863
$$ 1217042 1252484 1291244 1333055 1377001 1422536 1469088 1516042 1563609 1612482 1662183 1711046
53430A711046M7461M7858N0585N3781N5415N4859N2768N0652N0089N1128N1948
$$ 1711046 1758507 1806365 1856950 1910731 1966146 2021005 2073773 2124425 2174514 2225642 2277590
53419B277590N1304N0418N1025N2403N2260N0168M8090M7451M7470M6665M4550
$$ 2277590 2328894 2379312 2430337 2482740 2535000 2585168 2633258 2680709 2728179 2774844 2819394
53408B819394M1464L7999L4984L3137L2382L2108L1829L0860K8012K2950J7635
$$ 2819394 2860858 2898857 2933841 2966978 2999360 3031468 3063297 3094157 3122169 3145119 3162754
53397C162754J4858J5203J6385J5699J2109O249k85n619q885j1134j4017j7652
$$ 3162754 3177612 3192815 3209200 3224899 3237008 3243257 3242972 3237353 3228468 3217334 3203317 3185665
53385C185665k0894k3475k6465l0349l4112l6711l8374l9912m1606m3229m4477
$$ 3185665 3164771 3141296 3114831 3084482 3050370 3013659 2975285 2935373 2893767 2850538 2806061
53374B806061m5096m5219m5562m6525m7271m6807m5767m5642m6161m5116m1489
$$ 2806061 2760965 2715746 2670184 2623659 2576388 2529581 2483814 2438172 2392011 2346895 2305406
53363B305406l7098l4111l2244k9880k6874k4469k2807k0362j6157j1185o905
$$ 2305406 2268308 2234197 2201953 2172073 2145199 2120730 2097923 2077561 2061404 2050219 2043314
53352B043314l367L38M358P945J0949J4321J8642K3018K6233K8580L1552L5809
$$ 2043314 2039947 2040285 2044643 2052588 2063537 2077858 2096500 2119518 2145751 2174331 2205883 2241692
53340B241692M0458M4453M7766N0746N3364N5647N8191O1352O4589O7312O9947
$$ 2241692 2282150 2326603 2374369 2425115 2478479 2534126 2592317 2653669 2718258 2785570 2855517
53329B855517P3324P7375Q1233Q4447Q7356R0383R3662R7292J01347J05597J09515
$$ 2855517 2928841 3006216 3087449 3171896 3259252 3349635 3443297 3540589 3641936 3747533 3857048
53318C857048J12573J14381J14922J14871J15203J16022J16301J15188J13166
$$ 3857048 3969621 4084002 4198924 4313795 4428998 4545020 4661321 4776509 4889675
53309D889675J11291J09748J07693J04131R8505R0937Q2511P4896O9014O4388
$$ 4889675 5000966 5110714 5218407 5322538 5421043 5511980 5594491 5669387 5738401 5802789
53299E802789O0146N6023N1775M6340L8684K9202J9457J0581K436n841j4976k4968
$$ 5802789 5862935 5918958 5970733 6017073 6055757 6084959 6104416 6114997 6117433 6111592 6096616 6071648
53287F071648l5070m4604n4027o4542p6371q8105r8099j05675j10798j13634j15062
$$ 6071648 6036578 5991974 5937947 5873405 5797034 5708929 5610830 5505155 5394357 5280723 5165661
53276E165661j16409j17996j18935j18926j18890j18997j17787j14551j11114
$$ 5165661 5049252 4931256 4812321 4693395 4574505 4455508 4337721 4223170 4112056
53267D112056j09511j09149j08062j05948j03910j01996r9116r5055r0645q6132
$$ 4112056 4002545 3893396 3785334 3679386 3575476 3473480 3374364 3279309 3188664 3102532
53257C102532q1008p5287o9425o3456n7595n3075n0559m8436m4631l9648l5541
$$ 3102532 3021524 2946237 2876812 2813356 2755761 2702686 2652127 2603691 2559060 2519412 2483871
53246B483871l2375k8223k2723j8003j5524j4272j2815j1028r046o400l227o51
$$ 2483871 2451496 2423273 2400550 2382547 2367023 2352751 2339936 2328908 2319862 2313462 2310235 2309584
53234B309584R71K753N467Q378J0689J2792J5250J7847K0439K3543K7254L0692
$$ 2309584 2310555 2313308 2318775 2327153 2337842 2350634 2365884 2383731 2404170 2427713 2454967 2485659
53222B485659L3206L5261L7556M0165M2916M5639M7668M8390M8500M9419N1016
$$ 2485659 2518865 2554126 2591682 2631847 2674763 2720402 2768070 2816460 2864960 2914379 2965395
53211B965395N1395M9503M6608M4501M3542M3048M2344M0744L7774L4136L1244
$$ 2965395 3016790 3066293 3112901 3157402 3200944 3243992 3286336 3327080 3364854 3398990 3430234
53200C430234K9196K6513K2404J7833J3648R302M422k1l358o676j1290j6930k2813
$$ 3430234 3459430 3485943 3508347 3526180 3539828 3549130 3553552 3553531 3550173 3543497 3532207 3515277 3492464
53187C492464k9262l6725m4024m9350n2588n5289n8535o1954o4595o5897o5961
$$ 3492464 3463202 3426477 3382453 3333103 3280515 3225226 3166691 3104737 3040142 2974245 2908284
53176B908284o5591o5704o6263o6217o4970o3168o1587o0142n8663n7736n7802
$$ 2908284 2842693 2776989 2710726 2644509 2579539 2516371 2454784 2394642 2335979 2278243 2220441
53165B220441n8174n7855n6865n5962n5584n5562n5407n4388n2052m9090m6801
$$ 2220441 2162267 2104412 2047547 1991585 1936001 1880439 1825032 1770644 1718592 1669502 1622701
53154A622701m5301m3373m0531l7828l5898l3791l0970k8851k8694k9103k7756
$$ 1622701 1577400 1534027 1493496 1455668 1419770 1385979 1355009 1326158 1297464 1268361 1240605
53143A240605k4888k3002k3267k4101k3656k2144k1062k1143k1709k1676k0735
$$ 1240605 1215717 1192715 1169448 1145347 1121691 1099547 1078485 1057342 1035633 1013957 993222
53132I93222j9628j9157j9143j8892j8606j9155k0184j9920j7863j6147j6839
$$ 993222 973594 954437 935294 916402 897796 878641 858457 838537 820674 804527 787688
53121G87688j8873j9504j8097j6568j6295j6461j5737j4120j2580j1962j2561
$$ 787688 768815 749311 731214 714646 698351 681890 666153 652033 639453 627491 614930
53110F14930j3908j4688j3759j1475r392q558q749r322r922j0250j0010r355q716
$$ 614930 601022 586334 572575 561100 551708 543150 534401 525079 515157 504907 494897 485542 476826
53097D76826q106p229o399o414p288p873p267n941m999m739m645m448m468m836
$$ 476826 468720 461491 455092 448678 441390 433517 426250 420309 415310 410571 405926 401478 397010 392174
53083C92174n063m774m411m687n363n318m030k436j763k060k469k590k664k684
$$ 392174 387111 382337 377926 373239 367876 362558 358528 356092 354329 352269 349800 347210 344546 341862
53069C41862k294j700j606k055k134j202K63J381J690J087k20j374j257K43J887
$$ 341862 339568 337868 336262 334207 332073 330871 331134 332515 334205 335292 335072 333698 332441 332684 334571
53054C34571K380J561J59r22j013q8R91J358J338J921L124L923L909L696L518
$$ 334571 336951 338512 338671 337749 336736 336648 337639 338997 340335 342256 345380 349303 353212 356908 360426
53039C60426K863J865J560K067J991M29j645k843k989k547j810j406k319m348
$$ 360426 363289 365154 366714 368781 370772 371201 369556 366713 363724 361177 359367 357961 355642 351294
53025C51294n886o098n929o013n377l588k451l630n864o517m958k723j216j055
$$ 351294 345408 339310 333381 327368 321991 318403 315952 312322 306458 299941 294983 292260 291044 289989
53011B89989k631n378p194o528m549l600m074m585m416l913l075j742p95j145
$$ 289989 287358 281980 274786 268258 263709 260109 256035 251450 247034 243121 240046 238304 237509 236364
52997B36364j888j359K28J134P34j06r69k174l260l328k783k781l061k363r71
$$ 236364 234476 233117 233345 234479 235213 235107 234138 231964 228704 225376 222593 219812 216751 214388 213417
52982B13417m42q74p66R3J44j018j738j183p13j339k019j833j763k772l877l749
$$ 213417 212975 212101 211335 211428 211572 210554 208816 207633 206920 205581 203562 201729 199966 197194 193317 189568
52966A89568k817k261k029j354k77O26J124Q41j002m086o205n470k672l15K11
$$ 189568 186751 184490 182461 181107 180830 181456 182580 183421 182419 178333 172128 166658 163986 163671 163882
52951A63882n32j402j662j111k30j1r01k209k996l083k679j708k02J218J937J998
$$ 163882 163350 161948 160286 159175 158945 158934 158033 155824 152828 149745 147066 145358 145156 146374 148311 150309
52935A50309J721J201O45N30J011J685K200K433J949L20j781k961k950k871l118
$$ 150309 152030 153231 153876 154406 155417 157102 159302 161735 163684 164004 162223 159262 156312 153441 150323
52920A50323k504k66K373L753L736L091K074Q72L88J187K393K878K846L054L288
$$ 150323 147819 147553 149926 153679 157415 160506 162580 163452 163840 165027 167420 170298 173144 176198 179486
52905A79486K912K161J629J156O28J070L312O138P473P030O193N652M983M320
$$ 179486 182398 184559 186188 187344 187972 189042 192354 198492 205965 212995 219188 224840 229823 234143
52891B34143M469N263N617N523O132P447P778O133L492R60j589l972m660k960
$$ 234143 238612 243875 249492 255015 261147 268594 276372 282505 285997 286957 285368 281396 276736 273776
52877B73776q81r74l027m602m387l296k499k181k358l199m085l753k165r77j308
$$ 273776 272895 271921 268894 264292 259905 256609 254110 251929 249571 246372 242287 238534 236369 235392 234084
52862B34084k129j979j264j341j972j494K89J149p29m071n851m642j714Q61K146
$$ 234084 231955 229976 228712 227371 225399 223905 224194 225343 224614 220543 214692 210050 208336 209197 211343
52847B11343K492K587K627K049J50k652m582m172j964J95J312J758J822J086l64
$$ 211343 213835 216422 219049 221098 221248 218596 214014 209842 207878 208073 209385 211143 212965 214051 213687
52832B13687j338r76K9N02M35O62J355J773J472Q60M82L75K70N2j89k20K01J044
$$ 213687 212349 211373 211402 211904 212339 213001 214356 216129 217601 218461 218943 219318 219588 219640 219451 219231 219432 220476
52814B20476J818J998J637J371J688K241K105Q06q35j272L8J760K100R38k49m88
$$ 220476 222294 224292 225929 227300 228988 231229 233334 234140 233305 232033 232071 233831 235931 236869 236620 236132
52798B36132k89k84p7P19J347J006M09Q83K213K901K462J983K175K434K458L177
$$ 236132 235843 235559 235482 236201 237548 238554 238963 239846 242059 244960 247422 249405 251580 254014 256472 259649
52782B59649M921O054N110L338L271M978N911M686K941K608L170L151K750L101
$$ 259649 264570 270624 275734 279072 282343 287321 293232 297918 300859 303467 306637 309788 312538 315639
52768C15639L889L793K972K725K756J069k581n447n296l406k438k844l297l487
$$ 315639 319528 323321 326293 329018 331774 332843 330262 324815 319519 316113 313675 310831 307534 304047
52754C04047m213n198n147m014l168l110k903k340k686m406n855n425l753k604
$$ 304047 299834 294636 289489 285475 282307 279197 276294 273954 271268 266862 261007 255582 251829 249225
52740B49225k601l183l940m630m686l909l300l836m726m131j638J035K027J051
$$ 249225 246624 243441 239501 234871 230185 226276 222976 219140 214414 210283 208645 209680 211707 212758
52726B12758r48k936m131m050k841j390n56m02l86k30k26p20j551k231k599l007
$$ 212758 211810 208874 204743 200693 197852 196462 195906 195504 195118 194888 194662 193942 192391 190160 187561 184554
52710A84554l661m090l696k604j537q24r4R19J790J907J195M8j167k256l062l432
$$ 184554 180893 176803 173107 170503 168966 168142 168048 168967 170757 172664 173859 173907 172740 170484 167422 163990
52694A63990l205k259q37J79j90j976l998m802l748j346J006J750M02j843l201
$$ 163990 160785 158526 157689 157868 157678 155702 151704 146902 143154 141808 142814 144564 144966 143123 139922
52679A39922l090k255j307k30N60M1j770l158k740j351p60j137j227o40l78r17
$$ 139922 136832 134577 133270 133040 133600 133641 131871 128713 125973 124622 123862 122725 121498 120858 120480 119563
52663A19563j225l04J246K140K181K302L062L857L704K359M94r74j629j718j719
$$ 119563 118338 118034 119280 121420 123601 125903 128965 132822 136526 138885 139379 138405 136776 135058 133339
52648A33339j804j667j007r1K49n21j793k229j227L07J094J044J149J882K577
$$ 133339 131535 129868 128861 128770 129019 128498 126705 124476 123249 123556 124650 125694 126843 128725 131302
52633A31302K500J844J292J233J791K968M278M724L925K842K678L322L707L530
$$ 131302 133802 135646 136938 138171 139962 142930 147208 151932 155857 158699 161377 164699 168406 171936
52619A71936L577M152M147K497J2j263n52N97K08j725l460l913l778m081m501
$$ 171936 175513 179665 183812 186309 186321 185058 184506 185103 185311 183586 180126 176213 172435 168354 163853
52604A63853m019k693j735j870k525k804k494j835j010l34l22j045j753j694j084
$$ 163853 159834 157141 155406 153536 151011 148207 145713 143878 142868 142534 142212 141167 139414 137720 136636
52589A36636q36j410k264k574k175j658j526j516j159q40j517l066l806k556m25
$$ 136636 135800 134390 132126 129552 127377 125719 124193 122677 121518 120678 119161 116095 112289 109733 109308
52574A09308N82K75K04J112K113K526K840L294L023J577m1q56j313k105k626j874
$$ 109308 109890 110165 110369 111481 113594 116120 118960 122254 125277 126854 126813 125957 124644 122539 119913 118039
52558A18039k21R76J120O97L03K84Q89J831K097J149j10m98j53k0k37k29P2L20
$$ 118039 117818 118794 119914 120611 120914 121198 122087 123918 126015 127164 127054 126556 126403 126383 126146 125917 125989 126309
52540A26309P45J713K544K169R48M04J071J940K222K190J940Q37j050k276j773
$$ 126309 127054 128767 131311 133480 134428 134832 135903 137843 140065 142255 144195 145032 143982 141706 139933
52525A39933l30N90P85J050J580J740J295R48J341K101K199J217J88P47L169N527
$$ 139933 139603 140193 140978 142028 143608 145348 146643 147591 148932 151033 153232 154449 154637 155384 158553 164080
52509A64080N498K935q1j713j958j626r53O0Q04O43r2m75q1R22K325L648L866
$$ 164080 169578 172513 172432 170719 168761 167135 166182 166242 167046 167689 167597 167122 167041 167963 170288 173936 177802
52492A77802K402L10o61j79M73M79M88J111J616J139L03L28J047J183M12j95N
$$ 177802 180204 180514 179853 179674 180147 180626 181114 182225 183841 184980 185283 185611 186658 187841 188253 188058 188063
52475A88063K26l73j353j765j326j99J481L086L305J702k55q30j28O04J101J827
$$ 188063 188289 187916 186563 184798 183472 183273 184754 187840 191145 192847 192592 191762 191634 192238 193339 195166
52459A95166K235J288k58l17J317K362J496L33O46J533J213N8k75K74L13n20j278
$$ 195166 197401 198689 198431 198114 199431 201793 203289 203622 204268 205801 207014 207072 206797 207071 207384 206864 205586
52442B05586j556j659j228K79J841J840Q72J263L213L883J527j580k140j55J726
$$ 205586 204030 202371 201143 201422 203263 205103 205975 207238 210451 214334 215861 214281 212141 211986 213712
52427B13712J976J239K16j215k683k992j728Q4J376K031K169J648Q95J012K172
$$ 213712 215688 216927 217143 215928 213245 210253 208525 208609 209985 212016 214185 215833 216728 217740 219912
52412B19912K823J646l63j110l01M06J28K2J150K597K957K621K967L840L594J753
$$ 219912 222735 224381 224018 222908 222607 223013 223141 223163 224313 226910 229867 232488 235455 239295 242889 244642
52396B44642n1l02N81J405J904K259J945M18j544k478k096j409j151j148j230
$$ 244642 244591 244289 244870 246275 248179 250438 252383 252801 251257 248779 246683 245274 244123 242975 241745
52381B41745j610k122k004j011L0L17J69L66Q43P61j59j087j210q72j040j768
$$ 241745 240135 238013 236009 234998 235028 235345 235514 235880 236723 237484 237325 236238 235028 234156 233116 231348
52365B31348j947r16M38Q76O11P95J398J107l67j327m31J218J626P22J05M24O83
$$ 231348 229401 228485 228923 229799 230410 231205 232603 233710 233343 232016 231585 232803 234429 235151 235256 235680 236363
52348B36363J84m29l76K65J284K927M934N923M752K123P0j43R47J918J992J496
$$ 236363 236547 236118 235742 236007 237291 240218 245152 251075 255827 257950 258020 257877 258824 260742 262734 264230
52332B64230J094R10O19K80N55J780L172L538K594J211M01M90J027J162L21j080
$$ 264230 265324 266234 266853 267133 267688 269468 272640 276178 278772 279983 280384 280874 281901 283063 283384 282304
52316B82304j784j087J98P60M64K51O42J263J776K342K954L177K888K563K522
$$ 282304 280520 279433 279631 280391 280855 281106 281748 283011 284787 287129 290083 293260 296148 298711 301233
52301C01233K477K094J486Q34J59l30j36P94J792K188J990J554R75K12m52n10
$$ 301233 303710 305804 307290 308124 308283 307953 307817 308611 310403 312591 314581 316135 317110 317322 316870 316360
$$ [...]
##END NTUPLES=NMR SPECTRUM
##END=
