##TITLE=coffee_type TOFR01-ROVE100A_80-20%
COFFEE_meoh_noesyp64 COFFEE_meoh {C:\Bruker\TOPSPIN} Administrator 12
##JCAMPDX= 6.0         $$ Bruker NMR JCAMP-DX V2.0
##DATA TYPE= NMR SPECTRUM
##DATA CLASS= NTUPLES
##ORIGIN= Bruker BioSpin GmbH
##OWNER= Administrator
$$ 1.72 TOPSPIN		Version 2.1
$$ 2012-05-18 15:45:41.479 -0700  Administrator@X
$$ Compression mode = diff/dup
##.OBSERVE FREQUENCY= 400.13188235
##.OBSERVE NUCLEUS= ^1H
##.ACQUISITION MODE= SIMULTANEOUS (DQD)
##.ACQUISITION SCHEME= undefined
##.AVERAGES= 64
##.DIGITISER RES= 22
##SPECTROMETER/DATA SYSTEM= spect
##.PULSE SEQUENCE= noesygpps1d.comp
##.SOLVENT NAME= COFFEE_meoh
##.SHIFT REFERENCE= INTERNAL, COFFEE_meoh, 1, 14.98061
##AUDIT TRAIL= $$ (NUMBER, WHEN, WHO, WHERE, PROCESS, VERSION, WHAT)
$$ ##TITLE= Audit trail, TOPSPIN		Version 2.1
$$ ##JCAMPDX= 5.01
$$ ##ORIGIN= Bruker BioSpin GmbH
$$ ##OWNER= Administrator
$$ $$ C:\Bruker\TOPSPIN/data/Administrator/nmr/12-COFFEE-2302/132/pdata/1/auditp.txt
$$ ##AUDIT TRAIL=  $$ (NUMBER, WHEN, WHO, WHERE, PROCESS, VERSION, WHAT)
(   1,<2012-02-23 23:32:57.406 -0500>,<Administrator>,<TOPSPIN>,<go>,<TOPSPIN 2.1>,
      <created by zg
	started at 2012-02-23 23:21:27.109 -0500,
	POWCHK enabled, PULCHK disabled,
       configuration hash MD5:
       B0 76 FB 9C 50 81 44 7D 18 B3 26 32 4E 60 AD 96
       data hash MD5: 64K
       19 7A A8 F1 3D 3D BB BB 4B EC 3D 41 76 C0 04 0F>)
(   2,<2012-02-23 23:33:00.094 -0500>,<Administrator>,<TOPSPIN>,<proc1d>,<TOPSPIN 2.1>,
      <Start of raw data processing
       efp LB = 0.3 FT_mod = 6 PKNL = 1 PHC0 = 0 PHC1 = 0 SI = 128K 
       data hash MD5: 128K
       5B 8E 9E 35 82 B5 65 1A EB 58 FF BD BB B8 F7 7D>)
(   3,<2012-02-23 23:33:01.375 -0500>,<Administrator>,<TOPSPIN>,<proc1d>,<TOPSPIN 2.1>,
      <pk PHC0 = 25.3894 PHC1 = 0 
       data hash MD5: 128K
       45 21 38 49 1B ED 5D EE 34 7B 21 7F 97 8D 5F 4C>)
(   4,<2012-02-23 23:33:01.625 -0500>,<Administrator>,<TOPSPIN>,<proc1d>,<TOPSPIN 2.1>,
      <abs ABSG = 1 
       data hash MD5: 128K
       B9 4F C7 4E AD BD 80 62 DA 59 B9 ED 28 B6 15 8A>)
(   5,<2012-02-23 23:33:01.703 -0500>,<Administrator>,<TOPSPIN>,<proc1d>,<TOPSPIN 2.1>,
      <abs ABSG = 2 
       data hash MD5: 128K
       14 B4 16 A0 97 5E 10 53 F4 A5 40 B6 5E 8D 89 8E>)
(   6,<2012-02-23 23:33:01.766 -0500>,<Administrator>,<TOPSPIN>,<proc1d>,<TOPSPIN 2.1>,
      <abs ABSG = 3 
       data hash MD5: 128K
       18 39 0E 6E 5D 7E 20 6D 40 F3 14 6C D7 DC A3 52>)
(   7,<2012-02-23 23:33:01.828 -0500>,<Administrator>,<TOPSPIN>,<proc1d>,<TOPSPIN 2.1>,
      <abs ABSG = 4 
       data hash MD5: 128K
       ED 94 E5 22 F8 03 93 86 7F BC CC 90 25 75 3B 52>)
(   8,<2012-02-23 23:33:01.891 -0500>,<Administrator>,<TOPSPIN>,<proc1d>,<TOPSPIN 2.1>,
      <abs ABSG = 5 
       data hash MD5: 128K
       69 CA 03 80 07 D9 8C DC 65 AC BF A4 AE 4D FF B7>)
(   9,<2012-02-23 23:33:02.172 -0500>,<Administrator>,<TOPSPIN>,<audit>,<TOPSPIN 2.1>,
      <user comment:
       ICON-NMR User ID: Administrator
$$ [...]
150 150 150 150 150 150 150 150
##$TP07= 0
##$TPNAME0= <>
##$TPNAME1= <>
##$TPNAME2= <>
##$TPNAME3= <>
##$TPNAME4= <>
##$TPNAME5= <>
##$TPNAME6= <>
##$TPNAME7= <>
##$TPOAL= (0..7)
0.5 0.5 0.5 0.5 0.5 0.5 0.5 0.5
##$TPOFFS= (0..7)
0 0 0 0 0 0 0 0
##$TUNHIN= 0
##$TUNHOUT= 0
##$TUNXOUT= 0
##$USERA1= <user>
##$USERA2= <user>
##$USERA3= <user>
##$USERA4= <user>
##$USERA5= <user>
##$V9= 5
##$VALIST= <valist>
##$VCLIST= <CCCCCCCCCCCCCCC>
##$VD= 0
##$VDLIST= <DDDDDDDDDDDDDDD>
##$VPLIST= <PPPPPPPPPPPPPPP>
##$VTLIST= <TTTTTTTTTTTTTTT>
##$WBST= 1024
##$WBSW= 4
##$XGAIN= (0..3)
0 0 0 0
##$XL= 0
##$YL= 0
##$YMAX_a= 14716009
##$YMIN_a= -6870557
##$ZGOPTNS= <>
##$ZL1= 120
##$ZL2= 120
##$ZL3= 120
##$ZL4= 120
##$ABSF1= 14.98061
##$ABSF2= -5.57192
##$ABSG= 5
##$ABSL= 3
##$ALPHA= 0
##$AQORDER= 0
##$ASSFAC= 0
##$ASSFACI= 0
##$ASSFACX= 0
##$ASSWID= 0
##$AUNMP= <proc_prof1d_extract>
##$AXLEFT= 0
##$AXNAME= <>
##$AXNUC= <1H>
##$AXRIGHT= 0
##$AXTYPE= 0
##$AXUNIT= <>
##$AZFE= 0.1
##$AZFW= 0.1
##$BCFW= 0
##$BC_mod= 0
##$BYTORDP= 0
##$COROFFS= 0
##$CY= 15
##$DATMOD= 1
##$DC= 0
##$DFILT= <>
##$DTYPP= 0
##$F1P= 0
##$F2P= 0
##$FCOR= 0.5
##$FTSIZE= 131072
##$FT_mod= 6
##$GAMMA= 0
##$GB= 0
##$INTBC= 1
##$INTSCL= 1
##$ISEN= 128
##$LB= 0.3
##$LEV0= 0
##$LPBIN= 0
##$MAXI= 10000
##$MC2= 0
##$MEAN= 0
##$ME_mod= 0
##$MI= 0
##$NCOEF= 0
##$NC_proc= -3
##$NLEV= 6
##$NOISF1= 0
##$NOISF2= 0
##$NSP= 0
##$NTH_PI= 0
##$NZP= 0
##$OFFSET= 14.98061
##$PC= 1
##$PHC0= 25.3894
##$PHC1= 0
##$PH_mod= 1
##$PKNL= yes
##$PPARMOD= 0
##$PPDIAG= 0
##$PPIPTYP= 0
##$PPMPNUM= 2147483647
##$PPRESOL= 1
##$PSCAL= 4
##$PSIGN= 0
##$PYNMP= <proc.py>
##$REVERSE= no
##$SF= 400.13
##$SI= 131072
##$SIGF1= 0
##$SIGF2= 0
##$SINO= 400
##$SIOLD= 131072
##$SPECTYP= <>
##$SREGLST= <1H.CDCl3>
##$SSB= 0
##$STSI= 131072
##$STSR= 0
##$SW_p= 8223.68421052632
##$SYMM= 0
##$S_DEV= 0
##$TDeff= 65536
##$TDoff= 0
##$TI= <>
##$TILT= no
##$TM1= 0
##$TM2= 0
##$TOPLEV= 0
##$USERP1= <user>
##$USERP2= <user>
##$USERP3= <user>
##$USERP4= <user>
##$USERP5= <user>
##$WDW= 1
##$XDIM= 131072
##$YMAX_p= 498004862
##$YMIN_p= -176674037
##$CURPLOT= <Network HP LaserJet P1505>
##$CURPRIN= <$Network HP LaserJet P1505>
##$DFORMAT= <normdp>
##$LAYOUT= <+/1D_H.xwp>
##$LFORMAT= <normlp>
##$PFORMAT= <normpl>
##$SURQMSG= 1
$$ End of Bruker specific parameters
$$ ---------------------------------
##NTUPLES= NMR SPECTRUM
##VAR_NAME=  FREQUENCY,     SPECTRUM/REAL,   SPECTRUM/IMAG
##SYMBOL=    X,             R,               I
##VAR_TYPE=  INDEPENDENT,   DEPENDENT,       DEPENDENT
##VAR_FORM=  AFFN,          ASDF,            ASDF
##VAR_DIM=   131072,        131072,          131072
##UNITS=     HZ,            ARBITRARY UNITS, ARBITRARY UNITS
##FACTOR=    0.0627417313425165, 1,          1
##FIRST=     8223.62146879498, 1009,         -88259
##LAST=      0,             2914,            -87741
##MIN=       0,             -176674037,      0
##MAX=       8223.62146879498, 498004862,    0
$$ Real data points
##PAGE= N=1
##DATA TABLE= (X++(R..R)), XYDATA
$$ [...]
62926B511486K7353K6060K4115K2606K1726K0535J7437J1786N097n07n128j0886
62914B671680j8606k6610l3656m1026m9904n8269o2917o3941o4651o6950o9230
62903B115920o9402o7778o5665o2989n9167n5209n2844n1876n0161m6465m1928
62892A492436l8229l5560l3088l0494k8093k5886k3534k1191j9588j9094j9257
62881A198422j9450j9592j9791j9694j8662j6724j4871j4126j4428j4715j4122
62870A012247j2814j1534j0595r740q768p857p198o753o567o750o942o352m906
62857I05471l736l758m208l645k154j303j772k469k418k239k814l656l774l310
62843H64215k962k515j348L3N22L06O12J543J738M96j220k502l687n054n707m864
$$ y = [2511486, 2538839, 2564899, 2589014, 2611620, 2633346, 2653881, 2671318, 2683104, 2688201, 2687694, 2682566, 2671680, 2653074, 2626464, 2592808, 2551782, 2501878, 2443609, 2380692, 2316751, 2252100, 2185150, 2115920, 2046518, 1978740, 1913075, 1850086, 1790919, 1735710, 1682866, 1630990, 1580829, 1534364, 1492436, 1454207, 1418647, 1385559, 1355065, 1326972, 1301086, 1277552, 1256361, 1236773, 1217679, 1198422, 1178972, 1159380, 1139589, 1119895, 1101233, 1084509, 1069638, 1055512, 1041084, 1026369, 1012247, 999433, 987899, 977304, 967564, 958796, 950939, 943741, 936988, 930421, 923671, 916729, 910377, 905471, 901735, 897977, 893769, 890124, 887970, 886667, 884895, 882426, 880008, 877769, 874955, 871299, 867525, 864215, 861253, 858738, 857390, 857423, 857945, 858251, 858863, 860406, 862144, 862640, 861420, 858918, 855231, 850177, 844470, 839606]
62827H39606l225k038j525j305j623k839m132m037k271j24J000P39l77j469j718
62812H14662r29K03P75O01J80m4NJ72J60k06n36j85O11O50n62j826j913j487k152
62793H08179m048n687o036n396m179k231L37K628L774L508J911m73k253k187q72
62778G86975k75j095j810j009N05R70J49n72j03J280K486K503J066r63k116j767
62762G86224o94R4N18Q54Q47K48k95Q7J204K134K520K683K712K510K532L369M564
62745H12111M908M210L685M213N167N583N716O675Q866J1494J3429J4166J4134
62732I14357J4409J5938J8661K1522K3515K4600K5421K6376K7372K8427L0136
62721A170734L3258L7756M2433M5885M8117N0855N5792O2674O9601P5097P9192
$$ y = [839606, 836381, 834343, 832818, 831513, 829890, 827051, 822919, 818882, 816611, 816487, 817487, 818226, 817849, 816380, 814662, 813733, 813936, 814711, 815312, 815492, 815448, 815453, 815625, 815785, 815579, 815043, 814858, 815469, 816119, 815557, 813731, 811818, 810331, 808179, 804131, 798444, 792408, 787012, 782833, 780602, 780939, 783567, 787341, 790849, 792760, 792287, 790034, 787847, 786975, 786700, 785605, 783795, 782786, 783291, 784261, 784410, 783838, 783735, 785015, 787501, 790004, 791070, 790107, 787991, 786224, 785530, 785624, 786142, 786996, 787843, 788091, 787796, 787883, 789087, 791221, 793741, 796424, 799136, 801646, 804178, 807547, 812111, 817019, 821229, 824914, 829127, 834294, 839877, 845593, 852268, 861134, 872628, 886057, 900223, 914357, 928766, 944704, 963365, 984887, 1008402, 1033002, 1058423, 1084799, 1112171, 1140598, 1170734, 1203992, 1241748, 1284181, 1330066, 1378183, 1429038, 1484830, 1547504, 1617105, 1692202, 1771394]
62710A771394Q2543Q5358Q7540Q9070Q9676Q8692Q5888Q1877P6934O9838N8983
62699B667793M4668K9321J4997J409j3039k8728m4082n7183o7518p5767q2397
62688B389474q7087q9556r0331r0166q9071q6519q2679p8659p5148p1438o6499
62677A482321o0631n5367n1626m8745m5578m1932l8433l5298l1969k8062k4242
62666A020438k1642k0534j9975j8909j7207j5283j3127j0449p652n626m375k767
62654H62892k83J891K516K344L156N118O639P071Q007J0994J5214J8619K0680
62641I64858K2700K5593K8681L0965L2705L5130L8996M3844M8611N2690N6373
62630A381146O0188O3913O6560O7589O7720O8012O8279O7062O3196N6895M9078
$$ y = [1771394, 1853937, 1939295, 2026835, 2115905, 2205581, 2294273, 2380161, 2462038, 2538972, 2608810, 2667793, 2712461, 2741782, 2756779, 2758188, 2745149, 2716421, 2672339, 2615156, 2547638, 2471871, 2389474, 2302387, 2212831, 2122500, 2032334, 1943263, 1856744, 1774065, 1695406, 1620258, 1548820, 1482321, 1421690, 1366323, 1314697, 1265952, 1220374, 1178442, 1140009, 1104711, 1072742, 1044680, 1020438, 998796, 978262, 958287, 939378, 922171, 906888, 893761, 883312, 875660, 870034, 865659, 862892, 862609, 864500, 867016, 869360, 872516, 877634, 884273, 891344, 899351, 910345, 925559, 944178, 964858, 987558, 1013151, 1041832, 1072797, 1105502, 1140632, 1179628, 1223472, 1272083, 1324773, 1381146, 1441334, 1505247, 1571807, 1639396, 1707116, 1775128, 1843407, 1910469, 1973665, 2030560, 2079638]
62619B079638M0271L0528K0038R215j718j2836k4079l4984m4929n3469o0354o5370
62607A881951o8370o9530o9482o9010o8394o7162o4660o0983n7140n4088n1684
62596A181448m8878m4967m0363l6015l2475k9813k8125k7408k6983k5716k3147
62585H17558j9962j7103j4943j3623j3500j4534j5676j5715j4440j2404r922p282
62573F48454n553n759p125p502o064m378m166n079n556m880l332j228R30J953
62559E90715J051p55j575j000l48m65n14P01L122N736P718Q754Q756P903O875
62544F36674O620P762J0116J2754J4704J5913J7241J9306K1646K3470K4769K6077
62532H37052K7501K8809L0256L2428L5280L8171M0939M4053M7479N0116N0716
$$ y = [2079638, 2119909, 2150437, 2170475, 2179690, 2177972, 2165136, 2141057, 2106073, 2061144, 2007675, 1947321, 1881951, 1813581, 1744051, 1674569, 1605559, 1537165, 1470003, 1405343, 1344360, 1287220, 1233132, 1181448, 1132570, 1087603, 1047240, 1011225, 978750, 948937, 920812, 893404, 866421, 840705, 817558, 797596, 780493, 765550, 751927, 738427, 723893, 708217, 692502, 678062, 665658, 655736, 648454, 642901, 637142, 630017, 622515, 616451, 612073, 607907, 602828, 597272, 592392, 589060, 587832, 588762, 590715, 591766, 591011, 589436, 588436, 588088, 587623, 587109, 587810, 590932, 596668, 604386, 613140, 621896, 629799, 636674, 643294, 651056, 661172, 673926, 688630, 704543, 721784, 741090, 762736, 786206, 810975, 837052, 864553, 893362, 923618, 956046, 991326, 1029497, 1070436, 1114489, 1161968, 1212084, 1262800]
62521A262800M8921M5275M0673L5845L0887K5217J8375J0713K800n415j3930k1529
62509A480632k6562k9004l0750l3506l7154m0236m1316l9974l7427l6005l6741
62498A091957l7649l5822l1295k7094k5208k4545k3521k2519k2435k2650k2134
62487G97085k1199k0400j8944j6003j2730j0984j0732j0469r668q953q264o769
62475F41970m581k749j545l69O63O67k17o42J03J447L029N279P969R711R559Q060
62459F78354O361N392O224R665J4694J8627J9871J9651K0297K2776K6581L0863
62447H79356L4635L6776L7087L6858L7454L8725L9520L9180L7733L5169L1506
62436A283999K7163K2410J6802R944K602l878r076j3735j8595k3687k8604l2727
$$ y = [1262800, 1311721, 1356996, 1397669, 1433514, 1464401, 1489618, 1507993, 1518706, 1521506, 1516091, 1502161, 1480632, 1454070, 1425066, 1394316, 1360810, 1323656, 1283420, 1242104, 1202130, 1164703, 1128698, 1091957, 1054308, 1018486, 987191, 960097, 934889, 910344, 886823, 864304, 841869, 819219, 797085, 775886, 755486, 736542, 720539, 707809, 696825, 686093, 675624, 665956, 657003, 648739, 641970, 637389, 634640, 633095, 632726, 633389, 634056, 633839, 633197, 633300, 634747, 637776, 643055, 651024, 660735, 670294, 678354, 684715, 690107, 696331, 705996, 720690, 739317, 759188, 778839, 799136, 821912, 848493, 879356, 913991, 950767, 987854, 1024712, 1062166, 1100891, 1140411, 1179591, 1217324, 1252493, 1283999, 1311162, 1333572, 1350374, 1360318, 1362920, 1359042, 1349966, 1336231, 1317636, 1293949, 1265345, 1232618]
62424A232618l5224l5514l3983l1833l0116k9012k7902k5884k2535j8521j5258
62413I26836j3555j2822j1891j0328q495o780n341m362l888l516k847k073j586
62400H39352j085J05J909L388M011M301M842N277M942M191M280N776P616Q170
62386H97075P029N318M226L802L327K343P46j704n162q980j2039j3899j4982j5422
62372H51678j4668j2749j1047j0828j1474j1244r647q076p819q280p790n736l262
62359G29058j829j505j051M72K614M308N291O179P273Q103Q280Q103P957P813
62345G91066P823Q668J0485J2080J2178J1194J0733J1298J1607J0406Q064N802
62333I11404M090K558J107K45J40n8j385l636n171m493j853J094L150M519N794
$$ y = [1232618, 1197394, 1161880, 1127897, 1096064, 1065948, 1036936, 1009034, 983150, 960615, 942094, 926836, 913281, 900459, 888568, 878240, 869745, 862965, 857624, 853262, 849374, 845858, 843011, 840938, 839352, 838267, 838372, 840281, 843669, 847680, 851981, 856823, 862100, 867042, 871233, 875513, 881289, 888905, 897075, 904104, 909422, 913648, 917450, 920777, 923120, 923866, 922162, 917000, 908020, 895981, 882082, 867100, 851678, 837010, 824261, 813214, 802386, 790912, 779668, 770021, 761945, 754126, 745846, 738056, 732320, 729058, 727229, 725724, 724673, 725145, 727759, 732067, 737358, 743537, 750810, 758913, 767193, 775296, 783253, 791066, 798889, 807557, 818042, 830122, 842300, 853494, 864227, 875525, 887132, 897538, 905602, 911404, 915494, 918052, 919159, 919404, 919544, 919486, 918101, 914465, 909294, 904801, 902948, 904042, 907192, 911711, 917505]
62318I17505O811P173P428Q856J2003J6165K0355K4218K7820L1029L3602L5765
62306A148730L8524M3163N0015N7525O3118O5563O6251O7441O9558P1053P0719
62295A811660O8924O6237O2119N5782M7485L8028K7529J5846M022o042j3662k0240
62283B157688k7453l5125m1662m6191m9442n2272n4211n4063n1701m8493m5772
62272A651303m3554m1077l8103l5066l2316k9910k8084k7023k6184k4609k2250
62261A303127k0194j9071j7934j5545j2248r532q028o940n628m669m811n633o049
62248A166845n711n199n001n110n538o464p666q504q747q858r003q532p098n746
62234A069668n708o374n765l300p96K3j33O69K797M922O188O971P524P489P238
$$ y = [917505, 924316, 931489, 938917, 947773, 959776, 975941, 996296, 1020514, 1048334, 1079363, 1112965, 1148730, 1187254, 1230417, 1280432, 1337957, 1401075, 1466638, 1532889, 1600330, 1669888, 1740941, 1811660, 1880584, 1946821, 2008940, 2064722, 2112207, 2150235, 2177764, 2193610, 2197632, 2191590, 2177928, 2157688, 2130235, 2095110, 2053448, 2007257, 1957815, 1905543, 1851332, 1797269, 1745568, 1697075, 1651303, 1607749, 1566672, 1528569, 1493503, 1461187, 1431277, 1403193, 1376170, 1349986, 1325377, 1303127, 1282933, 1263862, 1245928, 1230383, 1218135, 1208603, 1200575, 1193635, 1188007, 1183338, 1178527, 1172894, 1166845, 1161134, 1155935, 1150934, 1145824, 1140286, 1133822, 1126156, 1117652, 1108905, 1100047, 1091044, 1082512, 1075414, 1069668, 1063960, 1057586, 1051821, 1048521, 1047725, 1047748, 1047615, 1048284, 1051081, 1056003, 1062191, 1069162, 1076686, 1084175, 1091413]
62219A091413Q211J1046J4409J6673J7877J8999K0143K0804K1401K3050K5832
62208A289858K8680L1059L3586L6641L9641M2270M5371M9800N5157O0374O4981
62197A777418O9040P2422P4872P6300P6188P3207O6459N6906M6609L6562K6179
62186B452162J4889L234p833j7743k6062l2325l6857m1074m5965n0593n2864n1918
62174B107051m9133m6461m4270m1301l6699l1461k7435k5063k2866j9396j5076
62163A747890j1424q989p080n340m351m281m052k686o94Q11J926L711O281Q345
62149A720067Q972Q883R338J0358J1056J1425J2714J5581J8760K0482K0849K1660
62137A890145K3837K6240K7579K8463L0354L3311L6145L8467M1011M3785M5536
$$ y = [1091413, 1099624, 1110670, 1125079, 1141752, 1159629, 1178628, 1198771, 1219575, 1240976, 1264026, 1289858, 1318538, 1349597, 1383183, 1419824, 1459465, 1501735, 1547106, 1596906, 1652063, 1712437, 1777418, 1846458, 1918880, 1993752, 2070052, 2146240, 2219447, 2285906, 2342812, 2389421, 2425983, 2452162, 2467051, 2470285, 2462452, 2444709, 2418647, 2386322, 2349465, 2308391, 2262426, 2211833, 2158969, 2107051, 2057918, 2011457, 1967187, 1925886, 1889187, 1857726, 1830291, 1805228, 1782362, 1762966, 1747890, 1736466, 1727477, 1720397, 1715057, 1710706, 1706425, 1702373, 1699687, 1698993, 1699804, 1701730, 1705441, 1711722, 1720067, 1729039, 1737922, 1747260, 1757618, 1768674, 1780099, 1792813, 1808394, 1827154, 1847636, 1868485, 1890145, 1913982, 1940222, 1967801, 1996264, 2026618, 2059929, 2096074, 2134541, 2175552, 2219337, 2264873]
62126B264873M5528M4567M3571M2284M0197L7571L4705L1240K7286K4213K3094
62115B659129K3250K3617K4621K7175L0683L3928L7441M2746M9333N4650N7561
62104C064134N9628O2052O3358O1521N6965N1777M6914M1896L6766L2589K9904
62093C607504K7856K5290K1975J8396J4859J1279P810N407N316P721J1131J3766
62081C778310J5435J7386K0294K3310K5327K6296K6857K7358K7829K8379K9114
62070D045895K9994L1111L2623L4292L5672L6893L8453M0131M1147M1751M3297
62059D451259M6057M8396M9126M9438N0932N2834N3115N1825N1232N2506N4202
62048E010922N4715N4670N5780N8263O0529O1144O0305N9415N9636O0914O2258
$$ y = [2264873, 2310401, 2354968, 2398539, 2440823, 2481020, 2518591, 2553296, 2584536, 2611822, 2636035, 2659129, 2682379, 2705996, 2730617, 2757792, 2788475, 2822403, 2859844, 2902590, 2951923, 3006573, 3064134, 3123762, 3185814, 3249172, 3310693, 3367658, 3419435, 3466349, 3508245, 3545011, 3577600, 3607504, 3635360, 3660650, 3682625, 3701021, 3715880, 3727159, 3734969, 3740376, 3745692, 3753413, 3764544, 3778310, 3793745, 3811131, 3831425, 3854735, 3880062, 3906358, 3933215, 3960573, 3988402, 4016781, 4045895, 4075889, 4107000, 4139623, 4173915, 4209587, 4246480, 4284933, 4325064, 4366211, 4407962, 4451259, 4497316, 4545712, 4594838, 4644276, 4695208, 4748042, 4801157, 4852982, 4904214, 4956720, 5010922, 5065637, 5120307, 5176087, 5234350, 5294879, 5356023, 5416328, 5475743, 5535379, 5596293, 5658551]
62037E658551O2929O3273O4295O6501O9258P1229P1499P0645P0653P3128P7360
62026F419321Q0919Q2456Q3110Q4640Q7178Q9514R0548Q9323Q4655P6405O6695
62015G334764N8297N2060M7270M3967M2867M2963M1426L6692L0005K3056J5831
62004G769198P929M84m920q489j1855j5926k0379k4956k9762l4296l7391l8683
61992G550954l9342m0813m3253m5650m7266m8507n0157n2111n3315n3119n2177
61981G025244n1537n1262n0586m9079m6906m4193m1133l8725l8200l9489m1181
61970F532953m2248m2746m2744m1963m1132m2102m5460m9265n1435n2420n3991
61959F027447n6411n8504n9963o1506o2820o2434o0083n7424n5665n3950n1094
$$ y = [5658551, 5721480, 5784753, 5849048, 5915549, 5984807, 6056036, 6127535, 6198180, 6268833, 6341961, 6419321, 6500240, 6582696, 6665806, 6750446, 6837624, 6927138, 7017686, 7107009, 7191664, 7268069, 7334764, 7393061, 7445121, 7492391, 7536358, 7579225, 7622188, 7663614, 7700306, 7730311, 7753367, 7769198, 7777127, 7777611, 7772691, 7764202, 7752347, 7736421, 7716042, 7691086, 7661324, 7627028, 7589637, 7550954, 7511612, 7470799, 7427546, 7381896, 7334630, 7286123, 7235966, 7183855, 7130540, 7077421, 7025244, 6973707, 6922445, 6871859, 6822780, 6775874, 6731681, 6690548, 6651823, 6613623, 6574134, 6532953, 6490705, 6447959, 6405215, 6363252, 6322120, 6280018, 6234558, 6185293, 6133858, 6081438, 6027447, 5971036, 5912532, 5852569, 5791063, 5728243, 5665809, 5605726, 5548302, 5492637, 5438687, 5387593]
61948E387593m7639m5022m3517m2106l9902l6793l3078k9485k7105k6409k6564
61937D989973k6600k7108k9747l4955m1273m7182n2690n8401o3743o7200o8251
61926D472823o8220o8820p0152p0514o8238o3564n8616n5435n4107n3044n1056
61915C791057m8550m6481m4660m2065l8682l5966l4978l4872l4038l2343l1047
61904C367375l0637k9780k7055k2941j9388j7623j7008j6019j3724j0211o055
61893C156934j762K360O154R642J3144J7224K2254K8032L3888L9276M4162M8848
61881C420156N3595N8570O3886O9455P4778P9080Q1866Q3413Q4802Q7344R1673
61870D248618R7117J02094J05474J07582J09774J13064J17516J23015J30106J39573
$$ y = [5387593, 5339954, 5294932, 5251415, 5209309, 5169407, 5132614, 5099536, 5070051, 5042946, 5016537, 4989973, 4963373, 4936265, 4906518, 4871563, 4830290, 4783108, 4730418, 4672017, 4608274, 4541074, 4472823, 4404603, 4335783, 4265631, 4195117, 4126879, 4063315, 4004699, 3949264, 3895157, 3842113, 3791057, 3742507, 3696026, 3651366, 3609301, 3570619, 3534653, 3499675, 3464803, 3430765, 3398422, 3367375, 3336738, 3306958, 3279903, 3256962, 3237574, 3219951, 3202943, 3186924, 3173200, 3162989, 3156934, 3155172, 3157532, 3163686, 3173328, 3186472, 3203696, 3225950, 3253982, 3287870, 3327146, 3371308, 3420156, 3473751, 3532321, 3596207, 3665662, 3740440, 3819520, 3901386, 3984799, 4069601, 4156945, 4248618, 4345735, 4447829, 4553303, 4660885, 4770659, 4883723, 5001239, 5124254, 5254360, 5393933]
61860E393933J51405J64930J80154J98236K20023K44596K70291K97129L27242
61851G447939L62423M01970M43631M86232N30662N78555O30495O85216P39803
61842A2306926P90816Q35668Q72463Q97592R03689Q81026Q21179P19144N73500
61833A9602003L87680J72580n3843k72021m66763o28737p52958q38445q88848
61824A6260648r10785r10336q91612q58219q14248p63393p08587o53026o00031
61815I150411n50952n04492m59283m16161l76800l41268l08480k78319k51478
61806E663178k27495k04837j83050j63129j45394j28590j11735r5449q0583o6815
61796D256101n3513m0829k8955j7431o389K597Q386J2091J5435J8117J8623J7092
$$ y = [5393933, 5545338, 5710268, 5890422, 6088658, 6308681, 6553277, 6823568, 7120697, 7447939, 7810362, 8212332, 8655963, 9142195, 9672857, 10251412, 10881907, 11567123, 12306926, 13097742, 13933410, 14805873, 15703465, 16607154, 17488180, 18309359, 19028503, 19602003, 19989683, 20162263, 20108420, 19836399, 19369636, 18740899, 17987941, 17149496, 16260648, 15349863, 14439527, 13547915, 12689696, 11875448, 11112055, 10403468, 9750442, 9150411, 8599459, 8094967, 7635684, 7219523, 6842723, 6501455, 6192975, 5914656, 5663178, 5435683, 5230846, 5047796, 4884667, 4739273, 4610683, 4498948, 4403499, 4322916, 4256101, 4202588, 4161759, 4132804, 4115373, 4108984, 4111581, 4119967, 4132058, 4147493, 4165610, 4184233, 4201325]
61784D201325J5101J2703Q122J076n885j0452j3131j5305j6424j4968j1083o394
61772D144685j679L457Q826J3294J6194J7824J8316J7244J4550J0771O161O04
61760D270247n369j0519j4293j7203j9298j9245j5856r960l679K074Q472J7023
61748D182394K7607L8793M9731O0990P3319Q6154R8158J09113J20425J33467J48067
61737E128218J63129J78102J93228K08789K24778K41249K58453K76952K97913
61728G170811L22633L51201L82325M15402M52036M94247N41757N92806O47688
61719A1370906P09655P81451Q62323R49393J041015J137472J238647J341955J442497
61710B0875314J534123J609462J658659J668604J624455J513164J326804J064408
$$ y = [4201325, 4216426, 4229129, 4237251, 4238327, 4232442, 4221990, 4208859, 4193554, 4177130, 4162162, 4151079, 4144685, 4143006, 4146463, 4155289, 4168583, 4184777, 4202601, 4220917, 4238161, 4252711, 4263482, 4269643, 4270247, 4264878, 4254359, 4240066, 4222863, 4203565, 4184320, 4168464, 4158504, 4154825, 4156899, 4165371, 4182394, 4210001, 4248794, 4298525, 4359515, 4432834, 4518988, 4617146, 4726259, 4846684, 4980151, 5128218, 5291347, 5469449, 5662677, 5871466, 6096244, 6337493, 6595946, 6872898, 7170811, 7493444, 7844645, 8226970, 8642372, 9094408, 9588655, 10130412, 10723218, 11370906, 12080561, 12862012, 13724335, 14673728, 15714743, 16852215, 18090862, 19432817, 20875314, 22409437, 24018899, 25677558, 27346162, 28970617, 30483781, 31810585, 32874993]
61702C2874993P33641L52743n0193m43037p97762j095287j325767j487449j585543
61693B7176339j629503j629029j592411j528087j445656j353876j258400j162307
61685A5577070j068056r77871q92974q13792p40842o74718o15329n61906n13700
61676H717882m70340m31515l96623l64767l35159l07671k82714k60167k38976
61667E629950k18575k00167j85329j73643j63137j53066j44468j37794j31862
61658D121909j25797j20152j15186j09903j03998r8868r5229r1331q5375p8268
61648C097802p2152o7449o3459o0617n9628n9067n6609n2453m9153m7884m7263
61637B462068m6079m4853m3995m2557l9975l7384l6161l6319l7115l7990l8187
$$ y = [32874993, 33608634, 33961377, 33911184, 33468147, 32670385, 31575098, 30249331, 28761882, 27176339, 25546836, 23917807, 22325396, 20797309, 19351653, 17997777, 16739377, 15577070, 14509014, 13531143, 12638169, 11824377, 11083535, 10408817, 9793488, 9231582, 8717882, 8247542, 7816027, 7419404, 7054637, 6719478, 6411807, 6129093, 5868926, 5629950, 5411375, 5211208, 5025879, 4852236, 4689099, 4536033, 4391565, 4253771, 4121909, 3996112, 3875960, 3760774, 3650871, 3546873, 3448005, 3352776, 3261445, 3176070, 3097802, 3025650, 2958201, 2894742, 2834125, 2774497, 2715430, 2658821, 2606368, 2557215, 2509331, 2462068, 2415989, 2371136, 2327141, 2284584, 2244609, 2207225, 2171064, 2134745, 2097630, 2059640, 2021453]
61626B021453l6769l3959l1480l0546l0340k9208k6672k3570k0965j9533j9381
61615A719030j9876k0107j9728j8749j6610j2658p868m551l726l936l478k546
61603A585197k347l245m888p036q986r238p217m664l751m292m279k851j065J21
61589A521459R82J873K533K919L409L593K150j108m261n399n018n090o196o911
61575A504935o005m060k426j430k64J729M211O176O799O070M801L806K912J147
61561A528401j883n249p840r748j1746j3712j4759j4896j5263j6178j6234j4254
61549A386639j1216r028q088p284o048n041m833n149n485n588n155m053k840k224
61535A304607j973j405p87r30j441r24P00J776J606J843M067P353R726J0895J2025
$$ y = [2021453, 1984684, 1950725, 1919245, 1888699, 1858359, 1829151, 1802479, 1778909, 1757944, 1738411, 1719030, 1699154, 1679047, 1659319, 1640570, 1623960, 1611302, 1603434, 1598883, 1595157, 1591221, 1587743, 1585197, 1582850, 1579605, 1574717, 1567681, 1558695, 1549457, 1542240, 1537576, 1533825, 1529533, 1525254, 1522403, 1521338, 1521459, 1522441, 1524314, 1526847, 1529766, 1533175, 1536768, 1538918, 1537810, 1533549, 1528150, 1523132, 1518042, 1511846, 1504935, 1498930, 1494870, 1492444, 1491014, 1490750, 1492479, 1496690, 1502866, 1509665, 1515735, 1520536, 1524342, 1527254, 1528401, 1526518, 1521269, 1513429, 1503681, 1491935, 1478223, 1463464, 1448568, 1433305, 1417127, 1400893, 1386639, 1375423, 1366395, 1358307, 1351023, 1344975, 1339934, 1335101, 1329952, 1324467, 1318879, 1313724, 1309671, 1306831, 1304607, 1302634, 1301229, 1300442, 1299512, 1298071, 1297147, 1297847, 1299623, 1301229, 1303072, 1307139, 1314492, 1324218, 1335113, 1347138]
61520A347138J3616J5376J7545K0527K3561K5593K7340L0576L5195L8943M0704
61509A636114M2093M4754M7676M8794M8139M7699M8628N0204N1429N2094N1978
61498B169602N0311M6791M2441L8757L6402L5070L4191L3213L1576K9062K6161
61487B573577K3597K1431J8976J5688J1740P604L439q44n095q874j1749j3421
61475B636069j3675j2608j0855r160p532n121j245L725Q836J3689J8601K3731
61463B644455K8669L3244L8248M4741N2744O1179O9258P7450Q6836R7886J10209
61452C344919J23157J36292J49369J62499J76446J92384K11016K31838K53344
61443D981264K73962K93048L10960L27851L42103L50391L49682L38856L17822
$$ y = [1347138, 1360754, 1376130, 1393675, 1414202, 1437763, 1463356, 1490696, 1521272, 1556467, 1595410, 1636114, 1678207, 1722961, 1770637, 1819431, 1867570, 1915269, 1963897, 2014101, 2065530, 2117624, 2169602, 2219913, 2266704, 2309145, 2347902, 2384304, 2419374, 2453565, 2486778, 2518354, 2547416, 2573577, 2597174, 2618605, 2637581, 2653269, 2665009, 2672613, 2676052, 2675208, 2670113, 2661239, 2649490, 2636069, 2622394, 2609786, 2598931, 2589771, 2582239, 2577118, 2575873, 2579598, 2588434, 2602123, 2620724, 2644455, 2673124, 2706368, 2744616, 2789357, 2842101, 2903280, 2972538, 3049988, 3136824, 3234710, 3344919, 3468076, 3604368, 3753737, 3916236, 4092682, 4285066, 4496082, 4727920, 4981264, 5255226, 5548274, 5859234, 6187085, 6529188, 6879579, 7229261, 7568117, 7885939]
61434G885939K85764K41625J86563J24918O2208K680n1279r8637j39291j73285
61424H327205j99729k17191k25752k27744k25604k19706k09358j95071j78606
61415F428444j61269j43445j25512j07903r0446p2861n5775m0065k5321j0433
61405E595414M315J7272K7813L7222M6724N6022O4325P1269P6106P7473P5325
61394F149280P2032P0190O9966O9767O8972O8632O9785P2218P5045P7654P9890
61383F943431Q1731Q2806Q2225P9348P4957P0846O7737O4324N8971N1481M2543
61372G700400L2389K1168R752j122j1959k3306l3980m2076m7485n1701n5216n6986
61360G439878n6721n5821n5131n3488m9562m3831l7513l0732k3201j5857j0200
$$ y = [7885939, 8171703, 8413328, 8599891, 8724809, 8787017, 8789697, 8738418, 8639781, 8500490, 8327205, 8127476, 7910285, 7684533, 7456789, 7231185, 7011479, 6802121, 6607050, 6428444, 6267175, 6123730, 5998218, 5890315, 5799869, 5727008, 5671233, 5631168, 5605847, 5595414, 5599729, 5617001, 5644814, 5682036, 5728760, 5784782, 5849107, 5920376, 5996482, 6073955, 6149280, 6221312, 6291502, 6361468, 6431235, 6500207, 6568839, 6638624, 6710842, 6785887, 6863541, 6943431, 7025162, 7107968, 7190193, 7269541, 7344498, 7415344, 7483081, 7547405, 7606376, 7657857, 7700400, 7732789, 7753957, 7763709, 7762587, 7750628, 7727322, 7693342, 7651266, 7603781, 7552080, 7496864, 7439878, 7383157, 7327336, 7272205, 7218717, 7169155, 7125324, 7087811, 7057079, 7033878, 7018021, 7007821]
61349G007821o409l547j273M6P94J914L063K431q15n075q036q925q192n872j447
61334F966478N213J3932K5086L9236N5896P3722R2238J12445J35362J60697J87379
61323G867684K14638K41967K68638K93952L17508L38566L55437L66221L69784
61314A0634395L65222L50691L23902K84142K33159J74083J10228M5035j7951p6056
61304A2426850j28237j74592k15469k51215k82110l07864l27456l40066l46038
61295A0053803l46576l42645l34606l22783l08019k91642k75051k59121k43752
61286G329608k28255k12309j96357j80776j65137j48805j31895j15004r8337q1817
61276E770916o5942n1554l8520k5552j1954J156J2072K0650K8410L6526M4397
$$ y = [7007821, 7001412, 6997865, 6996592, 6996638, 6997432, 6999346, 7002409, 7004840, 7004025, 6998950, 6990914, 6981989, 6973797, 6967925, 6966478, 6971691, 6985623, 7010709, 7049945, 7105841, 7179563, 7271801, 7384246, 7519608, 7680305, 7867684, 8082322, 8324289, 8592927, 8886879, 9204387, 9542953, 9898390, 10264611, 10634395, 10999617, 11350308, 11674210, 11958352, 12191511, 12365594, 12475822, 12520857, 12502906, 12426850, 12298613, 12124021, 11908552, 11657337, 11375227, 11067363, 10739907, 10399841, 10053803, 9707227, 9364582, 9029976, 8707193, 8399174, 8107532, 7832481, 7573360, 7329608, 7101353, 6889044, 6692687, 6511911, 6346774, 6197969, 6066074, 5951070, 5852733, 5770916, 5704974, 5653420, 5614900, 5589348, 5577394, 5578550, 5590622, 5611272, 5639682, 5676208, 5720605]
61265E720605N0442N3739N4649N4095N2703N0504M7263M3034L8449L4314L0884
61254F230681K7763K4577K1530J9201J7996J7845J7995J7023J3653Q024J592m848
61242F413032j2346k2114l3186m3220n1413n9104o7121p4157p8618q0800q2032
61231E808921q2596q1740p9199p5555p1483o7471o3847o0106n4809m7286l8940
61220E085889l1769k6082k0898j6008j2099r178o657m900m886o056o337m883l168
61207D932968k579k359r45J990N808J0140J4843J9540K4144K9110L4465L9453
61195E106578M4076N0037N9092P1133Q4657R8355J11307J22571J31739J39243
61185F018788J44782J46000J40032J25947J04465P5855L9901j942m5957q8241
$$ y = [5720605, 5771047, 5824786, 5879435, 5933530, 5986233, 6036737, 6084000, 6127034, 6165483, 6199797, 6230681, 6258444, 6283021, 6304551, 6323752, 6341748, 6359593, 6377588, 6394611, 6408264, 6416288, 6417880, 6413032, 6400686, 6378572, 6345386, 6302166, 6250753, 6191649, 6124528, 6050371, 5971753, 5890953, 5808921, 5726325, 5644585, 5565386, 5489831, 5418348, 5350877, 5287030, 5226924, 5172115, 5124829, 5085889, 5054120, 5028038, 5007140, 4991132, 4979033, 4969855, 4963198, 4958298, 4953412, 4947356, 4941019, 4936136, 4932968, 4930389, 4928030, 4927085, 4929075, 4934883, 4945023, 4959866, 4979406, 5003550, 5032660, 5067125, 5106578, 5150654, 5200691, 5259783, 5330916, 5415573, 5513928, 5625235, 5747806, 5879545, 6018788, 6163570, 6309570, 6449602, 6575549, 6680014, 6755869, 6795770, 6793828, 6747871, 6659630]
61175F659630j26338j58694j83869k01199k11405k15705k14807k09326k00654
61166D937633j90506j79678j67958j55447j43293j32646j23138j13188j02072
61157C629707r0978q1512p3627o6012n8214n1241m5863m1399l6653l1258k5530
61146C027420j9763j4180q999m025J081N815R129J1294J4297J9197K4047K5898
61134C091211K4319K1407J8572J4974R448K483m469j0746j6668k2364k7149l0260
61122C070758l2001l3887l7364m2331m7199n0571n2345n3047n2869n1920n0893
61111B566331n0537n0658n0286m8961m7407m6793m7484m8430m8072m6080m3843
61100B037780m2598m1440l8536l4135l0625k9123k7789k4566k0003j6012j3309
$$ y = [6659630, 6533292, 6374598, 6190729, 5989530, 5778125, 5562420, 5347613, 5138287, 4937633, 4747127, 4567449, 4399491, 4244044, 4100751, 3968105, 3844967, 3731779, 3629707, 3538729, 3457217, 3383590, 3317578, 3259364, 3208123, 3162260, 3120861, 3084208, 3052950, 3027420, 3007657, 2993477, 2984478, 2980453, 2981534, 2987349, 2996478, 3007772, 3022069, 3041266, 3065313, 3091211, 3115530, 3136937, 3155509, 3170483, 3179931, 3182414, 3177945, 3167199, 3150531, 3128167, 3101018, 3070758, 3038757, 3004870, 2967506, 2925175, 2877976, 2827405, 2775060, 2722013, 2669144, 2617224, 2566331, 2515794, 2465136, 2414850, 2365889, 2318482, 2271689, 2224205, 2175775, 2127703, 2081623, 2037780, 1995182, 1953742, 1915206, 1881071, 1850446, 1821323, 1793534, 1768968, 1748965, 1732953, 1719644]
61089A719644j1782j2098j4836j8637k1242k2130k2422k2632k2278k1491k1040
61078A509056k0633j8998j5937j2738j0171p562m289q02K206M538O034O610O945
61065A444259P952R328R843R335Q989R356R583R146Q909R667J0808J1157J0257
61052A568589Q287N777L895L861N401O819P092O748O119M266O48l406o215p891
61038A609990r700j2036j4247j5932j7222j8027j8130j7841j7749j7914j7944
61027A433248j7705j7420j7255j7320j7734j8290j8387j7648j6210j4209j1671
61016A249399r203p796p364o465m327k152j229p61Q05K950L575K392J805L661
61002A225290O694Q353Q002O951O095N176M253M331N856P662Q307P865P496P675
$$ y = [1719644, 1707862, 1695764, 1680928, 1662291, 1641049, 1618919, 1596497, 1573865, 1551587, 1530096, 1509056, 1488423, 1469425, 1453488, 1440750, 1430579, 1423017, 1418728, 1417926, 1420132, 1424670, 1430704, 1437314, 1444259, 1452211, 1461539, 1471382, 1480717, 1489706, 1499062, 1508645, 1517791, 1526700, 1536367, 1547175, 1558332, 1568589, 1576876, 1582653, 1586548, 1590409, 1595810, 1602629, 1609721, 1616469, 1622588, 1626854, 1627502, 1624096, 1617881, 1609990, 1600290, 1588254, 1574007, 1558075, 1540853, 1522826, 1504696, 1486855, 1469106, 1451192, 1433248, 1415543, 1398123, 1380868, 1363548, 1345814, 1327524, 1309137, 1291489, 1275279, 1261070, 1249399, 1240196, 1232400, 1225036, 1218571, 1214244, 1212092, 1210863, 1210102, 1210907, 1213857, 1217432, 1219824, 1221629, 1225290, 1231984, 1240337, 1248339, 1255290, 1261385, 1266561, 1270814, 1275145, 1281001, 1288663, 1296970, 1304835, 1312331, 1320006]
60988A320006P798P497P373Q050R284J0387J1044J1348J1571J2175J3635J5849
60976A446017J8126J9968K1354K2184K2306K2386K3710K6400K8797K9488K9063
60965A709799K8871K8911K8264K6935K5929K5800K6398K7721K9777L1879L3312
60954B023596L4497L6426L9288M2763M7144N2681N8299O2668O6379P1497P9077
60943B614315Q8561R9310J10924J22171J31797J40696J51367J64829J79747J94883
60933C998600K10554K27110K43868K60168K76022K91280L05883L21307L39909
60924F474701L62396L87669M15381M46544M81129N17529N55238N96265O43688
60915A0880540P01304P74721Q69383R86503J123990J282211J465729J679551J928497
$$ y = [1320006, 1327804, 1335301, 1342674, 1350724, 1360008, 1370395, 1381439, 1392787, 1404358, 1416533, 1430168, 1446017, 1464143, 1484111, 1505465, 1527649, 1549955, 1572341, 1596051, 1622451, 1651248, 1680736, 1709799, 1738670, 1767581, 1795845, 1822780, 1848709, 1874509, 1900907, 1928628, 1958405, 1990284, 2023596, 2058093, 2094519, 2133807, 2176570, 2223714, 2276395, 2334694, 2397362, 2463741, 2535238, 2614315, 2702876, 2802186, 2913110, 3035281, 3167078, 3307774, 3459141, 3623970, 3803717, 3998600, 4209154, 4436264, 4680132, 4940300, 5216322, 5507602, 5813485, 6134792, 6474701, 6837097, 7224766, 7640147, 8086691, 8567820, 9085349, 9640587, 10236852, 10880540, 11581844, 12356565, 13225948, 14212451, 15336441, 16618652, 18084381, 19763932, 21692429]
60906B1692429K219745K558152K938158L351005L799463M275819M693394M852685
60898E0380850M534874L682782K496248J326333M60816K264q7387J03334M38475
60889F3338589O87392N68471q5235j185662k427636l478765m151214m434035m417422
60880D4414483m211416l909054l576221l246949k928294k617386k315971k031165
60872A9578027j769700j536068j333640j163777j024272r10310q16507p37712
60864A0286041o69497o09101n55342n07414m64556m26399l92084l59436l27026
60855E975186k96743k72073k53697k39105k26477k16087k07278j97204j84181
60846C882341j69919j56785j44966j33903j24375j16974j10264j02752r5477r0222
$$ y = [21692429, 23912174, 26470326, 29408484, 32759489, 36558952, 40834771, 45528165, 50380850, 54915724, 58598506, 61094754, 62421087, 62881903, 62884167, 62796780, 62900114, 63338589, 64025981, 64594452, 64509217, 63323555, 60895919, 57417154, 53265940, 48831905, 44414483, 40203067, 36294013, 32717792, 29470843, 26542549, 23925163, 21609192, 19578027, 17808327, 16272259, 14938619, 13774842, 12750570, 11840260, 11023753, 10286041, 9616544, 9007443, 8452101, 7944687, 7480131, 7053732, 6661648, 6302212, 5975186, 5678443, 5406370, 5152673, 4913568, 4687091, 4471004, 4263726, 4066522, 3882341, 3712422, 3555637, 3410671, 3276768, 3152393, 3035419, 2925155, 2822403, 2726926, 2636704]
60836B636704q6199q0978p4260o8348o4649o1889n8312n4054n0549m8598m7796
60825A941072m7135m5651m2985l9875l7803l7619l8528l8726l7272l5155l4115
60814A506208l4307l3831l1090k7045k4037k2819k1975k0270j8030j5763j2948
60803A244093r257n800l880l093j917J54K171L424M451O122Q422J0645J2389J3888
60789A281812J5328J6287J6213J5374J4840J5186J5804J5866J5420J4858J3822
60778A450810J1663Q751O221M559L457K968L408M011L188O06k271m369o460r392
60764A477150j2160j3043j2003j0634j0068j0181j0707j1900j3775j5470j5907
60753A341302j4804j2886j1191j0240r764r172q184o786m897k529k17J382K440
$$ y = [2636704, 2550505, 2469527, 2395267, 2326919, 2262270, 2200381, 2142069, 2088015, 2037466, 1988868, 1941072, 1893937, 1848286, 1805301, 1765426, 1727623, 1690004, 1651476, 1612750, 1575478, 1540323, 1506208, 1471901, 1438070, 1406980, 1379935, 1355898, 1333079, 1311104, 1290834, 1272804, 1257041, 1244093, 1234836, 1229036, 1225156, 1222063, 1220146, 1220300, 1222471, 1225895, 1230346, 1236468, 1244890, 1255535, 1267924, 1281812, 1297140, 1313427, 1329640, 1345014, 1359854, 1375040, 1390844, 1406710, 1422130, 1436988, 1450810, 1462473, 1471224, 1477445, 1482004, 1485461, 1488429, 1491837, 1495848, 1499036, 1499642, 1497371, 1493002, 1486542, 1477150, 1464990, 1451947, 1439944, 1429310, 1419242, 1409061, 1398354, 1386454, 1372679, 1357209, 1341302, 1326498, 1313612, 1302421, 1292181, 1282417, 1273245, 1265061, 1258275, 1253378, 1250849, 1250632, 1252014, 1254454]
60740A254454L873O072Q294R709J0480J1470J3178J5350J7334J8591J9036J9027
60728A406868J8871J8464J7753J7122J6681J5540J2851R503P537P594Q100P400
60716A564284N572L582J835M90L05J775L868M759L818K126J017P24O11J90k77
60701A594679j85M45O73k85j916l079l633m497n888o659o017m900m820n975p331
60686A540612q028p844o741m940l239k429k403k451k301k265k492k687k647k556
60672A487589k647k874l039l107l327m116n563p110p942p777o964n863m559l435
60658A419266l303m507o234p191o819n538m073k931k530l387n837r299j2088j2540
60644A332989j0803r051r355j1558j3857j5026j5263j5215j5263j5688j6466j6762
$$ y = [1254454, 1258327, 1264399, 1272693, 1282402, 1292882, 1304352, 1317530, 1332880, 1350214, 1368805, 1387841, 1406868, 1425739, 1444203, 1461956, 1479078, 1495759, 1511299, 1524150, 1533653, 1541190, 1548784, 1556884, 1564284, 1569856, 1573438, 1575273, 1575763, 1576068, 1577843, 1581711, 1586470, 1590288, 1592414, 1593431, 1594155, 1594766, 1594956, 1594679, 1594494, 1594939, 1595612, 1595327, 1593411, 1590332, 1586699, 1582202, 1576314, 1569655, 1563638, 1558738, 1553918, 1547943, 1540612, 1532584, 1524740, 1517999, 1513059, 1509820, 1507391, 1504988, 1502537, 1500236, 1497971, 1495479, 1492792, 1490145, 1487589, 1484942, 1482068, 1479029, 1475922, 1472595, 1468479, 1462916, 1455806, 1447864, 1440087, 1433123, 1427260, 1422701, 1419266, 1415963, 1411456, 1405222, 1398031, 1391212, 1385674, 1381601, 1378670, 1376140, 1372753, 1366916, 1357617, 1345529, 1332989, 1322186, 1313135, 1303780, 1292222, 1278365, 1263339, 1248076, 1232861, 1217598, 1201910, 1185444, 1168682]
60632A168682j5782j4177j3532j4183j4630j3519j1139q621o689n734n950o705
60620A038021o661n228l197j483j69Q48J349J590K406L775M392L675L190M834
60606A047342Q394J1916J3942J4323J3581J2592J2459J3457J4450J4142J2597
60595A189195J0864R730R705J1341J4402J7229J8255J7948J8035J9061J9882J9511
60583A375158J8306J7105J6155J5301J4600J4327J4472J4422J3359J1353R751
60572A534309R700J0290R389O548L576J664m31m144q536j1667j3363j4845j6365
60559A506125j7185j7429j8013j8837j8769j7471j5730j3989j1988r893q260o715
60547A331846m186p16K298L933M685N370O374Q185J1287J5137J8317K0035K0464
$$ y = [1168682, 1152900, 1138723, 1125191, 1111008, 1096378, 1082859, 1071720, 1063099, 1056410, 1050676, 1044726, 1038021, 1031360, 1026132, 1022935, 1021452, 1021283, 1022131, 1023480, 1025070, 1027476, 1031251, 1035643, 1039318, 1042508, 1047342, 1055736, 1067652, 1081594, 1095917, 1109498, 1122090, 1134549, 1148006, 1162456, 1176598, 1189195, 1200059, 1209789, 1219494, 1230835, 1245237, 1262466, 1280721, 1298669, 1316704, 1335765, 1355647, 1375158, 1393464, 1410569, 1426724, 1442025, 1456625, 1470952, 1485424, 1499846, 1513205, 1524558, 1534309, 1544009, 1554299, 1563688, 1570236, 1573812, 1575476, 1575045, 1570901, 1562365, 1550698, 1537335, 1522490, 1506125, 1488940, 1471511, 1453498, 1434661, 1415892, 1398421, 1382691, 1368702, 1356714, 1346821, 1338561, 1331846, 1327660, 1326944, 1329242, 1333175, 1337860, 1343230, 1349604, 1357789, 1369076, 1384213, 1402530, 1422565, 1443029]
60534A443029J9603J7143J3736J0912R176P554N480L812L278L216K856K751L904
60521A546450O132Q083Q380O372K596j081k817k976l868o678r841j1417j1777
60508A527558j2418j3260j3097j2208j2409j4238j5893j5647j3947j2248j0977
60497A381216r776q911q897q996p574m381j232L38J110K780N261P031P997J0009
60483A365975J3791J7158J7905J7251J8376K2098K6109K8690L1005L4870M0104
60472A633332M5419N0733N6927O3958P0746P6692Q1794Q5088Q4354P8147O7382
60461B394572N4160L9527K3345O291q973j9372k3856k3750k0902j6227j0200l854
60449B390761J492N297P870R555J0422J0700J0795J0817J0698J1046J3203J7994
$$ y = [1443029, 1462632, 1479775, 1493511, 1504423, 1513599, 1521153, 1526633, 1530445, 1533723, 1536939, 1539795, 1542546, 1546450, 1552582, 1560665, 1569045, 1575417, 1578013, 1576932, 1574115, 1571139, 1567271, 1560593, 1550752, 1539335, 1527558, 1515140, 1501880, 1488783, 1476575, 1464166, 1449928, 1434035, 1418388, 1404441, 1392193, 1381216, 1371440, 1362529, 1353632, 1344636, 1337062, 1332681, 1331449, 1331787, 1332897, 1335677, 1340938, 1347969, 1355966, 1365975, 1379766, 1396924, 1414829, 1432080, 1450456, 1472554, 1498663, 1527353, 1558358, 1593228, 1633332, 1678751, 1729484, 1786411, 1850369, 1921115, 1997807, 2079601, 2164689, 2249043, 2327190, 2394572, 2448732, 2488259, 2511604, 2517895, 2508922, 2489550, 2465694, 2441944, 2421042, 2404815, 2394615, 2390761, 2392253, 2397550, 2405420, 2414975, 2425397, 2436097, 2446892, 2457709, 2468407, 2479453, 2492656, 2510650]
60437B510650K4648L1553L7882M4186N1386N9682O8652P8092Q8230R8985J09602
60426C203548J19357J28349J37025J45128J51969J57816J64300J73240J85779
60417D566511K02915K25986K55872K92109L33219L77502M23188M68278N10163
60408G655743N44174N62016N53264N10269M31890L22462J88739L9308j14337k58962
60398A0434566l83106m79399n44626n79468n88381n77927n54118n21272m82744
60389E723525m41433l99480l58479l20004k85179k53927k25739k00863j79644
60380C058777j61203j44309j29299j17410j08146r9239q9595q0513p3313o7419
60370A988331o1654n5960n0867m6491m2963m0733l9531l7977l5135l1581k8261
$$ y = [2510650, 2535298, 2566851, 2604733, 2648919, 2700305, 2759987, 2828639, 2906731, 2994961, 3093946, 3203548, 3322905, 3451254, 3588279, 3733407, 3885376, 4043192, 4207492, 4380732, 4566511, 4769426, 4995412, 5251284, 5543393, 5876612, 6254114, 6677302, 7145580, 7655743, 8199917, 8761933, 9315197, 9825466, 10257356, 10579818, 10768557, 10807865, 10693528, 10434566, 10051460, 9572061, 9027435, 8447967, 7859586, 7281659, 6727541, 6206269, 5723525, 5282092, 4882612, 4524133, 4204129, 3918950, 3665023, 3439284, 3238421, 3058777, 2897574, 2753265, 2623966, 2506556, 2398410, 2299171, 2209576, 2129063, 2055750, 1988331, 1926677, 1870717, 1819850, 1773359, 1730396, 1689663, 1650132, 1612155, 1577020, 1545439, 1517178]
60359A517178k5404k3171k2100k1913k1046j8604j5739j4011j3294j2562j1695
60348A317639j1081j0215q436o525n955o661p001o042m482l199k109p84P69K319
60334A248237L737M705M754L827K428J111K16j4L97Q35M40j019k888m253m633
60319A257880m226l820m267n704p340q322q516q240p521o137m212k281q66k07
60305A186221j67n3J064L314N448N869M320K257J411K199L500L945L400K974L405
60290A229107L867L119J595J283L208O053P896Q409Q554Q885R167R248R195Q666
60276A318252P229N480M952O415Q742R906Q977O860N151M591M830N376O064O497
60262A409322N859M107K600K542L072K281Mj873k078j539j775l023m692o397p603
$$ y = [1517178, 1491774, 1468603, 1446503, 1424590, 1403544, 1384940, 1369201, 1355190, 1341896, 1329334, 1317639, 1306558, 1296343, 1287907, 1281382, 1275427, 1268766, 1261765, 1255723, 1251241, 1248042, 1245933, 1245149, 1245918, 1248237, 1251974, 1256679, 1261433, 1265260, 1267688, 1268799, 1269015, 1269001, 1269398, 1270233, 1270673, 1269654, 1266766, 1262513, 1257880, 1253654, 1249834, 1245567, 1239863, 1232523, 1224201, 1215685, 1207445, 1199924, 1193787, 1189575, 1187294, 1186428, 1186221, 1186054, 1186001, 1187065, 1190379, 1195827, 1201696, 1206016, 1208273, 1209684, 1211883, 1215383, 1219328, 1222728, 1225702, 1229107, 1232974, 1236093, 1237688, 1238971, 1242179, 1248232, 1256128, 1264537, 1273091, 1281976, 1291143, 1300391, 1309586, 1318252, 1325481, 1330961, 1335913, 1342328, 1351070, 1360976, 1369953, 1376813, 1381964, 1386555, 1391385, 1396761, 1402825, 1409322, 1415181, 1419288, 1421888, 1424430, 1427502, 1429783, 1429787, 1427914, 1425836, 1424297, 1422522, 1419499, 1414807, 1408410, 1400807]
60247A400807p417n691l573k131j280p32q55j539j469J46K063K597J962J706K565
60232A387159M234O482Q905J0291R829Q551P930P661O543N020M778O104P687Q947
60218A490121J0444J1916J2278J1946J2785J4962J6171J5134J3782J4438J6681
60207A640658J8745K0518K3052K6147K8537L0057L1839L4531L7806M1509M5883
60196A979282N0606N4796N8179O1465O5485P0692P7294Q5032R2897R9930J06363
60185B802021J13292J21241J29795J38525J47472J56608J65542J73896J81335
60176D129727J87065J89938J89314J85329J78351J68607J56493J42562J26970
60167E654356J09340Q9558O8357M7025K6743Q265q136k2520l4726m3962m9333
$$ y = [1400807, 1393390, 1387699, 1384126, 1381995, 1380715, 1379983, 1379128, 1377589, 1376120, 1376266, 1378329, 1380926, 1382888, 1384594, 1387159, 1391393, 1397875, 1406780, 1417071, 1426900, 1435451, 1443381, 1451042, 1457585, 1462605, 1467383, 1473487, 1481174, 1490121, 1500565, 1512481, 1524759, 1536705, 1549490, 1564452, 1580623, 1595757, 1609539, 1623977, 1640658, 1659403, 1679921, 1702973, 1729120, 1757657, 1787714, 1819553, 1854084, 1891890, 1933399, 1979282, 2029888, 2084684, 2142863, 2204328, 2269813, 2340505, 2417799, 2502831, 2595728, 2695658, 2802021, 2915313, 3036554, 3166349, 3304874, 3452346, 3608954, 3774496, 3948392, 4129727, 4316792, 4506730, 4696044, 4881373, 5059724, 5228331, 5384824, 5527386, 5654356, 5763696, 5853254, 5921611, 5968636, 5995379, 6003644, 5995508, 5972988, 5938262, 5894300, 5844967]
60156E844967n0887m9593m6048l9795l0315j8282n170Q252K2558L8673N6543P5001
60144E805904R2758J09403J25344J40864J55267J67101J75146J79097J79228J75623
60134G305735J67806J55206J37985J17378R4980P1556M6952K1327l946k7377m9010
60123H038592o9962r0069j06963j18078j22917j22690j18463j10581r9464q5724
60113F993681o9507n0695k9990q866J1874L2716N4138P5303R4547J10708J23411
60102G337320J32351J36846J36148J29931J18632J03478Q6003O7404M8471K9993
60092H326577J2784k617j5687k5325l0235l0156k6027j8639p811O875K5224M6753
60080H261716P0990R7048J23794J51139J80214K11538K43996K76584L10020L45306
$$ y = [5844967, 5794080, 5744487, 5698439, 5658644, 5628329, 5610047, 5604877, 5613129, 5635687, 5674360, 5730903, 5805904, 5898662, 6008065, 6133409, 6274273, 6429540, 6596641, 6771787, 6950884, 7130112, 7305735, 7473541, 7628747, 7766732, 7884110, 7979090, 8050646, 8097598, 8118925, 8114979, 8087602, 8038592, 7968630, 7878561, 7771598, 7653520, 7530603, 7407913, 7289450, 7178869, 7079405, 6993681, 6924174, 6873479, 6843489, 6834623, 6846497, 6879213, 6933351, 7008654, 7103201, 7213909, 7337320, 7469671, 7606517, 7742665, 7872596, 7991228, 8094706, 8180709, 8248113, 8296584, 8326577, 8339361, 8336744, 8321057, 8295732, 8265497, 8235341, 8209314, 8190675, 8182864, 8189739, 8214963, 8261716, 8332706, 8429754, 8553548, 8704687, 8884901, 9096439, 9340435, 9617019, 9927039, 10272345]
60070A0272345L81563M16926M50886M83820N14502N39989N58167N68754N71536
60061A4758488N65385N49531N24365M90353M47378L95738L36576K70820J98926
60052A8537560J22339M3907l3984j10580j85358k56443l21121l76914m21557m53188
60042A6544661m71621m78373m74512m59616m33960m00436l62737l22286k78440
60033A2862680k31159j81986j32723q4609l8732L951M2920P7492J06062J26932
60023A2550828J39741J45177J43479J34311J17934R5448O7934L6355K285l2342
60013A3401150o6434r9837j32134j62198j89169k13041k33896k51091k63539k70474
60003A1519337k71908k68630k61756k51992k39453k24394k07512j89049j68300
$$ y = [10272345, 10653908, 11070834, 11521720, 12005540, 12520042, 13060031, 13618198, 14186952, 14758488, 15323873, 15873404, 16397769, 16888122, 17335500, 17731238, 18067814, 18338634, 18537560, 18659899, 18703806, 18669822, 18559242, 18373884, 18117441, 17796320, 17419406, 16997849, 16544661, 16073040, 15594667, 15120155, 14660539, 14226579, 13826143, 13463406, 13141120, 12862680, 12631521, 12449535, 12316812, 12232203, 12193471, 12197422, 12240342, 12317834, 12423896, 12550828, 12690569, 12835746, 12979225, 13113536, 13231470, 13326918, 13394852, 13431207, 13433492, 13401150, 13334716, 13234879, 13102745, 12940547, 12751378, 12538337, 12304441, 12053350, 11789811, 11519337, 11247429, 10978799, 10717043, 10465051, 10225598, 10001204, 9793692, 9604643, 9436343]
59994I436343j44792j19558r4268o9479m4625j9469N693L1046N7063Q2926J06233
59983I227113J24947J38927J49135J55873J58206J54535J43475J24725R9679P0927
59973A0547542M0709R745k2379n5773q9154j20181j47024j69527j88277k02495
59963I603186k09971k09757k03984j95701j85449j71389j52678j31131j09138
59954H033988q7278o4738m1072j6602Q411L4069O0456Q7465J14951J42540J69291
59943H441481J93887K15388K33634K48580K59112K62871K57828K43989K23022
59934A0579792J96265J64123J27656Q9500N2013J5113k2857o2368j01541j37445
59924A0900251j67479j89768k03469k09128k08016k00976j88352j70935j50188
$$ y = [9436343, 9291551, 9171993, 9077725, 9008246, 8963621, 8944152, 8949845, 8980891, 9037954, 9120880, 9227113, 9352060, 9490987, 9640122, 9795995, 9954201, 10108736, 10252211, 10376936, 10476615, 10547542, 10588251, 10597996, 10575617, 10519844, 10430690, 10310509, 10163485, 9993958, 9805681, 9603186, 9393215, 9183458, 8979474, 8783773, 8598324, 8426935, 8274257, 8143126, 8033988, 7946710, 7881972, 7840900, 7824298, 7832709, 7866778, 7927234, 8014699, 8129650, 8272190, 8441481, 8635368, 8850756, 9084390, 9332970, 9592082, 9854953, 10112781, 10356770, 10579792, 10776057, 10940180, 11067836, 11157336, 11209349, 11224462, 11201605, 11139237, 11037696, 10900251, 10732772, 10543004, 10339535, 10130407, 9922391, 9721415, 9533063, 9362128, 9211940]
59915I211940j27487j03594p8833n3200k6525Q81K7824N3122P6621R8752J19243
59904I198744J37103J51736J63299J72022J77656J79491J76560J68361J56017
59895A0680989J42047J28100J13554R7413Q0838O6333N4942M6096M0049L8542
59885A1488903M2638N1618O4762Q2916J07420J38395J74718K14889K57462L01337
59875A2925058L46220L92324M39340M85998N30197N68799N97621O12980O13249
59866A7511786N97817N64756N11056M35501L40130K28949J06988j9154j41766
59857B0136063k54388l52969m34695m97403n40817n66645n76321n70078n49292
59848A5793455n18174m81553m41704l98608l52362l03949k54331k04225j54465
$$ y = [9211940, 9084453, 8980859, 8902026, 8848826, 8822301, 8823182, 8851006, 8904128, 8980749, 9079501, 9198744, 9335847, 9487583, 9650882, 9822904, 10000560, 10180051, 10356611, 10524972, 10680989, 10823036, 10951136, 11064690, 11162103, 11242941, 11309274, 11364216, 11410312, 11450361, 11488903, 11531541, 11583159, 11647921, 11730837, 11838257, 11976652, 12151370, 12366259, 12623721, 12925058, 13271278, 13663602, 14102942, 14588940, 15119137, 15687936, 16285557, 16898537, 17511786, 18109603, 18674359, 19185415, 19620916, 19961046, 20189995, 20296983, 20277829, 20136063, 19881675, 19528706, 19094011, 18596608, 18055791, 17489146, 16912825, 16342747, 15793455, 15275281, 14793728, 14352024, 13953416, 13601054, 13297105, 13042774, 12838549, 12684084]
59839A2684084j05649n7779j1063L3482P4959J13358J48378J78158K00313K13710
59829A3471951K18069K12338J94731J64444J22450P0729J1500n2893j20113j87800
59819A4105406k53045l12223l62045m00697m27803m43755m49539m46704m36815
59810A0572780m21208m01341l78654l53751l26497k97443k68260k40296k13732
59801G671598j88921j67370j50262j36890j25789j16717j10292j06347j03783
59792F465227j01595r8804r4080q6776p7899o8788n9365m9097l9148l1694k7257
59781E730724k4696k3982k6927l4385m4397n4232o2953p0810p7169q0581q0560
59770E150032p8025p3920o8293o0997n2614m4222l6399k8745k0404j0871k33J1191
$$ y = [12684084, 12578435, 12520656, 12509593, 12543075, 12618034, 12731392, 12879770, 13057928, 13258241, 13471951, 13690020, 13902358, 14097089, 14261533, 14383983, 14454712, 14466212, 14413319, 14293206, 14105406, 13852361, 13540138, 13178093, 12777396, 12349593, 11905838, 11456299, 11009595, 10572780, 10151572, 9750231, 9371577, 9017826, 8691329, 8393886, 8125626, 7885330, 7671598, 7482677, 7315307, 7165045, 7028155, 6902366, 6785649, 6675357, 6569010, 6465227, 6363632, 6264828, 6170748, 6083972, 6006073, 5937285, 5877920, 5828823, 5789675, 5757981, 5730724, 5706028, 5682046, 5655119, 5620734, 5576337, 5522105, 5459152, 5388342, 5311173, 5230592, 5150032, 5072007, 4998087, 4929794, 4868797, 4816183, 4771961, 4735562, 4706817, 4686413, 4675542, 4675309, 4686500]
59758D686500K3054L4941M6561N8211P0475Q3190R5149J05212J13169J18934J21510
59747E556906J19685J13660J05181R5939Q6558P7141O8043N9650N1747M3555L4479
59736F412544K4944J6760J2522J4200K2031L4683N0407O8068Q7449J08836J32258
59725F984702J57175J83353K12008K45176K83404L24563L65714M05738M45268
59716I607101M83923N18249N42324N49581N33627M88376M09613K98623J65024
59707A3596441K5093j04409k12084k93075l46756l75023l82213l74103l55487
59698A1178384l28952k96118k58947k19478j79317j40026j03041o8587l5607l296
59688I545015K8097N8428Q8300J17840J46153J73017K00022K28838K59406K90975
$$ y = [4686500, 4709554, 4744495, 4791056, 4849267, 4919742, 5002932, 5098081, 5203293, 5316462, 5435396, 5556906, 5676591, 5790251, 5895432, 5991371, 6077929, 6155070, 6223113, 6282763, 6334510, 6378065, 6412544, 6437488, 6454248, 6466770, 6480970, 6503001, 6537684, 6588091, 6656159, 6743608, 6852444, 6984702, 7141877, 7325230, 7537238, 7782414, 8065818, 8390381, 8756095, 9161833, 9607101, 10091024, 10609273, 11151597, 11701178, 12234805, 12723181, 13132794, 13431417, 13596441, 13621534, 13517125, 13305041, 13011966, 12665210, 12290187, 11907974, 11533871, 11178384, 10849432, 10553314, 10294367, 10074889, 9895572, 9755546, 9652505, 9583918, 9548311, 9545015, 9573112, 9631540, 9719840, 9837680, 9983833, 10156850, 10356872, 10585710, 10845116, 11136091]
59678A1136091L23782L58296L93753M29244M65668N05018N48025N93965O42284
59669A5396126O92815P44672P96602Q48340Q99995R49980R94906J031738J058768
59660B3413942J074499J076925J064495J037238R97305R49401R00259Q56269Q21290
59651C2191623P97427P86820P90832Q07841Q33893Q65617R00426R33652R57670
59642C9865801R65073R51518R15077Q54776P71005O66283N44787M12103K75872
59633D6222295J44838K6083p6036j57828k15042k44985k48459k28173j86241j24591
59623D4911861m6416M4869J47722K61701L84895N13728O45273P78002R09663J035620
59613D9586918J149683J245335J315306J350708J341843J280274J160306R79367
$$ y = [11136091, 11459873, 11818169, 12211922, 12641166, 13106834, 13611852, 14159877, 14753842, 15396126, 16088941, 16833613, 17630215, 18478555, 19378550, 20328530, 21323436, 22355174, 23413942, 24488441, 25565366, 26629861, 27667099, 28664404, 29613805, 30514064, 31370333, 32191623, 32989050, 33775870, 34566702, 35374543, 36208436, 37074053, 37974479, 38908131, 39865801, 40830874, 41782392, 42697469, 43552245, 44323250, 44989533, 45534320, 45946423, 46222295, 46367133, 46393216, 46317180, 46159352, 45944310, 45699325, 45450866, 45222693, 45036452, 44911861, 44865445, 44910314, 45058036, 45319737, 45704632, 46218360, 46863633, 47641635, 48551298, 49586918, 50736601, 51981936, 53297242, 54647950, 55989793, 57270067, 58430373, 59409740]
59605E9409740P38564M44350J10152k44236n96152r24317j211335j444523j616794
59596E4665449j727482j781297j785805j749945j684344j601016j511567j426475
59588D1397518j356541j312918j302853j324590j367276j416025j457131j480585
59580C0379599j481200j459214j418807j364712j300159j227843j151192j073470
59572A9903002r96317r20478q47537p79587p17163o58918o03799n52435n05669
59563A3321099m62776m22238l83765l48321l16382k87322k60597k36510k15543
59554A0387645j97847j83545j72636j64356j57737j53248j52647j56495j62861
59545H886273j69297j74941j79646j82480j82769j81586j80163j77372j70985
$$ y = [59409740, 60148304, 60592654, 60702806, 60458570, 59862418, 58938101, 57726766, 56282243, 54665449, 52937967, 51156670, 49370865, 47620920, 45936576, 44335560, 42823993, 41397518, 40040977, 38728059, 37425206, 36100616, 34733340, 33317315, 31860184, 30379599, 28898399, 27439185, 26020378, 24655666, 23355507, 22127664, 20976472, 19903002, 18906685, 17986207, 17138670, 16359083, 15641920, 14983002, 14379203, 13826768, 13321099, 12858323, 12436085, 12052320, 11703999, 11387617, 11100295, 10839698, 10603188, 10387645, 10189798, 10006253, 9833617, 9669261, 9511524, 9358276, 9205629, 9049134, 8886273, 8716976, 8542035, 8362389, 8179909, 7997140, 7815554, 7635391, 7458019, 7287034]
59536G287034j61236j50875j41440j31649j20119j07433r4486q0859o6322n2290
59526F180325m0009k8506j6351m531M497J0360J5381K1489K8211L4158L9052M3432
59514F287508M7363N0442N2782N5325N9221O5020P2361Q0461Q9159R9220J11246
59503G070108J24507J37695J50826J65488J82773K01814K21118K40802K62368
59494H757499K86225L10529L33196L54367L75825L98116M19379M37437M51972
59485A2124545M63575M71331M72890M67135M55408M39496M19595L95256L67447
59476A6076678L38157L08166K76591K42997K08753J75856J45346J17882R5111
59467A7985537P9353P1918P2505Q0251R4568J14552J38120J61971J82128J94446
$$ y = [7287034, 7125798, 6974923, 6833483, 6701834, 6581715, 6474282, 6379796, 6298937, 6232615, 6180325, 6140316, 6111810, 6095459, 6090928, 6095425, 6105785, 6121166, 6142655, 6170866, 6205024, 6244076, 6287508, 6334871, 6385313, 6438095, 6493420, 6552641, 6617661, 6690022, 6770483, 6859642, 6958862, 7070108, 7194615, 7332310, 7483136, 7648624, 7831397, 8033211, 8254329, 8495131, 8757499, 9043724, 9354253, 9687449, 10041816, 10417641, 10815757, 11235136, 11672573, 12124545, 12588120, 13059451, 13532341, 13999476, 14454884, 14894380, 15313975, 15709231, 16076678, 16414835, 16723001, 16999592, 17242589, 17451342, 17627198, 17772544, 17890426, 17985537, 18064890, 18136808, 18209313, 18289564, 18384132, 18498684, 18636804, 18798775, 18980903, 19175349]
59457A9175349J95425J83089J56776J15936N9868j0613r1826j78387k65658l50391
59447A8989568m29578m99935n58797o04552o35975o52104o53352o42013o21054
59438A3692208n92816n58974n21038m80427m38507l96834l56766l18722k82470
59429I745654k48292k16727j87013j57198j26565r6679o9009m2714j6098J0847
59419H596206L6903O1985Q7334J13658J40576J67728J94936K21452K46412K70058
59409A0137248K93021L14179L30651L40306L42972L38776L26281L03012K67196
59400A2993642K18872J60120R4394K4835m6942j19680j90318k54336l08566l52590
59390A2219431l87004m11580m25850m30616m27862m19565m07085l91320l72887
$$ y = [19175349, 19370774, 19553863, 19710639, 19826575, 19886443, 19875830, 19784004, 19605617, 19339959, 18989568, 18559990, 18060055, 17501258, 16896706, 16260731, 15608627, 14955275, 14313262, 13692208, 13099392, 12540418, 12019380, 11538953, 11100446, 10703612, 10346846, 10028124, 9745654, 9497362, 9280635, 9093622, 8936424, 8809859, 8713180, 8644171, 8601457, 8585359, 8596206, 8633109, 8695094, 8782428, 8896086, 9036662, 9204390, 9399326, 9620778, 9867190, 10137248, 10430269, 10744448, 11075099, 11415405, 11758377, 12097153, 12423434, 12726446, 12993642, 13212514, 13372634, 13467028, 13491863, 13444921, 13325241, 13134923, 12880587, 12572021, 12219431, 11832427, 11420847, 10994997, 10564381, 10136519, 9716954, 9309869, 8918549, 8545662]
59381H545662l52304l30170l07088k83627k60659k39304k19873k01300j82530
59372F168807j64175j47607j32757j18147j03117q8549p5145o2556n0602l9862
59362E186290l0306k0648j0084L00Q790J5056K0250K5719L2165L9465M6944N4360
59350E368301O2423P1287P8670Q1452P9775P7747P9081Q3800R0464R9669J13049
59339F285718J30056J48277J66495J84979K02789K17481K28538K39358K54465
59330H058156K75676L02056L32546L67262M06334M48886M93692N40423N89736
59321A1814767O42110O96720P51297Q02939Q49005Q87376R15922R31922R32272
59312A9224330R14871Q80098Q30910P71417P05487O36459N67230M99886M35510
$$ y = [8545662, 8193358, 7863188, 7556100, 7272473, 7011814, 6772510, 6552637, 6351337, 6168807, 6004632, 5857025, 5724268, 5606121, 5503004, 5414455, 5339310, 5276754, 5226152, 5186290, 5155984, 5135336, 5125252, 5125552, 5134342, 5149398, 5169648, 5195367, 5227532, 5266997, 5313941, 5368301, 5430724, 5502011, 5580681, 5662133, 5741908, 5819655, 5898736, 5982536, 6073000, 6172669, 6285718, 6415774, 6564051, 6730546, 6915525, 7118314, 7335795, 7564333, 7803691, 8058156, 8333832, 8635888, 8968434, 9335696, 9742030, 10190916, 10684608, 11225031, 11814767, 12456877, 13153597, 13904894, 14707833, 15556838, 16444214, 17360136, 18292058, 19224330, 20139201, 21019299, 21850209, 22621626, 23327113, 23963572, 24530802, 25030688, 25466198]
59303B5466198L74708L17753K63668K09800J53312R3061K9287l7964j08907j82472
59293B6578444k55613l24502l85992m38196m80447n12861n35800n50395n59831
59284B2534807n68629n79076n89227n96054n99782o02948o05679o04671n97124
59275A7191617n83265n64241n39950n10330m77075m42623m08480l75334l43429
59266A2946890l12110k80657k50424k24502k04288j88138j74510j64453j59231
59257A0988577j57228j55497j53314j52063j52396j53483j54689j55944j56566
59248I597397j55355j52070j47518j42172j35635j27500j17758j06551r4262q1738
59238H336838o9746n8208m6419l3682j9532l989J2023K7327M1932N7034P3326
$$ y = [25466198, 25840906, 26158659, 26422327, 26632127, 26785439, 26878500, 26907787, 26869823, 26760916, 26578444, 26322831, 25998329, 25612337, 25174141, 24693694, 24180833, 23645033, 23094638, 22534807, 21966178, 21387102, 20797875, 20201821, 19602039, 18999091, 18393412, 17788741, 17191617, 16608352, 16044111, 15504161, 14993831, 14516756, 14074133, 13665653, 13290319, 12946890, 12634780, 12354123, 12103699, 11879197, 11674909, 11486771, 11312261, 11147808, 10988577, 10831349, 10675852, 10522538, 10370475, 10218079, 10064596, 9909907, 9753963, 9597397, 9442042, 9289972, 9142454, 9000282, 8864647, 8737147, 8619389, 8512838, 8418576, 8336838, 8267092, 8208884, 8162465, 8128783, 8109251, 8105262, 8117285, 8144612, 8186544, 8243578, 8316904]
59227H316904R0318J07657J25748J44481J62850J80582J98587K16988K34282K49449
59217A0027846K63009K74795K82540K84351K80657K72006K56731K33043K01736
59208A2376714J64431J20889P0954J7772l4131q3179j29941j72761k07822k33696
59198A1889230k52373k65472k72730k75146k76121k77686k77936k73872k64798
59189I453096k51488k34086k12860j89596j66307j43289j19767r5696p1680m7687
59179G920640k3049K612K9236N6717Q4867J13481J42988J74486K08648K44988
59169H955614K82611L21277L61390M03279M46485M89267N28621N61236N84502
59160A2934282N96335N94376N75906N38503M80608M02400L06872J99227Q4159
$$ y = [8316904, 8407222, 8514879, 8640627, 8785108, 8947958, 9128540, 9327127, 9544115, 9778397, 10027846, 10290855, 10565650, 10848190, 11132541, 11413198, 11685204, 11941935, 12174978, 12376714, 12541145, 12662034, 12732988, 12750760, 12716629, 12633450, 12503509, 12330748, 12122926, 11889230, 11636857, 11371385, 11098655, 10823509, 10547388, 10269702, 9991766, 9717894, 9453096, 9201608, 8967522, 8754662, 8565066, 8398759, 8255470, 8135703, 8040007, 7968327, 7920640, 7897591, 7900203, 7929439, 7986156, 8071023, 8184504, 8327492, 8501978, 8710626, 8955614, 9238225, 9559502, 9920892, 10324171, 10770656, 11259923, 11788544, 12349780, 12934282, 13530617, 14124993, 14700899, 15239402, 15720010, 16122410, 16429282, 16628509, 16712668]
59151A6712668l5492j56391k72368l76459m64657n35657n87746o18784o29630
59142A3035484o24836o08973n84047n51244n13106m72614m31718l91844l54574
59133H502528l20421k88107k56269k25273j96584j71130j48957j29628j12308
59124F653851r6241q1608o9081n8123m6968l4765k2578j1552j376Q628J8057K6143
59112F284387L3038L9323M5024M9844N3722N6371N7024N5325N1748M6540L9129
59101F811475K9434J8769Q472j705j2883k5270l7903m9569n9145o5695o9149p0546
59089F476285p0851o9903o7189o3005n8075n2453m5819l8506l1291k4278j6761
59078E938154q290P67R877J9046K8611L8538M8327N7711O7281P7859Q9233J00306
$$ y = [16712668, 16677176, 16520785, 16248417, 15871958, 15407301, 14871644, 14283898, 13665114, 13035484, 12410648, 11801675, 11217628, 10666384, 10153278, 9680664, 9248946, 8857102, 8502528, 8182107, 7894000, 7637731, 7412458, 7215874, 7044744, 6895787, 6766159, 6653851, 6557610, 6476002, 6406921, 6348798, 6301830, 6267065, 6244487, 6232935, 6231559, 6240187, 6258244, 6284387, 6317425, 6356748, 6401772, 6451616, 6505338, 6561709, 6618733, 6674058, 6725806, 6772346, 6811475, 6840909, 6859678, 6868150, 6866445, 6853562, 6828292, 6790389, 6740820, 6681675, 6615980, 6546831, 6476285, 6405434, 6335531, 6268342, 6205337, 6147262, 6094809, 6048990, 6010484, 5979193, 5954915, 5938154, 5929864, 5930631, 5940508, 5959554, 5988165, 6026703, 6075030, 6132741, 6200022, 6277881, 6367114, 6467420]
59066F467420J10982J22863J36959J51466J63481J72753J82110J93857K07232
59057G909123K19795K29887K37227K42350K46299K49849K52418K52559K49882
59048A0089389K45502K40307K33982K26024K16109K02904J84067J58463J26996
59039A1923743R0354M7520k289n7564j15702j74881k33068k86562l31740l67698
59029A0492113l95410m14883m25081m26380m20955m10528l95468l76453l55394
59020F871561l34043l12841k91797k71372k51933k33189k14876j97428j81427
59011D582655j66937j53758j42006j31890j23233j15481j08023j00450r2769q5474
59001C362634p8991p3061o7041o0930n5575n1620m8724m6138m3643m1320l8783
$$ y = [6467420, 6578402, 6701265, 6838224, 6989690, 7153171, 7325924, 7508034, 7701891, 7909123, 8128918, 8358805, 8596032, 8838382, 9084681, 9334530, 9586948, 9839507, 10089389, 10334891, 10575198, 10809180, 11035204, 11251313, 11454217, 11638284, 11796747, 11923743, 12014097, 12061617, 12059328, 12001764, 11886062, 11711181, 11478113, 11191551, 10859811, 10492113, 10096703, 9681820, 9256739, 8830359, 8409404, 7998876, 7603408, 7226955, 6871561, 6537518, 6224677, 5932880, 5661508, 5409575, 5176386, 4961510, 4764082, 4582655, 4415718, 4261960, 4119954, 3988064, 3864831, 3749350, 3641327, 3540877, 3448108, 3362634, 3283643, 3210582, 3143541, 3082611, 3027036, 2975416, 2926692, 2880554, 2836911, 2795591, 2756808]
58990B756808l5576l2439l1119l2189l3674l2990k9936k6559k4047k1340j7460
58979B439479j3576j1286j0024q063n540m374n118n766m334j019K951P120J1465
58966B391915J5286J7637J8318J7645J5857J3484J1562J0563R514P144L602L27
58954B532854j577k093j583j88J882M077N886P324Q735J0128J1080J1358J1371
58941B599254J1398J0614P887L698R2j912l637o360q829q851o516l912k025k8
58927B590873K425M382N547O998R191J1125J2412J4444J8242K2463K4993K5639
58915B748734K6101K7881L1123L4949L8272M0806M3548M7473N1724N4395N5378
58904C200384N6757N9749O2956O4755O5767O7497O9764P1237P1739P2577P4979
$$ y = [2756808, 2721232, 2688793, 2657674, 2625485, 2591811, 2558821, 2528885, 2502326, 2478279, 2456939, 2439479, 2425903, 2414617, 2404593, 2396530, 2390990, 2386616, 2381498, 2375732, 2371398, 2370379, 2373330, 2380450, 2391915, 2407201, 2424838, 2443156, 2460801, 2476658, 2490142, 2501704, 2512267, 2521781, 2528925, 2532527, 2532854, 2531277, 2529184, 2527601, 2527413, 2529295, 2533372, 2539258, 2546582, 2555317, 2565445, 2576525, 2587883, 2599254, 2610652, 2621266, 2629153, 2632851, 2632943, 2631031, 2627394, 2621034, 2612205, 2603354, 2596838, 2592926, 2590901, 2590873, 2593298, 2597680, 2603227, 2610225, 2619416, 2630541, 2642953, 2657397, 2675639, 2698102, 2723095, 2748734, 2774835, 2802716, 2833839, 2868788, 2907060, 2947866, 2991414, 3038887, 3090611, 3145006, 3200384, 3257141, 3316890, 3379846, 3444601, 3510368, 3577865, 3647629, 3718866, 3790605, 3863182, 3938161]
58893C938161P9327Q5284R1716R7104J01122J05293J11298J19204J27986J36890
58883D993385J45485J53484J61594J71504J83821J96854K08757K20106K33091
58874F668081K48748K66291K84639L03388L22686L43180L65683L90174M15830
58865I608700M42743M72659N06904N44639N84319O25806O69679P15534P62711
58856A4933694Q11657Q62783R14560R64449J010922J052553J085678J105241J107703
58847B3849240J091113J052601R88313Q96259P77177O32468M63761K75652P6828
58838C0103412j22846l15133m92925o49378p79719q83119r61234j015435j046585
58829B3837038j056649j048866j026498r92505r50310r03446q54220q03538p52320
$$ y = [3938161, 4017488, 4102772, 4194488, 4291592, 4392714, 4498007, 4609305, 4728509, 4856495, 4993385, 5138870, 5292354, 5453948, 5625452, 5809273, 6006127, 6214884, 6434990, 6668081, 6916829, 7183120, 7467759, 7771147, 8093833, 8437013, 8802696, 9192870, 9608700, 10051443, 10524102, 11031006, 11575645, 12159964, 12785770, 13455449, 14170983, 14933694, 15745351, 16608134, 17522694, 18487143, 19498065, 20550618, 21636296, 22741537, 23849240, 24940353, 25992954, 26981267, 27877526, 28654703, 29287171, 29750932, 30026584, 30103412, 29980566, 29665433, 29172508, 28523130, 27743411, 26860292, 25899058, 24883623, 23837038, 22780389, 21731523, 20705025, 19712520, 18762210, 17858764, 17004544, 16201006, 15448686]
58820A5448686p02322o55233o11670n71415n34173m99621m67226m36715m08502
58811A0561809l83081l59910l37539l14988k92525k71046k51261k33577k17950
58802G899932k03497j89039j74472j60731j47865j34338j19295j04287r1184p9382
58792F495842o6876n3429m0487k8405j6149l835P134J7054K8527M2886N8219P2175
58780F512656Q4917R7761J10721J23204J35792J49503J64185J79151J94554K10840
58770G963284K27686K44840K63203K83862L06605L30494L55169L80758M07417
58761A0763318M35896M67521N02765N40864N81533O25618O73124P22249P71620
58752A6084508Q21755Q72782R22435R67921J007853J040112J059441J059918J038783
$$ y = [15448686, 14746364, 14091131, 13479461, 12908046, 12373873, 11874252, 11407026, 10970311, 10561809, 10178728, 9818818, 9481279, 9166291, 8873766, 8602720, 8351459, 8117882, 7899932, 7696435, 7507396, 7332924, 7172193, 7024328, 6889990, 6770695, 6666408, 6575224, 6495842, 6428966, 6375537, 6335050, 6306645, 6290496, 6286661, 6293795, 6310849, 6339376, 6382262, 6440481, 6512656, 6597573, 6695334, 6806055, 6929259, 7065051, 7214554, 7378739, 7557890, 7752444, 7963284, 8190970, 8435810, 8699013, 8982875, 9289480, 9619974, 9975143, 10355901, 10763318, 11199214, 11666735, 12169500, 12710364, 13291897, 13917515, 14590639, 15312888, 16084508, 16906263, 17779045, 18701480, 19669401, 20677254, 21717366, 22776807, 23836725, 24875508]
58743B4875508R95342R27042Q29742P01990N46929L70357J79109j8810k14938
58734B9192271m01904n73367p23182q46509r41620j009337j051407j070929j072921
58725B1501095j061805j038815j004254r61544r16069q70199q22535p72475p22549
58716A3330850o75334o30749n87860n47385n10947m79128m51288m26227m02292
58707H619640l78079l53746l30759l09974k90954k73210k56756k41163k25448
58698E959551k09440j94130j80253j67476j55253j43531j32364j21718j11672
58689D543714j02255r3231q4698p7229p0613o3469n5408m8417m4444m2738m1630
58678C819582m1642m4141m7752m9572m9756n1452n5640n9471o0789o1044o2072
$$ y = [24875508, 25870850, 26797892, 27627634, 28329624, 28876553, 29246910, 29426019, 29407209, 29192271, 28790367, 28217000, 27493818, 26647309, 25705689, 24696352, 23644945, 22574016, 21501095, 20439290, 19400475, 18396221, 17434677, 16518608, 15648409, 14825874, 14053399, 13330850, 12655516, 12024767, 11436907, 10889522, 10378575, 9899447, 9448159, 9021932, 8619640, 8241561, 7887815, 7557056, 7247082, 6956128, 6682918, 6426162, 6184999, 5959551, 5750111, 5555981, 5375728, 5208252, 5052999, 4909468, 4777104, 4655386, 4543714, 4441459, 4348228, 4263530, 4186301, 4115688, 4052219, 3996811, 3948394, 3903950, 3861212, 3819582, 3777940, 3733799, 3686047, 3636475, 3586719, 3535267, 3479627, 3420156, 3359367, 3298323, 3236251]
58667C236251o2823o1617n9617n9448o1551o3992o5247o5512o5637o5960o6109
58656B538738o5250o2911n9789n7077n4881n2321m9274m6740m5056m3166m0261
58645A962012l6925l4026l1552k9153k6914k5052k3614k2705k2154k0961j8320
58634A670636j5159j3365j3267j3347j2515j1094r446p525o207p063r930j2373
58622A539345j2591j1413j0474r963r260q401p569o063l133O74L827N205M783
58609A474967L590L142M180N794O614O708P257Q514R527R871J0001R638P650L999
58595A571452K91k198l539l752k117J332N152Q214J0840J3652J6531J9415K2709
58582A657982K6266K9235L1532L4151L7586M1251M4999M9546N4854N9753O3868
$$ y = [3236251, 3173428, 3111811, 3052194, 2992746, 2931195, 2867203, 2801956, 2736444, 2670807, 2604847, 2538738, 2473488, 2410577, 2350788, 2293711, 2238830, 2186509, 2137235, 2090495, 2045439, 2002273, 1962012, 1925087, 1891061, 1859509, 1830356, 1803442, 1778390, 1754776, 1732071, 1709917, 1688956, 1670636, 1655477, 1642112, 1628845, 1615498, 1602983, 1591889, 1582443, 1574918, 1568711, 1561648, 1551718, 1539345, 1526754, 1515341, 1504867, 1494904, 1485644, 1477243, 1469674, 1463611, 1460478, 1461152, 1464979, 1470184, 1474967, 1478557, 1481699, 1485879, 1491673, 1498287, 1504995, 1512252, 1520766, 1530293, 1540164, 1550165, 1559803, 1567453, 1571452, 1571743, 1569545, 1566006, 1562254, 1560137, 1561469, 1566621, 1574835, 1585675, 1599327, 1615858, 1635273, 1657982, 1684248, 1713483, 1745015, 1779166, 1816752, 1858003, 1903002, 1952548, 2007402, 2067155, 2131023]
58571B131023O8291P3526P8512Q2767Q7802R5144J04307J13977J24069J35340
58561C094758J48030J62053J77634J94744K12503K29881K46429K61975K76502
58552E004509K90407L03636L14341L19680L18014L08720K89989K59225K16262
58543G624783J63991J05096M0729k6382r0275j45476j90725k27287k55373k74328
58533F724753k84805k88323k85472k76670k63930k49762k34706k17791j99218
58524D424076j80832j63889j47936j32249j17256j03980r2782q3053p4157o6410
58514C261532o0769n7178n3795m8879m3026l8384l5758l3921l1767k9455k7192
58503B801408k4669k2287k1463k3037k6665l2197m0021m9391n8001o3984o7212
$$ y = [2131023, 2199314, 2272840, 2351352, 2434119, 2521921, 2617065, 2721372, 2835349, 2959418, 3094758, 3242788, 3404841, 3582475, 3777219, 3989722, 4219603, 4466032, 4728007, 5004509, 5294916, 5598552, 5912893, 6232573, 6550587, 6859307, 7149296, 7408521, 7624783, 7788774, 7893870, 7934599, 7908217, 7817942, 7672466, 7481741, 7254454, 6999081, 6724753, 6439948, 6151625, 5866153, 5589483, 5325553, 5075791, 4841085, 4623294, 4424076, 4243244, 4079355, 3931419, 3799170, 3681914, 3577934, 3485152, 3402099, 3327942, 3261532, 3200763, 3143585, 3089790, 3040911, 2997885, 2959501, 2923743, 2889822, 2858055, 2828600, 2801408, 2776739, 2754452, 2732989, 2709952, 2683287, 2651090, 2611069, 2561678, 2503677, 2439693, 2372481]
58492B372481o8184o7186o4954o2549n9913n6073n1242m7006m3928m0960l7815
58481A772671l5765l5160l4321l2102k9588k7959k6516k4268k1809k0118j8953
58470A466112j7772j6936j6789j6737j6266j5623j4859j3677j2784j3469j5174
58459A296026j5572j3961j2271j1780j1228r543p906p448p116n667l659j746Q37
58446A188966M181O382O426O292P947J0320J1599J2463J4341J6234J6273J5080
58434A316504J4679J5118J4938J4208J4236J4762J4035J1488Q203M889J367k181
58422A442246n292q379j2177j6199j9192k0770k1435k1471k0963k0383k0037j9496
58410A236452j8424j7183j5907j4114j2074j1128j1575j1681j0100p904o736o357
$$ y = [2372481, 2304297, 2237111, 2172157, 2109608, 2049695, 1993622, 1942380, 1895374, 1851446, 1810486, 1772671, 1736906, 1701746, 1667425, 1635323, 1605735, 1577776, 1551260, 1526992, 1505183, 1485065, 1466112, 1448340, 1431404, 1414615, 1397878, 1381612, 1365989, 1351130, 1337453, 1324669, 1311200, 1296026, 1280454, 1266493, 1254222, 1242442, 1231214, 1221671, 1213765, 1206317, 1199201, 1193534, 1189875, 1188129, 1188966, 1193147, 1199529, 1205955, 1212247, 1220194, 1230514, 1242113, 1254576, 1268917, 1285151, 1301424, 1316504, 1331183, 1346301, 1361239, 1375447, 1389683, 1404445, 1418480, 1429968, 1438171, 1443060, 1444427, 1442246, 1436954, 1428575, 1416398, 1400199, 1381007, 1360237, 1338802, 1317331, 1296368, 1275985, 1255948, 1236452, 1218028, 1200845, 1184938, 1170824, 1158750, 1147622, 1136047, 1124366, 1114266, 1106362, 1099626, 1093269]
58398A093269n515m126l059k700k934l551l689k179N31K286K057J402K056L761
58384A077609N572P515R654J1312J2514J4466J7308J9213J9049J7986J7231J6092
58372A245521J3607J0066N820P69l935o330p057r265j3614j6579j5644j2908j1147
58359A179304r768p532n919o331o753m852j931j98J550N548J0354J2602J2216
58346A178290J2074J3354J4533J4314J2684R853O655M747M179K355k180o836q563
58333A255459q265q637r618r313p724o071m026q84J900K720L061N513R722J3276
58319A237113J5311J6328J5999J4222J2890J3441J4110J2625J0017Q770Q848Q739
58307A388413Q799J0167J1837J2105J1572J1829J2627J3102J3933J5426J5660
$$ y = [1093269, 1087754, 1083628, 1080569, 1077869, 1074935, 1071384, 1067695, 1065516, 1066047, 1068333, 1070390, 1071792, 1073848, 1077609, 1083181, 1090696, 1100350, 1111662, 1124176, 1138642, 1155950, 1175163, 1194212, 1212198, 1229429, 1245521, 1259128, 1269194, 1275014, 1275783, 1271848, 1265518, 1258461, 1249196, 1235582, 1219003, 1203359, 1190451, 1179304, 1169536, 1162004, 1156085, 1149754, 1143001, 1138149, 1136218, 1136020, 1137570, 1143118, 1153472, 1166074, 1178290, 1190364, 1203718, 1218251, 1232565, 1245249, 1255102, 1261757, 1266504, 1270683, 1273038, 1270858, 1264022, 1255459, 1247194, 1238557, 1228939, 1219626, 1211902, 1205831, 1201805, 1200921, 1202821, 1205541, 1208602, 1214115, 1223837, 1237113, 1252424, 1268752, 1284751, 1298973, 1311863, 1325304, 1339414, 1352039, 1362056, 1370826, 1379674, 1388413, 1397212, 1407379, 1419216, 1431321, 1442893, 1454722, 1467349, 1480451, 1494384, 1509810, 1525470]
58296A525470J3559J1527J1960J3591J4341J4943J6211J5906J2370Q317O636N385
58284A670216J675k427l057j092j77m67L36J737J845K129N214R437J1074J0508
58270A706951J0872J2100J1939J1449J3674J7769J9918J9506J9305K0388K1772
58259A885643K3892K7518L0539L0725L0117L1816L4218L3736L1085K9311K7771
58248B216371K4093J9991J8717J8712J6353J3319J4192J8329K1029K1673K3564
58237B426343K6816K8496K9114L1856L5961L7796L7863L9931M3866M6198M7108
58226B831348M9923N4298N6770N7353N9006O1534O2833O4659P0080P6714Q0000
58215C524518Q1437Q5792R1915R4707R4521R5926R8461R7658R4111R2539R2869
$$ y = [1525470, 1539029, 1550556, 1562516, 1576107, 1590448, 1605391, 1621602, 1637508, 1649878, 1658195, 1664831, 1670216, 1671891, 1669464, 1666407, 1665315, 1665138, 1664671, 1665007, 1666744, 1668589, 1670718, 1675932, 1685369, 1696443, 1706951, 1717823, 1729923, 1741862, 1753311, 1766985, 1784754, 1804672, 1824178, 1843483, 1863871, 1885643, 1909535, 1937053, 1967592, 1998317, 2028434, 2060250, 2094468, 2128204, 2159289, 2188600, 2216371, 2240464, 2260455, 2279172, 2297884, 2314237, 2327556, 2341748, 2360077, 2381106, 2402779, 2426343, 2453159, 2481655, 2510769, 2542625, 2578586, 2616382, 2654245, 2694176, 2738042, 2784240, 2831348, 2881271, 2935569, 2992339, 3049692, 3108698, 3170232, 3233065, 3297724, 3367804, 3444518, 3524518, 3605955, 3691747, 3783662, 3878369, 3972890, 4068816, 4167277, 4264935, 4359046, 4451585, 4544454]
58204D544454R1270Q8926R0563R5398R8911J02246J10134J20969J29017J35093
58194E606981J44676J56995J66867J75845J90093K08445K24219K37658K54441
58185G366220K73322K87939K99879L16811L38536L58370L77338M02962M34686
58176A0456063M64889M93895N29291N71101O12880O56659P10621P72511Q31832
58167A6099742Q88010R49356J015035J076271J134791J201152J275539J349749
58159B4989645J427033J518856J623133J727824J834843J956972K092960K231263
58151C9402529K376618K545450K736878K938145L156920L416096L719018M055369
58143F4347023M439219M903183N459229O109716O892993P866093R043109J0405730
$$ y = [4544454, 4635724, 4724650, 4815213, 4910611, 5009522, 5111768, 5221902, 5342871, 5471888, 5606981, 5751657, 5908652, 6075519, 6251364, 6441457, 6649902, 6874121, 7111779, 7366220, 7639542, 7927481, 8227360, 8544171, 8882707, 9241077, 9618415, 10021377, 10456063, 10920952, 11414847, 11944138, 12515239, 13128119, 13784778, 14495399, 15267910, 16099742, 16987752, 17937108, 18952143, 20028414, 21163205, 22364357, 23639896, 24989645, 26416678, 27935534, 29558667, 31286491, 33121334, 35078306, 37171266, 39402529, 41779147, 44324597, 47061475, 49999620, 53156540, 56572636, 60291654, 64347023, 68786242, 73689425, 79148654, 85258370, 92151363, 100017456, 109060565, 119466295]
58135A19466295J1970910J3784043J5852256J8166266K0788655K3835598K7385399
58128B51249422L1490414L6121087M0665198M3299645M1329387L2903313J8761502
58121D95819968K184894j2937614k4124406l0853195l3853064l4255135l3143243
58114C28838205l1332394k9247784k7002056k4611189k2122619j9607551j7150566
58107A57764046j4863522j2843439j1108677r619828q350648p292085o407824
58100H7278023n644778m980405m412910l916630l453006l013001k604704k213169
58092E7039420j814967j414709j023087o17304j65813L31048Q64544J440745K029183
58083E6669060K551944L015645L583425M337373M944477M741222L298152Q69057
$$ y = [119466295, 131437205, 145221248, 161073504, 179239770, 200028425, 223864023, 251249422, 282739836, 318860923, 359526121, 402825766, 444155153, 477058466, 495819968, 498004862, 485067248, 460942842, 430089647, 396236583, 361981448, 328838205, 297505811, 268258027, 241255971, 216644782, 194522163, 174914612, 157764046, 142900524, 130057085, 118948408, 109328580, 100977932, 93685847, 87278023, 81633245, 76652840, 72239930, 68323300, 64870294, 61857293, 59252589, 57039420, 55224453, 53809744, 52786657, 52169353, 52003540, 52334588, 53199132, 54639877, 56669060, 59221004, 62236649, 65820074, 70157447, 75101924, 79843146, 83141298, 84010355]
58075H4010355j778877l928912n277719n880022n932392n646880n207702m736051
58067D5621800m278905l842487l427221l033690k662879k323735k028556j777744
58059B2246583j561125j373996j219285j095141r93357r09438q42864p88632p39151
58050A2723594o93065o52993o16668n79109n40946n06051m73720m40838m08631
58041G811573l79856l52867l25417l00628k82343k68553k55814k45495k39075
58032E161525k32136k20391k07267j98286j91934j83192j72209j62405j53425
58023C440280j43020j32841j25835j20453j13371j05392r9279r4505q9200q4266
58013B332118q0730p6209o8945o2052n8853n7220n3382m8120m4406m2074l9624
$$ y = [84010355, 82231478, 78302566, 73024847, 67144825, 61212433, 55565553, 50357851, 45621800, 41342895, 37500408, 34073187, 31039497, 28376618, 26052883, 24024327, 22246583, 20685458, 19311462, 18092177, 16997036, 16003679, 15094241, 14251377, 13462745, 12723594, 12030529, 11377536, 10760868, 10181759, 9640813, 9134762, 8661042, 8220204, 7811573, 7431717, 7078850, 6753433, 6452805, 6170462, 5901909, 5646095, 5400600, 5161525, 4929389, 4708998, 4501731, 4303445, 4111511, 3928319, 3756110, 3593705, 3440280, 3297260, 3164419, 3038584, 2918131, 2804760, 2699368, 2600089, 2505584, 2416384, 2332118, 2251388, 2175179, 2106234, 2044182, 1985329, 1928109, 1874727, 1826607, 1782201, 1740127, 1700503]
58002A700503l8160l8802l9147l6924l4335l4306l5414l4841l3263l2456l1138
57991A311717k7768k4527k3925k4127k2168j9174j7899j7643j6190j4466j4665
57980A089165j5631j4580j1925j0357j0472j0830j0981j1186j0532q304n849m654
57968I63864m264m070m776o068n633k993j304k655m653m486l216k980l060k081
57954I11625j147j342r97J126K725J639j42J29J398J373R70K004K888J131j805
57939I21575k623j684k076m233n715n669n791p115q906j0341j0585q107k693K618
57925H48655M368K850J129P44P33J39r37k263l500l869l209k444j918o12J683
57910H41549L239K830J491M55n30j491j286j05k91k592m298l377j809k178l609
$$ y = [1700503, 1662343, 1623541, 1584394, 1547470, 1513135, 1478829, 1443415, 1408574, 1375311, 1342855, 1311717, 1283949, 1259422, 1235497, 1211370, 1189202, 1170028, 1152129, 1134486, 1118296, 1103830, 1089165, 1073534, 1058954, 1047029, 1036672, 1026200, 1015370, 1004389, 993203, 982671, 974367, 968518, 963864, 959600, 955530, 950754, 944686, 939053, 936060, 934756, 932101, 927448, 922962, 919746, 916766, 913706, 911625, 910478, 909136, 908139, 909265, 911990, 913629, 913487, 913616, 915014, 916387, 917357, 919361, 922249, 923380, 921575, 918952, 917268, 915192, 910959, 905244, 899575, 893784, 886669, 877763, 867422, 856837, 848730, 846037, 848655, 853023, 855873, 857002, 857746, 858479, 858618, 857681, 855418, 851918, 848049, 844840, 842396, 840478, 839866, 841549, 844788, 847618, 849109, 849564, 849034, 847543, 846257, 846152, 845861, 843269, 838971, 835594, 833785, 831607, 827998]
57895H27998m055m304o357r627j1911j2630j2345j0708p725n453n427n836m099
57882G27521q28J645L222N500Q301R791R376P946O018L787K187J708J049j176
57868G86047m523q161j2450j7134j9918j9372j7570j7141j7393j6074j3440j1558
57856F11313j0659r308p295n673m494l033j554o44L77K237L923M230L920M205
57842E87545M403L516K711L632N401O002N641N961O895P128O954P801R305R378
57828F72273P109L506j40k868l792l235l082m264n107m184l111l963n666n966
57814F37510n405n905o623n224k608k129m076m829k450O61J977K522M446P342
57800F15209R087R016Q328Q014P733O734N252M521N128N601L854K35k383k397
$$ y = [827998, 823943, 819639, 813282, 803655, 791744, 779114, 766769, 756061, 748336, 742883, 737456, 731620, 727521, 726693, 728338, 731560, 737060, 745361, 755152, 764528, 772474, 778492, 782279, 784466, 786174, 787223, 786047, 781524, 773363, 760913, 743779, 723861, 704489, 686919, 669778, 652385, 636311, 622871, 611313, 600654, 591346, 584051, 578378, 573884, 570851, 569297, 568653, 569030, 571267, 575190, 579420, 583340, 587545, 591948, 595464, 598175, 601807, 607208, 613210, 618851, 624812, 631707, 638835, 645789, 653590, 662895, 672273, 679382, 682888, 682748, 679880, 676088, 672853, 669771, 665507, 660400, 656216, 653105, 649142, 643476, 637510, 632105, 626200, 619577, 614353, 611745, 609616, 605540, 600711, 598261, 598922, 600899, 603421, 607867, 615209, 624296, 633312, 641640, 649654, 657387, 664121, 669373, 673894, 679022, 684623, 688477, 688712, 686329, 683932]
57786F83932j663k638n041o995p959q488q447p596o876p063p155o058m684m362
57772E98907m443l753l089l741m766m532l939n116p650r197r355r779j0763j0858
57758E07926r981r825j0845j1577j1479j1698j2566j2704j1351r397p543n578
57746C83382l858l322l562l042j728j331k320k878j650M97K291L763N202O107
57732C77551O292O540P229P652P429P458Q601J0522J2458J4096J5152J5024J3512
57719E09516J1128Q435N737L413J580m13l099n681p007p472q467r984j0519r500
57705D77667q059p010n864m451l808m315m524l020n93Q40Q45Q40K145M602P142
57690D52437Q998J0080J0602J0653J0212R304P945O164M356L418L843M822N116
$$ y = [683932, 682269, 679631, 674590, 667595, 659636, 651148, 642701, 635105, 628229, 621166, 614011, 607953, 603269, 598907, 594464, 590711, 587622, 583881, 579115, 574583, 570644, 565528, 557878, 548681, 539326, 529547, 518784, 507926, 497945, 488120, 477275, 465698, 454219, 442521, 429955, 417251, 405900, 396503, 388960, 383382, 379524, 376202, 372640, 369598, 367870, 366539, 364219, 361341, 359691, 360188, 362479, 366242, 371444, 377551, 383843, 390383, 397612, 405264, 412693, 420151, 428752, 439274, 451732, 465828, 480980, 496004, 509516, 520644, 529079, 534816, 538229, 539809, 539396, 536297, 530616, 523609, 516137, 507670, 497686, 487167, 477667, 469608, 462598, 456734, 452283, 448475, 444160, 439636, 436616, 436023, 436863, 437708, 438548, 440693, 445295, 452437, 461435, 471515, 482117, 492770, 502982, 512286, 520231, 526395, 530751, 534169, 538012, 542834, 547950]
57677E47950M730M725N346N674N406N412N999O239N935O595R201J2428J4518J5686
57663F55844J7209J9295K1361K3253K4731K4907K3856K3605K5785K9356L2371
57652I21573L4721L7142L8917L9080L8995M0960M4727M8022N0222N2887N6776
57641A404022O1044O5535P1204P7764Q3489Q8175R3968J02149J11230J19419J27394
57630B405393J37127J49329J63279J78273J94027K10224K26632K43289K59884
57621D167457K75332K88229K97216L00577K95954K81106K54927K17987J72535
57612F551320J22185P1250K3805j7262n0879p7212r6133j07096j12188j18638
57602F189152j35449j65704k03269k37736k61314k70948k67146k53451k35285
$$ y = [547950, 552680, 557405, 562751, 568425, 573831, 579243, 585242, 591481, 597416, 604011, 613212, 625640, 640158, 655844, 673053, 692348, 713709, 736962, 761693, 786600, 810456, 834061, 859846, 889202, 921573, 956294, 993436, 1032353, 1071433, 1110428, 1151388, 1196115, 1244137, 1294359, 1347246, 1404022, 1465066, 1530601, 1601805, 1679569, 1763058, 1851233, 1945201, 2047350, 2158580, 2277999, 2405393, 2542520, 2691849, 2855128, 3033401, 3227428, 3437652, 3664284, 3907573, 4167457, 4442789, 4731018, 5028234, 5328811, 5624765, 5905871, 6160798, 6378785, 6551320, 6673505, 6744755, 6768560, 6751298, 6700419, 6623207, 6527074, 6419978, 6307790, 6189152, 6053703, 5887999, 5684730, 5446994, 5185680, 4914732, 4647586, 4394135, 4158850]
57593D158850k16385j96743j75419j53897j34596j17592j01410q6032p2463o0104
57583B844209m7475l5187k5294j7607r360J042J2286K2626L1998M1143N0511O0646
57571B929538P2037Q4118R5862J07675J21169J36751J52883J68083J82295J95875
57561D246286K08429K19005K26334K28687K24271K11979J91180J61298J22491
57552F039960P6326K5072k8892q2101j29862j68877j99308k22825k39541k48576
57542D821376k50485k47069k39458k28451k16033k04289j93158j81242j68369
57533B892822j55551j43188j31383j21201j13217j05693r6763q7665q0888p5852
57523A781421o9680o2105n6022n2796n0333m6709m2650l9381l6663l4129l2188
$$ y = [4158850, 3942465, 3745722, 3570303, 3416406, 3281810, 3164218, 3062808, 2976776, 2904313, 2844209, 2796734, 2761547, 2736253, 2718646, 2709286, 2710328, 2722614, 2745240, 2777238, 2818381, 2868892, 2929538, 3001575, 3085693, 3181555, 3289230, 3410399, 3547150, 3700033, 3868116, 4050411, 4246286, 4454715, 4673720, 4900054, 5128741, 5353012, 5564991, 5756171, 5917469, 6039960, 6116286, 6141358, 6112466, 6030365, 5900503, 5731626, 5532318, 5309493, 5069952, 4821376, 4570891, 4323822, 4084364, 3855913, 3639880, 3435591, 3242433, 3061191, 2892822, 2737271, 2594083, 2462700, 2341499, 2228282, 2122589, 2025826, 1938161, 1857273, 1781421, 1711741, 1649636, 1593614, 1540818, 1490485, 1443776, 1401126, 1361745, 1325082, 1290953, 1258765]
57512A258765l0603k8181k4797k1672j9092j5986j2321r534p901n888k999p03
57500A079088M30K017M983P894R612J1380J4524J8047K0332K1628K3109K4920
57488A237964K6841K9571L3646L8061M1573M4641M8690N3963N9315O3837O7929
57477A746031P2896P9788Q8222R6545J03924J11811J22077J34097J45423J55014
57467B855828J63683J71317J76211J77589J76246J71553J60336J40343J13058
57458D306164Q1469M6737Q889l0485o8169j01454j29017j50270j64987j73373
57448C625504j75868j73334j67546j60440j52467j42685j31010j19138j08592
57439B294424r9027q9224p8878o8587n8998n0533m3318l6887l0668k4904k0214
$$ y = [1258765, 1228162, 1199981, 1175184, 1153512, 1134420, 1118434, 1106113, 1096579, 1088678, 1082790, 1079791, 1079088, 1079518, 1081535, 1086518, 1094412, 1104024, 1115404, 1129928, 1147975, 1168307, 1189935, 1213044, 1237964, 1264805, 1294376, 1328022, 1366083, 1407656, 1452297, 1500987, 1554950, 1614265, 1678102, 1746031, 1818927, 1898715, 1986937, 2083482, 2187406, 2299217, 2421294, 2555391, 2700814, 2855828, 3019511, 3190828, 3367039, 3544628, 3720874, 3892427, 4052763, 4193106, 4306164, 4387633, 4434370, 4443259, 4412774, 4344605, 4243151, 4114134, 3963864, 3798877, 3625504, 3449636, 3276302, 3108756, 2948316, 2795849, 2653164, 2522154, 2403016, 2294424, 2195397, 2106173, 2027295, 1958708, 1899710, 1849177, 1805859, 1768972, 1738304, 1713400, 1693186]
57428A693186j6084j1043m641J823O984J0850J4363J8513K4098L1279L9038M6071
57416A854437N2376N9137O7092P6007Q5447R4914J03567J11248J19384J29274
57406B752883J39694J48017J53235J55854J54942J47943J33798J13884Q9083N8210
57396D047543K0616k1335o3346j01480j32901j56194j72037j82335j88038j88892
57386B861601j85431j79439j71946j62562j51500j40523j31001j22452j13831
57377A502916j04938r6004q7275p9645p4236p0663o6902o1624n5596n0384m6677
57366G08972m4169m2019l9345l6170l3765l2827l1951k9439k6110k4275k4264
57355C44638k4156k2724k0486j8002j5454j3901j4319j5331j4475j1973j0597
$$ y = [1693186, 1677102, 1666059, 1661418, 1663241, 1670225, 1681075, 1695438, 1713951, 1738049, 1769328, 1808366, 1854437, 1906813, 1965950, 2033042, 2109049, 2194496, 2289410, 2392977, 2504225, 2623609, 2752883, 2892577, 3040594, 3193829, 3349683, 3504625, 3652568, 3786366, 3900250, 3989333, 4047543, 4068159, 4046824, 3983478, 3881998, 3749097, 3592903, 3420866, 3238531, 3050493, 2861601, 2676170, 2496731, 2324785, 2162223, 2010723, 1870200, 1739199, 1616747, 1502916, 1397978, 1301974, 1214699, 1135054, 1060818, 990155, 923253, 861629, 806033, 755649, 708972, 664803, 622784, 583439, 547269, 513504, 480677, 448726, 419287, 393177, 368902, 344638, 320482, 297758, 277272, 259270, 243816, 229915, 215596, 200265, 185790, 173817, 163220]
57344A63220j1411j2369j1664r881q147o678n749n714n577m020k160k413m427
57331G3010n317m457m339n793o249m400k847l920o099p006p031p456D94f027n389
57316a1416n696o877p763q545r344q915o934n407n637n929m546k868k970m033
57302i6880m065l621m680o893p853o662m651k903j330o3K22m94j426j980k006
57287a45285j455o62l33n71o60l67l80q05n63P99K099K280J933K017K274J938
57271a37741J092K93j71j1J037K355K601J365k52r13l1K256M868N910M719L299
57255a09324L747N071M991M166N351Q589J0867J0974J1032J2397J3515e487F829
57241A8751J1146R992J0153J2086J4050J5271J7017J9379K0356J9662K0053K3079
$$ y = [163220, 151809, 139440, 127776, 117895, 109748, 103070, 97321, 91607, 86030, 82010, 79850, 77437, 73010, 67693, 63236, 58897, 53104, 46855, 42455, 39608, 35688, 29589, 22583, 15552, 8096, 494, -6027, -11416, -17112, -23989, -31752, -40297, -49641, -58556, -65490, -70897, -76534, -82463, -87009, -89877, -92847, -96880, -100945, -104566, -109246, -116139, -123992, -130654, -135305, -138208, -139538, -139601, -139379, -139873, -141299, -143279, -145285, -146740, -147402, -147735, -148306, -148966, -149333, -149713, -150518, -151081, -150282, -148183, -145903, -143970, -141953, -139679, -137741, -136649, -136356, -136527, -136538, -135501, -133146, -130545, -129180, -129432, -130345, -130376, -128120, -123252, -117342, -112623, -109324, -105577, -100506, -95515, -91349, -85998, -77409, -66542, -55568, -44536, -32139, -18624, -5487, 6829, 18751, 29897, 39889, 50042, 62128, 76178, 91449, 108466, 127845, 148201, 167863, 187916, 210995]
57229B10995K6715K9072L1305L4766L8450M1368M4428M7857M9656M8954M8069
57218F51635M8936N0119M9501M7271M4090L9005L1428K2835J4346N016n703j6213
57206I82266k5019l2048l6561l7098l5056l4617l7015l8531l6472l3259l1804
57195F04786l0564k6607k0636j5628j2732j1256j0570r728p525m829m232n913
57183D44566o976o227n709o053m809j628j78k049l547j901R5n37j571J65L191
57168D06832M548M909O107O948N941N202P366J1370J4954J8274K1538K2661K1077
57155E57727K0313K2761K5530K5449K4347K5052K6232K5909K6156K9223L2604
57144H41303L3181L2980L5504L9519M1807M3192M6422N0649N3228N4743N7304
$$ y = [210995, 237710, 266782, 298087, 332853, 371303, 412671, 457099, 504956, 554612, 603566, 651635, 700571, 750690, 800191, 847462, 891552, 930557, 961985, 984820, 999166, 1004182, 998479, 982266, 957247, 925199, 888638, 851540, 816484, 781867, 744852, 706321, 669849, 636590, 604786, 574222, 547615, 526979, 511351, 498619, 487363, 476793, 467065, 459540, 454711, 450479, 444566, 437590, 431363, 425654, 419601, 414792, 413164, 412986, 410937, 407390, 405489, 405584, 405047, 403476, 403641, 406832, 411380, 416289, 422396, 429344, 435285, 440487, 447853, 459223, 474177, 492451, 513989, 536650, 557727, 578040, 600801, 626331, 651780, 676127, 701179, 727411, 753320, 779476, 808699, 841303, 874484, 907464, 942968, 982487, 1024294, 1067486, 1113908, 1164557, 1217785, 1272528, 1329832]
57133A329832O0051O0866O0418O0456O0621O0670O2712O7400P1430P2697P4116
57122B041269P8164Q2017Q2689Q2529Q4600Q6990Q7000Q6602Q8275Q9777Q8713
57111B978625Q7900R0351R3262R2976R1668R3019R5418R5496R4246R3767R2410
57100C999138Q9035Q7197Q8923Q9414Q4307P7017P2207O7727O0107N2411M8866
57089D816349M7056M3124L9364L9124L9756L8191L7465L9873M0067L3130K2893
57078E236392J3837K137j6223l6170n2128o8095q9057j10328j26196j40920j59852
57067D453397j78141j90230k01900k20574k42592k63017k88588l27196l74128
57058B167031m22953m79812n52148G7853f42093q17583r35943j067723j205145
$$ y = [1329832, 1389883, 1450749, 1511167, 1571623, 1632244, 1692914, 1755626, 1823026, 1894456, 1967153, 2041269, 2119433, 2201450, 2284139, 2366668, 2451268, 2538258, 2625258, 2711860, 2800135, 2889912, 2978625, 3066525, 3156876, 3250138, 3343114, 3434782, 3527801, 3623219, 3718715, 3812961, 3906728, 3999138, 4088173, 4175370, 4264293, 4353707, 4438014, 4515031, 4587238, 4654965, 4715072, 4767483, 4816349, 4863405, 4906529, 4945893, 4985017, 5024773, 5062964, 5100429, 5140302, 5180369, 5213499, 5236392, 5250229, 5252366, 5236143, 5199973, 5147845, 5079750, 4990693, 4880365, 4754169, 4613249, 4453397, 4275256, 4085026, 3883126, 3662552, 3419960, 3156943, 2868355, 2541159, 2167031, 1744078, 1264266, 712118, 77853, -642093, -1459676, -2395619, -3463342, -4668487]
57049d668487j358110j537022j732251j932158k146035k385933k642801k906607
57041b1309404l192192l516657l869801m237275m631530n066219n524682n991798
57033e7339558o487510p023499p559662q055428q523717q974494r364284r677905
57025a23006057r944389r980791r209985p100953l974083j128395J38266l65244
57017a64571631j708908k801416l145238k748706j693196m942K208547M713171
57009a69752319P230884R482017J1200534J2224219J2580877J2434119J1951003
57002i2648666J1248588J0420969R544295Q656241P774213O930664O160568N467061
56994b6446067M832539M253988L739437L282106K868176K501154K191473h47240
$$ y = [-4668487, -6026597, -7563619, -9295870, -11228028, -13374063, -15759996, -18402797, -21309404, -24501596, -28018253, -31888054, -36125329, -40756859, -45823078, -51347760, -57339558, -63827068, -70850567, -78410229, -86465657, -94989374, -103963868, -113328152, -123006057, -132950446, -142931237, -152141222, -159242175, -163216258, -164344653, -164206387, -164571631, -166280539, -169081955, -172227193, -174975899, -176669095, -176674037, -174465490, -169752319, -162521435, -153039418, -141838884, -129614665, -117033788, -104599669, -92648666, -81400078, -70979109, -61434814, -52778573, -45004360, -38073696, -31913128, -26446067, -21613528, -17359540, -13620103, -10337997, -7469821, -4968667, -2777194, -847240]
56985H48995J485790J305574J151125J010627Q84896P81907O97365O20048N50273
56976I336600M94669M49083M04632L64334L36012L14732K89598K62221K41537
56967A2493418K25666K05724J82946J65537J52412J35724J16092J00427Q7740
56958A3865686P1307N2067L6398K3477P637r822k3669l6305n4036p4968r2615
56947A3765157j08169j27369j48560j66105j82489k04801k31696k55920k77376
56938A2062672l01882l28910l52102l69964l84718l92215l84671l62517l32700
56929H852993k96200k47915j88500j26614p0765k9039j5108m1773j05655j86444
56919G544980k62438l20732l55241l65742l59964l47947l32634l11761k87140
$$ y = [848995, 2334785, 3640359, 4791484, 5802111, 6687007, 7468914, 8166279, 8786327, 9336600, 9831269, 10280352, 10684984, 11049318, 11385330, 11700062, 11989660, 12251881, 12493418, 12719084, 12924808, 13107754, 13273291, 13425703, 13561427, 13677519, 13777946, 13865686, 13936993, 13989060, 14025458, 14048935, 14056572, 14046750, 14023081, 13986776, 13932740, 13857772, 13765157, 13656988, 13529619, 13381059, 13214954, 13032465, 12827664, 12595968, 12340048, 12062672, 11760790, 11431880, 11079778, 10709814, 10325096, 9932881, 9548210, 9185693, 8852993, 8556793, 8308878, 8120378, 7993764, 7922999, 7893960, 7878852, 7837079, 7731424, 7544980, 7282542, 6961810, 6606569, 6240827, 5880863, 5532916, 5200282, 4888521, 4601381]
56910D601381k64004k42617k19205j94599j73600j56364j38711j20699j06682
56901B984900r7149q8353p9769p3887o9067o1049n1749m8269n2402n8740o3787
56890B240679o9217p5173p8028p6522p3641p0993o7114o2031n7630n3148m6176
56879A511006l8241l3305l0746k6126j9069j3843j1737r223m472K28L230M875
56867A332577L713k707j2602k0911k5964l0015l3378l3762l1550k9927k9370k7404
56855A058700k3957k1501j9920j6951j3579j3177j5170j5405j2907j0537q987
56844H86609o294l320l322n616n975l901l213m726m805k228o0O25K633O759R910
56829H63076J0853J2048J4238J4800J3146J2169J2567J1243P068K847k51m657
$$ y = [4601381, 4337377, 4094760, 3875555, 3680956, 3507356, 3350992, 3212281, 3091582, 2984900, 2887751, 2799398, 2719629, 2645742, 2576675, 2515626, 2463877, 2415608, 2363206, 2304466, 2240679, 2171462, 2096289, 2018261, 1941739, 1868098, 1797105, 1729991, 1667960, 1610330, 1557182, 1511006, 1472765, 1439460, 1408714, 1382588, 1363519, 1349676, 1337939, 1328716, 1324244, 1324472, 1327702, 1332577, 1336290, 1333583, 1320981, 1300070, 1274106, 1244091, 1210713, 1176951, 1145401, 1115474, 1086104, 1058700, 1034743, 1013242, 993322, 976371, 962792, 949615, 934445, 919040, 906133, 895596, 886609, 880315, 876995, 873673, 868057, 862082, 858181, 854968, 850242, 845437, 843209, 843149, 843774, 846407, 853166, 863076, 873929, 885977, 900215, 915015, 928161, 940330, 952897, 964140, 971208, 974055, 973804, 969147]
56817I69147j0774j4830j4753j3212j2489j1115p868m503k101R68N188Q291R634
56804I01583J2027J7053K2555K6724L0767L5511L9034L9471L6697K9950J7950
56793A209322K853r880j7299k1044k2758k1706j8249j5037j2905r677m605J31
56781A059146L819Q753J5754K2582K8454L5719M5245N4718O3266P2543Q0683Q0116
56769A570798O5227L8793Q368k0022m2385n5676o0158o0013n8530n5160m9120
56758A282122m2335l6372k9973k2309j5292r887l485O038J6590K5311L3050M2130
56746A245588N1521N7030N4831M3249K3383j21k1122l6721m8164n6368n9706n7596
56734A195804n2758m7719m2139l5584k9853k6076k2319j6633j0096m682l56L763
$$ y = [969147, 958373, 943543, 928790, 915578, 903089, 891974, 884106, 879603, 877502, 878470, 883658, 891949, 901583, 913610, 930663, 953218, 979942, 1010709, 1046220, 1085254, 1124725, 1161422, 1191372, 1209322, 1212175, 1202295, 1184996, 1163952, 1141194, 1119488, 1101239, 1086202, 1073297, 1063620, 1059015, 1059146, 1062965, 1071718, 1087472, 1110054, 1138508, 1174227, 1219472, 1274190, 1337456, 1409999, 1490682, 1570798, 1636025, 1674818, 1683186, 1663164, 1620779, 1565103, 1504945, 1444932, 1386402, 1331242, 1282122, 1239787, 1203415, 1173442, 1151133, 1135841, 1125954, 1122469, 1128507, 1145097, 1170408, 1203458, 1245588, 1297109, 1354139, 1408970, 1452219, 1475602, 1475481, 1454359, 1417638, 1369474, 1313106, 1253400, 1195804, 1143046, 1095327, 1053188, 1017604, 987751, 961675, 939356, 922723, 912627, 907945, 907589, 911352]
56722I11352P710J1830J7076K2308K3963K0128J2511L027q286k0240k9065l2636
56710I39678l3216l3476l2616k9057k4253k0824j9094j7938j7092j6250j4106
56699F81756j0621q203q405r424q977p485o395n483m135l217l516m074m022m140
56685E93659m953n317m647m230m703m520k841j518k231m006n346o450p342o571
56671E28984l934k076l003n190o269o241n958m968l239k538l598m115k237K26
56657D75844O48m12p82l85o92j928l212m170m439l170p78O02J28l09O58J553R75
56640D60131K26P19J179Q4j371j334l62K09R21K616M010L571K156J379J085O92
56624D75911J116K752L561J960j38pJ770K708K434K413K784K407J268L48k08p94
$$ y = [911352, 919062, 930892, 947968, 970276, 994239, 1014367, 1026878, 1029905, 1021619, 1001379, 972314, 939678, 906462, 872986, 840370, 811313, 787060, 766236, 747142, 729204, 712112, 695862, 681756, 671135, 662932, 654527, 645103, 636126, 628641, 622246, 616763, 612628, 609411, 605895, 601821, 597799, 593659, 588706, 583389, 578742, 574512, 569809, 565289, 562448, 560930, 558699, 554693, 549347, 542897, 535555, 528984, 525050, 522974, 519971, 514781, 508512, 502271, 496313, 491345, 488106, 485568, 481970, 477855, 475618, 475844, 476492, 476080, 475298, 474913, 474221, 472293, 469081, 464911, 460472, 457302, 456524, 457126, 457254, 456945, 457603, 459156, 460131, 460357, 461076, 462255, 462339, 460968, 459634, 459272, 459481, 460402, 463018, 467028, 470599, 472755, 474134, 475219, 475911, 477027, 479779, 483340, 485300, 485162, 485155, 486925, 489633, 492067, 494480, 497264, 499671, 500939, 501287, 501079, 500285]
56608E00285j076p91q12j656k280j811j105j002q11j23k12j753l061k560j197
56593D80035n83n50k68K09J127L475O599P871O507M962M755M119J988O21J386
56578E22253J595r46l705l826l515o268j0322j1087q346o009n646n260l936l226
56564D51756l788m391m456m505m327l483l025l919m764l842k282k081k400j205
56550D03288O80Q26n67j314j165j339j202O55K864K945J926L006N878O781M384
56535D27646J400j75j307k523k223K52L017M442M958N050M126K271R26Q02J021
56520D49683Q40M11k25j010q50J109L578M746N157O343P159M980N37j995n80K185
56504D82068L263L120L959O172Q109Q122N947K998J545K525M326M922M629N081
$$ y = [500285, 499209, 498418, 497606, 495950, 493670, 491859, 490754, 489752, 488941, 488818, 488606, 486853, 483792, 481232, 480035, 479452, 478902, 478634, 478843, 479970, 483445, 490044, 497915, 504422, 509384, 514139, 518258, 520246, 520867, 522253, 523848, 522902, 519197, 515371, 511856, 505588, 495266, 484179, 475833, 469824, 464178, 458918, 454982, 451756, 447968, 443577, 439121, 434616, 430289, 426806, 423781, 419862, 415098, 411256, 408974, 406893, 404493, 403288, 403968, 404794, 404227, 402913, 401748, 400409, 399207, 399862, 402726, 405671, 407597, 410603, 416481, 423262, 427646, 429046, 428871, 427564, 425041, 422818, 423070, 426087, 430529, 435487, 440537, 444663, 446934, 447860, 448662, 449683, 450523, 450934, 450709, 449699, 448849, 449958, 453536, 458282, 463439, 469782, 476941, 481921, 482458, 480463, 479883, 482068, 485331, 488451, 492410, 498582, 506691, 514813, 520760, 523758, 525303, 527828, 532154, 537076, 541705, 546786]
56490E46786O270O619N642M364L381K587K396L170L733K655O39m12m05r23k490
56475E84012m142n417o450o495m666k014o01p43j230j829l286n144o014n732n184
56460E25065m436l235k695l938n614n400l609k707l665n382p145q808q952o158
56446D53321k113l68j649l111k645j236o74j276k370l025k205o2J233l0k329k887
56430D28574j583m17N8P96J593J638K083M543P349P068L874J667K407L943M119
56415D67712L542L246K869K351K662L745M143L424K711K406J923J948L942O952
56401E13576P820N500K474J105J205J896L140M401M346K959J941K137K517K259
56387E57276J912K005K340K795L244K958J911J797L495M662K879k2l32J679K381
$$ y = [546786, 553056, 559675, 565317, 569681, 573062, 575649, 578045, 581215, 584948, 587603, 588242, 587830, 587425, 586502, 584012, 579870, 574453, 568003, 561508, 556842, 554828, 554227, 553484, 552254, 550425, 547139, 541995, 535981, 530249, 525065, 520629, 517394, 514699, 510761, 505147, 499747, 496138, 493431, 489766, 484384, 477239, 468431, 459479, 453321, 451208, 450840, 449191, 446080, 443435, 442199, 441525, 440249, 437879, 434854, 432649, 432587, 433820, 433790, 431461, 428574, 426991, 426574, 426632, 427428, 429021, 430659, 432742, 437285, 444634, 451702, 455576, 457243, 459650, 463593, 467712, 471254, 474500, 477369, 479720, 482382, 486127, 490270, 493694, 496405, 498811, 500734, 502682, 506624, 513576, 521396, 526896, 529370, 530475, 531680, 533576, 536716, 541117, 545463, 548422, 550363, 552500, 555017, 557276, 559188, 561193, 563533, 566328, 569572, 572530, 574441, 576238, 579733, 584395, 587274, 587252, 586920, 588599, 590980]
56372E90980Q63r6O16O28j451l825m907n297n336m232k712k916m669n238l849
56357E48559k914l774m784m781m809n109m115j888r73k320l706l738l877m912
56343D96859m950k901p30k84p26p68o83o40J0N34r55l861n026l550k084k160k052
56326D66033r34j027l382n339m584k257R6L025O386P821O710O043P653R096Q080
56311E03420O452O640P436O684N207M729M660M142M554O687Q040O305L179J472
56297E79607Q10m74j546p45R01J344J057J767L154L803L823L807K940R21j72J149
56281F02146K800K155K73j08Q48R66K92R91L572O234P656Q065P971P724Q006R146
56265F68737J0551J1802J3162J4252J3966J2647J2236J3221J3855J3411J3373
$$ y = [590980, 591843, 591747, 592363, 592991, 591540, 587715, 582808, 577511, 572175, 567943, 565231, 562315, 557646, 552408, 548559, 545645, 541871, 537087, 532306, 527497, 522388, 518273, 516385, 515412, 513092, 509386, 505648, 501771, 496859, 491909, 489008, 488278, 487994, 487268, 486500, 485817, 485177, 485187, 485721, 484766, 480905, 475879, 472329, 470245, 468085, 466033, 465099, 464072, 460690, 455351, 450767, 448510, 448606, 451631, 458017, 465838, 472548, 478591, 486244, 495340, 503420, 509872, 516512, 523948, 530632, 535839, 540568, 545228, 549370, 553924, 560611, 568651, 574956, 578135, 579607, 580417, 579943, 578397, 577652, 578553, 579897, 580954, 582721, 585875, 589678, 593501, 597308, 600248, 601169, 600997, 602146, 604946, 607101, 607374, 607266, 608114, 609080, 609372, 610363, 613935, 620169, 627825, 635890, 643861, 651585, 659591, 668737, 679288, 691090, 704252, 718504, 732470, 745117, 757353, 770574, 784429, 797840, 811213]
56254H11213J4127J3697J1466R745R605Q785O141M388N424O700N605L981M336
56241I15213M914L007L30M22K801M395M931O323Q048P902O470O587Q653J0415
56227I90411J1106J2397J5271J8803K1795K3461K3291K2345K3295K6938L0532
56216A219645L1940L3118L6537M0672M2754M3796M6808N1681N6072N9929O4984
56205A727936P0799P5631Q0449Q7930R7781J07038J14809J23061J32800J42786
56195B761020J52093J60861J68682J74906J80187J84986J87315J84737J77740
56186D332527J68252J55818J38537J16996R3914P0434M6085K1873Q0j8923l6587
56175E089006n3085o6916p7382q4938q9636r1638r2677r4426r6146r6341r5842
$$ y = [811213, 825340, 839037, 850503, 860248, 869853, 878638, 884779, 889167, 894591, 901291, 906896, 910877, 915213, 920127, 923134, 923464, 923886, 926687, 931082, 936013, 942336, 950384, 958286, 964756, 971343, 979996, 990411, 1001517, 1013914, 1029185, 1047988, 1069783, 1093244, 1116535, 1138880, 1162175, 1189113, 1219645, 1251585, 1284703, 1321240, 1361912, 1404666, 1448462, 1495270, 1546951, 1603023, 1662952, 1727936, 1798735, 1874366, 1954815, 2042745, 2140526, 2247564, 2362373, 2485434, 2618234, 2761020, 2913113, 3073974, 3242656, 3417562, 3597749, 3782735, 3970050, 4154787, 4332527, 4500779, 4656597, 4795134, 4912130, 5006044, 5076478, 5122563, 5144436, 5144516, 5125593, 5089006, 5035921, 4969005, 4891623, 4806685, 4717049, 4625411, 4532734, 4438308, 4342162, 4245821, 4149979]
56164D149979r6787r9512j02844j06330j09774j11956j12531j13531j16195j17981
56154C062538j15992j11654j08519j06818j03920r8984r3577q8426q3113p8169
56144B073366p4205o9818o3344n5852m9554m4626m0396l7737l7016l5726l1896
56133A533196k7912k6905k7273k5276k1249j8435j7057j4639j1265r446r169p937
56121A316633n492l934l346j737Q51K472L224M893P002P516P086Q305J0954J2372
56107A366799J2305J2983J4528J4588J2610J0387Q479O100M306N077P488Q728
56095A484378Q640R208J0304J0282J0124J2324J6120J8480J9410K1647K5667K9820
56083A676404L4871M3114N3217O1317O7180P4119Q2794R0552R7170J05739J17301
$$ y = [4149979, 4053192, 3953680, 3850836, 3744506, 3634732, 3522776, 3410245, 3296714, 3180519, 3062538, 2946546, 2834892, 2726373, 2619555, 2515635, 2416651, 2323074, 2234648, 2151535, 2073366, 1999161, 1929343, 1865999, 1810147, 1760593, 1715967, 1675571, 1637834, 1600818, 1565092, 1533196, 1505284, 1478379, 1451106, 1425830, 1404581, 1386146, 1369089, 1354450, 1343185, 1333739, 1324570, 1316633, 1311141, 1307207, 1303861, 1302124, 1302975, 1305447, 1308671, 1313564, 1320566, 1328082, 1335168, 1343473, 1354427, 1366799, 1379104, 1392087, 1406615, 1421203, 1433813, 1444200, 1452679, 1458779, 1463085, 1468162, 1475650, 1484378, 1493018, 1502226, 1512530, 1522812, 1532936, 1545260, 1561380, 1579860, 1599270, 1620917, 1646584, 1676404, 1711275, 1754389, 1807606, 1868923, 1936103, 2010222, 2093016, 2183568, 2280738, 2386477, 2503778]
56072B503778J29843J43110J59040J76598J91437K01506K08022K10303K05181
56063D128818J92754J77644J63222J49209J35697J24237J13370R7996P5179M7015
56053E405141J7065j1989l6810n4355o5608p4686q4043r4207j07316j25550j46029
56042D621613j62514j72533j78075j79674j75496j66438j56283j46188j34373
56033C150039j21413j10220j00628q9793p8266o9757o4618n9398n3043m7643m3055
56022B312205l7115l0992k7724k5668k0469j3357r834j0082q698m427j715j578
56010B120546K07M313N924L873L298O652J0129J1502J3571J7298J9421J9610K2085
55997B258429K7498L1045L1084L1679L4166L4627L2433L2533L6190L8031L5767
$$ y = [2503778, 2633621, 2776731, 2935771, 3112369, 3303806, 3505312, 3713334, 3923637, 4128818, 4321572, 4499216, 4662438, 4811647, 4947344, 5071581, 5184951, 5282947, 5358126, 5405141, 5422206, 5410217, 5373407, 5319052, 5253444, 5178758, 5094715, 5000508, 4893192, 4767642, 4621613, 4459099, 4286566, 4108491, 3928817, 3753321, 3586883, 3430600, 3284412, 3150039, 3028626, 2918406, 2817778, 2727985, 2649719, 2579962, 2515344, 2455946, 2402903, 2355260, 2312205, 2275090, 2244098, 2216374, 2190706, 2170237, 2156880, 2147046, 2136964, 2128266, 2123839, 2122124, 2120546, 2120753, 2125066, 2130990, 2134863, 2138161, 2144813, 2154942, 2166444, 2180015, 2197313, 2216734, 2236344, 2258429, 2285927, 2316972, 2348056, 2379735, 2413901, 2448528, 2480961, 2513494, 2549684, 2587715, 2623482]
55986B623482L4296L6674L9442M0490M2990M7950N1260N1669N3287N6959N8033
55975C136532N5871N6230O0791O3948O3648O5411P1728P7691Q1360Q7739R7934
55964C918883J05150J06686J09233J16894J24559J28437J32321J38099J41401
55955E021663J42212J48111J60924J72137J77735J85313J99842K15148K26562
55946F649647K39042K55318K69165K78455K91503L12237L32725L48749L68550
55937I345391L97106M26569M51915M80990N19036N58864N96822O42046O98355
55928A4117094P53863Q00957Q49373R06652R63693J013841J067655J133598J202774
55919B2809500J268776J343217J434680J532414J628681J736113J863776J998329
$$ y = [2623482, 2657778, 2694452, 2733894, 2774384, 2817374, 2865324, 2916584, 2968253, 3021540, 3078499, 3136532, 3192403, 3248633, 3309424, 3373372, 3437020, 3502431, 3574159, 3651850, 3733210, 3820949, 3918883, 4024033, 4130719, 4239952, 4356846, 4481405, 4609842, 4742163, 4880262, 5021663, 5163875, 5311986, 5472910, 5645047, 5822782, 6008095, 6207937, 6423085, 6649647, 6888689, 7144007, 7413172, 7691627, 7983130, 8295367, 8628092, 8976841, 9345391, 9742497, 10169066, 10620981, 11101971, 11621007, 12179871, 12776693, 13418739, 14117094, 14870957, 15671914, 16521287, 17427939, 18391632, 19405473, 20473128, 21606726, 22809500, 24078276, 25421493, 26856173, 28388587, 30017268, 31753381, 33617157, 35615486]
55911C5615486K129869K273829K445279K635658K838340L071408L349422L660197
55903E8019488L998026M392461M876427N458724O158583P027049Q094046R334843
55895A07359647J0735380J2352996J4273010J6558656J9281409K2504727K6156617
55888B29222442L0021217L3938191L7759604M0730135M0978150L6233877K5621085
55881D74504701J0815039m748567j7886059k7049990l2261314l4313673l4181152
55874C34878985l2766399l0734252k8423302k5944616k3357175k0740334j8180898
55867A54732009j5774284j3620761j1774484j0213586q888904p776556o859853
55860G9823581o096762n442703m882766m412014m006278l640221l313873l034402
$$ y = [35615486, 37745355, 40019184, 42464463, 45100121, 47938461, 51009869, 54359291, 58019488, 62017514, 66409975, 71286402, 76745126, 82903709, 89930758, 98024804, 107359647, 118095027, 130448023, 144721033, 161279689, 180561098, 203065825, 229222442, 259243659, 293181850, 330941454, 371671589, 412649739, 448883616, 474504701, 485319740, 480571173, 462685114, 435635124, 403373810, 369060137, 334878985, 302112586, 271378334, 242955032, 217010416, 193653241, 172912907, 154732009, 138957725, 125336964, 113562480, 103348894, 94459990, 86683434, 79823581, 73726819, 68284116, 63401350, 58989336, 54983058, 51342837, 48028964, 44994562]
55852D4994562k789136k560542k351017k169585k009074j857793j719505j601424
55844B7936486j495609j391376j293678j211172j137966j064598r95513r38812
55836A8407762q89464q38886p90903p52391p17799o78394o37987o04786n76040
55827A1921112n44782n13715m88801m66744m41796m17494l99105l81922l59462
55818G907291l35961l18537l04213k86801k69460k58039k48646k34513k19081
55809E432040k09690k03724j93543j80584j72284j68905j65018j60613j59508
55800C818171j59662j55707j48629j43205j38425j29896j19062j10828j04497
55791B608260r5810q5587p7819p1565o2941n2800m4632l7305k7582j7399j1327
$$ y = [44994562, 42205426, 39644884, 37293867, 35124282, 33115208, 31257415, 29537910, 27936486, 26440877, 25049501, 23755823, 22544651, 21406685, 20342087, 19346574, 18407762, 17518298, 16679412, 15888509, 15136118, 14418319, 13739925, 13101938, 12497152, 11921112, 11376330, 10862615, 10373814, 9907070, 9465274, 9047780, 8648675, 8266753, 7907291, 7571330, 7252793, 6948580, 6661779, 6392319, 6134280, 5885634, 5651121, 5432040, 5222350, 5018626, 4825083, 4644499, 4472215, 4303310, 4138292, 3977679, 3818171, 3658509, 3502802, 3354173, 3210968, 3072543, 2942647, 2823585, 2712757, 2608260, 2512450, 2426863, 2349044, 2277479, 2214538, 2161738, 2117106, 2079801, 2052219, 2034820, 2023493]
55780B023493r471r917j4703k5705l7842m4532m7146n1117n5590n5466n1269m8246
55768A572489m7174m4423m0052l7814l7781l6385l3325l1654l1669l1116l0451
55757A170645l1464l2035k8754k3555k1132k0973j8699j4193j1431j0946r493
55746I47970o879o210p272o352l105j333k251k903k007j843l512n446p477j1374
55732H80006j6521j9616j9626j9006j9389j9811j9518j8960j7897j5893j4311
55721F79458j4451j4559j2325r195q226q754p635m896l686n248q195j1936j6474
55708E53878j9598j9002j6548j5963j6881j5912j2822j0635r955q504o358o384
55696C95316q791j0247r375q588r344r683p847m654j191K683O656R675J1834J3774
$$ y = [2023493, 2014022, 2004105, 1989402, 1963697, 1925855, 1881323, 1834177, 1783060, 1727470, 1672004, 1620735, 1572489, 1525315, 1480892, 1440840, 1403026, 1365245, 1328860, 1295535, 1263881, 1232212, 1201096, 1170645, 1139181, 1107146, 1078392, 1054837, 1033705, 1012732, 994033, 979840, 968409, 957463, 947970, 941091, 934881, 927609, 921257, 918152, 916819, 914568, 911665, 909658, 907815, 904303, 898857, 891380, 880006, 863485, 843869, 824243, 805237, 785848, 766037, 746519, 727559, 709662, 693769, 679458, 665007, 650448, 638123, 628928, 620702, 611948, 604313, 599417, 595731, 590483, 582288, 570352, 553878, 534280, 515278, 498730, 482767, 465886, 449974, 437152, 426517, 416562, 408058, 401700, 395316, 386525, 376278, 366903, 358315, 348971, 339288, 331441, 326787, 325596, 328279, 334935, 344610, 356444, 370218]
55682C70218J4249J1387O245J879p97l015m576m111k587k677m432n230m127k756
55668C69670j954j128p76j980l518l306k455l844o799p669n891m798n786o284
55654C13482m709l006k657k111o2K054K715K605K831L311L943M985N579M416K309
55639C35685J366J474O37j057j243N07J833J651J597K566L186K731K334K321J487
55624C57075q3n78K24L55p32j235n87n92j840k408j570j389l001m422l836k334
55608C33047j586j417j334j904l015l057j474J9Q0n17p53p26k56J368L257L250
55592C24982J511R06K544L698J919j445l605m042m122m898o678r077j0489r453
55578B81751p208o661q127q757o983m658l675l487l292l796n089n619m921m711
$$ y = [370218, 384467, 395854, 402099, 403978, 403181, 400166, 395590, 391479, 388892, 386215, 381783, 376553, 372426, 369670, 367716, 366588, 365812, 363832, 360314, 357008, 354553, 350709, 343910, 336241, 330350, 325552, 319766, 313482, 308773, 305767, 303110, 300999, 300937, 302991, 305706, 308311, 311142, 314453, 318396, 323381, 328960, 333376, 335685, 337051, 338525, 339162, 338105, 336862, 337369, 339202, 340853, 342450, 345016, 348202, 350933, 353267, 355588, 357075, 356992, 356414, 356638, 356993, 356261, 355026, 354439, 353847, 352007, 349599, 348029, 346640, 343639, 339217, 335381, 333047, 331461, 330044, 328710, 326806, 323791, 320734, 319260, 319279, 319359, 318842, 318089, 317363, 317107, 318475, 321732, 324982, 326493, 327399, 329943, 333641, 335560, 334115, 330510, 326468, 322346, 317448, 310770, 301693, 291204, 281751, 274543, 267882, 259755, 250998, 244015, 239357, 235682, 232195, 228903, 225107, 220018, 214399, 209478, 204767]
55564B04767n703o101n035m591o213p827o899m055j413M85J818J820L35q32m67
55549A60089o1j227k791k745j391m24l26o53j396k153j644R2Q06p77k650k484
55533A40265r84j49lN40J160R40L64K73J41o15r86j59O11J27l95N63J924J808
55515A45425Q04P94J784K593L493N315P001O980O155O561P795P749O443O007O899
55500B21798P203N883M013K352L06k171m079n299o870q706r313q488q172r516
55486A78941j1003j0688q846p053n795m381k638j310r07r39n84L15J130J353J290
55471A28885J412J320K95j079j086P95K892L460K651J627R18P25J551K998L077
55456A50441M86l102m781l884k188j152p48o47o83j98J233K310R85k625n912o905
$$ y = [204767, 199064, 192963, 187928, 183337, 177124, 169297, 162398, 158343, 156930, 157415, 159233, 161053, 161388, 160556, 160089, 160028, 158801, 156010, 153265, 151874, 151450, 151124, 150471, 149075, 146922, 145278, 145370, 146176, 145399, 142749, 140265, 139281, 139132, 139129, 139669, 140829, 141769, 142133, 142406, 142547, 141932, 140946, 140787, 141398, 141525, 141130, 141693, 143617, 145425, 146229, 147023, 148807, 151400, 154893, 160208, 167209, 174189, 180344, 186905, 194700, 202449, 208892, 214899, 221798, 229001, 234884, 238897, 241249, 241555, 239384, 235305, 230006, 223136, 214430, 205117, 196629, 188457, 178941, 167938, 157250, 148404, 141351, 135556, 131175, 128537, 127227, 126320, 125381, 124797, 125112, 126242, 127595, 128885, 130297, 131617, 131912, 130833, 129747, 130542, 133434, 136894, 139545, 141172, 142090, 142815, 144366, 147364, 150441, 150927, 147825, 143044, 139160, 136972, 135820, 135072, 134425, 133742, 133544, 134777, 137087, 138072, 135447, 129535, 122630]
55440A22630o343n845n491m449l029k575l422m214l768k699k389k888l019k490
55426G0009k399k999k615k91J912J502m19n90J232J773l62k200j151P38Ok858
55410F1288m322l015j098p60j767k632k416j125L75R32M21L8M14M59p67k071j697
55393D2257M2J428J899K140K193J383j23j362j947j937q75J353L177K845J042
55378E3515O3M91P07k03j086p98K25J112J835K545K820K329J422N40k07o74o39
55361F3997l99n62j151j537j337p03J61J075J617J535J252J326J648J813J792
55346G0527J604R60J45L33J937L359K803O15j475k681l095k270K4K111J817m09
55330G6305j894j465o40q61j626k018k030j619k93J422J846N35o69k01R10O35
$$ y = [122630, 116287, 110442, 104951, 100502, 97473, 94898, 91476, 87262, 83494, 80795, 78406, 75518, 72499, 70009, 67610, 64611, 61996, 61705, 63617, 65119, 64700, 64110, 65342, 67115, 66753, 64553, 63402, 64140, 64146, 61288, 56966, 53951, 52853, 52093, 50326, 47694, 45278, 44153, 44528, 45460, 45881, 45919, 46333, 46792, 46025, 43954, 42257, 42299, 43727, 45626, 47766, 49959, 51342, 51219, 49857, 47910, 45973, 45098, 46451, 49628, 52473, 53515, 53578, 54069, 54776, 54573, 53487, 52689, 52914, 54026, 55861, 58406, 61226, 63555, 64977, 65517, 65310, 64636, 63997, 63598, 63036, 61885, 60348, 59011, 58308, 58469, 59544, 61161, 62696, 63948, 65274, 66922, 68735, 70527, 72131, 73091, 73236, 73569, 75506, 78865, 81668, 82283, 80808, 78127, 75032, 72762, 72786, 74897, 76714, 76305, 74411, 72946, 72306, 71445, 69819, 67801, 65771, 64152, 63859, 65281, 67127, 67662, 66993, 66792, 67702, 68337]
55314F8337j260l220l936l172j289Q81K043J469j42j506k196k571k601j662K57
55299D9432J763J106j764m525m534j743J077J500L0j147j100n73q3O47J438J543
55283D3067J133J461K945M208L742J639q56k682l310k669j306j28N43J116J793
55268E0696K132J772R57K2q73j403j242q72j307k523l058j868Q8Q92k5j293j321
55251D0774j04Q30K87j022j202L42J864J395o38j899j016J022K426K555K066J814
55235D9494J942J689K46j928l047j980K20J618J760J582J443P73m05j184j296
55220E0927j452j738j152N63J889J371l67j508j432j235j958l037k830n99K295
55205C9737L618K798J517J349J727J232M4m48M1M08J78J44P63J405J494J095J14
$$ y = [68337, 67077, 63857, 59921, 56749, 55460, 56341, 58384, 59853, 59711, 58205, 56009, 53438, 50837, 49175, 49432, 51195, 52301, 50537, 46012, 41478, 39735, 40812, 42312, 42342, 41195, 40095, 39522, 39439, 40086, 41524, 43067, 44200, 45661, 48606, 52814, 56556, 58195, 57339, 54657, 51347, 48678, 47372, 47244, 47787, 48903, 50696, 52828, 54600, 55557, 55579, 54706, 53303, 52061, 51189, 49882, 47359, 44301, 42433, 42521, 43413, 43388, 42095, 40774, 40670, 41500, 41787, 40765, 39563, 39905, 41769, 43164, 42526, 40627, 39611, 40633, 43059, 45614, 47680, 49494, 51436, 53125, 53371, 51443, 48396, 46416, 46636, 48254, 50014, 51596, 53039, 53812, 53407, 52223, 50927, 49475, 47737, 46585, 47148, 49037, 50408, 50041, 48533, 47101, 45866, 43908, 40871, 38041, 37442, 39737, 43355, 46153, 47670, 49019, 50746, 51978, 52022, 51574, 51615, 52023, 52201, 52345, 53108, 54513, 56007, 57102, 57216]
55188E7216j618l129k794o74J062Q89j68k18R45K006J982J018j60r12j155j305
55172E2985j372l90K141M484M003O27k578k936q74J428K574K329R43o72j186l54
55156F1152N24M78J63N11J271J802K185K479K030O50m35j53Q10J088N05k32q31
55139G3997j202p92N05J483R83m70j582k130k662k982k520j691j441j602j203
55124E6691j72N92P74R92J456J446M05j224k409k313r56M31L05j210j993n71J675
55107E3919K273R49l63m37K7M7l73q89j343j368o43K81M83J27J72O26M23o65j458
55088E1788j226q14j124j585j026N57J938K017Q48l06OJ756K933J776o04j213
55072E5721Q63L167L244J663M59P2l42m71J039M061O399O279M189J785K7r57r97
$$ y = [57216, 55598, 52469, 49675, 49001, 50063, 50952, 50784, 50566, 51511, 53517, 55499, 56517, 56357, 55445, 54290, 52985, 51613, 51223, 53364, 57848, 61851, 62478, 59900, 56964, 56090, 57518, 60092, 62421, 63364, 62692, 61506, 61152, 61676, 62154, 62317, 62828, 64099, 65901, 68086, 70565, 72595, 73245, 72810, 72657, 73467, 74555, 75060, 74828, 73997, 72795, 72003, 72508, 73991, 74974, 74504, 72922, 70792, 68130, 65148, 62628, 60937, 59496, 57894, 56691, 56519, 57111, 57885, 58877, 60333, 61779, 62184, 60960, 58551, 56238, 55282, 55713, 56018, 54808, 52815, 52244, 53919, 56192, 57141, 56778, 56341, 56368, 56415, 56042, 55153, 53810, 52442, 51799, 52080, 52563, 52690, 52862, 53488, 53911, 53246, 51788, 50562, 49748, 48624, 47039, 46013, 46570, 48508, 50525, 51373, 51067, 51073, 52829, 55762, 57538, 56934, 55721, 56584, 59751, 62995, 64658, 65117, 65189, 64847, 64376, 65415, 69476, 75875, 82154, 86343, 88128, 88155, 87198, 86201]
55055H6201J10J951L371L196J193j487l034k728j820k021l184l461j891J77J018
55040G7591Q61J168K183K615J808Q80J073J949K108J254O06J295K931M065L728
55025A06115K361J199Q25N91k99j481j740p02N12O16l21j079o59Q57K447K917
55009A12159J908M63%O26J167J057J121J766J693k29k671l235j741m30p98j861
54993A10995k051j292m59J02N69R02R86J007J118J023L03j038k450k983j851N73
54977A05454K513K498J134K86O73J412J799K080K278J895J157R49Q97o87l877
54962A20461n820l971L92L543L538J692L45N38J718K600K291J145K59j5k87n92
54946A27837m0J298J693K95j142q47j7r87l289m130k590p32k16k13M55J225J191
$$ y = [86201, 86311, 88262, 91633, 94829, 96022, 94535, 91501, 88773, 86953, 84932, 81748, 78287, 76396, 76573, 77591, 78452, 79620, 81803, 84418, 86226, 87106, 88179, 90128, 92236, 93490, 94096, 95391, 98322, 102387, 106115, 108476, 109675, 110500, 111091, 110792, 109311, 107571, 106869, 107381, 107997, 107676, 106597, 105938, 106795, 109242, 112159, 114067, 114530, 114530, 115156, 116323, 117380, 118501, 120267, 121960, 121731, 119060, 115825, 114084, 113654, 112856, 110995, 108944, 107652, 107193, 107295, 107864, 108766, 109752, 110759, 111877, 112900, 113203, 112165, 109715, 106732, 104881, 105454, 107967, 110465, 111599, 111885, 112558, 113970, 115769, 117849, 120127, 122022, 123179, 124128, 125025, 124338, 120461, 114641, 110670, 111062, 114605, 118143, 119835, 120180, 120718, 122436, 125036, 127327, 128472, 128731, 128716, 128429, 127837, 127797, 129095, 130788, 131083, 129941, 129094, 129077, 128090, 124801, 120671, 118081, 117349, 117133, 116920, 117375, 118600, 119791]
54929A19791R56J577K610K670J479K04q6M85J030Q93K20k77j65J54N3l37l31K75
54911A31201J032J713K553L477L839L245K063R37K73M00J475L023M226M972O020
54896A70449P736R295R588Q535P088O292O723Q374J0621J2525J3565J4023J4356
54883B99170J4456J3736J1905R249O193K783j191n615r801j2969j4878j5644j5201
54870B82193j3513j1428j0298j0304j0056q642p199p245q017p147m037r37j05
54857A83265j121j973j677p85J36J211K530L775M757N693O542O870O744P255R247
54842B32469J1808J3004J2364J1610J2096J2484J0217N009p03m902p977j1006
54830B96473j3578j4595j4109j3049j1753j0134q646p863p390o553n764n901o504
$$ y = [119791, 120747, 122324, 124934, 127604, 129083, 129287, 129201, 129686, 130716, 131609, 131829, 131552, 131387, 131541, 131594, 131257, 130926, 131201, 132233, 133946, 136499, 139976, 143815, 147060, 149123, 150060, 150333, 150733, 152208, 155231, 159457, 164429, 170449, 178185, 187480, 197068, 205603, 212691, 218983, 225706, 234080, 244701, 257226, 270791, 284814, 299170, 313626, 327362, 339267, 348516, 354709, 357492, 356301, 350686, 340885, 327916, 313038, 297394, 282193, 268680, 257252, 246954, 236650, 226594, 217952, 210753, 203508, 195491, 188344, 184307, 183370, 183265, 182144, 180171, 178494, 177709, 177845, 179056, 181586, 185361, 190118, 195811, 202353, 209223, 215967, 223222, 232469, 244277, 257281, 269645, 281255, 293351, 305835, 316052, 321061, 320358, 315456, 307479, 296473, 282895, 268300, 254191, 241142, 229389, 219255, 210609, 202746, 195356, 188803, 183039, 177138, 170634]
54817A70634o145m513k648j094O04K202K281K70k430m170m781m750l885k056l03
54802A39216J72l27n69l07m14j210j873j736j140p34o34o51o87n48K1O48L39j167
54784A28399k482j961O6J543J351O38P88J147N5k414m356m674m160l546k130N51
54768A08815K994L217J363n70j228r14l20L95J185J886K591L504M200L879K423
54753A33420O27o56j035m43Q16J989K664L441M979O650P144O332N389N062N070
54738A81449N436O941R646J2107J2965J2628J2511J3184J4046J4478J4496J4340
54726C24227J3947J3011J1339Q961N848J726l337q152j1028j1656j1595j2129
54714C21162j2492j1280q846o811n665m479k884j630j035m94K36Q30J703L814
$$ y = [170634, 164489, 159976, 157328, 156234, 156838, 159040, 161321, 161591, 159161, 154991, 150210, 145460, 141575, 139519, 139216, 139388, 139061, 138492, 138185, 137771, 136561, 134688, 132952, 131812, 131078, 130444, 129793, 129106, 128558, 128579, 129227, 129566, 128399, 125917, 123956, 124022, 125565, 126916, 127554, 128342, 129489, 129544, 127130, 122774, 118100, 113940, 110394, 108264, 108815, 111809, 115026, 116389, 115819, 114591, 113677, 113357, 113752, 114937, 116823, 119414, 122918, 127118, 130997, 133420, 134047, 133391, 132356, 131913, 132729, 134718, 137382, 140823, 145802, 152452, 159596, 165928, 171317, 176379, 181449, 186885, 193826, 203472, 215579, 228544, 241172, 253683, 266867, 280913, 295391, 309887, 324227, 338174, 351185, 362524, 371485, 377333, 379059, 375722, 367570, 356542, 344886, 333291, 321162, 308670, 297390, 288544, 281733, 276068, 271589, 268705, 267075, 266040, 265546, 265782, 266612, 268315, 272129]
54700B72129O706Q614R177J0218J2707J4820J4573J3027J2988J5388J8633K0937
54688D29917K1758K1197J9453J6907J3815R913M909q86o882j2619j7323j9978
54676D80181k0577k0587k1118k1457k0429j8484j7071j6488j5794j4488j2874
54665B80814j1004q706o670o086o960p862p653o469m879l153j717j318k151l417
54651B02769m188m179l553k596j858j879k348j998m5K549L729K373m51k373j946
54636A84006kJ412J304N01R4J12J52N30J712L103L520K698J389R8j130j670m52
54619A97377K320M621M729L259K348L127M701N519N090M257M170N182O603P452
54605B60755P360O722O038N442M951M833N429O612P609P507O033L946K612L019
$$ y = [272129, 278835, 287449, 296626, 306844, 319551, 334371, 348944, 361971, 374959, 390347, 408980, 429917, 451675, 472872, 492325, 509232, 523047, 532960, 537869, 536983, 530101, 517482, 500159, 480181, 459604, 439017, 417899, 396442, 376013, 357529, 340458, 323970, 308176, 293688, 280814, 269810, 261104, 254434, 248348, 241388, 233526, 225873, 219404, 214525, 211372, 209655, 208337, 206186, 202769, 198581, 194402, 190849, 188253, 186395, 184516, 182168, 180170, 180125, 182674, 186403, 188776, 188325, 185952, 184006, 184004, 185416, 186720, 187221, 187315, 187427, 187579, 188109, 189821, 192924, 196444, 199142, 200531, 200629, 199499, 197829, 197377, 199697, 204318, 209047, 212306, 214654, 217781, 222482, 228001, 233091, 237348, 241518, 246700, 253303, 260755, 268115, 274837, 280875, 286317, 291268, 296101, 301530, 308142, 315751, 323258, 329291, 333237, 335849, 338868]
54591C38868N117P988J0617J2465J3550J4190J4769J5609J6899J8609K0421K1864
54579E10966K2503K1907J9498J4867Q570K122l320q027j2889j7812k1646k3667
54567E13072k4238k3957k2968k1420j9788j8375j7072j5834j4685j3071j0193
54556C11471o487l834l405m095l987k804j835j866k275k259j966k099k927l988
54542B67644m576m453m097m095m328m207l703l436l555l458k999l026l946m734
54528B13031m395l681m041n311n886n106m091l974m456m569l947k801j346O4O66
54513A60157j64j964l239k855j366n63j328k307j565O77K157J675O42P43J433
54498A52133J193K70L32J622K388J442j41n64N43K135L274L922M499N135N462
$$ y = [338868, 343985, 351973, 362590, 375055, 388605, 402795, 417564, 433173, 450072, 468681, 489102, 510966, 533469, 555376, 574874, 589741, 598311, 600433, 597113, 589086, 576197, 558385, 536739, 513072, 488834, 464877, 441909, 420489, 400701, 382326, 365254, 349420, 334735, 321664, 311471, 304984, 301150, 297745, 293650, 289663, 286859, 285024, 283158, 280883, 278624, 276658, 274559, 271632, 267644, 263068, 258615, 254518, 250423, 246095, 241888, 238185, 234749, 231194, 227736, 224737, 221711, 217765, 213031, 208636, 204955, 200914, 195603, 189717, 184611, 180520, 176546, 172090, 167521, 163574, 160773, 159427, 159491, 160157, 159993, 158029, 154790, 151935, 150569, 150006, 148678, 146371, 144806, 145483, 147640, 149315, 149957, 150700, 152133, 153326, 153596, 153928, 155550, 157938, 159380, 159239, 158675, 159218, 161353, 164627, 168549, 173048, 178183, 183645]
54483A83645N173M667M683N085M841L780L541N709R485J2392J3068J2251J1201
54470B79521J0279R228P749N657L202J217J89o70k417m764o534p474q303r109
54456B77771r208q817r178j0541j1411j0474q195n890m452m384n743p250o814
54443A75414m049j170l51j210k009k186k266k081r34P59J582J091M40P51J813
54428A65594K707K953K694K279J926J497O18o68j469q60Q44K234K283J323L23
54413A84278k45m66k13J016L167M896M463J676j538k969k349j197p62r45j171
54398A87641j400j833k332k523k117j020L30P65m77k274k447o42Q41nk193l226
54382A67088k448j315q01k54R06J919J802Q10j6j71O1K55J93k44j007j706j794
$$ y = [183645, 188818, 193485, 198168, 203253, 208094, 211874, 215415, 221124, 230609, 243001, 256069, 268320, 279521, 289800, 299028, 306777, 312434, 315636, 316853, 317042, 316372, 313955, 309191, 302657, 295183, 286880, 277771, 268563, 259746, 250568, 240027, 228616, 218142, 209947, 204057, 199605, 195221, 189478, 182228, 175414, 171365, 170195, 169844, 168634, 166625, 164439, 162173, 160092, 159158, 159917, 161499, 162590, 163030, 163781, 165594, 168301, 171254, 173948, 176227, 178153, 179650, 180268, 179600, 178131, 177271, 178115, 180349, 182632, 183955, 184278, 184033, 183567, 183354, 184370, 187537, 192433, 196896, 198572, 197034, 194065, 191716, 190519, 189757, 188812, 187641, 186241, 184408, 182076, 179553, 177436, 176416, 176746, 177511, 177034, 174760, 172313, 171671, 172512, 172507, 170314, 167088, 164640, 163325, 162524, 162270, 163176, 165095, 166897, 167707, 167691, 167520, 167581, 167836, 168029, 167785, 166778, 165072, 163278]
54365A63278j108j95Q3n39j245r22M68J785K269K526L396M391M265K868J450J008
54349A83778J314J861K742M089N398O112O361O495O290N400M247L652L704L814
54335B45257L788M058M691M941M210K767J233r8r51r17l11m83k169m022m173l128
54319B54693l450o053q531q379o531n819o644o434l682l61Q34J08j98Q53J786
54304B02192J177n13k025k936l357l001j641q1O25P60J650L526M869M529L445
54289B09219L228L764L588K310J257J481K525L571M659O024P143P259O262M403
54275B66693J828r26k827l450l517l555k975j630j168l195o472p931o408l777
54261B20690k158j692j605j871k711l644m100m421n248o361o807o038m428k903
$$ y = [163278, 162170, 161975, 162058, 161519, 160274, 159352, 159820, 161605, 163874, 166400, 169796, 174187, 178452, 181320, 182770, 183778, 185092, 186953, 189695, 193784, 199182, 205294, 211655, 218150, 224440, 229840, 234087, 237739, 241443, 245257, 249045, 253103, 257794, 262735, 266945, 269712, 270945, 270847, 269896, 268979, 268668, 268185, 266016, 261994, 257821, 254693, 251243, 245190, 236659, 228280, 221749, 215930, 209286, 202852, 199170, 198809, 199643, 199751, 199553, 200406, 202192, 203369, 202856, 200831, 197895, 194538, 191537, 189896, 189815, 190440, 191200, 192850, 196376, 201245, 205774, 209219, 212447, 216211, 219799, 222109, 223366, 224847, 227372, 230943, 235602, 241626, 248769, 256028, 262290, 266693, 268521, 267595, 264768, 261318, 257801, 254246, 251271, 249641, 248473, 245278, 238806, 230875, 224467, 220690, 218532, 216840, 215235, 213364, 210653, 207009, 202909, 198488, 193240, 186879, 180072, 174034, 169606, 166703]
54247A66703k252k491k790k467j956k275l488m528m596l902k884j729j019j668
54233A28658l524m900m308k039M53K070K339J161q30k206k018q27J68N54O61O36
54217A16048M00J97L07M91L34p0m04p20j075r44J61J649K201J232n66k047k436
54200A14758j433P34L121M434L947K134K48p38r77j391k279k609j351Q37K217
54185A21652K226J869J744J127k33j003j59J260J786J842K707L810L138K51k958
54170A39059m728m990m202k443l90L51q85k526k562r33P60J459J473J393J202
54155A22038O64j05q22j447k067k532k364j193P41K660L883M229L699K197k8j971
54139A27582k548j764o91k15l06n13o34n87j40Q10J842K231J560K9j607k311j489
$$ y = [166703, 164451, 161960, 159170, 156703, 154747, 152472, 148984, 144456, 139860, 135958, 133074, 131345, 130326, 128658, 125134, 120234, 115926, 113887, 114340, 116410, 118749, 119910, 119080, 116874, 114856, 114029, 114197, 114751, 115412, 116048, 116448, 116645, 116952, 117443, 117777, 117707, 117303, 116583, 115508, 114564, 114725, 116374, 118575, 119807, 119241, 117194, 114758, 113325, 114059, 117180, 121614, 125561, 127695, 127943, 127205, 126228, 124837, 122558, 119949, 118598, 119435, 121652, 123878, 125747, 127491, 128618, 128385, 127382, 127223, 128483, 130269, 132111, 134818, 138628, 141766, 142017, 139059, 134331, 129341, 125139, 122696, 122306, 122657, 121772, 119246, 116684, 115751, 116511, 117970, 119443, 120836, 122038, 122702, 122597, 121775, 120328, 118261, 115729, 113365, 112172, 112913, 115573, 119456, 123685, 127384, 129581, 129553, 127582, 125034, 123270, 122579, 122364, 122058, 121545, 120911, 120324, 120184, 120994, 122836, 125067, 126627, 126656, 125049, 122738, 121249]
54122A21249K07J030k77k907m478l482r95N44J56p62n90L41M79m88j123l11J262
54105A09855K182K047J531J214J079Q20J66q11j397p88O27J161k21k312k894j372
54089A10887O73J480R04J25K11J203K176K130J036p8k98J85O46R26J376J979K219
54072A27780J725N03j242k967l713k969j509n81l06L45J822L120K866P65k188
54057A23451m420m628k715j18J311J106M26M20R04J017N53R9J11M33O11L32m39
54040A18454j461k195j962m84J519K513J533n14j556o46J026J865J845J922K135
54025A23994J540r8j734k448k385k020j413o52j85j81j70J53M18L88O50J629K493
54008A19979K070O47j88L53J312J579J417J606J862J311L60N47K103K999J541
$$ y = [121249, 121456, 122486, 122209, 119302, 114824, 111342, 110347, 110891, 111047, 110285, 109695, 110036, 110515, 110027, 108904, 108593, 109855, 112037, 114084, 115615, 116829, 117908, 118728, 118894, 118083, 116686, 115898, 116525, 117686, 117465, 115153, 112259, 110887, 111560, 113040, 113944, 114069, 114280, 115483, 117659, 119789, 120825, 120747, 120449, 120634, 121280, 122206, 123582, 125561, 127780, 129505, 130008, 128766, 125799, 122086, 119117, 117608, 117027, 116721, 117066, 118888, 122008, 124874, 125639, 123451, 119031, 114403, 111688, 111570, 112881, 113987, 114413, 114833, 115737, 116754, 117307, 117406, 117517, 117950, 118561, 118893, 118454, 116993, 114798, 112836, 112352, 113871, 116384, 117917, 117403, 115847, 115201, 116227, 118092, 119937, 121859, 123994, 125534, 125436, 123702, 121254, 118869, 116849, 115436, 114784, 114599, 114418, 114248, 114401, 114819, 115207, 115857, 117486, 119979, 122049, 122696, 122508, 122861, 124173, 125752, 127169, 128775, 130637, 131948, 132308, 132855, 134958, 137957, 139498]
53993A39498j066k118r00P78J414J516K127L180M143M922N324M695L119J964K117
53978A70713K644K379J904K461L661M043L537L557M709O024O713P047P146O410
53964B32948M926M111M960O534P076O236N240N124N517N334M269L170K771K520
53950C00736J506K82M86K152K952J221j550k833k419j847j425l70N84m88l467
53935B95520n879o404o286o432n777l886k699l593m682l429o22P10m69k345l284
53920B40443l395k989j640N63K329K542J463Q5j046j974k800l371l338k459j068
53905B23345N5M78M32J35o28j770k402j807m68N78J014J143R84K99o77j399j751
53888B17561j855j386R8K133L515L665L223L062L285L468L563M099N391O754O952
$$ y = [139498, 138432, 136314, 135414, 136192, 137606, 139122, 141249, 144429, 148572, 153494, 158818, 163513, 166632, 168596, 170713, 173357, 175736, 177640, 180101, 183762, 187805, 191342, 194899, 199608, 205632, 212345, 219392, 226538, 232948, 237874, 241985, 246945, 253479, 260555, 266791, 272031, 277155, 282672, 288006, 292275, 295445, 298216, 300736, 302242, 302524, 303010, 305162, 308114, 309335, 307785, 304952, 302533, 300686, 299261, 298891, 299475, 298987, 295520, 289641, 283237, 276951, 270519, 264742, 260856, 258157, 254564, 249882, 246453, 245831, 246541, 246072, 243727, 240443, 237048, 234059, 232419, 232982, 235311, 237853, 239316, 239401, 238355, 236381, 233581, 230210, 226872, 224413, 223345, 223400, 223878, 224310, 224445, 223817, 222047, 219645, 217838, 217370, 217948, 218962, 220105, 221089, 221388, 220711, 219312, 217561, 215706, 214320, 214418, 216551, 220066, 223731, 226954, 230016, 233301, 236769, 240332, 244431, 249822, 256576, 263528]
53873B63528N698M285M095M828N082M443L820L587K874J266k03p25r96j633j490
53858B98459Q27M492P086P375O185M868M213M615N856O804O589O020O536P896
53844C77821Q365P278N929N599O118O890P933R085R270P571M523J615j58p86q22
53829D56231r17j422k155k867l844n428p016p408o478n568n863p136q486r394
53815C82249r580q741p267o426o871p522o969n572n014n908o974o851n708m642
53801B88204m177m021l938m139m872n918o777p131p084o904o530n487l589j743
53787B15894j508l353n585n758l384o37J9j563l530m399m129l050j115J262K612
53772A81776J790l97j886j601l97L11J78m3L38J097J424Q61j76r04j052r95j031
$$ y = [263528, 269226, 273511, 277606, 282434, 287516, 291959, 295779, 299366, 302240, 303506, 303303, 302578, 301582, 299949, 298459, 299286, 303778, 310864, 318239, 324424, 329292, 333505, 338120, 343976, 350780, 357369, 363389, 369925, 377821, 386186, 393464, 399393, 404992, 411110, 418000, 425933, 435018, 444288, 451859, 456382, 457997, 457839, 457053, 456231, 455314, 453892, 451737, 448870, 445026, 439598, 432582, 425174, 418696, 413128, 407265, 400129, 391643, 382249, 372669, 363928, 356661, 350235, 343364, 335842, 328873, 323301, 318287, 312379, 305405, 298554, 292846, 288204, 284027, 280006, 276068, 271929, 267057, 261139, 254362, 247231, 240147, 233243, 226713, 221226, 217637, 215894, 214386, 211033, 205448, 199690, 196306, 195669, 195688, 194125, 190595, 186196, 182067, 179017, 177902, 179164, 181776, 183566, 183169, 181283, 179682, 179285, 179596, 179774, 179731, 180069, 181166, 182590, 183451, 183275, 182371, 181319, 180324, 179293]
53755A79293j015p43k36N55J867L490M529M299L224K387K389K959L538L805L773
53740B14114L666L653L632L518L686M596N851O263N343M079L832M935O805Q702
53726B82675R892R772Q584P356O556N568M220L707M747N804M879K438O91K11n06
53711C56594k023k716j591l16r46k964m178l855l248l386l832l822l355k777k091
53696C15494j259p02r62j971l128m106n109o145o461n414l763l270m583o157n969
53681B56495l878j626p96j419k396k508j257O18J571P71j005k534l560m203l744
53666B30529j617P18Q78j171k754k040k91M23J52K37Q53J085R53J538L127M640
53650B37260N124M861M688M950N421N645N227M204L243K999L193K807J400j10
$$ y = [179293, 178278, 177535, 177299, 177854, 179721, 183211, 187740, 192039, 195263, 197650, 200039, 202998, 206536, 210341, 214114, 217780, 221433, 225065, 228583, 232269, 236865, 242716, 248979, 254322, 258401, 262233, 267168, 273973, 282675, 292567, 302339, 310923, 318279, 324835, 330403, 334623, 338330, 343077, 348881, 353760, 356198, 356889, 357100, 356594, 354571, 351855, 350264, 349948, 349002, 346038, 341860, 338005, 334757, 331371, 327539, 323717, 320362, 317585, 315494, 314235, 313533, 312571, 310600, 307472, 303366, 298257, 292112, 285651, 280237, 276474, 273204, 268621, 262464, 256495, 252617, 250991, 250195, 248776, 246380, 243872, 242615, 243233, 244804, 245575, 244570, 242036, 238476, 234273, 230529, 228912, 229630, 230508, 229337, 226583, 224543, 224252, 224675, 224827, 225064, 225917, 227002, 227955, 229493, 232620, 237260, 242384, 247245, 251933, 256883, 262304, 267949, 273176, 277380, 280623, 283622, 286815, 289622, 291022, 290912]
53636B90912k96J155K882L079J467k31j50J555L043L255L015L268L347K102J44
53621C18547m78J069L237M088L623L419M479O151P145O834N378L132N93j281j433
53606C64503K14K413L693L578K463P26j255k611k471j226l32n24r33n26K90L19
53590C68321n75j234q48m2K6p61j327p77M84J296J175P10M41O8o92j078j96J289
53572C66280J597K20j185r07P51K157K431J958J325P26L28M79J328K605L729M095
53556C87917L497K539K249K956L866M062L589L190L344M048N125O225O852O997
53542D46456P488Q931J0489J0495Q445N874M917O211Q364R393Q600P045O219O466
53528E55393P005P289P517P780P603O818O146O248O729O715N983M870L683K861
$$ y = [290912, 290616, 291771, 294653, 297732, 299199, 298968, 298818, 300373, 303416, 306671, 309686, 312954, 316301, 318403, 318547, 318069, 319138, 322375, 326463, 330086, 333505, 337984, 344135, 351280, 358114, 363492, 366624, 367217, 365936, 364503, 364717, 367130, 370823, 374401, 376864, 377590, 376335, 373724, 371253, 370027, 369695, 369171, 368238, 367712, 368002, 368321, 367746, 366512, 365664, 365622, 365648, 364887, 363560, 362783, 363267, 364563, 365738, 366448, 366889, 366957, 366265, 365187, 364991, 366280, 367877, 368097, 366912, 366005, 366756, 368913, 371344, 373302, 374627, 375353, 375681, 376160, 377488, 380093, 383822, 387917, 391414, 393953, 396202, 399158, 403024, 407086, 410675, 413865, 417209, 421257, 426382, 432607, 439459, 446456, 453944, 462875, 473364, 483859, 492304, 498178, 503095, 509306, 517670, 527063, 535663, 542708, 548927, 555393, 562398, 569687, 577204, 584984, 592587, 599405, 605551, 611799, 618528, 625243, 631226, 636096, 639779, 642640]
53514F42640L101M309N003M003K214J545K210K636J937R83O13M52J34K14Q76J093
53498F73963J77q70r00n76j245k503k677j562q53j562k623k643j621k16J442L107
53482F58838L774K925J761J814K810L252K797K568L148L768L924M294N297N909
53468G06879N010L227K340L254N381P720R817J1790J3891J5930J6967J6287J4972
53455H33465J5415J8394K1687K2675K1602K0756K1291K2649K4572K7382L0216
53444A080104L1281L0551L0195L1466L3101L3917L4930L7233L9551M0046L9495
53433A461870M0274M2831M5382M6849M7897M8954M9313M8800M8436M8730M8833
53422A978169M8249M7894M8456M9005M8526M7752M8010M8966M9066M7953M6908
$$ y = [642640, 645741, 650050, 655053, 659056, 661270, 662815, 665025, 667661, 669598, 670581, 671194, 671646, 671780, 671994, 672870, 673963, 674140, 673270, 672370, 671794, 670549, 668046, 665369, 663807, 662954, 661392, 658769, 656126, 654505, 654289, 655731, 658838, 662612, 665537, 667298, 669112, 671922, 675174, 677971, 680539, 683687, 687455, 691379, 695673, 700970, 706879, 711889, 715116, 717456, 720710, 726091, 733811, 743628, 755418, 769309, 785239, 802206, 818493, 833465, 848880, 867274, 888961, 911636, 933238, 953994, 975285, 997934, 1022506, 1049888, 1080104, 1111385, 1141936, 1172131, 1203597, 1236698, 1270615, 1305545, 1342778, 1382329, 1422375, 1461870, 1502144, 1544975, 1590357, 1637206, 1685103, 1734057, 1783370, 1832170, 1880606, 1929336, 1978169, 2026418, 2074312, 2122768, 2171773, 2220299, 2268051, 2316061, 2365027, 2414093, 2462046, 2508954]
53411B508954M6801M6846M5889M3867M1487L9192L7087L5234L3487L1352K8693
53400B938889K6196K4548K3474K2230K0777J9591J8259J5523J1066O351K917N42
53388C130363k065n319q615j1733j5099j8641k1623k3985k6755l0531l4365l6875
53376B894757l7897l8454l9473m1091m2831m3953m3976m3241m2588m2143m1144
53365B437966l9339l7833l7656l8038l7175l4431l0780k7257k4004k1036j8816
53354B091601j7463j6041j3248q673l103K170O140Q566J0148J2082J5198J9339
53342B106716K3706K7780L1743L5862L9694M2261M3328M4098M6161M9814N3885
53331B545048N7199N9726O2249O5333O8921P2471P5417P7807Q0553Q4474Q9153
$$ y = [2508954, 2555755, 2602601, 2648490, 2692357, 2733844, 2773036, 2810123, 2845357, 2878844, 2910196, 2938889, 2965085, 2989633, 3013107, 3035337, 3056114, 3075705, 3093964, 3109487, 3120553, 3126904, 3129821, 3130363, 3128298, 3122979, 3114364, 3102631, 3087532, 3068891, 3047268, 3023283, 2996528, 2965997, 2931632, 2894757, 2856860, 2818406, 2778933, 2737842, 2695011, 2651058, 2607082, 2563841, 2521253, 2479110, 2437966, 2398627, 2360794, 2323138, 2285100, 2247925, 2213494, 2182714, 2155457, 2131453, 2110417, 2091601, 2074138, 2058097, 2044849, 2036176, 2033073, 2035243, 2041383, 2049949, 2060097, 2072179, 2087377, 2106716, 2130422, 2158202, 2189945, 2225807, 2265501, 2307762, 2351090, 2395188, 2441349, 2491163, 2545048, 2602247, 2661973, 2724222, 2789555, 2858476, 2930947, 3006364, 3084171, 3164724, 3249198, 3338351]
53320C338351R3310R6378R8910J01392J03630J05546J07522J09385J10056J08971
53310D373451J07063J05518J04400J03200J01859J00220R7318R2491Q6612Q0975
53300E353107P5463O9074O1995N5699N0943M6798M1812L5211K6993J7844Q966
53289E843905J158n993j3408k1267k9308l8009m8218n9684p0993q0993q9308r5652
53277E292230r9858j02653j05190j07626j09198j09716j09775j09406j07999j05889
53267D224920j04594j04791j05240j04431j02306r9658r6839r3796r0582q7161
53257C235522q3290p9104p5087p1086o6307o0850n6202n3347n1229m7998m3274
53246B547748l8243l3989l0574k7478k4252k0770j7271j4145j1596r738q806q608
$$ y = [3338351, 3431661, 3528039, 3626949, 3728341, 3831971, 3937517, 4045039, 4154424, 4264480, 4373451, 4480514, 4586032, 4690432, 4793632, 4895491, 4995711, 5093029, 5185520, 5272132, 5353107, 5428570, 5497644, 5559639, 5615338, 5666281, 5713079, 5754891, 5790102, 5817095, 5834939, 5843905, 5845063, 5839070, 5825662, 5804395, 5775087, 5737078, 5688860, 5629176, 5558183, 5477190, 5387882, 5292230, 5192372, 5089719, 4984529, 4876903, 4767705, 4657989, 4548214, 4438808, 4330809, 4224920, 4120326, 4015535, 3910295, 3805864, 3703558, 3603900, 3507061, 3413265, 3322683, 3235522, 3152232, 3073128, 2998041, 2926955, 2860648, 2799798, 2743596, 2690249, 2639020, 2591022, 2547748, 2509505, 2475516, 2444942, 2417464, 2393212, 2372442, 2355171, 2341026, 2329430, 2319692, 2310886, 2302278]
53234B302278p949n634k066J148L382N548Q256J0879J2968J5184J8000K0778K3110
53221B405882K5699K8927L1764L3519L5333L8454M2093M4576M5751M6520M6891
53210B825409M6440M5974M6536M7135M5792M2709M0134L8703L6482L2346K8041
53199C275701K5562K4380K2803K0600J8442J5944J2130P393L173k55m181r552
53187C412140j5781k1778k7217l2414l7624m2806m7615n1473n4093n6054n8297
53176B966988o0880o2692o2837o1794o0860o0645o0696o0348n9418n7931n5849
53165B303038n3495n1804n1564n2511n3611n4131n3979n3193n1800n0185m8848
53154A727917m7490m5153m1693l8347l6184l4617l2409k9705k7965k7986k8913
$$ y = [2302278, 2294329, 2288695, 2286629, 2287777, 2291159, 2296707, 2304963, 2315842, 2328810, 2343994, 2361994, 2382772, 2405882, 2431581, 2460508, 2492272, 2525791, 2561124, 2599578, 2641671, 2686247, 2731998, 2778518, 2825409, 2871849, 2917823, 2964359, 3011494, 3057286, 3099995, 3140129, 3178832, 3215314, 3247660, 3275701, 3301263, 3325643, 3348446, 3369046, 3387488, 3403432, 3415562, 3422955, 3426128, 3425873, 3421692, 3412140, 3396359, 3374581, 3347364, 3314950, 3277326, 3234520, 3186905, 3135432, 3081339, 3025285, 2966988, 2906108, 2843416, 2780579, 2718785, 2657925, 2597280, 2536584, 2476236, 2416818, 2358887, 2303038, 2249543, 2197739, 2146175, 2093664, 2040053, 1985922, 1931943, 1878750, 1826950, 1776765, 1727917, 1680427, 1635274, 1593581, 1555234, 1519050, 1484433, 1452024, 1422319, 1394354, 1366368, 1337455]
53143A337455k9381k8834k7486k5804k4359k3585k3252k2541k1009j9209j8120
53132A073875j8113j8733j9281j9393j9144j8656j7735j6207j4725j4704j6740
53121H80444j9452k0690j9893j8524j8065j8450j8729j8456j7875j7278j6847
53110F76185j6658j6438j5570j3884j2175j1398j1565j1807j1465j0673r881r236
53098E25435q532p718p278p827r164r983r135p083n409m837m624m135l937m596
53084D31177n338n066m037l385l308l000k260j803j891j862j449j344j941k568
53070C91925k653k637k903k752j478K09R88O86J33k61o08n12O13K201K859K345
53054C88155K029K869M137M724M710M770M879M534L717K749J603Q9j575l086m555
$$ y = [1337455, 1308074, 1279240, 1251754, 1225950, 1201591, 1178006, 1154754, 1132213, 1111204, 1091995, 1073875, 1055762, 1037029, 1017748, 998355, 979211, 960555, 942820, 926613, 911888, 897184, 880444, 860992, 840302, 820409, 801885, 783820, 765370, 746641, 728185, 710310, 693032, 676185, 659527, 643089, 627519, 613635, 601460, 590062, 578497, 566690, 555225, 544552, 534671, 525435, 516903, 509185, 501907, 494080, 484916, 474933, 465798, 458715, 453306, 448469, 443845, 439710, 435773, 431177, 425839, 420773, 416736, 413351, 410043, 407043, 404783, 402980, 401089, 399227, 397778, 396434, 394493, 391925, 389272, 386635, 383732, 380980, 379502, 379711, 380699, 381385, 381518, 381257, 380649, 380137, 380750, 382951, 385810, 388155, 390184, 393053, 397190, 401914, 406624, 411394, 416273, 420807, 424524, 427273, 428876, 428965, 427390, 424304, 419749]
53039D19749o033o881o526n466m767m663m500m023l788m212m895n115m594l700
53025C50586l264m001n660o901o641n316m245l977l954l578k789j714p02n71j849
53010B95424l674m484l874k884k361k132k032k496l631m646m801m027k345J67
52996B52204K385K432j2k822l873l379k812k493j769p75m23r08j625k296k946
52981B30888k994j864m26l11j595k529k057j277j662k868l179j648Q35K374J676
52966B13363p94l045l336j888m24j14o48j295j861k270k080j088R9P04N83N9o55
52949A95310j343j543r44J47J155J761J857J269J21q43r23l96k35q21j372q82
52933A92318O52K179K609J767M42l72k53L33N38N0m61N8J789L589M104L125J634
$$ y = [419749, 413716, 406835, 400309, 394843, 390076, 385413, 380913, 376890, 373102, 368890, 363995, 358880, 354286, 350586, 347322, 343321, 337661, 330760, 324119, 318803, 314558, 310581, 306627, 303049, 300260, 298546, 297844, 297273, 295424, 291750, 287266, 283392, 280508, 278147, 276015, 273983, 271487, 267856, 263210, 258409, 254382, 252037, 252204, 254589, 257021, 257009, 254187, 250314, 246935, 244123, 241630, 239861, 239086, 238663, 237755, 236130, 233834, 230888, 227894, 226030, 225604, 225293, 223698, 221169, 219112, 217835, 216173, 213305, 210126, 208478, 209313, 211687, 213363, 212569, 209524, 206188, 204300, 203876, 203762, 203114, 201819, 199958, 197688, 195608, 194520, 194619, 195323, 195906, 195965, 195310, 193967, 192424, 191480, 191627, 192782, 194543, 196400, 197669, 197790, 196947, 196024, 195628, 195393, 194572, 193200, 192318, 192970, 195149, 197758, 199525, 199967, 199595, 199342, 199675, 200213, 200263, 199802, 199860, 201649, 205238, 209342, 212467, 214101]
52916B14101O49N06J187K517L870M374L854L158L106L623M234M831N426N725N611
52901B66772N536N748N677M790L581K775K117R84k28o02k30L3J22O55J232N11
52885B99473j702l867m724m532l797k357n35L33k88r91m27M92r3k215m147m776
52869B65847m508m013l370k526j526k77R29J019o31k651k758n82J828K599J876
52854B51256O37r14k742l790k823l41J547J431J54l46O47J915J962R15K83R32
52838B50723J995K147J365P03P53J240J876K617K998K253M88j090j463p38L91
52823B66258J363J617P35p08j246l08R21J074M29J82N99J043J419K218L274L650
52807B82520K983K000J497J653K286K885K428L65k003k540j010N12N95L85J575
$$ y = [214101, 214750, 215256, 216443, 218960, 222830, 227204, 231058, 234216, 237322, 240945, 245179, 250010, 255436, 261161, 266772, 272308, 278056, 283733, 288523, 292104, 294879, 296996, 297980, 297752, 297150, 296920, 296953, 297075, 297730, 298962, 299473, 297771, 293904, 289180, 284648, 280851, 278494, 277959, 278292, 278004, 277013, 276586, 277078, 276985, 274770, 270623, 265847, 261339, 257326, 253956, 251430, 249904, 249627, 250556, 251575, 250944, 248293, 245535, 244953, 246781, 249380, 251256, 251893, 250979, 248237, 244447, 241624, 241283, 242830, 244261, 244415, 244069, 244716, 246631, 248593, 249508, 249791, 250723, 252718, 254865, 256230, 256933, 257686, 258926, 260802, 263419, 266417, 268670, 269158, 268068, 266605, 265867, 266258, 267621, 269238, 269973, 269265, 268019, 267711, 268632, 269706, 270135, 270317, 270916, 271959, 273378, 275596, 278870, 282520, 285503, 287503, 289000, 290653, 292939, 295824, 298252, 298617, 296614, 294074, 293064, 293576, 294171, 294556, 296131]
52792B96131L689M834M322L101K143J883K842N202P697Q443P155N411M566M531
52778C61950M848N499O108N545L309N29j253j753j780j982k397k872l197l145
52764C69409k800k659k993l557m117m814n659o215o170n704m906l554j950j241
52750C13070k206m170n788o394n989m667k839j556j583k376k763k321j425m71
52736B68522J14l77k117l990m735m500m245l952k801r85J45n2p53j088j107j018
52720B37061p27n63j163k139k092o90M62O3r82j108n74q63k095k759k108j318
52704B18405j761l164m097l673k177m81N05J06j670l827n024m838m036l415k710
52689A78143j342J67M98m32r15K82J939J924J46j490j851j709j795j462k24P42
$$ y = [296131, 299820, 304654, 308976, 312077, 314220, 316103, 318945, 324147, 331844, 340287, 347442, 352853, 357419, 361950, 366798, 372297, 378405, 383950, 387259, 387788, 386535, 384782, 383002, 381020, 378623, 375751, 372554, 369409, 366609, 363950, 360957, 357400, 353283, 348469, 342810, 336595, 330425, 324721, 319815, 316261, 314311, 313070, 310864, 306694, 300906, 294512, 288523, 283856, 281017, 279461, 277878, 275502, 272739, 270418, 268993, 268522, 268636, 268259, 266142, 262152, 257417, 252917, 248672, 244720, 241919, 240934, 241079, 241027, 240274, 239186, 238079, 237061, 236334, 235771, 234608, 232469, 230377, 229687, 230149, 230212, 229230, 228122, 227548, 226685, 224590, 221831, 219723, 218405, 216644, 213480, 209383, 205710, 203533, 203052, 203557, 203663, 201993, 198166, 193142, 188304, 184268, 180853, 178143, 176801, 176968, 177466, 177034, 176119, 176401, 178340, 180264, 180410, 178920, 177069, 175360, 173565, 172103, 171879, 172621]
52673A72621Mj935l164k743j377o4Q36J093L92r46j849j598n92L37Q87J172J177
52656A64251Q80N93N77M84j82j051j226q20j203k971m533l915j511M31R46J342
52640A52092K658M037M552M978O221P309O830N414M700M472L165R98J42J284K371
52625B11223J572m58k294l743m852m643k551l5R40K66p42j353j721j872j786k028
52609A85923k994l951l952l311l046l290l428l432l809m504m879m669l885k192
52595A34581M75K886L416K023L37l36j76o0m78j332k062j972r96Q9P41J310J988
52578A40434J893M47j058q97N49J334Q21J80O9k22p88l59J543L235K954J155l89
52561A50901q40o30k14K97P09Q51R02J042J078Q18L28l96j346j856j034N65Q88
$$ y = [172621, 172625, 170690, 167526, 164783, 163406, 163342, 164178, 165271, 165663, 164717, 162868, 161270, 160678, 161015, 161902, 163074, 164251, 165131, 165724, 166301, 166785, 166603, 165552, 164326, 163506, 162303, 159332, 154799, 150884, 149373, 149804, 150750, 152092, 154750, 158787, 163339, 168317, 174538, 181847, 188677, 194091, 198791, 203263, 206428, 207426, 207568, 208852, 211223, 212795, 212337, 210043, 206300, 201448, 196805, 194254, 194219, 195159, 195425, 194683, 193330, 191609, 189737, 187951, 185923, 182929, 178978, 175026, 171715, 168669, 165379, 161951, 158519, 154710, 150206, 145327, 140658, 136773, 134581, 135056, 137942, 141358, 143381, 143718, 143382, 143206, 143146, 142668, 141336, 139274, 137302, 136306, 136395, 137136, 138446, 140434, 142327, 142774, 141716, 140819, 141368, 142702, 143523, 143703, 143772, 143550, 142762, 142403, 143946, 147181, 150135, 151290, 150901, 150061, 149431, 149217, 149514, 150223, 151074, 151976, 153018, 154096, 154914, 155242, 154846, 153500, 151644, 150610, 151175, 152063]
52544A52063j044l371l463j152J420K725L174L527L476K581J551J655L021M247
52530A70410L932K229O44K69N85K98r15k040k034q64R17K829M351M834M095K659
52514A92199J031o71j922j530Q63L515M100K355J91q14q92q04l34J106L048M214
52498B05655L973K854J561K33j109j951j647l50R69J528J437J275J266J259J278
52483B18231J515J792J532N30n85r23k01J165K467L024K394P49j094k280k494
52468B25822j835m72J254K546K576J270n39j693j470NJ667K148J003o71j346o91
52452B29574L56J047J554K062K105J403P64J184K393L166K979K391J710M02j615
52437B51475l030k493n13J036J134M92J83L40N46O76P27M37j32p8J390L433M022
$$ y = [152063, 151019, 147648, 144185, 143033, 144453, 147178, 150352, 153879, 157355, 159936, 161487, 163142, 166163, 170410, 174342, 176571, 177215, 177484, 178069, 178367, 177452, 175412, 173378, 172514, 173431, 176260, 180611, 185445, 189540, 192199, 193230, 192559, 190637, 189107, 189970, 193485, 197585, 199940, 200131, 199317, 198425, 197621, 197287, 198393, 201441, 205655, 209628, 212482, 214043, 214276, 213167, 211216, 209569, 209219, 210188, 211716, 213153, 214428, 215694, 216953, 218231, 219746, 221538, 223070, 223600, 223015, 222092, 221891, 223056, 225523, 228547, 230941, 231690, 230596, 228316, 225822, 223987, 223515, 224769, 227315, 229891, 231161, 230622, 228929, 227459, 227464, 229131, 231279, 232282, 231611, 230265, 229574, 229930, 230977, 232531, 234593, 236698, 238101, 238865, 240049, 242442, 245608, 248587, 250978, 252688, 253090, 251475, 248445, 245952, 245439, 246475, 247609, 248101, 248284, 248624, 249170, 249846, 250573, 251010, 250878, 250800, 252190, 255623, 259645]
52420B59645K195o74k391k312j555j126p31K67J586K423K694K890K844J699m44
52405B67010j974j515M10K247L239L472K868J550Q07J983M265N148L566J114m04
52390B93786j168k120k953k713j586p42q12j532k440k888k051P4K034K457J704
52375B79050J060P38mj224k193k731l269l529k679r02N28J025J332K047K674K580
52359B74503J880Q91k38j044r51l83m73j201j118L26J485P91o71m61J814L880
52343B79030L658J584l31q52m06j7l4M5O80J610K179K151J916J936K262K500K034
$$ y = [259645, 261840, 261166, 258775, 256463, 254908, 253782, 253051, 253318, 254904, 257327, 260021, 262911, 265755, 267454, 267010, 265036, 263521, 263931, 266178, 269417, 272889, 275757, 277307, 278114, 280097, 284362, 289510, 293076, 294190, 293786, 292618, 290498, 287545, 284832, 283246, 282504, 281692, 280160, 277720, 274832, 272781, 272855, 274889, 277346, 279050, 280110, 280848, 280844, 279620, 277427, 274696, 271427, 267898, 265219, 264317, 264845, 265870, 267202, 269249, 271923, 274503, 276383, 277274, 277036, 275992, 275041, 274658, 274185, 272984, 271866, 272192, 273677, 274468, 273797, 273336, 275150, 279030, 282688, 284272, 283941, 283089, 282683, 282666, 282632, 282677, 283357, 284967, 287146, 289297, 291213, 293149, 295411, 297911, 299945]
$$ [...]
##END NTUPLES=NMR SPECTRUM
##END=
