##TITLE=coffee_type TOFR01-ROVE100A_85-15%
COFFEE_meoh_noesyp64 COFFEE_meoh {C:\Bruker\TOPSPIN} Administrator 13
##JCAMPDX= 6.0         $$ Bruker NMR JCAMP-DX V2.0
##DATA TYPE= NMR SPECTRUM
##DATA CLASS= NTUPLES
##ORIGIN= Bruker BioSpin GmbH
##OWNER= Administrator
$$ 1.72 TOPSPIN		Version 2.1
$$ 2012-05-18 15:41:48.745 -0700  Administrator@X
$$ Compression mode = diff/dup
##.OBSERVE FREQUENCY= 400.13188235
##.OBSERVE NUCLEUS= ^1H
##.ACQUISITION MODE= SIMULTANEOUS (DQD)
##.ACQUISITION SCHEME= undefined
##.AVERAGES= 64
##.DIGITISER RES= 22
##SPECTROMETER/DATA SYSTEM= spect
##.PULSE SEQUENCE= noesygpps1d.comp
##.SOLVENT NAME= COFFEE_meoh
##.SHIFT REFERENCE= INTERNAL, COFFEE_meoh, 1, 14.98061
##AUDIT TRAIL= $$ (NUMBER, WHEN, WHO, WHERE, PROCESS, VERSION, WHAT)
$$ ##TITLE= Audit trail, TOPSPIN		Version 2.1
$$ ##JCAMPDX= 5.01
$$ ##ORIGIN= Bruker BioSpin GmbH
$$ ##OWNER= Administrator
$$ $$ C:\Bruker\TOPSPIN/data/Administrator/nmr/12-COFFEE-2002/132/pdata/1/auditp.txt
$$ ##AUDIT TRAIL=  $$ (NUMBER, WHEN, WHO, WHERE, PROCESS, VERSION, WHAT)
(   1,<2012-02-21 01:10:50.234 -0500>,<Administrator>,<TOPSPIN>,<go>,<TOPSPIN 2.1>,
      <created by zg
	started at 2012-02-21 00:59:20.078 -0500,
	POWCHK enabled, PULCHK disabled,
       configuration hash MD5:
       B0 76 FB 9C 50 81 44 7D 18 B3 26 32 4E 60 AD 96
       data hash MD5: 64K
       6A 37 E5 61 CF DF 82 06 69 C6 83 A3 A3 75 01 C9>)
(   2,<2012-02-21 01:10:52.906 -0500>,<Administrator>,<TOPSPIN>,<proc1d>,<TOPSPIN 2.1>,
      <Start of raw data processing
       efp LB = 0.3 FT_mod = 6 PKNL = 1 PHC0 = 0 PHC1 = 0 SI = 128K 
       data hash MD5: 128K
       DE 0E 56 87 66 A1 B8 FC 85 26 B1 40 54 46 1E 51>)
(   3,<2012-02-21 01:10:54.203 -0500>,<Administrator>,<TOPSPIN>,<proc1d>,<TOPSPIN 2.1>,
      <pk PHC0 = 21.91223 PHC1 = 0 
       data hash MD5: 128K
       96 8D 38 66 C3 31 2B 36 46 CE 82 4E 47 1C 52 B8>)
(   4,<2012-02-21 01:10:54.453 -0500>,<Administrator>,<TOPSPIN>,<proc1d>,<TOPSPIN 2.1>,
      <abs ABSG = 1 
       data hash MD5: 128K
       BD 78 AC 19 78 56 36 61 12 EC 0C 79 C7 14 40 D8>)
(   5,<2012-02-21 01:10:54.547 -0500>,<Administrator>,<TOPSPIN>,<proc1d>,<TOPSPIN 2.1>,
      <abs ABSG = 2 
       data hash MD5: 128K
       25 99 B9 D6 DE F1 B8 15 12 DA 8B 96 0C 00 44 62>)
(   6,<2012-02-21 01:10:54.594 -0500>,<Administrator>,<TOPSPIN>,<proc1d>,<TOPSPIN 2.1>,
      <abs ABSG = 3 
       data hash MD5: 128K
       0E A7 3C 79 E1 37 36 82 E4 13 DD BA F4 67 D2 80>)
(   7,<2012-02-21 01:10:54.672 -0500>,<Administrator>,<TOPSPIN>,<proc1d>,<TOPSPIN 2.1>,
      <abs ABSG = 4 
       data hash MD5: 128K
       AD 6C 5F 00 A2 2D D8 44 49 59 B3 BB 9E 7C 04 8F>)
(   8,<2012-02-21 01:10:54.734 -0500>,<Administrator>,<TOPSPIN>,<proc1d>,<TOPSPIN 2.1>,
      <abs ABSG = 5 
       data hash MD5: 128K
       53 F7 72 E7 4B 1F 94 F9 96 3D 5F 2C CC C8 1A 38>)
(   9,<2012-02-21 01:10:54.859 -0500>,<Administrator>,<TOPSPIN>,<audit>,<TOPSPIN 2.1>,
      <user comment:
       ICON-NMR User ID: Administrator
$$ [...]
150 150 150 150 150 150 150 150
##$TP07= 0
##$TPNAME0= <>
##$TPNAME1= <>
##$TPNAME2= <>
##$TPNAME3= <>
##$TPNAME4= <>
##$TPNAME5= <>
##$TPNAME6= <>
##$TPNAME7= <>
##$TPOAL= (0..7)
0.5 0.5 0.5 0.5 0.5 0.5 0.5 0.5
##$TPOFFS= (0..7)
0 0 0 0 0 0 0 0
##$TUNHIN= 0
##$TUNHOUT= 0
##$TUNXOUT= 0
##$USERA1= <user>
##$USERA2= <user>
##$USERA3= <user>
##$USERA4= <user>
##$USERA5= <user>
##$V9= 5
##$VALIST= <valist>
##$VCLIST= <CCCCCCCCCCCCCCC>
##$VD= 0
##$VDLIST= <DDDDDDDDDDDDDDD>
##$VPLIST= <PPPPPPPPPPPPPPP>
##$VTLIST= <TTTTTTTTTTTTTTT>
##$WBST= 1024
##$WBSW= 4
##$XGAIN= (0..3)
0 0 0 0
##$XL= 0
##$YL= 0
##$YMAX_a= 14692225
##$YMIN_a= -6819179
##$ZGOPTNS= <>
##$ZL1= 120
##$ZL2= 120
##$ZL3= 120
##$ZL4= 120
##$ABSF1= 14.98061
##$ABSF2= -5.57192
##$ABSG= 5
##$ABSL= 3
##$ALPHA= 0
##$AQORDER= 0
##$ASSFAC= 0
##$ASSFACI= 0
##$ASSFACX= 0
##$ASSWID= 0
##$AUNMP= <proc_prof1d_extract>
##$AXLEFT= 0
##$AXNAME= <>
##$AXNUC= <1H>
##$AXRIGHT= 0
##$AXTYPE= 0
##$AXUNIT= <>
##$AZFE= 0.1
##$AZFW= 0.1
##$BCFW= 0
##$BC_mod= 0
##$BYTORDP= 0
##$COROFFS= 0
##$CY= 15
##$DATMOD= 1
##$DC= 0
##$DFILT= <>
##$DTYPP= 0
##$F1P= 0
##$F2P= 0
##$FCOR= 0.5
##$FTSIZE= 131072
##$FT_mod= 6
##$GAMMA= 0
##$GB= 0
##$INTBC= 1
##$INTSCL= 1
##$ISEN= 128
##$LB= 0.3
##$LEV0= 0
##$LPBIN= 0
##$MAXI= 10000
##$MC2= 0
##$MEAN= 0
##$ME_mod= 0
##$MI= 0
##$NCOEF= 0
##$NC_proc= -3
##$NLEV= 6
##$NOISF1= 0
##$NOISF2= 0
##$NSP= 0
##$NTH_PI= 0
##$NZP= 0
##$OFFSET= 14.98061
##$PC= 1
##$PHC0= 21.91223
##$PHC1= 0
##$PH_mod= 1
##$PKNL= yes
##$PPARMOD= 0
##$PPDIAG= 0
##$PPIPTYP= 0
##$PPMPNUM= 2147483647
##$PPRESOL= 1
##$PSCAL= 4
##$PSIGN= 0
##$PYNMP= <proc.py>
##$REVERSE= no
##$SF= 400.13
##$SI= 131072
##$SIGF1= 0
##$SIGF2= 0
##$SINO= 400
##$SIOLD= 131072
##$SPECTYP= <>
##$SREGLST= <1H.CDCl3>
##$SSB= 0
##$STSI= 131072
##$STSR= 0
##$SW_p= 8223.68421052632
##$SYMM= 0
##$S_DEV= 0
##$TDeff= 65536
##$TDoff= 0
##$TI= <>
##$TILT= no
##$TM1= 0
##$TM2= 0
##$TOPLEV= 0
##$USERP1= <user>
##$USERP2= <user>
##$USERP3= <user>
##$USERP4= <user>
##$USERP5= <user>
##$WDW= 1
##$XDIM= 131072
##$YMAX_p= 501225498
##$YMIN_p= -210165946
##$CURPLOT= <Network HP LaserJet P1505>
##$CURPRIN= <$Network HP LaserJet P1505>
##$DFORMAT= <normdp>
##$LAYOUT= <+/1D_H.xwp>
##$LFORMAT= <normlp>
##$PFORMAT= <normpl>
##$SURQMSG= 1
$$ End of Bruker specific parameters
$$ ---------------------------------
##NTUPLES= NMR SPECTRUM
##VAR_NAME=  FREQUENCY,     SPECTRUM/REAL,   SPECTRUM/IMAG
##SYMBOL=    X,             R,               I
##VAR_TYPE=  INDEPENDENT,   DEPENDENT,       DEPENDENT
##VAR_FORM=  AFFN,          ASDF,            ASDF
##VAR_DIM=   131072,        131072,          131072
##UNITS=     HZ,            ARBITRARY UNITS, ARBITRARY UNITS
##FACTOR=    0.0627417313425165, 1,          1
##FIRST=     8223.62146879498, 5932,         -96171
##LAST=      0,             8410,            -95775
##MIN=       0,             -210165946,      0
##MAX=       8223.62146879498, 501225498,    0
$$ Real data points
##PAGE= N=1
##DATA TABLE= (X++(R..R)), XYDATA
$$ [...]
66813 4383307 4378546 4371747 4363302 4354011 4343978 4332783 4320285 4306376 4290439 4272181 4252716 4233667
66801 4233667 4215244 4196257 4175989 4154967 4133799 4112222 4089511 4064959 4037883 4008245 3977551
66790 3977551 3948185 3921357 3896173 3870702 3843181 3812312 3777754 3740951 3704588 3670486 3638362
66779 3638362 3606771 3574615 3541625 3508107 3474575 3441196 3407713 3374493 3343052 3314187 3285882
66768 3285882 3254891 3220704 3186132 3153348 3121150 3087230 3051547 3015928 2981452 2947779 2914367
66757 2914367 2880949 2847265 2813436 2780257 2748212 2716725 2685099 2653452 2622020 2590564 2559561
66746 2559561 2530736 2504826 2479708 2452576 2423385 2394236 2365786 2336560 2306068 2276404 2249724
66735 2249724 2225661 2202251 2178256 2153489 2127716 2100602 2072623 2045169 2019467 1995637 1972773
66724 1972773 1949845 1926512 1903039 1879553 1855923 1832519 1810315 1789532 1768805 1746719 1723804
66713 1723804 1701942 1681909 1662692 1643358 1624417 1606796 1590264 1573572 1555878 1537615 1520000
66702 1520000 1503745 1488213 1472060 1454746 1436764 1418254 1398542 1377972 1359072 1344229 1332716
66691 1332716 1321624 1309483 1297160 1285305 1273064 1259899 1246620 1233577 1219556 1203843 1188051
66680 1188051 1174300 1162480 1150822 1138460 1125881 1113259 1100070 1086489 1073768 1062770 1053014
66669 1053014 1043556 1034067 1024613 1014907 1004358 992821 981030 970154 960796 952474 944312 936203 928843
66656 928843 922494 916282 909095 900782 892106 883901 876551 869804 862694 854147 844160 833959 824668 816406
66642 816406 809120 803316 798877 793965 786563 777037 767825 760494 754317 748041 741739 736218 731599 727404
66628 727404 723419 719558 715191 709475 702448 695254 689173 684595 680740 676197 670022 662668 655726 650482
66614 650482 646849 643797 640349 635855 629852 622488 614882 608325 603000 598038 592815 587549 582601 577957
66600 577957 573781 570734 569071 567787 565294 560891 555225 549547 544897 541630 539060 535622 530081 522810
66586 522810 515547 509845 506063 503761 502388 501350 499920 497648 494658 491298 487565 483132 477828 471994
66572 471994 466323 461361 457099 453183 449578 446765 444995 443689 442079 440184 438543 437196 435767 434371
66558 434371 433369 432026 428659 422810 416339 411516 408683 406554 404162 401546 399021 396852 395503 395200
66544 395200 395280 394645 392805 389935 386256 382135 378497 376146 374752 373392 372007 371310 371204 370454 368259 365219
66528 365219 362297 359633 356890 354115 351718 350071 349420 349616 349600 347872 344151 340126 337911 337968 338976 339459
66512 339459 339024 338182 337480 336896 335935 334316 332558 331551 331340 330672 328118 323530 318211 313755 310885 309324
66496 309324 308487 308122 308184 308254 307570 305828 303535 301159 298370 294715 290671 287203 284520 282149 280077 278762
66480 278762 277923 276501 274220 272179 271311 271207 271077 270911 270783 269830 267203 263718 261351 260921 261108 260103
66464 260103 257664 255198 254093 254386 255104 255650 256310 257178 257148 254894 250770 246848 244797 244534 245126 245942 246331
66447 246331 245227 242246 238701 236487 236089 236314 235768 233974 231412 229147 228201 228634 229391 229543 229266 229030
66431 229030 228407 226635 223997 221593 219825 218130 216252 214798 214282 214450 214838 215355 216062 216868 217565 217742
66415 217742 216786 214680 212705 212449 213852 215015 214185 211229 207036 202485 198454 195875 195016 195254 196144 198000
66399 198000 200746 203048 203716 203594 204739 207681 210563 211257 209428 206150 202401 198705 195699 194002 193421
66384 193421 192908 191670 190128 189518 190662 193201 195931 197725 198145 197398 195938 194171 192323 190389 188193
66369 188193 185667 183137 181101 179650 178384 177258 177293 179817 184736 190043 193572 195049 195891 197061 197754
66354 197754 196545 193365 189742 187111 185376 183440 180890 178583 177384 176803 175521 173192 171005 170102 170149
66339 170149 170028 169430 168846 168290 167109 165227 163578 162851 162570 161952 161057 160491 160487 160946 161952 163409 164338 163360
66321 163360 160104 155742 152016 150010 149771 150698 152072 153471 154870 156347 157732 158613 158578 157458 155475
66306 155475 153213 151255 149856 149181 149713 151747 154300 155297 153464 149803 146689 145730 146770 148551 149801
66291 149801 150042 149944 150726 152701 154625 154989 153633 151448 148798 145250 140891 136846 133992 131959 130019
66276 130019 128433 128158 129388 131101 132197 132568 132789 133111 133273 133187 133232 133635 134035 134153 134517 135795 137525
66259 137525 138347 137702 136504 135783 135432 134873 134284 134356 135134 135868 135905 135216 134144 133103 132411 132059 131809 131635
66241 131635 131623 131232 129322 125493 120894 117176 115197 115269 117742 122238 126858 129439 129510 128202 126693 125757
66225 125757 126235 128373 130822 131853 131723 132390 134666 137178 138581 139268 140099 140823 140761 139987 138730 136464
66209 136464 132757 128482 125157 123425 122984 123589 125174 127188 128658 129048 128676 128355 128773 129847 130538 129760
66193 129760 127636 125232 123026 120702 118772 118918 121676 124986 126491 126507 127125 128875 130105 129666 128474
66178 128474 127833 127618 126936 125650 124470 124088 124843 126638 128588 129147 127380 124040 121019 119736 120235 121592
66162 121592 122863 123667 124062 124039 123309 121709 119555 117290 114978 112651 111003 110957 112356 113751 113967 113379
66146 113379 113063 113036 112144 109688 106473 103924 102649 102324 102621 103562 104914 105916 106092 105976 106637 108702 112161
66129 112161 116724 121657 125571 127359 127446 127209 126994 125793 123293 120938 119977 119593 118376 116883 116958 118696
66113 118696 119926 119016 116634 114189 112108 110587 110605 112751 115832 118000 118795 118966 118834 118225 117758 118551
66097 118551 120374 121447 120614 118666 116924 115496 113642 111130 108454 106288 105417 106584 109487 112327 113352
66082 113352 112741 112181 112662 113552 113850 113481 113097 113280 114247 115796 117314 118243 118678 119031 119109 118219 116302 114206
66064 114206 112517 110926 109196 107940 107765 108320 108940 109677 110806 111878 112301 112598 113899 116136 117764 117580
66048 117580 116030 114389 113307 112581 111801 110790 109625 108586 107994 108049 108926 110794 113403 115877 117353 117699
66032 117699 117160 115643 113114 110525 109400 110348 112694 115556 118384 120441 120996 120540 120676 122070 123371
66017 123371 123038 121517 120618 121204 122445 123103 122599 120990 118872 117422 117685 119448 121272 121877 121198 120033
66001 120033 119144 118907 119443 120673 122297 124027 125871 127997 130103 131125 130102 127473 124995 123899 123595
65986 123595 122846 121728 121337 121679 121249 119136 116410 114699 114308 114590 115358 116854 118734 120113 120569 120487 120512
65969 120512 121008 121690 121498 119587 117013 116455 119238 123341 125679 125800 125808 126899 127843 127259 125789 125055 125579
65952 125579 126717 127979 129365 130716 131577 131765 131632 131673 132025 132371 132309 131943 131919 132704 134037 135443 136934
65935 136934 138703 140471 141888 143310 145273 147325 148510 149100 150581 153546 156781 159129 161090 163547
65921 163547 165820 166332 164852 162911 162062 162615 163997 165362 165795 164849 163208 162151 162104 162351 162370 162605 163395
65904 163395 163902 163082 161450 160824 162104 164091 164978 164424 163563 163380 163895 164802 165979 167040 167235 166353 165155
65887 165155 164162 162476 158845 153831 149929 149080 150712 152596 153149 152515 151961 152826 155745 160069 163910 165350
65871 165350 164091 161795 160426 160223 159615 157365 154465 153285 154834 157589 159380 159656 159243 158584 157461
65856 157461 156183 155587 155576 154933 153200 151608 151317 151680 151372 150499 150187 150440 149927 148132 146423 146411 148187
65839 148187 150816 153697 156527 158501 158654 157104 155110 153728 152948 152364 152101 152589 153800 155282 156851
65824 156851 158646 160393 161201 160570 159382 159383 161609 165484 169427 172031 172778 172078 170904 170074 169598 168831 167389
65807 167389 165652 164121 162654 160846 158991 157963 157956 158041 157403 156517 156426 157079 157191 155874 153751 152139 151574
65790 151574 151517 151146 150102 148800 148356 149826 153022 156371 158368 158767 157925 155786 152642 150260 150472 152436
65774 152436 152923 150041 145285 141141 138170 135817 134678 135901 138873 141535 143037 144327 145832 146271 144539
65759 144539 141515 139152 138679 140284 143514 147093 149114 148491 145962 143131 140932 139528 138954 138995 138892 138082
65743 138082 137023 136515 136444 136007 135044 134411 134993 137032 140356 144451 148126 149948 149541 148053 146943 146547
65727 146547 146169 145250 143912 142351 140316 137543 134546 132447 131800 131837 131193 129342 127064 125593 125680 127391
65711 127391 130296 133610 136447 138245 138900 138576 137696 136977 136834 136542 134653 130760 126445 124056 124721 127715
65695 127715 131215 133327 133062 131098 129336 129027 129544 129528 128818 128364 128535 128625 128061 126976 125255 122162 117590
65678 117590 112813 109125 106329 103556 101176 100727 102834 106116 108555 109303 108832 107931 107117 106669 106560 106381
65662 106381 105771 104967 104602 104988 105916 107124 108559 110121 111520 112573 113235 113195 111910 109415 106703 104764
65646 104764 103486 102009 99988 97818 95657 93065 89992 87636 87725 90927 96143 101285 104757 106435 107337
65631 107337 108215 108517 107125 104010 100655 98587 98043 98331 98970 99888 100846 101401 101469 101464 101802 102526 103400 103996
65613 103996 103723 102224 99930 97931 97041 97134 97629 98448 100158 103042 106306 108554 109066 108347 107349 106558 106114
65596 106114 106429 107945 110219 111809 111445 109125 105914 102986 101018 100155 100183 100719 101418 101950 101916 101189 100466
65579 100466 101069 103679 107293 109689 109091 105483 100535 96281 93726 92600 92403 93351 95941 99882 104075
65564 104075 107651 110340 111745 111130 108470 105076 102490 101003 99796 98257 96589 95333 94830 95134 95945
65549 95945 96613 96603 96099 95930 96863 99065 102169 105617 108852 111346 112631 112613 111955 111843 112913 114586 115898
65532 115898 116687 117267 117219 115675 112977 110795 110028 109632 108336 106482 105128 104160 102651 100713 99658 100260
65516 100260 101797 102824 102265 99934 96797 94496 93816 93856 93537 93370 94496 96250 96358 93918 90854 89753
65500 89753 91315 94419 97694 100211 101478 101609 101159 100323 98776 96568 94404 92578 90513 88141 86917
65485 86917 88387 92117 96038 98647 100032 100845 101301 101393 101358 101506 101954 102687 103540 103973 103310 101478 99257
65468 99257 97550 96605 96131 95951 96177 96859 97870 99227 101076 103020 103851 102709 100602 99971 102233 106109
65452 106109 109013 109828 109743 110422 112108 113758 114554 114819 115515 117085 118937 120194 120812 121545 122693 123485 123159
65435 123159 122187 121828 122785 124867 127575 130187 131597 131072 129190 127254 125874 125001 125118 127081 130459 133264
65419 133264 133984 133033 131723 130707 130098 130288 131744 134373 137646 141037 144049 146359 148239 150219 152121
65404 152121 153249 153761 154765 156577 158083 158607 159078 160172 160577 158749 155557 153337 152669 151860 149569 146214
65388 146214 142665 139134 135841 133306 131348 128946 125721 122594 120385 118754 117159 115928 115616 116099 117006
65373 117006 118257 119380 119063 116501 112854 110365 110087 111160 112155 112401 112093 111868 112305 113245 113557 112149
65357 112149 109304 106518 104901 104264 103995 104299 106023 109308 112822 114541 113410 110306 107380 106356 107419
65342 107419 109612 112001 114286 116570 119056 121905 124936 127314 127963 126661 124506 122919 122274 121915 121498
65327 121498 121797 123819 127412 131187 133845 135323 136677 139101 142952 147313 150470 151347 150784 151046 153689
65312 153689 158115 162502 165902 169036 173278 179356 186931 194942 202348 208959 215626 223338 232259 241956
65298 241956 252286 263260 273993 282650 287868 289674 288695 285172 279385 272448 265658 259153 252061 244121
65284 244121 236431 230275 225711 221772 217715 213620 209906 206794 204368 202751 201801 200733 198488 194789
65270 194789 190641 187427 185452 183639 180723 176479 171663 167143 163386 160511 158404 156756 155228 153568
65256 153568 151431 148425 144694 141244 139034 137733 135942 132813 128913 125194 121749 118103 114342 111199
65242 111199 109134 107903 107109 106655 106491 106388 106211 106123 106299 106650 107003 107314 107551 107522 106976 105716 103583 100658
65224 100658 97640 95704 95647 97292 99813 102288 103718 103117 100282 96400 93254 91761 91628 92279 93475
65209 93475 94985 96303 96994 96934 96074 94453 92576 91197 90404 89514 88330 87860 89108 91543 93647 94833
65193 94833 96007 98131 101012 103754 105714 106605 106283 105117 104392 105643 109329 114256 118360 120075 119270
65178 119270 117312 116273 117648 121234 125054 126647 125037 121726 119448 119528 120512 119806 116577 112545 109863
65163 109863 108886 108436 107700 107123 107531 108975 110514 110688 108288 103270 97167 92163 89418 88473 88297 88406
65147 88406 88728 89083 89465 90502 92750 95526 97098 96306 93579 90287 87561 85933 85582 86467 88348 90827
65131 90827 93240 94577 94082 92031 89508 87232 85242 83852 83970 85840 88226 89746 90515 91525 92879
65116 92879 93737 93799 93631 93521 93178 92696 92665 92977 92726 91743 91084 91329 91529 90777 89888 90345 92267 94524 96374
65097 96374 97758 98347 97664 96234 95453 96007 97200 97983 97899 96956 95451 94172 94021 95176 97124 99515 102146
65080 102146 104166 104439 103162 102066 102328 103147 103176 102534 102376 103042 103875 104603 105664 107008 107740 107421 106850
65063 106850 107000 107831 108852 110300 112818 116082 118638 119434 118993 118687 119206 120085 120410 119539 117365 114486
65047 114486 112181 111671 113084 115390 117435 118709 119195 119231 119882 122643 127888 133916 138444 140998 143133
65032 143133 146304 150407 154550 158363 162037 165705 169393 173283 177553 182204 187344 193196 199408 204759
65018 204759 208184 209878 210888 211752 212146 211742 210753 209482 207949 206259 204853 203856 202310 198539 191567
65003 191567 182155 172362 163958 157147 150804 143950 136840 130554 125813 122527 120371 119220 118692 117694 115108
64988 115108 111063 107098 104642 103519 102326 100228 97907 96558 96466 97028 97824 98961 100330 101260 101246 100598
64972 100598 99986 99620 99226 98553 97523 96069 94290 92726 92088 92585 93735 94807 95209 94616 93128 91404
64956 91404 90273 90010 90262 90784 91911 94033 96812 99303 100783 101132 100455 98710 95935 92596 89396 86773
64940 86773 84733 83158 82067 81585 81860 83019 84933 86931 88080 88064 87577 87580 88298 89281 90212 91065 91575 91279
64922 91279 90352 89821 90533 92298 94398 96414 98057 98729 98139 97111 96834 97220 96927 95279 93339 92546 92905
64905 92905 93139 92103 89520 85902 82695 82029 84964 89730 92827 92482 90295 88964 89227 89936 90378 91112
64889 91112 92564 94123 95113 95688 96141 96084 95079 93564 92389 91734 91195 90695 90528 90689 90919 91389 92464
64872 92464 93756 94308 93985 93799 94444 95283 95417 94984 94659 94439 93861 93016 92282 91270 89211 86557 85114
64855 85114 85980 88078 89409 89331 88932 89337 90287 90500 89136 86725 84688 84043 84699 86011 87619 89293 90266
64838 90266 89648 87710 86014 85749 86471 86966 86879 86798 87116 87605 87915 87775 86775 84850 83046 82845 84281 85455
64820 85455 84564 81954 79618 79045 80201 82259 84473 86280 87360 88009 89060 91014 93412 95303 96179
64805 96179 96298 96305 96800 98110 100026 101626 101717 99786 96601 93693 92107 91645 91269 90156 88346 86513 85237
64788 85237 84495 83787 82748 81636 81135 81588 82571 83366 83768 84196 85087 86465 88038 89378 89862 88924 86675
64771 86675 84098 82306 81664 81844 82608 84217 86899 90068 92247 92096 89742 86868 85123 84568 84203 83790
64755 83790 84165 85503 86483 86005 84949 85037 86458 87846 88426 88856 89837 91139 92444 94017 95952 97607
64739 97607 98451 98734 98705 97938 96161 94165 93026 92869 93198 94055 95868 98348 100495 101833 102894 104277
64723 104277 105824 106998 107654 108107 108487 108218 106361 102786 98884 96510 96092 96439 96666 97317 99001 100923
64707 100923 101959 102434 103404 104573 104562 103293 102451 102998 103661 102750 100491 98493 97656 97664 98299 100167 103796
64690 103796 108415 111971 112636 110617 108231 107595 108343 108438 107204 106369 107540 109816 110868 109706 107314 105037
64674 105037 103425 102554 102468 103065 104110 105413 106607 107038 106462 105643 105515 105875 105674 104501 102901 101159 98787
64657 98787 95585 92359 90046 88764 88355 89210 91730 95325 98844 101918 105064 108354 110857 111807 111711 111589
64641 111589 111435 110183 107379 104301 102987 104265 106948 108974 109177 108066 107085 107213 108216 109094 109066 108064
64625 108064 106532 105208 105032 106699 109830 112871 114221 113496 111591 109774 108963 109503 111027 112552 113194
64610 113194 112883 112121 111114 109542 107186 104424 102107 101126 101918 103961 105982 107137 107972 109689 112610
64595 112610 115855 118257 118919 117135 112898 107645 103488 101292 100196 99202 98337 98039 98525 100171 103348
64580 103348 107166 109506 109269 107716 106675 106385 106190 106255 107031 107808 107662 107464 109009 112000 113773 112620
64564 112620 109955 108397 108839 110202 111107 110923 109755 108246 107204 106964 107308 107909 108338 107808 105903 103746
64548 103746 103327 105200 107767 109319 109768 109797 109538 109200 110014 113088 117660 121700 124071 125087 125230 124570
64532 124570 123519 122928 123038 123127 122510 121156 119165 116547 113899 112454 112777 113957 114761 115082 115598 116413 116994
64515 116994 117327 118237 120283 122997 125545 127563 128901 129059 127672 125370 123410 122242 121110 119405 117842
64500 117842 117679 119069 120878 122002 122188 121482 119800 117555 116135 116941 120014 124098 127956 130993 132549
64485 132549 131508 127527 122396 119213 119562 121818 122787 121023 118019 116165 116212 117133 117835 118183 118482 118800
64469 118800 119075 119423 120078 121237 123012 125088 126413 125859 123555 121105 120051 120400 121004 121044 120598 120002 119268
64452 119268 118237 116902 115471 114293 113734 113926 114675 115753 117059 118279 118719 117951 116534 115535 115253 114911
64436 114911 113870 112743 112907 114978 118032 120343 120819 119728 118101 116520 114688 112257 109747 108207 107998
64421 107998 108450 108883 109534 111101 113636 116365 118572 120190 121458 122392 122857 122907 122686 122081 120859 119211
64405 119211 117805 117062 116621 115864 114795 114047 114119 115059 116796 119145 121258 121836 120550 118862 118680 120296
64389 120296 122310 123518 124059 124535 124896 124809 124597 124966 125932 126649 126465 125777 125705 127062 129575 131933 132815 132188
64371 132188 131472 132013 133487 134289 133493 131847 130706 130616 131307 132489 133980 135313 135936 135904 135878 136379 137364 138573
64353 138573 139935 141540 143561 146333 150123 154593 158717 161426 162305 161676 160295 159000 158282 157984 157613
64338 157613 157012 156484 156209 156006 155781 155690 155591 154970 153953 153781 155484 158328 160410 160625 159244 156736 153195
64321 153195 149223 146242 145166 145383 145667 145514 144937 143586 141171 138610 137775 139799 144077 148900 152623
64306 152623 154332 154061 152538 150310 147241 143448 140441 140161 142568 145254 146161 145910 146573 148860 151564
64291 151564 153461 154497 155011 154842 153636 151474 149000 147382 148062 151589 156457 160067 161295 161328 161393 160768
64275 160768 158190 154559 152633 153886 156864 159097 159743 159828 160587 162290 164351 165943 166553 166345 166056 166371
64259 166371 167388 168703 169848 170661 171462 172956 175718 179601 183813 187586 190531 192420 193050 192499 191145
64244 191145 189245 186785 183962 181519 180376 181010 183180 185956 188090 188968 189424 191087 194578 198751 202042
64229 202042 204027 205277 206260 207175 208554 211151 215142 219892 224569 228595 231581 233382 234273 234705 234893
64214 234893 235028 235795 238080 241928 246136 249088 249781 248050 244318 239540 235188 232725 232654 233898 234268 231920
64198 231920 226736 220337 214744 211002 208955 207903 207326 207231 208007 209786 211917 213436 214145 214719 215563 216172
64182 216172 216086 215892 216633 218639 221582 225315 229900 234961 239761 243877 247275 249990 252329 255061 258551
64167 258551 261893 263869 264805 266528 270256 275316 280107 283543 285320 285624 285040 284184 283052 281205 278784
64152 278784 276720 275697 275489 275559 275676 275670 275361 275171 276155 278867 282690 286742 290914 295478 300167 304295 307524
64135 307524 310051 312260 314570 317271 320137 322490 323954 324764 325075 324557 323175 321802 321326 321411 320807 318782
64119 318782 315755 312687 310312 308789 307530 305475 302024 297739 293815 291006 289422 289128 290330 292847
64105 292847 295823 298181 299335 299450 299184 299208 299964 301866 305380 310447 316002 320898 325535 331779 340611
64090 340611 350510 358935 365142 370800 378013 387520 398745 410739 422642 433809 444087 453918 463793
64077 463793 473472 481850 487671 490244 489423 485212 478066 469669 462476 457578 453418 447524 439319 430263
64063 430263 421601 413415 405979 400244 396100 391642 385489 378907 374251 371921 370221 367783 364735 361658
64049 361658 358860 356960 357038 359659 364237 369628 374983 380069 385298 391341 398325 405656 413130 421697 432183
64034 432183 443595 453893 462515 471134 481624 494122 507265 519496 529808 538040 544988 551722
64022 551722 558331 563755 567044 568358 568482 567890 566639 564722 562005 557981 552014 543859 533975 523452
64008 523452 513642 505593 499641 495470 492427 489836 487398 485491 484629 484453 483914 482939 483166 486170 491451
63993 491451 497090 501972 506449 511209 516768 523905 533232 544154 555506 567451 581518 598281 616170
63980 616170 633290 649420 665460 681695 697545 712637 727288 741994 756739 770674 782479
63969 782479 791543 798858 806155 814127 822176 829763 836892 843249 848325 852965 859321 868276 878112 886972
63955 886972 895602 906199 919302 933479 947656 961958 976178 989212 1000732 1012177 1025095 1039144
63943 1039144 1052528 1064187 1075110 1087642 1103791 1123900 1146632 1170236 1194038 1218871 1246284
63932 1246284 1277466 1312528 1350408 1389698 1430145 1473360 1521578 1575760 1635331 1699717 1769373
63921 1769373 1844983 1926289 2012411 2103234 2199933 2303931 2415590 2534156 2658954 2790403
63911 2790403 2929857 3078726 3238043 3408737 3591956 3789111 4002064 4233396 4486036
63902 4486036 4762414 5064410 5394595 5757264 6157998 6602528 7096342 7644835 8253050
63893 8253050 8925242 9665144 10476293 11361000 12318427 13343854 14429862 15567738 16747621
63884 16747621 17957810 19184282 20410434 21616647 22780012 23874921 24874709 25754075
63876 25754075 26491757 27072333 27486028 27726864 27791000 27676510 27384040 26917394 26284326
63867 26284326 25497969 24577703 23547827 22434421 21262493 20054624 18830615 17607632
63859 17607632 16401164 15226257 14097368 13026501 12021603 11086965 10224538 9434361
63851 9434361 8714378 8060991 7469984 6936481 6454628 6018617 5624210 5268356 4947174
63842 4947174 4655531 4389069 4145531 3923348 3719913 3532137 3357921 3195974 3044765
63833 3044765 2902739 2769150 2643480 2524237 2409491 2298666 2192781 2092759 1998299 1908528
63823 1908528 1822923 1741303 1663592 1589916 1520599 1455911 1396001 1340748 1289337 1240489 1193716
63812 1193716 1149808 1109298 1071056 1033555 997019 962949 931825 902774 875362 850002 826449
63801 826449 803662 781643 761763 744617 729095 714327 700989 689669 679425 669248 659715 651897
63789 651897 645657 640337 636112 633144 630226 625788 619753 613124 606308 599173 592086 585245 577439 567183
63775 567183 555064 543405 533477 524282 514127 502121 488165 472891 457828 444371 432299 420406
63763 420406 408613 397986 388519 378630 367610 357012 348505 341610 334817 328019 322392 318354 314972
63750 314972 311232 306760 301386 295123 288852 284058 281340 279699 277700 275002 272329 270178 268096 265316
63736 265316 261774 258237 255493 253666 252329 251068 249754 248404 247034 245682 244367 243007 241479 239825
63722 239825 238288 236976 235495 233097 229456 225292 221894 219860 218647 217666 217322 218224 219578 219406 216702
63707 216702 212684 209470 208067 208014 208455 209006 209891 211713 214884 219026 223124 226339 228400 229348 229599 230215
63691 230215 232035 234240 234878 233294 231067 229950 230121 231210 233580 237255 240782 242919 244698 248034 252933
63676 252933 258045 263615 271510 281910 292120 299651 305014 310570 317867 327064 337919 350064 362747
63663 362747 375140 386768 397335 406604 414622 421452 426503 428854 428483 426305 422803 417613 410937 404259
63649 404259 398753 393760 387742 380270 372232 364560 357589 351374 345722 339942 333325 326076 319316 313952
63635 313952 309750 305749 301544 297949 296084 295814 295680 294776 294034 294801 296713 298260 299319 301574 306042
63620 306042 311630 317045 322961 331034 341370 352234 362134 371228 380580 390730 401254 411301 420382
63607 420382 428698 436653 444001 449606 452141 450892 446045 438539 429598 420004 409865 399417 389698 381811
63593 381811 375681 370293 364915 359277 352922 345766 339334 335925 336109 338320 341301 345429 350886 356115
63579 356115 359452 361259 363185 366154 370289 376048 383946 393569 403999 414843 425920 436606 446760
63566 446760 457864 471945 489533 509649 531324 553964 576784 599464 623287 650098 680100
63555 680100 712050 745668 782260 822411 864340 905118 942536 975405 1003144 1025827 1043782
63544 1043782 1056512 1062777 1062417 1057554 1051351 1045793 1040834 1035127 1027363 1017549 1007184 997539 987675 975031
63530 975031 958270 938540 917572 895760 872972 850127 828667 808998 790610 773400 757730
63519 757730 743309 729162 714895 701232 689152 679175 671503 666084 662303 659314 657065 656519 658649
63506 658649 663588 670964 680534 692160 705577 720561 737177 755712 776617 800511 827653 857161
63494 857161 887403 917753 949480 984168 1021529 1059431 1095788 1129487 1159503 1184329 1202956
63483 1202956 1215859 1224563 1230685 1235643 1240442 1245003 1248197 1249405 1249665 1250484 1251747 1251609 1248190 1240400
63469 1240400 1227241 1207665 1181702 1150837 1116590 1079267 1038672 995559 951814 909454 869777
63458 869777 833123 798947 766305 734612 703945 674659 647216 622430 601176 583431 568114
63447 568114 554278 541962 531461 522355 513907 506044 499327 494170 490667 488833 488517 489234 490584 492535
63433 492535 495023 497847 501528 507550 516610 527058 536403 544450 553769 566601 582309 598464 613649
63420 613649 628336 643373 658509 672585 684589 694052 700478 702861 700368 693544 684275 674061 662653
63407 662653 648982 633289 617637 604195 593532 584820 577268 570877 565916 562084 558545 554821 551361
63394 551361 548902 547411 546158 544822 543985 544359 546197 549709 555307 562826 571074 578847 586052 593433 601815
63379 601815 612223 625953 643447 663528 684803 707529 733100 761999 793408 826590 861429
63368 861429 897649 934902 973810 1015604 1060342 1106605 1153369 1201027 1249994 1299289 1347048
63357 1347048 1391464 1430636 1462494 1485719 1500126 1505816 1503104 1493945 1482132 1470615 1459279 1446497
63345 1446497 1432179 1417811 1403763 1388089 1368240 1342972 1312471 1277739 1240375 1202206 1164510
63334 1164510 1127734 1092013 1057638 1024968 994366 966322 941256 919125 899489 882038 866919
63323 866919 854724 846362 842536 842787 845296 848316 851827 857331 866168 878596 894278 912701 932990
63310 932990 954246 976614 1001393 1029581 1060856 1094528 1130942 1171016 1214514 1259653 1304618
63299 1304618 1348847 1392384 1434377 1472771 1505396 1530908 1548711 1558505 1560440 1555629 1546068 1533784
63287 1533784 1520029 1505268 1489711 1473619 1457091 1439619 1420021 1397087 1370487 1340930 1309217
63276 1309217 1275310 1238821 1200425 1162145 1125808 1091521 1058058 1024477 990898 957948 926160
63265 926160 896087 868446 843743 822013 803138 787120 773681 761877 750647 739868 730358 722649
63253 722649 716124 709761 703393 697603 692541 687678 683036 679791 678839 679209 678868 677045 674858 673441 672418
63238 672418 670797 668601 666751 665632 664612 662928 660306 656663 652052 647304 644043 643185 643518 642616 639540
63223 639540 636114 634924 636282 637923 637742 636019 634404 633510 632565 631258 630660 631807 634179 636256 637184
63208 637184 637294 637310 637811 639332 642199 645890 649021 650507 650764 651494 654156 658790 664448 670511 677118 684256
63192 684256 691104 696878 701914 707214 713095 719252 726164 735354 747679 762161 777172 792224 807902
63179 807902 824603 842198 860580 879620 898781 917760 937564 960014 985766 1013477 1041260
63168 1041260 1068444 1095596 1123279 1151305 1179087 1206308 1233112 1259719 1286016 1311745 1337058
63157 1337058 1362396 1387477 1410880 1431329 1449137 1465675 1481476 1495613 1506961 1515191 1520218 1521420
63145 1521420 1517982 1509605 1496575 1479528 1459361 1436876 1412261 1385422 1357085 1328887 1302038 1276591
63133 1276591 1252575 1231072 1213300 1199195 1187808 1178808 1172691 1169878 1170590 1175337 1184311 1196297 1209406
63120 1209406 1223217 1239070 1257776 1278116 1298291 1317879 1337453 1357105 1376449 1395628 1415115
63109 1415115 1434662 1453522 1471706 1489931 1508002 1524175 1536641 1545001 1549771 1551064 1548370 1541255
63097 1541255 1529593 1513356 1492851 1469123 1443470 1416481 1388089 1358692 1329537 1301563 1274414
63086 1274414 1247274 1220396 1195114 1172439 1152489 1135392 1121786 1111738 1103820 1096114 1087893 1079632
63074 1079632 1071718 1064114 1057238 1052106 1049232 1048163 1048410 1050003 1052696 1055507 1057831 1060417 1064430 1069927
63060 1069927 1075966 1081759 1086981 1091376 1094959 1098392 1102340 1106732 1111376 1116763 1123078 1128826 1132047 1132966
63046 1132966 1133907 1136183 1138548 1139464 1139462 1140209 1142273 1145042 1148074 1151306 1154467 1157506 1161320 1166964 1174128
63031 1174128 1181217 1186860 1190706 1193077 1194752 1196953 1200634 1205720 1211692 1218762 1227586 1237896 1248430
63018 1248430 1258541 1269154 1281743 1296868 1313963 1332022 1350152 1367785 1384818 1401500 1418223
63007 1418223 1435526 1454082 1474269 1495812 1518271 1541864 1567390 1595372 1625569 1657343 1690206
62996 1690206 1724092 1759384 1796513 1835376 1875569 1917505 1962607 2011589 2063061 2114839 2166406
62985 2166406 2219026 2273627 2329769 2386850 2444985 2504066 2562919 2620195 2675672 2730248 2785000
62974 2785000 2840499 2896530 2952155 3006432 3059152 3110346 3159072 3203380 3241547 3272488 3294856
62963 3294856 3306811 3307154 3295928 3273588 3240563 3198125 3148614 3094035 3035280 2973424 2910693 2849062
62951 2849062 2788833 2729867 2673533 2622022 2576161 2535430 2499999 2471177 2449628 2434487 2424697
62940 2424697 2420106 2420717 2425863 2434830 2447574 2464003 2482960 2502609 2521752 2540499 2559906 2581114
62928 2581114 2604417 2628823 2652853 2675874 2698073 2718852 2736014 2747224 2751830 2750455 2743213 2729322
62916 2729322 2708368 2680785 2646710 2605349 2556170 2500089 2438797 2373427 2304775 2234378 2164233
62905 2164233 2095340 2027544 1961031 1897000 1836391 1778914 1724135 1672722 1625624 1582417 1541626
62894 1541626 1502569 1465886 1432094 1400614 1370688 1342570 1317168 1294795 1274675 1255670 1237266
62883 1237266 1219836 1203944 1189476 1175630 1161724 1147602 1133204 1118509 1104239 1091630 1080611
62872 1080611 1069019 1054941 1039354 1025066 1013319 1002978 992977 983699 975443 967270 958355 949205
62860 949205 940590 932505 925213 920124 918216 918233 917794 915862 913135 910561 908643 907757 907841 907925 907001 905307
62844 905307 903786 902451 900387 897365 894341 892107 890322 888296 886089 884494 884213 885171 886410 886787 886173
62829 886173 885756 886669 888569 890140 890723 890679 890340 889463 887883 885948 884051 882295 880832 880053 880196 881091 882455
62812 882455 884110 885790 886946 886873 884968 881117 876093 871405 868333 867032 866696 866418 865746 864683 863422
62797 863422 861913 859677 856421 852851 850168 848559 847067 845415 844942 846815 850131 852982 854856 856666
62783 856666 858734 860138 860225 859652 859539 860329 861719 863150 864212 865028 866136 867594 868618 868845 869446 871842
62767 871842 875534 878425 879404 879466 880121 881834 884318 887133 889402 890005 888980 888119 889345 892663 896187 898007
62751 898007 897821 897051 897661 900655 905456 910763 915799 920507 924975 929342 934127 939962 947050 955406 965355
62736 965355 977068 989842 1002881 1016693 1032685 1051267 1071329 1091848 1113134 1136321 1162526
62725 1162526 1192684 1227174 1265248 1305700 1348495 1394931 1445977 1501413 1560951 1625077 1694162
62714 1694162 1767655 1844817 1925482 2009450 2095892 2184006 2273577 2364102 2453765 2539813 2619387
62703 2619387 2689687 2748110 2792929 2823414 2838996 2839152 2824554 2797245 2758710 2708611 2646458 2573932
62691 2573932 2494413 2410488 2322989 2232313 2139716 2047173 1956622 1869455 1786311 1707343 1632906
62680 1632906 1563716 1500019 1440951 1385173 1331934 1281336 1234049 1191127 1153415 1120472 1090508
62669 1090508 1062080 1035552 1012273 992621 975479 959532 944497 931111 920288 912164 905844 900259
62657 900259 895331 891766 889759 888824 889219 892401 899262 908740 919170 930320 943126 958069 975039
62644 975039 994388 1016759 1041955 1069196 1098615 1131434 1168428 1209205 1253355 1301374 1353824
62633 1353824 1410108 1468778 1528886 1590642 1654668 1720781 1787642 1853587 1917534 1978669 2035426
62622 2035426 2085599 2127727 2161593 2186803 2201582 2203797 2192785 2169542 2135633 2092568 2041767
62611 2041767 1984220 1920598 1852513 1783173 1715599 1650271 1585573 1520442 1455658 1392667 1332412
62600 1332412 1275467 1222163 1172163 1124920 1080928 1041590 1007343 976761 948138 921238 896775
62589 896775 874743 854113 833918 814022 794930 777359 761903 748581 736585 724741 712431
62578 712431 700102 688852 679454 671646 664415 657106 650105 644284 639944 636609 633701 630972 628313 625605
62564 625605 622922 620642 619205 618871 619585 620896 622156 623142 624386 626564 629749 633702 638705 645396 653635
62549 653635 662219 670181 678081 687548 699594 713671 728462 743361 758980 776296 795693 817052
62537 817052 840380 865770 892879 921269 951412 984592 1021443 1061220 1102963 1146668 1192663
62526 1192663 1240355 1288354 1335458 1380933 1424261 1465259 1503859 1538824 1567193 1586178 1595568
62515 1595568 1597346 1593101 1582797 1565987 1543047 1514889 1482386 1446439 1407918 1367261 1324600 1280437
62503 1280437 1235717 1191363 1148389 1108233 1071978 1039260 1008893 980562 954853 931593 909454
62492 909454 887647 866750 847275 828527 809681 791068 773509 757101 741498 726816 713475
62481 713475 701655 691570 683605 677317 670927 662928 653983 646334 641462 639089 638240 638354 639277 640968
62467 640968 643493 646939 651321 656900 664299 673700 684175 694569 705080 717136 731574 747707 764556
62454 764556 782316 802009 824130 848402 874803 904059 936707 972044 1008508 1045152 1082323
62443 1082323 1120587 1159260 1196372 1230074 1259703 1285405 1307090 1324047 1335450 1340989 1340952 1335625
62431 1335625 1324654 1307328 1283894 1256316 1227084 1197261 1166454 1134925 1104716 1077861 1053948
62420 1053948 1030534 1006013 981327 958660 939120 922076 906248 890856 875902 862011 850255
62409 850255 841649 836289 832945 829793 825788 821264 817319 814910 814577 816454 820064 824328 828315 832017
62395 832017 836129 841238 847554 855132 863703 872380 880215 887205 894127 901358 908588 915872 923954 932845
62381 932845 940752 945389 946150 944316 941248 937064 931029 922537 911493 898209 883249 867201 850582
62368 850582 834086 818774 805571 794525 784959 776496 769533 764442 760659 757026 753060 749549 747681
62355 747681 747753 748998 750775 753681 759078 767381 777075 785858 792827 799271 807137 816964 827594 837762
62341 837762 847432 857363 867835 878384 888603 898605 908482 917793 925850 932234 936862 939985 942476
62328 942476 945617 949896 954062 956015 954860 951872 949355 948814 950279 953099 957127 962960 970945 980216
62314 980216 989428 998791 1010864 1028707 1053434 1083976 1118831 1157304 1199334 1245130 1295167 1349872
62302 1349872 1409066 1472258 1539519 1611363 1687543 1766605 1846832 1926941 2005551 2080690 2150281
62291 2150281 2212524 2265333 2306172 2333456 2348006 2352383 2348677 2337229 2317182 2287641 2248428 2200459
62279 2200459 2145786 2086899 2025613 1962649 1898414 1833993 1771169 1711451 1655331 1602676 1553643
62268 1553643 1508749 1467872 1429722 1392922 1357463 1324493 1294624 1267019 1240465 1215016 1192240
62257 1192240 1173960 1160732 1151307 1143424 1135386 1127028 1119221 1112722 1107873 1105065 1104639 1106016 1107572 1107890
62243 1107890 1106869 1105240 1103287 1100549 1096764 1092525 1088626 1084909 1080295 1074318 1068189 1063626 1060679 1057700
62229 1057700 1053844 1050573 1049860 1051810 1055254 1059963 1066667 1075125 1083908 1092387 1101411 1111578 1122342 1133571
62215 1133571 1146558 1162403 1180483 1199689 1220280 1243325 1269052 1297151 1328220 1363466 1403037
62204 1403037 1445933 1491733 1541409 1596174 1656326 1721442 1791001 1864453 1941112 2020207 2100695
62193 2100695 2180894 2258423 2330412 2393655 2445159 2483437 2509264 2524482 2529926 2525045 2509473 2484108
62181 2484108 2450222 2408244 2358243 2301470 2240682 2178682 2116871 2055471 1994844 1936086 1880439
62170 1880439 1828752 1781817 1740669 1705912 1676907 1652188 1630652 1611997 1596191 1583094 1572444
62159 1572444 1563667 1555854 1548608 1542724 1539335 1538561 1539857 1543256 1548893 1555414 1560579 1563910 1567176 1571652
62145 1571652 1576554 1581253 1587265 1596390 1608070 1620468 1633392 1648327 1666108 1686373 1709058 1734566
62133 1734566 1762448 1791632 1822173 1855197 1890864 1928015 1966299 2006902 2050195 2094017 2135502
62122 2135502 2173696 2209261 2242413 2272499 2299381 2324103 2348069 2372220 2397058 2422925 2450169
62111 2450169 2479429 2511786 2548240 2589012 2633603 2681570 2732877 2787299 2843724 2900358 2955548
62100 2955548 3008043 3056288 3098004 3131188 3155691 3173305 3186109 3195060 3200190 3201445 3198937 3192934
62088 3192934 3184180 3173836 3162617 3150460 3137614 3125634 3116511 3111020 3108562 3108500 3111015 3116647 3125523
62075 3125523 3137066 3150237 3164342 3179781 3197525 3217620 3239004 3261290 3285641 3312817 3341428
62064 3341428 3369758 3398708 3431075 3467918 3507528 3548271 3590593 3635364 3681818 3728337 3774251
62053 3774251 3819822 3865251 3910875 3957759 4006955 4058300 4110666 4163203 4215754 4268422 4321436
62042 4321436 4375371 4430846 4488047 4546942 4607889 4671545 4738137 4807115 4877661 4949592 5023906
62031 5023906 5102370 5186136 5274631 5366101 5459173 5553244 5647184 5738652 5825657 5908667 5990507
62020 5990507 6074118 6160697 6249714 6339853 6429431 6516303 6598189 6673799 6743809 6810436 6875700
62009 6875700 6940050 7002750 7063343 7122373 7180665 7238176 7293591 7344826 7389958 7427840 7457910
61998 7457910 7479648 7492779 7498168 7497778 7492982 7483249 7467142 7444292 7415615 7381809 7342651 7297923
61986 7297923 7248205 7194584 7138291 7080956 7024569 6970775 6920385 6873543 6829979 6789248 6751341
61975 6751341 6717014 6686825 6659822 6634005 6608302 6583442 6560724 6540640 6522892 6506944 6492082
61964 6492082 6477348 6461736 6444270 6424209 6401858 6378940 6357054 6335590 6312249 6285909 6257883
61953 6257883 6229910 6202106 6173693 6144759 6116239 6088692 6062041 6036156 6010871 5985694 5960137
61942 5960137 5934119 5907665 5880661 5853363 5826523 5800160 5772412 5740310 5701736 5656434 5605493
61931 5605493 5550235 5491244 5428053 5360009 5287697 5213084 5138065 5063464 4989822 4918388 4850614
61920 4850614 4787085 4727485 4671130 4616983 4563727 4510703 4458633 4408937 4362588 4319876 4280598
61909 4280598 4243791 4207852 4171729 4135856 4101436 4069304 4039869 4013272 3988689 3964238 3938774
61898 3938774 3913371 3889963 3868999 3849779 3832611 3818827 3808543 3800218 3793217 3789371 3790958 3798258
61886 3798258 3810272 3826870 3848615 3874788 3903466 3934150 3969017 4010472 4058121 4109277 4162127
61875 4162127 4217182 4275515 4337004 4401139 4468350 4539219 4612976 4688318 4765508 4846147 4930835
61864 4930835 5018820 5110581 5209105 5317482 5436491 5565818 5706689 5861968 6034445 6226546
61854 6226546 6441218 6681455 6948969 7244652 7570478 7929818 8325746 8760016 9233817
61845 9233817 9748532 10305510 10905877 11550645 12240127 12972801 13744944 14550569 15379830
61836 15379830 16216307 17035747 17807143 18494677 19060171 19467470 19688388 19707375 19523308
61827 19523308 19149403 18611555 17943829 17181840 16357915 15500146 14632928 13776193 12944298
61818 12944298 12146813 11390509 10680264 10018758 9406668 8843601 8328462 7859037 7432056
61809 7432056 7044241 6693144 6376655 6091846 5834753 5601668 5390591 5201065 5032548
61800 5032548 4883469 4752127 4637811 4540278 4458428 4390377 4334648 4290330 4256022 4229748 4210310
61789 4210310 4197870 4192581 4193260 4197805 4204192 4210439 4214297 4213903 4208571 4198456 4183819 4165247 4144179
61776 4144179 4122441 4101410 4082208 4066455 4055967 4051619 4053050 4059479 4070169 4084044 4099607 4115581
61764 4115581 4131195 4145466 4156586 4162501 4162079 4155598 4144335 4129840 4113399 4095928 4078392 4062396
61752 4062396 4050121 4043415 4043014 4048978 4061863 4083179 4114561 4156731 4209534 4272840 4347099 4432961
61740 4432961 4530721 4640328 4761741 4895067 5040501 5198484 5369958 5556221 5758485 5977747
61730 5977747 6215006 6471342 6747811 7045805 7367884 7718027 8100576 8518913 8975557
61721 8975557 9473748 10018666 10616777 11274058 11995237 12784765 13647960 14590486 15616620
61712 15616620 16728376 17926218 19209645 20575872 22017229 23519210 25059531 26606917
61704 26606917 28119197 29542434 30812941 31862605 32626784 33053903 33114756 32808059 32159482
61695 32159482 31214969 30032158 28673066 27198523 25663670 24114706 22587506 21107965
61687 21107965 19693415 18354759 17098794 15929453 14847556 13850748 12935193 12097526
61679 12097526 11334320 10639882 10006334 9426813 8897525 8415640 7976325 7573475 7202725
61670 7202725 6861800 6548043 6257667 5988040 5738865 5509898 5298689 5101788 4917286
61661 4917286 4744929 4584277 4433828 4291603 4155699 4024724 3898660 3778882 3666286
61652 3666286 3559693 3457179 3358746 3266383 3181431 3103081 3029781 2960921 2896490 2836005 2778743
61641 2778743 2724645 2674148 2627123 2582491 2539045 2496360 2454635 2413769 2373028 2332028 2291779
61630 2291779 2253949 2218823 2184864 2150788 2117172 2085046 2053629 2021096 1987511 1955370 1926626
61619 1926626 1900387 1874401 1847985 1822471 1799235 1778299 1758840 1740376 1723242 1708223 1695719
61608 1695719 1685049 1674702 1663562 1651864 1640708 1630745 1621629 1612706 1603865 1595514 1587998 1581375 1575709
61595 1575709 1571169 1567687 1564993 1563445 1564422 1569036 1576341 1583619 1588856 1592337 1595519 1599168 1603226 1607633
61581 1607633 1612072 1615270 1615796 1613709 1610533 1607459 1604340 1600626 1596516 1592842 1590326 1589250 1589479 1590609
61567 1590609 1592366 1594847 1598052 1601377 1603999 1605578 1605990 1604632 1600772 1594417 1585989 1575265 1561720 1546010
61553 1546010 1529948 1514648 1499640 1484323 1469351 1455937 1444543 1434845 1426346 1418452 1410617 1402968
61541 1402968 1396134 1389901 1382855 1374256 1365596 1359237 1355883 1354368 1353600 1353549 1354367 1355802 1357895 1361393 1366784
61526 1366784 1373428 1380201 1386827 1394182 1403391 1414972 1428871 1444990 1463393 1484030 1506605 1530949
61514 1530949 1557400 1586489 1618318 1652500 1688625 1726414 1765477 1805474 1846670 1889913 1935781
61503 1935781 1984038 2033837 2083893 2132381 2177569 2219233 2259064 2299086 2339876 2380658 2420604
61492 2420604 2459384 2496632 2531588 2563392 2591415 2615345 2635386 2652333 2667127 2680213 2691334
61481 2691334 2699683 2704139 2703774 2698601 2689710 2678403 2665390 2651136 2636588 2623023 2611361 2602170 2596252
61468 2596252 2594610 2597757 2605558 2617843 2634683 2656060 2681910 2712847 2750336 2795636 2848926 2910056
61456 2910056 2979927 3060309 3152071 3254319 3365999 3488091 3623489 3774638 3941893 4124495
61446 4124495 4322623 4537885 4771970 5025266 5296714 5584510 5886795 6201824 6527313
61437 6527313 6859145 7190329 7511034 7809627 8074341 8295330 8466321 8584358 8647889 8655901
61427 8655901 8609735 8515067 8380687 8215101 8025021 7816787 7597593 7374674 7154045 6940364
61417 6940364 6736984 6545659 6367307 6203835 6058318 5932480 5824811 5732373 5654212 5592082
61407 5592082 5548017 5522008 5511893 5514807 5528806 5553757 5590626 5639492 5698405 5764517 5835861
61396 5835861 5911486 5990516 6072056 6155663 6240757 6325609 6408112 6487806 6566143 6644319 6721872
61385 6721872 6798106 6873970 6951222 7029802 7107050 7179900 7247343 7310469 7370560 7427630 7480577
61374 7480577 7528060 7568990 7602687 7629073 7648551 7661217 7666225 7662405 7649621 7629175 7602790 7571527
61362 7571527 7535780 7495842 7452213 7405699 7357569 7309590 7263711 7221720 7184905 7153537 7126718
61351 7126718 7103286 7082944 7065989 7051983 7039617 7028168 7018043 7009107 6999307 6986107 6969031 6949890
61339 6949890 6930680 6912172 6894683 6879443 6868840 6865669 6872268 6890068 6919983 6963469 7023069 7101552
61327 7101552 7200692 7321394 7464792 7632413 7825014 8041956 8282281 8546045 8833778 9144307
61317 9144307 9473403 9814871 10162787 10512028 10856389 11186688 11491417 11759178 11980279
61308 11980279 12146869 12253396 12297913 12282379 12210982 12088383 11919562 11710277 11466580 11193994
61298 11193994 10897668 10582938 10255106 9919017 9579527 9242137 8912361 8594348 8290390
61289 8290390 8001490 7727872 7469250 7225450 6997091 6785332 6590941 6413851 6253509
61280 6253509 6109414 5981319 5869068 5772134 5689471 5620364 5565463 5526113 5502257 5491781 5492474
61269 5492474 5503806 5525927 5557711 5597009 5642436 5693605 5749599 5808268 5867203 5924696 5979799
61258 5979799 6032262 6082478 6130683 6176019 6217034 6253022 6284199 6310599 6331746 6347608 6359048
61247 6359048 6366980 6371525 6372116 6367849 6357640 6340642 6316618 6285401 6246130 6197946 6141678 6080012
61235 6080012 6015511 5948893 5879417 5806339 5729749 5650743 5571419 5494376 5421666 5354215 5292206
61224 5292206 5235673 5184583 5138708 5097638 5060838 5027762 4998187 4972279 4950087 4931222 4915347
61213 4915347 4902388 4891483 4880305 4866669 4850743 4834614 4819791 4806502 4795571 4789274 4789425 4795798
61201 4795798 4807462 4824623 4847949 4876824 4909708 4946184 4987616 5035892 5092408 5158241 5234334
61190 5234334 5321134 5418588 5526630 5645113 5772881 5907129 6043761 6178043 6304773 6418164
61180 6418164 6511895 6579397 6614350 6611600 6568407 6485382 6366322 6216923 6043327 5851625 5648214
61169 5648214 5439785 5232200 5029285 4832959 4644484 4465297 4296816 4139921 3994779
61160 3994779 3860910 3737479 3623940 3520463 3427447 3344712 3271570 3207489 3151966 3103683
61150 3103683 3060592 3021364 2986302 2956465 2932325 2913743 2900778 2893790 2892641 2896257 2903172 2912511
61138 2912511 2924492 2939926 2958971 2980215 3001134 3019599 3034898 3047456 3057880 3066247 3071736 3072819
61126 3072819 3068256 3058335 3044829 3029414 3012224 2992177 2968421 2941048 2910507 2876783 2839464 2798490
61114 2798490 2754591 2708804 2661618 2612864 2562537 2511407 2460501 2410193 2360212 2310442 2261239
61103 2261239 2212934 2165457 2118563 2072146 2026288 1981371 1938230 1897799 1860429 1825761 1793319
61092 1793319 1763045 1735243 1710192 1687773 1667122 1646795 1625595 1603175 1579526 1554282 1527289
61081 1527289 1499719 1473601 1449991 1428421 1408492 1391017 1376785 1365045 1354397 1344998 1338711 1336826
61069 1336826 1338520 1341951 1346179 1351466 1358300 1366923 1377547 1390044 1403267 1415547 1426397 1437148
61057 1437148 1449363 1463114 1477395 1491579 1505432 1518161 1528948 1538650 1549556 1562784 1576888
61046 1576888 1589597 1599920 1607807 1612850 1614537 1613088 1608901 1601712 1591460 1579459 1567402 1555501
61034 1555501 1542920 1529881 1517916 1507869 1498943 1490045 1480894 1471318 1460505 1447834 1433992 1420584
61022 1420584 1408624 1397519 1385449 1370960 1354504 1338225 1323915 1311581 1300357 1290124 1281459
61011 1281459 1274620 1269592 1266695 1266015 1266547 1267030 1267465 1268829 1271602 1275563 1280565 1286205 1291170 1294513 1297350
60996 1297350 1301676 1307626 1313681 1319505 1326526 1335257 1344171 1352129 1360318 1370734 1383957 1399207 1415446
60983 1415446 1431707 1447473 1463330 1480196 1497598 1514123 1529949 1547216 1567235 1589125 1612134
60972 1612134 1637419 1666165 1697561 1730196 1764229 1800663 1839594 1880708 1924560 1971763 2021617
60961 2021617 2072930 2125676 2180697 2238417 2298853 2362232 2428623 2497740 2569974 2646625 2728203
60950 2728203 2813735 2903012 2998305 3102306 3215338 3336254 3465325 3604591 3755831 3919704
60940 3919704 4096621 4287213 4492021 4711465 4945727 5194412 5457562 5737720 6039772
60931 6039772 6368042 6725276 7115277 7544040 8016458 8534117 9099091 9718692 10404886
60922 10404886 11171515 12035033 13015760 14134268 15406942 16847498 18471168 20294994
60914 20294994 22338322 24629685 27211949 30133951 33434132 37125106 41162310 45379001
60906 45379001 49432601 52859618 55268714 56550390 56927791 56808915 56581169 56503249 56696656
60897 56696656 57131565 57575136 57603373 56763691 54810746 51830612 48160136 44192728 40231427
60888 40231427 36456733 32960163 29777084 26904955 24321780 22004526 19935837 18100053
60880 18100053 16479743 15056262 13809777 12718088 11757853 10907865 10150715 9472332 8861412
60871 8861412 8308648 7805275 7342923 6915700 6521289 6158777 5826195 5520842 5240212
60862 5240212 4980777 4737039 4503929 4279887 4066303 3864581 3675157 3498444 3334679
60853 3334679 3182922 3041773 2910878 2790346 2678932 2574549 2476688 2386745 2305526 2231686
60843 2231686 2163131 2098899 2039027 1983408 1931532 1883055 1838085 1796887 1759328 1724604 1691772
60832 1691772 1660718 1632143 1606330 1582548 1560235 1540029 1522635 1507101 1491298 1474044 1455824
60821 1455824 1437380 1418635 1399256 1379492 1359971 1341094 1322828 1304657 1285583 1264870 1243238
60810 1243238 1222852 1205427 1190405 1175675 1160327 1146100 1135546 1129025 1124318 1119243 1113655 1108549
60798 1108549 1104377 1101336 1100436 1102728 1107725 1114115 1121999 1132859 1146944 1162332 1177333 1192547 1209685
60785 1209685 1229378 1251076 1274092 1297749 1321263 1344415 1367603 1390425 1411114 1428314 1442492
60774 1442492 1454427 1463289 1467858 1469133 1469909 1471699 1473504 1473867 1472834 1471315 1469469 1466336 1460701 1452069
60760 1452069 1441117 1429305 1417694 1406212 1394265 1381646 1368313 1353828 1338020 1321980 1307367
60749 1307367 1294522 1282132 1269072 1255901 1244205 1234865 1227343 1220404 1213390 1206938 1202535 1201171 1202419
60736 1202419 1204848 1207200 1209096 1211030 1214079 1219353 1227322 1237691 1249937 1263644 1278259 1293130 1308105
60723 1308105 1323590 1339770 1356476 1374113 1393716 1415259 1436738 1456048 1473265 1490056 1507263
60712 1507263 1524243 1540245 1555074 1568329 1579242 1587644 1594231 1599547 1603497 1606145 1608172 1610119 1611745
60699 1611745 1612527 1612398 1611636 1610443 1608907 1607114 1604996 1602265 1598749 1594774 1591055 1587998 1584936 1580385 1573659
60684 1573659 1566168 1560157 1555812 1550630 1542317 1531330 1519677 1508263 1496874 1485979 1476667 1468898 1461563
60671 1461563 1454531 1448998 1445361 1442322 1438842 1435628 1433647 1432266 1430058 1426764 1423364 1420675 1418877 1418075
60657 1418075 1418278 1418841 1418747 1417517 1415407 1412821 1410015 1407184 1404215 1400489 1395631 1390443 1386380 1383796 1381291
60642 1381291 1377116 1370766 1362760 1353370 1342352 1329895 1316984 1304414 1291945 1278919 1265332 1251683
60630 1251683 1237962 1223542 1208219 1192735 1178040 1164519 1152081 1140466 1129242 1118070 1107329
60619 1107329 1097843 1089650 1081614 1072797 1063608 1055117 1047905 1042199 1038344 1036154 1034448 1032475 1031463 1033468
60605 1033468 1038763 1045669 1053029 1061449 1071635 1082729 1093078 1101892 1109502 1116627 1124116 1132893 1143504
60592 1143504 1155770 1169086 1182729 1195788 1207519 1218206 1229051 1240700 1252473 1263606 1274636
60581 1274636 1286566 1299006 1310294 1319750 1328984 1340406 1354802 1370847 1386691 1401490 1415468 1429166
60569 1429166 1443036 1457375 1472107 1486683 1500645 1514259 1527998 1541264 1552223 1559308 1562501 1562812
60557 1562812 1560964 1557059 1551029 1542822 1532441 1520380 1507769 1495611 1484259 1474118 1466231 1461220
60545 1461220 1458109 1455334 1452744 1451398 1451453 1451581 1450802 1449612 1448611 1447044 1443573 1437777 1430159 1421313 1412001
60530 1412001 1403653 1397806 1394921 1394253 1394852 1396348 1398931 1402957 1408574 1415494 1423178 1431350 1440020 1448818
60516 1448818 1456700 1462772 1467303 1471541 1476519 1482179 1487589 1491754 1494289 1495603 1496579 1498034 1500304 1503067
60502 1503067 1505439 1506409 1505456 1502715 1498380 1492289 1484535 1476336 1469603 1465321 1462689 1460135 1457100 1454688
60488 1454688 1454641 1457818 1463731 1471575 1481485 1494449 1511123 1531335 1554881 1582082 1613327 1648874 1689587
60475 1689587 1736805 1790560 1848831 1909708 1973451 2040750 2109394 2174538 2232276 2281096 2319576
60464 2319576 2344826 2354553 2349647 2333742 2311127 2285633 2260274 2236724 2215742 2198882 2188906 2187525
60452 2187525 2193437 2203597 2215872 2229720 2245132 2262220 2281487 2303268 2326977 2351780 2378017
60441 2378017 2407346 2441699 2482618 2531232 2588131 2653530 2728123 2813340 2910176 3018338 3137384
60430 3137384 3268069 3411500 3567448 3734748 3913254 4104273 4309171 4528862 4765086
60421 4765086 5021405 5302671 5613909 5959185 6340110 6754820 7198546 7664192 8140242
60412 8140242 8607326 9038230 9402767 9673528 9828984 9855167 9748058 9515276 9174627 8750358
60402 8750358 8269567 7759115 7242113 6735038 6247746 5786090 5354299 4955364 4590449
60393 4590449 4258808 3958433 3686985 3442583 3223960 3029667 2857182 2703267 2565424
60384 2565424 2442573 2333883 2237177 2149071 2066942 1990518 1921297 1860317 1806442 1756816 1709099
60373 1709099 1663342 1621488 1584813 1552068 1520495 1488465 1456530 1425954 1397217 1370386 1345998
60362 1345998 1324518 1305433 1287897 1271989 1258140 1245483 1232290 1218460 1206250 1197705 1192315 1188063
60350 1188063 1183895 1180116 1177046 1174572 1172788 1171908 1171474 1170511 1168553 1165905 1163037 1160525 1159465 1160894 1164543
60335 1164543 1168902 1172816 1176420 1180340 1184830 1190090 1196615 1204467 1212614 1219677 1225177 1229413 1232254 1232792
60321 1232792 1230452 1225985 1220932 1216270 1211928 1207521 1203078 1198866 1194915 1191158 1187786 1184965 1182280 1179044
60307 1179044 1175231 1171560 1168590 1166357 1165062 1165246 1166847 1168806 1170299 1171887 1174776 1179482 1185882 1193943
60293 1193943 1203294 1212467 1219777 1225154 1230215 1236387 1243724 1251569 1259472 1267224 1274752 1282339 1290368 1298578
60279 1298578 1306113 1312475 1317919 1322899 1327837 1333476 1340597 1349025 1357521 1364932 1370886 1375340 1378426 1381028
60265 1381028 1384491 1389228 1394411 1399544 1405216 1411402 1416035 1416658 1413179 1407884 1402894 1398582 1394300 1389539
60251 1389539 1384201 1378620 1373600 1369819 1367046 1364511 1362133 1360675 1360460 1360618 1360044 1358660 1357283 1356499 1356093
60236 1356093 1355580 1355055 1355498 1358190 1363647 1370928 1377985 1382897 1385109 1385850 1387310 1391012 1396753 1403288 1410005
60221 1410005 1417464 1426300 1436404 1447604 1460356 1474965 1490659 1506350 1521980 1538177 1554890 1571475
60209 1571475 1588026 1605413 1623825 1642517 1661382 1681560 1703870 1727707 1752350 1778433 1807019
60198 1807019 1837948 1870488 1905475 1945507 1992603 2046347 2104654 2165966 2230616 2300550 2377908
60187 2377908 2463607 2557169 2657863 2765712 2881204 3004546 3135841 3275576 3424146 3580954
60177 3580954 3744694 3914496 4090010 4270162 4452477 4633864 4811546 4983042 5145828
60168 5145828 5297490 5435968 5559508 5666706 5756773 5829483 5884739 5922429 5942654 5945807 5932689
60157 5932689 5905319 5867602 5824356 5779336 5734761 5692753 5656241 5628027 5609955 5603673 5611346 5634773
60145 5634773 5674395 5730126 5802583 5892492 5999194 6120813 6255771 6403225 6562005 6729923
60135 6729923 6903921 7079892 7252362 7415481 7564808 7697637 7811645 7904240 7973473 8018653
60125 8018653 8039521 8035645 8007189 7955764 7884057 7795157 7692719 7581136 7464895 7348064 7234788
60114 7234788 7129689 7037057 6959861 6900106 6859764 6840578 6842987 6865890 6907606 6966664 7041610
60103 7041610 7130370 7230023 7337169 7448533 7561143 7671722 7776128 7870067 7950538 8016145
60093 8016145 8065967 8099192 8116452 8120611 8115165 8102391 8084067 8063483 8045338 8033741 8031690 8042613
60081 8042613 8070808 8119574 8190094 8283195 8401315 8547626 8723733 8929390 9164313 9429395
60071 9429395 9726392 10057332 10424029 10826977 11264332 11732658 12228742 12749763 13291521
60062 13291521 13847463 14409803 14970514 15520573 16049455 16546875 17004782 17416683 17775436
60053 17775436 18073177 18303544 18462853 18548813 18559324 18493328 18352138 18139440 17860735 17523534
60043 17523534 17137496 16713538 16262970 15797684 15330194 14872159 14432816 14019347 13638292
60034 13638292 13295656 12995888 12741732 12534984 12376329 12264426 12196343 12169355 12181435 12229522
60024 12229522 12308119 12410160 12528446 12655532 12782981 12901941 13004595 13084660 13136953 13157533
60014 13157533 13144590 13098754 13022274 12917922 12788249 12635169 12460029 12264486 12051448 11824689
60004 11824689 11587224 11340428 11085411 10825325 10565844 10312949 10070525 9840502 9625052
59995 9625052 9427675 9251795 9099076 8969886 8864953 8785689 8733049 8707019 8707306 8733677 8785334
59984 8785334 8860614 8957617 9074553 9209086 9357654 9515465 9676615 9834272 9981865 10114725
59974 10114725 10229786 10323230 10389506 10423851 10425227 10395612 10336724 10248713 10132090 9989582 9825568
59963 9825568 9644656 9451612 9252024 9051938 8856656 8670234 8496038 8337149 8195915
59954 8195915 8073528 7970581 7888123 7827899 7791561 7780116 7794335 7835093 7902639 7995866 8113263
59943 8113263 8254654 8421042 8612211 8825016 9054454 9295663 9544159 9794566 10040148
59934 10040148 10273754 10488791 10679365 10840269 10967375 11058093 11111412 11127540 11107280 11051541
59924 11051541 10961514 10839468 10689359 10516677 10327948 10130301 9930905 9736213 9551580
59915 9551580 9381489 9229682 9098997 8991584 8909554 8854944 8828747 8830440 8858810 8912749 8990836
59904 8990836 9090798 9210073 9346450 9497457 9659569 9828944 10002658 10178141 10351338 10516620
59894 10516620 10669202 10807218 10931157 11042004 11140575 11228118 11306454 11377235 11441772 11502317
59884 11502317 11563308 11630588 11709207 11802684 11914880 12051796 12220372 12425627 12669884 12954662
59874 12954662 13281945 13653185 14068186 14525435 15022136 15552736 16108203 16677701 17250109
59865 17250109 17812612 18348534 18838268 19262468 19603680 19846159 19977115 19989935 19885961
59856 19885961 19672996 19362895 18970474 18512820 18007793 17472585 16923336 16374950 15840275
59847 15840275 15329377 14849671 14406434 14003269 13642877 13327903 13060762 12842608 12673070
59838 12673070 12551367 12477080 12449315 12465467 12521494 12613358 12737663 12890597 13066381 13256957
59828 13256957 13453093 13645531 13824820 13980446 14100967 14175545 14195394 14154136 14047947 13876208
59818 13876208 13641779 13350278 13009425 12629118 12220789 11795321 11361607 10927412 10500420
59809 10500420 10086989 9690396 9311929 8953731 8619406 8311874 8031902 7778761 7550990
59800 7550990 7346370 7162682 6999038 6855411 6730434 6620703 6522608 6433567 6351056 6271952
59790 6271952 6193914 6116563 6040637 5967011 5897265 5833775 5777844 5728435 5683898 5644137 5609737
59779 5609737 5579485 5550136 5518314 5481479 5437529 5385202 5325222 5259844 5191019 5119921 5048354
59768 5048354 4979195 4914766 4855664 4802027 4755181 4717113 4688730 4669730 4660329 4662243 4677156 4704240
59756 4704240 4739653 4778992 4820458 4865639 4917301 4976858 5044164 5119182 5202690 5294805 5393229
59745 5393229 5493631 5591764 5684828 5770858 5847732 5913699 5968877 6015490 6056194 6092411 6124411
59734 6124411 6152598 6178397 6204314 6233661 6270004 6316260 6374160 6444766 6529378 6629877 6748729
59723 6748729 6889199 7055080 7249332 7472906 7725591 8008082 8322661 8671856 9056935
59714 9056935 9477597 9932150 10417222 10926747 11450191 11970362 12462619 12897303 13244673
59705 13244673 13480114 13588670 13568652 13432405 13202326 12904275 12563130 12201646 11839488
59696 11839488 11491093 11165129 10867029 10601502 10372219 10180392 10025130 9905115 9819498
59687 9819498 9767949 9750664 9767761 9817941 9898462 10007266 10144635 10311969 10509741 10737711
59677 10737711 10996415 11287066 11610421 11967298 12360108 12792273 13265785 13780640 14337285
59668 14337285 14938471 15587923 16288026 17039703 17843872 18701753 19613421 20576525 21586358
59659 21586358 22636577 23719406 24825159 25941765 27055201 28151146 29217269 30244961
59651 30244961 31229943 32172275 33076514 33951701 34809995 35663625 36521743 37389360 38268318
59642 38268318 39157864 40053326 40944532 41816373 42651029 43429403 44131554 44738262 45234182
59633 45234182 45610247 45863779 45997891 46021714 45950353 45803225 45601935 45369379 45129288 44904570
59623 44904570 44715278 44578475 44509830 44524408 44635419 44852627 45182366 45628889 46195261 46882838
59613 46882838 47689861 48610426 49634332 50747029 51928621 53152236 54383146 55579279
59605 55579279 56692477 57669992 58457066 59001474 59259511 59201779 58817100 58113713 57117923
59596 57117923 55870925 54424237 52833711 51153268 49430853 47707699 46018503 44389906
59588 44389906 42838395 41370433 39984195 38669733 37407738 36170988 34930238 33661168
59580 33661168 32348962 30990833 29597138 28189148 26792418 25429367 24115811 22861892
59572 22861892 21674241 20557144 19512832 18541452 17641216 16809157 16042138 15337093 14690612
59563 14690612 14099092 13559400 13068413 12621745 12214107 11841544 11502358 11195115 10916686
59554 10916686 10662967 10430642 10217325 10020750 9838642 9668548 9506868 9348880 9190841
59545 9190841 9031445 8870324 8706102 8537295 8364437 8189749 8015003 7841006 7668857
59536 7668857 7500341 7337188 7181064 7033963 6897351 6771182 6655140 6550605 6459819 6383092
59526 6383092 6318443 6264270 6220848 6188730 6167119 6154692 6150946 6155829 6168730 6188584 6214558 6246215
59514 6246215 6283348 6325827 6373092 6423776 6476594 6531874 6591493 6657122 6729261 6808238 6895178
59503 6895178 6991469 7097965 7215377 7345019 7488617 7647654 7823286 8016653 8229011 8461674
59493 8461674 8715850 8992168 9290340 9609683 9950011 10311586 10694069 11095865 11514451
59484 11514451 11946747 12388993 12836707 13284912 13728104 14160099 14574684 14966922 15333789
59475 15333789 15673503 15984320 16263639 16507746 16712675 16876355 17000656 17091422 17156403 17202918
59465 17202918 17236778 17262609 17284999 17309662 17343568 17393867 17466707 17566748 17696600 17855705
59455 17855705 18039798 18241724 18452120 18658744 18846087 18997292 19097146 19133407 19096457 18979356
59445 18979356 18778614 18494330 18129656 17690788 17187416 16632458 16041072 15429426 14812821
59436 14812821 14203451 13610086 13040396 12502471 12002751 11543322 11123033 10741002 10397571
59427 10397571 10092508 9824531 9592939 9397811 9238083 9111013 9014055 8945901 8905448 8891607
59417 8891607 8904873 8947343 9020054 9121545 9249902 9404830 9586558 9793907 10024795 10277697
59407 10277697 10551198 10842596 11147934 11462637 11780652 12093235 12389799 12660219 12895787
59398 12895787 13088309 13229350 13310830 13326505 13273398 13152398 12967458 12724194 12429485 12091994
59388 12091994 11721688 11328064 10919266 10503020 10087159 9678255 9280358 8895949 8527671
59379 8527671 8178393 7850036 7543190 7257826 6993840 6751096 6529330 6327856 6145186
59370 6145186 5979375 5829087 5693951 5573675 5467380 5374044 5292953 5223304 5164014 5114477
59360 5114477 5075058 5046401 5028627 5021462 5024397 5036221 5055010 5079287 5109056 5145481 5189849 5242556
59348 5242556 5301857 5363134 5420622 5471263 5516871 5562435 5613045 5672654 5744230 5829520 5928998
59337 5928998 6043002 6172275 6316150 6470597 6629862 6791058 6957046 7134858 7331778
59328 7331778 7552592 7799490 8073722 8377186 8712602 9082579 9489213 9934798 10422387
59319 10422387 10955129 11535238 12163720 12840705 13565644 14337359 15153711 16010297 16898798
59310 16898798 17806883 18720030 19623201 20501292 21339923 22127560 22856965 23524174 24126586
59301 24126586 24662732 25133261 25540979 25889633 26182771 26422900 26610284 26742021 26812820
59292 26812820 26817095 26750402 26609337 26391110 26094248 25720292 25274917 24766981 24205980 23600207
59282 23600207 22957119 22284386 21589459 20878242 20155239 19425221 18694144 17968760 17256390
59273 17256390 16564883 15901080 15268604 14668241 14101044 13569983 13078064 12626174 12213657
59264 12213657 11839763 11503313 11201883 10932668 10693761 10483766 10300869 10143266 10009792
59255 10009792 9898914 9807552 9731974 9669507 9618449 9576704 9541510 9510151 9480063 9448655 9414004
59244 9414004 9375327 9331842 9281670 9223078 9156538 9084341 9008400 8929677 8849723 8771327 8697145
59233 8697145 8628748 8567462 8515275 8474178 8445176 8428653 8425636 8438247 8468789 8518419 8586824
59222 8586824 8673275 8777975 8902068 9046327 9210203 9392216 9590735 9804085 10030436 10267861
59212 10267861 10514003 10765283 11016661 11262292 11496013 11711451 11902727 12065263 12194899
59203 12194899 12285972 12331891 12328909 12278890 12187844 12062721 11910133 11736489 11547209 11345769
59193 11345769 11134614 10916841 10696173 10475659 10257310 10042710 9833209 9629956 9434537
59184 9434537 9249213 9075793 8914860 8766956 8633980 8518452 8421873 8344730 8287564 8251067
59174 8251067 8235674 8242263 8273033 8330741 8417408 8534565 8684126 8867843 9086336 9339879
59164 9339879 9629930 9958731 10327455 10735482 11180977 11660925 12170468 12702674 13248247
59155 13248247 13794573 14325708 14824514 15274543 15659619 15963468 16172059 16276177 16270675 16152657
59145 16152657 15923064 15589875 15167492 14672587 14121926 13533249 12924803 12312314 11707698
59136 11707698 11121011 10561519 10035540 9544878 9088853 8667196 8280257 7927562 7607413
59127 7607413 7317544 7055604 6819598 6608376 6421169 6256342 6111183 5983135 5870590
59118 5870590 5772503 5688248 5617946 5561798 5518567 5485568 5460591 5443198 5433954 5433165 5440558 5455366
59106 5455366 5476644 5504325 5539932 5585136 5639465 5700447 5766093 5836016 5909983 5986828 6065261
59095 6065261 6144567 6223904 6301905 6377268 6448573 6513201 6567919 6611167 6643518 6665297 6675283
59084 6675283 6672717 6659144 6636881 6606704 6568454 6523274 6473933 6423351 6373838 6327336 6285262
59073 6285262 6248276 6216962 6192489 6176017 6168007 6168963 6180375 6204012 6240619 6290251 6353603 6431834
59061 6431834 6524927 6631241 6749312 6879649 7024309 7184945 7361611 7553377 7759557 7979945
59051 7979945 8214057 8460863 8719600 8990362 9273318 9567534 9870879 10180509 10492703
59042 10492703 10802683 11105659 11397948 11675966 11933920 12163273 12354653 12499694 12591143
59033 12591143 12622367 12587626 12483021 12307903 12066384 11767335 11421685 11039304 10628748 10199169
59023 10199169 9760566 9321665 8888666 8466310 8058889 7669668 7300383 6951894 6624518
59014 6624518 6317558 6029805 5761105 5512311 5283026 5070543 4871872 4686015 4513383
59005 4513383 4353798 4205993 4068517 3940348 3820973 3710406 3608683 3514955 3427706 3346207
58995 3346207 3270915 3201826 3137274 3075130 3014783 2957352 2904388 2856805 2814487 2776318 2740869
58984 2740869 2707306 2675277 2644063 2612832 2582012 2553357 2528085 2505792 2485719 2468172 2454072
58973 2454072 2443849 2437339 2433937 2432284 2430794 2429394 2430148 2435318 2445187 2458112 2471936 2484819 2495560
58960 2495560 2504048 2510913 2516343 2519901 2521873 2523666 2526194 2528907 2531224 2533736 2536926 2539837 2541617 2543703
58946 2543703 2548791 2557734 2568750 2579592 2589303 2597811 2605021 2610671 2614310 2615200 2612835 2607683 2600881 2593145
58932 2593145 2584500 2575128 2565962 2558263 2552805 2549518 2547846 2547597 2549495 2554587 2563032 2573934 2586536 2601035
58918 2601035 2617920 2637044 2657765 2679622 2702532 2726795 2753246 2782937 2816290 2852978 2892867
58907 2892867 2936410 2983626 3033209 3083298 3132987 3182804 3234094 3288131 3345315 3404862 3465608
58896 3465608 3527371 3591198 3658294 3729171 3803785 3881745 3962315 4045175 4131444 4223127 4321284
58885 4321284 4425597 4535898 4653044 4777850 4910387 5051001 5200968 5361158 5530884
58876 5530884 5709116 5896470 6095266 6307934 6535957 6779949 7040286 7317849 7614348
58867 7614348 7931643 8270889 8633053 9020055 9434315 9877322 10350049 10854980 11396078
58858 11396078 11976192 12596010 13256308 13959707 14709043 15505191 16347487 17235064 18166415
58849 18166415 19138278 20145574 21181088 22233825 23288380 24326750 25329796 26276100
58841 26276100 27140896 27898090 28523446 28995991 29298791 29421053 29359821 29119157 28708853
58832 28708853 28144857 27449116 26646316 25760241 24813514 23828771 22827331 21826513 20839474
58823 20839474 19877080 18948247 18058910 17212490 16411493 15657479 14949868 14286462 13665219
58814 13665219 13084359 12541075 12031873 11554431 11107801 10690445 10299346 9931542 9585793
58805 9585793 9262390 8961856 8683853 8426746 8188009 7965302 7757115 7562579 7381535
58796 7381535 7215055 7064701 6930402 6809972 6701648 6606080 6524732 6457231 6401730 6357318
58786 6357318 6324767 6305296 6299595 6307502 6327675 6358333 6399398 6453106 6521272 6602872 6695666 6799413
58774 6799413 6915960 7047016 7193512 7356349 7535799 7730545 7939218 8162808 8404060
58765 8404060 8664832 8945673 9247559 9572173 9920670 10294149 10695443 11128598 11596278
58756 11596278 12099184 12638220 13215782 13834878 14498463 15209550 15970126 16779479 17634899
58747 17634899 18533891 19473779 20448550 21447544 22457474 23463830 24449414 25393017 26270723
58738 26270723 27057868 27729630 28261772 28633213 28828947 28841418 28670734 28324558 27817214
58729 27817214 27167689 26397514 25529282 24585817 23589963 22564424 21530161 20503652 19496120
58720 19496120 18516215 17572429 16671704 15816920 15007947 14244837 13527985 12855515 12223091
58711 12223091 11627135 11066509 10540416 10046441 9581688 9144495 8733900 8348316 7985776
58702 7985776 7644971 7325274 7026045 6746355 6485111 6241169 6013425 5800787 5602097
58693 5602097 5416514 5244186 5085768 4940736 4807010 4682840 4567966 4462024 4363198 4270029
58683 4270029 4183446 4105117 4034489 3969321 3908505 3852261 3799918 3749629 3700229 3651445 3602363
58672 3602363 3551687 3499596 3447341 3394876 3340841 3285207 3229967 3176645 3124672 3072583 3019220
58661 3019220 2963599 2905472 2846493 2789160 2733983 2679047 2622659 2564978 2506861 2448915 2392092
58650 2392092 2337528 2285192 2234140 2184501 2137758 2094695 2054576 2016670 1980944 1946849 1913134
58639 1913134 1879441 1846688 1815496 1785709 1757690 1732348 1709450 1687492 1665712 1644658 1624708
58628 1624708 1605873 1589231 1576321 1566543 1557374 1547914 1540103 1535595 1533648 1533153 1534432 1537503 1540584
58615 1540584 1542039 1542340 1542472 1541869 1539579 1536291 1533519 1531647 1530297 1529872 1531266 1534458 1538557 1542985 1547763
58600 1547763 1552768 1557095 1559113 1557501 1552986 1548580 1546769 1546834 1546467 1545494 1545717 1547338 1548486 1549030 1552086
58585 1552086 1560397 1573538 1590104 1610264 1634318 1660811 1688325 1717725 1750582 1786635 1824851
58574 1824851 1865972 1911856 1962843 2017719 2076080 2139093 2207861 2282221 2361403 2445264 2534949
58563 2534949 2632578 2739931 2857230 2983864 3120288 3268250 3429103 3603165 3791064 3994286
58553 3994286 4213799 4449320 4700382 4966806 5247522 5539951 5840833 6146236 6450213
58544 6450213 6744711 7021199 7271191 7485292 7653659 7768150 7822990 7814140 7741146 7610422
58534 7610422 7433996 7223327 6985838 6727787 6457382 6182988 5910196 5642580 5383691
58525 5383691 5136434 4901868 4680554 4474266 4285004 4113178 3957736 3817122 3689403
58516 3689403 3572867 3467416 3374001 3292004 3218637 3151529 3090140 3034147 2982677 2935976 2895401
58505 2895401 2860318 2827345 2794201 2762213 2733317 2706519 2678907 2648215 2612666 2570381 2521095
58494 2521095 2467156 2411188 2354189 2297121 2242293 2191366 2143672 2098045 2054563 2013148 1972746
58483 1972746 1933599 1897935 1866405 1836173 1804765 1773538 1744812 1717892 1690851 1664227 1639775
58472 1639775 1617011 1594114 1571099 1549118 1527732 1505870 1484655 1466254 1450332 1434300 1416784
58461 1416784 1398498 1380036 1361170 1342293 1324568 1308525 1293856 1280288 1267566 1255289 1243787
58450 1243787 1234245 1227026 1221169 1216342 1213446 1212216 1210453 1207313 1205092 1205887 1208690 1211882 1216279 1223187
58436 1223187 1231578 1239845 1248547 1258730 1269445 1279632 1290608 1303876 1318324 1332507 1347660 1365046
58424 1365046 1382112 1395009 1403756 1411385 1418975 1424850 1427741 1427497 1423503 1415547 1405388 1394475 1381277
58411 1381277 1364116 1345375 1329209 1315888 1302021 1285824 1268622 1251585 1234552 1218070 1203442
58400 1203442 1190766 1179458 1170130 1163216 1156674 1148233 1139153 1132574 1128930 1126327 1124598 1125222 1127695 1129767
58386 1129767 1131195 1133713 1137363 1140331 1142506 1145776 1150641 1155768 1161188 1168820 1179451 1191913 1205381
58373 1205381 1219907 1234841 1249270 1263666 1278478 1291757 1300956 1306411 1310180 1312437 1312334 1311490 1312906
58360 1312906 1316845 1321140 1325035 1329325 1333497 1336380 1338970 1342912 1346978 1348979 1350361 1354584 1361555 1368123
58346 1368123 1373688 1380618 1389301 1397616 1405594 1415824 1428590 1441007 1451444 1460368 1466488 1466961 1462372
58333 1462372 1456800 1451829 1444965 1435149 1425178 1417028 1409114 1400037 1391020 1382645 1372663 1359056 1342505
58320 1342505 1324621 1306679 1290973 1280185 1274315 1271068 1269727 1271499 1276012 1281289 1287551 1297053 1309574
58307 1309574 1322114 1333790 1347033 1363280 1381418 1401109 1423403 1447163 1469052 1488059 1506302
58296 1506302 1524907 1543098 1561513 1581697 1601917 1618522 1632175 1647580 1666105 1683928 1698567
58285 1698567 1711741 1724225 1733600 1739325 1744802 1751947 1758438 1762600 1766428 1771541 1776693 1781413 1787691
58272 1787691 1796001 1804046 1811415 1821097 1834635 1850214 1867021 1886571 1908199 1928558 1947489 1969134
58260 1969134 1995211 2022544 2049146 2076975 2106443 2134376 2160358 2189091 2223011 2258114 2290529
58249 2290529 2321846 2354320 2386096 2415102 2442781 2470162 2494813 2515409 2535039 2556673 2579624
58238 2579624 2603439 2630671 2662617 2696852 2731914 2769937 2812054 2855986 2900645 2948019 2998275
58227 2998275 3048703 3099738 3155701 3216784 3277070 3333943 3392809 3458801 3530366 3605044 3684702
58216 3684702 3770431 3858589 3946708 4037584 4133239 4230878 4328918 4430663 4537642 4645669 4751774
58205 4751774 4858525 4967384 5074932 5180416 5289833 5407574 5530993 5658064 5793009
58196 5793009 5939260 6094291 6256730 6431056 6620031 6820318 7030955 7258094 7505973
58187 7505973 7771662 8054190 8359468 8690002 9039334 9403555 9788780 10200232 10634033
58178 10634033 11087528 11567573 12080333 12623069 13194656 13804021 14459212 15158378 15900464
58169 15900464 16693680 17543531 18443669 19389176 20388119 21449863 22573751 23760161 25020440
58160 25020440 26364240 27789554 29297424 30903872 32625237 34465609 36431553 38544538
58152 38544538 40825243 43281527 45926704 48793309 51913985 55308154 59005814 63066290
58144 63066290 67556753 72535709 78080410 84310088 91362692 99376776 108521365 119009858
58136 119009858 131042931 144750602 160208807 177483894 196659995 217917711 241666306
58129 241666306 268535294 299103819 333541317 371308079 410735354 448452890 479374945
58122 479374945 498087180 501225498 489094110 465192227 434208385 400191262 365890461
58115 365890461 332934038 302147330 273802956 247884896 224310216 202997843 183847046
58108 183847046 166745391 151593023 138283733 126678134 116623096 107982463 100629714
58101 100629714 94430833 89256665 84998494 81555724 78823964 76716350 75196612 74287510
58093 74287510 74050278 74547308 75802273 77773026 80318394 83111072 85540086 86784689
58085 86784689 86156711 83488855 79205536 74011442 68516188 63093310 57941708 53157377
58077 53157377 48757422 44716275 41014305 37644935 34591970 31832014 29354796 27155992
58069 27155992 25213779 23493188 21968265 20620328 19420481 18334475 17341955 16434015
58061 16434015 15595818 14808099 14062110 13357532 12688920 12048506 11438665 10867378 10334083
58052 10334083 9832360 9362462 8928240 8525293 8144842 7785914 7451297 7134729 6824659
58043 6824659 6518513 6221837 5935868 5657420 5388939 5137252 4903333 4683056 4476477
58034 4476477 4286865 4112482 3948601 3795810 3657286 3529918 3407049 3288021 3176193
58025 3176193 3069860 2964260 2860637 2764189 2674513 2586810 2501030 2421132 2346648 2273639 2202930
58014 2202930 2138847 2080468 2022394 1963793 1908951 1859240 1811952 1766616 1725163 1686236 1646456
58003 1646456 1606997 1572160 1541890 1512355 1483255 1457723 1435421 1412485 1388212 1365452 1344608
57992 1344608 1323428 1302467 1284652 1269603 1254172 1238256 1224409 1212301 1199347 1186132 1175370
57981 1175370 1166140 1155145 1143058 1133540 1126403 1117825 1107072 1097024 1088238 1078537 1068456 1061225 1057124
57968 1057124 1053393 1049625 1047692 1046654 1043643 1039727 1038818 1040622 1040818 1038624 1037986 1040425 1042849 1043744 1045630
57953 1045630 1049702 1053306 1054614 1055032 1055413 1054268 1051285 1048425 1046298 1043296 1039189 1035685 1032888 1029306
57939 1029306 1025773 1024915 1026211 1026069 1023411 1020661 1018554 1014674 1008040 1000414 991925 979936 963497 944536
57925 944536 923519 898668 871050 845912 826872 812526 800476 790899 784451 780342 778337 779438
57913 779438 783063 786686 789396 792537 795968 797496 797110 797846 800924 803916 805311 806978 809985 811738 809892
57898 809892 806172 803722 802800 801124 796599 788349 777114 765735 757078 750685 743651 735273 728096 723941
57884 723941 722019 721620 723368 726866 730425 734317 740991 750706 760141 766767 771683 776657 781284 784511
57870 784511 786121 785190 779777 769611 756629 741842 724492 705323 687447 672457 658613 644343
57858 644343 630584 618212 606301 594782 585855 580720 577538 574537 572637 573166 575511 578872 583932
57845 583932 591008 598861 606959 616412 627102 636578 643652 650324 658098 665183 669783 673618 679392 686761
57831 686761 693438 698642 702927 706029 707272 707030 705870 703306 698962 693646 687844 680719 672126 664017
57817 664017 658182 654124 650637 647755 645554 642752 638391 633509 629493 626229 623490 622577 624787 629505
57803 629505 635399 642237 649963 657364 663356 668488 673709 678692 682737 686173 689555 692540 694701 696414
57789 696414 697928 698618 697956 696041 692704 687639 681835 676978 672885 667741 661495 656396 653161 649397 643321
57774 643321 636368 630354 624742 618821 613998 611362 609059 604750 599028 593784 588675 581724 572292 561168
57760 561168 548826 535752 523394 512647 502315 491026 479650 469937 461880 454319 447110 440720
57748 440720 434651 428179 421907 416901 413154 410353 409038 409436 410479 411636 414409 420102 427297 433505
57734 433505 438181 442290 446208 450169 455551 463296 471746 478207 482137 484969 487663 490369 493756 498500
57720 498500 503943 508950 513474 517555 519756 518690 515476 512579 510604 508063 503889 498356 491885 484781
57706 484781 477962 472428 468048 463984 459844 455485 450577 445570 442066 440922 441081 441620 443429 447201 451325
57691 451325 454042 456376 460479 466162 471592 476546 482255 488622 494457 500196 507566 516473 524792 531559
57677 531559 537976 544920 551842 558785 567277 578220 590485 602499 613868 624869 635589 646329
57665 646329 657921 671043 685768 701861 718902 736333 754101 772988 793561 815273 837431
57654 837431 860342 884476 909314 934265 959978 987367 1016157 1045954 1077958 1113790 1153108
57643 1153108 1194316 1237343 1283917 1335151 1390503 1449092 1510592 1574983 1642844 1715741 1794832
57632 1794832 1879286 1967484 2059556 2157294 2262045 2374485 2496371 2630720 2779861 2944502
57622 2944502 3124762 3320989 3533623 3763297 4010699 4275187 4553811 4842694 5138575
57613 5138575 5437668 5733707 6018567 6284088 6521985 6723545 6882087 6995281 7062487 7079811
57603 7079811 7039953 6937289 6772002 6550492 6284729 5991025 5685971 5381557 5084705 4800765
57593 4800765 4535011 4290507 4067154 3863895 3680357 3515972 3369416 3239647 3126096
57584 3126096 3027488 2942086 2869235 2809016 2760281 2720912 2690157 2668532 2655226 2648080 2646929 2654573
57572 2654573 2673356 2702760 2741421 2789408 2847161 2914175 2990402 3077479 3176847 3287874 3409379
57561 3409379 3541946 3687183 3845507 4016153 4198636 4392577 4596137 4805520 5015604
57552 5015604 5220136 5411624 5582083 5724033 5830599 5895418 5913663 5883579 5806904 5688024
57542 5688024 5532997 5349111 5144540 4927413 4704140 4478280 4251573 4026545 3807561
57533 3807561 3598933 3402731 3219005 3047179 2886323 2735216 2593671 2463096 2344355
57524 2344355 2235756 2134747 2040953 1955715 1879055 1809032 1743957 1683326 1626630 1573255 1523803
57513 1523803 1479659 1440763 1405288 1371850 1340660 1312316 1286832 1263906 1242907 1222740 1203222
57502 1203222 1186160 1173342 1163866 1155488 1148159 1143769 1142618 1142999 1144566 1149185 1157682 1168512 1180693
57489 1180693 1195402 1213387 1233373 1254581 1278444 1305991 1335626 1365573 1396889 1432183 1472709
57478 1472709 1518317 1568824 1623667 1681536 1742175 1807525 1879538 1958016 2042211 2133368 2233763
57467 2233763 2344069 2463359 2590948 2726494 2868952 3017195 3171170 3330610 3492652
57458 3492652 3652128 3804082 3944658 4069468 4172393 4246667 4287001 4291101 4259910 4196490
57448 4196490 4104432 3987562 3850951 3701075 3544222 3385199 3227722 3074997 2929178 2790950
57438 2790950 2660324 2537466 2422709 2316625 2220328 2134698 2058992 1991373 1931047 1878629
57428 1878629 1834092 1796011 1763586 1737786 1719376 1707126 1699248 1695601 1697324 1705085 1718690 1737604
57416 1737604 1760911 1787560 1817608 1852718 1894907 1945520 2005661 2076179 2156436 2244369 2338914
57405 2338914 2441431 2553779 2675920 2806163 2942657 3083513 3226325 3368610 3507966
57396 3507966 3640923 3762193 3865544 3944721 3993504 4006754 3982696 3923467 3832918 3715034
57386 3715034 3574790 3418522 3252063 3079537 2904670 2731614 2563332 2400776 2244985
57377 2244985 2098511 1963301 1838528 1722140 1613479 1512891 1419951 1333734 1253970 1180428
57367 1180428 1111945 1047512 987607 933114 883624 837977 795682 756636 720226 685839 653566
57356 653566 623524 595350 569037 545076 523077 501770 481298 463669 449678 437130 423678
57345 423678 409702 396782 385040 373871 363747 355216 347544 340242 334463 330813 327264 321532 314153
57332 314153 306975 300155 293352 288411 287612 289920 291903 291847 290331 287437 282544 276705 272134 269061 265670
57317 265670 261354 257558 255160 253327 251199 248550 244740 239280 233503 229370 226576 223224 219364 217153
57303 217153 217125 217181 216168 215782 217634 220568 222331 222169 220510 217667 214256 211807 211761 214357 218909 224279
57287 224279 228931 231814 233616 235986 239188 241811 243099 244352 247557 253647 262306 272350 282159 290880
57273 290880 299524 309937 322763 337386 353501 371365 390724 410938 432010 453957 475483 495051
57261 495051 513221 532074 552235 572360 591815 611940 634037 657610 681089 703079 722839
57250 722839 741012 759913 781379 804146 825105 843461 861832 882881 906697 932088 958559
57239 958559 986013 1013914 1041780 1069724 1097988 1126823 1156947 1189099 1223034 1258061 1294468
57228 1294468 1333226 1374561 1418257 1465035 1515933 1570485 1627265 1685943 1746749 1808198 1867857
57217 1867857 1925721 1984313 2044734 2104786 2161709 2214585 2262994 2305358 2339973 2366307 2384321
57206 2384321 2393812 2395285 2390194 2379661 2364144 2344767 2323520 2301605 2278958 2255896 2233886 2214288
57194 2214288 2197724 2185023 2177324 2174887 2177016 2183147 2192642 2203871 2215455 2228292 2244218 2262653
57182 2262653 2280864 2297550 2313751 2330104 2346105 2362696 2382660 2407220 2434603 2463089 2493312
57171 2493312 2526638 2563558 2604739 2651337 2703130 2758406 2816707 2879397 2946405 3014774 3081766
57160 3081766 3147259 3211694 3273801 3331821 3385168 3433640 3476953 3516277 3554354 3592934 3632070
57149 3632070 3672837 3718367 3770815 3829473 3893298 3963122 4039966 4123253 4212133 4306571 4405813
57138 4405813 4507960 4612468 4720974 4834294 4950682 5068112 5185915 5303013 5417376
57129 5417376 5528733 5638976 5748047 5852230 5948566 6038383 6124465 6207460 6287360 6365770
57119 6365770 6444068 6521536 6597730 6674513 6753253 6832233 6909178 6984121 7057311 7126643 7189940
57108 7189940 7247761 7301326 7349682 7391547 7428063 7461084 7490416 7514924 7534290 7547485 7551969
57097 7551969 7547090 7536195 7522920 7507698 7490224 7472402 7455799 7438785 7419477 7399082 7379147
57086 7379147 7358010 7333552 7307318 7282617 7260787 7242668 7231227 7228756 7233227 7240614 7248509 7254104
57074 7254104 7251251 7233639 7199101 7147738 7078532 6991346 6889083 6773459 6641091 6487549 6312018
57063 6312018 6113499 5885759 5620978 5315307 4965725 4564772 4104187 3580952 2994122
57054 2994122 2338686 1608453 801723 -82618 -1052340 -2119226 -3292790 -4583578 -6010042
57045 -6010042 -7595554 -9362048 -11334065 -13546057 -16039048 -18854809 -22041931 -25663718
57037 -25663718 -29792073 -34499288 -39866086 -45993101 -52993762 -60975587 -70022654 -80168559
57029 -80168559 -91370134 -103537166 -116616109 -130594489 -145320176 -160272315 -174558523
57022 -174558523 -187194503 -197408886 -204738672 -208978494 -210165946 -208596051 -204728219 -199005435
57014 -199005435 -191768856 -183331043 -174052551 -164289108 -154283779 -144146250 -133923299
57007 -133923299 -123660874 -113415377 -103251755 -93251386 -83512835 -74141615 -65245339
57000 -65245339 -56930991 -49287277 -42361282 -36155490 -30644330 -25786019 -21523759 -17791291
56992 -17791291 -14525107 -11669339 -9171483 -6982113 -5060836 -3377061 -1903463 -612787
56983 519082 1512296 2386528 3161486 3853109 4472806 5031159 5539101 6004550 6430530 6817342
56973 6817342 7164840 7472958 7742840 7978250 8184580 8366886 8530224 8680448 8821965
56964 8821965 8955106 9077974 9190313 9293145 9385060 9461528 9518239 9553487 9567637 9562221 9539288
56953 9539288 9499585 9441302 9362053 9261723 9141844 9003262 8847019 8677326 8500873 8322366
56943 8322366 8142262 7958813 7770189 7574525 7370798 7161403 6952457 6750260 6558513
56934 6558513 6379558 6215609 6064937 5915855 5746961 5536901 5276750 4974696 4649686
56925 4649686 4320598 3999965 3694610 3408312 3142167 2893914 2659364 2435351 2221121
56916 2221121 2017366 1824962 1644752 1477716 1324739 1186286 1062393 952924 857810 776902
56906 776902 709228 652419 603464 560461 523511 493837 472248 458437 451260 449520 452701 460765
56894 460765 472637 484941 493057 493743 486499 472672 454249 433672 413617 396046 381659 370393
56882 370393 361912 355584 350905 348304 348713 351911 356210 360571 366382 376285 391502 410928 432561 455037
56868 455037 477553 498646 515399 524233 522814 511297 491786 467171 440781 416116 395440 378567
56856 378567 363930 350719 339072 328560 318195 308231 300436 295875 293668 292647 293006 295280 298697
56843 298697 301767 304027 306256 309375 313976 320542 329236 339513 350516 361907 374081 387892 404376
56830 404376 424331 447800 474243 503241 534480 566923 598738 628334 654752 676671 692043
56819 692043 699578 700162 696081 689099 679798 668496 656205 644623 635284 628538 623481 619430 617499 619927
56805 619927 627676 639503 653872 671068 692847 720412 753150 788790 824235 856378 882500 900085
56793 900085 906963 902661 889616 871983 852830 833201 813915 797062 784986 778619 777452 780596
56781 780596 787533 798599 815232 839037 870205 907671 951189 1002252 1062119 1129413 1199753 1266450
56769 1266450 1320992 1354675 1362213 1344351 1306688 1256343 1200009 1143575 1091420 1045485 1005758
56758 1005758 971889 944061 922616 907542 898388 894570 896014 903499 917849 938859 965904 999565
56746 999565 1040976 1088480 1135822 1174547 1197661 1200961 1183139 1146863 1098977 1047226 996147 946727
56734 946727 899344 855412 816288 782154 752508 726957 705457 688579 677425 672504 672917 677586
56722 677586 686879 701814 721731 743933 765494 784022 796578 799560 790777 771150 744003 713165
56710 713165 681569 650458 619432 588017 557449 530035 506601 485735 466007 447797 432248
56699 432248 419478 408777 399715 392030 385086 378520 372914 368723 364974 360356 355433 352316 351880 352602
56685 352602 352696 352175 351907 351630 350224 347582 344886 342979 341520 339968 338343 336549 333952 330416 326997
56670 326997 324626 322595 319460 315218 311363 308718 306392 303373 300127 297840 296761 296063 295007 293500
56656 293500 291698 289695 287628 285751 284381 283796 283862 283620 281749 277927 273508 270474 269893 271475 274049
56641 274049 276004 275879 273407 269930 267140 265383 263691 261399 259084 257733 257409 257050 255430 252300 248591
56626 248591 245496 243313 241456 239708 238936 240100 242792 245370 246527 246287 245508 244927 244836 245303 246377 248081
56610 248081 250258 252469 254250 255637 257214 259385 261736 263388 263773 262745 260254 256501 252393 249182
56596 249182 247290 245807 243462 239944 236112 233060 231197 230202 229690 229720 230501 231644 232001 230655 227938 225198
56580 225198 223449 222629 222247 222314 223184 224754 226477 228231 230566 233689 236755 238766 239928 241383 243673
56565 243673 246225 248549 251102 254459 258231 261393 263391 264411 264917 265405 266229 267029 266660 264479 261506
56550 261506 259624 259596 260545 261332 261764 262387 263696 265726 267961 269630 270518 271363 272901 274646 275437 275195 275304
56533 275304 276975 279844 282486 283789 283603 282566 281632 281461 282074 283268 285189 288010 291224 293925 295848
56518 295848 297589 299817 302844 306757 311127 314600 315646 314089 311394 309453 309568 312287 317213 322939
56504 322939 328157 332979 338386 344471 350347 355745 361350 367373 373257 379205 386446 395124 403398 409691
56490 409691 414682 419939 425576 430625 434900 439004 442922 445993 448155 450021 451711 452608 452412 451590 450555
56475 450555 449072 446719 443381 438956 432972 425142 416403 408888 404146 401351 398047 393039 387704 383777
56461 383777 380889 377595 374000 371461 369891 367466 363382 358995 355484 352075 347608 342495 338022 334769
56447 334769 332475 330390 327194 322012 316397 313710 315289 318596 320434 320616 320917 321811 322252 321823 321004 319737
56431 319737 317567 315151 314094 315183 317880 321314 324723 327290 328778 330033 331763 333289 333685 333710 335055
56416 335055 338006 341347 344547 348466 353639 359165 363791 367148 369566 371529 373684 376756 381029 386222
56402 386222 391952 398008 404213 410280 415778 420249 423868 427925 433787 441085 447923 453239 457769 462135
56388 462135 465471 467026 467639 468137 467450 464185 459306 455466 454089 454708 456662 459633 462651 464341 464388 463540
56372 463540 462133 459829 456740 453566 450612 447576 444243 440517 436204 431683 428239 426534 425332 423000
56358 423000 419694 416644 413858 410244 405631 401001 396944 393550 391428 390995 390839 388793 384837 381206 379370
56343 379370 378655 378202 378529 380446 383742 387507 390742 392455 392411 392056 393402 396719 400349 402805 403740 403045
56327 403045 400827 398596 398647 401441 404914 406956 407413 407182 406778 406530 406961 408167 409646 411240 413395 416177
56311 416177 418995 421633 424533 427775 430834 433640 436818 440514 444021 446841 449115 450871 451978 453073
56297 453073 455213 458341 461302 463741 466687 470861 475679 480427 485143 489821 493898 497152 500056 502846
56283 502846 505365 508206 512556 518213 523045 525421 526161 527176 529028 530787 531613 531593 531479 532334 535143 540298
56267 540298 547533 556425 566569 577360 588210 599010 609907 620854 631917 643561 655792 667555
56255 667555 678073 688251 699495 711594 723260 734307 745567 757018 767983 779051 791636
56244 791636 805281 817448 826508 833111 838163 841521 843540 845971 850062 855164 860198 865256 870926 877296
56230 877296 884406 892564 901520 910547 919835 930555 943140 957012 972555 991560 1014776 1040507
56218 1040507 1066712 1093291 1121436 1152073 1185796 1223038 1263442 1306261 1352104 1402808 1458899
56207 1458899 1518870 1582017 1650244 1725675 1808011 1895951 1989997 2092055 2203117 2323086 2452386
56196 2452386 2591984 2741745 2899984 3064849 3235449 3411596 3592773 3777202 3961752
56187 3961752 4143003 4318204 4484515 4637658 4772683 4886376 4977860 5046821 5092601 5115443
56177 5115443 5117194 5100004 5065413 5015105 4951330 4876045 4790838 4698226 4601735 4503925 4405222
56166 4405222 4305019 4202885 4098413 3991209 3881591 3770262 3657104 3541554 3424346
56157 3424346 3307354 3191366 3075518 2959261 2843396 2728826 2615924 2505632 2399559
56148 2399559 2298501 2202243 2111041 2025674 1945946 1871154 1802245 1741208 1687730 1638722 1591953
56137 1591953 1547986 1507684 1470210 1434692 1401737 1371910 1344546 1319381 1297570 1279707 1264316
56126 1264316 1249570 1235214 1221967 1210422 1201229 1194762 1190024 1185574 1181964 1181373 1184436 1189623 1196040
56113 1196040 1204185 1213442 1221880 1229610 1239360 1252381 1266737 1281135 1297461 1317564 1340158 1362979
56101 1362979 1385661 1408474 1430441 1450752 1470118 1489130 1507253 1524699 1542854 1561573 1578900
56090 1578900 1595071 1613660 1636760 1662141 1687419 1713822 1743210 1774535 1806531 1841317 1882033
56079 1882033 1929244 1982964 2046211 2123168 2215446 2323121 2447752 2591192 2752650 2929514
56069 2929514 3119455 3318974 3521234 3718051 3903243 4072794 4224447 4359895 4485093
56060 4485093 4605035 4718868 4821462 4907215 4970271 5004502 5007427 4982952 4937716 4876487 4802931
56049 4802931 4721115 4632103 4531229 4412698 4275650 4123243 3958643 3785876 3612249 3445293
56039 3445293 3288156 3141163 3006100 2885305 2778211 2682663 2598446 2526086 2463594 2407870
56029 2407870 2358039 2314116 2274065 2235689 2200006 2169304 2143173 2119548 2097991 2078850 2061103
56018 2061103 2044386 2031189 2023549 2019474 2015970 2013346 2013074 2013931 2014239 2015577 2020180 2026905 2033914 2042897
56004 2042897 2056252 2072455 2088756 2106163 2127077 2150350 2173570 2198051 2226400 2257268 2287629
55993 2287629 2318401 2352644 2390097 2428520 2468329 2510587 2552657 2591607 2630198 2673822 2723073
55982 2723073 2774762 2828243 2884878 2942994 2999587 3055823 3115282 3178160 3242541 3309494 3381274
55971 3381274 3456517 3532962 3612666 3698596 3788604 3879135 3972315 4072746 4179898 4290604 4406328
55960 4406328 4530561 4661672 4796100 4936163 5086784 5246971 5412600 5585044 5768688
55951 5768688 5962649 6163900 6375876 6604595 6848804 7103673 7371747 7660050 7968813
55942 7968813 8293793 8637354 9005798 9397552 9805876 10232184 10685202 11168292 11679502
55933 11679502 12222752 12806497 13432061 14095419 14799141 15549865 16345675 17179806 18055742
55924 18055742 18984968 19971404 21012694 22114962 23290339 24541311 25864228 27267442
55916 27267442 28768988 30377749 32095156 33934356 35918584 38061921 40371992 42870482
55908 42870482 45590078 48554218 51784827 55329217 59254743 63620977 68488453 73955890
55900 73955890 80159680 87240007 95341959 104643558 115333608 127552382 141392413 156957953
55892 156957953 174381869 193801924 215400411 239476490 266393290 296400819 329466350
55885 329466350 364995446 401187274 434369499 459362247 471379111 468346439 451772679
55878 451772679 425562575 394006389 360485840 327245343 295619185 266253787 239338154
55871 239338154 214869764 192810394 173087093 155573315 140120816 126573236 114739074
55864 114739074 104397272 95346837 87423554 80469010 74322922 68855206 63974337 59596842
55856 59596842 55636102 52025509 48723867 45690465 42878923 40260625 37829460 35576071
55848 35576071 33478086 31520374 29702838 28021032 26458215 25002879 23655612 22411518
55840 22411518 21252325 20162700 19139598 18179820 17273171 16414251 15607707 14855613 14151244
55831 14151244 13489876 12873810 12302005 11766031 11260614 10787430 10344669 9923757 9520389
55822 9520389 9138399 8778874 8435598 8104910 7790032 7491843 7205178 6928184 6665875
55813 6665875 6420294 6186015 5959326 5743336 5540164 5346342 5159649 4982300 4813524
55804 4813524 4646673 4477586 4308828 4142607 3976965 3812290 3654225 3506429 3367085
55795 3367085 3235580 3115785 3009570 2913763 2826515 2749893 2682936 2618757 2552093 2483764 2414895
55784 2414895 2343288 2268828 2196230 2128830 2065299 2005483 1953407 1910887 1873709 1837663 1803393
55773 1803393 1772288 1742917 1714745 1690244 1669992 1650234 1628095 1604614 1580325 1552981 1522284
55762 1522284 1491664 1462503 1431507 1396578 1360384 1325442 1290784 1256258 1224892 1197849 1172018
55751 1172018 1145692 1121746 1102022 1083748 1065020 1048873 1038072 1030429 1023189 1017722 1015840 1015483
55739 1015483 1014068 1012517 1012164 1011107 1007317 1002033 996644 989621 979860 969541 960139 949132 934339
55726 934339 918244 904227 891624 878374 865588 855512 847427 839375 831774 825971 821278 816489 811964
55713 811964 807310 799672 787510 773513 760593 747635 732586 716950 703381 691258 678761 667408
55701 667408 660296 657022 654108 649543 643610 636183 626602 615716 605204 595201 584762 573786 562345
55688 562345 549130 532834 514161 494524 473877 451811 429673 409602 392421 378045 366653
55677 366653 357879 350288 343305 338203 335611 333851 331441 329417 329259 330314 331244 332108 332821 331308 325650
55662 325650 316885 307641 299285 292272 287613 285753 285147 284024 282501 281317 279904 277575 275372 274885 276363
55647 276363 279415 284108 289837 294751 298017 301103 305271 309569 312924 316175 319975 322698 322760 321365 320581
55632 320581 320225 319086 317863 318318 320503 323164 326105 330117 335256 340990 347209 353570 358838 362316 364796
55617 364796 366758 367103 365006 361389 357052 351270 344075 337841 334393 332362 329788 327608 327872 329933 331142
55602 331142 330370 328364 325629 322379 319754 318756 318592 318063 317674 318495 320057 321534 323824 328096 333283 337302
55586 337302 339777 341182 340400 335974 329263 323537 320002 316934 312573 306778 299989 292732 286154 281204
55572 281204 277221 272856 268106 263857 259709 253936 245640 235755 226110 218400 213489 210682 208301 205716
55558 205716 203723 202278 199675 195291 191172 189007 187334 183980 179613 176310 173988 171076 167788 165760
55544 165760 164997 163992 162647 162438 163600 164573 164473 164068 164065 164228 164368 164682 165032 165160 165385 165891 165871 164751
55526 164751 163583 163692 164630 165051 164879 164918 165164 165333 166272 168873 172149 174480 176268 179480 185057 192617
55510 192617 202057 213411 225652 237690 250118 263983 278407 291624 303860 316690 329695 340080
55498 340080 345717 346515 342853 334930 323936 311846 299560 286710 273374 260347 247694 234743
55486 234743 221640 209445 198668 189004 180275 172307 164348 156172 149206 144797 141888 138368 134290
55473 134290 131660 131266 131828 132290 132932 134064 135449 137251 139904 142947 145368 146957 147979 148057 147060 146437
55457 146437 147562 149138 148430 144903 140612 137221 134792 133304 132889 132425 130187 126320 122665 119935 116990
55442 116990 113071 108678 104050 98920 94085 91133 90139 89501 88434 87751 87860 87957 87603 87242 86760 85365
55426 85365 83326 81998 81740 81549 81066 81070 81608 81483 80096 78116 76021 73599 71070 68885 66304 62143
55410 62143 57105 53313 51382 50089 49104 49488 51062 51840 50879 49387 48235 46790 45116 44786 46315 48065
55394 48065 48993 50188 52229 53339 52006 49520 47991 47437 46740 46031 46107 46517 46129 44936 43764 42833 41971
55377 41971 41695 42738 44850 47014 48536 49263 49370 49467 50235 51420 51910 51251 50249 49751 49762 50137 51060 52326
55359 52326 53194 53394 53394 53382 53048 52548 52491 52819 53038 53740 56282 60599 64868 67701 69233 69813 69452 68905 69339
55340 69339 70257 69745 67504 65691 65820 66772 66904 66166 65039 63310 61363 60828 62366 64293 64829 64262 63588
55323 63588 62626 61133 60257 61057 62736 63985 64902 65973 66373 65098 62849 61013 59650 58216 57445 58543
55307 58543 60943 62691 62891 62343 61933 61752 61650 61501 60932 59743 58423 57496 56652 55309 53644 52341 51662
55290 51662 51416 51456 51666 51861 52107 52608 53024 52680 51689 50967 50870 50893 50944 51543 52323 51924 50168 48778 48943 49476
55270 49476 48507 45786 42290 38761 35712 33758 32851 32175 31561 31803 32864 33354 32743 32455 33588 35173
55254 35173 36000 36440 36974 36741 35428 34895 36731 39472 40502 39697 39089 39825 41567 43963 46489 47599
55238 47599 46343 44305 43793 44643 44968 44482 44595 45495 45773 45223 45566 47710 50241 51409 51084 50122 49070
55221 49070 48088 47071 45453 42884 40298 39324 40361 42027 42592 41330 38751 36367 35911 37817 40624
55206 40624 42576 43244 42889 41272 38399 35653 34642 35485 37534 40792 44852 47385 46090 41897 38069
55191 38069 36218 35412 35177 36771 40698 45118 47905 48849 48913 48560 47697 46278 44272 41765 39370 37743
55175 37743 36648 35523 34895 35935 38528 41217 43287 45494 48330 50992 52588 53166 53095 52570 52132 52488
55159 52488 53385 53784 53521 53584 54410 55258 55761 56712 58646 60960 63139 65496 67786 68472 66598 63411 60869
55142 60869 59216 57253 54484 51829 50389 50400 51256 51973 51814 50884 49871 48997 47825 46468 46128 47670
55126 47670 50285 52448 53853 55441 57669 59613 59966 58356 55558 52801 51003 50389 50631 51319 52243 53240
55110 53240 54053 54534 54856 55292 55786 55858 55013 53223 50993 48881 47073 45620 44903 45301 46300 46600 45511
55093 45511 43813 42761 42646 42810 42742 42591 42812 43801 45620 47633 48681 48086 46256 44057 42048 40667
55077 40667 40515 41758 43770 45989 48603 51712 54528 56373 57988 60763 64888 69176 72424 74129 74260
55062 74260 73312 72274 71645 70796 69211 67841 68028 69511 70891 71790 73006 74578 75311 74643 73634 73517
55046 73517 74260 75090 75598 75850 76067 76469 76971 77116 76876 77216 78851 80735 81111 80052 79634 81314 84309
55029 84309 86939 88479 89245 89847 90806 92152 93162 93262 93178 94130 95821 96448 95002 92402 90087 88704
55013 88704 88521 89747 91821 93545 94645 96018 97821 98605 97314 95006 93495 93185 93409 94131 95972 98756
54997 98756 101207 102139 101352 99526 97673 96516 95968 95463 94908 94790 95207 95645 96090 97343 99504 101126 100944
54980 100944 99711 98995 98566 96502 92124 87517 85464 86604 89376 92319 95464 99387 103693 107165 109176
54965 109176 110094 110086 108411 104652 100109 96950 96029 96468 97389 99079 102055 105854 109405 112101 113923 114828
54949 114828 114657 113691 112864 113154 114710 116665 118028 118750 119596 120903 121961 121961 121038 119976 119348 119449 120466
54932 120466 121938 122530 121210 118417 115399 112795 110635 109174 108694 108698 108298 107277 105992 104689 103688 103638
54916 103638 104403 104366 102276 99408 98332 99861 102722 105924 109569 113401 116534 118897 121199 123223 123909
54901 123909 123465 123538 124845 126499 128192 131047 135549 140725 146332 153803 163656 173890 182590 190515 199376
54886 199376 208932 217673 225441 233652 243533 255485 269285 283470 295331 303134 307818 311257 313524
54873 313524 313212 309701 303520 294978 283973 270977 257005 242858 229436 218128 209579 202477 194920
54860 194920 186697 178949 172075 165538 159577 155479 153858 153834 154149 154123 153468 152292 151549 152603 156015 161321
54844 161321 167994 175959 185192 195483 206615 218295 230154 242313 255494 269668 282956 292845
54832 292845 298386 300376 299679 296409 290634 282698 272624 260156 245718 230594 215878 201845 188528
54819 188528 176246 165313 155808 147955 142298 139165 138101 137994 137667 136424 134278 131680 128972 126191
54805 126191 123355 120589 117945 115545 113998 114042 115448 116881 117306 117075 117250 118242 119561 120487 120686 120510
54789 120510 120795 121830 122500 121294 118283 115123 112877 110938 108541 106083 104331 103481 103651 104942 106136
54774 106136 104922 100750 96170 93844 93403 92842 91802 91417 91821 92126 92486 93927 96093 97300 97226 97626
54758 97626 99764 102662 104593 105107 104992 105259 106712 109676 113725 118217 123092 128369 133055 135714 136282
54743 136282 136352 137507 140244 144499 150187 157044 164845 173754 183570 192832 199981 205518 211773 220370 231037
54728 231037 243049 256386 270963 285966 300655 314923 328502 340408 349595 355409 357091 353902
54716 353902 346440 337042 328107 320288 312646 304150 294782 285615 278017 272468 268104 263766 259243 255011
54702 255011 251286 248184 246427 246775 249004 252488 257487 264569 273018 281341 289337 298277 309031 321586
54688 321586 336330 353858 373132 391821 409172 426594 444494 460564 472600 481217 487968 492127
54676 492127 491361 484834 473808 459665 443037 424596 405095 384665 363383 342530 323977 308182
54664 308182 293850 279809 266311 254294 244157 235611 228168 221500 215612 210808 207260 204636 202329
54651 202329 199922 197240 194269 191211 188269 185205 181609 177890 175286 174395 174273 173612 172269 171024 170417
54636 170417 170714 172430 175723 179349 181348 180990 179269 177342 175359 173196 171489 171089 171715 171912 170663
54621 170663 168751 168127 169911 173361 176971 180188 183539 187438 191653 195991 200689 205770 210718 215301
54607 215301 220170 226166 233391 241346 249428 256871 262753 266820 269956 273203 276591 279575 282322 285716
54593 285716 290154 295116 300115 305331 310892 316023 319637 321883 324803 331062 341826 355947 371326
54580 371326 386925 403233 421035 440401 460901 482038 502926 521893 536996 546993 551771 552035
54568 552035 548701 542222 532309 518550 501420 482287 462262 441619 420672 400608 382716 367078
54556 367078 352683 338830 325885 314587 305108 297078 290309 285132 281865 279994 278218 275492 271813
54543 271813 267627 262842 257135 251165 246530 244027 242435 239515 233975 226319 218189 211168 205755 201160
54529 201160 196277 191055 186590 183845 182798 182913 183674 184206 183119 179504 173950 168095 163337 160143 158179
54514 158179 156627 154743 152510 150549 149207 148117 146892 145708 144874 144398 144264 144530 144660 143579 141105
54499 141105 138728 138061 138949 139962 140452 141163 142927 145620 148427 150458 151179 150947 151165 153164 156725 160138
54483 160138 161864 161876 161577 162808 166721 173029 180276 187222 193814 200511 207241 213759 220604 228675 237941
54468 237941 247519 257007 266712 276355 284622 290424 293772 295014 294199 291782 288966 286344 282814 276946
54454 276946 269087 260969 253279 244883 234843 224164 214717 206969 199739 192062 184507 178387 174181 171071
54440 171071 167765 163567 158886 155026 153296 153942 155894 157747 159000 160197 161963 164162 165988 166676 166059
54425 166059 164619 163080 161884 161112 160814 161123 161933 162876 163862 165186 166646 167137 165942 164088 163317 163791
54409 163791 163937 162817 161514 161606 163212 165317 167216 168680 169262 168552 167105 166262 166880 168644 170555 171658
54393 171658 171391 169742 167189 164253 161131 157975 155328 153987 154370 156074 157938 158603 157455 155161 152941
54378 152941 151219 149465 147380 145495 144317 143675 143325 143439 143989 144476 144929 146263 148700 150731 150979 150441
54362 150441 151319 153833 155815 155601 153836 152045 150896 150657 152016 155195 158890 161214 161558 160914 160686 161852
54346 161852 164934 169830 175561 180861 185322 189709 195003 201378 208176 214646 220475 225697 230354 234462
54332 234462 238265 242245 246573 250576 253026 253182 251549 249540 248371 248181 248044 246666 243148 237339 229957
54317 229957 222532 216766 213271 210996 208434 205380 202895 201505 200393 198749 197049 196242 196390 197017 198203
54302 198203 200160 202021 202343 200904 198881 197103 195293 193465 192776 194146 196833 199444 201805 204774 208540
54287 208540 212320 215772 219478 223494 226411 226912 225885 225960 228737 233218 237322 240263 242747 245148 246492
54272 246492 245549 242365 238244 234387 230909 227115 222633 218153 214873 213035 211270 207965 203182 198431
54258 198431 194434 190131 184477 178349 173524 170161 166467 160994 154347 148314 144043 141489 140073 139219
54244 139219 138330 136759 134115 130735 127752 126314 126351 126315 124598 121265 118059 116609 116915 117646 117625 116813 115960
54227 115960 115447 114584 112259 108300 103856 100272 97874 96229 95207 95211 96487 98784 101668 104642 106939
54212 106939 107825 107330 106301 105497 105078 105213 106609 109720 113534 115871 115345 112846 110795 110971 113219 116085
54196 116085 118149 118649 117413 114857 111886 109233 106965 105080 104308 105432 107794 109478 109450 108740 108982 110464
54180 110464 112286 113866 115436 117333 119465 121367 122349 121932 120618 119782 120140 120772 120367 119025 117951 117701
54164 117701 117802 118033 118937 120770 122859 124373 125078 124952 123735 121455 119005 117644 117958 119513 121380 122732
54148 122732 123058 122141 120182 118002 116701 116627 116790 115972 114434 113686 114250 114673 113498 111398 110307 110952 112291
54131 112291 113075 112928 112134 111452 111989 114087 116294 116541 114621 112506 111891 112321 112155 110630 108449 106841
54115 106841 106516 107170 107736 107340 106158 105185 105239 106452 108294 109616 109158 106807 104082 102477 101633 100094
54099 100094 97670 95778 95527 96702 98808 101777 105132 107629 108415 107820 106617 105314 104434 104445 104858 104328
54083 104328 102302 99857 98480 98766 100611 103552 106374 107492 106659 105460 105282 105566 104920 103107 100865
54068 100865 98551 96187 94410 94008 94598 94830 94016 92756 91940 91964 92916 94679 96532 97392 96943 96264 96828
54051 96828 98894 101182 102322 102494 103230 105405 107925 108924 107899 105883 103794 101655 99521 98076 97796
54036 97796 98317 99051 99797 100458 100883 101278 101983 102592 102241 101115 100519 101001 101544 101304 100814 100601 99900 98105
54018 98105 96388 96252 97216 97608 97198 97292 98415 99621 100311 101207 102974 105055 106474 106926 106576 105476 103716
54001 103716 101807 100532 100593 102303 105238 108352 110963 113492 116741 120661 124437 127612 130443 133281 136362
53986 136362 140103 144801 149948 154497 157932 160622 163244 166346 170284 174878 179356 183445 188242 195092
53972 195092 203585 211725 218182 223418 228399 233302 238048 243020 248403 253404 257119 259895 263067 267330
53958 267330 272067 276526 281054 286598 293029 298674 302005 303389 304434 305794 306575 306050 304757 303290 301122
53943 301122 297678 293745 290584 288175 285578 282596 279762 276996 273650 269810 266116 262325 257542 252107
53929 252107 247693 245048 243049 240616 238189 236513 235224 233610 231735 229774 227183 223717 220460 218581
53915 218581 217593 216136 214182 213156 213805 215018 215053 213172 209900 206347 203622 202390 202522 203182 203414 202819
53899 202819 201921 201928 203768 207203 211143 214780 217919 220222 221022 220326 219181 218424 217747 216754 216208 217283 220057
53882 220057 223742 227957 232562 236550 238611 239096 240147 243367 248336 253920 259938 266594 273078 277912
53868 277912 280561 281878 283006 284432 286122 287951 289897 292176 295177 298940 302755 305801 308239 311260
53854 311260 315903 322159 329286 336563 343493 349740 355353 360974 367373 374671 382158 388931 394626 399639
53840 399639 404742 410346 415919 420259 422651 423777 425131 427322 429160 428677 425131 419904 415354 412745
53826 412745 411258 408967 404665 398569 391431 383557 375014 366374 358517 351624 344870 337335 328879 320020
53812 320020 311287 302936 295040 287595 280591 274087 268121 262535 257083 251779 246947 242905 239761 237430
53798 237430 235532 233336 230279 226616 223168 220281 217441 214054 210228 206606 203670 201322 198906 195661
53784 195661 191453 186970 182830 178916 175280 173185 173900 176479 178275 178108 177501 178033 179057 179145 178414 177856
53768 177856 177363 176233 175003 174941 175919 176460 175909 175066 174663 174630 175034 176322 178456 181082 184548 189219 193617
53751 193617 195128 193287 190824 190546 192584 195574 198975 202717 205854 207434 208258 210166 213711 217852 221894
53736 221894 226485 232421 239468 246757 253739 260416 267030 273785 280717 287723 294628 301023 306114 309378
53722 309378 311579 314371 318371 322208 324293 325096 326772 330646 335819 340284 342711 343061 342056 340413 338395
53707 338395 336005 333552 331701 330625 329396 326699 322057 316050 309549 303209 297588 293201 290337 288963
53693 288963 288729 288858 288306 286474 283599 280121 275974 271072 266226 262685 260479 257883 253019 245825 238214
53678 238214 232491 229759 229508 230223 230351 229120 226859 224595 223081 222162 221246 220335 220082 220563 220714 219806 218986
53661 218986 220174 223429 226685 228495 229737 231846 234601 236949 239098 242135 245881 248839 250444 251918
53647 251918 254352 257274 259883 262683 266788 272181 277755 282844 287822 293103 298362 302949 306549 309145
53633 309145 310740 311464 311812 312522 314255 317389 321845 327001 331979 336320 340192 343715 346443 348044 349350
53618 349350 351808 355572 358853 359915 359282 359240 361431 365663 370763 375479 378505 378907 377186 375089 373721
53603 373721 372495 370615 368848 368810 370837 373588 375742 377176 378344 379224 379216 377721 374727 371135 368455 367572
53587 367572 367749 367268 365302 362774 361223 361281 362453 363984 365457 366648 367203 366743 365345 363837 363414 364695
53571 364695 367246 370143 372882 375422 377490 378357 377628 376019 375024 375733 378103 381385 385083 389296 394130
53556 394130 399193 403987 408668 413928 420039 426475 432650 438616 444718 450888 456738 462267 468211 475636
53542 475636 485166 496303 507414 516922 524864 532885 542250 552261 561177 568354 574728 581386 588546
53529 588546 596111 604337 613406 622734 631216 638041 643141 647079 650758 654855 659170 662678 664733 666259
53515 666259 669169 674296 680224 684729 687188 688901 690964 692775 693301 692967 693058 693556 692981 690702 688066 686622
53499 686622 686310 686344 686830 688253 689975 690708 690388 690307 691255 692652 693785 694823 696077 697153 697618 698032 699564
53482 699564 702634 706382 709530 711608 713296 715653 719018 722746 725997 728574 730921 733773 737997 744307
53468 744307 752614 762046 772129 783487 796766 811405 826398 841911 858953 877577 896613 915353
53456 915353 934325 954218 975183 997584 1022146 1048745 1076228 1104245 1134100 1166655 1200453
53445 1200453 1233402 1265711 1299592 1336277 1374984 1415089 1457676 1504029 1553468 1603715 1653011
53434 1653011 1701159 1748823 1796675 1845340 1895448 1947171 1999804 2052227 2103903 2155124 2206083
53423 2206083 2256092 2304331 2351260 2398532 2447170 2496501 2545402 2593974 2643092 2692570 2740799
53412 2740799 2786355 2829230 2870193 2909646 2947576 2984072 3019241 3052811 3084343 3113746 3141147
53401 3141147 3166252 3188282 3206694 3221726 3234095 3244325 3252355 3257497 3258641 3254938 3246635 3235084
53389 3235084 3221473 3205596 3186245 3162726 3135525 3105433 3072730 3037540 3000399 2961779 2921512
53378 2921512 2879459 2836539 2794120 2752295 2709652 2665111 2619182 2572951 2526713 2480578 2435884
53367 2435884 2394760 2358106 2324852 2293495 2263635 2235658 2209750 2185999 2165087 2147954 2134593
53356 2134593 2123962 2115417 2109774 2108395 2111489 2117957 2126981 2139137 2155521 2176090 2199491 2224662
53344 2224662 2252255 2284212 2321907 2364801 2410953 2458847 2508610 2561310 2617296 2675724 2735926
53333 2735926 2798708 2865717 2937667 3013757 3092829 3174552 3259228 3346970 3437566 3530966 3627506
53322 3627506 3727547 3831051 3937511 4046087 4155747 4265509 4374817 4483820 4592972
53313 4592972 4702044 4809611 4914063 5015211 5114334 5212194 5307583 5398382 5483573 5563229
53303 5563229 5636698 5702082 5758035 5805259 5845545 5879808 5907667 5928525 5942285 5948946 5948062 5938794
53291 5938794 5920421 5892806 5856518 5812350 5760590 5700748 5632046 5554050 5467071 5372391 5272110
53280 5272110 5168184 5061400 4951744 4839895 4727584 4616069 4505088 4394181 4284515
53271 4284515 4178233 4076006 3976186 3876718 3777243 3679055 3583549 3491153 3401525 3314463 3230668
53260 3230668 3151563 3078105 3009756 2944974 2882774 2823503 2768091 2717025 2670283 2627730 2589087
53249 2589087 2553678 2520698 2489870 2461640 2436626 2414969 2396247 2380002 2366296 2355722 2348872
53238 2348872 2345855 2346376 2350008 2356213 2364370 2374123 2385656 2399239 2414606 2431241 2449332 2469893 2493681
53225 2493681 2520439 2549606 2581398 2616600 2655377 2696824 2739786 2783800 2829119 2876181 2925275
53214 2925275 2976308 3028339 3079332 3126948 3170116 3209776 3247770 3284913 3320318 3352449 3380382
53203 3380382 3403972 3423503 3439708 3453780 3466565 3477657 3485781 3490030 3490179 3485765 3475739 3459522
53191 3459522 3437894 3412269 3383379 3351156 3315503 3276463 3233692 3186432 3134315 3077989 3018963
53180 3018963 2958909 2898759 2838070 2775637 2711391 2647426 2586265 2528098 2470710 2412381 2353850
53169 2353850 2296947 2242285 2189276 2137732 2088102 2040219 1992868 1945016 1896889 1849614 1804163
53158 1804163 1760771 1719087 1678845 1640527 1604979 1572003 1539840 1506977 1474229 1443962 1417149
53147 1417149 1392209 1367064 1341330 1315995 1291839 1268891 1246732 1224615 1201802 1178451 1155728
53136 1155728 1134497 1114473 1095094 1076447 1058518 1040364 1021104 1001132 981237 961177 940449
53125 940449 919884 900702 882220 862565 841986 823360 808422 795199 780527 763795 746654
53114 746654 730141 714003 698364 684079 671073 657769 642836 626781 611395 598175 587466
53103 587466 578543 570139 561235 551649 541885 532621 524494 517935 512593 507176 500538 492867 485266 478354
53089 478354 471924 465706 459593 453206 446231 439394 434093 430666 427815 424121 419378 414115 408765 403942
53075 403942 400573 398760 397151 394496 391432 389630 389323 388852 386820 383775 381458 380964 381918 382840 382098 379052
53059 379052 374638 370563 367792 366062 364752 363630 362767 362399 363000 364727 366666 367419 366850 366403 367163 368485
53043 368485 369262 369719 370885 372843 374765 376421 378471 381253 384359 387460 390427 392488 392540 390824 389255
53028 389255 389361 390656 391562 391053 388671 383999 377363 370545 365426 361939 358460 354220 350263 347794 346538
53013 346538 345223 342991 339716 335368 329702 322560 314240 305580 297687 291305 286273 281725 276945 271956
52999 271956 267337 263613 260786 258324 255664 252850 250473 248768 247036 244375 240760 236956 233521 230499
52985 230499 228051 226619 226198 226018 225378 224457 223914 223918 223932 223294 221707 219198 215986 212656 210336 210169 212112
52968 212112 214339 214550 212261 209273 207421 206402 204563 201318 197744 194931 193057 192368 193810 197687 202334
52953 202334 205015 204163 200433 195851 192285 190421 189695 189225 188840 188868 188895 187506 183870 179168 175777 175106
52937 175106 176662 179042 181262 183011 184177 184546 184020 182923 181857 181194 180951 181313 182837 185593 188450
52922 188450 190126 190896 192329 195120 198131 200013 200777 201148 201316 201301 201794 203401 205434 206664 207198 208526
52906 208526 211642 216053 220667 224644 227125 227461 226438 226429 229246 234168 238936 242443 245564 249385 253752
52891 253752 258133 263058 269524 277130 283911 288525 291885 295860 300827 305414 308520 310556 312353 313660
52877 313660 313422 311181 307792 304854 303628 304183 305313 305591 304683 303327 301994 300116 296859 292129 286514
52862 286514 280850 276264 273924 273974 275027 275278 273889 270994 267062 262973 260168 259659 260935 262542 263524
52847 263524 263736 263125 261641 259709 257909 256185 254077 251709 249787 248817 249070 251040 254741 258542 260126
52832 260126 259113 257693 258022 259845 261403 261739 261234 260472 259738 259453 260086 261417 262554 262952 263030 263558 264716
52815 264716 265918 266413 265876 264559 263041 261962 261843 262947 265158 268027 270922 273107 273915 273335 272492 272992
52799 272992 275464 279156 283128 287161 290945 293246 293028 291071 289347 288809 288846 288954 289743 291914 295182 298719
52783 298719 301923 304393 306036 307705 310829 315688 320803 324783 328034 331629 335226 337429 338040 338603 340476
52768 340476 343434 346549 349449 352063 353946 354770 355069 355547 355758 354393 351139 347502 345308 344815 344738 343694
52752 343694 340999 336513 330743 325123 321207 319105 317428 315100 312366 309476 305508 299578 292519 285915
52738 285915 279868 273408 267150 263614 263951 265720 265264 261549 256470 251934 248164 244858 242483 241607 241626
52723 241626 241024 238756 235049 231029 227951 226558 226561 226670 225555 223116 220536 218803 217557 215813 213529
52708 213529 211707 210925 210541 209525 207382 204026 199695 195484 193025 192621 192306 189855 185356 180773 177276
52693 177276 174308 171294 168914 168102 168655 169404 169277 167880 165520 162919 160515 158097 155487 153313 152277
52678 152277 151870 150859 149110 147863 147906 148508 148553 147842 146886 146299 146767 148653 151032 152074 151098 149527 149163
52661 149163 150219 151609 152438 152510 151994 151340 151079 151146 150898 150125 149394 149081 149008 149418 151035 153312 153947 151452
52643 151452 147282 144099 142815 142803 144105 147309 151392 153823 153405 151596 150482 150674 151717 153300 155115
52628 155115 156351 156368 155677 155657 157374 160930 165594 170253 174009 176824 179697 183924 189867 196258 200928
52613 200928 202657 202398 202192 202864 203364 202478 200318 197697 194947 192052 189160 186123 182241 177453 173151
52598 173151 170694 169577 168215 166103 163970 162112 160032 157638 155524 153849 152084 149963 147639 144928
52584 144928 141650 138785 137882 138922 139994 139545 137811 135734 133804 132533 132641 133765 134162 132806 131021
52569 131021 130912 132789 135166 136852 137974 139174 140690 142179 142878 142063 139845 137333 135634 135014 135347
52554 135347 136810 139490 142642 145019 145814 144949 142853 140498 139282 140098 142514 145261 147410 148786 149541
52539 149541 149873 150011 150018 149668 148768 147517 146396 145921 146557 148320 150269 151072 150549 150072 150853 152411 153457
52522 153457 153714 154018 154986 156604 158966 162247 165835 168493 169830 170971 173439 177725 183105 188209 191583
52507 191583 192419 191296 189945 189882 191469 194351 198214 202610 206449 208414 208084 206351 204669 204002 204384 205158
52491 205158 205627 205663 205786 206541 207818 208965 209578 209879 210219 210577 210909 211801 214115 217742 221119 222466 221449
52474 221449 219421 218103 218295 219740 221719 223518 224501 224187 222557 220387 218966 219140 220592 222354 223975
52459 223975 225713 227466 228350 227808 226508 225353 224066 221759 218749 216732 216989 219187 222114 224733 226305
52444 226305 226396 225369 224284 223836 223875 224305 225671 228225 230979 232458 232259 231340 231003 231964 234037 236252 237482
52427 237482 237441 236908 236729 236973 237346 237896 238744 239568 240076 240694 242093 244182 246188 247678 248867 249995 251018
52410 251018 251967 253053 254280 255397 256337 257311 258399 259323 259782 259752 259494 259450 260063 261433 263140 264577 265438
52393 265438 265835 266187 267166 269311 272385 275323 277194 278006 278372 278791 279652 281401 284109 287104 289579 291306
52377 291306 292412 293078 294102 296978 302051 307007 308752 306965 304344 302973 301941 299408 295600 292321
52363 292321 290251 288365 286027 284327 284842 287688 291198 293256 292878 290882 289077 288466 288227 286739 283621
52348 283621 280331 278665 279080 280701 282506 284069 285267 285867 285659 284787 283731 282974 282758 282995 283354 283559
52332 283559 283812 284717 286486 288420 289667 290497 292172 295293 298873 301537 303107 304319 305346 305534 304711
52317 304711 303925 304533 306970 310693 314885 318842 321970 323943 324943 325632 326787 328841 331569 334265 336417
52302 336417 338184 340083 342348 344854 347480 350088 352316 353942 355467 357596 359928 360880 359561 357386
52288 357386 357173 360640 367175 374922 382484 389346 395153 399352 401848 403564 405806 408931 412133 414562
52274 414562 416215 417437 418230 418638 419302 420812 422811 424588 426308 428654 431409 433656 435516 438313 442453
52259 442453 446465 449162 451658 455942 462172 468787 474991 481573 489101 496668 503151 508894 515316 523188
52245 523188 531977 540939 550323 561144 573810 587486 601176 615103 630149 646042 661280 675406
52233 675406 690299 708089 728461 749103 768431 786723 804957 823947 844579 867343 891118
52222 891118 913583 933576 952331 971904 993095 1015249 1037287 1058305 1077945 1096785 1115674
52211 1115674 1134077 1149824 1161335 1169668 1177546 1186652 1196553 1205941 1214117 1221278 1227926 1234027 1238652
52198 1238652 1240789 1240754 1240142 1239937 1239382 1237379 1234248 1231122 1228242 1225184 1222483 1221605 1223075 1225732 1228215
52183 1228215 1230298 1232493 1235250 1238902 1243557 1248598 1253154 1257602 1263870 1273451 1285582 1298113 1309890
52170 1309890 1321576 1334230 1347804 1361330 1374199 1386808 1399832 1413109 1425712 1437224 1448344
52159 1448344 1459815 1471262 1481773 1491170 1499721 1506940 1511861 1514531 1516027 1516756 1515935 1513146 1509118 1504313
52145 1504313 1497925 1489241 1479039 1468648 1458412 1448117 1438119 1428860 1419774 1409878 1399085 1387979
52133 1387979 1376717 1365300 1354488 1345135 1336796 1328258 1319357 1311051 1303825 1297410 1292125 1288893 1287344
52120 1287344 1285226 1280644 1274043 1267317 1261673 1257148 1253640 1251536 1251281 1252564 1253936 1253450 1250280 1245608
52106 1245608 1241281 1237658 1233522 1228011 1221582 1215065 1208941 1203893 1200740 1199134 1197315 1193904 1189183 1183959
52092 1183959 1178194 1171686 1165312 1160407 1157172 1154526 1151197 1146410 1139928 1132231 1124473 1117695 1112233 1108017
52078 1108017 1104779 1101649 1097431 1091930 1086257 1081237 1076467 1071686 1067870 1065701 1063906 1060685 1056092 1051387
52064 1051387 1046622 1040735 1033875 1027641 1022831 1018780 1015338 1013617 1013895 1014436 1013605 1011881 1010483 1009096 1006603
52049 1006603 1003615 1002627 1005446 1011513 1019061 1027021 1035290 1043721 1051759 1059322 1067548 1078118 1091697 1107489
52035 1107489 1124509 1142727 1162496 1183501 1205092 1227365 1250861 1275351 1299932 1324411 1349508
52024 1349508 1375463 1401483 1426948 1452124 1477151 1501321 1524100 1546055 1567985 1589650 1610018
52013 1610018 1628220 1643791 1656691 1667721 1678134 1688061 1696055 1701056 1704011 1706438 1708127 1707645 1704674
52000 1704674 1700281 1695041 1688432 1680338 1671641 1662807 1653139 1642169 1630908 1620969 1613132 1607323 1603257
51987 1603257 1600318 1597362 1593444 1588539 1583084 1577305 1571601 1567072 1564760 1564471 1565094 1566008 1567468 1569548 1571502
51972 1571502 1572638 1573445 1575336 1579246 1584651 1590054 1594465 1598302 1602609 1607409 1611391 1613508 1614400 1615523
51958 1615523 1617053 1617429 1615075 1609991 1603398 1596414 1589480 1582596 1575480 1567435 1557500 1544990 1530044 1513720
51944 1513720 1497349 1481324 1464555 1445585 1424293 1401834 1378693 1353752 1326017 1296494 1267146
51933 1267146 1238336 1208604 1177131 1145076 1113827 1083096 1051815 1020320 990282 962422 935402
51922 935402 907555 879059 851675 826516 802773 778896 754514 730621 708090 686789 666316
51911 666316 646812 628415 610560 592717 575466 559852 545836 532617 520491 510902 504012 497569
51899 497569 489304 479629 470817 464107 458786 453654 448138 442064 435555 429386 424550 421198 418483 415508
51885 415508 411878 407569 402918 398615 394917 391029 386029 380241 374778 369928 365174 360684 357386 355276
51871 355276 353076 350203 347794 346849 346339 344239 339918 334698 330478 328369 328012 327578 324984 319884 314005
51856 314005 309066 305115 301559 298815 297663 297587 297179 295948 294497 293066 291251 289249 288003 287673 287076
51841 287076 285287 282993 281533 281150 280761 279128 275847 271536 267496 264870 263732 263074 261851 259879 257685
51826 257685 255884 254804 254389 254244 254080 254257 255459 257658 259839 261091 261536 261759 261752 261135 260291 260429 262158
51809 262158 264480 265690 265073 263323 261453 259995 259439 260619 263831 267815 270680 272102 273693 276548 279259
51794 279259 279460 276977 274183 273089 273255 273146 272593 272938 275166 278858 282904 286453 289030 290380 290635 290329
51778 290329 289979 289834 290064 290801 291767 292350 292497 293208 295516 299089 302578 305328 307985 311059 313727 314826
51762 314826 314505 313970 313693 312870 310827 308179 306239 305820 306918 308954 310941 311878 311562 310727 310038 309258 307846
51745 307846 306026 304705 304541 305540 307426 309888 312461 314671 316401 317834 318928 319197 318213 316327 314785
51730 314785 314806 316256 317490 317150 316062 316489 319267 322658 324626 325332 326482 329014 332620 336986 341990
51715 341990 346726 349849 351323 352756 355434 358940 362228 365219 368687 373184 378777 385371 392628 399872
51701 399872 406723 413588 421028 428788 436037 442507 448819 455502 461942 466693 468856 468999 468326 466971 463807
51686 463807 458460 452892 449922 450316 452334 454091 455099 455327 454400 452783 452410 454527 457515 458440 456574
51671 456574 453955 452430 451784 451298 451621 453774 457096 459628 460515 460879 461902 463035 462878 461429 460297 460475
51655 460475 460982 460563 459910 460658 462357 462271 459022 454893 453058 453594 454073 453456 453158 454095 454973 454512 453522 453316
51637 453316 453441 452719 451612 451636 452883 454055 454976 457100 461029 465254 468252 470546 473592 477696 482187
51622 482187 486827 491699 496155 499277 501352 503818 507458 511387 513795 513149 509072 502977 497624 494784
51608 494784 493193 489891 483786 476617 470112 463737 456182 447786 439999 433172 426359 419052 411775 405009
51594 405009 398774 393474 390065 388887 388944 388772 387584 385522 383369 382160 382438 383496 383707 381829 377884
51579 377884 372854 367975 364122 361318 358799 356118 353993 353418 354036 354356 353572 352101 350100 346723 341654
51564 341654 336303 332536 330849 330656 331645 333672 335827 336973 337271 338076 340086 342464 343977 344261 343760 343204
51548 343204 343454 345103 347742 350126 351600 352964 355439 359074 362747 365555 367623 369563 371755 374521
51534 374521 378571 384562 391930 398607 402639 404310 406191 410604 417242 423700 428065 430285 431071 430492 428345
51519 428345 425359 423089 422455 422849 422862 421678 419754 418397 418673 420391 422114 422537 422007 422428 425449 430931
51503 430931 437289 442919 447056 449756 451830 454704 459448 465456 470567 473042 473264 473215 474472 477088 480178
51488 480178 483054 485670 488286 490926 493187 494676 495607 496578 497603 497814 496579 494482 492577 490966 488855
51473 488855 485891 482604 479458 476338 473258 470795 469406 468839 468541 468049 466690 463758 459574 455659 453125
51458 453125 451475 449745 448241 448061 449283 450754 451617 451913 451577 450036 447275 444366 442252 440639 438740
51443 438740 436552 434583 432609 429575 424913 419538 415351 413843 415114 417996 421125 423971 426838 429937
51429 429937 432921 435566 438482 442572 447780 452946 457064 460393 464139 469300 475986 483554 491065 497746
51415 497746 503420 508633 514144 520268 526857 533888 541636 550029 558182 565060 570544 575412 580271 584968
51401 584968 589148 592916 596527 599773 602159 603550 604232 604310 603543 601983 600437 599967 600950 602784 604394 604688
51385 604688 602594 597280 588970 579379 570641 563517 557138 550731 544865 540319 536353 531301 524749 517995
51371 517995 512169 507099 502495 499042 497375 496869 496590 496854 498600 501514 504050 505381 506219 507481 509040
51356 509040 510190 510620 510545 510389 510591 511238 511777 511421 509802 506694 501462 493798 485017 477392 471811 467116
51340 467116 462118 457024 452184 446802 440192 433413 428133 424241 420029 414516 408256 401852 395063 387713
51326 387713 380323 373349 366760 360782 356048 352421 348559 343387 337344 331482 326026 320784 316347 313659
51312 313659 312440 311163 308820 305906 303324 300948 297776 293191 287671 282366 278202 275307 273174 271335
51298 271335 269776 268646 267870 267410 267656 268983 270877 272060 271699 270211 268803 268529 269714 271779 273552
51283 273552 274345 274859 276427 279229 282138 284632 287790 292530 297744 301453 303372 305050 307677 311055 314721
51268 314721 318637 322395 325113 326770 328473 330575 331622 330210 327030 323745 320446 315660 308811 301292
51254 301292 294811 289704 285267 280978 276868 273220 270378 268520 267255 265647 262806 258461 253097 247819
51240 247819 243832 241503 239936 238041 235932 234677 234664 234996 234829 234491 234674 234995 234198 231820 229063 227690
51224 227690 228163 229151 229080 228056 227815 229539 232268 234031 234204 233982 234645 236145 237390 237178 234841 230923
51208 230923 227351 225929 226264 226060 223888 220670 217968 215975 214110 212514 211516 210325 207806 204367 201663
51193 201663 200329 199258 197331 194826 192801 192034 192873 195170 197931 199836 200588 201134 202124 202885 202394 200619
51177 200619 198314 196107 194399 193590 193672 193961 193938 194080 195151 196995 198732 199988 201062 201914 201965 201232 200924
51160 200924 202228 204900 207607 209496 210949 212764 215013 216916 217703 217333 216347 215263 214324 213766 213923 214839
51144 214839 216023 216933 217595 218422 219453 220223 220584 221317 223503 227297 231611 235094 237235 238406 239094 239413
51128 239413 239388 239288 239382 239487 239202 238587 238224 238412 238669 238407 237825 237694 238245 238702 238087 236129 233229 229859
51110 229859 226393 223306 221021 219383 217679 215419 213001 211383 211159 212113 213546 214750 215249 215025 214686
51095 214686 215104 216494 217971 218314 217180 215432 214417 215142 217825 221685 225174 226983 227080 226381 225281 223199
51079 223199 219977 217066 216259 217409 218367 217532 215740 215012 215948 217115 216921 215358 213658 212748 212509 212305
51063 212305 211639 210154 207535 203881 200123 197596 197047 198143 199981 201792 203079 203410 202577 200957 199440
51048 199440 198841 199369 200581 201653 201848 200987 199656 198809 199067 200437 202673 205731 209645 214011 217853 220288
51032 220288 221376 222071 223164 224494 225501 226451 228481 232220 236749 240292 241687 241020 239271 237741 237416
51017 237416 238215 239055 239195 239314 240543 242642 244136 244484 245133 247796 252321 256902 259999 261414 261866 262227
51001 262227 263127 264631 266089 266620 265859 264192 262382 261146 260847 261262 261702 261593 260883 259859 258880 258438 258995
50984 258995 260315 261248 260686 258653 256163 254313 253832 255024 257432 259810 261090 261335 261281 261311 261627 262998
50968 262998 265977 269333 270680 269422 267995 269147 272638 275691 276408 275694 275728 277471 280112 282409 284006
50953 284006 285475 287505 290350 294003 298448 303322 307589 310325 312077 314802 319941 326923 334052 340469
50939 340469 346577 352813 358910 364628 370537 377504 385602 393963 401726 408971 416669 425847 436784 448822
50925 448822 460826 471964 482369 493202 505846 520897 538019 556805 577393 600018 624442
50914 624442 650387 678190 708374 740834 775298 812461 853655 899209 948091 999528 1053988
50903 1053988 1111995 1172970 1236028 1301267 1369337 1440286 1513536 1588395 1663622 1737031 1806601
50892 1806601 1871665 1932124 1987013 2035207 2077254 2114886 2148464 2176252 2196595 2209641 2216517
50881 2216517 2218093 2215187 2208800 2199311 2186481 2171228 2156371 2144204 2133895 2122601 2108879 2093647
50869 2093647 2077761 2060073 2038492 2012047 1981261 1946985 1909418 1868030 1822088 1771452 1717083
50858 1717083 1660663 1603599 1546589 1490102 1434757 1381005 1328817 1278182 1229749 1184597 1143368
50847 1143368 1105878 1071589 1040196 1011693 986113 963414 943549 926502 912208 900517 891192
50836 891192 883869 878063 873383 869827 867769 867550 869081 871791 874941 878019 881044 884546 889038 894377
50822 894377 899797 904798 909883 916155 924145 933185 941944 949598 956611 964534 974792 987462 1001396
50809 1001396 1015737 1031052 1048553 1068438 1089663 1111537 1135012 1162040 1193882 1230226 1269759
50798 1269759 1311412 1355367 1403115 1456483 1516432 1582910 1655814 1735655 1822973 1917491 2018524
50787 2018524 2126385 2242857 2369743 2506858 2651730 2801415 2954425 3110704 3270015
50778 3270015 3430815 3590662 3746987 3897041 4037616 4165584 4278658 4375184 4453466 4512108
50768 4512108 4551210 4572671 4579130 4573042 4556875 4533426 4505230 4473865 4440382 4406436 4374551 4347005
50756 4347005 4324343 4304807 4285164 4262259 4234089 4199668 4158221 4108685 4049798 3980458 3900183
50745 3900183 3809535 3709945 3602835 3489123 3369950 3247553 3124868 3004496 2888596 2779383
50735 2779383 2678653 2586801 2503340 2428651 2364181 2310520 2266295 2229799 2201098 2181725 2172629
50724 2172629 2173009 2180929 2194690 2213801 2238670 2268786 2301185 2331753 2358507 2382503 2404794 2423748
50712 2423748 2436694 2443282 2445534 2444927 2441157 2433726 2423014 2409172 2391298 2368577 2341475 2311192
50700 2311192 2278630 2244422 2209305 2173711 2137360 2099939 2062100 2025415 1991282 1959833 1929833
50689 1929833 1899921 1870473 1844056 1823446 1809253 1800112 1794986 1794247 1798525 1807991 1823294 1845798
50677 1845798 1875733 1911150 1950159 1993720 2044784 2104904 2173068 2247826 2328975 2416505 2509245
50666 2509245 2605634 2705089 2807419 2911093 3013074 3110478 3201709 3285866 3361753 3427906 3483231
50655 3483231 3527047 3558547 3576584 3580275 3569885 3547124 3514600 3474937 3430395 3383110 3335347
50644 3335347 3289239 3246365 3207801 3174416 3146705 3124180 3105344 3088493 3072379 3055962 3037787
50633 3037787 3015965 2988735 2954989 2914624 2868659 2818569 2765061 2707787 2646992 2585340 2527225
50622 2527225 2475867 2431524 2392845 2359512 2333021 2315051 2305651 2303333 2306983 2317515 2337391 2368465
50610 2368465 2410693 2463292 2526480 2601096 2686526 2780081 2878863 2981514 3087625 3196042 3304354
50599 3304354 3409748 3509847 3602984 3688215 3765099 3833360 3892908 3944126 3987564 4023175 4050355
50588 4050355 4068990 4079954 4084285 4082498 4075069 4063036 4047700 4030284 4012225 3995157 3980161 3967672
50576 3967672 3958492 3953963 3954466 3958757 3965786 3976291 3991397 4010243 4030266 4049291 4065970 4078615
50564 4078615 4085389 4086018 4082074 4075134 4065468 4052634 4036459 4017443 3997090 3977874 3961847 3949209
50552 3949209 3939146 3932034 3929725 3933496 3942667 3955297 3969118 3981761 3991417 3997810 4001518 4002021 3997359
50539 3997359 3985779 3966399 3937965 3898509 3846927 3783709 3709485 3624292 3529218 3427430 3322271
50528 3322271 3215156 3106326 2996768 2888290 2782517 2680949 2585223 2496005 2412238 2332847
50518 2332847 2258737 2191797 2132318 2078865 2030699 1988837 1954367 1926841 1904964 1888154 1876790
50507 1876790 1871164 1870674 1874164 1881006 1891699 1907032 1926899 1950622 1978499 2011897 2051366 2095724
50495 2095724 2143883 2196719 2256094 2322681 2395791 2474837 2559800 2650648 2747440 2850658 2960139
50484 2960139 3073764 3188380 3301992 3413971 3523228 3627552 3725150 3815806 3900135 3978699
50474 3978699 4052434 4123143 4192824 4262750 4333509 4405556 4479508 4556212 4636755 4722070 4812496
50463 4812496 4907936 5008330 5113632 5223461 5337242 5454481 5574389 5695380 5815435 5932709
50453 5932709 6045104 6149430 6241828 6319116 6379248 6420651 6441911 6442182 6421144 6378519 6314283
50442 6314283 6229631 6127373 6011411 5886058 5755420 5622730 5490544 5362197 5242645 5136920
50432 5136920 5047891 4976266 4922202 4885597 4865043 4858083 4862738 4877468 4899198 4922498 4941190 4949878
50420 4949878 4943854 4918936 4872335 4803069 4711282 4598133 4466657 4321576 4167459 4007624
50410 4007624 3844763 3681337 3518927 3358645 3202918 3055417 2918202 2790188 2669644
50401 2669644 2557144 2454642 2362548 2279427 2204191 2137061 2078378 2027686 1984089 1946576 1913986
50390 1913986 1885493 1861217 1841853 1827764 1818799 1814526 1814031 1816080 1820303 1827825 1839827 1855961 1875141
50377 1875141 1897440 1923941 1954797 1988711 2024499 2062067 2101545 2142434 2184211 2227309 2272928
50366 2272928 2321954 2374032 2427615 2481187 2534663 2589153 2645000 2700831 2755259 2808825 2863096
50355 2863096 2918310 2973287 3027604 3082563 3139761 3199745 3262307 3327157 3393924 3462271 3532145
50344 3532145 3603234 3674171 3743149 3809318 3872581 3932093 3986273 4034455 4076961 4112868 4139120
50333 4139120 4152834 4153377 4141177 4115673 4075988 4022924 3958618 3884188 3799032 3702755 3596978
50322 3596978 3485206 3371690 3260635 3155605 3058926 2971646 2894071 2826273 2768265 2720152
50312 2720152 2682142 2654235 2635926 2626403 2624711 2629282 2637418 2645742 2651255 2651740 2645384 2630572 2606323
50299 2606323 2572685 2530458 2480596 2423902 2361260 2294074 2224320 2153958 2084297 2016082 1950000
50288 1950000 1886600 1825739 1766680 1709106 1653751 1601962 1555075 1514247 1480032 1451520 1426562
50277 1426562 1403609 1382952 1365475 1350751 1337333 1324698 1313715 1305145 1298851 1294950 1294699 1299200
50265 1299200 1307690 1317990 1328639 1339958 1352968 1368025 1384893 1403651 1424730 1447894 1471807
50254 1471807 1495117 1517752 1540709 1564770 1590027 1616510 1644331 1672852 1700539 1726401 1751133
50243 1751133 1776129 1801734 1827152 1851630 1874702 1895317 1911825 1923246 1930012 1933124 1933013 1929422
50231 1929422 1922046 1911095 1897565 1882894 1867884 1852003 1834293 1814839 1794465 1772880 1748219
50220 1748219 1719085 1686378 1652424 1618756 1585451 1552316 1519945 1489518 1461841 1436525 1411986
50209 1411986 1386659 1360548 1335199 1311892 1290315 1269394 1248838 1229168 1210731 1193577 1178164
50198 1178164 1165290 1155145 1147058 1140282 1134561 1129858 1126060 1123047 1120605 1118212 1115382 1112256 1109461
50185 1109461 1107383 1106140 1106208 1108310 1112314 1116767 1119941 1121028 1120107 1117538 1113877 1110024 1106728 1103826 1100269
50170 1100269 1095004 1087824 1079563 1071571 1064810 1059193 1053972 1048839 1044324 1040842 1037703 1033612 1028137 1022197
50156 1022197 1016943 1012566 1008567 1005043 1003144 1003998 1007376 1011817 1016092 1020152 1024426 1028623 1031758 1033270
50142 1033270 1033615 1033657 1033847 1034098 1034092 1033557 1032579 1031755 1031716 1032307 1032594 1031899 1030485 1028906 1027013 1024108 1019942 1015141
50124 1015141 1010577 1006597 1002832 998612 993470 987420 980819 974046 967355 960902 954585 947861 940191 931964
50110 931964 924698 919963 918187 918589 919933 921134 921517 921083 920406 919880 919128 917533 915204 912869 910816 908480
50094 908480 905195 900851 895586 889381 882484 875930 870985 868003 866153 864381 862354 860449 859247 859229 860636
50079 860636 863142 865801 867752 869067 870613 873070 876414 880245 884066 887188 889143 890693 893776 899756
50065 899756 908070 917103 925825 933812 940442 945408 949772 955077 961340 967250 972515 978407 985469 992346
50051 992346 997852 1002708 1007919 1012747 1015914 1017955 1020580 1024185 1027643 1030290 1032558 1034825 1037288 1040943
50037 1040943 1046944 1054694 1062208 1068859 1076306 1086094 1097869 1110716 1124824 1140645 1157503 1174323
50025 1174323 1191172 1209031 1228537 1249797 1272804 1297100 1321491 1345103 1368512 1393144 1419954
50014 1419954 1449287 1481421 1516254 1552867 1590495 1629665 1671404 1715561 1761092 1807977 1857645
50003 1857645 1911131 1967867 2026825 2088102 2152813 2221970 2296112 2375690 2461076 2552125 2648057
49992 2648057 2747801 2850108 2953120 3053968 3149212 3236042 3312995 3379282 3433771 3475531 3505634
49981 3505634 3527541 3544806 3558600 3568018 3572290 3571665 3566039 3553614 3531260 3495831 3445169 3378622
49969 3378622 3297208 3203317 3100163 2991396 2880669 2770763 2662989 2557855 2456407 2360419
49959 2360419 2271185 2188613 2111759 2040004 1973613 1913420 1860002 1812953 1771022 1733234 1699625
49948 1699625 1670512 1645294 1622697 1601958 1582910 1564940 1547074 1529473 1513821 1501401 1491429
49937 1491429 1481939 1471751 1460792 1449102 1436530 1423245 1409682 1396031 1382417 1369327 1357025
49926 1357025 1344758 1331584 1318095 1306214 1296897 1289062 1281355 1273989 1267939 1263214 1259253 1256582 1256525
49913 1256525 1259062 1262439 1265583 1269788 1276946 1286866 1297644 1308426 1320504 1335396 1352909 1371761
49901 1371761 1391433 1412658 1436290 1462222 1489316 1516107 1541927 1567852 1596512 1630389 1670079
49890 1670079 1714236 1761076 1809868 1861337 1917265 1979742 2050295 2129452 2217176 2313626 2419335
49879 2419335 2534787 2660172 2795378 2939729 3091497 3247979 3406089 3562529 3713468
49870 3713468 3854867 3983962 4100533 4206403 4303647 4393280 4475352 4549749 4616593 4675957
49860 4675957 4727293 4768998 4798289 4811433 4804491 4774553 4720891 4645161 4550445 4440007 4316701
49849 4316701 4182990 4041042 3892880 3740753 3587293 3434918 3284997 3137897 2993932
49840 2993932 2854061 2719618 2591729 2471159 2358425 2253784 2157176 2068266 1986469 1910994
49830 1910994 1841119 1776517 1717032 1662073 1610681 1562457 1518000 1477897 1441473 1407088 1373741
49819 1373741 1341819 1312043 1284082 1256696 1229089 1201592 1174942 1149451 1125261 1103083 1083919
49808 1083919 1067862 1053710 1040201 1027316 1015930 1006472 998521 991640 985896 981303 977391 973828 971159
49795 971159 970297 971315 973149 974598 975413 976349 978305 981455 985202 988944 992789 997304 1002533 1007778 1012628
49780 1012628 1017917 1025086 1034747 1046416 1059519 1073970 1089545 1105462 1121247 1137665 1156168 1177651
49768 1177651 1202399 1231055 1264662 1303451 1346367 1392422 1442000 1496290 1556008 1621632 1694642
49757 1694642 1777180 1869849 1970479 2075659 2183088 2291908 2401121 2508472 2610935 2705714
49747 2705714 2790673 2864329 2925927 2975629 3014638 3045133 3069782 3090765 3108858 3123395 3132991
49736 3132991 3136109 3130806 3114206 3082719 3033369 2965376 2880560 2782179 2673479 2557523 2437942
49725 2437942 2318860 2203538 2093450 1989033 1890890 1799717 1715455 1637360 1565030 1498856
49715 1498856 1439329 1386260 1338761 1295685 1256046 1219393 1185883 1155862 1129250 1105496 1083963
49704 1083963 1064160 1045877 1029438 1015497 1003991 993530 982557 971088 960567 951904 944499 937507
49692 937507 931186 926361 923091 920557 918065 915622 913664 912577 912352 912357 911617 909668 907054 904830 903727
49677 903727 903881 904935 906137 906695 906401 905662 904745 903457 902006 901613 903453 907197 911282 914487 916577 917608
49661 917608 917572 916961 916732 917146 917220 915902 913393 910742 908585 906925 905804 905294 904907 903961 902863 903109 905353
49644 905353 908138 909425 909037 908608 909280 910530 911490 912236 913066 913431 912679 911476 911347 912871 915178 917237
49628 917237 918752 919718 920006 919816 919851 920541 921535 922331 923003 923997 925567 927623 929694 930873 930378 928578 926923
49611 926923 926428 926685 926842 927031 928157 930590 933781 937014 939881 942128 943655 944749 945892 947279 948849
49596 948849 950632 952534 953883 953828 952501 951367 952059 954851 958430 961167 962549 963326 964292 965214 965344 964753
49580 964753 964455 965116 966329 967502 968736 970302 971942 973492 975663 979316 984218 989359 994262 999092 1003691
49565 1003691 1007536 1010696 1013843 1017098 1019808 1021853 1024305 1028347 1034132 1041089 1048709 1056690 1064907 1073709
49551 1073709 1083641 1094464 1105033 1114749 1124558 1135943 1149421 1164589 1181014 1198166 1214965 1230574
49539 1230574 1245590 1261481 1278784 1296869 1315664 1336426 1359986 1385096 1409580 1432888 1456625
49528 1456625 1482593 1511063 1541063 1571661 1602645 1634578 1668628 1705905 1746385 1788708 1831406
49517 1831406 1874076 1916925 1959735 2002203 2045207 2090542 2138897 2188939 2238991 2288932 2339836
49506 2339836 2392415 2446836 2503579 2563252 2625382 2688339 2750757 2812420 2873646 2934574 2995264
49495 2995264 3055812 3115991 3175389 3234132 3292802 3351154 3407666 3460974 3511164 3558882 3603575
49484 3603575 3643638 3678252 3708260 3735028 3759055 3779859 3796724 3809226 3817431 3821972 3823777 3823483
49472 3823483 3821131 3816557 3810023 3802392 3794766 3787933 3782069 3777031 3773067 3771143 3772270 3776441 3782519 3789278
49458 3789278 3796445 3804666 3814854 3827756 3843765 3862547 3882901 3903558 3924304 3945917 3968718 3991614
49446 3991614 4012980 4032196 4049765 4066054 4080579 4092596 4101749 4107815 4110204 4108100 4100821 4087902
49434 4087902 4069163 4044924 4015762 3981911 3943441 3901206 3856661 3809907 3758674 3700592 3636368
49423 3636368 3569618 3503369 3437810 3371716 3304922 3238612 3173890 3110975 3049626 2989653 2930948
49412 2930948 2873279 2816071 2758610 2701011 2645003 2592883 2545160 2499846 2454661 2409485 2366016
49401 2366016 2325592 2288202 2253406 2221139 2191332 2163526 2137366 2113106 2091156 2071277 2052588
49390 2052588 2034586 2017931 2003876 1992698 1983081 1973494 1964038 1956187 1950649 1946359 1941996 1937673 1934393
49377 1934393 1932462 1931301 1930489 1930092 1930197 1931020 1933409 1938295 1945583 1954315 1964007 1974971 1987281 2000406
49363 2000406 2014216 2029369 2046160 2063877 2082078 2101834 2124569 2149863 2175384 2199132 2221011
49352 2221011 2241969 2262152 2280513 2296195 2309913 2323846 2340220 2360093 2383288 2408931 2435599
49341 2435599 2461478 2485428 2508246 2532210 2558941 2588046 2618118 2648340 2678558 2708372 2737140
49330 2737140 2764631 2790918 2815745 2838880 2861101 2883880 2907752 2931727 2954702 2976727 2998393
49319 2998393 3019604 3039762 3058848 3077675 3097093 3117478 3138851 3161068 3183813 3206853 3230336
49308 3230336 3254568 3279492 3304724 3330145 3356253 3383962 3414161 3447202 3482456 3518524 3554388
49297 3554388 3590320 3627354 3666094 3706653 3749454 3795091 3843201 3892456 3942248 3993579 4047553
49286 4047553 4103707 4160783 4218797 4279171 4342771 4408826 4476202 4545096 4616931 4692824 4772495
49275 4772495 4854564 4937823 5022377 5109554 5200395 5294225 5388997 5483184 5577055 5671970 5768670
49264 5768670 5866408 5963544 6058769 6151718 6242465 6330663 6415604 6497170 6576071 6652605 6725639
49253 6725639 6793490 6855537 6912189 6963440 7008465 7046631 7077971 7102466 7119876 7130605 7135789
49242 7135789 7136030 7130996 7120895 7107546 7093060 7078061 7061945 7044264 7025109 7004781 6983987 6963918
49230 6963918 6945248 6927612 6911059 6897314 6888139 6882810 6878821 6875212 6873729 6876349 6883039 6892539 6904096
49217 6904096 6917696 6933481 6951668 6972198 6993893 7014810 7034120 7052683 7070909 7086990 7098391
49206 7098391 7104394 7105800 7102469 7092623 7074752 7049082 7016866 6979119 6936382 6888962 6836793 6779428
49194 6779428 6716568 6648572 6576390 6501220 6424128 6345684 6266000 6185374 6104700 6024948 5946493
49183 5946493 5869371 5793729 5719405 5645537 5571762 5499626 5431524 5367879 5306460 5245034 5183629
49172 5183629 5123566 5065335 5008595 4953597 4901217 4851641 4804119 4758160 4714132 4672560 4633550
49161 4633550 4597173 4563825 4533852 4507202 4483607 4462889 4445042 4430304 4419009 4410945 4405085 4400529
49149 4400529 4397536 4396802 4397771 4398759 4399110 4400215 4403726 4409650 4416902 4424861 4433270 4441381 4448775 4456877 4468069
49134 4468069 4482906 4499513 4516324 4534079 4554097 4575621 4596541 4616413 4637206 4660647 4686093
49123 4686093 4711687 4736637 4761388 4786138 4810457 4834293 4858130 4881804 4904262 4925232 4946269
49112 4946269 4969035 4992949 5015848 5036931 5057646 5079211 5100607 5120016 5137353 5154143 5171397
49101 5171397 5188848 5206133 5223420 5240777 5258114 5276093 5295995 5318151 5341335 5364298 5387224
49090 5387224 5411089 5436427 5463512 5492970 5525053 5558576 5591614 5623364 5654636 5686568 5719509
49079 5719509 5752986 5786006 5817359 5846459 5874040 5901390 5928742 5955156 5980115 6004437 6029176
49068 6029176 6054383 6079526 6104419 6128907 6152063 6172657 6190485 6206600 6222195 6237707 6252951
49057 6252951 6267375 6279977 6289644 6296058 6299963 6302248 6303161 6302825 6302112 6302207 6303359 6304683 6305377 6305602 6305979
49042 6305979 6306859 6308512 6311485 6316089 6321700 6327158 6331773 6335471 6338199 6339986 6341670 6344757 6350190 6357641
49028 6357641 6366125 6374700 6382507 6388997 6394643 6400650 6407295 6413121 6416585 6418013 6419141 6421091 6423682 6426314
49014 6426314 6428429 6429178 6427819 6424696 6420937 6416938 6412000 6405721 6398794 6391879 6384446 6375202 6363128 6347779
49000 6347779 6329406 6309322 6289270 6269516 6248242 6223835 6197278 6171082 6146036 6120199 6091321
48989 6091321 6059190 6025246 5990852 5956697 5923194 5890431 5857808 5824496 5790523 5757119 5725742
48978 5725742 5697009 5670620 5646014 5622748 5600446 5578953 5558748 5540769 5525398 5511838 5499005
48967 5499005 5486862 5476298 5467758 5460718 5454749 5450305 5447880 5447005 5446879 5447701 5450590 5456209 5464066 5473110
48953 5473110 5482411 5491275 5499545 5508131 5518600 5531601 5545886 5559354 5571013 5581623 5592494 5604021
48941 5604021 5615567 5626417 5636422 5645680 5653976 5660930 5666512 5670990 5674437 5676846 5678826 5681491 5685265
48928 5685265 5689325 5692684 5695285 5697374 5698405 5697525 5694932 5691739 5688509 5684776 5680004 5673981 5666128 5655525
48914 5655525 5642098 5626887 5610729 5593566 5575537 5557622 5540370 5522953 5504649 5486321 5469051
48903 5469051 5451893 5432735 5411286 5389618 5369530 5350959 5333495 5317783 5304281 5291923 5279526
$$ [...]
##END NTUPLES=NMR SPECTRUM
##END=
