##TITLE=coffee_type TOFR01-ROVE100A_90-10%
COFFEE_meoh_noesyp64 COFFEE_meoh {C:\Bruker\TOPSPIN} Administrator 7
##JCAMPDX= 6.0         $$ Bruker NMR JCAMP-DX V2.0
##DATA TYPE= NMR SPECTRUM
##DATA CLASS= NTUPLES
##ORIGIN= Bruker BioSpin GmbH
##OWNER= Administrator
$$ 1.72 TOPSPIN		Version 2.1
$$ 2012-05-18 15:40:39.151 -0700  Administrator@X
$$ Compression mode = diff/dup
##.OBSERVE FREQUENCY= 400.13188235
##.OBSERVE NUCLEUS= ^1H
##.ACQUISITION MODE= SIMULTANEOUS (DQD)
##.ACQUISITION SCHEME= undefined
##.AVERAGES= 64
##.DIGITISER RES= 22
##SPECTROMETER/DATA SYSTEM= spect
##.PULSE SEQUENCE= noesygpps1d.comp
##.SOLVENT NAME= COFFEE_meoh
##.SHIFT REFERENCE= INTERNAL, COFFEE_meoh, 1, 14.98061
##AUDIT TRAIL= $$ (NUMBER, WHEN, WHO, WHERE, PROCESS, VERSION, WHAT)
$$ ##TITLE= Audit trail, TOPSPIN		Version 2.1
$$ ##JCAMPDX= 5.01
$$ ##ORIGIN= Bruker BioSpin GmbH
$$ ##OWNER= Administrator
$$ $$ C:\Bruker\TOPSPIN/data/Administrator/nmr/12-COFFEE-2002/72/pdata/1/auditp.txt
$$ ##AUDIT TRAIL=  $$ (NUMBER, WHEN, WHO, WHERE, PROCESS, VERSION, WHAT)
(   1,<2012-02-20 22:51:17.875 -0500>,<Administrator>,<TOPSPIN>,<go>,<TOPSPIN 2.1>,
      <created by zg
	started at 2012-02-20 22:39:47.609 -0500,
	POWCHK enabled, PULCHK disabled,
       configuration hash MD5:
       B0 76 FB 9C 50 81 44 7D 18 B3 26 32 4E 60 AD 96
       data hash MD5: 64K
       0E DF 0A D0 87 60 17 7A CC EF DE DE 74 24 44 18>)
(   2,<2012-02-20 22:51:20.625 -0500>,<Administrator>,<TOPSPIN>,<proc1d>,<TOPSPIN 2.1>,
      <Start of raw data processing
       efp LB = 0.3 FT_mod = 6 PKNL = 1 PHC0 = 0 PHC1 = 0 SI = 128K 
       data hash MD5: 128K
       66 34 E0 7A B2 36 CA 26 3A 50 C9 D5 C8 E0 04 95>)
(   3,<2012-02-20 22:51:21.938 -0500>,<Administrator>,<TOPSPIN>,<proc1d>,<TOPSPIN 2.1>,
      <pk PHC0 = 20.52795 PHC1 = 0 
       data hash MD5: 128K
       04 3B FA 05 B5 D3 87 61 73 9E F4 AA 31 00 E3 E3>)
(   4,<2012-02-20 22:51:22.203 -0500>,<Administrator>,<TOPSPIN>,<proc1d>,<TOPSPIN 2.1>,
      <abs ABSG = 1 
       data hash MD5: 128K
       5F A8 46 B5 62 43 56 9D B7 56 E6 D4 4A 20 C9 EC>)
(   5,<2012-02-20 22:51:22.281 -0500>,<Administrator>,<TOPSPIN>,<proc1d>,<TOPSPIN 2.1>,
      <abs ABSG = 2 
       data hash MD5: 128K
       95 4D B9 BB C9 6F 54 78 D0 21 83 D9 0E F7 EB 4F>)
(   6,<2012-02-20 22:51:22.344 -0500>,<Administrator>,<TOPSPIN>,<proc1d>,<TOPSPIN 2.1>,
      <abs ABSG = 3 
       data hash MD5: 128K
       9A D9 DA F5 DB 99 7D 22 EC 05 7D 6D 5D 03 13 A7>)
(   7,<2012-02-20 22:51:22.500 -0500>,<Administrator>,<TOPSPIN>,<proc1d>,<TOPSPIN 2.1>,
      <abs ABSG = 4 
       data hash MD5: 128K
       A3 4F F4 12 4E A6 D4 BB A5 94 5F 9E A2 44 03 2C>)
(   8,<2012-02-20 22:51:22.641 -0500>,<Administrator>,<TOPSPIN>,<proc1d>,<TOPSPIN 2.1>,
      <abs ABSG = 5 
       data hash MD5: 128K
       1B CC 49 4A A5 FC 8A C3 67 7A 81 D2 C7 81 8E 3D>)
(   9,<2012-02-20 22:51:22.766 -0500>,<Administrator>,<TOPSPIN>,<audit>,<TOPSPIN 2.1>,
      <user comment:
       ICON-NMR User ID: Administrator
$$ [...]
150 150 150 150 150 150 150 150
##$TP07= 0
##$TPNAME0= <>
##$TPNAME1= <>
##$TPNAME2= <>
##$TPNAME3= <>
##$TPNAME4= <>
##$TPNAME5= <>
##$TPNAME6= <>
##$TPNAME7= <>
##$TPOAL= (0..7)
0.5 0.5 0.5 0.5 0.5 0.5 0.5 0.5
##$TPOFFS= (0..7)
0 0 0 0 0 0 0 0
##$TUNHIN= 0
##$TUNHOUT= 0
##$TUNXOUT= 0
##$USERA1= <user>
##$USERA2= <user>
##$USERA3= <user>
##$USERA4= <user>
##$USERA5= <user>
##$V9= 5
##$VALIST= <valist>
##$VCLIST= <CCCCCCCCCCCCCCC>
##$VD= 0
##$VDLIST= <DDDDDDDDDDDDDDD>
##$VPLIST= <PPPPPPPPPPPPPPP>
##$VTLIST= <TTTTTTTTTTTTTTT>
##$WBST= 1024
##$WBSW= 4
##$XGAIN= (0..3)
0 0 0 0
##$XL= 0
##$YL= 0
##$YMAX_a= 14525318
##$YMIN_a= -6769628
##$ZGOPTNS= <>
##$ZL1= 120
##$ZL2= 120
##$ZL3= 120
##$ZL4= 120
##$ABSF1= 14.98061
##$ABSF2= -5.57192
##$ABSG= 5
##$ABSL= 3
##$ALPHA= 0
##$AQORDER= 0
##$ASSFAC= 0
##$ASSFACI= 0
##$ASSFACX= 0
##$ASSWID= 0
##$AUNMP= <proc_prof1d_extract>
##$AXLEFT= 0
##$AXNAME= <>
##$AXNUC= <1H>
##$AXRIGHT= 0
##$AXTYPE= 0
##$AXUNIT= <>
##$AZFE= 0.1
##$AZFW= 0.1
##$BCFW= 0
##$BC_mod= 0
##$BYTORDP= 0
##$COROFFS= 0
##$CY= 15
##$DATMOD= 1
##$DC= 0
##$DFILT= <>
##$DTYPP= 0
##$F1P= 0
##$F2P= 0
##$FCOR= 0.5
##$FTSIZE= 131072
##$FT_mod= 6
##$GAMMA= 0
##$GB= 0
##$INTBC= 1
##$INTSCL= 1
##$ISEN= 128
##$LB= 0.3
##$LEV0= 0
##$LPBIN= 0
##$MAXI= 10000
##$MC2= 0
##$MEAN= 0
##$ME_mod= 0
##$MI= 0
##$NCOEF= 0
##$NC_proc= -3
##$NLEV= 6
##$NOISF1= 0
##$NOISF2= 0
##$NSP= 0
##$NTH_PI= 0
##$NZP= 0
##$OFFSET= 14.98061
##$PC= 1
##$PHC0= 20.52795
##$PHC1= 0
##$PH_mod= 1
##$PKNL= yes
##$PPARMOD= 0
##$PPDIAG= 0
##$PPIPTYP= 0
##$PPMPNUM= 2147483647
##$PPRESOL= 1
##$PSCAL= 4
##$PSIGN= 0
##$PYNMP= <proc.py>
##$REVERSE= no
##$SF= 400.13
##$SI= 131072
##$SIGF1= 0
##$SIGF2= 0
##$SINO= 400
##$SIOLD= 131072
##$SPECTYP= <>
##$SREGLST= <1H.CDCl3>
##$SSB= 0
##$STSI= 131072
##$STSR= 0
##$SW_p= 8223.68421052632
##$SYMM= 0
##$S_DEV= 0
##$TDeff= 65536
##$TDoff= 0
##$TI= <>
##$TILT= no
##$TM1= 0
##$TM2= 0
##$TOPLEV= 0
##$USERP1= <user>
##$USERP2= <user>
##$USERP3= <user>
##$USERP4= <user>
##$USERP5= <user>
##$WDW= 1
##$XDIM= 131072
##$YMAX_p= 496553365
##$YMIN_p= -248639167
##$CURPLOT= <Network HP LaserJet P1505>
##$CURPRIN= <$Network HP LaserJet P1505>
##$DFORMAT= <normdp>
##$LAYOUT= <+/1D_H.xwp>
##$LFORMAT= <normlp>
##$PFORMAT= <normpl>
##$SURQMSG= 1
$$ End of Bruker specific parameters
$$ ---------------------------------
##NTUPLES= NMR SPECTRUM
##VAR_NAME=  FREQUENCY,     SPECTRUM/REAL,   SPECTRUM/IMAG
##SYMBOL=    X,             R,               I
##VAR_TYPE=  INDEPENDENT,   DEPENDENT,       DEPENDENT
##VAR_FORM=  AFFN,          ASDF,            ASDF
##VAR_DIM=   131072,        131072,          131072
##UNITS=     HZ,            ARBITRARY UNITS, ARBITRARY UNITS
##FACTOR=    0.0627417313425165, 1,          1
##FIRST=     8223.62146879498, -2623,        -94319
##LAST=      0,             2698,            -95263
##MIN=       0,             -248639167,      0
##MAX=       8223.62146879498, 496553365,    0
$$ Real data points
##PAGE= N=1
##DATA TABLE= (X++(R..R)), XYDATA
$$ [...]
66835 4245049 4259257 4274514 4290460 4306128 4320963 4335014 4348093 4359342 4368186 4375355 4382105 4388366
66823 4388366 4392505 4393367 4391926 4390222 4389051 4387542 4384930 4381694 4378455 4374597 4368884 4361088 4352101 4342486
66809 4342486 4331803 4319481 4305577 4290332 4273734 4255858 4236985 4216926 4194998 4171325 4147457
66798 4147457 4124789 4102786 4079680 4054509 4027455 3998549 3967484 3934909 3902682 3872209 3843261
66787 3843261 3814749 3785889 3756265 3725722 3694838 3664744 3635664 3606257 3575184 3542869 3510806
66776 3510806 3479533 3448216 3416145 3383544 3350690 3317158 3282534 3247404 3213069 3180322 3148796
66765 3148796 3117355 3084873 3050800 3015413 2979715 2944824 2911140 2878107 2845052 2812229 2780609
66754 2780609 2750429 2720509 2689635 2658286 2628130 2599762 2571820 2542609 2511878 2480561 2449532
66743 2449532 2419335 2390548 2363555 2338080 2313511 2289453 2265385 2240214 2213155 2185017 2157665
66732 2157665 2131944 2106901 2081329 2055281 2029540 2004241 1978838 1953217 1928111 1904274 1881668
66721 1881668 1859693 1838069 1817308 1798200 1780714 1763475 1744676 1723766 1702165 1682060 1664418
66710 1664418 1648165 1631176 1612036 1591076 1569902 1549909 1531234 1513203 1495658 1479268 1464355
66699 1464355 1449945 1434661 1418351 1402151 1386832 1371771 1355937 1339367 1323068 1307697 1293008
66688 1293008 1278680 1265124 1253064 1242418 1231945 1220194 1206872 1193217 1180772 1169728 1158732
66677 1158732 1146495 1133200 1119907 1107019 1094225 1081839 1070956 1061692 1052256 1040893 1028293 1016913
66665 1016913 1007966 1000160 991571 981613 970662 958811 946098 933508 922613 914027 906789 899464 891477
66652 891477 883401 876290 870740 866222 861341 855108 847942 840926 834173 826616 817634 808051 798905 789941
66638 789941 780334 770517 762053 755451 749352 742529 735681 730211 725868 721002 714948 708763 703379 698451
66624 698451 693681 689907 687558 684888 679367 670781 661722 654832 650577 647806 645251 641954 637297 631515
66610 631515 625688 620523 615537 609974 604046 598545 593616 588737 583727 579010 574812 570733 566212 560997
66596 560997 555144 549103 543863 540359 538343 536175 532138 525919 518707 512043 506827 503294 501547 501648
66582 501648 503005 503933 502538 498396 492987 488047 483762 479160 474007 469364 466038 463261 459571 454667
66568 454667 449791 446363 444627 443625 442083 439287 435391 431162 427410 424550 422480 420661 418338 415067
66554 415067 411304 408232 406604 405770 404211 401180 397555 394921 393984 394072 394050 393427 392504 391689 390907 389737 388012
66537 388012 386051 384112 381727 377977 372696 367177 363247 361574 361232 360933 360204 359189 357894 356270 354755
66522 354755 354030 354139 354391 354304 354057 353760 352737 350037 345488 339959 334752 330921 328905 328359 328429 328473 328431 328325
66504 328325 327741 326288 324364 322835 321880 320725 318754 316373 314380 312816 310963 308322 305063 301489 297633
66489 297633 293739 290751 289704 290556 291984 292503 291528 289305 286368 283527 281926 282288 283924 285051 284412
66474 284412 282236 279531 276964 274757 273132 272201 271575 270617 269143 267565 266358 265671 265424 265508 265821 266229
66458 266229 266488 266232 265271 263952 262810 261713 259806 256700 253308 250985 250106 249984 249810 249061 247271 244312
66442 244312 240908 238176 236495 235380 234390 233538 232891 232616 233429 235907 239059 240638 239501 236860 234521
66427 234521 232697 230397 227262 223950 221046 218677 217084 216652 217260 218264 219112 219396 218553 216427 214090
66412 214090 213098 213685 214562 214836 215203 216661 218831 220367 220553 219678 218096 215724 212519 208870 205289 202023
66396 202023 198992 195950 192819 190146 189025 190056 192443 194595 195730 196490 197905 200072 201974 202294 200393
66381 200393 196950 193774 192470 192969 193828 194223 194998 197109 199611 200250 198061 194379 191102 188905 187608
66366 187608 187285 187993 188965 189217 188922 189209 190444 191570 191556 190792 190504 191161 191962 191748 190090 187698 185936
66349 185936 185691 186503 187131 187159 187465 188715 190040 190034 188657 187098 185800 183778 180303 176335 173480 172056
66333 172056 170969 169313 167380 166093 165962 166727 167756 168624 169432 170467 171463 171450 169680 166560 163307 160700
66317 160700 158592 156606 154869 153771 153270 152772 151738 150410 149812 150840 153245 155788 157634 159156 160938
66302 160938 162399 162355 160848 159401 159065 159134 158371 156693 154852 153128 151461 150420 150756 151899 152175 150877
66286 150877 149044 147645 146140 143853 142005 142818 146496 150282 151144 148816 145663 143905 143644 143534 142781
66271 142781 142047 142525 144500 146971 148500 148323 146843 145351 145174 146670 148871 150297 150147 148600 146162
66256 146162 143333 140957 140068 140796 141822 141605 140041 138377 137603 137483 137120 135961 134187 132603 132245 133669
66240 133669 136373 139217 141418 142849 143445 142979 141661 140352 139688 139322 138503 137188 136092 135676 135483 134642
66224 134642 132866 130841 129594 129420 129530 128916 127491 126012 124964 124146 123489 123575 124801 126585 128080 129297
66208 129297 130710 132013 132241 131184 129724 128508 127174 125404 123896 123474 123767 123758 123456 123995 125862 127869
66192 127869 128406 127359 126250 126593 128396 130284 130884 130055 128780 127925 127371 126566 125642 125421 126236 127325 127576
66175 127576 126518 124383 121767 119637 119092 120293 121866 122095 120731 118988 117866 117328 117251 118183 120457 123171
66159 123171 124875 125070 124472 123986 124025 124666 125772 126832 127237 126905 126236 125371 123965 121974 120254 120001 121614
66142 121614 124164 125866 125228 122211 118481 116028 115242 114732 113397 112071 112360 114237 115915 116290 116388 117686
66126 117686 119865 121341 121633 121883 122863 123684 123130 121412 119734 118651 117730 116542 115077 113290 111121 109068
66110 109068 108054 108582 110512 113454 116549 118092 116701 113199 110134 108954 108800 108651 109089 110673 111902
66095 111902 110742 107576 104709 103199 102090 100848 100496 101636 103140 103889 104422 105650 107058 107558 107353
66080 107353 107517 108078 107947 106722 105462 105453 106997 109509 112119 114006 114800 115005 115695 117610 120618 123920
66064 123920 126448 127286 126246 124171 122294 121225 120637 119793 118085 115279 111655 108000 105250 104107 104930
66049 104930 107541 110969 113788 115213 115649 115897 116181 116258 115998 115311 113961 112066 110390 109504 109108 108946 109801
66032 109801 112381 115461 116601 115044 112693 111741 112310 113112 113571 114424 116586 120065 123795 126278 126759 125994
66016 125994 125427 125474 125300 124477 123833 123965 123888 122300 119751 118352 119361 121944 124362 125525 125278 124069 122870
65999 122870 122839 124400 126651 128013 127647 126287 125609 126584 128429 129460 128951 127655 126360 124788 122556 120495
65983 120495 119875 120527 120910 120195 119254 119139 119397 118573 115909 111944 107750 104158 101729 100983 102357 105712
65967 105712 109838 112892 113895 113709 113954 115056 116151 116899 118210 120640 123090 124049 123465 122456 121722 121359
65951 121359 121839 123765 126511 128298 128156 126994 126413 127221 129491 133078 137308 140841 142834 143958 145477
65936 145477 147499 148970 149293 149060 148954 148781 148186 147804 148855 151567 154577 156229 156167 155324 154588 154071 153734
65919 153734 154039 155368 157138 158254 158420 158269 158031 156890 154261 151175 149631 150635 153268 155561 155993
65904 155993 154471 152403 151639 152759 154391 154611 152950 150635 149071 148703 149269 150416 151825 153283 154899
65889 154899 156870 158859 159983 159652 158123 156180 154544 153605 153242 152880 152182 151638 151886 152513 152387 151360
65873 151360 150670 151241 152536 153756 155144 157033 158325 157382 154323 151230 149861 150068 150631 150785 150562 150343
65857 150343 150515 151032 151059 149626 147016 144950 144877 146456 148177 149131 149535 149782 149790 149538 149645 150834 152889 154570
65839 154570 154795 153802 152955 153433 155204 157194 158222 157777 156251 154638 153807 153821 154042 154003 153966 154361 154892 154558
65821 154558 152649 149672 147314 147279 149747 152865 154215 153019 150601 148615 147521 147102 147517 148862 150257
65806 150257 150547 149794 149121 149113 149339 149480 149816 150324 150318 149506 148605 148351 148552 148585 148210 147354 145792 143702 141991
65787 141991 141290 141100 140696 140527 141745 144427 147178 148797 149628 150837 152736 154309 154399 153060 151578 151177
65771 151177 151906 152902 153505 153705 153611 153075 152080 151045 150412 150165 149965 149507 148641 147475 146544 146414 146897 147065
65753 147065 146341 145165 144355 144261 144817 145762 146332 145450 142974 140362 139291 139858 140804 141214 141199 141117 141021 141005 141334
65734 141334 141984 142438 142116 140815 138903 137288 136829 137346 137714 137469 137719 139538 142001 143014 141895 139906
65718 139906 138382 137638 137738 138738 139780 139513 138219 138117 140566 144080 146217 146385 145589 144470 143099 141988
65702 141988 141532 140748 138233 134381 131153 129588 129085 129304 130965 133972 136339 136198 133896 131104 128763
65687 128763 127063 126458 127118 127826 127050 125018 123254 121990 119734 116001 112820 112243 113351 113260 110739 107474
65671 107474 105719 105862 106679 107018 106702 106298 106537 107655 108969 109389 108564 107260 106377 106035 105902 105988 106630 107951
65653 107951 109817 112138 114751 117148 118803 119709 120238 120549 120512 120056 119191 117855 116284 115372 115953 117646
65637 117646 119036 119182 118385 117404 116675 116539 117353 118717 119158 117383 113617 109235 105367 102395 100391 99252
65621 99252 98468 97455 96271 95524 95558 96125 96804 97300 97441 97413 98011 100074 103449 106899 109156 109808 109233 108187
65603 108187 107413 107078 106403 104400 101207 98231 96779 97020 98408 100373 102181 102924 102466 102004 102809 104519
65587 104519 105442 104610 102883 101825 102020 102750 102982 102339 101250 100389 100064 100259 101186 103371 106789 110192 111882
65570 111882 111250 109161 106778 104499 102210 100128 98860 98676 99054 99126 98591 98084 98465 99729 100854 100851 99630
65553 99630 97666 95259 92622 90389 89288 89379 90197 91543 93324 94588 93762 90536 86819 85128 86259
65538 86259 89062 92168 95214 98491 101960 104839 106022 104979 102477 100233 99566 100410 101638 102161 101661
65523 101661 100758 100654 102195 104922 107425 108803 109181 108565 106213 102097 98098 96334 96539 96465 94953 93251
65507 93251 92890 93481 93405 91852 89383 87066 85771 85989 87596 89906 92284 94501 96276 96951 96105 94200
65491 94200 92177 90637 89686 89195 88893 88540 88415 89222 91017 92616 92620 90819 88152 85732 84514 85393 88491
65474 88491 92298 94569 94585 93940 94709 97211 99906 101082 100330 98719 97960 99187 102054 104961 106379 106008
65458 106008 104613 103026 101683 100968 101377 103019 105384 108034 111263 115329 119110 120500 118766 115899 114744
65443 114744 116034 118098 119295 119688 120137 120831 121407 121879 122724 124331 126799 129929 133069 135372 136598 137262
65427 137262 137699 137571 136735 135872 135592 135530 135131 134736 134999 135723 136325 137085 138765 141224 143599 145690 147855
65410 147855 149579 149725 148570 148049 149270 151099 152131 152824 154408 156586 157849 157707 157232 157361 157779 157652
65394 157652 156555 154370 151024 146684 141867 137144 133046 130244 129272 129836 130662 130323 128133 124405 120157
65379 120157 116528 114108 112676 111774 111428 111936 113017 113754 113620 113203 113457 114445 115206 114858 113577 112324 111844
65362 111844 112106 112669 113255 113753 113855 113199 112094 111706 113093 116011 119022 120805 121084 120261 118676 116665
65346 116665 115050 114815 116111 118030 119686 121154 122955 124957 126432 127069 127302 127554 127781 127943 128263 128713
65330 128713 128921 128969 129559 130880 132122 132975 134745 138621 143332 146129 146290 146096 147861 151408 155271 159109
65314 159109 163615 168696 173160 176258 178649 181750 186566 193121 200614 208238 216034 224602 233819 242583
65300 242583 250384 258464 268404 279827 290377 297802 301210 300516 295925 288414 279813 271667 264362 257746
65286 257746 252130 248110 245570 243414 240402 236046 230750 225325 220446 216338 212746 209145 205181 201068
65272 201068 197406 194421 191516 187883 183409 178628 173878 169098 164427 160259 156486 152427 147880 143575
65258 143575 140044 136797 133297 130173 128581 128753 130026 131852 133760 134641 133347 130185 126802 124241 121953
65243 121953 119005 115464 112116 109506 107846 107464 108654 111004 113103 113207 110659 106906 104579 104887 106252
65228 106252 106256 104593 103038 102746 102986 102863 102871 103894 105595 106711 106424 104743 102040 98896 96062 94039 92996
65211 92996 93336 95530 98901 101441 101760 100655 99808 99516 98907 98064 98406 100656 103542 105167 105062 104359 104385
65194 104385 105534 107217 108408 108301 106791 104578 102846 102602 103983 106092 107903 109482 111870 115475 119079
65179 119079 120903 120303 117923 114750 111794 110182 110450 111813 113112 114523 117161 120736 122798 121121 116149
65164 116149 110398 106037 103708 103035 103244 103413 103085 102775 103317 104617 105602 105481 104500 103225 101621 99233
65148 99233 96071 92942 90909 90590 91822 93765 95376 96019 95755 94992 93909 92368 90410 88575 87469
65133 87469 87068 86759 86064 85062 84025 83105 82687 83544 85885 88435 89336 88177 86424 85490 85190 84766 84634
65116 84634 85853 88125 89659 89444 88556 88552 89367 89699 88923 87638 86573 85978 86074 87098 88586 89498 89536 89660
65098 89660 90771 92494 93936 95075 96478 97911 98329 97430 96368 96498 97916 99615 100660 100846 100522 100208
65082 100208 100310 100920 101798 102607 103081 103108 102912 103120 104203 105757 106700 106376 105181 104031 103558 103952 105103
65065 105103 106586 107914 109146 110885 113330 115599 116423 115363 113145 111126 110661 112453 115927 119510 122032
65050 122032 123673 125174 126599 127507 127988 128676 129803 130998 132054 133187 134509 135840 137148 138615 140321
65035 140321 142457 145798 151083 157818 164476 170098 174940 179441 183612 187822 193044 199527 206049 211367
65021 211367 215635 219417 222035 222257 220396 218379 217576 217591 217368 216398 214352 210512 204474 197079 189908 183852
65005 183852 178542 173140 167385 161780 156894 152605 148141 142899 137046 131194 125830 121326 118166 116534
64991 116534 115719 114494 112204 109218 106327 104106 102749 101908 100609 98012 94517 91596 90208 89859 89553
64976 89553 89041 88640 88353 87977 87873 88801 90822 92955 94188 94531 94888 96100 98267 100755 102661 103368 102915
64959 102915 101894 100876 99863 98381 96266 94297 93696 94738 96031 95610 92778 88656 85083 83340 83745
64944 83745 85739 88088 89647 90354 91066 92101 92504 91359 89372 88336 89154 91056 92713 93448 93225 92160
64928 92160 90488 88713 87555 87731 89664 93003 96441 98471 98568 97506 96570 96653 97877 99483 100133 98941
64912 98941 96441 94101 92792 92228 92006 92390 93641 95151 95966 95882 95507 95330 95180 94532 93062 90979 88966
64895 88966 87620 86868 86285 86099 87221 89850 92630 93897 93434 92347 91495 90837 90139 89513 89185 89369 90320
64878 90320 91855 92921 92517 91075 90018 89765 89217 87633 85941 85448 86116 86989 87674 88379 88991 89255 89590
64861 89590 90520 91310 90391 87485 84338 82869 83356 84795 86219 87042 86831 85651 84346 83840 84310 85468
64845 85468 87174 89089 90116 89174 86560 83775 81940 81093 81044 81968 83768 85637 86791 87114 86717 85665
64829 85665 84676 85194 87671 90244 90431 88129 85810 85542 86915 88307 89047 89542 90055 90493 91072 92194 93582
64812 93582 94276 93669 92061 90097 88155 86444 85257 84831 85130 85942 87030 88048 88554 88302 87540 86913 87003
64795 87003 87886 89061 89903 90254 90440 90686 90791 90542 90103 89659 88962 87689 86108 84933 84593 85086 86443
64778 86443 88653 91029 92309 91836 90299 89041 88847 89595 90699 91667 92455 93434 94687 95369 94378 91999
64762 91999 90167 90444 92154 93323 93158 92751 93369 95004 96903 98716 100517 102194 103519 104643 105891
64747 105891 107065 107467 106813 105720 105016 104841 104807 104793 105010 105206 104504 102580 100606 100226 101565 102957 102919 101761
64729 101761 100829 100727 101053 101562 102608 104223 105444 105138 103252 100881 99177 98472 98404 98560 98786 98952 98786
64712 98786 98141 97292 96662 96333 96261 96981 99415 103485 107432 109236 108565 106681 104598 102239 99591 97743
64696 97743 98029 100522 103883 106518 107521 106878 105347 104060 103636 103520 102503 100061 96955 94415 92963
64681 92963 92125 91170 89959 89068 89192 90588 93110 96561 100663 104721 107760 109285 109712 109846 110069 110187
64665 110187 109790 108576 106617 104560 103267 102902 102739 102283 102159 103166 104787 105636 105447 105447 106349 106987 105826
64648 105826 103147 100703 99563 99312 99319 99704 100764 102268 103817 105339 106792 107825 108262 108617 109587 111192
64632 111192 112866 114303 115709 117220 118489 119045 118775 117957 117002 116289 115996 115920 115536 114480 113035 111993
64616 111993 111853 112133 111657 109833 107642 107019 109012 112686 116033 117709 117666 116429 114539 112744 111985 112587
64600 112587 113738 114316 114169 114162 114882 115757 115655 114140 111816 109543 107612 105802 104102 103119 103614 105587 107883
64583 107883 108954 108179 106477 105478 106072 107851 109861 111531 112617 112680 111382 109426 108506 109687 112079 113736
64567 113736 113847 113466 113945 115318 116611 117302 117812 118640 119603 120081 119605 118058 115676 113210 111789 112004 113061
64550 113061 113374 112380 111399 112250 115156 118595 121192 123011 124636 125789 125754 124875 124574 125582 126948 127223
64534 127223 126161 124731 123852 123646 123662 123301 122179 120671 120077 121537 124480 126649 126162 123457 120890 120397
64518 120397 121733 123034 122892 121725 121070 121718 122847 123067 121987 120338 118727 116869 114247 111122 108481
64503 108481 107144 107174 107986 108741 108868 108557 108719 110003 111902 113225 113485 113327 113538 114266 115585 118101 122181
64486 122181 126859 130284 131296 130080 127523 124715 122921 122869 123648 123370 121632 120460 121844 125006 127191
64471 127191 126824 124690 122160 119658 117254 115516 114950 115203 115540 115751 116028 116293 116152 115340 113896 112132
64455 112132 110701 110356 111327 113219 115723 118971 122780 126061 127610 127323 126237 125581 126139 128089 130785
64440 130785 132878 133276 132074 130187 128363 126969 126372 126678 127207 127083 126476 126488 127545 128648 128635 127598 126562
64423 126562 126163 126187 126138 125736 124965 123977 122952 121799 120192 118178 116599 116403 117459 118446 118213 117032 116205
64406 116205 116501 117361 117836 117927 118478 119742 120665 119951 117577 114907 113481 113952 115937 118355 119999 120283 119705
64389 119705 119427 120342 122533 125272 127257 127284 125375 123135 122320 123006 123732 123447 122498 121648 121138 121256 122883
64372 122883 126419 130566 133189 133364 131916 130037 128189 126486 125307 125117 126115 128387 131955 136304 140302
64357 140302 143093 144901 146500 148121 149377 150113 150641 151083 151099 150550 149847 149237 148271 146551 144555 142993
64341 142993 141644 139763 137616 136557 137197 138358 138439 137178 135453 133991 133014 132718 133081 133353 132574 130741
64325 130741 128854 127784 127651 128276 129585 131386 133293 134965 136009 135799 134051 131635 130028 129739 130009
64310 130009 130331 131470 134378 138608 142483 144649 145032 144528 144182 144584 145674 146989 148043 148443 147985 147133
64294 147133 147191 149146 152231 154342 154194 152419 150406 148904 148137 148215 148679 148447 147266 146567 147787 150190
64278 150190 151546 150872 149469 149103 150058 151203 151263 149883 148145 148198 151543 157319 162832 166113 167457 168245
64262 168245 168997 169223 168722 168212 168614 170218 172726 175807 179286 182800 185576 186993 187435 188167 190026 192494
64246 192494 194387 195178 195110 194326 192625 190201 187898 186403 185537 184578 183015 180921 178954 178050 178662 180199
64230 180199 181673 183049 185431 189626 194969 199977 203889 207288 211414 216999 223408 228781 231590 232385
64216 232385 233518 236674 241133 244916 247064 248069 248532 248518 248157 247876 247661 246903 245420 244017 243418 243049
64200 243049 241485 237984 233148 228240 224303 221878 220996 221143 221468 221267 220352 218982 217585 216422 215296
64185 215296 213555 210750 207456 205166 205060 206958 209790 212939 216650 220991 225068 227866 229667 231934
64171 231934 235618 240177 244675 249365 255422 263140 271105 277395 281153 282666 282464 281024 279162 277936
64157 277936 277817 278333 278760 278931 279167 279674 280258 280534 280239 279470 278729 278533 278907 279544 280480 282150 284503 286669
64139 286669 288092 289554 292232 295866 298815 300080 300501 301585 303916 307148 310897 314856 318324 320367
64125 320367 320490 318842 315933 312528 309514 307318 305448 303102 300161 297172 294505 292144 290295 289393 289204
64110 289204 288672 287272 286097 286851 289837 293640 296848 299446 302146 304867 306602 306793 306323 306918 309784
64095 309784 314950 321673 329183 337144 345667 354965 364879 374831 384353 393594 403070 412979 423002 432817
64081 432817 442511 452360 462389 472255 481410 489169 494722 497396 497102 494516 490557 485494 478709 469683
64067 469683 459247 449322 441154 434178 427027 419350 412116 406364 402221 399069 396112 392837 389457 386859
64053 386859 385599 384986 383742 381459 378814 376502 374880 374645 376709 380913 385740 389845 393237 396648 400668
64038 400668 406006 413581 423378 433813 443218 451664 460637 471199 483028 494880 505573 514931 524155
64025 524155 534602 545822 555754 563351 569723 575712 579772 579955 576966 573180 569223 563760 556570 549472
64011 549472 543614 537818 530541 521908 512962 504335 496720 491443 489307 489565 490916 492835 495251 497779
63997 497779 500204 502997 506495 510280 514169 519025 525579 533150 540676 548574 558288 570244 583343 596470
63983 596470 609496 622774 636588 651416 667949 686442 706315 726493 745914 763803 779888
63972 779888 794378 807508 819231 829513 838584 846630 853666 860109 866967 874886 883497 892409 902329
63959 902329 914189 927415 940202 951556 962085 972692 983641 995266 1008432 1023349 1038690
63948 1038690 1052818 1065655 1078629 1093141 1109827 1128984 1150562 1173503 1196123 1217926 1240598
63937 1240598 1266593 1297018 1331364 1368861 1409198 1451977 1496582 1543091 1592750 1646990 1706421
63926 1706421 1771140 1841384 1917157 1997757 2082635 2172547 2268921 2372192 2481681 2597120 2719243
63915 2719243 2848687 2985363 3129479 3282290 3445198 3618665 3802612 3997403 4204019
63906 4204019 4423930 4659491 4913988 5190663 5491932 5820049 6178270 6571096 7003932
63897 7003932 7482938 8014596 8604583 9257171 9975863 10763737 11622242 12549998 13543247
63888 13543247 14596763 15703309 16852646 18032094 19227675 20423481 21599832 22733115
63880 22733115 23797875 24769001 25623081 26339841 26903589 27303250 27531295 27583380 27458732
63871 27458732 27159551 26689898 26056701 25272770 24357892 23335949 22231275 21067707 19869038
63862 19869038 18657621 17451784 16265531 15111074 14000728 12945777 11954281 11030833
63854 11030833 10178000 9396918 8686237 8041565 7457014 6927379 6448591 6016591 5626752
63845 5626752 5274496 4955607 4665734 4400592 4157335 3935000 3732688 3547762 3376610
63836 3376610 3216685 3066873 2926298 2793969 2669359 2551942 2440050 2331558 2226107
63827 2226107 2125340 2030214 1939275 1850682 1765024 1684798 1611478 1544244 1481339 1421502 1364048
63816 1364048 1308741 1256084 1206886 1161041 1117322 1074891 1034511 997688 964923 935368 907899
63805 907899 881878 856990 833038 810155 788697 768716 749910 732269 716306 702346 690035
63794 690035 678913 669013 660447 652831 645730 639266 633656 628527 623570 619474 617048 615479 612772 608177
63780 608177 602804 597354 590562 580907 568759 555743 542731 529658 516635 503955 491245 477914
63768 477914 464361 451737 440516 430175 420211 410576 401146 391592 381812 371859 361612 351223 341604
63755 341604 333511 326417 319341 312615 307648 304879 303222 301652 300151 298710 296554 292950 287983 282104
63741 282104 275739 269719 265282 263165 263171 264699 266863 268191 267486 265356 263686 263148 262467 260721 258922 258345
63725 258345 258423 257530 255051 251568 247797 244460 242540 242380 242936 242920 242272 241577 240600 238675 236095 233805 231867
63708 231867 229568 226963 225030 224068 223248 222164 221732 222912 225263 227431 228598 228891 228708 228213 227490 226864
63692 226864 226816 227471 228271 228520 228354 228645 229697 230642 230706 230474 231154 232985 235295 237856 241160 245429 250377
63675 250377 256124 263353 272160 281490 290202 298272 306653 316285 327381 339309 351039 362071 372914
63662 372914 384212 395508 405549 413707 420199 424790 426273 423902 418609 412252 406094 400494 395431
63649 395431 390529 384905 377875 369856 362125 355626 350315 345498 340438 334748 328713 323242 319177 316539
63635 316539 314683 313038 311334 309197 306157 302394 299134 297789 298683 300870 303184 305167 306903 308424
63621 308424 309823 311823 315603 321744 329683 338518 348044 358577 369982 381418 392101 401889 411091
63608 411091 420085 429156 438194 446239 451686 453349 451235 446085 438460 428689 417608 406853 397991 391406
63594 391406 386195 381236 376191 371346 366658 361429 355296 349276 345325 344619 346434 348839 350444 351449
63580 351449 353144 356500 361221 366201 370870 375819 381915 389157 397005 405682 416340 429540 444286
63567 444286 459316 474923 492524 512429 533070 552950 572562 593665 617238 643111 671258
63556 671258 702153 735591 770227 804871 839414 873856 907264 938539 967455 993751 1015700
63545 1015700 1031034 1039304 1042111 1041058 1036852 1030580 1024066 1018106 1011728 1004247 996766 990292 983407 973532
63531 973532 959974 944079 926701 907359 886109 864496 843888 824107 804464 785156 766816
63520 766816 749443 732751 717210 703884 693329 685126 678486 672972 668704 665985 664677 664043 663662
63507 663662 664462 668209 675729 686187 698412 712308 728438 746686 766034 785647 805795 827790
63495 827790 853202 882821 915934 950714 985527 1019778 1053338 1085531 1115059 1140768 1162143
63484 1162143 1179186 1192161 1201483 1207733 1211875 1215272 1218880 1222146 1223378 1221860 1219157 1217381 1216301
63471 1216301 1213067 1204950 1191397 1172978 1149327 1119361 1083364 1043733 1003198 962885 922588 882495
63459 882495 843897 808100 775161 744012 713697 684348 657111 633256 613275 596713 582819
63448 582819 571242 561827 553842 545936 537145 527751 518908 511723 506880 504619 504395 504733 504211 502859 502213
63433 502213 503784 507645 512502 516888 520483 524750 532166 544142 559487 575421 590238 604399 618880
63420 618880 633448 647232 660158 672555 683599 691420 695131 695789 694697 691474 684669 674010 661135
63407 661135 647993 635241 622544 609887 598014 587796 579596 573186 567869 562775 557502 552581 548978
63394 548978 546961 545742 544333 542608 541510 542498 546624 553605 561773 569561 577236 586504 598193 611178
63380 611178 624168 637677 653254 671434 691669 714004 739333 767719 797656 827730 858251
63369 858251 890580 925370 962130 1000313 1040146 1082293 1126854 1172764 1218237 1261971 1303852
63358 1303852 1344196 1382376 1416522 1444458 1464600 1476198 1479683 1477035 1471049 1463525 1454359 1442767
63346 1442767 1429057 1414688 1400546 1385542 1367247 1343979 1316140 1285272 1252100 1216261 1178125
63335 1178125 1139728 1102985 1067744 1032940 999231 968868 942905 920197 899680 882110 868592
63324 868592 858646 850981 845407 842768 843335 846343 850918 856730 863997 873485 886233 902512 921342 941622
63310 941622 963391 987378 1013820 1042602 1074058 1108568 1145466 1183539 1222673 1263951 1307704
63299 1307704 1352254 1394966 1433883 1467926 1496130 1517467 1531297 1537584 1536786 1529839 1518315 1504195
63287 1504195 1489126 1473741 1457767 1440912 1423467 1405701 1386815 1365039 1338981 1308554 1274609
63276 1274609 1238319 1201144 1164591 1129300 1094686 1059980 1025324 991488 959060 928482 900414
63265 900414 875254 852535 831372 811349 792532 774995 758972 745052 733449 723265 713186
63254 713186 702738 692374 682751 674637 669053 666344 665231 663733 661080 657979 655196 652830 650867 649291
63240 649291 647510 644685 640860 636985 633781 631495 630716 632107 635008 637541 638612 638696 638124 635953 631582
63225 631582 626519 623258 622739 623780 624628 624325 623034 621865 622088 623720 625134 624799 623158 622098 622850 625205
63209 625205 628496 632222 635532 637092 636295 634370 633820 636592 642670 650229 657035 661866 664901 667176 669973
63194 669973 674422 680954 688904 697073 704961 713117 722280 732724 744484 757476 771008 783955 795993
63181 795993 808116 821431 836055 851764 868932 887959 908391 929674 952337 977201 1003717
63170 1003717 1030438 1057210 1085446 1115758 1146578 1175994 1204017 1231998 1260334 1287943 1313980
63159 1313980 1339002 1364032 1389157 1413675 1437351 1460724 1483998 1506239 1526161 1543304 1557715
63148 1557715 1568719 1575014 1576102 1572529 1564210 1549687 1528027 1500732 1470569 1439027 1406174 1372597
63136 1372597 1339973 1309634 1281961 1257483 1237213 1221347 1208820 1198815 1191766 1188279 1188088 1190806
63124 1190806 1196671 1205618 1216627 1229073 1243806 1261490 1280601 1298756 1315741 1333582 1353530 1374672
63112 1374672 1395892 1417580 1440383 1463414 1484910 1504096 1521455 1537389 1551420 1562596 1570107
63101 1570107 1573545 1572951 1568494 1559883 1546355 1527515 1503948 1476849 1447492 1417281 1387628 1359066
63089 1359066 1330884 1302410 1274441 1248606 1225393 1203656 1182201 1161099 1141196 1123139 1107486
63078 1107486 1095101 1086474 1080618 1075485 1069969 1065087 1062605 1062597 1063102 1062523 1061701 1062785 1066302 1070413 1073258
63063 1073258 1074986 1076901 1079583 1082835 1086806 1091865 1097684 1103617 1109861 1116949 1124115 1129643 1133207 1136443
63049 1136443 1140473 1144235 1146359 1147525 1149507 1152673 1156090 1159792 1165110 1172411 1179893 1185373 1188408 1190030
63035 1190030 1191189 1192214 1193366 1195048 1197412 1200174 1202902 1205366 1207690 1210313 1213794 1218602 1225040 1233197
63021 1233197 1242844 1253587 1265347 1278448 1292885 1307798 1322297 1336650 1352027 1368999 1386961
63010 1386961 1405250 1424179 1444537 1466527 1489644 1513397 1537817 1563424 1590959 1620991 1653497
62999 1653497 1687854 1723310 1759413 1796091 1833608 1872500 1913303 1956330 2001880 2050405 2101974
62988 2101974 2155632 2209955 2264394 2319511 2375712 2432405 2488710 2544388 2599629 2654571 2709618
62977 2709618 2765647 2822985 2880458 2936328 2990175 3043054 3095651 3146996 3195366 3239860 3280441
62966 3280441 3316508 3345916 3365624 3373354 3368677 3352688 3326852 3292289 3250012 3201320 3147580 3089741
62954 3089741 3028477 2964962 2901246 2839629 2781708 2728130 2679278 2635905 2598818 2567987 2542439
62943 2542439 2521301 2504700 2493310 2487294 2486201 2489713 2497797 2510043 2525488 2543375 2563533 2585705
62931 2585705 2609013 2632563 2656189 2680080 2703860 2726491 2746932 2764521 2778768 2789220 2795603
62920 2795603 2797852 2795730 2788314 2773906 2750836 2718763 2679024 2633215 2581576 2523405 2459038 2390613
62908 2390613 2320635 2250464 2180481 2110871 2041829 1973701 1907518 1844783 1786223 1731477 1680462
62897 1680462 1634063 1592620 1554681 1518489 1484103 1452750 1424484 1397775 1371264 1344705 1318408
62886 1318408 1293055 1270001 1250360 1233558 1217941 1202908 1189204 1177001 1165177 1152926 1140608
62875 1140608 1128380 1115332 1100991 1086505 1073282 1061320 1049935 1039267 1029895 1021522 1013222 1004667
62863 1004667 996077 987308 978024 968656 960262 953420 947934 943439 939569 935692 931302 926803 923328 921603
62849 921603 921268 921132 919886 916978 913212 910108 908218 906651 904801 903702 904606 906834 908478 908943 909392
62834 909392 910582 911767 912137 912061 912163 912148 911343 909731 907766 905625 903173 900253 896691 892554 888743 886579
62818 886579 886288 886509 885913 884809 884521 885755 888218 891266 894070 895579 895369 894388 893943 893993 893278 891123 888082
62801 888082 884589 880021 873783 866686 860490 856293 853919 852643 851971 851757 852021 852750 853660 854218 854278 854632
62785 854632 856358 859349 861974 862797 862362 862630 864622 867512 870339 873675 878564 884335 888839 891003 891982
62770 891982 893335 895198 897028 899140 902223 905822 908582 909915 910367 910392 910052 910107 912077 916454 921722 925957
62754 925957 928756 930948 933156 935516 938237 941309 944000 945777 947675 951591 957948 965052 971282 977184
62740 977184 984786 995359 1008416 1022551 1036668 1050573 1064915 1080678 1098576 1118884 1141656 1166663
62728 1166663 1193217 1220807 1250148 1282772 1319066 1357563 1397082 1438832 1485188 1536814 1592577
62717 1592577 1652293 1717814 1790560 1869284 1951415 2035787 2122935 2213239 2305948 2399622 2492212
62706 2492212 2580661 2661602 2732893 2793886 2844172 2882852 2909047 2921994 2920201 2901597 2865569
62695 2865569 2814484 2752452 2682694 2606487 2524205 2436561 2344869 2250741 2155882 2062083 1971335
62684 1971335 1885624 1805963 1731385 1659673 1589859 1523594 1463224 1408809 1358006 1308994 1262493
62673 1262493 1220534 1184025 1152164 1123722 1098057 1074868 1053569 1033380 1014058 996380 981594
62662 981594 970191 961400 954108 948075 943831 941672 941317 942475 944975 948335 952078 956734 963643 973277
62648 973277 984600 996843 1011125 1029144 1050706 1073864 1097644 1123508 1153691 1188903 1228167
62637 1228167 1270273 1314779 1361931 1412186 1465811 1522673 1582446 1644972 1710011 1776551 1842912
62626 1842912 1907820 1970800 2031005 2086162 2133487 2171536 2200393 2220006 2229069 2225892 2209816 2181453
62614 2181453 2142095 2093441 2037578 1976479 1911368 1842926 1772149 1700574 1629570 1559928 1492354
62603 1492354 1427895 1367356 1310482 1256346 1204668 1156348 1112459 1072963 1036745 1002870 971533
62592 971533 943618 919349 897573 876580 855635 835400 816678 799053 781254 762777 744682
62581 744682 728636 715503 704969 696176 688458 681665 675912 670896 665537 658734 650571 642364 635434
62568 635434 630309 627116 625767 625222 623590 620096 616470 615213 616632 618760 620146 621467 624046 628100
62554 628100 633233 639630 647640 656667 665583 674237 683738 695074 707922 720990 733343 745340 758455
62541 758455 774023 792054 811535 832017 854401 879732 907763 937517 969076 1003885 1043026
62530 1043026 1085851 1130715 1176593 1223481 1271483 1320062 1368225 1415011 1459526 1500668 1537129
62519 1537129 1567838 1592278 1610201 1621137 1624477 1619964 1607776 1588030 1560728 1526600 1487634 1446186
62507 1446186 1403525 1359675 1314682 1269587 1225996 1185028 1146906 1111289 1077654 1045484 1014427
62496 1014427 984558 956426 930687 907557 886657 867405 849422 832365 815591 798432 780922
62485 780922 763814 747718 732651 718690 706508 696621 688436 680788 673383 667039 662453 659318 656895
62472 656895 654924 653739 653836 655591 659077 663958 669788 676503 684288 692954 701920 710942 720379 730615
62458 730615 741822 754531 769707 787722 807876 829542 853164 879351 907650 937397 969354
62447 969354 1004956 1043792 1083277 1121387 1158466 1195617 1232474 1267534 1299597 1327476 1349163
62436 1349163 1363109 1370178 1372526 1370302 1361140 1343626 1319764 1292944 1264626 1234385 1202349 1169948
62424 1169948 1138414 1108001 1078867 1051481 1025902 1001647 978762 958142 940216 924030 908284
62413 908284 892894 878934 867374 858343 851312 845445 839932 834528 829747 826172 823681 821811 820870 822122
62399 822122 826530 833455 840931 847261 852221 856714 861555 866986 873281 881130 890917 901937 912904 923081
62385 923081 932390 940552 946901 951138 953590 954444 953275 949592 943287 934386 923073 910282 897465 885221
62371 885221 872764 859314 845332 831701 818443 805269 792861 782399 773965 766558 759676 753900
62359 753900 749875 747741 747690 749894 753450 756538 758443 760586 764642 770279 775812 780871 787267 797011 810141
62344 810141 824809 838869 851058 861259 870408 880153 891845 905405 919234 931429 940951 947645
62332 947645 951799 954262 956620 960196 964679 968365 969962 969535 967677 964871 962191 961449 963597 967739 972846
62317 972846 979733 989965 1003272 1017754 1032653 1049342 1069204 1092090 1117577 1146464 1180054 1218788
62305 1218788 1262429 1310850 1363818 1420692 1481284 1546548 1617443 1693292 1771885 1850910 1928670
62294 1928670 2003688 2074392 2139154 2196255 2243976 2281132 2307250 2321990 2324902 2316264 2297615 2270732
62282 2270732 2236410 2194914 2147166 2094660 2038463 1979249 1918109 1856450 1795112 1734543 1675913
62271 1675913 1621069 1571046 1525417 1483342 1444427 1408159 1373486 1339796 1307833 1278826 1252991
62260 1252991 1229585 1208158 1188886 1171675 1155843 1141127 1128424 1118868 1112364 1107463 1102657 1097471
62248 1097471 1092397 1088341 1086195 1086275 1087625 1088205 1086447 1082721 1078941 1076731 1076153 1075855 1073957 1069117 1061733
62233 1061733 1054287 1049643 1048568 1049541 1051215 1054113 1059230 1065940 1072463 1078066 1083583 1089836 1096677 1103883
62219 1103883 1112092 1122275 1134726 1149029 1164729 1181729 1200150 1220011 1241011 1262849 1286035
62208 1286035 1312227 1343135 1378974 1418428 1460296 1504766 1552859 1605061 1660937 1719977 1782508
62197 1782508 1849612 1922015 1998836 2077358 2154161 2226516 2292725 2351472 2401318 2440781 2468566
62186 2468566 2483777 2486307 2477007 2457097 2427423 2388723 2342489 2290852 2235345 2176409 2114573 2051666
62174 2051666 1990324 1932498 1878780 1828996 1782904 1740431 1701705 1667093 1636930 1611125 1589213
62163 1589213 1570921 1556541 1546467 1540231 1536098 1531943 1526771 1521263 1516674 1513414 1511126 1509974 1511030
62150 1511030 1514952 1520790 1526844 1532549 1538842 1546572 1555211 1563609 1571674 1580729 1592250 1606683 1623548
62137 1623548 1642204 1662195 1683286 1705671 1730111 1757413 1787724 1820615 1855835 1893544 1933733
62126 1933733 1975767 2018543 2060632 2100281 2136050 2168031 2197963 2227540 2256901 2285233 2312423
62115 2312423 2339263 2366251 2393213 2420447 2449528 2482415 2519902 2561188 2604833 2650071 2697344
62104 2697344 2747553 2800518 2854147 2905253 2951104 2990246 3022459 3048549 3069825 3086939 3099252
62093 3099252 3106007 3107894 3106521 3102391 3094646 3083148 3069616 3055925 3042403 3028884 3016593 3007493
62081 3007493 3002068 2999228 2998623 3001731 3009957 3022544 3037165 3052159 3067487 3083839 3101640 3120994
62069 3120994 3141977 3164569 3188605 3214070 3241351 3270912 3302769 3336481 3371618 3408055 3445819
62058 3445819 3484973 3525774 3568606 3613471 3659855 3707374 3756267 3806733 3857966 3908544 3957877
62047 3957877 4006754 4056387 4107426 4160026 4214248 4269944 4326761 4384651 4444096 4505609 4569499
62036 4569499 4636375 4707147 4781773 4858566 4935761 5013716 5094623 5179854 5268185 5356790 5443294
62025 5443294 5526676 5607050 5685478 5763882 5844432 5928598 6016550 6107117 6198064 6286687 6370788
62014 6370788 6449528 6523391 6593278 6659672 6722849 6783851 6844795 6907623 6972387 7037093 7099363
62003 7099363 7157894 7212203 7261633 7305283 7342551 7373012 7395850 7410168 7415964 7414252 7406096 7392004
61991 7392004 7372293 7347339 7317329 7282452 7243601 7202095 7158326 7111528 7061619 7010527 6960730
61980 6960730 6912977 6866623 6822006 6781116 6745553 6714802 6687088 6661164 6636658 6613327 6590908
61969 6590908 6569600 6550000 6532365 6516185 6500504 6484575 6468296 6452055 6435955 6419253 6400994
61958 6400994 6381267 6361230 6341594 6321679 6300512 6278308 6256169 6234705 6213776 6193340 6173559
61947 6173559 6154060 6134010 6113239 6092553 6072596 6053067 6033391 6013451 5993071 5971210 5946333
61936 5946333 5917466 5884412 5847045 5804725 5756406 5701237 5639298 5571966 5501354 5429208 5356438
61925 5356438 5283570 5211144 5139685 5069923 5003192 4940743 4882259 4825878 4770400 4716739 4666342
61914 4666342 4618825 4572439 4526648 4482920 4442722 4405761 4370716 4336964 4305007 4275513 4248313
61903 4248313 4222288 4196266 4170362 4146186 4125206 4107025 4089985 4073357 4057993 4044685 4033074
61892 4033074 4022853 4015200 4012045 4014285 4021526 4033243 4049337 4069592 4093481 4120882 4152417 4188650
61880 4188650 4229232 4273310 4320679 4372085 4428180 4488548 4552193 4618856 4689193 4763541 4841177
61869 4841177 4921363 5004505 5091451 5181944 5274833 5369946 5468952 5574241 5687867 5811999 5949313
61858 5949313 6101944 6270357 6454134 6653985 6872698 7114291 7382603 7680366 8009005
61849 8009005 8369293 8762591 9191707 9660475 10172464 10730033 11334346 11985898 12684698
61840 12684698 13429368 14215399 15033689 15870031 16704565 17510404 18253176 18894076 19395641
61831 19395641 19726630 19864529 19797910 19529608 19077643 18471390 17745524 16935843 16077090
61822 16077090 15200256 14329480 13481308 12666791 11893750 11167377 10490089 9861922 9281261
61813 9281261 8745613 8252582 7800587 7388316 7013442 6672380 6361557 6078608 5822229
61804 5822229 5591351 5384636 5200356 5036412 4890664 4761489 4647998 4549726 4466146 4396311
61794 4396311 4338682 4291506 4253733 4225261 4205707 4193167 4185023 4180072 4178792 4180905 4183453 4182379
61782 4182379 4175945 4165772 4154309 4141928 4127012 4108598 4088174 4068767 4052829 4041510 4035428 4035080
61770 4035080 4040249 4049852 4062996 4079658 4099733 4121856 4143808 4163727 4180271 4192105 4198442 4200109
61758 4200109 4199017 4196392 4192545 4188672 4187600 4191777 4201171 4214259 4230929 4253509 4284937 4326706 4378881
61745 4378881 4441498 4515224 4600556 4696969 4803575 4920765 5050575 5194793 5353041 5523584
61735 5523584 5705999 5902115 6114055 6342243 6585986 6845386 7121984 7418049 7736144
61726 7736144 8079290 8450737 8853392 9289830 9762957 10276403 10834457 11442071 12104912
61717 12104912 12828991 13620105 14483784 15425665 16451456 17566079 18772310 20069290 21451411
61708 21451411 22907751 24421234 25966155 27504828 28986584 30350883 31532438 32465801
61700 32465801 33090917 33362301 33259375 32791181 31992468 30915392 29622133 28178869 26649148
61691 26649148 25087570 23536625 22027196 20580470 19209789 17922647 16722563 15609889
61683 15609889 14581936 13633897 12760566 11957265 11219373 10541865 9919825 9349049 8825902
61674 8825902 8346989 7909267 7509929 7145600 6811903 6504417 6220117 5957588 5715941
61665 5715941 5493839 5289311 5099909 4922816 4755258 4595274 4442161 4296101 4157339
61656 4157339 4025620 3900270 3780752 3667106 3559823 3459285 3365415 3277799 3195950 3119426
61646 3119426 3047878 2980985 2918076 2857951 2799679 2743631 2690941 2641547 2593636 2545821 2499069
61635 2499069 2455161 2413703 2372282 2329815 2288132 2249457 2213599 2178825 2144515 2111439 2079802
61624 2079802 2048648 2017474 1987166 1958689 1931750 1905492 1880011 1856454 1835749 1817773 1801527
61613 1801527 1785576 1768508 1749770 1730465 1712817 1698403 1686944 1677023 1667572 1658197 1648463 1637834
61601 1637834 1626538 1615747 1606362 1598123 1590398 1583349 1577766 1574190 1572894 1574246 1578108 1583153 1587896
61588 1587896 1592365 1597591 1603422 1608244 1611345 1614168 1618280 1623254 1627674 1631165 1633889 1634819 1632535 1627911
61574 1627911 1624174 1623473 1624560 1624838 1623877 1623826 1626647 1631927 1637563 1641838 1644319 1645183 1644418 1642039 1638504 1634085
61558 1634085 1627789 1617810 1603600 1586941 1570236 1554121 1537646 1520616 1504651 1491549 1481292 1472201
61546 1472201 1462682 1452462 1442377 1433355 1425506 1417991 1409903 1401399 1393854 1388785 1386767 1387373 1389821 1393377
61532 1393377 1397352 1401186 1404840 1408953 1414303 1420974 1428354 1436247 1445713 1458217 1473873 1491086 1508226
61519 1508226 1525188 1542931 1562007 1582197 1603395 1626285 1652096 1681900 1715970 1753422 1792696
61508 1792696 1832730 1873688 1916348 1961044 2007463 2055062 2103222 2151310 2199063 2246699 2294171
61497 2294171 2340558 2384714 2426318 2465765 2503278 2538687 2571985 2603488 2633441 2661820 2688289
61486 2688289 2712041 2732080 2748237 2761490 2772628 2781047 2785676 2786718 2785498 2782814 2778507 2772622 2765982
61473 2765982 2759473 2753607 2748841 2745597 2744069 2744873 2749712 2760284 2776563 2797439 2823115 2855470 2895621
61460 2895621 2942534 2994783 3052571 3117178 3189408 3269635 3358722 3458013 3568753 3692083 3829205
61449 3829205 3980978 4147697 4329617 4527284 4741273 4972237 5221332 5489586 5776465
61440 5776465 6079869 6397577 6727170 7063586 7397914 7719521 8018449 8284975 8508496
61431 8508496 8679156 8790863 8842163 8835081 8774511 8668088 8524669 8352189 8157337 7946819
61421 7946819 7727689 7506350 7288004 7076924 6876407 6688573 6515044 6357708 6218081
61412 6218081 6096263 5991465 5903415 5832344 5777818 5738723 5714417 5704815 5709248 5726276 5754852
61401 5754852 5794671 5845076 5904446 5971021 6043567 6120856 6201112 6282427 6363454 6443696 6523595
61390 6523595 6604233 6686178 6768423 6849064 6927096 7003001 7077646 7151443 7224618 7297295 7368877
61379 7368877 7438094 7503970 7566026 7623263 7673919 7716964 7753195 7784093 7809935 7829540 7841535
61368 7841535 7845240 7840608 7827929 7807710 7780561 7747275 7709083 7667589 7624163 7579555 7534229 7488911
61356 7488911 7444730 7403116 7365537 7333004 7305705 7283440 7266353 7254651 7247489 7242746 7238318 7233181
61344 7233181 7226975 7219198 7209446 7198072 7185944 7173627 7161279 7149322 7138813 7131326 7128907 7134241
61332 7134241 7150501 7180738 7227213 7291141 7373039 7473601 7594388 7737413 7903898 8093794
61322 8093794 8306805 8543461 8804596 9089826 9396926 9722501 10062381 10410972 10760615
61313 10760615 11102146 11426029 11722683 11982076 12194011 12349851 12444459 12476725 12448667 12364376
61303 12364376 12229517 12050687 11834182 11585006 11307325 11005952 10687150 10357712 10023309
61294 10023309 9687949 9355123 9029049 8714123 8412937 8125411 7850560 7588917 7342643
61285 7342643 7113494 6901705 6706986 6529493 6369128 6224868 6095881 5982959 5887783 5810806
61275 5810806 5750560 5704891 5672110 5651147 5641563 5643575 5657216 5681208 5713377 5752337 5797869 5849235
61263 5849235 5904094 5959931 6015979 6072703 6129464 6183673 6232574 6275343 6313051 6346943 6377256
61252 6377256 6403684 6426405 6446125 6463121 6476611 6485232 6488008 6484766 6475841 6461423 6440836 6412369
61240 6412369 6374393 6327208 6273496 6216394 6157134 6094922 6028773 5958835 5886062 5811491 5736133
61229 5736133 5660978 5586757 5514150 5444552 5380235 5323133 5273429 5229625 5190108 5154522 5123589
61218 5123589 5097825 5076695 5058987 5043529 5029174 5014577 4998880 4982647 4967169 4952575 4937586
61207 4937586 4921761 4907075 4896327 4890595 4889304 4892145 4899590 4911683 4927721 4947415 4971434 5000690
61195 5000690 5036185 5079750 5133732 5199344 5276084 5363221 5461049 5570158 5690091 5819137 5954606
61184 5954606 6092506 6227429 6353434 6464872 6556015 6620486 6651882 6645274 6598335 6511737 6388978
61173 6388978 6235495 6057482 5861372 5654010 5442349 5232427 5028654 4833836 4649148
61164 4649148 4474211 4308410 4152705 4009355 3879359 3761096 3652181 3551868 3460715 3378663
61154 3378663 3304768 3238557 3180330 3129827 3085518 3045737 3010125 2979651 2955452 2937780 2925886
61143 2925886 2918674 2915402 2915722 2919276 2925722 2935254 2948535 2965644 2985303 3005354 3023854 3039535 3051663
61130 3051663 3059845 3063842 3063465 3058868 3050919 3040635 3028051 3012240 2992734 2970209 2945322 2917626
61118 2917626 2886432 2852088 2815490 2776617 2734599 2689156 2641176 2591888 2542226 2493009 2444843
61107 2444843 2397460 2349766 2300966 2251341 2201776 2152915 2105090 2058595 2013609 1970041 1927921
61096 1927921 1887972 1851380 1818703 1789153 1761279 1734474 1709498 1687252 1667195 1647298 1625509
61085 1625509 1601006 1574125 1545600 1516107 1486317 1457235 1430366 1407124 1387750 1371212 1356799
61074 1356799 1345409 1338353 1335094 1333379 1331821 1331266 1333253 1338177 1345456 1354384 1364052 1373414 1382440 1392414
61060 1392414 1404090 1416231 1427086 1436811 1447254 1459663 1473687 1488320 1502685 1515979 1527793
61049 1527793 1538600 1549141 1559420 1569090 1578441 1587732 1595578 1599423 1598004 1592341 1584009 1573635 1561693
61036 1561693 1549527 1538524 1528845 1519803 1511072 1502733 1494533 1485899 1476551 1466483 1455529 1443587 1431174
61023 1431174 1419106 1407591 1396133 1384396 1372630 1361089 1349638 1338239 1327458 1317976 1309821 1302567
61011 1302567 1296139 1290742 1285944 1280659 1274652 1269536 1267452 1268916 1272633 1277306 1282807 1289484 1297212 1305578
60997 1305578 1314347 1323295 1332178 1341244 1351202 1362120 1372898 1382514 1391420 1401110 1412569 1425731 1440105
60984 1440105 1455257 1470801 1486588 1502932 1520295 1538834 1558542 1579588 1602211 1626586 1653088
60973 1653088 1682255 1714092 1747980 1783850 1822807 1865889 1912746 1962469 2015152 2071510 2131241
60962 2131241 2192975 2255922 2320583 2387859 2458457 2533190 2612775 2697072 2785387 2877728 2974938
60951 2974938 3077617 3186030 3301334 3425548 3559677 3702972 3854872 4016802 4191022
60942 4191022 4378406 4578385 4790672 5015833 5254245 5505662 5770369 6050268 6348565
60933 6348565 6668864 7014943 7390913 7800617 8246428 8729005 9248895 9808682 10413879
60924 10413879 11072826 11797325 12603857 13513183 14547877 15730359 17082951 18628077 20387464
60915 20387464 22382835 24639484 27188725 30063965 33288330 36850292 40662523 44517531
60907 44517531 48085031 50994361 52982407 54014933 54293668 54151416 53918446 53831588 53986577
60898 53986577 54304805 54527036 54281216 53229241 51217043 48331818 44839499 41062112
60890 41062112 37276435 33671252 30350713 27356488 24691579 22338699 20270764 18455535
60882 18455535 16859255 15450947 14204717 13098565 12112422 11228247 10431436 9711206 9059478
60873 9059478 8469387 7934299 7447679 7003712 6597894 6226845 5887811 5578542 5296948
60864 5296948 5039807 4801984 4577853 4363669 4157961 3960137 3770071 3588999 3419097
60855 3419097 3261315 3114652 2978103 2852032 2736655 2630294 2530556 2436751 2349931 2270782
60845 2270782 2198486 2131497 2068553 2009018 1953011 1901184 1853677 1809353 1766733 1725672 1687484
60834 1687484 1653400 1623445 1596829 1572698 1550303 1528953 1508242 1488193 1469073 1451172 1434648
60823 1434648 1419252 1404147 1388362 1371620 1354659 1338620 1324040 1310308 1296028 1280132 1262821
60812 1262821 1245320 1228651 1212818 1197275 1181965 1167633 1155243 1145299 1137681 1132008 1128066 1125838
60800 1125838 1125098 1125253 1125838 1127005 1129241 1132763 1137603 1144064 1152535 1162870 1174549 1187472 1202027 1218347
60786 1218347 1236093 1255017 1275064 1295933 1317287 1339481 1363133 1387716 1411466 1432967 1451808
60775 1451808 1467397 1478530 1485068 1488904 1492062 1494628 1495764 1495937 1496584 1497838 1498120 1496080 1491749 1485653
60761 1485653 1478066 1469527 1461025 1453067 1445166 1436670 1427589 1418250 1408617 1398258 1386622 1373170 1357751
60748 1357751 1341143 1324937 1310667 1299103 1290196 1283175 1276745 1269876 1262746 1256521 1252080 1249328 1247873
60735 1247873 1247725 1248955 1251160 1253835 1257227 1262402 1270330 1280921 1292883 1304678 1315885 1327653 1341555
60722 1341555 1357948 1375786 1393978 1412376 1431165 1449931 1468025 1485563 1503285 1521215 1538091
60711 1538091 1552509 1564328 1574592 1584392 1594280 1604482 1614833 1624385 1631877 1637038 1640851 1644035 1645938
60698 1645938 1645652 1643635 1641207 1638847 1636189 1633536 1631877 1631071 1629444 1625906 1621338 1617052 1612995 1608579
60684 1608579 1604250 1600728 1597165 1591703 1583810 1574691 1565296 1555266 1544365 1533642 1524277 1516003 1507627
60671 1507627 1498774 1490288 1483001 1476793 1471037 1465486 1460424 1456195 1452969 1450890 1450010 1449813 1449185 1447423 1445248
60656 1445248 1444233 1445005 1446476 1447036 1446036 1443817 1440894 1437682 1434575 1431602 1428080 1423139 1416588 1408938
60642 1408938 1400725 1392110 1382977 1373123 1362651 1352449 1343774 1336739 1329562 1320051 1307782 1294252 1280986
60629 1280986 1268118 1254796 1240345 1224842 1209118 1194412 1181632 1170610 1160090 1148588 1135360
60618 1135360 1120864 1106534 1093900 1083677 1075783 1070216 1067316 1066866 1067506 1067776 1067529 1067809 1069576 1073071
60604 1073071 1078096 1084283 1091194 1098754 1107438 1117531 1128348 1138780 1148410 1157501 1166066 1173767 1180877
60591 1180877 1188714 1198750 1211464 1226014 1240787 1254450 1266807 1278536 1289968 1300524 1309704 1318117
60579 1318117 1326931 1336660 1347025 1357588 1367954 1377786 1387388 1397929 1410445 1424981 1441242 1459338
60567 1459338 1478900 1498212 1515536 1530929 1545401 1558668 1569285 1576879 1582588 1587094 1589754 1590004
60555 1590004 1588160 1584326 1577975 1569345 1560000 1551220 1542863 1534397 1525939 1517603 1509070 1500781 1494399 1490938
60541 1490938 1489226 1487290 1484508 1481306 1477502 1472354 1465899 1458931 1451757 1444161 1436606 1430337 1425995 1422973
60527 1422973 1420544 1419014 1419196 1421135 1423970 1427110 1431194 1437395 1445776 1454764 1462579 1468792 1474062 1478929
60513 1478929 1483733 1489304 1496424 1504429 1511499 1516635 1520362 1523178 1524599 1524370 1523477 1523046 1523116 1523296 1523800 1524798
60497 1524798 1525463 1524623 1522009 1518098 1513288 1507988 1502966 1498876 1496046 1495361 1498380 1505596 1515563 1527057
60483 1527057 1541272 1560221 1583530 1608850 1635495 1665913 1703028 1747545 1798346 1854117 1913673
60472 1913673 1975641 2038701 2101629 2162488 2218204 2265478 2301825 2325642 2336061 2333458 2319902
60461 2319902 2298728 2273679 2248342 2225768 2208161 2196945 2192997 2196314 2205561 2218657 2234175 2251854
60449 2251854 2271735 2293413 2316416 2340774 2366827 2394775 2424742 2457111 2492672 2532745 2579168
60438 2579168 2633748 2697432 2770281 2852372 2944486 3047810 3163138 3290292 3428093 3575129
60428 3575129 3731118 3897476 4076128 4268032 4473702 4695140 4936328 5201664 5494907
60419 5494907 5819789 6179834 6575652 7002006 7447557 7896239 8327509 8716001 9033619
60410 9033619 9254403 9359121 9337558 9189432 8924890 8563448 8130600 7653524 7157744 6664723
60400 6664723 6189903 5742051 5324794 4939184 4585279 4262445 3969483 3704893 3466706
60391 3466706 3252235 3058623 2883673 2725668 2582622 2452714 2335511 2231505 2139819 2057476
60381 2057476 1981846 1912856 1851518 1797000 1746731 1699162 1654794 1614246 1576846 1541658 1508573
60370 1508573 1477608 1448207 1420135 1394260 1371451 1351243 1332403 1314440 1297789 1282777 1268948
60359 1268948 1255191 1240322 1224178 1208509 1196019 1187861 1182648 1178396 1174550 1171452 1169030 1167275 1167113
60346 1167113 1169179 1172231 1174296 1175100 1175834 1176768 1176898 1176066 1175616 1176423 1177898 1179654 1182611 1187414 1193053 1198307
60330 1198307 1203662 1210385 1218185 1225113 1229658 1231974 1233066 1233644 1233924 1233800 1232886 1230682 1226941 1221875 1216085
60315 1216085 1210359 1205285 1200868 1196732 1192757 1189351 1187061 1186217 1186795 1188060 1188501 1187067 1184750 1183900 1185384
60300 1185384 1187395 1188059 1188410 1191430 1198320 1207077 1215062 1221926 1229353 1238518 1248598 1257798 1265384 1272465
60286 1272465 1280720 1290540 1300702 1309911 1318225 1326661 1335829 1345359 1354402 1362131 1367948 1371796 1374286 1376089
60272 1376089 1377286 1377788 1378183 1379446 1381714 1384179 1386545 1389938 1395791 1404128 1413405 1421772 1428080 1431938
60258 1431938 1433459 1433034 1430922 1426947 1420884 1413220 1405215 1398065 1392217 1387569 1383987 1381311 1379164 1377202
60244 1377202 1375639 1375173 1376167 1378049 1379620 1379990 1379225 1378277 1378314 1379942 1382889 1386478 1390337 1394557 1399138 1403635
60228 1403635 1407624 1411316 1415482 1420848 1427799 1436488 1446859 1458489 1470651 1482678 1494320 1505962
60216 1505962 1518676 1533695 1551346 1570539 1589721 1608293 1626629 1644924 1662859 1680643 1699532
60205 1699532 1720666 1743908 1768505 1794502 1822834 1854250 1888927 1927019 1968690 2013509 2060687
60194 2060687 2110335 2163844 2222503 2286312 2354786 2428536 2509219 2597969 2694477 2797789 2907464
60183 2907464 3023836 3147589 3279394 3419622 3568161 3724632 3888834 4060565 4238686
60174 4238686 4420745 4603946 4786333 4966480 5142030 5309057 5463207 5601394 5722413
60165 5722413 5826240 5912983 5982314 6033617 6066604 6081926 6081320 6067226 6042258 6008939 5969832
60154 5969832 5927846 5886213 5847907 5815075 5789327 5772723 5768116 5778194 5804409 5847081 5906242
60143 5906242 5981869 6073575 6180708 6302749 6439046 6588114 6747747 6915685 7089303 7264415
60133 7264415 7435321 7596744 7745321 7878710 7993915 8087351 8156408 8200245 8219035 8213094
60123 8213094 8182950 8129936 8056571 7966466 7863872 7753119 7638487 7524403 7415292 7314958
60113 7314958 7226293 7151685 7093304 7052873 7031704 7031224 7052727 7096028 7158860 7238284 7332189 7438653
60101 7438653 7554339 7674576 7794953 7911899 8021802 8120801 8205960 8276004 8330630 8369776
60091 8369776 8394036 8405278 8406399 8400586 8390885 8380093 8371072 8367588 8374713 8397543 8439177 8500552
60079 8500552 8582516 8687320 8817608 8974644 9158378 9369034 9608069 9877694 10179906 10515840
60069 10515840 10885512 11288119 11722760 12188701 12684490 13206667 13749409 14305249 14865885
60060 14865885 15422473 15965713 16486191 16974892 17423490 17824226 18169675 18452928 18668187
60051 18668187 18811110 18878535 18868405 18780615 18617967 18385801 18090639 17739627 17341378 16906747
60041 16906747 16448232 15978531 15509515 15051909 14615181 14207353 13834795 13502178 13212773
60032 13212773 12968906 12771939 12621679 12516355 12453708 12431823 12448177 12498012 12574413 12670016
60022 12670016 12778002 12891578 13003501 13106475 13193349 13257113 13292068 13295823 13269270 13213989
60012 13213989 13130427 13019103 12882317 12723354 12544588 12347591 12134584 11908414 11671303
60003 11671303 11425040 11172596 10918322 10666340 10419866 10182444 9958527 9751823 9563892
59994 9563892 9395392 9248297 9125816 9030118 8960936 8916625 8896065 8899413 8927479 8980634 9057997
59983 9057997 9157250 9275259 9409060 9556078 9713074 9874823 10034190 10183754 10317412 10430521
59973 10430521 10519287 10580793 10613579 10617318 10591510 10535051 10447616 10331157 10189530 10027009 9847886
59962 9847886 9657340 9461610 9266675 9077098 8896368 8727789 8574446 8438673 8322234
59953 8322234 8226824 8153641 8102456 8072152 8062808 8076694 8116396 8182319 8272995 8387743 8527845
59942 8527845 8694468 8886127 9098824 9328001 9569508 9818884 10070540 10317718 10552780
59933 10552780 10767888 10956423 11114142 11238678 11328083 11380453 11394831 11371636 11312131 11218320
59923 11218320 11093625 10942838 10771099 10583719 10387309 10190026 9999681 9821786 9659781
59914 9659781 9516520 9394935 9297706 9226867 9183384 9166764 9175708 9209682 9269213 9353987 9461432
59903 9461432 9588124 9731776 9890621 10061302 10238891 10418967 10598441 10774384 10943547
59894 10943547 11103355 11252124 11387878 11508344 11613006 11704153 11785060 11857973 11924817 11988939
59884 11988939 12054818 12126503 12207734 12303566 12420531 12564661 12740053 12949692 13196913 13485327
59874 13485327 13817497 14194103 14614240 15076043 15576553 16110636 16669825 17242264 17813918
59865 17813918 18369565 18892432 19363522 19762610 20071082 20274600 20364221 20336672 20194663 19946680
59855 19946680 19605549 19186640 18707018 18185182 17639988 17088606 16545013 16019915 15521451
59846 15521451 15055781 14627614 14240805 13898479 13602364 13352331 13147270 12986681 12871182
59837 12871182 12801282 12775930 12792487 12847910 12939432 13063728 13215609 13387968 13573123 13763657
59827 13763657 13951356 14125469 14272784 14379990 14436104 14433253 14366569 14234440 14038567 13782950
59817 13782950 13472865 13115439 12720816 12301334 11868622 11431555 10996882 10570831 10159390
59808 10159390 9767414 9398129 9053413 8734211 8440813 8173070 7930349 7711230 7513650
59799 7513650 7335735 7176315 7034372 6908261 6795721 6694321 6601404 6514000 6429626 6347422
59789 6347422 6268020 6192195 6120063 6051766 5988349 5931342 5881476 5838110 5799833 5765199 5732631
59778 5732631 5699833 5663743 5621388 5571020 5512771 5448521 5381061 5312885 5245308 5178726 5113731
59767 5113731 5051964 4995872 4947891 4909824 4882388 4864969 4856267 4855756 4864258 4882508 4909487 4943027
59755 4943027 4981995 5027078 5079399 5139349 5207089 5283198 5367962 5460380 5558282 5658947 5759265
59744 5759265 5856025 5946979 6031546 6109955 6181804 6245913 6301434 6348751 6389386 6425408 6458905
59733 6458905 6491812 6526207 6564648 6609869 6664116 6729238 6807392 6900996 7011891 7141451 7291956
59722 7291956 7466999 7669798 7901795 8163774 8457703 8786481 9152114 9554959 9994324
59713 9994324 10468336 10972488 11498162 12031557 12552567 13034634 13447496 13762559 13958293
59704 13958293 14023985 13961855 13787035 13524304 13202448 12849093 12487828 12137025 11809482 11513017
59694 11513017 11251875 11028048 10842125 10694023 10583288 10508528 10467020 10456013 10474803 10524781
59684 10524781 10607076 10720785 10864041 11036300 11238932 11473740 11741332 12040964 12371725
59675 12371725 12733911 13129249 13559815 14027028 14532231 15078073 15668518 16307116 16995731
59666 16995731 17735178 18526436 19370501 20267287 21215167 22211303 23251569 24329577 25435841
59657 25435841 26558088 27682655 28796078 29886127 30942331 31956755 32925524 33850337
59649 33850337 34738565 35601484 36451716 37301137 38159433 39032798 39922717 40825330 41731700
59640 41731700 42628567 43499073 44323484 45080592 45749986 46314358 46760912 47082183 47277084
59631 47277084 47351871 47319794 47199226 47011654 46780322 46529008 46280603 46056278 45875553 45756167
59621 45756167 45713137 45758051 45899586 46144715 46499558 46969631 47559309 48270087 49098785 50037566
59611 50037566 51075147 52196067 53377476 54587210 55785502 56927307 57962213 58834472
59603 58834472 59487498 59871534 59949639 59700774 59122313 58231721 57064432 55668200 54097775
59594 54097775 52411101 50664625 48907566 47178741 45507206 43913315 42407775 40990805
59586 40990805 39653226 38377810 37139855 35909654 34658814 33367409 32027780 30644584
59578 30644584 29232857 27814431 26412853 25049089 23739954 22498066 21331415 20243214
59570 20243214 19233204 18299267 17437799 16643858 15912437 15239517 14621253 14052916 13529933
59561 13529933 13049683 12610968 12211643 11847922 11516208 11214513 10941479 10694598 10469959
59552 10469959 10263432 10071762 9892648 9723971 9562906 9405809 9249027 9089732 8926162
59543 8926162 8757734 8585269 8410554 8235064 8059411 7884399 7712064 7544964 7384865
59534 7384865 7232841 7090211 6958344 6837829 6728905 6632613 6550313 6481931 6425883 6381115
59524 6381115 6348002 6326660 6315624 6313360 6320157 6337000 6362949 6395248 6432256 6474896 6524467 6580022
59512 6580022 6638912 6699407 6761857 6827636 6898106 6974712 7059048 7152089 7253765 7363816 7482955
59501 7482955 7612945 7755939 7914024 8088963 8281685 8492097 8719923 8965850 9231591
59492 9231591 9518814 9828278 10159856 10512991 10886932 11280579 11692029 12118285 12555632
59483 12555632 13000234 13447867 13892909 14328468 14748264 15148073 15524998 15876074 16198393
59474 16198393 16489707 16747482 16967857 17147339 17286071 17388455 17460613 17508439 17538097 17556460
59464 17556460 17570049 17584718 17607093 17645063 17705652 17793121 17909768 18056984 18233576 18433349
59454 18433349 18645540 18857330 19055035 19223761 19348207 19414745 19412400 19332375 19168222 18917270
59444 18917270 18581386 18166442 17681850 17140531 16557886 15949655 15330523 14714175 14113073
59435 14113073 13536982 12991914 12481149 12007198 11572499 11178512 10824857 10509719 10231081
59426 10231081 9987495 9777882 9600968 9455319 9339909 9254216 9197622 9169179 9168288 9195249
59416 9195249 9250594 9334001 9444311 9580552 9742479 9930008 10142399 10378076 10634962 10910680
59406 10910680 11202149 11504829 11812480 12117906 12413669 12691512 12941189 13150961 13310112
59397 13310112 13410925 13448316 13418809 13321217 13158038 12934987 12658788 12336091 11974712 11584986
59387 11584986 11178729 10766305 10354512 9947204 9547721 9160452 8789884 8438583 8106916
59378 8106916 7794926 7503765 7234808 6988000 6761819 6554655 6365557 6193759 6038117
59369 6038117 5897237 5769890 5655405 5553966 5466465 5393637 5335191 5289854 5256168 5233105
59359 5233105 5220071 5216591 5221977 5235276 5255652 5282842 5317082 5358695 5407994 5465201 5529479 5597745
59347 5597745 5665312 5728599 5787437 5844983 5905971 5974925 6054778 6146364 6249605 6365560 6496514
59336 6496514 6643402 6803743 6973040 7148113 7328950 7518251 7720268 7939793 8181316
59327 8181316 8448734 8745588 9074719 9437417 9833953 10265836 10736820 11250904 11810230
59318 11810230 12415931 13069991 13774429 14528695 15329097 16170402 17046111 17946494 18857566
59309 18857566 19762958 20646819 21495384 22297133 23042649 23724772 24339298 24885838 25367363
59300 25367363 25788085 26151465 26459875 26714614 26914949 27057736 27139253 27156959 27108348 26988845
59290 26988845 26792888 26517520 26164052 25736726 25241663 24687232 24083420 23439509 22762955
59281 22762955 22060613 21339677 20606780 19867362 19126810 18391488 17668049 16962378 16279584
59272 16279584 15624200 14999852 14409295 13855028 13339112 12862226 12423804 12023350 11660645
59263 11660645 11334499 11042489 10782516 10553487 10353937 10181147 10032446 9906370 9801760
59254 9801760 9716631 9648726 9596203 9556890 9527804 9506389 9491309 9480891 9471670 9459925 9444124
59243 9444124 9424464 9400344 9369738 9331012 9284120 9230052 9170452 9107980 9045683 8985311 8927045
59232 8927045 8871402 8820806 8778870 8748690 8732268 8730885 8745217 8775299 8821100 8883377 8963744
59221 8963744 9063838 9184485 9325536 9486127 9664913 9860149 10069714 10291063 10521131
59212 10521131 10756446 10993412 11228309 11456612 11672395 11868859 12039596 12178832 12280624
59203 12280624 12339167 12351309 12318784 12247289 12143601 12014121 11865329 11703578 11533438 11357001
59193 11357001 11175438 10990724 10805471 10621729 10440511 10262141 10086692 9914657 9747689
59184 9747689 9588321 9438601 9299391 9171445 9056655 8957608 8876106 8812726 8767774 8742186
59174 8742186 8737431 8754921 8795842 8861611 8954371 9076744 9230975 9418464 9640341 9898158
59164 9898158 10193655 10528096 10902207 11316160 11768636 12255585 12770122 13303154 13843335
59155 13843335 14376651 14886950 15357029 15768910 16104220 16346485 16484018 16510383 16422910 16222732
59145 16222732 15916626 15516933 15038595 14497142 13909653 13295139 12671598 12052905 11449482
59136 11449482 10870761 10324983 9816684 9345988 8910957 8510101 8142856 7808742 7506511
59127 7506511 7233779 6987341 6764202 6562417 6381002 6219347 6076688 5951466 5840998
59118 5840998 5742537 5655138 5579848 5517569 5467460 5428017 5398811 5380182 5371802 5372468 5380912 5395978
59106 5395978 5416494 5442108 5474152 5514648 5564310 5622074 5686349 5756067 5830602 5909405 5991777
59095 5991777 6076543 6162034 6246765 6329866 6410411 6486665 6556604 6618862 6672559 6716580 6749738
59084 6749738 6771466 6781698 6780424 6768165 6746698 6718434 6685020 6647295 6606671 6565764 6527400
59073 6527400 6493367 6464312 6440539 6422880 6413089 6413382 6425410 6449697 6486042 6534051 6593331 6663993
59061 6663993 6747446 6845882 6960269 7089414 7231743 7387382 7557546 7742499 7941400 8153959
59051 8153959 8380968 8622938 8879206 9148684 9430594 9723973 10026940 10336784 10650389
59042 10650389 10964257 11274187 11574874 11859491 12119777 12346860 12532050 12666874 12743069
59033 12743069 12753560 12693897 12562975 12363000 12099391 11780431 11416303 11018058 10596947 10163445
59023 10163445 9725961 9290708 8863124 8448556 8050885 7671369 7310099 6968075 6646690
59014 6646690 6345622 6062872 5797191 5549235 5319951 5108666 4913223 4731393 4561831
59005 4561831 4404082 4257810 4121879 3994400 3874116 3761291 3656758 3560605 3472506 3392572
58995 3392572 3320497 3254245 3191076 3130007 3072078 3018149 2967741 2920240 2875822 2834552 2795625
58984 2795625 2758154 2721891 2686753 2652651 2620340 2591421 2566687 2545185 2525621 2508062 2493503
58973 2493503 2482366 2474280 2468836 2465675 2464059 2463280 2463576 2466087 2471779 2480657 2491839 2503950 2515494
58960 2515494 2525355 2533192 2539240 2543734 2546775 2548760 2550631 2553307 2556790 2560225 2563176 2566582 2571839 2579019
58946 2579019 2586868 2594740 2603578 2614287 2625978 2636789 2645842 2653267 2658746 2661463 2661606 2660622 2659532 2657859
58932 2657859 2654737 2650365 2645927 2642619 2641188 2642026 2645307 2651144 2659700 2670996 2684702 2700462 2718208
58919 2718208 2737776 2758621 2780560 2804543 2831800 2862256 2894568 2927713 2961843 2997748 3036359
58908 3036359 3078731 3125505 3176260 3230131 3287026 3347264 3410123 3474018 3538369 3604106 3672033
58897 3672033 3741952 3813934 3889089 3968229 4050860 4136498 4226017 4320542 4419781 4522796 4630052
58886 4630052 4743438 4864278 4992367 5127088 5268648 5417994 5576205 5744289 5923098
58877 5923098 6113070 6314260 6526974 6752358 6992064 7247150 7517411 7802198 8102004
58868 8102004 8418886 8755177 9112537 9492831 9899173 10334753 10800811 11297052 11824368
58859 11824368 12385978 12985451 13624624 14304178 15025333 15789965 16599365 17453434 18350830
58850 18350830 19289218 20265116 21273089 22304276 23345367 24379356 25387121 26347432
58842 26347432 27235700 28024797 28688859 29206455 29560525 29737616 29729784 29537641 29170582 28644139
58832 28644139 27977901 27195207 26322225 25384953 24406208 23405055 22398214 21401035 20426805
58823 20426805 19485358 18582670 17721984 16905479 16135074 15412017 14735928 14104212 13512429
58814 13512429 12956006 12432342 11941201 11482585 11054432 10653142 10276197 9923327 9594996
58805 9594996 9290657 9008856 8748100 8506878 8283359 8075885 7883750 7707153 7546414
58796 7546414 7401255 7270541 7152751 7047095 6954155 6874966 6809548 6756971 6716822 6689715
58786 6689715 6676188 6675875 6687962 6711743 6746591 6792294 6849790 6920606 7005150 7102442 7211898
58775 7211898 7334348 7470686 7620633 7783789 7961023 8153853 8363119 8589265 8833274
58766 8833274 9096151 9377961 9678504 9998777 10340840 10706523 11097359 11515581 11964063
58757 11964063 12445062 12959993 13510725 14100286 14731872 15407599 16128451 16894937 17707228
58748 17707228 18564612 19464673 20402530 21370372 22357249 23349023 24328519 25276116 26170348
58739 26170348 26987702 27702269 28287275 28718783 28979127 29057944 28951839 28664669 28208029
58730 28208029 27600078 26862751 26019366 25093698 24109681 23090636 22057871 21029165 20017919
58721 20017919 19033575 18082974 17171264 16301816 15476132 14694566 13957064 13262922 12610208
58712 12610208 11996081 11417845 10873469 10361238 9879414 9426533 9001695 8604029 8231662
58703 8231662 7881767 7552290 7243374 6956087 6689448 6439820 6203929 5981410 5773317
58694 5773317 5579220 5397501 5227917 5071716 4929037 4797928 4676351 4563507 4458804
58685 4458804 4361283 4270788 4187954 4112048 4040405 3971209 3905448 3844753 3788577 3734976 3682938
58674 3682938 3632152 3581345 3528871 3474711 3420215 3365879 3310849 3254678 3198219 3142436 3087327
58663 3087327 3032349 2977210 2921963 2866647 2810973 2754308 2696356 2637980 2580654 2524862 2469997
58652 2469997 2416167 2364726 2316106 2268518 2220216 2171959 2125663 2081604 2038922 1998214 1961255
58641 1961255 1928100 1896557 1865149 1834922 1807676 1783636 1761528 1739912 1717876 1695289 1672949
58630 1672949 1651842 1632098 1613372 1596215 1582018 1571366 1563450 1557404 1553167 1550658 1549167 1548287 1548643
58617 1548643 1550875 1554337 1557404 1558913 1559034 1559035 1560307 1563198 1566575 1568915 1569863 1570325 1571123 1572306 1574013 1577201
58601 1577201 1582833 1590565 1598642 1605045 1608691 1609766 1609204 1607939 1606708 1606384 1607871 1611352 1616186 1622198
58587 1622198 1630692 1643434 1660757 1681418 1704199 1728925 1755893 1785160 1816742 1851008 1888481
58576 1888481 1929499 1974183 2022494 2074113 2128528 2185478 2245478 2309874 2380084 2456405 2537804
58565 2537804 2623501 2714668 2813726 2921964 3038991 3164961 3302041 3452783 3618027 3797442
58555 3797442 3991215 4199942 4423592 4662058 4916253 5186959 5472385 5767935 6068340
58546 6068340 6368766 6663606 6945363 7205142 7433450 7620311 7755883 7832347 7845908 7797424
58536 7797424 7691659 7535866 7338513 7108767 6856303 6590302 6317972 6044551 5774907
58527 5774907 5513967 5264911 5028279 4804327 4595423 4404547 4231901 4074762 3930684
58518 3930684 3799378 3681258 3575478 3479921 3392308 3311032 3235511 3165815 3101579 3041663 2985509
58507 2985509 2934103 2888510 2847909 2810304 2774663 2740909 2708058 2674111 2637974 2600002 2560264
58496 2560264 2517571 2470755 2419930 2366144 2310773 2255652 2202775 2153219 2106887 2063422 2022710
58485 2022710 1984406 1947931 1913354 1881583 1853217 1827574 1803113 1778625 1754051 1730291 1708016
58474 1708016 1686530 1664423 1641480 1618929 1597314 1575439 1552517 1530104 1510327 1493043 1476415
58463 1476415 1459602 1443095 1426868 1410088 1392572 1374972 1357678 1340967 1325834 1312941 1301138
58452 1301138 1288841 1276605 1266396 1258591 1251925 1246263 1242926 1241890 1241121 1239512 1238306 1238670 1239833 1240771
58438 1240771 1242006 1244492 1248111 1252357 1257355 1263247 1269711 1276946 1286079 1297739 1311088 1324850 1338402
58425 1338402 1351397 1363265 1373585 1382172 1388710 1393164 1396401 1399141 1400461 1398844 1394494 1388890 1382178
58412 1382178 1373184 1362154 1351092 1340733 1329401 1315777 1300736 1285475 1269897 1254034 1239195
58401 1239195 1226264 1214370 1202524 1191293 1181797 1174316 1168790 1165358 1163568 1162482 1162297 1164303 1168486
58388 1168486 1172873 1176104 1178884 1182055 1185216 1188326 1192555 1198250 1204057 1209500 1216442 1226291 1237741 1249104
58374 1249104 1261029 1274722 1289103 1302020 1313104 1323220 1332147 1338912 1343620 1347001 1348910 1349144 1348947
58361 1348947 1349822 1351488 1352807 1354016 1356245 1359346 1362059 1364039 1366275 1369828 1375372 1383327 1393091 1402887
58347 1402887 1411793 1421183 1432579 1444820 1455198 1462961 1469877 1477446 1485164 1491669 1496192 1498659 1499308
58334 1499308 1498471 1496298 1492990 1489630 1488032 1488998 1491415 1493784 1495828 1497756 1498863 1497954 1494449 1487971 1477494
58319 1477494 1462088 1442315 1420297 1398763 1380390 1367124 1359354 1356192 1356827 1360934 1367856 1376687 1387373
58306 1387373 1400263 1414391 1427932 1440816 1455045 1471728 1489584 1507068 1524033 1540581 1556432
58295 1556432 1572436 1590470 1610627 1630571 1648823 1666418 1684082 1700309 1713894 1725824 1736767
58284 1736767 1745146 1749942 1753059 1756452 1758975 1758729 1756815 1756151 1758081 1762439 1769444 1779072 1790037 1801680
58270 1801680 1815520 1832842 1852331 1872205 1892895 1915449 1939318 1964172 1991842 2023600 2057351
58259 2057351 2090497 2123866 2159761 2197707 2235342 2272191 2309380 2346772 2383417 2419778 2456588
58248 2456588 2492596 2526136 2557681 2588106 2616046 2640114 2662368 2686302 2712587 2739823 2768148
58237 2768148 2798859 2831793 2866353 2903900 2945875 2990958 3037411 3086770 3141519 3200423 3259978
58226 3259978 3319435 3380760 3444813 3511342 3581613 3657059 3736170 3816491 3898797 3985647 4077014
58215 4077014 4171304 4269440 4373671 4483167 4594999 4708633 4825478 4945080 5065983 5189408
58205 5189408 5317759 5450451 5585393 5723498 5867512 6017938 6174839 6342046 6524308
58196 6524308 6721485 6930820 7153519 7393325 7649777 7919244 8202194 8503404 8825273
58187 8825273 9166905 9529461 9916266 10327699 10762044 11221486 11711465 12234342 12789651
58178 12789651 13379953 14009841 14679286 15384628 16126070 16907574 17729623 18589179 19486942
58169 19486942 20428204 21417429 22459586 23565914 24749467 26014220 27356324 28776049
58161 28776049 30280465 31875178 33562982 35350655 37247158 39254596 41370966 43602793
58153 43602793 45965787 48473778 51138368 53980064 57028922 60315013 63870895 67742433
58145 67742433 71982504 76634151 81736917 87353391 93577776 100523008 108321441 117140617
58137 117140617 127179945 138653746 151798639 166885393 184177377 203869344 226118523
58130 226118523 251169748 279412361 311229735 346640513 384772558 423272618 458051832
58123 458051832 483969256 496553365 493856536 477154756 450065722 416900792 381387990
58116 381387990 346198560 312990298 282607789 255326579 231101595 209731327 190918416
58109 190918416 174314630 159596622 146515065 134879387 124530777 115349507 107264314
58102 107264314 100228118 94189488 89096406 84909858 81591352 79082351 77316173 76255518
58094 76255518 75911751 76328113 77540595 79513723 82035367 84614353 86503193 86927449
58086 86927449 85422586 82038906 77259962 71723967 65976936 60387012 55169476 50424997
58078 50424997 46169228 42372748 38996618 35997715 33320992 30910605 28729894 26759380
58070 26759380 24978639 23362576 21892821 20559123 19348521 18243308 17229775 16299029
58062 16299029 15438553 14632248 13870156 13150491 12471574 11829383 11223199 10655393 10124228
58053 10124228 9623872 9152534 8713602 8307377 7928001 7569736 7230089 6905684 6591317
58044 6591317 6284986 5988775 5703644 5428365 5164332 4916035 4685558 4471374 4273214
58035 4273214 4093093 3930593 3782016 3645097 3519970 3404930 3296093 3192008 3093964 3001263
58025 3001263 2910966 2822664 2738394 2657335 2576012 2494543 2417109 2344946 2274380 2203477 2135228
58014 2135228 2072114 2012620 1955466 1902503 1854757 1809884 1766164 1725140 1687905 1652652 1618303
58003 1618303 1586822 1559386 1533836 1508506 1485226 1465731 1448125 1429639 1410337 1391579 1373318
57992 1373318 1355324 1338867 1324858 1312253 1300213 1289839 1281996 1275315 1267954 1259512 1250055 1239388
57980 1239388 1228557 1219808 1213797 1208908 1204160 1200297 1197122 1192773 1187013 1182213 1179411 1176258 1170754 1164348
57966 1164348 1159210 1154924 1150085 1144949 1140272 1135443 1129930 1124888 1121314 1118128 1113925 1109157 1104907 1100962
57952 1100962 1096743 1092708 1089245 1085427 1080294 1074218 1067902 1061315 1054642 1048938 1044796 1041640 1038987 1036991
57938 1036991 1035265 1032900 1030043 1027479 1024185 1017581 1006719 992790 975874 954052 926750 896206
57926 896206 864518 832230 801184 775510 757625 745895 738192 735060 737213 742664 749057 756571 765795
57913 765795 774846 781495 786576 792488 799646 806871 813872 820701 825916 827921 827473 826718 826543 826624 826960 827353
57897 827353 826447 823358 819342 815917 812372 806946 799449 790834 781373 771286 762164 755693 751732 749361
57883 749361 748732 750164 752685 755529 759765 766185 772853 777294 780106 783614 787632 789425 787678 783825
57869 783825 779294 773768 766416 756867 744768 730311 715383 702400 691723 681736 671570 662139 654456
57856 654456 648621 644707 643068 643244 643869 644211 644955 647177 651287 657096 664168 672034 680496 689542 698629
57841 698629 706721 713685 720876 729472 738806 747120 753304 757223 759380 761225 764667 769946 774688 776275
57827 776275 774418 770506 765552 760176 755520 752401 750067 747123 743015 737528 729975 720503 711190 704016
57813 704016 698474 692951 687656 684159 682642 681760 681084 681637 683997 687629 692172 697825 704352 711144 718239
57798 718239 725978 733803 740674 746496 751774 756091 758387 758632 757850 756606 754685 752043 748806 744631 739322
57783 739322 733706 728598 723361 716965 709993 703959 698988 693923 688460 683350 678515 672778 665712 658257
57769 658257 651351 645150 639554 634097 627465 618623 608443 598827 590301 581813 572589 562520 551046
57756 551046 537743 524161 513099 505511 499790 494487 489971 486759 483886 480111 475680 471945 469871
57743 469871 469364 469449 468779 466618 463606 461135 460180 461217 464659 470366 477217 484356 492387 502101 512487
57728 512487 521523 528605 534739 540647 546361 552469 559995 568754 577208 583987 588473 590315 589980 589372 590051
57713 590051 590936 589533 585267 579771 574138 568080 561785 556249 551365 545981 540370 536537 535404 535799 536903
57698 536903 539501 543814 548187 551302 553998 557588 561776 565490 568675 572152 576718 583093 591628 601307
57684 601307 610196 617500 624089 630602 636528 641766 647523 654811 663332 672488 682137 691773 700590 709105
57670 709105 719181 731560 744826 757588 770127 783215 797123 812761 831824 854345 877744
57659 877744 899772 921121 943760 968184 993854 1021005 1050264 1081359 1113646 1147134 1181790
57648 1181790 1216902 1252344 1289360 1328791 1369731 1411487 1455764 1505148 1560152 1619412 1682167
57637 1682167 1748945 1820109 1895172 1973425 2054405 2138259 2226462 2321371 2424190 2534350 2651979
57626 2651979 2779902 2921763 3078974 3250915 3437394 3639431 3858173 4094301 4347872
57617 4347872 4617396 4899472 5190201 5485923 5781196 6067147 6333701 6572943 6778830
57608 6778830 6944827 7064497 7134622 7155484 7127189 7047061 6911579 6720657 6480489 6203424
57598 6203424 5905077 5600197 5300128 5013100 4745082 4499118 4274992 4071442 3888569
57589 3888569 3726972 3585175 3459679 3347547 3247648 3159631 3083166 3018191 2964533 2921113
57579 2921113 2886698 2861405 2846197 2840833 2843689 2853914 2872443 2900379 2937348 2982007 3033528 3092286
57567 3092286 3159778 3238175 3329334 3433792 3550853 3679632 3819817 3971832 4136717 4315354
57557 4315354 4506898 4708097 4914643 5122719 5328395 5525763 5706504 5861140 5980380
57548 5980380 6056212 6083326 6060016 5987552 5869432 5711958 5524377 5316340 5094781 4864136
57538 4864136 4629205 4396151 4170202 3953719 3747156 3551034 3366279 3193370 3032036
57529 3032036 2881743 2742004 2612204 2491479 2379058 2274764 2178776 2090607 2008757 1932173
57519 1932173 1861707 1798946 1743601 1693427 1646947 1604676 1567045 1532941 1501472 1473630 1450589
57508 1450589 1431403 1413880 1396864 1380340 1364393 1349584 1337318 1328183 1320854 1314360 1310243 1310422
57496 1310422 1314013 1318770 1324880 1334376 1347088 1360307 1372956 1387192 1404898 1425146 1446495 1469742
57484 1469742 1496757 1528073 1563023 1601142 1642147 1685506 1731260 1780657 1835121 1895124 1960546
57473 1960546 2031355 2107442 2188725 2276075 2371366 2475978 2589864 2712481 2843804 2983963
57463 2983963 3132515 3288473 3450170 3614586 3777467 3934479 4081518 4213514 4323786
57454 4323786 4405412 4453164 4464379 4439053 4379705 4290684 4177021 4043898 3896721 3740791
57444 3740791 3580767 3420888 3265401 3117803 2979681 2850962 2731188 2619923 2516585
57435 2516585 2421272 2335464 2260469 2195229 2137109 2084925 2039725 2002441 1972327 1948089 1929091
57424 1929091 1914933 1905263 1900583 1901919 1908995 1919890 1933196 1949644 1971157 1999303 2035004 2078506
57412 2078506 2128950 2185011 2246562 2314934 2391333 2476095 2569684 2673026 2786288 2908497 3038712
57401 3038712 3176253 3319233 3464183 3607517 3745806 3873913 3984539 4070701 4127543 4151308
57391 4151308 4138578 4088280 4003292 3888816 3750109 3592753 3423414 3248184 3070663 2893154
57381 2893154 2719045 2552397 2395478 2248221 2110031 1980909 1860841 1749290 1645687
57372 1645687 1549869 1461920 1381846 1309220 1242845 1181080 1122859 1068127 1017267 970610 928430
57361 928430 890478 855223 820581 785921 752682 722698 696628 674034 653824 634445 614924
57350 614924 596105 579459 564442 548816 532215 517281 505949 496567 486569 476381 468403 463003
57338 463003 457912 451299 443466 435377 427273 419180 411571 405011 399760 395806 392812 390143 387499 385363
57324 385363 384386 384630 385599 386457 385987 383317 379348 376563 376687 379250 382917 387225 392269 397837 403921 411142
57308 411142 419674 428681 437765 447792 458978 469282 476315 480132 482617 484935 487268 490416 495555
57295 495555 502499 509958 517700 526933 538304 550848 563271 575110 586275 596589 606329 616544
57283 616544 628245 641581 655926 670424 684400 697564 709978 721857 733613 745995 759602
57272 759602 774170 789051 804452 821342 839960 859476 879439 900325 922206 944230 966144
57261 966144 988854 1012474 1035234 1055598 1074324 1092969 1111423 1128397 1143600 1157990 1172501
57250 1172501 1187757 1204259 1221623 1238390 1253928 1269751 1287640 1307231 1326905 1346265 1366199
57239 1366199 1387134 1408871 1431731 1456363 1482739 1510641 1540645 1573310 1607920 1643392 1679957
57228 1679957 1718622 1759601 1802645 1848268 1897059 1948234 2000388 2053291 2107511 2162690 2217527
57217 2217527 2271027 2322487 2370949 2416131 2459221 2501092 2540305 2574414 2602747 2626336 2645870
57206 2645870 2661500 2674028 2684355 2692120 2696725 2699367 2702295 2706285 2710347 2713395 2714687 2713585 2711023
57193 2711023 2710716 2716784 2730448 2750828 2778113 2813572 2857047 2907131 2963623 3027216 3096738 3169179
57181 3169179 3242710 3317375 3392696 3466908 3538673 3607176 3670452 3726442 3776429 3825021 3875899
57170 3875899 3929553 3985737 4045775 4111389 4183081 4260479 4342732 4428024 4514366 4601309 4689308
57159 4689308 4777356 4863339 4946952 5029943 5112827 5193539 5270086 5342581 5412001 5479113 5545546
57148 5545546 5613852 5685212 5758541 5832843 5909030 5988556 6071564 6157239 6245003 6334948 6428101
57137 6428101 6526296 6630562 6739612 6851096 6963774 7076901 7188448 7296519 7402274 7508762
57127 7508762 7616755 7724337 7830806 7938208 8048458 8161569 8277187 8395038 8512651
57118 8512651 8624956 8727437 8818177 8896564 8962336 9016713 9062411 9101627 9135415 9164920 9191089
57107 9191089 9213140 9229820 9242493 9254753 9268971 9285572 9305490 9330227 9359299 9390460 9422759
57096 9422759 9456566 9490843 9523978 9557698 9596669 9643481 9697003 9755666 9818445 9882066 9941234
57085 9941234 9992756 10036248 10070386 10092302 10101161 10098261 10082879 10052097 10005271 9944262 9868604 9775179
57073 9775179 9663228 9534318 9386071 9211231 9004280 8763469 8484837 8160318 7784151
57064 7784151 7355399 6871618 6325741 5711913 5028568 4272621 3435928 2510243 1490047
57055 1490047 367767 -868077 -2227537 -3718372 -5353256 -7151309 -9130217 -11304380
57047 -11304380 -13693572 -16325160 -19224665 -22413418 -25919657 -29782563 -34041281 -38730521
57039 -38730521 -43891939 -49578449 -55841570 -62726789 -70287036 -78585406 -87675259 -97590430
57031 -97590430 -108358411 -119995729 -132468858 -145673960 -159466377 -173678994 -188076911
57024 -188076911 -202301558 -215863466 -228132820 -238290028 -245380598 -248639167 -247934138
57017 -247934138 -243919501 -237694876 -230256776 -222178432 -213644432 -204643059 -195122599 -185078157
57009 -185078157 -174583871 -163759289 -152699736 -141450729 -130051670 -118585934 -107185827
57002 -107185827 -96012984 -85245160 -75058959 -65597439 -56946424 -49138845 -42169883
56995 -42169883 -36003504 -30578740 -25825013 -21673604 -18055653 -14899710 -12139172 -9718772
56987 -9718772 -7591031 -5712420 -4046906 -2567927 -1252872 -79748 968297 1900743 2725765
56978 2725765 3455164 4101315 4673948 5182341 5636093 6041125 6399154 6713517 6991629
56969 6991629 7239797 7460132 7654976 7829961 7989855 8135040 8264428 8378138 8475052 8551782
56959 8551782 8607041 8643764 8664326 8666722 8647962 8608176 8548740 8468977 8367232 8243002 8096244
56948 8096244 7927305 7739786 7541366 7339941 7140536 6946197 6758005 6572191 6380846
56939 6380846 6178869 5969200 5760512 5562318 5382466 5223511 5076214 4918323 4724560
56930 4724560 4480147 4186514 3858010 3515182 3177617 2858063 2561660 2290275 2045425
56921 2045425 1826429 1629034 1448560 1282915 1130970 990202 858238 735126 621948
56912 621948 518680 425320 343505 274597 217117 168045 126011 91652 65787 48756 40648
56901 40648 40596 46414 56188 69748 87821 110470 136687 164126 188573 205361 212532 211553 204485
56888 204485 192150 175775 158134 141419 125558 110149 96494 86130 78753 73348 70392 71391
56876 71391 77009 86870 100375 116645 134650 154337 176503 200487 222958 239853 248523 247634 236957
56863 236957 218631 196986 175447 154525 133858 114738 99215 87959 80424 76079 74223 73729
56851 73729 74277 76745 81226 85962 89575 93041 97916 103780 109051 113428 117960 123376 129542 135847 141126
56836 141126 144205 145496 146886 149104 150701 150757 150775 152265 154202 155037 155824 158959 164647 170761 175392 177430
56820 177430 175417 168462 158340 148735 142156 138830 138153 139669 143044 148752 158435 172973 190656 209109
56806 209109 228643 251722 279224 309446 341150 375487 413962 455801 498110 537498 570807
56795 570807 595246 609031 612000 605568 592232 574873 555982 537414 520908 508215 500285 496900
56783 496900 497689 503017 513538 529687 552178 582059 619542 663624 713522 769282 830001 892587
56771 892587 953119 1007861 1051577 1076942 1078724 1058500 1023405 980546 934166 887241 842898 803627
56759 803627 770859 745629 728121 716549 708382 703167 702796 708821 720959 738402 760963 788595
56747 788595 821256 859311 901959 944277 977500 993833 990738 970478 937125 894949 848207 800364
56735 800364 753259 707857 665693 628939 599048 575936 558618 546319 538688 535124 534447 535857
56723 535857 540080 548755 562401 579568 598055 615833 630263 637770 635691 623973 604261 578266
56711 578266 548069 516791 486987 458757 431093 404742 381986 363727 348516 334611 321533
56700 321533 309516 299033 290961 285669 281609 276475 270081 264579 261258 258716 255039 250395 246429 244004
56686 244004 242484 240597 237312 232449 226948 222070 218102 214479 211096 208471 206468 204130 201212 198733
56672 198733 197385 196392 194660 192184 189669 187464 185390 183043 179885 175770 171638 168798 167255 165721
56658 165721 163552 161510 160093 158383 155433 151765 148564 146208 144465 143348 142798 142070 140421 138057 135717
56643 135717 133771 132325 131696 132074 133063 134122 135052 135682 135631 134901 134102 133573 132896 131822 131003 131203 132461
56626 132461 134665 138167 143005 148215 152878 157373 162636 168488 173594 176802 177943 177658 177219 178047 180487
56611 180487 183282 184993 185614 186099 186712 186848 186324 185884 186305 187620 189245 190349 190262 189060 187537 186130
56595 186130 184253 181348 178066 175410 173037 169620 164930 160436 157555 156213 155469 154735 153999 153547 153946
56580 153946 155752 158783 162011 164423 165692 165980 165729 165892 167669 171415 176016 179835 182143 183441 184640
56565 184640 186232 188059 189603 190560 191247 192344 194131 196147 197655 198272 198166 197946 198483 200406 203528 206923
56549 206923 209763 211915 213684 215385 217419 220296 223951 227180 228428 227480 225992 225971 227827 230215 231798
56534 231798 232694 233983 236076 238138 239206 239376 239599 240639 242667 245629 249332 253078 255832 257134 257601
56519 257601 258234 259406 260715 261600 261828 261625 261704 262919 265480 268537 271019 272832 274743 277126 279585 282129
56503 282129 285888 291766 298727 304483 308064 310923 315121 321052 327487 333329 338495 343225 347424 351053
56489 351053 354658 358990 364216 369750 374712 378323 380110 380191 379408 378796 378688 378586 377924 376615 374643 371717
56473 371717 367960 364621 363125 363247 363103 361333 358571 356091 353796 350468 345578 339758 333664 327547 322031
56458 322031 318130 316032 314810 313822 313590 314643 316202 316747 315423 312352 308198 304110 301400 300316 299479
56443 299479 297472 294697 292748 292257 292449 292712 293298 294161 294286 292919 290832 289689 290462 292831 295718 298055
56427 298055 299396 300152 301066 302255 303068 303088 302785 302848 303327 303916 304762 306351 308617 310742 312062 312877 314184
56410 314184 316739 320432 324488 328159 331331 334551 338450 343120 348124 353191 358765 365570 373580 381759
56396 381759 389010 395010 399763 402833 403868 403861 404801 407581 410931 413062 413798 414503 416288 419033 421891 424051
56380 424051 425138 425437 425598 425660 424678 421950 418319 415456 413996 413154 411974 409950 406507 401068 394129 387365
56364 387365 382142 378537 376071 374445 372922 370037 365108 359674 356245 355502 355533 354036 350574 346369 342558
56349 342558 339355 336763 335258 335263 336220 336869 336617 336154 336373 337055 337202 336488 335758 336019 337416 339289 340748
56332 340748 341105 340301 339097 338377 338012 336932 334672 332419 331986 333908 337013 339698 341260 342049 342855 344325
56316 344325 346646 349446 352104 354430 357042 360760 365404 369547 371950 373157 375029 378557 382759 386126
56302 386126 388528 391115 394856 399919 406035 412505 418091 421959 424786 427988 431799 435163 437708 440624
56288 440624 444974 450243 455356 460279 465547 470866 475485 479771 485179 492435 500572 508088 514401 519953
56274 519953 525426 531203 537158 542730 547505 551924 556977 562898 568632 573095 576782 581600 589088 599202
56260 599202 610822 622957 635179 647289 659126 670782 682752 695658 709721 724408 738699
56249 738699 751994 764811 778186 792089 804906 815079 822962 830265 837678 844039 848281 851335 855286
56236 855286 861065 867828 874488 881132 888773 898290 909820 922827 936477 950151 963883 978400 994750
56223 994750 1013729 1035409 1059085 1083830 1109266 1135834 1164482 1196279 1232131 1272319 1316189
56212 1316189 1362751 1411744 1463738 1519139 1577701 1639288 1704653 1775205 1852465 1937806 2031987
56201 2031987 2134599 2244662 2362209 2488533 2624543 2769701 2923140 3084720 3254069
56192 3254069 3429549 3609450 3793384 3980890 4168832 4351599 4524045 4683210 4827275
56183 4827275 4954118 5061127 5145572 5205134 5239193 5249740 5240021 5212037 5166312 5104155 5028891
56172 5028891 4944360 4853193 4757105 4657806 4556631 4453805 4348964 4242262 4134417 4025767
56162 4025767 3915659 3802795 3686195 3566119 3444133 3322006 3200421 3079027 2957695
56153 2957695 2837325 2719424 2605280 2495691 2391206 2292478 2200312 2115098 2036072 1961688
56143 1961688 1891071 1824687 1763217 1706518 1654383 1607488 1566385 1529977 1496307 1464802 1436525
56132 1436525 1412100 1390545 1370409 1351101 1332646 1314976 1298033 1282121 1267836 1255788 1246307
56121 1246307 1239080 1233385 1229238 1227888 1230279 1235294 1240592 1245194 1250377 1257997 1268794 1282414 1298103
56108 1298103 1315091 1332942 1351787 1371924 1393317 1415958 1440245 1466220 1492725 1518104 1541550
56097 1541550 1563176 1583385 1603083 1623854 1646640 1670714 1695037 1720047 1746772 1774968 1803972
56086 1803972 1834981 1870447 1911168 1955719 2002718 2051788 2102403 2154010 2207963 2267573 2335818
56075 2335818 2414715 2507154 2616961 2745934 2892254 3052473 3223201 3399912 3576073 3745220
56065 3745220 3903328 4048675 4180931 4301379 4412502 4515587 4608813 4688046 4748734 4786972
56055 4786972 4800419 4789394 4756579 4705413 4639426 4562494 4477396 4383296 4276330 4153627 4015790
56044 4015790 3865632 3706792 3544314 3384143 3230461 3085043 2950074 2829348 2724912
56035 2724912 2634415 2553894 2482021 2419767 2367031 2321780 2282072 2247106 2216333 2188837 2163630
56024 2163630 2139949 2117663 2097894 2082528 2072379 2066450 2063366 2062684 2064348 2067945 2073175 2080192 2088992
56011 2088992 2099271 2111061 2124423 2138595 2152936 2168787 2188430 2211737 2235791 2258519 2280878
56000 2280878 2304817 2331172 2360458 2393463 2429609 2466465 2502388 2538258 2575546 2614245 2653993
55989 2653993 2695699 2740790 2789855 2842779 2898977 2957035 3015747 3075874 3139092 3205021 3271618
55978 3271618 3338848 3409202 3483870 3561214 3640057 3721477 3806131 3892857 3981599 4074909 4174802
55967 4174802 4280747 4392319 4510907 4636936 4768347 4903987 5045918 5196327 5354840
55958 5354840 5521092 5697439 5886848 6090138 6306811 6536199 6776519 7025948 7286154
55949 7286154 7561559 7853703 8160015 8479793 8817176 9176214 9557491 9962108 10394397
55940 10394397 10857710 11351867 11877576 12438499 13035584 13664387 14321829 15010815 15734347
55931 15734347 16490435 17277534 18100154 18964581 19874263 20834360 21855220 22945366 24105690
55922 24105690 25336010 26642271 28031733 29506692 31068974 32724751 34478482 36328577
55914 36328577 38276727 40336061 42523287 44849977 47330073 49989305 52858813 55967097
55906 55967097 59347652 63046100 67108520 71571387 76477455 81898436 87935722 94712093
55898 94712093 102377680 111114376 121120474 132602312 145793201 160959534 178364888
55891 178364888 198246094 220846405 246433391 275207651 307125402 341675377 377529451
55884 377529451 412087415 441363009 460799726 466929861 458859613 438513275 409574186
55877 409574186 376021770 341143921 307216409 275577214 246849145 221200936 198557011
55870 198557011 178701461 161325665 146090817 132689575 120857854 110356883 100978247
55863 100978247 92565783 85012536 78235070 72159355 66720428 61854791 57491104 53558225
55855 53558225 49999828 46772115 43831990 41138364 38661747 36381950 34277777 32326861
55847 32326861 30512796 28823974 27247336 25770421 24387163 23094639 21886121 20753351
55839 20753351 19692718 18702445 17775933 16904096 16082306 15309369 14581983 13895834 13249946
55830 13249946 12644392 12075661 11539164 11033741 10558507 10108007 9676146 9262546 8869360
55821 8869360 8494132 8131853 7782229 7448576 7130591 6824255 6528548 6246708 5980761
55812 5980761 5729659 5492844 5271008 5062904 4865179 4675569 4492986 4315053 4139218
55803 4139218 3966075 3798225 3636287 3479391 3329071 3189108 3061464 2945329 2839969
55794 2839969 2745739 2662522 2589637 2526672 2471859 2420360 2366887 2309596 2249466 2187273 2123780
55783 2123780 2061406 2002408 1946226 1891463 1839469 1792952 1751967 1714445 1679923 1649680 1623751
55772 1623751 1600775 1580210 1561825 1543680 1523563 1501844 1480028 1457235 1431198 1402079 1371993
55761 1371993 1341143 1307846 1272340 1237304 1204333 1172871 1142842 1115435 1090920 1068476 1048644
55750 1048644 1033406 1023234 1016272 1010702 1005888 1001146 995821 990784 987545 985657 983232 980067 977800
55737 977800 976693 974830 971009 966067 960631 953794 944872 934505 923191 910477 896327 881698 867035
55724 867035 851752 835860 820725 807510 796030 785670 776345 768163 761049 754822 748696 740866 729753
55711 729753 715633 700006 683711 666883 650222 634771 620690 607767 596865 589232 584443 580403
55699 580403 575267 568145 558574 546992 535206 524476 513319 498909 480310 458511 433825 405544
55687 405544 374194 342022 311127 282993 259606 242569 230846 221696 214349 210597 211223 214065 216648
55674 216648 218842 221868 226117 230929 235325 238289 239506 240222 242137 245047 246923 246581 244795 242439 239228
55659 239228 234920 230268 226047 222376 219482 217854 217147 216217 214756 213636 213437 214073 216171 220945 227958
55644 227958 234665 239156 241966 244333 246162 246809 246522 245775 244150 241299 238452 237727 240011 244153 248008
55629 248008 250052 250499 251202 253997 259012 265107 271644 278671 285434 290307 292880 294889 298194 302575 306225
55614 306225 307646 306358 302384 296031 288198 280546 275100 273103 273716 274336 273132 271032 270343 271877 274572
55599 274572 277508 280628 283471 284907 284691 284035 284217 285692 288693 293276 298336 301948 303283 303076 301819
55584 301819 298864 293984 288474 283643 278985 272757 263880 252868 241409 231359 223511 217118 211114
55571 211114 205671 201696 199104 196744 193890 190391 185542 178583 170682 164602 161670 160450 158963 156710
55557 156710 153893 150319 146127 142287 139295 136410 132979 129386 125878 121769 116786 112137 109271 108535
55543 108535 109735 112687 116239 118282 118013 117006 116665 115949 113293 109701 107871 108714 110679 112287 113597
55528 113597 115094 116781 118808 121719 125467 129008 131326 132372 132818 133418 134776 137166 140275 143371 145917
55513 145917 148041 150510 154272 159783 166671 174314 182723 192444 203615 215748 228416 241311 253354
55500 253354 262612 267676 268538 265857 260075 251654 241340 229585 216365 202097 187957 174733 162102
55487 162102 149795 138775 130387 124794 121021 118102 115465 112678 109674 106958 104890 103088 101223 100015
55473 100015 100571 102834 105486 107370 108389 108964 109279 109307 109158 109048 109104 109423 110340 112434 116046 120719 125377
55456 125377 129225 132174 134247 135100 134608 133396 132156 130876 129453 128469 128232 127444 124136 117917 110151
55441 110151 102006 93669 85518 78604 73545 70038 67639 65853 63410 59053 53430 48683 45647 42971
55427 42971 39544 36122 33744 32213 31192 31277 32730 34476 35618 36610 37651 37277 34245 29740 26019
55412 26019 23677 21916 20685 20641 21352 21322 19850 17590 15399 13828 13424 14206 14988 14472 12977 12031 12370
55395 12370 13329 14004 13849 12350 9303 5563 2627 1421 2085 4515 8136 11569 13665 14640 15194 14849
55379 14849 12547 8793 5760 5006 6168 8131 10310 12407 13901 14478 14429 14273 14396 15148 16668 18381
55363 18381 19222 18608 16983 15427 14950 15874 17376 17893 16594 14421 13166 13637 15211 16967 18670 20712
55347 20712 23517 26903 29818 31135 31036 30951 31709 32481 32322 31861 32343 33602 34286 33763 32599 31398 30428
55330 30428 30292 31680 34295 36997 39123 40720 41608 41350 40254 39231 38393 36847 34241 31595 30191
55315 30191 30361 31597 32985 33267 31411 27722 23753 20791 18926 17774 17260 17257 17241 16945 16868 17480 18257 18071
55297 18071 16526 14605 13952 15481 18455 20942 21441 20100 18211 16810 16190 16444 17668 19498 21022
55282 21022 21453 20669 19136 17622 16835 16842 16933 16445 15568 14803 13895 12164 9943 8783 9810 12462 15204
55265 15204 17061 18004 18199 17457 15609 13211 11561 11688 13341 15304 16846 18417 20620 22977 24303
55250 24303 24083 23026 22362 22939 24691 26587 27264 26097 23556 20494 17536 15236 14008 13472 12683 11710
55234 11710 12158 15127 19234 21728 21313 19004 16677 15770 17078 20505 24819 28378 30190 29889 27334
55219 27334 23275 19865 19118 20705 22265 21981 20044 17720 16053 15527 15998 16689 16945 16951 17096 16986 16115
55202 16115 15154 15260 16146 16279 15288 14758 16024 18204 19113 17451 13628 9177 5812 4440 4590 5091 5444
55185 5444 6067 7252 8490 9010 8553 7662 7561 9277 12194 14111 13851 13348 15647 20966 26157 28262
55169 28262 27165 24559 21878 19912 19123 19331 19708 19638 19073 17996 16450 15160 15029 15789 16191 15724 15054
55152 15054 14685 14618 15536 18549 23062 26546 27407 26777 26527 26940 27572 29077 32455 37102 40995 42534 41311
55135 41311 37753 33101 29245 27332 26637 25601 23750 21973 21277 22015 23992 26541 28627 29369 28493 26341
55119 26341 23945 22961 24419 27239 29094 29231 29229 30344 31470 30750 28086 24828 22044 20418 20955 24070
55103 24070 28351 31628 33092 33387 33103 32407 31662 31022 29676 26901 23779 22463 23533 25197 25375 23730
55087 23730 21589 20697 22010 24795 26908 26891 25754 25736 27383 29088 29750 30496 32929 36508 38729 37792
55071 37792 34481 31390 30559 31950 34134 36191 38466 41397 44340 46209 46843 47004 47243 47512 47846 48683
55055 48683 50386 52805 55274 56751 56349 54360 52476 52246 53339 54003 53197 51620 50590 50566 50957 50972 50388
55038 50388 49693 49438 49427 48829 47325 45706 45013 45656 47768 51612 56665 60911 62401 61497 60509 61053 62756
55021 62756 64652 66586 68738 70771 72389 74256 77515 82241 86869 89389 89120 87186 85104 83092 80250
55006 80250 76443 73114 71622 71544 71558 71560 72689 75309 78159 79840 80324 80549 81155 82004 82465 81871 80013 77395
54988 77395 74738 72304 70108 68700 68935 70724 72579 72868 71313 69038 67378 66773 66687 66459 66269 67093
54972 67093 69561 73080 76357 78495 79283 78885 77853 77132 77269 77698 77420 76289 75002 73917 72668 71040
54956 71040 69600 69314 70984 74941 80602 86311 90414 92682 94148 95545 96527 96566 95867 95144 94962 95478
54940 95478 96261 96298 94783 92126 89689 88413 88169 88379 88547 88051 86318 83593 81049 79765 79954 81154
54924 81154 82570 83331 83312 83807 86314 90284 93171 93373 92163 91893 93139 94590 95086 94606 93598 92537
54908 92537 92182 93226 95424 97706 99342 100483 101547 102763 104531 107589 112263 117781 122771 126410 128945
54893 128945 131284 134398 139175 146397 156368 168312 180473 191242 200401 209242 219393 231431 244378
54880 244378 256400 266243 274271 281903 289708 296210 298925 296442 289162 278342 265091 250324 234929
54867 234929 219697 205448 193212 183773 176849 171202 165675 159778 153404 146787 140931 137187 135887
54854 135887 135906 136026 136236 137256 139309 141957 144868 148192 152348 157677 164169 171339 178750 186752 196199
54839 196199 207259 219142 231251 243663 255809 265582 270861 271577 269269 264894 258117 248703 237501
54826 237501 225721 213952 202267 190819 180026 170448 162497 155901 149524 142239 134094 126228 119678
54813 119678 114708 111231 109127 107933 106820 105188 102974 100298 97351 94753 93427 93731 95107 96813
54799 96813 98462 99606 99571 98378 97336 97891 99971 102088 102988 102610 101568 100464 99873 100234 101251 101835
54783 101835 101160 99632 98386 97845 97188 95384 92473 89562 87616 86509 85398 83838 82156 80798 79747
54768 79747 78861 78354 78484 78933 79063 78796 78734 79358 80566 82160 84214 86639 88872 90442 91571 92759 94136
54751 94136 95674 97766 100977 105224 109694 113525 116248 117793 118640 119822 122078 125020 127791 130585 134708
54736 134708 140920 148560 156775 165799 176299 187998 199815 211213 222724 235148 248657 262633
54724 262633 276014 287865 297844 305972 311876 314721 314150 310761 305266 297810 288747 279458 271440 264920
54710 264920 259344 254826 251881 249886 247267 243691 240813 240229 241633 243733 246024 248663 251393 253776
54696 253776 256270 259985 265414 272262 280477 290574 302817 316937 332889 351072 371363 392523
54684 392523 413072 432244 449597 464097 474370 479682 480175 476237 468207 456638 442184 425138
54672 425138 405633 384515 363401 343530 325000 307473 291099 276202 262483 249312 236741
54661 236741 225564 216394 209158 203412 198549 193651 187936 181687 176276 172899 171511 171094 170620 169703 168761
54646 168761 168679 169850 171393 171778 170296 167515 164321 161249 158751 157193 156197 154801 152776 151088 150701
54631 150701 151705 153931 157304 160899 162852 162386 161125 161239 162968 165131 167269 169824 172753 175596 178615
54616 178615 182217 185468 186947 187259 188910 193189 198748 203864 208598 213936 220116 226739 233414 239333
54602 239333 243289 245256 247084 250525 255168 259358 262498 265254 267965 270184 271884 274058 277830 283436
54588 283436 290184 297170 304235 312497 323562 337795 353758 369822 385803 402502 420229 438557
54576 438557 457003 474974 491391 505380 517178 527307 534827 537467 533684 523741 508700 489657
54564 489657 468458 447875 429700 413151 396252 378584 361587 346295 332125 318451 306244
54553 306244 297038 290798 285892 280960 275754 270127 263601 256483 250282 245999 242743 238994 234663 230713
54539 230713 227214 223286 218871 215001 211832 207861 201924 194952 188765 183943 179905 176411 173755 171653
54525 171653 169149 165796 162058 158312 154243 149681 145520 143038 142303 141737 139657 136164 133169 132451 133930
54510 133930 136057 137477 137896 137636 137063 136485 135931 134874 132686 129589 126661 124733 123702 123166 123260 124577
54494 124577 127460 131450 135260 137459 137667 136930 136398 135908 134626 132851 132042 133005 135182 137993 141670 146331
54478 146331 151383 156464 162040 168387 174973 181501 188607 196741 205290 213552 221611 229562 237086 244756
54464 244756 254291 265884 276439 282422 283785 283101 281417 277289 270020 261446 253658 246651 239128 230280
54450 230280 219967 208437 196980 187930 182746 180431 178527 175358 170804 165589 160629 156735 154131
54437 154131 152222 150214 147798 144970 141519 137275 132785 129208 127319 126785 126595 126139 125705 125855 126590 127446
54421 127446 128326 129632 131484 133403 135058 136630 137989 138258 136965 135085 134040 134104 134689 135767 137803
54406 137803 140487 142706 143868 144220 143874 142686 141231 140603 140776 140377 138719 137074 137116 138936 141392 143730
54390 143730 145809 147151 146826 144337 140076 134962 130124 126736 125440 125670 125946 125151 123427 121733 120686
54375 120686 120128 119888 120585 123055 127020 130975 133706 135304 136274 136439 135593 134609 134720 135877 136908 137243
54359 137243 137363 137578 137652 137992 139908 143934 148741 152453 154559 156044 158180 161605 166006 170276 173467
54344 173467 175947 179073 183533 188667 193626 198304 202638 206038 208350 210714 214488 219603 224648 228311
54330 228311 230254 230970 231430 232616 234802 237365 239389 240130 238933 235514 230689 225953 221836 217409 211997
54315 211997 206445 201905 198250 194616 190807 187098 183320 179325 175820 173473 171607 169206 166959 166802
54301 166802 169290 172753 175276 176356 176315 175416 174136 173283 173097 172942 172473 172396 173527 175674 178104 180632
54285 180632 183763 188044 193586 199802 205407 209364 212199 215633 220291 224445 225781 224019 220947 218273
54271 218273 216412 215212 214699 214590 213827 211327 207158 202675 199399 197642 196060 192643 186442 178353 170083
54256 170083 162597 155996 150538 146800 144467 141895 137793 132997 129581 128183 127066 124280 120096 116683
54242 116683 115637 116377 116769 114917 110471 104808 100020 97299 96111 95087 93591 92004 90656 89302 87878
54227 87878 87025 87250 88035 88405 88079 87424 86482 84848 82639 80864 80423 81099 81960 82539 83183 84209 85179 85432
54209 85432 85236 85889 88176 91037 92463 91827 90584 90282 90612 90242 89056 88399 89066 90195 90623 90520 90990
54192 90990 92511 94409 95592 95332 93651 91629 91081 93052 96421 98598 97963 95319 92836 92010 92829 94401
54176 94401 95811 96559 96709 96736 97043 97624 98326 99111 99776 99609 97959 95197 92721 91818 92774 95021 97681
54159 97681 99832 100753 100351 99127 97505 95478 93141 91132 90114 90020 90267 90513 90845 91381 92150 93216 94441
54142 94441 95233 95025 94021 93061 92701 92815 93080 93346 93504 93364 92872 92146 91380 91049 91950 94299 96769 97400
54124 97400 95950 94518 95089 96926 97336 94898 91116 88691 88703 89834 90027 88567 86629 85976 87180 89062
54108 89062 89887 89079 87663 87055 87571 88194 87711 85834 83232 80809 79272 79154 80646 83239 85910 87842
54092 87842 88667 88126 86177 83647 81881 81127 80096 78001 76310 77235 80811 84786 87345 88611 89336 89645
54076 89645 89687 90248 91648 92830 92495 90698 88615 87185 86595 86631 86793 86414 85255 83758 82317 80762 78979
54059 78979 77505 76917 77135 77925 79486 81836 84109 85358 85673 85679 85314 84119 82547 81841 82452 83418 83595
54042 83595 82818 81628 80438 79327 78289 77460 77187 77809 79108 80228 80495 80176 80096 80784 82288 84340 86150
54025 86150 86589 85452 84171 84341 85719 86716 86739 86911 88243 90250 91745 92114 91336 89592 87561 86460
54009 86460 87051 88843 90768 92447 94443 97424 101278 104862 106613 105769 103194 100693 99561 100023 101746
53994 101746 104135 106307 107768 109271 112008 115811 119271 122044 125657 131120 136957 140965 143119 145195
53980 145195 147998 150665 152772 155442 159747 165147 170296 174592 178309 181952 186153 191719 199014 207536
53966 207536 216513 225510 234010 241026 246037 250028 254708 260618 266693 271700 275392 278073 279785 280295
53952 280295 279454 277408 274928 273597 274723 277705 280242 280804 280114 279469 278468 275643 270785 265152 259534
53937 259534 253597 247437 242276 238888 236464 233822 230915 228414 226543 225128 224093 223046 220954 217197
53923 217197 212602 208631 205904 204184 203351 203422 203917 204170 204201 204489 205018 205283 205057 204479 203511 202055 200386
53906 200386 198806 197145 195407 194477 195134 196635 197468 197398 197502 198183 198547 198029 197327 197196 197449 197746 198339 199376
53888 199376 200401 201260 202758 205718 209994 214928 219977 224438 227401 228866 230214 232790 236508 240494
53874 240494 244440 248650 253262 258123 262909 266851 269108 270155 271891 275308 278786 279933 278689 277349
53860 277349 277826 280130 283446 287416 292168 298062 305528 314350 323111 330288 335951 341498 347807 354618
53846 354618 361697 369294 377141 384225 390121 395499 400772 405269 408441 410906 413296 414810 414024 410860
53832 410860 406785 403220 400453 397944 394989 391038 385950 380056 373684 366858 359698 352740 346263 339626
53818 339626 331973 323479 315270 308126 301807 295594 288881 281310 273064 265192 258879 254069 249317 243331
53804 243331 236250 229179 222974 217794 213300 208865 204055 199410 196241 195039 194451 192597 189183 185450
53790 185450 182146 178645 174370 170151 167386 166295 165767 164747 163134 161306 159399 157422 155715 154697
53776 154697 154077 152749 149950 146444 143952 143197 143099 142488 142052 143536 147118 150709 152293 152074 151692 152056
53760 152056 152805 153524 154564 156528 159493 162862 165880 168404 171133 174679 178410 181008 182366 183876 186204
53745 186204 187998 187956 187216 188052 190842 194172 197690 202711 209615 216708 222609 228069 234149 240016 244105
53730 244105 246613 249258 252965 257146 261098 264928 269051 273625 278528 283319 287392 290729 294041 297601
53716 297601 300514 302044 303032 304762 306875 307898 307716 307873 309069 309935 309046 306875 304797 303133 301346
53701 301346 299491 298199 297360 295931 293250 289793 286340 282906 278936 274371 270152 267415 266202 265217 263067
53686 263067 259551 255408 251066 246419 241756 238001 235518 233380 230511 227056 224029 221977 220696 219968
53672 219968 219789 219929 219985 219850 219512 218491 216296 213582 211982 212372 213961 215567 217166 219548 222889 226379
53656 226379 229082 230588 231031 231094 231838 233799 236202 237708 238121 238814 241307 245880 251706 257735 263200 267889
53640 267889 272437 277886 284396 290710 295359 298116 299843 301363 303178 305873 309755 314034 317257 318957
53626 318957 320217 322356 325669 329824 334712 340153 345155 348319 349150 348542 347863 347790 348033 348006 347674 347739 348888
53609 348888 350913 352914 354440 355928 357837 359843 361425 362763 364285 365498 365218 363166 360694 359444
53595 359444 359675 360322 360362 359669 358693 357777 356902 355790 354159 352007 349668 347539 345743 344188 342853 341834
53579 341834 341255 341339 342412 344385 346327 347218 347396 348512 351424 354667 355991 355275 354929 357225 362199 368450
53563 368450 374926 381060 385972 388819 389957 390972 393439 397952 404052 410482 415800 419604 423109 427812
53549 427812 433677 439473 444918 451421 460186 470277 479199 485197 488777 492300 498128 506780 516657 525757
53535 525757 533450 540190 546089 550939 555569 561751 570185 579600 588442 596530 604381 611986 619200 626493
53521 626493 634047 640576 644301 645153 645156 646597 650372 655813 661326 665250 666879 666831 666188 665594 665475 666405 668342
53504 668342 669957 669852 668342 667016 666686 666805 666955 667642 669200 671015 672486 673979 676092 678484 680203
53489 680203 680868 680933 680933 681081 681650 683317 686728 691709 697068 701482 704787 708179 712828 718497 723861 728119
53473 728119 731890 736544 742997 751125 759970 768522 776682 785561 796567 810074 825106 840228 854651
53460 854651 868840 884326 902606 923751 946309 968885 991388 1014307 1037632 1061535 1087538
53449 1087538 1117435 1150865 1185336 1219063 1252639 1287434 1323546 1360251 1397578 1436272 1476652
53438 1476652 1518424 1561462 1605945 1651820 1698787 1746784 1795923 1845959 1896243 1946250 1995811
53427 1995811 2044924 2093687 2142444 2191720 2241897 2292956 2344459 2395714 2446209 2495895 2544908
53416 2544908 2593041 2639839 2685149 2729157 2771783 2812663 2851869 2889976 2927025 2962079 2994349
53405 2994349 3024240 3052596 3079310 3103490 3124771 3143664 3160516 3174802 3185705 3193047 3197460 3199708
53393 3199708 3199731 3196190 3187307 3172607 3153672 3132710 3110578 3086633 3060199 3031267 2999824 2965613
53381 2965613 2929141 2892132 2856100 2820609 2783619 2743534 2700526 2655960 2611170 2566960 2523804
53370 2523804 2482012 2441788 2403415 2367364 2333993 2303171 2274420 2247566 2223087 2201667 2183448
53359 2183448 2167800 2153880 2141489 2131489 2125332 2123918 2126834 2132791 2140790 2150688 2162796 2177518
53347 2177518 2195573 2217941 2245062 2276396 2311161 2349116 2390114 2433452 2478601 2526282 2577795
53336 2577795 2633287 2691725 2752600 2816447 2883382 2952515 3023610 3098133 3177497 3261060 3347157
53325 3347157 3435483 3527014 3621873 3718780 3816788 3916162 4017201 4119436 4222608 4327341
53315 4327341 4433966 4541261 4647156 4750234 4850024 4946421 5039540 5129654 5216478 5298767
53305 5298767 5375333 5446095 5511310 5570141 5621066 5663687 5699101 5728219 5750676 5765740 5773320
53294 5773320 5773428 5765406 5748593 5723445 5691240 5652799 5607977 5556159 5496781 5429551 5354722 5273032
53282 5273032 5184987 5090536 4989992 4884977 4777833 4670251 4563067 4457078 4353174 4251668
53272 4251668 4152223 4054339 3957271 3859835 3761572 3664230 3570757 3482365 3397626 3314909 3234479
53261 3234479 3157482 3084050 3013539 2945923 2881937 2822368 2768040 2719686 2676786 2637167 2599017
53250 2599017 2562814 2530104 2500920 2473931 2448793 2426593 2407818 2391613 2377600 2366966 2360800
53239 2360800 2358391 2358034 2358854 2361012 2364744 2369992 2376778 2385340 2396088 2409620 2426443 2446361 2468529
53226 2468529 2492307 2517707 2544941 2574199 2606101 2641662 2681232 2723858 2768034 2812791 2857844
53215 2857844 2903080 2948189 2992430 3034641 3074062 3111336 3148042 3184833 3220484 3253125 3281912
53204 3281912 3307146 3329330 3348617 3364816 3377586 3386884 3393327 3397497 3398615 3394726 3384768 3369833
53192 3369833 3351780 3331117 3307032 3278916 3246888 3210992 3170910 3126677 3079028 3028677 2975642
53181 2975642 2919610 2860871 2800714 2740796 2682049 2624208 2566526 2508812 2451594 2395457 2340711
53170 2340711 2287511 2235756 2184920 2134605 2085284 2037768 1991922 1946741 1901767 1857442 1813814
53159 1813814 1770125 1726358 1684245 1645762 1611247 1579771 1550676 1523801 1498631 1474211 1449783
53148 1449783 1424915 1399415 1373734 1349019 1325946 1303781 1281334 1258550 1236458 1215781 1196259
53137 1196259 1177114 1157596 1137359 1116874 1097113 1078212 1058920 1038091 1016260 994943 974831
53126 974831 955568 936816 918349 899421 879441 859350 841074 825190 810136 794134 777079
53115 777079 760059 743719 727630 710932 693233 675152 658108 643270 630629 619375 609001
53104 609001 599488 590507 581151 570731 559439 548046 537272 527427 518309 509417 500586 492335 485226
53091 485226 479019 472909 466566 460508 455554 452164 450062 448052 444541 438884 432098 425687 419975 414203
53077 414203 408083 402502 398579 396546 395556 394170 391243 386873 382415 379178 377238 375851 374475 372793
53063 372793 370304 366863 363411 361253 360631 360696 360630 360149 359258 358307 357993 358387 358439 357392 356256 356710 358904
53046 358904 361638 364403 367667 371299 374324 376481 378577 381003 383297 385484 388389 392179 395931 399001
53032 399001 401512 403154 403047 401280 399025 396612 393148 388686 384793 381865 377873 371407 364354 359611
53018 359611 357270 355038 351577 347407 343071 338377 333322 328030 321812 313819 304704 296178 288930 282422
53004 282422 276879 273840 274023 275737 276283 274395 270806 266955 263595 260468 257026 253402 250398 248377 246690
52989 246690 244633 242451 240679 239068 237092 235143 234090 233733 232831 230862 228767 227531 226778 225265 222333
52974 222333 218532 215003 212426 210503 208579 206742 205869 206322 207252 207645 207390 206733 205449 203491 201721 200746
52958 200746 199652 197323 194604 193480 194191 194989 194950 195152 196346 197300 196693 195294 194840 195626 196539 196924 197067
52941 197067 197136 196781 195766 194189 192212 190168 188724 188301 188632 189498 191361 194346 197036 197474 195367 192220
52925 192220 189252 186375 183582 182084 183066 185942 188769 190204 190427 190382 190802 192058 194316 197460 200904
52910 200904 203644 204673 203715 201765 200617 201533 204421 208333 212440 216285 219530 222086 224325 226652 229019
52895 229019 231405 234575 239498 245940 252498 258343 264123 270693 277789 284579 290717 296071 300124 302745
52881 302745 305049 308168 311376 312801 312080 310966 310852 310993 309927 307629 305265 303411 301541 298989 295686
52866 295686 292061 288836 286781 286141 286301 286317 285588 283820 280723 276223 270879 265753 261914 260028 260012 260940
52850 260940 261734 262134 262555 262886 262295 260524 258566 257398 256816 256268 256093 256932 258485 259874 260876 261687 261907
52833 261907 260959 259442 258789 259506 260838 262206 263767 265344 266192 266353 267070 269070 271430 272888 273417 273560
52817 273560 273094 271518 269319 267547 266414 265457 264948 265805 267887 269649 270057 269914 270478 271532 271791 270853
52801 270853 269707 269327 269699 270413 271472 273109 275341 278012 280805 282973 283756 283518 283828 285689 288209 289827
52785 289827 290394 291012 292287 293999 296304 299736 303791 307105 309602 312910 317757 322398 324922 325868 326917
52770 326917 328008 327811 326695 327009 330016 334342 338146 341396 345016 348933 352122 353932 354341 353240 350427
52755 350427 346373 342263 339001 336366 333253 328746 322997 317118 312144 308254 305043 302141 299180 295522
52741 295522 290732 285333 280537 277152 275040 273363 270832 266157 259350 252579 248649 248207 249241 249631 249265
52726 249265 249024 248669 246828 242850 237739 233118 229713 226981 223960 220389 217004 214664 213339 212288 211091
52711 211091 209994 209233 208658 208229 208193 208434 208184 206856 204727 202417 200107 197640 194930 191836 188090 183969
52695 183969 180680 179411 180078 181471 182502 182845 182491 181253 178810 175031 170279 165600 162370 161272 161568
52680 161568 161660 160418 157951 155261 153366 152557 152219 151453 149931 147918 145447 142094 138044 134906 134547 137070
52664 137070 140452 142376 142140 140756 139632 139347 139488 139414 139159 139378 140277 140944 140213 138049 135509 133274 130871
52647 130871 127687 124294 122297 123007 126485 131504 136049 138208 137369 134850 132962 133205 135470 138713 141855
52632 141855 144012 144753 144709 145329 147271 149482 150779 151997 155325 161358 168049 173093 176336 179016 181643
52617 181643 183799 185526 187576 190285 193152 195610 197435 198386 198296 197724 197678 198342 198625 197301 194213 190141
52601 190141 185964 182213 179030 176235 173545 170859 168186 165447 162651 160123 158108 156272 154100 151657
52587 151657 149354 147057 144153 140524 136839 133881 132225 132368 134109 135717 134976 131654 127982 126113 125967
52572 125967 126231 126410 126743 126827 125842 124155 123446 124767 127227 129118 129899 130480 131623 132721 132617 131412 130627
52555 130627 131202 132049 131431 129355 127491 126850 126868 126967 127691 129629 132257 134731 136881 138576 138936 137344 134725
52538 134725 132751 132103 132446 133684 136020 138919 141155 142133 142259 141915 140939 139498 138697 139725 142685 146567
52522 146567 150178 152927 154953 156736 158574 160382 161877 162783 162947 162668 163054 165441 169981 175128 178934
52507 178934 180650 180818 180330 179994 180563 182407 185131 188028 190767 193220 194888 195261 194734 194563 195663 197740
52491 197740 199704 200715 200830 200765 201059 201504 201647 201722 202558 204366 206219 207024 206565 205445 204656 205358 208130
52474 208130 211919 214621 215383 215437 216007 216464 215605 213740 212091 210922 209851 209497 210977 213832 216149 217003
52458 217003 217396 218460 220060 221541 222614 223073 222735 222087 222014 222419 222116 220527 218628 217803 218603 220892 224165
52441 224165 227332 229169 229528 229325 229053 228326 227199 226681 227270 228033 227866 226666 224706 222102 219744 219489
52425 219489 222124 226029 229115 231266 233547 235815 236902 236850 237198 238819 240825 241996 242179 241911 241611 241654
52409 241654 242491 244245 246574 249231 252279 255523 258236 259771 260206 260120 260021 260071 260191 260358 260917 262493 265379
52392 265379 269043 272456 274804 275766 275441 274420 273669 273778 274383 274736 274814 275373 276910 279041 281075 282920
52376 282920 285178 288460 292705 297151 300883 303266 303864 302435 299660 297478 297552 299134 299569 297542 294773
52361 294773 293614 293977 293989 292972 292010 291733 291257 289768 287745 285922 284130 281967 279703 277681 275472 272583
52345 272583 269612 267857 267888 269100 270608 272073 273651 275435 277023 277639 277010 276121 276479 278357 280429 281619
52329 281619 282643 284879 288206 291006 292189 292283 292331 292666 293209 294257 296248 298974 301655 303776 305605 307805
52313 307805 310730 314052 317002 318963 319973 320710 322073 324741 328728 333070 336190 337289 337551 339278 343409
52298 343409 348274 351360 351995 351746 352403 354395 357307 361031 365711 371034 376363 381565 387016 392579 397211
52283 397211 400152 402218 405157 409579 414113 417010 418209 419248 421335 424150 426566 427891 428182 428117 429047
52268 429047 432463 438440 444833 448974 450242 450344 451133 453110 456141 460514 466443 473269 480022 486513 493205
52253 493205 500239 507229 513906 520430 527129 534395 542747 552546 563587 575296 587319 599755 613002
52240 613002 627493 643255 659456 674890 689373 704190 720603 738421 756710 775285 794480
52229 794480 813850 832496 850695 869971 891192 913599 935998 957917 979230 999777 1019983
52218 1019983 1040881 1062784 1084608 1105192 1124517 1142919 1160018 1175402 1189791 1204319 1218960
52207 1218960 1232533 1244066 1253371 1260699 1266770 1272788 1279295 1285034 1288046 1287973 1286378 1284673 1282863 1280511
52193 1280511 1277865 1275378 1272993 1270596 1268589 1267331 1266510 1265702 1265166 1265419 1266402 1267748 1269686 1272906 1277632
52178 1277632 1283488 1290306 1298360 1307706 1318058 1329675 1343536 1359854 1376834 1391909 1404294 1415639
52166 1415639 1428100 1442451 1458190 1474415 1489893 1503153 1513729 1523022 1532770 1542689 1550769 1556061
52154 1556061 1559862 1563457 1565863 1564927 1560039 1552673 1544564 1536452 1528456 1520521 1512120 1502316 1490618 1477512
52140 1477512 1464042 1451207 1439676 1429444 1419627 1409049 1397262 1384746 1372297 1360769 1351231 1344354
52128 1344354 1339357 1334352 1328306 1322123 1317312 1314153 1311740 1309257 1306395 1302962 1299033 1295388 1292778 1290574
52114 1290574 1287137 1281963 1276659 1272994 1270552 1267284 1262213 1256625 1252310 1249489 1247062 1244304 1241471 1238888
52100 1238888 1236290 1233325 1230094 1226807 1223283 1219266 1214996 1210980 1207249 1203204 1198324 1192756 1187143 1182046
52086 1182046 1177561 1173276 1168503 1162732 1156101 1149430 1143659 1139060 1134919 1130052 1123850 1116931 1110724 1106427
52072 1106427 1104263 1103517 1102920 1101163 1097659 1093041 1088554 1084683 1080677 1075624 1069568 1063262 1057327 1052192
52058 1052192 1048360 1045969 1044244 1042258 1040243 1039443 1040502 1042687 1044894 1046779 1048719 1051398 1055808 1062903
52044 1062903 1072586 1083452 1094113 1104485 1115326 1127065 1139757 1153776 1169588 1186884 1204820
52033 1204820 1223238 1242875 1264217 1286878 1310485 1335340 1361628 1388492 1414589 1439312 1462914
52022 1462914 1485848 1508679 1532271 1557135 1582494 1606770 1629087 1649513 1667860 1683382 1696207
52011 1696207 1707911 1719539 1729795 1736485 1739533 1741212 1743272 1745108 1745136 1742737 1738030 1730799 1720991 1709903
51997 1709903 1699657 1691301 1684170 1677148 1669873 1662560 1655392 1648452 1641780 1635158 1628193 1620972 1614327 1609061
51983 1609061 1605153 1602070 1599695 1598444 1598537 1599664 1601516 1604202 1607826 1611985 1616067 1619949 1623953 1628186
51969 1628186 1632357 1636268 1640018 1643501 1646207 1647910 1649136 1650429 1651424 1651202 1649358 1646117 1641605 1635854
51955 1635854 1629561 1623843 1618763 1612709 1603907 1592197 1578841 1564888 1550249 1534184 1516160 1496212
51943 1496212 1474832 1452649 1430044 1406950 1382924 1357375 1329966 1301176 1272312 1244389 1216998
51932 1216998 1188851 1159418 1129259 1098776 1067723 1036441 1006393 978514 951792 924509 896402
51921 896402 868568 841700 815596 790111 765431 741366 717472 693933 671349 649635 628251
51910 628251 607810 590122 576006 563912 551568 538428 525721 514517 504489 494563 484184 473801
51898 473801 464254 455763 447657 439366 431519 425542 421985 419715 417022 413195 408793 404679 401131 397785
51884 397785 394352 391248 389225 388124 386383 382422 376348 369711 363773 358778 354667 351354 348058 343446
51870 343446 337099 330126 323843 318560 314185 311183 309961 309858 309728 309343 309334 309785 309692 308042 304928 301420
51854 301420 298613 296843 295533 293731 291059 288185 286208 285602 285810 285827 285009 283433 281635 280139 279283 279423
51838 279423 280811 282872 283901 282316 278378 274052 270907 268665 266121 262909 259789 257579 256382 255682
51824 255682 254821 253408 251532 249561 247733 246206 245368 245540 246185 246078 244693 242939 242071 242232 242537 242293
51808 242293 241694 241564 242763 245631 249630 253704 257172 260038 262462 264461 266328 268572 271047 272894 273889
51793 273889 275107 277438 280126 281742 282123 282292 282704 282775 282196 281563 281365 281179 280368 279048 277872 277154 276509
51776 276509 275269 273222 271063 270021 270842 273263 276598 280431 284404 287837 290209 291803 293264 294750
51762 294750 296084 297482 299348 301480 303292 304787 306514 308483 309873 310024 309086 307527 305626 303676 302164
51747 302164 301485 301746 302764 303860 303974 302752 301389 301447 302827 303949 304104 304396 305861 307739 308590 308249
51731 308249 307618 307000 305831 304081 302971 303957 307356 312022 316134 318497 319507 320796 323600 327530 331179
51716 331179 333756 335745 338162 341604 345979 350643 354612 357035 357867 358102 359195 362105 366694 371886 376451
51701 376451 379899 382829 386457 391725 398733 406908 415641 424694 433926 442820 450535 456408 460084 461235
51687 461235 459806 456799 454135 453048 452976 452623 451707 450861 450180 449050 447469 446452 446740 447987 449635 451701
51671 451701 454145 456322 457882 459607 462381 465627 467736 468016 467391 467032 466990 466561 465574 464789 465030 466128
51655 466128 466946 466526 465077 463655 462939 462695 462385 461750 460604 458658 456102 453978 453320 453907 454392 453816 452624
51638 452624 452026 452621 453892 454961 455526 455958 456710 457963 459734 461890 463909 465103 465491 466066 467788 470676
51622 470676 474333 478908 484813 491878 499588 507663 515159 519499 518276 512516 506542 503702 503363 502809 500681
51607 500681 497377 493308 488522 483461 478525 473118 466415 458890 451750 445056 437787 429810 422418 416601
51593 416601 411950 407656 403545 399617 395504 391048 386834 383601 381437 379843 378218 376154 373676 371282
51579 371282 369342 367518 365316 362977 360937 358622 354973 350363 346711 345171 344820 344229 343204 342062 340309
51564 340309 337414 334356 332959 333712 335380 336759 337745 338476 338514 337554 336266 335588 335432 334772 333130 331397
51548 331397 330825 331549 332743 334200 336890 341418 346601 350557 352955 355135 358055 361278 364321 367656 371605
51533 371605 375302 377994 380760 385591 392886 400903 407713 412802 416697 419996 423080 426040 428472 429852
51519 429852 430455 431396 433316 435323 435634 433275 429004 424703 421887 420673 420133 419732 420260 423005 428047 433708
51503 433708 437938 440174 441734 444391 448613 453379 457818 462532 468530 475001 479408 480382 479413 478610 477752
51488 477752 475141 470910 467551 466793 467688 468440 468696 469021 469406 469643 470352 472173 474420 475920 477031 479326
51472 479326 483069 486351 487317 486238 484689 483473 482351 481315 480993 481518 481716 479957 475700 469908 464004
51457 464004 458721 454089 450206 447479 445941 444797 443093 440760 438551 436936 435516 433716 431623 429716
51443 429716 428032 426255 424724 424663 426753 429748 431292 430402 428573 428039 429451 431826 434271 436679 438832
51428 438832 440025 440131 440136 440854 441764 442073 442543 445117 450611 457695 464494 470511 476513 483070 489857 496287
51412 496287 502292 508361 515029 522458 530449 538733 547144 555470 563293 570206 576222 581804 587316 592391
51398 592391 595959 597097 596114 594668 594540 596136 598387 600038 600651 600425 599732 599179 599427 600252 600238 598187 594623
51381 594623 591043 587859 584034 578861 573017 567355 561514 554583 546683 538980 532261 526251 520575 515685
51367 515685 512312 510258 508318 505541 502102 498647 495210 491408 487597 485009 484497 485750 488018 490830
51353 490830 493505 495006 495307 496268 499740 504982 509175 510412 509001 505904 501460 496057 490535 485060 478691
51338 478691 470901 462592 454790 447337 439786 432528 425808 418490 409334 399062 389710 382058 375080 367914
51324 367914 360972 354749 348664 341786 334174 327145 322482 321205 322420 323461 322033 318307 314267 311083
51310 311083 308103 304422 300243 296189 292294 288390 284667 281191 277539 273741 270994 270499 271769 272899
51296 272899 272518 270793 268648 266702 265181 264238 263992 264477 265737 267714 269880 271324 271602 271362 271748 273142
51280 273142 274878 276295 277650 279606 282167 284733 287118 289790 292943 295996 298357 300229 302281 304993
51266 304993 308674 313504 318925 323451 325927 326832 327671 329169 330604 330761 328956 325288 320528 315680 311065
51251 311065 305940 299548 292362 285657 280125 275562 271559 267556 262494 255701 248230 242203 238521 236172
51237 236172 233993 231975 230376 228715 226518 224329 223169 223392 224500 225545 225445 223684 221197 219825 220220
51222 220220 220900 219904 216863 212912 209319 206936 206382 207767 210325 212840 214366 214484 213533 212881 214020 216674
51206 216674 218580 217939 215424 212936 211210 209781 208678 208588 209371 209753 208888 207381 206355 205999 205323 203116
51190 203116 199210 195028 192561 192439 193333 193680 193440 193537 194206 194825 195024 194928 194468 193409 192029 190976 190426
51173 190426 190035 189650 189371 189111 188901 189350 190881 192583 192851 191303 189233 188120 188407 189684 191150 191841
51157 191841 191369 190552 190608 191680 193044 194517 196460 198403 199242 199252 200412 203870 208154 210963 211886 212373
51141 212373 213611 215487 217310 218646 219475 220118 220980 222062 223017 223929 225579 228495 232063 234939 236151
51126 236151 235708 234522 233871 234350 235184 235145 234289 233977 234953 236440 237619 238895 240806 242540 242678 240845 237652
51109 237652 233555 228846 224440 221375 219547 217895 215849 213749 211921 210319 209161 208911 209297 209296 208475 207628
51093 207628 207645 208382 209180 209974 211232 213028 214764 215806 216066 215957 215987 216372 216836 216784 215852 214318 212912 212186
51075 212186 212128 212324 212382 212140 211600 210888 210344 210318 210734 211064 211003 210833 210682 209835 207548 204450 202184 201441 201263
51056 201263 200588 199526 198429 196672 193506 189617 186679 185531 185751 186927 189263 192787 196926 201150 205243
51041 205243 208687 210635 210938 210505 210119 209604 208715 208231 209226 211552 213917 215479 216576 217828 219340 221126
51025 221126 223568 226772 229877 231750 232339 232687 233557 234638 235300 235473 235333 234716 233535 232398 232065 232500
51009 232500 233288 234824 237980 242393 246173 247966 248471 249093 249745 249105 246834 244555 244367 246945 251140 255019
50993 255019 257310 258284 259310 261278 263606 265043 265165 264457 263271 261539 259563 258141 257462 256653 254983
50978 254983 253133 252632 254160 256897 259537 261552 263430 265967 269491 273605 277448 280161 281322 281192 280637
50963 280637 280594 281464 283137 285586 289044 293276 297056 299026 299136 298759 299255 300786 302671 304442 306097 307621
50947 307621 308869 310115 312382 316836 323780 332307 340970 348673 355055 360392 365422 371093 378056 386305
50933 386305 395365 404780 414292 423907 434111 445769 459204 473552 487714 501849 517093 533783
50921 533783 551134 569020 588825 611611 636354 661143 685623 711240 739414 770558 804545
50910 804545 841010 879254 918968 961217 1007790 1059385 1115195 1174262 1236287 1301010 1367937
50899 1367937 1437175 1509632 1585599 1663529 1740773 1815224 1885926 1952415 2013959 2069521 2118468
50888 2118468 2161256 2198941 2231387 2256389 2271433 2276381 2273813 2266926 2257856 2247634 2236364 2223239
50876 2223239 2207636 2190697 2174714 2160596 2147017 2132442 2116526 2098774 2077450 2051308 2021263
50865 2021263 1988775 1953308 1913029 1867575 1818374 1766415 1711505 1654126 1596384 1540257 1485870
50854 1485870 1432295 1379396 1328083 1279242 1233159 1189982 1150185 1114278 1082113 1052648 1024733
50843 1024733 998289 974432 954234 937682 924064 912795 903355 895010 887416 881226 877281 875412
50831 875412 874796 875266 877281 880681 884509 888238 892279 897075 902576 908842 916319 925085 934600 944553 955254
50816 955254 966844 978844 990895 1003284 1016418 1030484 1046054 1064194 1085401 1109088 1134569
50805 1134569 1161728 1190324 1219709 1250162 1283520 1321386 1363546 1409181 1458699 1512886 1571096
50794 1571096 1632391 1698266 1772129 1855659 1947499 2046118 2152153 2266937 2390341 2521443
50784 2521443 2660204 2806990 2961071 3120789 3284560 3450507 3615662 3776908 3932348
50775 3932348 4080507 4218459 4342107 4448374 4536088 4604995 4655300 4688215 4705459 4707741 4695052
50764 4695052 4669069 4634168 4595379 4556135 4518376 4483594 4452777 4426000 4402713 4381630 4359825
50753 4359825 4333168 4298921 4257153 4208622 4152186 4085643 4008325 3921075 3824115 3716906 3600444
50742 3600444 3478000 3352942 3227021 3101396 2978194 2860225 2749873 2648766 2557745 2476520
50732 2476520 2404033 2339777 2284311 2238148 2200857 2171747 2150831 2138612 2135396 2141015 2154383 2172917
50720 2172917 2193374 2214068 2235540 2258324 2280915 2300877 2317107 2329742 2338438 2342169 2340646 2334636
50708 2334636 2324815 2311382 2294883 2276280 2255974 2233712 2209691 2184677 2158697 2130790 2100773
50697 2100773 2070414 2041892 2015577 1990046 1964075 1937998 1913424 1892234 1875624 1863423 1854289
50686 1854289 1846992 1841606 1839300 1841201 1847839 1859442 1876116 1897623 1923567 1953991 1989497 2030574
50674 2030574 2077241 2129707 2188975 2256126 2330932 2411740 2496962 2586336 2680361 2778805 2880072
50663 2880072 2981772 3081432 3176883 3266602 3349719 3425135 3490632 3543541 3582430 3607487 3619049
50652 3619049 3616693 3600349 3571607 3533190 3487772 3438095 3387494 3338947 3293543 3250868 3211003
50641 3211003 3175359 3145495 3121890 3103788 3089298 3075462 3059229 3038856 3013921 2983988 2948153
50630 2948153 2906070 2858407 2805884 2748819 2688162 2626081 2564873 2506069 2451260 2402730 2362088
50619 2362088 2328806 2301361 2279570 2264935 2259036 2262663 2276206 2299644 2332097 2372590 2421565 2480595
50607 2480595 2550128 2628477 2713486 2804205 2900051 2998988 3097641 3193170 3284352 3370883 3452268
50596 3452268 3527634 3596213 3657686 3712088 3759493 3799880 3833363 3860505 3882036 3898157 3908382
50585 3908382 3912323 3910501 3904241 3894979 3884012 3872790 3862984 3855914 3852008 3851107 3853480 3860306 3872703
50572 3872703 3890095 3910011 3929946 3949174 3968184 3986604 4002685 4014891 4022970 4026864 4025573 4018196
50560 4018196 4005592 3989796 3971888 3951586 3929103 3906296 3885513 3868251 3855638 3849261 3850302 3857969
50548 3857969 3869685 3882874 3896026 3908215 3918457 3925746 3929048 3926987 3918109 3901773 3878161 3846801
50536 3846801 3805531 3751776 3684987 3607261 3521450 3429141 3330847 3227685 3122071 3016671 2913306
50525 2913306 2813188 2717518 2626921 2540567 2457014 2376436 2301212 2233567 2173247 2118493 2068917
50514 2068917 2026135 1991304 1963129 1938895 1916997 1898004 1883718 1875746 1874554 1879278 1888334 1900521
50502 1900521 1915668 1934442 1957920 1987219 2022748 2063553 2108026 2155738 2208201 2267423 2334073
50491 2334073 2407354 2486133 2569650 2657651 2750477 2848725 2952196 3059318 3168040 3276956
50481 3276956 3385203 3491724 3595226 3694442 3787956 3874467 3954096 4028898 4101165 4171801 4241347
50470 4241347 4311695 4384981 4461028 4537950 4615647 4696804 4783724 4875928 4972019 5072322 5178036
50459 5178036 5288811 5402920 5519223 5637044 5754017 5865792 5968608 6061154 6143183 6212953
50449 6212953 6266863 6301413 6314897 6307184 6278445 6228776 6159074 6071705 5969810 5856299 5734082
50438 5734082 5606859 5478679 5352721 5231561 5118797 5019055 4935558 4868500 4816686 4779913
50428 4779913 4758679 4752144 4757572 4771423 4789836 4808137 4821096 4824066 4813297 4785287 4736920 4666696
50416 4666696 4575319 4464816 4337623 4196646 4045546 3888359 3728804 3569857 3413716 3262149
50406 3262149 3117042 2980355 2853156 2734908 2624244 2520438 2423855 2335271 2255319 2184354
50396 2184354 2122087 2067307 2018612 1975586 1938858 1908929 1885339 1866977 1852832 1842400 1835761
50385 1835761 1833263 1834914 1840310 1849346 1862413 1879371 1898909 1919881 1942847 1969210 1999068 2031069
50373 2031069 2064379 2099576 2137427 2177998 2221321 2267675 2316548 2366317 2415828 2465633 2516928
50362 2516928 2569783 2623068 2675729 2727588 2779208 2831400 2884585 2938348 2991935 3045113 3097983
50351 3097983 3150148 3201337 3253154 3308778 3369886 3434726 3500207 3565101 3630119 3695517 3759932
50340 3759932 3821342 3877977 3928329 3971280 4006393 4033468 4051853 4060599 4058911 4045761 4019395 3978181
50328 3978181 3921984 3852162 3770559 3679241 3580712 3477280 3370371 3261656 3154670 3053948
50318 3053948 2962180 2879247 2804372 2738023 2681224 2634304 2597399 2571292 2556475 2551499 2553174 2558309
50306 2558309 2564682 2570588 2574324 2574315 2569073 2556728 2535049 2502515 2459519 2408419 2352216 2292943 2231062
50293 2231062 2166258 2098691 2029640 1961312 1896186 1836001 1780681 1728382 1677335 1627972 1582719
50282 1582719 1543429 1509446 1478537 1449313 1422214 1398364 1378130 1360932 1346007 1333013 1322040
50271 1322040 1313345 1307188 1303788 1303291 1305640 1310540 1317559 1326289 1336516 1348394 1362304 1378306 1395744
50258 1395744 1413842 1432736 1453327 1475879 1499368 1522746 1546288 1570931 1596677 1622638 1648436
50247 1648436 1674525 1700984 1727050 1752203 1776841 1801312 1824899 1846319 1864760 1879987 1891968
50236 1891968 1900891 1907057 1910136 1908976 1902877 1892871 1881104 1869008 1856460 1842526 1826438 1807885
50224 1807885 1786919 1763738 1738387 1710754 1681083 1650284 1619444 1589166 1559618 1530960 1503360
50213 1503360 1476866 1451661 1428098 1405984 1384084 1360940 1336183 1310644 1285478 1261617 1239719
50202 1239719 1219814 1201240 1183769 1168654 1157440 1149644 1142713 1134688 1126040 1118420 1112644 1108613 1106346
50189 1106346 1105915 1106739 1107814 1108463 1108349 1107236 1105471 1104262 1104498 1105498 1105831 1105147 1104301 1103750 1103021 1101746
50173 1101746 1100049 1097590 1093516 1088088 1083270 1080705 1079643 1077715 1073258 1066148 1056988 1046697 1036699 1028427
50159 1028427 1022378 1018223 1015728 1014803 1014753 1014458 1013582 1012884 1013010 1013644 1014266 1015159 1017197 1020896 1025984 1031511
50143 1031511 1036151 1038844 1039611 1039500 1039444 1039464 1039261 1039142 1039741 1040901 1041278 1039317 1034628 1028462 1022703 1018160
50127 1018160 1013898 1008566 1002256 996438 992113 988731 985140 980718 975175 968113 959525 950100 940267 929542
50113 929542 917825 906856 899109 895248 893650 892527 891545 891256 891943 893508 895749 898222 900293 901720
50099 901720 902776 903539 903523 902284 899903 896466 891545 884701 876349 867759 860238 854366 849856 845999 842425
50084 842425 839468 837645 836981 837239 838524 840950 843694 845205 844731 843102 841734 841343 841919 843377 845761
50069 845761 849167 853802 859790 866796 874272 882172 890748 899484 907138 913307 919022 925115 930910 935572
50055 935572 940010 946102 954263 963041 971057 978143 984296 988730 990645 990354 989208 988855 990706 995290 1001505
50040 1001505 1007072 1010583 1013015 1016653 1022508 1029392 1035730 1041730 1049190 1059320 1071411 1083974 1096632
50027 1096632 1110237 1125489 1142332 1160743 1180976 1202575 1224046 1244364 1264187 1284742 1306106
50016 1306106 1327676 1349891 1374131 1400788 1428706 1456960 1486139 1517271 1550212 1583810 1617180
50005 1617180 1650159 1682875 1715586 1748864 1783510 1820226 1859491 1901564 1946351 1993533 2043067
49994 2043067 2095534 2151808 2212560 2278141 2348712 2424264 2504634 2589433 2677608 2766862 2853916
49983 2853916 2935652 3009887 3075046 3129752 3173423 3207056 3232675 3251660 3264008 3269545 3269600 3266920
49971 3266920 3263643 3259407 3251535 3236745 3212400 3176490 3127531 3065260 2991183 2907837 2817508 2722013
49959 2722013 2623501 2524753 2428444 2336352 2249389 2168064 2092744 2023573 1960269 1902137 1848691
49948 1848691 1800366 1758115 1721756 1689188 1657955 1627458 1598998 1573824 1551887 1532354 1514369
49937 1514369 1497141 1480096 1463258 1446868 1430549 1413591 1396072 1378753 1361620 1343684 1324791
49926 1324791 1306581 1290676 1276629 1262624 1247701 1232416 1217759 1204473 1193260 1184632 1178359 1173689
49914 1173689 1170242 1168224 1167745 1168392 1169680 1171627 1174772 1179646 1186140 1193547 1201598 1211294 1223964 1239340
49900 1239340 1255507 1271142 1286814 1303288 1319633 1334316 1347698 1362174 1379954 1401712 1427182
49889 1427182 1455876 1487145 1520541 1556286 1594625 1634866 1676097 1718860 1765057 1816010 1871833
49878 1871833 1933016 2001441 2078986 2165902 2261267 2364558 2476181 2596767 2726226 2862926
49868 2862926 3003442 3143529 3279719 3409834 3532173 3645170 3748007 3840725 3923504 3996855
49858 3996855 4062667 4123705 4181098 4233265 4277953 4314052 4340156 4352529 4346377 4319030 4270667
49847 4270667 4202480 4115933 4013817 3900159 3778215 3649484 3515080 3377067 3237914 3099638
49837 3099638 2964014 2832618 2705875 2582965 2463575 2349235 2242009 2142374 2049315 1962130
49827 1962130 1881064 1806301 1737456 1674325 1617132 1565554 1518195 1473660 1431790 1393311 1358522
49816 1358522 1326790 1297071 1268472 1240504 1213365 1187883 1164536 1142429 1119892 1096393 1073296
49805 1073296 1052349 1034017 1017798 1003500 991176 980134 969352 959137 951130 945999 942105 937338
49793 937338 931588 926433 922986 921295 921520 924139 928662 933394 937142 940248 943391 946276 948322 950030
49779 950030 952731 957220 963329 970489 978000 985101 991700 998873 1007899 1018920 1031284 1044940 1060418
49766 1060418 1077560 1095658 1115225 1138211 1165582 1195853 1227224 1260342 1297548 1339779 1385797
49755 1385797 1434636 1487387 1545995 1611306 1683028 1760898 1844994 1935112 2030404 2129321 2229320
49744 2229320 2326718 2417382 2497928 2566530 2623118 2669100 2706535 2736984 2761097 2779443 2793449
49733 2793449 2805035 2815227 2823259 2826865 2823124 2809062 2781842 2738973 2679061 2602982 2514203 2417216
49721 2417216 2315197 2209563 2101979 1995906 1895250 1801762 1714572 1632280 1554819 1483232
49711 1483232 1418394 1360298 1308251 1261464 1219573 1182476 1149595 1119702 1092125 1067742 1047798
49700 1047798 1031712 1016988 1001669 986113 971882 959702 949124 939555 930803 922867 915953 910450
49688 910450 906295 902450 897694 891932 886192 881257 876892 872639 868959 867082 867637 869614 870894 870058 867692
49673 867692 865723 865497 866796 868615 870196 871044 870689 869210 867637 867043 867301 867331 866426 864714 862463 859769
49657 859769 857077 855253 854671 854654 854151 852792 851138 850256 851021 853292 855658 856598 856143 855844 856797 858417 859652
49640 859652 860719 862685 865735 868902 871527 873984 876572 878488 878572 876821 874666 873815 875017 877739 880639
49625 880639 882409 882592 881844 881386 882076 883785 885499 886043 884981 883052 881628 881582 882692 884122 885261 886048
49609 886048 886776 887905 889878 892684 895598 897716 898815 899440 900150 901046 902056 903175 904195 904715 904849 905457
49593 905457 907126 909293 911141 913090 916326 920654 923909 924207 922074 919537 917674 916137 914883 915097 917789
49578 917789 922288 926833 930327 932939 935258 937509 939670 941800 944110 946985 951089 956935 964052 970905
49564 970905 976116 979684 982706 986029 989746 993963 999302 1006145 1013961 1021934 1029999 1038525 1047157 1054856
49550 1054856 1061397 1068154 1076892 1088123 1100987 1114432 1128042 1142003 1156742 1172613 1189628 1207574
49538 1207574 1226495 1246787 1268500 1290870 1313019 1334979 1357522 1381119 1405598 1430798 1456886
49527 1456886 1483846 1511258 1538978 1567619 1597894 1629801 1662997 1697853 1735429 1776152 1818888
49516 1818888 1861830 1904240 1947035 1991592 2038436 2087342 2138221 2191185 2245744 2300742 2355600
49505 2355600 2411237 2469287 2530620 2594862 2660881 2727126 2791986 2854682 2915924 2977038 3038537
49494 3038537 3100126 3161915 3224430 3287124 3347948 3405147 3458722 3509369 3556710 3599716 3638523
49483 3638523 3674433 3707785 3736961 3760176 3777617 3791017 3801443 3808420 3811308 3810694 3807835 3803215
49471 3803215 3796469 3787858 3778939 3771277 3764943 3759039 3753426 3749076 3746627 3745605 3745569 3747257 3751753 3758970
49457 3758970 3767785 3777532 3788594 3801582 3816733 3834278 3854566 3877329 3901271 3924980 3947955 3970416
49445 3970416 3992352 4013225 4032444 4049532 4063661 4073492 4077910 4076883 4071363 4062334 4049943 4033497
49433 4033497 4012115 3985359 3953404 3916732 3875630 3829892 3779078 3723146 3662804 3599194 3533290
49422 3533290 3465680 3396774 3326999 3256802 3186708 3117285 3048828 2981160 2914126 2848337 2784952
49411 2784952 2724546 2666632 2610574 2556539 2505100 2456247 2409386 2364230 2321093 2280268 2241575
49400 2241575 2204773 2170086 2138089 2109134 2082938 2058583 2034918 2011223 1987765 1965803 1946965
49389 1946965 1932224 1920969 1911101 1900617 1889358 1878760 1869805 1861988 1854784 1849083 1845924 1844401 1842424
49376 1842424 1839572 1837722 1838363 1840733 1843447 1846737 1851776 1858427 1865089 1870822 1876626 1884456 1895588 1910010
49362 1910010 1926850 1945218 1964908 1986338 2009685 2034353 2059469 2084310 2107851 2128589 2145832
49351 2145832 2160864 2175912 2192075 2209191 2227494 2248024 2270992 2294964 2318465 2341584 2365254
49340 2365254 2389569 2413897 2438332 2464017 2491779 2521086 2550739 2580227 2609988 2640342 2670503
49329 2670503 2699050 2725434 2750606 2775797 2801078 2825661 2849316 2872523 2895253 2916673 2936603
49318 2936603 2956362 2977395 2999613 3021891 3043757 3065826 3088778 3112693 3137366 3162625 3188280
49307 3188280 3214207 3240590 3267847 3296501 3327213 3360431 3395492 3430727 3465136 3499599 3535675
49296 3535675 3573740 3613372 3655111 3700287 3748962 3799491 3850644 3902929 3957107 4012544 4068080
49285 4068080 4123840 4181283 4241886 4306509 4375361 4447628 4521550 4596007 4671922 4751217 4834418
49274 4834418 4920253 5007638 5097028 5189320 5284084 5379579 5474433 5568903 5664350 5761529 5859564
49263 5859564 5956887 6053087 6149146 6245546 6340869 6432862 6520350 6603308 6681637 6755008 6823677
49252 6823677 6888071 6947476 7000324 7046041 7085384 7118519 7144179 7161592 7172032 7177188 7176902 7170110
49240 7170110 7157549 7141913 7125188 7107235 7087328 7065847 7043841 7021921 7000452 6980147 6961655
49229 6961655 6944848 6929134 6914236 6900356 6888095 6878791 6874310 6875436 6880636 6887427 6895056 6904920 6918200
49216 6918200 6934186 6951549 6970193 6990623 7011893 7031562 7047886 7061130 7072289 7081352 7087403 7089689
49204 7089689 7087670 7080234 7065818 7043616 7014196 6978644 6937412 6890218 6836742 6777182 6712293 6643153
49192 6643153 6570854 6496298 6420184 6343057 6265055 6185582 6103766 6019728 5935260 5852810 5773685
49181 5773685 5697447 5622977 5549691 5477677 5407271 5338954 5273262 5210162 5148566 5087116 5025617
49170 5025617 4965294 4907461 4852376 4799618 4748956 4700362 4653609 4608691 4566495 4528311 4494502
49159 4494502 4464160 4436174 4410141 4386147 4364427 4345626 4330794 4320444 4313780 4309270 4305777 4302896
49147 4302896 4300535 4298728 4297683 4297528 4298060 4299110 4301084 4304746 4310447 4317818 4326197 4335273 4345470 4357812
49133 4357812 4373003 4390354 4408113 4425277 4442709 4461959 4483535 4506983 4532083 4558892 4586874
49122 4586874 4615147 4643595 4672704 4702315 4731671 4760791 4790445 4820407 4849252 4876593 4904099
49111 4904099 4933149 4962658 4990691 5017256 5043741 5070129 5094821 5117370 5139430 5162257 5184806
49100 5184806 5205548 5225184 5246089 5269361 5293606 5316881 5339037 5361722 5386536 5413726 5442627
49089 5442627 5472924 5505014 5539099 5574298 5609055 5642508 5675255 5708664 5743479 5779034 5813752
49078 5813752 5846357 5876621 5904901 5931335 5956005 5979831 6004500 6031034 6058788 6086226 6112304
49067 6112304 6136724 6159549 6181419 6203688 6227261 6251262 6273641 6293144 6310016 6324895 6338038
49056 6338038 6349772 6360629 6370623 6379201 6386351 6392904 6399222 6404413 6407571 6409109 6410128 6410988 6411418 6411589
49042 6411589 6412211 6413696 6415977 6418993 6422745 6427059 6431945 6437797 6444540 6451002 6456156 6460766 6466607 6474106
49028 6474106 6482048 6489807 6498348 6508289 6518199 6525970 6531098 6534466 6536587 6537473 6537998 6539938 6544135 6549361
49014 6549361 6553398 6554838 6553759 6551218 6548204 6544584 6539111 6531104 6521918 6513698 6506480 6497727 6485459 6470764
49000 6470764 6455975 6441118 6423728 6402174 6377756 6352991 6328880 6304559 6278951 6251826 6223482
48989 6223482 6194061 6163227 6130226 6094494 6056636 6018700 5982885 5949820 5918319 5886857 5855049
48978 5855049 5823752 5794121 5766806 5741764 5718554 5696799 5676572 5658346 5642436 5628406 5615222
48967 5615222 5602203 5589753 5578779 5569379 5560628 5552035 5544725 5540409 5539401 5540537 5543065 5547530 5554319
48954 5554319 5562419 5570621 5579291 5589692 5601751 5613781 5624591 5634775 5645463 5656632 5667346 5676975
48942 5676975 5685517 5693104 5699927 5706369 5712605 5718147 5722408 5725643 5728654 5731403 5732585 5730986 5727017 5722412
48928 5722412 5718521 5715293 5711976 5708269 5704277 5699530 5692934 5684130 5674435 5665587 5657498 5647947 5634774 5617872
48914 5617872 5598766 5578897 5558970 5539435 5520580 5501954 5482460 5461495 5439697 5418255 5397698
48903 5397698 5377644 5357487 5337094 5316933 5297819 5280553 5265590 5252871 5241967 5232340 5223549 5215454
48891 5215454 5208432 5203284 5200720 5200913 5203701 5209169 5217637 5228941 5242097 5256149 5271367 5289204 5310885
$$ [...]
##END NTUPLES=NMR SPECTRUM
##END=
