##TITLE=coffee_type TOFR01-ROVE100A_95-5%
COFFEE_meoh_noesyp64 COFFEE_meoh {C:\Bruker\TOPSPIN} Administrator 11
##JCAMPDX= 6.0         $$ Bruker NMR JCAMP-DX V2.0
##DATA TYPE= NMR SPECTRUM
##DATA CLASS= NTUPLES
##ORIGIN= Bruker BioSpin GmbH
##OWNER= Administrator
$$ 1.72 TOPSPIN		Version 2.1
$$ 2012-05-18 15:41:25.354 -0700  Administrator@X
$$ Compression mode = diff/dup
##.OBSERVE FREQUENCY= 400.13188235
##.OBSERVE NUCLEUS= ^1H
##.ACQUISITION MODE= SIMULTANEOUS (DQD)
##.ACQUISITION SCHEME= undefined
##.AVERAGES= 64
##.DIGITISER RES= 22
##SPECTROMETER/DATA SYSTEM= spect
##.PULSE SEQUENCE= noesygpps1d.comp
##.SOLVENT NAME= COFFEE_meoh
##.SHIFT REFERENCE= INTERNAL, COFFEE_meoh, 1, 14.98061
##AUDIT TRAIL= $$ (NUMBER, WHEN, WHO, WHERE, PROCESS, VERSION, WHAT)
$$ ##TITLE= Audit trail, TOPSPIN		Version 2.1
$$ ##JCAMPDX= 5.01
$$ ##ORIGIN= Bruker BioSpin GmbH
$$ ##OWNER= Administrator
$$ $$ C:\Bruker\TOPSPIN/data/Administrator/nmr/12-COFFEE-2002/112/pdata/1/auditp.txt
$$ ##AUDIT TRAIL=  $$ (NUMBER, WHEN, WHO, WHERE, PROCESS, VERSION, WHAT)
(   1,<2012-02-21 00:24:12.047 -0500>,<Administrator>,<TOPSPIN>,<go>,<TOPSPIN 2.1>,
      <created by zg
	started at 2012-02-21 00:12:41.781 -0500,
	POWCHK enabled, PULCHK disabled,
       configuration hash MD5:
       B0 76 FB 9C 50 81 44 7D 18 B3 26 32 4E 60 AD 96
       data hash MD5: 64K
       30 CA FD A8 80 34 5F 88 0E 43 E5 42 71 56 66 CE>)
(   2,<2012-02-21 00:24:14.828 -0500>,<Administrator>,<TOPSPIN>,<proc1d>,<TOPSPIN 2.1>,
      <Start of raw data processing
       efp LB = 0.3 FT_mod = 6 PKNL = 1 PHC0 = 0 PHC1 = 0 SI = 128K 
       data hash MD5: 128K
       5B 31 48 55 BE F6 F0 27 5D 04 FA FD EF 10 B8 A6>)
(   3,<2012-02-21 00:24:16.094 -0500>,<Administrator>,<TOPSPIN>,<proc1d>,<TOPSPIN 2.1>,
      <pk PHC0 = 22.24182 PHC1 = 0 
       data hash MD5: 128K
       3A B6 26 3B 30 EA 8A 61 9C 02 0E DA 27 4D 10 B8>)
(   4,<2012-02-21 00:24:16.344 -0500>,<Administrator>,<TOPSPIN>,<proc1d>,<TOPSPIN 2.1>,
      <abs ABSG = 1 
       data hash MD5: 128K
       7B 22 F1 77 FD A1 2E 2A CC 9B 38 6E 05 F4 90 BE>)
(   5,<2012-02-21 00:24:16.422 -0500>,<Administrator>,<TOPSPIN>,<proc1d>,<TOPSPIN 2.1>,
      <abs ABSG = 2 
       data hash MD5: 128K
       8F 36 56 15 FE 7F 59 3D 9C 85 3E 69 00 8E AB AF>)
(   6,<2012-02-21 00:24:16.547 -0500>,<Administrator>,<TOPSPIN>,<proc1d>,<TOPSPIN 2.1>,
      <abs ABSG = 3 
       data hash MD5: 128K
       48 6B 1C C5 41 BC B5 D4 C0 27 82 A5 00 43 98 1E>)
(   7,<2012-02-21 00:24:16.719 -0500>,<Administrator>,<TOPSPIN>,<proc1d>,<TOPSPIN 2.1>,
      <abs ABSG = 4 
       data hash MD5: 128K
       D9 6A E3 29 A9 84 4F BB 18 74 B1 9D 46 E7 72 0B>)
(   8,<2012-02-21 00:24:16.766 -0500>,<Administrator>,<TOPSPIN>,<proc1d>,<TOPSPIN 2.1>,
      <abs ABSG = 5 
       data hash MD5: 128K
       0B AF 49 B0 68 04 E0 BA D3 1C DE 83 58 6F CF EB>)
(   9,<2012-02-21 00:24:16.922 -0500>,<Administrator>,<TOPSPIN>,<audit>,<TOPSPIN 2.1>,
      <user comment:
       ICON-NMR User ID: Administrator
$$ [...]
150 150 150 150 150 150 150 150
##$TP07= 0
##$TPNAME0= <>
##$TPNAME1= <>
##$TPNAME2= <>
##$TPNAME3= <>
##$TPNAME4= <>
##$TPNAME5= <>
##$TPNAME6= <>
##$TPNAME7= <>
##$TPOAL= (0..7)
0.5 0.5 0.5 0.5 0.5 0.5 0.5 0.5
##$TPOFFS= (0..7)
0 0 0 0 0 0 0 0
##$TUNHIN= 0
##$TUNHOUT= 0
##$TUNXOUT= 0
##$USERA1= <user>
##$USERA2= <user>
##$USERA3= <user>
##$USERA4= <user>
##$USERA5= <user>
##$V9= 5
##$VALIST= <valist>
##$VCLIST= <CCCCCCCCCCCCCCC>
##$VD= 0
##$VDLIST= <DDDDDDDDDDDDDDD>
##$VPLIST= <PPPPPPPPPPPPPPP>
##$VTLIST= <TTTTTTTTTTTTTTT>
##$WBST= 1024
##$WBSW= 4
##$XGAIN= (0..3)
0 0 0 0
##$XL= 0
##$YL= 0
##$YMAX_a= 14784107
##$YMIN_a= -6901330
##$ZGOPTNS= <>
##$ZL1= 120
##$ZL2= 120
##$ZL3= 120
##$ZL4= 120
##$ABSF1= 14.98061
##$ABSF2= -5.57192
##$ABSG= 5
##$ABSL= 3
##$ALPHA= 0
##$AQORDER= 0
##$ASSFAC= 0
##$ASSFACI= 0
##$ASSFACX= 0
##$ASSWID= 0
##$AUNMP= <proc_prof1d_extract>
##$AXLEFT= 0
##$AXNAME= <>
##$AXNUC= <1H>
##$AXRIGHT= 0
##$AXTYPE= 0
##$AXUNIT= <>
##$AZFE= 0.1
##$AZFW= 0.1
##$BCFW= 0
##$BC_mod= 0
##$BYTORDP= 0
##$COROFFS= 0
##$CY= 15
##$DATMOD= 1
##$DC= 0
##$DFILT= <>
##$DTYPP= 0
##$F1P= 0
##$F2P= 0
##$FCOR= 0.5
##$FTSIZE= 131072
##$FT_mod= 6
##$GAMMA= 0
##$GB= 0
##$INTBC= 1
##$INTSCL= 1
##$ISEN= 128
##$LB= 0.3
##$LEV0= 0
##$LPBIN= 0
##$MAXI= 10000
##$MC2= 0
##$MEAN= 0
##$ME_mod= 0
##$MI= 0
##$NCOEF= 0
##$NC_proc= -3
##$NLEV= 6
##$NOISF1= 0
##$NOISF2= 0
##$NSP= 0
##$NTH_PI= 0
##$NZP= 0
##$OFFSET= 14.98061
##$PC= 1
##$PHC0= 22.24182
##$PHC1= 0
##$PH_mod= 1
##$PKNL= yes
##$PPARMOD= 0
##$PPDIAG= 0
##$PPIPTYP= 0
##$PPMPNUM= 2147483647
##$PPRESOL= 1
##$PSCAL= 4
##$PSIGN= 0
##$PYNMP= <proc.py>
##$REVERSE= no
##$SF= 400.13
##$SI= 131072
##$SIGF1= 0
##$SIGF2= 0
##$SINO= 400
##$SIOLD= 131072
##$SPECTYP= <>
##$SREGLST= <1H.CDCl3>
##$SSB= 0
##$STSI= 131072
##$STSR= 0
##$SW_p= 8223.68421052632
##$SYMM= 0
##$S_DEV= 0
##$TDeff= 65536
##$TDoff= 0
##$TI= <>
##$TILT= no
##$TM1= 0
##$TM2= 0
##$TOPLEV= 0
##$USERP1= <user>
##$USERP2= <user>
##$USERP3= <user>
##$USERP4= <user>
##$USERP5= <user>
##$WDW= 1
##$XDIM= 131072
##$YMAX_p= 502664162
##$YMIN_p= -204286949
##$CURPLOT= <Network HP LaserJet P1505>
##$CURPRIN= <$Network HP LaserJet P1505>
##$DFORMAT= <normdp>
##$LAYOUT= <+/1D_H.xwp>
##$LFORMAT= <normlp>
##$PFORMAT= <normpl>
##$SURQMSG= 1
$$ End of Bruker specific parameters
$$ ---------------------------------
##NTUPLES= NMR SPECTRUM
##VAR_NAME=  FREQUENCY,     SPECTRUM/REAL,   SPECTRUM/IMAG
##SYMBOL=    X,             R,               I
##VAR_TYPE=  INDEPENDENT,   DEPENDENT,       DEPENDENT
##VAR_FORM=  AFFN,          ASDF,            ASDF
##VAR_DIM=   131072,        131072,          131072
##UNITS=     HZ,            ARBITRARY UNITS, ARBITRARY UNITS
##FACTOR=    0.0627417313425165, 1,          1
##FIRST=     8223.62146879498, -4959,        -92807
##LAST=      0,             -403,            -95058
##MIN=       0,             -204286949,      0
##MAX=       8223.62146879498, 502664162,    0
$$ Real data points
##PAGE= N=1
##DATA TABLE= (X++(R..R)), XYDATA
$$ [...]
66823 4360308 4366060 4369122 4370962 4373264 4376094 4377888 4377402 4375186 4372616 4369944 4366108 4360275 4352689 4343932
66809 4343932 4334250 4323762 4312457 4299753 4284938 4268383 4251447 4234780 4217621 4199289 4180329
66798 4180329 4161303 4141307 4118778 4093457 4066628 4039679 4013217 3987328 3961910 3936718 3911548
66787 3911548 3886147 3859655 3830746 3798980 3765578 3732171 3699143 3665893 3632190 3598387 3564619
66776 3564619 3530720 3496754 3462860 3428860 3394821 3361587 3329745 3298322 3265660 3231474 3197018
66765 3197018 3163289 3130273 3097881 3066269 3034933 3002832 2969916 2937408 2906012 2874954 2843489
66754 2843489 2812205 2781803 2751470 2719748 2686585 2653440 2621538 2591027 2561723 2533711 2506884
66743 2506884 2480564 2453961 2426759 2399120 2371327 2343472 2315377 2286850 2258165 2230041 2202906
66732 2202906 2176456 2150308 2124846 2100791 2077919 2054798 2030098 2003845 1977163 1951209 1926779
66721 1926779 1904531 1884701 1866391 1847866 1828100 1807564 1787032 1766196 1744442 1722583 1702412
66710 1702412 1684184 1665846 1645549 1623933 1602982 1583416 1564466 1545626 1527287 1509699 1492524
66699 1492524 1475454 1458330 1440705 1422396 1404461 1388446 1374470 1361173 1347728 1334565 1321730
66688 1321730 1308087 1293037 1277763 1263551 1249889 1235517 1220644 1206619 1193781 1181169 1168381
66677 1168381 1156298 1145522 1135178 1123924 1111462 1098430 1085326 1072192 1059183 1046787 1035233
66666 1035233 1024073 1012684 1001204 990614 981691 974083 966790 959326 951938 944728 937223 928999 920225
66653 920225 911352 902780 894969 888168 881648 873909 864242 853598 843428 834307 826247 819531 814138 808874
66639 808874 802397 794999 788176 782382 776424 769411 762117 755736 750232 744875 739707 735333 731316 725891
66625 725891 717777 707848 698468 691210 685538 679817 673244 666378 659888 653496 646666 639825 634045 629542
66611 629542 625359 620764 616109 611733 606777 600163 592556 586193 582395 580038 577076 572942 568616 564747
66597 564747 560821 556359 551874 547974 544164 539356 533253 526570 520146 514617 510773 509228 509422 509631 508350
66582 508350 505336 501326 497334 494242 492278 490605 488137 485009 482390 480561 478219 474305 469465 464830
66568 464830 460414 455946 452366 450726 450016 447960 444142 440599 438767 437448 434839 431321 428823 428039 427628
66553 427628 426076 423245 419807 415933 411181 405522 400053 396316 394746 393975 392025 388155 383173 378189
66539 378189 373823 370636 369247 369355 369402 368159 366265 365272 365359 365077 363515 361676 361072 361627 361792 360422 357779
66522 357779 354757 351967 349753 348346 347377 345830 343183 340283 338308 337084 335530 333767 333398 334896 335979
66507 335979 333915 328904 323738 320381 318336 316492 314840 313615 312087 309508 306589 304838 304659 305063 305099
66492 305099 304719 304199 303569 302865 302341 302077 301725 300842 299222 296812 293616 289853 285987 282482 279710 278122
66476 278122 278096 279382 280930 281611 281023 279433 277088 274013 270529 267393 265012 262681 259221 254546 250104
66461 250104 247396 246360 245741 244856 244260 244498 244973 244663 243576 242720 242551 242127 240343 237684 236164 237228
66445 237228 240020 242107 241922 240178 238756 238583 238851 238100 235691 232371 229782 229278 230706 232273 232060 229858
66429 229858 227245 225855 226000 226935 227750 227662 226069 223111 219905 217622 216363 215367 214220 213283 212898 212700
66413 212700 212004 210602 208879 207255 205729 204082 202458 201576 202185 204235 206767 208669 209411 209061 207875
66398 207875 206100 203998 201807 199695 197787 196103 194556 193281 192933 194074 196148 197650 197616 196370 194415
66383 194415 191480 187628 184634 184748 187903 191328 192422 191262 189867 189811 191231 193512 196036 198316 199996
66368 199996 200814 200416 198503 195436 192346 190182 188865 187747 186685 186108 186176 186410 186258 185690 185137 185006 185189
66351 185189 184827 182844 179189 175430 173643 174597 177296 180128 182004 182533 181912 180880 180217 179954 179475 178561
66335 178561 177688 176974 175579 172901 169879 168252 168661 170180 171512 171895 170979 168795 166105 163927 162348
66320 162348 160526 158254 156695 156893 158147 158652 157385 154701 151575 149207 148979 151525 155596 158815 159990
66305 159990 159995 160217 161043 162218 163619 164766 164323 161267 156369 151608 148185 145902 144353 143713 144146 145297
66289 145297 146770 148450 149966 150542 149895 148751 147808 146743 145077 143742 144682 148577 153652 157215 158015
66274 158015 156837 155285 154515 154751 155303 154959 152963 149946 147511 146572 146328 145288 143115 140958 139919 139752
66258 139752 139339 138104 136565 135709 136193 137927 139925 140608 138894 135371 132044 130594 130942 131728 131910 131592
66242 131592 131505 132143 133410 134778 135556 135242 133845 131956 130455 129989 130585 131702 132844 134081 135664 137134
66226 137134 137407 136201 134877 135088 136705 137878 137299 135591 134159 133436 132981 132746 133290 134763 136482 137764
66210 137764 138646 139415 139763 138884 136444 133247 130753 129884 130312 130950 130987 130300 129099 127799 127249 128292 130512
66193 130512 131971 131035 128277 125845 125172 126067 127797 129862 131498 131686 130442 129186 129016 129254 128583 127028
66177 127028 125677 124841 123768 122228 121122 121059 121318 120862 119697 118635 118246 118688 120107 122400 124798 126418
66161 126418 127222 127880 128711 129423 129974 130936 132521 133821 133678 132060 129974 128120 126365 124747 124210 125659
66145 125659 128604 131367 132576 131960 129756 126124 121551 117265 114610 114031 115030 117023 119812 123190 126463
66130 126463 128642 129122 128134 126609 125535 125329 125722 126180 126308 125938 125122 124154 123359 122762 122199 121822 122050 122781
66112 122781 123118 122394 121192 120759 121508 122611 123014 122336 120770 118693 116574 114860 113749 113269 113530 114569
66096 114569 115989 117253 118342 119554 120589 120493 118859 116626 115285 115621 117430 119964 122251 123351 122893
66081 122893 121282 119202 117118 115385 114346 113892 113304 112000 110204 108530 107324 106879 107754 109985 112222
66066 112222 112643 110898 108391 106475 105176 104079 103657 104916 107996 111730 114503 115227 113815 111293 109344
66051 109344 109050 109851 110193 109465 108921 110224 113216 115673 115511 113022 110671 110697 113042 115634 116488 115369
66035 115369 113478 111798 110099 107629 104440 101643 100334 100660 102060 103983 106038 107723 108624 108903 109148
66020 109148 109668 110283 110876 111724 113040 114527 115647 116076 115673 114369 112488 110974 110834 112268 114577 116853
66004 116853 118499 119228 118967 118010 116986 116437 116367 116323 115970 115531 115506 115930 116212 115993 115949 117193 119841 122642
65986 122642 124275 124637 124646 125216 126658 128576 129862 129194 126224 122183 118768 116517 114780 113118 112049 112263
65970 112263 113693 115625 117331 118307 118222 117053 115286 113829 113619 115064 117629 120092 121540 122209 123136 125036
65954 125036 127672 130180 131705 131827 130848 129749 129529 130460 132181 134363 136833 139081 140289 140104 139096
65939 139096 138270 138347 139403 140683 140797 138891 135888 133889 133869 134691 134993 135268 136984 140061 142578 143214 142822
65922 142822 142995 143951 144685 144735 144833 145838 147794 150154 152349 153797 153879 152467 150417 149099 149331 150863 152855
65905 152855 154592 155715 156117 155890 155372 154954 154709 154198 152774 150250 147353 145349 144981 145819 146901 147949
65889 147949 149602 152364 155702 158450 159861 160017 159437 158620 157870 157265 156792 156630 157052 157850 158118 157004 154613
65872 154613 151827 149335 147168 145052 142800 140418 138217 136840 136826 138035 139715 141061 141576 141245 140826
65857 140826 141644 144415 148287 151650 153668 154291 153109 149612 144899 141690 141684 143747 145616 146589 147397 148151
65841 148151 147956 146604 145266 145119 146111 147488 148786 149946 151007 152078 153145 153602 152510 149789 146739
65826 146739 144894 144595 145069 145641 146330 147317 148385 149207 149963 151218 153070 154689 155069 154204 153112 152581 152380
65809 152380 152014 151681 151814 152110 151901 151430 151759 153183 154625 155069 154792 154556 154204 152880 150320 147194 144241
65792 144241 141696 139573 137987 137134 137170 138068 139407 140586 141625 143360 146278 149409 151113 150853 149490
65777 149490 147907 146207 144479 143345 143122 143098 142377 141074 139978 139274 138392 137147 136258 136386 137102 137309 136590
65760 136590 135823 136331 138638 142132 145767 148751 150603 151013 150102 148597 147292 146384 145646 145093 144886 144710
65744 144710 144056 143296 143657 145635 148109 149592 149802 149363 148644 147731 147077 147002 146710 144951 141864 139187 138330
65727 138330 139015 140126 141019 141477 141187 140032 138581 137667 137635 138357 139611 141038 141955 141701 140088 137440 134488
65710 134488 132314 131671 131894 131113 128320 124907 123350 124501 126860 128451 128682 128282 128202 128951 130552 132553
65694 132553 134149 134612 133748 131972 129955 128149 126686 125738 125721 126747 127926 127844 125919 122817 119368 115863
65678 115863 112786 111298 112024 113874 115096 115150 114641 113796 112286 110486 109580 110112 111522 113387 115837 118220
65662 118220 118691 116265 112496 109983 109650 110402 110945 110861 110105 108648 106900 105661 105340 105753 106761 108440
65646 108440 110383 111561 111362 110407 109799 109721 109192 107318 104471 102095 101397 102360 104063 105761 107309 108542
65630 108542 108861 108007 106943 107112 108584 109588 108432 105511 102851 101888 102354 103311 104441 105901 107512 108773
65614 108773 109454 109645 109370 108800 108675 109788 111832 113392 113331 111697 109098 105957 102821 100688 100285 101430
65598 101430 103673 106977 110979 114135 114839 113377 111732 111294 111614 111561 110721 109303 107564 105924 105027 104995
65582 104995 104977 103967 101888 99577 97943 97427 98018 99475 101522 103922 106310 108198 109411 110308 111117 111404
65566 111404 110754 109602 108525 107106 104727 102284 101606 102969 104726 105832 106961 108307 108203 105515 101996
65551 101996 100242 100211 99834 98634 98528 100817 104297 106966 108154 108319 107897 107157 106393 105642 104836 104529 105675
65534 105675 108254 110889 112312 112562 112258 111448 109870 107817 105998 104680 103584 102520 101763 101814 102913 104656
65518 104656 106050 106338 105888 105815 106467 106737 105271 102107 98700 96446 95488 94912 93846 92359 91371 91701 93232
65501 93232 95064 96328 96659 96105 95008 93975 93472 93287 92687 91356 89958 89610 90908 93507 96494 99099
65485 99099 101096 102525 103167 102695 101461 100595 100769 101266 100882 99602 98718 99389 101685 104894 108018 109957
65469 109957 110102 109092 108352 108544 108998 108979 108954 110036 112347 114453 114572 112405 109779 109240 111726 115754 119083
65452 119083 120759 121187 120889 120168 119631 119878 120629 121179 121809 123655 126962 130608 133771 136923 140459 143303
65436 143303 143833 141659 137788 133523 129871 127574 126970 127944 130316 133866 137810 140935 142609 143010 142090
65421 142090 139476 135970 133955 135092 138380 141657 144373 147540 151495 155305 158341 160910 163088 164209
65407 164209 164084 163669 163846 164185 163562 161591 159050 157116 156461 156773 156890 155636 152812 149432 146945 146179
65391 146179 146692 147040 145967 143578 140930 138334 134775 129585 123957 119905 118157 117994 118690 119830 120433
65376 120433 119301 116676 114324 113337 112710 110864 107838 105157 103895 103587 103064 101861 100703 100682 101988 103599
65360 103599 104431 104506 104544 104730 104691 104595 105232 106683 107879 108105 108262 109878 113202 116952 119743 121259 122095 122937
65342 122937 124030 125278 126749 128875 131920 135361 138183 139772 140176 139661 138618 137815 137939 138738 139369 139802
65326 139802 140996 143297 145625 146915 147642 149081 151659 154922 158628 162844 167206 171117 174748 178903
65312 178903 183686 188033 190939 192760 195061 199410 206242 214465 222176 228278 233540 239809 248154 258061
65298 258061 268251 277574 284940 289082 289181 285820 280994 276883 274331 272401 269509 265160 260369 256245
65284 256245 252585 248286 242845 236807 230859 225235 220193 216304 213781 211874 209409 205807 201371 196740
65270 196740 192318 188133 184125 180561 178098 177121 177109 177006 176229 174784 172344 167970 161301 153541 146610
65255 146610 141490 137896 135299 133506 132218 130718 128480 125784 123412 121861 120975 120174 118808 116449 113161
65240 113161 109732 107487 107462 109406 111707 112839 112917 113354 114723 115745 115011 113132 112053 112342 112364 110499
65224 110499 107274 104612 103653 103971 104507 104542 103946 103030 102107 100981 99280 97577 97387 99298 101722 102631 102101
65207 102101 101824 102169 101399 98407 94824 93203 93882 94856 94494 93347 93205 95111 98524 102013 104567 106382
65191 106382 108332 110699 112736 113598 113274 112360 111496 111472 113237 116928 121193 124331 126086 127551 129365 130795
65175 130795 130862 129625 127943 126340 124563 122148 119217 116703 115656 116120 116853 116388 114254 111035 107739
65160 107739 105530 105438 107345 109415 109608 107871 106001 105258 105119 104646 103946 103581 103414 102984 102481 102470 102875 102983
65142 102983 102369 101222 99868 98571 97794 98157 99903 102510 104770 105257 103139 98984 94654 92084 92098 94275
65126 94275 97514 100468 102022 101939 100942 99855 98796 97398 95436 92939 90149 87819 87041 88067 89604
65111 89604 90075 89559 89699 91595 94416 96364 96534 95477 94303 93626 93420 93593 94418 96105 98004 98729 97441
65094 97441 94784 92281 91030 91224 92581 94627 96707 98203 98861 98788 98392 98465 99858 102553 105435 107481
65078 107481 108788 109872 110483 110065 109031 108479 108651 108754 108437 108326 108733 108880 108009 106527 105428 105209 105878
65061 105878 107442 109671 111780 112999 113287 113213 113510 114984 118131 122148 124930 124960 123023 121285 120781 120582
65045 120582 119519 117950 117465 119203 122812 126897 130312 133007 135710 138950 142635 146542 150797 155639
65031 155639 161029 166720 172461 177992 183223 188652 195085 202542 209828 215645 219723 222468 224059 224610
65017 224610 224754 225113 225359 224639 222910 220930 218899 216042 211758 206337 200184 193225 185663 178603 173080
65002 173080 168801 164506 159414 153734 147917 142041 136066 130239 125115 121376 119651 120120 122068 123898
64988 123898 123858 121052 116001 110303 105529 102234 100054 98618 98045 98390 99033 99125 98583 98159 98338 98473 97404
64971 97404 94902 92204 90851 91169 92140 92778 93265 94469 96599 98775 99904 99694 98725 97806 97352 97154 96623
64954 96623 95338 93446 91555 90328 90214 91199 92440 92504 90670 88048 86738 87655 89740 91558 92997 94853
64938 94853 97265 99346 100156 99444 97467 94697 91802 89403 87647 86268 85145 84515 84541 84968 85376 85578
64922 85578 85706 86019 86683 87567 88241 88271 87608 86636 85979 86342 88223 91327 94266 95383 94275 92421 92055
64905 92055 94281 98184 101629 102918 101876 99546 97079 95058 93684 93058 92934 92595 91503 90019 88986
64890 88986 88643 88404 87795 87133 87025 87486 87778 86994 84840 82202 81013 82948 87765 93086 96241 96421 94978
64873 94978 93865 94028 95157 96558 97994 99619 101258 102051 101129 98614 95698 93677 93058 93522 94432 95341
64857 95341 96330 97822 99726 100958 100490 98990 98507 100087 102392 103283 102110 99678 96682 93383 90591
64842 90591 89549 90456 91980 92724 92546 92156 92061 92329 92826 93229 93212 92962 93103 93848 94745 95509 96338 96902 95895
64823 95895 92642 88685 86588 87170 88853 89790 89639 89057 88579 88685 90165 93389 97372 100306 101124 100330
64807 100330 99428 99826 101949 104880 106932 106992 105316 102862 100178 97463 95336 94508 94477 93508 90641 87197
64791 87197 85504 86407 88814 91520 94399 97403 99414 99178 97149 95361 95140 95651 95207 93545 92129 92293
64775 92293 93773 95325 96282 96966 97726 98138 97465 95741 94023 93483 94322 95668 96426 96108 95008 93913 93723
64758 93723 94875 96715 97770 97245 96190 96400 97975 98838 97336 94574 93153 93902 95162 95463 95594 97197
64742 97197 100169 102608 103053 101817 100127 98797 98000 97642 97498 97246 96765 96364 96625 97999 100396 103022
64726 103022 104814 105357 105205 105037 104788 104074 103121 102475 101969 100945 99506 98549 98271 97823 97014 97150 99155
64709 99155 101743 102832 102288 101885 102677 103805 104043 103291 102201 101425 101675 103478 106144 107824 107352 105515
64693 105515 103958 103485 104046 105567 107737 109446 109620 108571 107623 107407 107342 106848 106202 105915 106056 106507 107267
64676 107267 108113 108443 107906 106904 106118 105833 105956 106339 106725 106727 106329 106190 106917 108100 108508 107385 105287 103538
64658 103538 103134 104251 106456 108969 110782 110992 109403 106658 103569 100450 97468 95399 95251 96868 98675
64643 98675 99420 99575 100263 101357 101767 101378 101320 102087 102724 102483 102082 102379 102811 102369 101456 101421 102584 104043 105375
64624 105375 107108 109314 110972 111367 111160 111481 112609 114094 115464 116255 115964 114683 113370 112809 112667 112168
64608 112168 111304 110629 110149 109272 107993 107336 108208 110187 111851 112302 112211 113205 116142 120078 123220 124717 125106
64591 125106 125089 124763 124252 124134 124551 124681 124054 123743 125104 127702 129746 130474 130751 131129 130736 128742 125827
64574 125827 123342 121754 120697 119872 119052 117728 115755 114016 113478 113682 113101 111075 108648 107253 107192 107665
64558 107665 107799 107327 106636 106471 107367 109119 110965 112430 113793 115490 117218 117900 116678 113923 111233 110313
64542 110313 111634 114137 116370 117911 119537 121971 124831 127054 128143 128548 128763 128613 127811 126792 126351
64527 126351 126528 126627 126468 126872 128357 130023 130568 130104 130022 131048 132226 132054 130044 126960 124063 122347 122050
64510 122050 122634 123426 124261 125125 125457 124700 123463 123139 124078 125193 125804 126653 128270 129416 128481 125866 123705
64493 123705 123386 124394 125464 125868 125607 125346 126152 128392 130789 131534 130493 129408 129568 130156 129449 127017
64477 127017 124102 122154 121561 121711 121895 121992 122270 122625 122485 121684 120964 121026 121498 121539 121124 120900 120971 120867 120602
64458 120602 120565 120243 118436 115292 112905 113003 114951 116977 118556 120385 122517 123889 123791 122759 121694 120834
64442 120834 120017 119429 119550 120439 121381 121352 119848 117244 114378 111883 110126 109551 110617 113162 116132 118238
64426 118238 118915 118640 118463 119139 120469 121509 121611 121121 120813 121007 121702 123129 125277 127043 126947 124922 122550
64409 122550 121265 121147 121679 122688 124007 125135 125910 126746 127640 127705 126459 124829 124100 124528 125743 127746
64393 127746 130465 132978 134415 135265 136602 138231 138844 137961 136535 135458 134560 133422 132213 131274 130525 129821
64377 129821 129453 129879 131116 132560 133319 132982 132301 132720 134694 136803 137281 136101 134687 133808 132847 131217
64361 131217 129347 127855 126712 125780 125468 126220 127811 129608 131201 132469 133395 134153 135008 135907 136568 137106
64345 137106 138028 139332 140215 140110 139548 139533 140397 141751 143223 144617 145464 145085 143417 141496 140724 141521 142844
64328 142844 143357 143071 143386 145260 147851 149537 149885 149851 150248 150934 151543 152061 152373 152025 150918 149615 148577
64311 148577 147662 146690 145866 145165 143967 141968 139991 139167 139577 140268 140417 139967 139355 139180 140016 141961 144370
64294 144370 146399 147801 148886 149843 150513 150760 150686 150390 149808 148823 147514 146330 146028 147099 149105 150975
64278 150975 152250 153543 155294 156618 156368 155165 155250 157818 161335 163288 163108 162444 162758 163782 164733 165938
64262 165938 168259 171471 174461 176974 179846 183106 185261 185469 185369 187263 190900 193622 193757 192432 191690
64247 191690 192083 192730 192690 191466 189007 186150 184477 184971 187098 189774 192692 196030 199343 201668 202509 202090
64231 202090 200949 199988 200575 203663 208771 214489 219876 224717 228675 231331 233336 236525 242115 249114 254999
64216 254999 257875 257765 256098 254356 253235 252791 252996 253858 255096 256201 257068 258129 259509 260471 260165 258544
64200 258544 255948 252180 246991 241301 236811 234018 231567 228153 224357 221951 221864 223533 225831 227840 228871
64185 228871 228634 227626 226799 226606 226870 227728 230047 234302 239489 243931 247165 250289 254290 258737 262691
64170 262691 266341 270863 276686 282685 287375 290405 292529 294475 296315 297719 298397 298222 297162 295231 292526
64155 292526 289371 286299 283645 281200 278513 275646 273273 271906 271323 270999 270834 271190 272451 274813 278398
64140 278398 283175 288697 294008 297955 299845 300028 299719 299925 300615 301325 302336 304547 308082 311779 314382
64125 314382 315620 315803 315076 313586 311818 310158 308561 307153 306590 307196 308187 308429 307557 305877 303818 302255
64109 302255 302494 304647 306569 305934 303324 301751 302997 305841 308354 310451 313289 317318 322132 327669 334361
64094 334361 342251 350723 359166 367553 376434 386535 398076 410361 422431 434215 446399 458974
64082 458974 470772 480875 489632 497599 504336 509294 513137 516812 519559 519302 515240 508782 501511 493406
64068 493406 483847 473374 463311 454115 445243 436595 429027 423139 418425 414142 410427 407846 406176 404463
64054 404463 402297 400299 399057 398316 397707 397732 399179 401753 404225 406142 408571 412698 418299 424262 430200
64039 430200 436721 444151 451836 459083 466327 474878 485653 498403 512058 525541 538346 550633 562839
64026 562839 575032 586525 596308 603952 609955 615025 619150 621563 621545 618912 613771 606304 597144 587614
64012 587614 579043 571845 565558 559750 554449 549680 545146 540716 536891 534302 532837 531658 530163 528600
63998 528600 527635 527620 528544 530574 534210 539728 546634 553918 560967 568199 576767 587692 601207 616766
63984 616766 633497 650679 667965 685400 703337 722181 741880 761573 780006 796646 812277
63973 812277 828120 844334 859789 873431 885410 896488 906632 914874 920714 925250 930447 937328
63961 937328 945233 953076 961043 970564 982524 996107 1009838 1023358 1037475 1052666 1068413 1084134
63949 1084134 1099955 1116151 1132556 1149052 1166089 1184050 1202535 1221050 1240143 1261125 1284829
63938 1284829 1311312 1340691 1373424 1409615 1448724 1490338 1534744 1582504 1633872 1689086 1748904
63927 1748904 1814338 1885771 1962565 2043761 2129168 2219754 2316961 2421738 2534267 2654263 2781093
63916 2781093 2913874 3052363 3198077 3353740 3520987 3699154 3886962 4084988 4295791
63907 4295791 4522082 4765724 5028354 5312011 5619039 5952227 6315382 6713360 7151475
63898 7151475 7635314 8170949 8764613 9421953 10147831 10946224 11819082 12764860 13778639
63889 13778639 14853650 15982010 17154254 18359172 19584046 20813454 22026903 23198417
63881 23198417 24299431 25302456 26183017 26920633 27499977 27911201 28148382 28207536 28086085
63872 28086085 27783591 27302923 26651894 25844832 24902348 23848959 22710724 21513963 20283461
63863 20283461 19039881 17799299 16576186 15385906 14243096 13158479 12138782 11189058
63855 11189058 10313099 9511670 8782303 8121304 7524547 6986263 6499361 6058333 5660568
63846 5660568 5303584 4982140 4689605 4421440 4175736 3950862 3744430 3554652 3380796
63837 3380796 3221322 3072759 2931662 2797162 2670570 2552725 2442606 2338364 2238665 2142745
63827 2142745 2050069 1960535 1874573 1792475 1713955 1638819 1567661 1501217 1439167 1380275 1323757
63816 1323757 1269948 1219520 1172644 1129118 1088772 1051398 1016609 984041 953471 924639 897316
63805 897316 871568 847416 824174 800887 777788 756487 738082 721807 706329 691732 679056
63794 679056 668243 657933 647509 638066 630787 625303 620476 616145 613159 611854 611201 609515 605588 599302
63780 599302 591659 584208 577816 571652 563661 552333 537904 521812 505341 489113 473608 459456
63768 459456 446934 435504 424223 412602 400937 389940 380226 371921 364420 356565 347574 337966 329310
63755 329310 322755 317910 313318 307918 301920 296433 292445 290111 288738 287298 285011 281668 277596 273390
63741 273390 269524 266051 262607 258717 254179 249381 245426 243651 244398 246149 246563 244737 241995 240001 238753
63726 238753 237045 234339 231115 227686 223890 220104 217450 216544 216787 217202 217295 216801 215451 213531 211956 211191
63710 211191 210575 209242 207241 205257 203727 202794 202664 203399 204627 205919 207134 208102 208428 208154 208203 209678
63694 209678 212907 217337 221799 224721 225089 223905 223851 226569 230833 234282 236274 237926 239992 242267 244899
63679 244899 248742 254030 259892 265589 271310 277376 283634 290077 297209 305289 313879 322681 332084 342280
63665 342280 352519 362014 371113 380684 390544 399367 406146 410898 413734 414141 411898 408186 404719 401742
63651 401742 397805 391951 385272 379543 374950 370232 364686 358741 352565 345496 337285 328708 320343 311965
63637 311965 303863 297502 293698 291142 288065 284561 281919 280408 279342 278823 279582 281213 282339 282717 283660
63622 283660 286174 290222 296058 304495 315164 326146 336252 346354 357527 369241 380631 392222
63610 392222 404707 416703 425535 430231 432328 433555 433877 432281 428604 423880 419073 413886 406994 397599
63596 397599 386759 376846 369467 364256 359823 355387 351073 347117 343469 340111 337236 335083 333885 333901
63582 333901 335248 337726 340989 344805 349065 353750 358975 364918 371621 379160 388028 398919 411815 425610
63568 425610 438938 451382 463892 478186 495534 515686 537168 559088 582388 608470 636880
63557 636880 665652 694231 724615 758716 795650 832673 867906 900838 930768 956408 977211
63546 977211 993853 1007026 1016567 1022155 1024167 1023432 1020667 1016546 1011920 1007385 1002648 996604 988255 977602
63532 977602 965557 952731 938370 920962 900073 877072 853705 830570 807672 785893 766827
63521 766827 751043 737403 724402 711559 699192 687514 676549 666670 658612 652820 648992 646389
63509 646389 644671 644439 646799 652179 659714 668124 677143 687729 700932 717105 736274 758473 783127
63496 783127 808749 834413 861472 892674 928898 967523 1004857 1039602 1072789 1104468 1132038
63485 1132038 1152652 1166306 1175476 1182261 1186988 1189466 1190287 1190455 1190487 1190521 1190889 1191880 1192865 1191939 1186766 1176055
63469 1176055 1160272 1140544 1116885 1088197 1054431 1017852 981157 944831 907560 868953 830504
63458 830504 793810 759367 727485 698892 673544 650008 627174 605770 587157 571210 556501
63447 556501 542158 528496 515975 504548 494141 485092 477933 473041 470476 469958 471177 474200 479000
63434 479000 484452 488749 491506 494763 500915 510065 520257 529978 539534 550336 563766 580478 599590
63421 599590 618525 634671 647536 658571 668757 677249 682611 684479 683476 680112 674423 666380 656195
63408 656195 644341 631644 619322 608588 599984 592948 586172 578752 571231 565158 561393 559111 556767
63395 556767 553586 549728 545602 541847 539712 540475 544236 549815 555896 561779 567194 572157 577389 584305
63381 584305 594153 607171 622570 639184 656370 674655 695397 719491 746528 775506 805989 838057
63369 838057 871515 905964 941582 979071 1018823 1060746 1104840 1151191 1199229 1247611 1294841
63358 1294841 1339386 1379191 1412002 1436624 1453394 1463201 1466597 1464133 1457045 1447242 1436734 1426827
63346 1426827 1417250 1406157 1391821 1374443 1355446 1334835 1310330 1279766 1243613 1204474 1164785
63335 1164785 1125759 1087990 1052058 1018505 987843 960514 936435 914814 895020 877580 863715
63324 863715 853777 846545 840219 833992 828656 825878 826820 831347 838625 848345 860970 876720 894963 915041
63310 915041 937171 961937 989241 1018550 1049926 1083939 1120478 1158558 1197567 1237886 1279667
63299 1279667 1321603 1361626 1398312 1430793 1457659 1477141 1488653 1493366 1492901 1488211 1480051 1469595
63287 1469595 1457805 1444818 1430734 1416315 1401821 1385650 1365549 1341123 1313823 1284391 1251932
63276 1251932 1216036 1178308 1140685 1103427 1065968 1028905 993740 961112 930553 901712 874687
63265 874687 849347 825383 802925 782169 762556 743465 725565 710323 698067 687714 678608 671374
63253 671374 666371 662440 658020 652941 648260 644672 641813 639021 636270 634023 632329 630366 627257 623263
63239 623263 619548 616557 613513 610027 607212 606107 605821 604679 602687 601257 600752 600112 598993 598376 598528
63224 598528 598173 596662 595432 596162 598587 601205 603160 604428 605059 605371 606114 607423 608339 608326 608377 609452 610760
63207 610760 611062 611032 612617 616240 620287 623492 626379 630002 634511 639491 644766 650243 655639 660961 666828
63192 666828 673975 682677 692769 703805 715120 726268 737632 750160 764218 779064 793738 808201
63180 808201 823325 839855 857693 876406 896287 918485 943699 970894 998021 1024213 1050745
63169 1050745 1079458 1110698 1143142 1175148 1205791 1235093 1263956 1293596 1324422 1355477 1385375
63158 1385375 1413544 1440343 1466410 1492377 1518564 1544128 1566904 1585079 1598936 1610133 1619223
63147 1619223 1624600 1623966 1616258 1602096 1582984 1560275 1534526 1505794 1474674 1442676 1411190 1380639
63135 1380639 1351375 1324820 1302546 1284360 1268501 1253879 1241113 1231113 1223805 1218764 1216186 1216566
63123 1216566 1220071 1226907 1237796 1253362 1273195 1295903 1319905 1343975 1367498 1390548 1413472 1436145
63111 1436145 1458003 1478946 1499684 1520741 1541462 1560338 1576081 1588176 1596832 1602612 1605697 1605192
63099 1605192 1599696 1588946 1574376 1557491 1538177 1515268 1488454 1458816 1427730 1396104 1364767
63088 1364767 1334783 1306952 1281377 1257731 1235668 1214912 1195378 1177354 1161139 1146332 1132037
63077 1132037 1118119 1105715 1095844 1087818 1079913 1071734 1065137 1062230 1062922 1065074 1066864 1068305 1070366 1073359
63063 1073359 1076696 1079864 1082943 1086220 1089861 1094191 1099901 1107445 1116192 1124477 1130780 1134933 1138128 1141730
63049 1141730 1146202 1151165 1156163 1161040 1165714 1170118 1174530 1179512 1185179 1190728 1195007 1197469 1198497 1199054
63035 1199054 1200198 1202512 1205591 1208303 1209965 1211051 1212377 1213937 1215322 1217075 1220680 1226823 1234406 1241871
63021 1241871 1249059 1257213 1267463 1280009 1294593 1311004 1328789 1347065 1365167 1383360 1402425 1422514
63009 1422514 1442877 1462963 1483500 1506005 1531251 1558619 1587066 1616351 1647019 1679498 1713669
62998 1713669 1749349 1786820 1826709 1869401 1914657 1961843 2010641 2061586 2115678 2173224 2233113
62987 2233113 2293494 2353163 2412189 2471251 2530710 2590450 2650409 2710861 2771860 2832452 2890886
62976 2890886 2946105 2999004 3051795 3106014 3161453 3216995 3271807 3325244 3376098 3422520 3462465
62965 3462465 3493744 3513978 3521383 3515791 3498404 3470375 3432012 3383489 3326006 3262030 3194537 3125963
62953 3125963 3057645 2990277 2925025 2863920 2808693 2759389 2714784 2674226 2638552 2609135 2586625
62942 2586625 2570763 2560717 2555314 2553711 2556470 2565340 2581106 2601908 2624549 2647376 2670994 2696130
62930 2696130 2721805 2746230 2768806 2790437 2812103 2833786 2854566 2872994 2887288 2895922 2898428 2895150
62918 2895150 2885898 2869362 2844313 2810919 2770200 2722502 2667396 2605165 2537620 2467089 2395118
62907 2395118 2322407 2249600 2177641 2107541 2039952 1974763 1911214 1848965 1789276 1734452 1685684
62896 1685684 1641905 1601228 1562999 1527778 1495790 1466306 1438534 1412380 1388143 1365955 1345639
62885 1345639 1326761 1308800 1291626 1275751 1261661 1248815 1235761 1221405 1205837 1189855 1174090
62874 1174090 1158760 1143819 1128996 1113879 1098368 1083115 1069279 1057595 1047637 1038169 1028460 1019150
62862 1019150 1011495 1005705 1000408 994035 986389 978617 971925 966732 962849 960017 958157 957214 956800 956058 954278
62847 954278 951658 949073 946914 944754 942350 940245 938910 937954 936907 936176 936375 937146 937566 937476 937438 937506 936997
62830 936997 935503 933343 930990 928718 926758 924953 922344 918047 912685 908077 905280 903692 902136 900000
62816 900000 897127 893590 890027 887474 886375 886343 887098 888969 892152 896181 900431 904340 906837 906492 903012
62801 903012 898001 893559 890425 887850 884763 880700 876089 872103 869761 868892 868434 867924 867892 868597 869379 869779
62785 869779 870261 871124 871743 871813 872406 874512 877302 879239 880388 882168 885015 887863 890045 892224 894956 897539
62769 897539 898993 899335 899249 899084 898786 898382 898044 897933 898343 899793 902733 907261 913014 918966 923554 925858
62753 925858 926933 929256 934298 941004 947066 951324 954458 957692 961491 965603 969970 975288 982675 992729
62739 992729 1005006 1018590 1033159 1049189 1067083 1086604 1107366 1129464 1153185 1178431 1204923
62728 1204923 1232775 1262412 1294146 1328403 1366230 1408679 1455424 1504761 1555594 1609012 1667355
62717 1667355 1732120 1803379 1880770 1963962 2052036 2143414 2236839 2331824 2427808 2523561 2617734
62706 2617734 2709169 2795927 2874686 2942007 2995926 3035626 3060172 3068609 3061007 3038233 3000806 2949158
62694 2949158 2885012 2811147 2729416 2640216 2544585 2445628 2346912 2250157 2155363 2062483 1972005
62683 1972005 1884437 1800386 1721053 1647697 1580503 1518539 1460779 1406741 1356302 1309532 1266612
62672 1266612 1227435 1191437 1158295 1128443 1102233 1078871 1057096 1036860 1019306 1004880 992448
62661 992448 980907 970847 963747 959868 957884 956614 956423 958571 963673 971155 979949 989260 998888 1009441
62647 1009441 1022386 1039236 1060152 1083679 1108332 1134237 1162743 1194765 1230213 1268836 1310656
62636 1310656 1355580 1403597 1455664 1513285 1576483 1643020 1710406 1778062 1846706 1916253 1985336
62625 1985336 2052411 2116041 2174135 2224078 2263990 2293070 2310567 2315276 2306566 2285337 2253461 2212606
62613 2212606 2163865 2108051 2045845 1977953 1905648 1831100 1756727 1683994 1613083 1543929 1477418
62602 1477418 1415194 1358182 1305627 1255930 1208204 1162606 1119415 1078630 1040595 1006110 975327
62591 975327 947109 920107 894167 870100 848446 829043 811541 795632 780901 767038 754091
62580 754091 742036 730299 718366 706647 696021 686572 677543 668622 660482 653770 648240 643258 638636
62567 638636 634512 630795 627231 623955 621594 620756 621463 623093 624894 626664 628901 632157 636397 641179 646286
62552 646286 651871 658049 664789 672267 680954 691226 703074 716434 731613 749066 768541 788687
62540 788687 808069 826892 847279 871260 898733 928108 958684 991268 1026423 1063602 1102650
62529 1102650 1144804 1191036 1240341 1290992 1342660 1395700 1448736 1498705 1543404 1582582 1616288
62518 1616288 1643495 1662727 1672900 1673218 1663581 1645726 1622685 1596161 1565311 1528986 1488306 1445888
62506 1445888 1403033 1358904 1312523 1264714 1217981 1174925 1136735 1102634 1070678 1039479 1009243
62495 1009243 981040 955300 931341 908301 886048 865029 845430 826767 808375 790207 772921
62484 772921 757203 743304 731397 721853 714474 707764 699838 690426 681407 675068 672142 671666 672325 673553
62470 673553 675567 678588 682082 684901 686516 688077 691794 699089 709542 721618 734085 746690 759918
62457 759918 774352 790228 807608 826951 849028 873971 900884 929060 959202 992686 1029824
62446 1029824 1069547 1110540 1151753 1192054 1230471 1266769 1300730 1330985 1355902 1375663 1391792
62435 1391792 1404050 1409416 1405300 1392674 1374852 1354002 1329997 1302050 1270284 1236010 1201332 1168090
62423 1168090 1136510 1105439 1074605 1045880 1021243 1000216 980606 961299 942932 926135 910717
62412 910717 896726 884910 875658 868543 863252 859874 857817 855554 852348 849501 848938 850897 853783 856135
62398 856135 858015 860449 864082 868761 874127 880232 887417 895746 904762 913771 922231 929944 937191 944630
62384 944630 952536 959970 965258 967646 967963 967178 964878 959890 951972 941955 930347 916797 901115 884139
62370 884139 867291 851767 838219 826611 816165 805975 795903 786509 778037 770060 762292 755188
62358 755188 749436 745420 743501 744253 747801 753188 758997 764532 770078 776190 783183 791219 800394 810553
62344 810553 821228 831871 842170 852232 862579 873806 885935 898153 909421 919357 928342 936731
62332 936731 944234 950223 954426 957040 958241 957948 956270 954002 952391 952329 953826 956246 958956 961794 965087
62317 965087 969380 975176 982970 993432 1007229 1024522 1044862 1067974 1094555 1125913 1162764 1204683
62305 1204683 1250760 1300426 1353555 1410230 1470654 1534999 1602991 1673770 1746388 1820203 1894482
62294 1894482 1967676 2037418 2101334 2157771 2205650 2243604 2269594 2282053 2281843 2272527 2257699 2237832
62282 2237832 2210262 2172393 2124393 2068884 2009061 1947588 1886387 1826476 1768152 1711739 1657832
62271 1657832 1606575 1557434 1510321 1466280 1426254 1389595 1354664 1320571 1287577 1256252 1227277
62260 1227277 1201752 1180334 1161968 1144687 1128040 1113717 1103260 1096049 1090170 1084540 1079406 1075301
62248 1075301 1072288 1070079 1068345 1067001 1066427 1067027 1068128 1067790 1064433 1058563 1052252 1046929 1042276 1037425 1032477
62233 1032477 1028333 1025416 1023369 1022134 1022678 1026047 1031861 1038394 1044359 1050223 1057473 1066898 1077989 1089792
62219 1089792 1101793 1113895 1126017 1138150 1150709 1164596 1180723 1199385 1220249 1243105 1268523
62208 1268523 1297394 1329799 1364863 1402005 1441768 1485002 1531820 1582095 1636558 1696275 1760999
62197 1760999 1828968 1898718 1970329 2044312 2119669 2193406 2261571 2320472 2367488 2401578 2423278
62186 2423278 2433961 2434875 2426511 2408493 2380125 2341576 2294738 2242402 2186392 2127065 2064988 2002325
62174 2002325 1941755 1884382 1829693 1777427 1728526 1684063 1644301 1609409 1580236 1557302 1539293
62163 1539293 1523639 1508762 1495109 1483816 1475158 1468705 1464201 1461467 1459918 1459105 1459632 1462527 1467535
62150 1467535 1472791 1476530 1478541 1479787 1481406 1484500 1489988 1497851 1507106 1517256 1529227 1543964 1560701
62137 1560701 1577905 1595683 1615768 1638911 1663757 1689039 1715677 1745514 1778624 1813139 1847636
62126 1847636 1882696 1919825 1959430 2000102 2039540 2076012 2109216 2139883 2168623 2195345 2220063
62115 2220063 2243934 2268926 2296234 2325430 2355433 2386107 2418703 2454954 2496067 2542365 2593158
62104 2593158 2646581 2699913 2750765 2798022 2841301 2879602 2911238 2935447 2953428 2967042 2976747
62093 2976747 2981463 2980350 2973979 2963715 2950702 2935782 2919736 2903119 2886224 2869685 2854827 2842919
62081 2842919 2834168 2827885 2823623 2821815 2823273 2828270 2836147 2845702 2856025 2867186 2880055 2895295 2912660
62068 2912660 2931523 2951913 2974611 3000180 3028255 3057911 3088393 3119376 3150996 3184083 3220046
62057 3220046 3259887 3303223 3348730 3395635 3444268 3494915 3546746 3598432 3649479 3700351 3751543
62046 3751543 3803225 3855791 3909876 3965594 4022291 4079464 4137514 4197358 4259681 4324786 4392662
62035 4392662 4462972 4535477 4610790 4690056 4773338 4858725 4943505 5025814 5104843 5180492 5253968
62024 5253968 5328196 5406186 5488753 5574515 5661802 5749350 5835233 5916980 5993711 6067200 6139864
62013 6139864 6212374 6284155 6355502 6427861 6502000 6577039 6651705 6725857 6800265 6875208 6949680
62002 6949680 7021706 7088931 7148976 7199922 7241079 7273319 7298270 7317050 7329881 7336647 7337138 7330603
61990 7330603 7315912 7292924 7263329 7229453 7192471 7152504 7110153 7066948 7024132 6981911 6940242
61979 6940242 6899736 6861381 6825827 6793175 6762977 6734269 6706177 6678866 6653504 6631034 6611389
61968 6611389 6593988 6578324 6563777 6549556 6535323 6521438 6508163 6495175 6482183 6469333 6456493
61957 6456493 6442960 6428667 6414956 6403084 6392390 6381094 6368684 6356252 6344542 6332998 6321150
61946 6321150 6309657 6299127 6288843 6277668 6265757 6254337 6243850 6233097 6220246 6203894 6182886
61935 6182886 6155793 6121357 6079550 6031784 5979790 5924205 5864256 5798946 5728679 5655709 5582837
61924 5582837 5511619 5441962 5373380 5306208 5241196 5178233 5116314 5055038 4995635 4939898 4888340
61913 4888340 4839928 4793490 4748759 4705900 4664678 4624567 4585422 4547691 4512094 4479330 4449806
61902 4449806 4423247 4398681 4375218 4352981 4333010 4316134 4302045 4289564 4277750 4266702 4257387
61891 4257387 4250861 4247717 4248223 4252704 4261505 4274632 4291758 4312704 4337685 4367029 4400855 4439200
61879 4439200 4482080 4529110 4579295 4631717 4686499 4744707 4807226 4874030 4944608 5018594 5095735
61868 5095735 5175714 5258543 5344891 5435478 5530356 5629499 5734124 5846679 5969318 6103315
61858 6103315 6250377 6413486 6595379 6796852 7017867 7260120 7527228 7822342 8146898
61849 8146898 8502085 8890284 9314419 9777048 10280994 10830002 11427684 12076199 12776598
61840 12776598 13529384 14332940 15180647 16059186 16948043 17818706 18634253 19351643 19926963
61831 19926963 20321628 20508094 20474390 20225871 19783131 19177610 18447062 17630743 16763855
61822 16763855 15873824 14981216 14103099 13254073 12444449 11679566 10961822 10292638 9672539
61813 9672539 9100887 8576342 8096847 7659102 7259424 6895556 6566447 6269854 6001707
61804 6001707 5758632 5539654 5344284 5170171 5014090 4874414 4751166 4644075 4551853 4473101
61794 4473101 4406781 4351826 4307100 4271618 4244166 4223084 4207116 4196043 4189553 4185718 4181379 4173989
61782 4173989 4162521 4147052 4128345 4107712 4086546 4065903 4046814 4030517 4017748 4008311 4002170 4000541
61770 4000541 4004934 4015257 4029780 4046823 4065608 4085526 4105553 4124641 4142017 4156911 4168557
61759 4168557 4176551 4180830 4181481 4179286 4176368 4175524 4178671 4186498 4199689 4219764 4248379 4286323 4333558
61746 4333558 4390030 4456202 4532977 4621271 4721559 4833716 4957345 5092238 5238689 5397669
61736 5397669 5570722 5759216 5963508 6183245 6418557 6670360 6939452 7226373 7532805
61727 7532805 7862177 8217816 8601028 9012090 9452979 9928255 10443406 11003114 11611100
61718 11611100 12271206 12988867 13771870 14629099 15567911 16593427 17710756 18926211 20244148
61709 20244148 21662532 23172186 24758059 26396822 28051017 29666347 31175156 32502212
61701 32502212 33570225 34308331 34665052 34619581 34184195 33398299 32319785 31016563 29557697
61692 29557697 28005262 26410095 24812154 23242700 21725776 20278788 18912886 17633535
61684 17633535 16441804 15336450 14315630 13376894 12516122 11727313 11003902 10340381 9732769
61675 9732769 9177862 8672209 8211770 7792364 7410086 7061043 6741081 6446474 6174972
61666 6174972 5925468 5696317 5484496 5286762 5101068 4926331 4761321 4604639 4455528
61657 4455528 4313785 4178722 4049051 3924298 3805757 3695254 3593003 3497189 3405751 3318157
61647 3318157 3235275 3157994 3086365 3019791 2957425 2898377 2842029 2788329 2737431 2688993 2642261
61636 2642261 2596866 2553001 2510670 2469423 2429227 2390932 2355252 2321607 2288478 2254636 2219669
61625 2219669 2183926 2148622 2115475 2085284 2056936 2028584 1999717 1971408 1944733 1919806 1896398
61614 1896398 1874554 1854239 1834980 1816286 1798166 1781137 1765916 1752919 1741654 1730749 1719107
61603 1719107 1706930 1695128 1683906 1672567 1660667 1648742 1637905 1629168 1623016 1619020 1616109 1613828
61591 1613828 1613060 1614738 1618202 1621871 1625410 1629941 1636000 1642519 1648277 1653293 1658166 1662866 1666792 1669466
61577 1669466 1670728 1670878 1670892 1671838 1673670 1675276 1676114 1677064 1679160 1682214 1685323 1688246 1691531 1695398 1698957
61562 1698957 1700512 1698688 1693531 1686352 1678049 1667873 1654728 1639422 1624294 1610422 1596535 1581286
61550 1581286 1565301 1550062 1535800 1521632 1507131 1492673 1478640 1465214 1452814 1442006 1433194
61539 1433194 1426740 1422881 1421007 1419676 1418160 1417536 1419456 1424075 1429901 1435429 1440303 1445120 1450751 1457811
61525 1457811 1466357 1476185 1487515 1500932 1516415 1533078 1550282 1568309 1587500 1607669 1629072 1653108
61513 1653108 1680897 1711792 1744405 1778703 1815900 1856598 1900256 1946423 1995161 2045999 2097533
61502 2097533 2148488 2198545 2247846 2296348 2343852 2390071 2434470 2476666 2517117 2556855 2596267
61491 2596267 2634594 2670795 2704454 2735693 2764647 2791179 2814677 2834031 2848250 2857336 2862212 2863666
61479 2863666 2861698 2856077 2847275 2836695 2826143 2816971 2809372 2802505 2795753 2790037 2787532 2789857 2796881
61466 2796881 2807591 2821871 2841005 2866466 2898757 2937570 2982632 3033818 3090803 3153545 3223445
61455 3223445 3303131 3394386 3496855 3609634 3733572 3870802 4022362 4187790 4367218 4562395
61445 4562395 4775172 5006414 5257093 5528815 5821863 6133650 6460387 6799343 7147613
61436 7147613 7498743 7841920 8164506 8454403 8700516 8893190 9025752 9095722 9104662 9057486
61426 9057486 8961745 8826212 8659009 8466806 8255549 8031481 7801421 7572284 7350042 7138584
61416 7138584 6939746 6754955 6586513 6436539 6304966 6189790 6089742 6005979 5940729 5894730
61406 5894730 5866425 5853413 5854225 5868532 5895788 5934175 5981391 6036393 6099506 6170558 6247746 6328795
61394 6328795 6412372 6497623 6583227 6668032 6752017 6835411 6917398 6997019 7075042 7153402 7232729
61383 7232729 7311738 7389226 7465285 7540107 7612779 7681944 7746866 7807406 7863560 7915200 7961460
61372 7961460 8000324 8029815 8049867 8061987 8066851 8063473 8051234 8031275 8005012 7972469 7933361 7888986
61360 7888986 7841752 7793365 7744770 7697491 7653569 7614012 7578340 7545904 7516876 7491818 7471140
61349 7471140 7455338 7444944 7439546 7437182 7435319 7432353 7427829 7421369 7412095 7399449 7384266 7368524 7354082
61336 7354082 7342156 7334129 7332180 7338582 7354789 7381979 7422282 7478597 7553100 7646747 7760577 7896675
61324 7896675 8057207 8243014 8453871 8689769 8951053 9237274 9546644 9876775 10224996
61315 10224996 10587039 10955485 11320086 11669573 11992698 12277888 12513602 12690697 12804728
61306 12804728 12855505 12844871 12775903 12653846 12485729 12277745 12033686 11756842 11452766 11129055
61296 11129055 10792759 10448991 10101766 9755127 9413303 9080414 8760005 8454198 8163505
61287 8163505 7888081 7628878 7386847 7161592 6952257 6759673 6586155 6432715 6297678
61278 6297678 6178703 6075207 5988039 5917585 5863074 5823356 5797531 5784939 5785017 5797065 5819909
61267 5819909 5852024 5892198 5939760 5993785 6052312 6112615 6172127 6229118 6282922 6333912 6383040
61256 6383040 6430875 6476723 6518591 6554267 6582994 6606292 6626736 6645638 6662261 6675277 6684003
61245 6684003 6687580 6684007 6671238 6648785 6617204 6576773 6528175 6473915 6416974 6357755 6294151 6225082
61233 6225082 6152311 6078100 6002768 5925686 5847297 5768896 5691514 5616388 5545777 5481918 5425502
61222 5425502 5376025 5333105 5296423 5264977 5237536 5213641 5193230 5175532 5159163 5143116 5126820
61211 5126820 5109538 5090666 5070570 5050407 5031257 5014164 5000749 4992765 4990824 4994182 5001798 5013098
61199 5013098 5027834 5046064 5068526 5096465 5130916 5172646 5222903 5283639 5356588 5442416 5541050
61188 5541050 5652537 5777028 5913523 6058674 6207082 6353059 6491860 6618785 6727219
61179 6727219 6808468 6854131 6858673 6820069 6739232 6619749 6467625 6290068 6093986 5885668
61169 5885668 5671292 5456672 5246079 5041676 4844524 4656078 4478545 4313836 4162349
61160 4162349 4023015 3894578 3776639 3669318 3572312 3484766 3405843 3334805 3270683 3212653
61150 3212653 3160866 3116116 3078404 3046592 3019957 2999435 2986486 2980959 2980683 2983222 2987689 2994860
61138 2994860 3005757 3020242 3036933 3054274 3071230 3086741 3099156 3107016 3110226 3109762 3106410 3100537
61126 3100537 3092859 3084259 3074559 3062315 3046087 3025274 2999794 2969957 2936811 2901525 2864121 2823766
61114 2823766 2780560 2735877 2690650 2644535 2597304 2549734 2502424 2454919 2406837 2358714 2310816
61103 2310816 2262254 2212510 2162960 2115696 2071441 2029613 1989748 1951819 1915811 1881995 1851047
61092 1851047 1822979 1796650 1771178 1746818 1723254 1698127 1669051 1636616 1603737 1572292 1542057
61081 1542057 1512837 1485755 1461796 1440384 1420270 1401304 1384913 1372989 1366272 1363409 1361882 1360293
61069 1360293 1359492 1361057 1365256 1371102 1377725 1384836 1392377 1400704 1410697 1422805 1436279 1450068 1463935
61056 1463935 1477865 1491072 1502795 1513653 1525158 1538164 1552554 1567868 1583119 1596602 1607084
61045 1607084 1614870 1620678 1624050 1623985 1620499 1614348 1605879 1595544 1584791 1574787 1564807 1553594 1541808
61032 1541808 1531222 1521949 1512571 1502875 1494152 1486473 1477846 1466831 1454207 1441382 1428720 1416147
61020 1416147 1403899 1391871 1379432 1366655 1354720 1344595 1336242 1329363 1323760 1318706 1313207 1307269
61008 1307269 1301813 1297214 1293215 1290367 1289941 1292039 1295386 1299501 1305410 1313391 1321576 1327944 1332654 1337419
60994 1337419 1343393 1350581 1358698 1367781 1378126 1389852 1402376 1414645 1426516 1439295 1454081 1470329
60982 1470329 1487273 1505742 1526655 1548576 1569253 1589193 1611062 1635677 1661489 1688352 1718666
60971 1718666 1753761 1791946 1831445 1872923 1917858 1966713 2019997 2078802 2142820 2209807 2278347
60960 2278347 2349145 2422715 2498277 2576253 2659077 2747833 2840600 2936033 3036031 3142903 3256520
60949 3256520 3376602 3505277 3644712 3794494 3954042 4125474 4311292 4511213 4723955
60940 4723955 4949938 5189448 5440772 5703790 5983418 6285923 6613754 6967517 7350540
60931 7350540 7766862 8216531 8697850 9213328 9769303 10371790 11028316 11752852 12563690
60922 12563690 13477812 14512931 15692763 17043021 18585032 20343843 22361108 24686641
60914 24686641 27357290 30400667 33852114 37709310 41803871 45717697 48903605 50979051
60906 50979051 51948468 52153741 52027576 51901444 51989097 52419890 53167539 53934755 54197376
60897 54197376 53465545 51562109 48680961 45211983 41524033 37866728 34384367 31153363
60889 31153363 28202514 25530441 23125628 20974611 19058409 17353442 15839229 14500030
60881 14500030 13318426 12273019 11343889 10516154 9777391 9115589 8520709 7984877 7499989
60872 7499989 7057809 6653033 6283474 5946549 5637844 5353422 5090890 4847495 4619372
60863 4619372 4403381 4198037 4002428 3815916 3638813 3471501 3313139 3163103 3023112
60854 3023112 2895336 2778679 2669635 2566799 2471668 2384821 2304449 2229418 2160720 2098600
60844 2098600 2040911 1985876 1934274 1887267 1843979 1802850 1763791 1727478 1693828 1662537 1633892
60833 1633892 1607782 1583045 1558954 1536367 1516438 1499250 1484455 1471942 1460880 1449322 1435901
60822 1435901 1421047 1405899 1391144 1377460 1365392 1353734 1339681 1321969 1302594 1284125 1266660
60811 1266660 1248922 1231064 1214519 1199875 1186623 1174497 1163672 1154177 1146320 1140895 1137713 1134866
60799 1134866 1131141 1128369 1129458 1134501 1140707 1146077 1151224 1157470 1165083 1174098 1185411 1199999 1217671
60786 1217671 1237215 1257463 1278164 1300186 1324786 1352045 1380129 1406615 1430264 1451011 1468847
60775 1468847 1483768 1496382 1507285 1515936 1521288 1523584 1524382 1524684 1524090 1522018 1518778 1515164 1511835 1509275
60761 1509275 1507397 1504837 1499570 1490735 1479354 1467072 1454875 1443125 1431919 1420879 1409319 1397147
60749 1397147 1385064 1373474 1361714 1348782 1334532 1319898 1306295 1294909 1286013 1278756 1272048 1265788
60737 1265788 1260704 1256987 1253948 1251401 1250538 1252662 1257418 1262964 1267824 1272227 1277787 1286110 1297583 1311272
60723 1311272 1326019 1341553 1358269 1376067 1394051 1411505 1428719 1446601 1465682 1485531 1504844
60712 1504844 1522265 1537742 1552939 1569578 1587336 1604196 1618956 1632299 1645068 1656666 1666096
60701 1666096 1673663 1680568 1687213 1692875 1696850 1699112 1699967 1699786 1698981 1697679 1695483 1692086 1687943 1683846 1680097
60686 1680097 1676687 1673901 1671860 1669588 1665485 1658892 1650473 1640876 1629959 1617700 1605183 1593928 1584521
60673 1584521 1576281 1568020 1558854 1548644 1538142 1528604 1520903 1514995 1510290 1506216 1502295 1498192 1494235
60660 1494235 1491535 1490903 1491695 1492454 1492749 1493586 1495588 1497488 1497229 1494282 1490084 1486208 1482836 1479225 1474913
60645 1474913 1469945 1464321 1457988 1451355 1445323 1440526 1436514 1431768 1424754 1415357 1405286 1396554 1389251 1381282
60631 1381282 1370552 1356885 1341461 1325207 1308636 1292612 1277898 1263954 1249388 1233730 1217702
60620 1217702 1201717 1185548 1169929 1156858 1147126 1138765 1129460 1119789 1112419 1108449 1106304 1104423 1103350
60607 1103350 1104351 1107211 1110529 1113590 1116931 1121264 1126643 1132775 1139590 1147324 1156190 1165964 1175836 1184958
60593 1184958 1193320 1201930 1211800 1222897 1234367 1245591 1256551 1267135 1276625 1284273 1290223 1295508 1301150
60580 1301150 1307522 1314728 1323265 1333849 1346480 1360050 1373261 1385936 1399187 1414153 1430809 1448154
60568 1448154 1465371 1482447 1499683 1517007 1534052 1550601 1566589 1581763 1595693 1608024 1618279
60557 1618279 1625551 1629158 1629812 1629278 1628253 1625315 1618898 1609885 1601055 1593986 1587752 1581080 1574615 1570080
60543 1570080 1567782 1566031 1562973 1558194 1552266 1545190 1535829 1523010 1507081 1490108 1474330 1460577 1448479
60530 1448479 1437899 1429444 1423566 1419914 1417930 1417573 1419035 1422185 1426685 1432344 1439040 1446515 1454469 1462611
60516 1462611 1470465 1477498 1483478 1488336 1491830 1494150 1496840 1501955 1509750 1518244 1525661 1532292 1539054 1545339
60502 1545339 1549726 1552084 1553456 1554117 1553280 1550605 1546596 1541469 1535212 1529185 1526031 1526971 1530100 1532479 1533472
60487 1533472 1535248 1540271 1549001 1560039 1572003 1585182 1601522 1623117 1650936 1685056 1725524 1772247
60475 1772247 1824320 1880433 1939965 2002623 2066666 2128315 2183425 2229035 2262981 2283209 2288796
60464 2288796 2281435 2264885 2242773 2217485 2191103 2166445 2146507 2133052 2126188 2125326 2130082 2140054
60452 2140054 2154131 2170836 2189529 2210647 2234392 2259816 2285928 2313300 2343749 2378649 2418423
60441 2418423 2463575 2515121 2573716 2639222 2711618 2791862 2881608 2982585 3096262 3223233 3362445
60430 3362445 3511695 3669470 3836049 4012735 4200888 4402285 4619973 4858218 5121891
60421 5121891 5416002 5744861 6110566 6511742 6942845 7392699 7842115 8263541 8625159
60412 8625159 8897587 9058896 9096412 9007117 8798187 8486876 8098179 7660163 7198574 6733125
60402 6733125 6276961 5838489 5423284 5034866 4674986 4344208 4042338 3768356 3520380
60393 3520380 3296081 3093087 2909264 2743184 2594357 2462332 2345460 2241180 2147612 2063996
60383 2063996 1989406 1922220 1861431 1807321 1759793 1716839 1675765 1635427 1596337 1559147 1524177
60372 1524177 1491952 1462813 1436036 1410520 1386349 1364561 1345284 1327256 1309523 1292450 1276537
60361 1276537 1261185 1245508 1229793 1215373 1203330 1193896 1186889 1182052 1178882 1176579 1174480 1172554 1171383
60348 1171383 1171597 1173276 1175854 1178555 1180751 1182075 1182561 1182827 1183664 1185246 1187116 1189144 1191879 1195534 1199328
60333 1199328 1202643 1206309 1211684 1218705 1225886 1232161 1237567 1242025 1244763 1245651 1246038 1247237 1248704 1248616 1246119
60318 1246119 1242258 1238735 1236351 1234756 1233284 1231761 1230548 1229845 1229055 1227168 1223914 1220218 1217293 1215606
60304 1215606 1215028 1215606 1217559 1220589 1223930 1227278 1231161 1236076 1241712 1247489 1253567 1260627 1268628 1276422
60290 1276422 1282924 1288265 1293426 1299117 1305532 1313001 1322133 1333064 1344994 1356757 1367661 1377549 1386307
60277 1386307 1393644 1399355 1403605 1406815 1409290 1411040 1412082 1412860 1413984 1415454 1416673 1417729 1420200 1425859
60263 1425859 1434541 1443957 1451666 1456693 1459309 1460155 1459903 1458990 1457131 1453552 1448032 1441323 1434277 1427153 1420040
60248 1420040 1413382 1407718 1403422 1400979 1400802 1402432 1404614 1406517 1408083 1408932 1408230 1406475 1406088 1408839 1413503
60233 1413503 1417500 1420222 1423138 1427073 1431254 1435174 1439682 1445719 1453255 1461944 1471597 1481533 1490726 1499450
60219 1499450 1509785 1523537 1540269 1558100 1575775 1593187 1610585 1628374 1647396 1668267 1690251
60208 1690251 1711673 1731882 1752331 1775239 1801339 1829421 1858212 1888241 1921273 1957933 1996741
60197 1996741 2036119 2076836 2121528 2171878 2227294 2286633 2350240 2419443 2494632 2574944 2659943
60186 2659943 2750853 2849764 2958062 3076016 3203501 3340390 3486213 3640159 3801849 3971594
60176 3971594 4149288 4333386 4521598 4712111 4903091 5091197 5272003 5442418 5601572
60167 5601572 5748832 5882032 5998409 6096170 6174230 6231543 6268071 6285693 6286826 6272825 6245162
60156 6245162 6207542 6164947 6120663 6075878 6032231 5993047 5961774 5940866 5932642 5939565 5962777 6001750
60144 6001750 6056349 6128107 6218432 6326620 6450763 6589872 6743757 6911035 7088179 7270320
60134 7270320 7452342 7629463 7797544 7952894 8091581 8209507 8303769 8373662 8419690 8441760
60124 8441760 8438765 8409873 8355845 8279335 8184312 8075201 7956334 7832184 7707842 7588699
60114 7588699 7479380 7383134 7302205 7238288 7192748 7166993 7162716 7181062 7221338 7281192 7358251
60103 7358251 7450797 7556588 7671990 7792927 7915988 8037846 8154224 8260451 8353072 8430429
60093 8430429 8491947 8537522 8567631 8583703 8588227 8584575 8576504 8567590 8561182 8560802 8570282 8593531 8634269
60080 8634269 8695614 8779341 8885780 9015251 9169575 9351543 9563151 9805372 10079526 10387499
60070 10387499 10730257 11107378 11518404 11963410 12441516 12949883 13484628 14041366 14613823
60061 14613823 15193123 15769621 16334588 16879127 17392786 17865078 18287945 18655289 18960708
60052 18960708 19197475 19360713 19447981 19457611 19388065 19239612 19015746 18722586 18367934 17961433
60042 17961433 17514798 17041064 16553545 16065172 15587729 15130945 14702371 14308089 13953144
60033 13953144 13641409 13375680 13158025 12989533 12869628 12796160 12766171 12775958 12820445 12893386
60023 12893386 12988533 13099835 13219997 13339557 13448395 13538378 13604555 13644354 13656338 13639631
60013 13639631 13593852 13519111 13416192 13286856 13133665 12959052 12764393 12550321 12318258 12071534
60003 12071534 11814726 11552079 11287066 11023387 10765599 10518252 10284819 10067964 9870465
59994 9870465 9695082 9543394 9415400 9310720 9230137 9175653 9148991 9150227 9178027 9231031 9308499
59983 9308499 9409442 9531609 9671709 9826140 9990687 10159641 10326137 10483658 10626730
59974 10626730 10750230 10849037 10919030 10958020 10965207 10939982 10881706 10790600 10668726 10520165 10350027
59963 10350027 10162996 9963044 9755042 9546098 9344054 9154298 8978834 8818623 8675757
59954 8675757 8552948 8451922 8373241 8317142 8283832 8273318 8285700 8321646 8382437 8469641 8584577
59943 8584577 8727454 8896995 9091284 9308496 9545719 9797374 10056309 10316569 10573471
59934 10573471 10820547 11048461 11248325 11415015 11546433 11641054 11697591 11715853 11696205 11638754
59924 11638754 11544397 11416171 11258720 11077392 10879020 10672353 10465746 10264772 10073451
59915 10073451 9897085 9742009 9612665 9510460 9435461 9387859 9367850 9375440 9410462 9471847
59905 9471847 9557215 9664362 9792698 9941767 10108527 10287462 10473214 10661704 10848998 11030925
59895 11030925 11204292 11367195 11517987 11655182 11778486 11888628 11986063 12071146 12145816 12213793
59885 12213793 12278891 12344372 12414139 12493126 12586141 12697589 12832631 12997267 13196759 13435078
59875 13435078 13716071 14043627 14419954 14844628 15315544 15829244 16379731 16958272 17554889
59866 17554889 18158223 18752620 19316746 19826812 20261341 20602925 20837630 20955270 20950918 20825877
59856 20825877 20587841 20250659 19832656 19353202 18830017 18279311 17716892 17157358 16612131
59847 16612131 16089333 15595739 15138096 14722313 14351990 14028294 13751370 13521853 13341050
59838 13341050 13209686 13126835 13090292 13097685 13146735 13234744 13358489 13514219 13696614 13897491
59828 13897491 14106262 14311721 14502638 14666785 14790976 14863172 14874452 14819226 14695016 14502979
59818 14502979 14248008 13937469 13579780 13184081 12760246 12318388 11868331 11419268 10978938
59809 10978938 10552711 10144112 9756508 9393527 9057566 8748686 8465582 8207187 7973129
59800 7973129 7763328 7577445 7414120 7270455 7142832 7028360 6924827 6829415 6738729 6650590
59790 6650590 6564840 6481998 6402132 6325466 6252939 6185516 6123901 6069409 6023746 5986655 5954521
59779 5954521 5922365 5886802 5846369 5799958 5746318 5685029 5617104 5544707 5470684 5397935 5328470
59768 5328470 5263127 5202465 5147598 5099935 5060689 5031044 5012136 5004237 5006186 5015938 5031471 5051395
59756 5051395 5075628 5105775 5144099 5191860 5249250 5316661 5394502 5481388 5573929 5669056 5765428
59745 5765428 5862120 5957335 6049294 6137045 6219467 6294858 6362604 6423843 6479210 6527429 6567915
59734 6567915 6603623 6639315 6677719 6719331 6765481 6819510 6884889 6963913 7058387 7170160 7300743
59723 7300743 7451628 7625136 7824076 8050882 8308203 8599949 8930163 9300849 9712104
59714 9712104 10164050 10656519 11185884 11742708 12311555 12870304 13388513 13829288 14157339
59705 14157339 14349165 14398781 14316827 14125549 13852903 13527624 13175837 12818946 12472484 12146392
59695 12146392 11846901 11578605 11345067 11148313 10988789 10865934 10778591 10725405 10705726 10719976
59685 10719976 10768492 10850309 10963965 11109169 11286628 11496260 11736736 12007106 12308044 12641171
59675 12641171 13007933 13409551 13847628 14324396 14842526 15404514 16011886 16665354 17366343
59666 17366343 18118079 18924262 19786828 20705660 21679914 22707912 23785060 24902659 26049126
59657 26049126 27211575 28375931 29526761 30648726 31729388 32761796 33745691 34686800
59649 34686800 35594564 36479962 37354756 38231105 39119740 40027325 40955315 41900384 42854247
59640 42854247 43802595 44725516 45600339 46404736 47118209 47722844 48204771 48556061 48776031
59631 48776031 48871684 48856935 48750449 48573193 48347385 48096433 47843957 47611877 47419568 47284512
59621 47284512 47222436 47246269 47366065 47590746 47929095 48388183 48971482 49679500 50511607 51465506
59611 51465506 52533838 53700977 54942223 56224421 57506274 58738205 59863036 60818672
59603 60818672 61543225 61981941 62094350 61859645 61278920 60373932 59183297 57757534 56154042
59594 56154042 54432061 52647543 50848914 49075091 47355767 45712268 44157331 42693744
59586 42693744 41313080 39995765 38713195 37432139 36121316 34759216 33340538 31877433
59578 31877433 30393847 28916321 27467460 26064816 24722157 23449424 22251810 21130453
59570 21130453 20084475 19112029 18210108 17374979 16603370 15892566 15239192 14638871 14087582
59561 14087582 13582637 13121893 12702603 12321624 11976138 11663390 11380012 11122399 10887665
59552 10887665 10673414 10476348 10291778 10115172 9943984 9777443 9614469 9452209 9286831
59543 9286831 9115575 8938083 8756253 8573119 8391345 8212189 8036050 7864238 7699629
59534 7699629 7544758 7399823 7263688 7136676 7021039 6918563 6829169 6752330 6688404 6637659
59524 6637659 6599198 6571951 6555823 6550700 6555205 6567710 6587953 6616382 6652471 6694972 6743381 6797692
59512 6797692 6856933 6919409 6984458 7052788 7125151 7201998 7284569 7375032 7475176 7585928 7708256
59501 7708256 7843293 7991308 8151819 8325482 8514981 8723406 8952410 9202342 9473393
59492 9473393 9766005 10080796 10418688 10780601 11166352 11573966 12000382 12442506 12897333
59483 12897333 13361350 13830060 14297776 14757756 15203049 15627820 16028089 16401309 16745252
59474 16745252 17056809 17331445 17564281 17752796 17898899 18008127 18086890 18140846 18175450 18196889
59464 18196889 18211942 18227437 18250170 18287012 18344719 18429466 18545916 18695785 18876722 19082341
59454 19082341 19302859 19525464 19734823 19914414 20047981 20120208 20117493 20029796 19852177 19584244
59444 19584244 19228708 18791544 18283354 17719042 17115144 16487232 15849137 15213392 14591566
59435 14591566 13994026 13428870 12900608 12410333 11958008 11544478 11170956 10837381 10542450
59426 10542450 10284840 10063374 9876469 9722807 9602385 9515563 9461035 9435888 9437783 9466023
59416 9466023 9520639 9601759 9710051 9846440 10010908 10202288 10419326 10661046 10926159 11213028
59406 11213028 11519661 11842120 12172852 12501975 12820201 13119001 13388197 13615879 13791688
59397 13791688 13908633 13961170 13943841 13853589 13692416 13466487 13183522 12851961 12481362 12081862
59387 12081862 11663203 11234530 10803994 10377586 9959116 9552140 9160987 8789123 8437716
59378 8437716 8107076 7798558 7513606 7251554 7009915 6786836 6582201 6396454 6229387
59369 6229387 6080138 5947535 5830301 5727517 5639007 5564791 5504147 5455567 5417724 5390159
59359 5390159 5372940 5365816 5368001 5378926 5398834 5427883 5464808 5507926 5557963 5617788 5687258 5759588
59347 5759588 5825764 5882746 5935226 5989703 6049875 6118294 6198802 6294819 6407223 6535875 6681178
59336 6681178 6841610 7011320 7183557 7356802 7535888 7727393 7935782 8163732 8413968
59327 8413968 8689714 8994123 9329654 9697714 10099313 10536846 11014833 11538175 12110034
59318 12110034 12731959 13405167 14130439 14907135 15733028 16604153 17513067 18447242 19390312
59309 19390312 20325218 21236021 22108140 22929095 23689905 24385337 25012924 25572439 26065921
59300 26065921 26496986 26869458 27186396 27449385 27657640 27807832 27895389 27915828 27864617 27736737
59290 27736737 27527714 27235471 26861410 26410792 25892649 25317999 24696496 24034795 23338424
59281 23338424 22614083 21868915 21108610 20338050 19563561 18793119 18034442 17293976 16577374
59272 16577374 15889503 15233861 14613040 14029617 13485545 12980990 12515119 12087971 11700166
59263 11700166 11350694 11036471 10754595 10503905 10283763 10092465 9927736 9788103 9672809
59254 9672809 9580473 9508475 9453776 9414086 9387972 9373863 9369345 9371840 9379688 9391783 9406111 9419630
59242 9419630 9429838 9435520 9435535 9428007 9411608 9386784 9354923 9317166 9275021 9231257 9188880 9149681
59230 9149681 9114792 9086112 9065968 9055864 9056846 9070914 9100973 9149415 9217516 9305812 9414065
59219 9414065 9541099 9685746 9847938 10028157 10225983 10439666 10666578 10903181 11144937
59210 11144937 11386844 11623262 11846292 12045201 12209133 12330756 12407275 12439324 12430381 12386414
59200 12386414 12314053 12218494 12103587 11973148 11831064 11680718 11525517 11369293 11214708 11061734
59190 11061734 10909107 10756831 10606065 10457381 10311017 10168398 10031608 9901508 9778048
59181 9778048 9662216 9555996 9460694 9377095 9307092 9253320 9217377 9200391 9205197 9235638 9293445
59170 9293445 9378089 9490341 9633823 9812193 10026799 10278153 10567974 10898501 11271024 11685873
59160 11685873 12142335 12637197 13164065 13714295 14276920 14836603 15373186 15864950 16292271
59151 16292271 16638359 16888579 17030946 17057213 16963279 16750046 16424951 16001669 15497038 14928540
59141 14928540 14314593 13674817 13027368 12385783 11759297 11155657 10582267 10044624 9544790
59132 9544790 9081973 8654441 8261065 7901404 7574622 7278704 7011164 6770228 6554531
59123 6554531 6361929 6189656 6035728 5899115 5778326 5671071 5575749 5492234 5420640 5360425
59113 5360425 5311313 5273941 5248528 5233497 5226390 5225808 5231871 5245048 5265115 5291142 5322359 5359274
59101 5359274 5403757 5457369 5519642 5588681 5663311 5743672 5829877 5921197 6016596 6114807 6213727
59090 6213727 6311047 6405659 6497021 6582919 6659704 6725493 6781390 6828455 6865125 6889144 6900786
59079 6900786 6902333 6895074 6878605 6853047 6820634 6784929 6749202 6715486 6684527 6656775 6633842 6618680
59067 6618680 6613984 6620849 6639400 6670063 6713682 6770986 6842597 6929077 7030382 7145781 7274935
59056 7274935 7418573 7577476 7751312 7939171 8141032 8358084 8591652 8842082 9108469
59047 9108469 9389385 9684082 9992605 10313972 10644428 10978602 11312282 11642370 11963504
59038 11963504 12266143 12538819 12771002 12952905 13074431 13126803 13105370 13009858 12842611 12608194
59028 12608194 12314417 11971864 11591483 11183000 10755304 10316942 9875532 9437388 9008173
59019 9008173 8593280 8196705 7819588 7460633 7118593 6794331 6490023 6206346 5941212
59010 5941212 5691867 5457563 5239168 5036545 4847769 4671224 4507205 4356564 4218467
59001 4218467 4090279 3969474 3855227 3748339 3649866 3559719 3476637 3399539 3328355 3262970
58991 3262970 3202065 3144075 3088881 3037273 2988978 2942649 2897812 2855222 2815078 2776484 2739131
58980 2739131 2703898 2671153 2639992 2610128 2583131 2560698 2542728 2528036 2515958 2506271 2498611 2493094
58968 2493094 2490655 2491723 2495318 2500389 2507244 2516601 2527903 2539605 2550530 2560052 2567639 2573183 2577327
58955 2577327 2580613 2582824 2583856 2584583 2586014 2588233 2590983 2594674 2599938 2606751 2614884 2624708 2636651 2650173
58941 2650173 2663868 2676126 2685309 2690222 2691322 2690765 2690347 2689887 2688342 2685896 2684001 2683820 2685404 2688153
58927 2688153 2691572 2695951 2702518 2712187 2723966 2735733 2747101 2760283 2777385 2798086 2820872 2845214
58915 2845214 2871311 2898932 2928053 2959828 2995394 3034379 3075936 3120581 3169450 3222183 3277026
58904 3277026 3332883 3390087 3449395 3511412 3576707 3645334 3716370 3788954 3863590 3941425 4022631
58893 4022631 4106577 4193349 4283958 4379126 4478993 4584053 4695413 4813899 4939494 5071766
58883 5071766 5210494 5356154 5510251 5674848 5851222 6039181 6237976 6447375 6667614
58874 6667614 6899169 7143249 7401851 7676765 7969076 8280033 8611405 8964359 9339013
58865 9339013 9735936 10157257 10605552 11082677 11590521 12131781 12708866 13323011 13975579
58856 13975579 14669343 15407311 16191072 17021300 17898734 18823207 19792400 20802395 21848012
58847 21848012 22920549 24005568 25084179 26135806 27138395 28066949 28894035 29592279
58839 29592279 30136492 30505727 30686343 30673910 30471885 30089686 29543231 28855326 28052211
58830 28052211 27158865 26198170 25192759 24164496 23131600 22107883 21104661 20131660
58822 20131660 19196162 18303021 17455778 16656569 15905343 15200778 14541798 13926722 13351573
58813 13351573 12811407 12303622 11828351 11385455 10972668 10586773 10225129 9885934 9568449
58804 9568449 9273135 9000365 8748942 8516868 8303134 8107454 7928741 7765403 7616725
58795 7616725 7482337 7360856 7251012 7153802 7071457 7004352 6950831 6909965 6882319 6867998 6866198
58784 6866198 6877030 6901683 6940271 6991491 7054891 7131454 7221331 7322985 7435514 7560203 7698900
58773 7698900 7852300 8020625 8204564 8404736 8621349 8854968 9106517 9376254 9664039
58764 9664039 9970913 10299009 10649832 11024227 11424221 11852968 12312457 12803260 13327262
58755 13327262 13888605 14491010 15135966 15824625 16559595 17343341 18176050 19056188 19981653
58746 19981653 20948650 21950036 22975397 24011348 25040324 26040009 26985274 27850246 28608200
58737 28608200 29231540 29694728 29978463 30071668 29971456 29683008 29219160 28598470 27842921
58728 27842921 26976803 26025938 25015745 23969070 22905466 21841521 20790833 19763863
58720 19763863 18768653 17811890 16899010 16033287 15215171 14442961 13714706 13029683 12387603
58711 12387603 11786320 11221433 10689061 10188208 9719226 9280756 8869724 8483796 8121887
58702 8121887 7782216 7461935 7159382 6875311 6611077 6366442 6139533 5927977 5729747
58693 5729747 5543753 5369921 5208114 5057161 4915804 4784188 4663049 4551633 4447869
58684 4447869 4350636 4260357 4177171 4099943 4027365 3958751 3893491 3830950 3771086 3714038 3658983
58673 3658983 3604548 3550261 3496346 3442361 3387584 3332595 3278850 3226598 3174754 3122668 3070398
58662 3070398 3017459 2963320 2909080 2856521 2805375 2753547 2700090 2645754 2590567 2533693 2476152
58651 2476152 2420908 2369101 2318680 2267920 2217950 2170553 2125736 2082999 2042998 2006251 1971807
58640 1971807 1938677 1907175 1877721 1849927 1823805 1800064 1778079 1755598 1731830 1708835 1688369
58629 1688369 1669360 1650279 1632033 1616422 1603473 1592616 1585073 1582408 1583369 1584508 1583755 1581787 1580163
58616 1580163 1579544 1579474 1578808 1576630 1573462 1570853 1569258 1567516 1565171 1563748 1564551 1566716 1568926 1571668 1576062
58601 1576062 1581592 1586794 1591264 1595246 1598028 1598634 1597717 1597119 1597820 1599738 1603257 1609551 1619322 1632144 1647016
58586 1647016 1663106 1680417 1700154 1723691 1750723 1779410 1808948 1840829 1876829 1916986 1960544
58575 1960544 2007574 2058363 2112284 2168754 2228661 2293636 2364368 2440537 2521750 2607734 2698445
58564 2698445 2794884 2899082 3012514 3135301 3267601 3410723 3566094 3734128 3915017 4109804
58554 4109804 4319992 4546885 4791691 5054919 5335050 5628873 5933542 6246688 6563860
58545 6563860 6877360 7178096 7456613 7701655 7900426 8042537 8122954 8140442 8095410 7991032
58535 7991032 7834653 7635815 7403606 7146819 6874617 6594665 6311526 6028627 5750930
58526 5750930 5484020 5231312 4993623 4770869 4563161 4371054 4195688 4037772 3895865
58517 3895865 3767005 3649607 3544016 3449628 3363830 3284978 3213962 3151107 3093734 3038783 2985823
58506 2985823 2935469 2886924 2839501 2794760 2754382 2717027 2679577 2640318 2598871 2554395 2506206
58495 2506206 2455157 2402378 2347828 2291986 2237496 2186923 2140174 2096262 2055983 2020311 1987581
58484 1987581 1955155 1923021 1893178 1866377 1841960 1819914 1800274 1781096 1759816 1736406 1713053
58473 1713053 1691119 1670493 1651278 1633761 1616996 1599434 1580723 1561307 1541026 1519844 1499015
58462 1499015 1479594 1460651 1440792 1420520 1401252 1383096 1365539 1349010 1333692 1318024 1300758
58451 1300758 1283358 1268162 1255400 1244323 1235619 1230005 1225857 1221459 1218395 1219425 1223796 1228066 1231096
58438 1231096 1234827 1240257 1245918 1250603 1254723 1258537 1261534 1264140 1267974 1274043 1282049 1291176 1300118 1307157
58424 1307157 1311953 1316381 1321804 1326767 1329461 1330977 1333573 1337085 1339865 1342053 1344808 1347213 1347146 1344583
58410 1344583 1341027 1336211 1328372 1317366 1304780 1291441 1277418 1263700 1251103 1238402 1224447 1211101
58398 1211101 1200962 1193166 1184872 1175959 1168675 1163378 1158539 1154544 1153533 1155381 1157428 1158350 1159066 1159898
58384 1159898 1160260 1161037 1163859 1168020 1171533 1175096 1181485 1191018 1201201 1210983 1221791 1234091 1246381
58371 1246381 1257953 1269402 1280188 1288783 1295241 1300486 1303509 1302883 1300543 1300093 1301567 1302068 1301420 1302529
58357 1302529 1305872 1308609 1310142 1313716 1320915 1328926 1335153 1340655 1347129 1354153 1361475 1370757 1382842 1395882
58343 1395882 1407942 1419168 1430008 1439638 1447254 1452755 1455392 1454082 1449614 1444201 1438468 1431389 1423246
58330 1423246 1415863 1409817 1404273 1399527 1396612 1394583 1391666 1389114 1390399 1396395 1404856 1414536 1425964 1438039
58316 1438039 1447997 1455354 1462063 1468371 1472368 1474119 1476293 1480133 1484610 1490013 1498379 1509776 1521968
58303 1521968 1534202 1547588 1561683 1574778 1587597 1602382 1618308 1632416 1645095 1659778 1677042
58292 1677042 1694117 1710444 1728267 1747275 1764349 1779428 1795819 1813543 1828312 1838568 1847698
58281 1847698 1857444 1864873 1868102 1869635 1871662 1873066 1873294 1874428 1877395 1880712 1884629 1891841 1902705 1914693
58267 1914693 1927729 1944769 1965852 1987244 2007815 2030450 2055714 2080218 2103003 2127381 2154705
58256 2154705 2182497 2210468 2241813 2276615 2310682 2342927 2376907 2412848 2445666 2473728 2502017
58245 2502017 2533229 2563125 2588514 2612823 2639794 2668436 2698063 2731517 2769325 2807165 2843036
58234 2843036 2880496 2921386 2962358 3002298 3045810 3095146 3145952 3195399 3247281 3304464 3363489
58223 3363489 3421492 3481591 3546741 3615097 3685850 3762589 3846496 3933393 4021666 4115516 4216331
58212 4216331 4319067 4421583 4528942 4643876 4761886 4880693 5005031 5136620 5269151
58203 5269151 5399525 5534624 5680457 5833934 5991765 6157790 6334721 6518625 6709023
58194 6709023 6914714 7142078 7387093 7646011 7923694 8224032 8542779 8877792 9235582
58185 9235582 9619791 10024479 10447093 10896250 11377981 11886467 12417642 12979439 13578959
58176 13578959 14212524 14878723 15588029 16348812 17157358 18012314 18924369 19900017 20930810
58167 20930810 22010896 23149849 24355961 25623959 26952921 28358837 29854977 31438058
58159 31438058 33108856 34886675 36786679 38803514 40935595 43204729 45633250 48224696
58151 48224696 50987333 53952471 57147259 60574526 64242768 68190009 72456656 77068685
58143 77068685 82075941 87572985 93653195 100382863 107856976 116241316 125727467 136500125
58135 136500125 148790483 162898619 179111619 197672476 218889785 243193551 271031621
58128 271031621 302836900 339046005 379508767 422016223 461251867 490027122 502664162
58121 502664162 497884964 478819689 450588740 417866257 383938417 350851000 319720893
58114 319720893 290982100 264693240 240790926 219147350 199570726 181888689 166003809
58107 166003809 151827585 139227209 128084299 118340260 109935718 102763511 96721224
58100 96721224 91749996 87785850 84737430 82547606 81213132 80724943 81084432 82391291
58092 82391291 84714566 87682136 90267033 91212248 89794628 86184116 81130699 75423343
58084 75423343 69613098 64024335 58826564 54075003 49758274 45846588 42303977 39085845
58076 39085845 36153898 33487095 31067796 28871252 26878301 25083104 23477934 22042309
58068 22042309 20753569 19595152 18548836 17592233 16709993 15896223 15141884 14431479 13755529
58059 13755529 13114878 12509684 11935092 11389846 10877685 10397435 9941942 9508598 9100660
58050 9100660 8716550 8347800 7988978 7640308 7300067 6964424 6635458 6319534 6017007
58041 6017007 5722991 5438565 5171199 4923357 4690456 4470962 4268816 4084604 3913627
58032 3913627 3754283 3609705 3479656 3358984 3245268 3140081 3041771 2945030 2848777 2756991
58022 2756991 2670799 2586988 2504859 2427150 2353622 2281108 2210483 2146169 2088049 2031093 1973682
58011 1973682 1919166 1868505 1818641 1769288 1724456 1685966 1651528 1619926 1591968 1565989 1538847
58000 1538847 1511902 1489680 1472232 1455061 1436832 1420487 1406356 1390980 1373600 1357224 1342285
57989 1342285 1325686 1307169 1290313 1276069 1261559 1246401 1233985 1224961 1215533 1203846 1192297 1181869
57977 1181869 1169864 1155176 1140671 1128491 1117739 1108187 1101406 1096809 1091314 1084294 1078252 1073579 1067502
57964 1067502 1059429 1052431 1048023 1044187 1039933 1037041 1035758 1033349 1028609 1023591 1019477 1014964 1010146 1007580
57950 1007580 1007685 1006964 1002609 995552 987692 979480 971283 963740 955849 945920 934931 925622 918128 910240
57936 910240 902042 896099 892827 890002 887256 886589 887938 888851 889284 892064 897612 902799 906091 909205 912503
57921 912503 913577 912054 911199 912764 914474 914574 914908 917381 921016 924490 928246 932283 935120 936468 937714
57906 937714 938462 936123 930357 924449 920637 917416 912915 907714 902857 898237 894243 891834 889755 884828
57892 884828 876071 865433 853987 841284 829094 821166 817755 814714 809843 805927 805478 806757 807499 808591
57878 808591 811234 813999 815645 817807 821961 826389 828759 829246 828668 825943 819794 810849 800064 787227
57864 787227 772791 758841 746483 734499 722084 710459 700426 691071 682324 675916 672186 668989
57852 668989 665549 664290 666904 671673 676854 683618 693186 703866 713529 722498 731544 739598 746018 752671
57838 752671 761081 769559 775792 780326 785047 790088 794662 799086 803554 806460 806231 803507 799697 794979
57824 794979 789418 784196 779889 775218 769145 762364 755237 746522 735958 725852 718169 712124 706516 702124
57810 702124 699791 698533 697792 699258 704006 709984 714862 719388 725409 732602 739794 747528 756449 764814
57796 764814 770541 774384 778349 782235 784374 784511 783306 780176 774430 767624 762126 758032 753779 748918
57782 748918 743988 738554 731856 724691 718258 711716 703200 692908 683134 675553 670182 666442 663424 659661
57768 659661 654448 648956 644488 640158 633831 624776 613954 602382 590640 579256 568175 556532 544189
57755 544189 532593 522797 513744 503974 494007 485461 478737 473107 468131 463488 458275 452149 446471 442947
57741 442947 441803 442393 444613 448512 453539 459464 467015 476445 486558 496142 505049 512770 517719 519519
57727 519519 520493 523181 527640 532707 538366 545022 551815 557596 562560 567223 570848 572452 572243 570681 567467
57712 567467 562883 558435 554483 549048 540987 532600 526758 523031 519177 515065 512369 511302 510392 509048
57698 509048 508068 508016 508938 511045 513965 516318 517875 521020 527922 537347 546461 554734 563687 573725 583800
57683 583800 593610 603667 613546 622213 629747 636858 643433 649489 656680 666549 677965 688584 698248
57670 698248 708634 720247 732256 744963 759817 776946 794753 812068 829062 846377 865007
57659 865007 886536 911636 938841 966379 994430 1023921 1054333 1084895 1116780 1151574 1188426
57648 1188426 1225289 1262218 1300933 1341960 1384912 1430796 1481102 1535179 1591530 1651125 1716288
57637 1716288 1786688 1859860 1935632 2016551 2103609 2195002 2289858 2389996 2497203 2611813 2734970
57626 2734970 2869375 3016632 3176520 3350055 3540645 3750780 3979884 4226617 4490887
57617 4490887 4771911 5066209 5368973 5675691 5980845 6276438 6553103 6801821 7014268
57608 7014268 7183563 7305967 7380319 7404422 7372990 7280259 7124412 6910088 6648723 6356885
57598 6356885 6051900 5746938 5449882 5165840 4898667 4650263 4421061 4212152 4025053
57589 4025053 3858997 3710835 3578488 3462281 3361990 3275111 3199580 3135926 3084821 3044366
57579 3044366 3011900 2987191 2971867 2966588 2970547 2982979 3003576 3031975 3068198 3113164 3167666 3231354
57567 3231354 3303695 3385332 3477610 3581343 3696943 3825211 3967034 4122696 4292053 4474900
57557 4474900 4670480 4876914 5091191 5308853 5523283 5726186 5909320 6065069 6185305
57548 6185305 6261372 6286786 6259849 6183403 6062803 5904655 5716457 5506060 5280969 5047871
57538 5047871 4812094 4577273 4346071 4121283 3905597 3700421 3505962 3322655 3151637
57529 3151637 2993654 2848327 2714634 2591354 2477105 2370978 2273134 2183804 2101734 2024819
57519 2024819 1952230 1884736 1822979 1766819 1716332 1671755 1632091 1595480 1561566 1531908 1507254
57508 1507254 1485820 1465281 1445328 1427280 1412034 1399434 1389113 1381083 1375695 1373293 1373704 1376203
57496 1376203 1380469 1387230 1397141 1409420 1422750 1437145 1453591 1472205 1492299 1514105 1538585 1565584
57484 1565584 1594143 1624905 1660170 1700867 1745250 1791353 1839212 1890044 1944932 2005104 2071842
57473 2071842 2145070 2223348 2306144 2394866 2490976 2594619 2706019 2826732 2958310 3100727
57463 3100727 3252908 3413561 3580409 3749654 3917026 4078404 4228670 4361170 4469354
57454 4469354 4548223 4593873 4603260 4575711 4513794 4421975 4305167 4169008 4020003 3864104 3705763
57443 3705763 3548772 3396753 3251986 3114877 2985433 2864345 2752025 2647858 2551432 2463639
57433 2463639 2385746 2317925 2259091 2207411 2161007 2119459 2084766 2059267 2042338 2030730 2022462
57422 2022462 2018455 2019906 2026366 2037316 2053433 2074946 2100785 2130913 2167668 2213014 2265935 2324204
57410 2324204 2387383 2456578 2532698 2616780 2710774 2816106 2932135 3057226 3190264 3329868
57400 3329868 3473458 3618459 3762824 3902570 4030215 4137610 4219191 4270805 4287317 4264613
57390 4264613 4203657 4110094 3989989 3847878 3688497 3517752 3341285 3163524 2988195 2818180
57380 2818180 2654701 2497922 2348508 2207484 2074843 1949773 1832280 1723422 1623871 1533247
57370 1533247 1450707 1375187 1305315 1240149 1179821 1124466 1072890 1023497 976337 933037 894705
57359 894705 860925 830682 803259 778133 754786 732789 711637 690709 669770 649282 629882
57348 629882 612073 596501 583549 572151 560163 546680 533041 520820 510004 500008 491074 483278
57336 483278 475327 466018 456194 447758 441316 436083 431483 427498 423950 420633 417615 414433 409908 403920
57322 403920 398371 394887 392527 389383 385557 382647 381023 379669 378352 377759 377399 375299 370288 363283 356069
57307 356069 349948 345657 343392 342549 342075 341136 339143 335844 332119 329808 329722 330648 331353 332502 335196 338662
57291 338662 341198 342683 344378 346864 349925 353838 358832 363749 367290 370283 374701 380601 386193 390978
57277 390978 396640 404465 413861 423886 434509 445771 457335 469490 483245 498923 515812 533472
57265 533472 552096 571248 589635 606583 622546 637811 651942 664940 677759 691196 705208
57254 705208 719702 735071 751633 769336 788226 808382 829317 850282 871211 892546 914267
57243 914267 936023 958097 981320 1006170 1032860 1061942 1093680 1127142 1161072 1195420 1230886
57232 1230886 1267417 1304559 1342901 1383551 1426339 1470113 1514751 1561427 1610988 1663485 1719034
57221 1719034 1777325 1836453 1894147 1950352 2006749 2063513 2118349 2168932 2214349 2253740 2285618
57210 2285618 2309334 2325503 2334182 2334333 2325974 2311208 2292104 2268967 2241796 2212110 2182094 2152777
57198 2152777 2124192 2096704 2071440 2049899 2033406 2022168 2014661 2009116 2005974 2007680 2015645 2028714
57186 2028714 2045076 2064166 2085770 2108759 2132129 2156540 2183625 2214134 2247536 2282896 2319394
57175 2319394 2356501 2394438 2434324 2477470 2524778 2576881 2634228 2696735 2763755 2834528 2908258
57164 2908258 2983926 3060792 3138935 3218487 3298484 3377569 3455792 3534518 3614388 3694459 3773545
57153 3773545 3851257 3927446 4001789 4074349 4145774 4216919 4289327 4365789 4448607 4536762 4626393
57142 4626393 4714877 4803177 4893521 4986320 5080605 5176185 5273646 5372671 5471857 5570280 5668350
57131 5668350 5767007 5866699 5967314 6068772 6171400 6275631 6381253 6487087 6591539 6693310
57121 6693310 6791474 6885361 6974718 7059433 7138501 7209690 7270976 7322151 7364694 7400793 7433118
57110 7433118 7464683 7497660 7532352 7567852 7603120 7636929 7667773 7694806 7718228 7738107 7754114
57099 7754114 7767435 7781361 7798316 7817450 7836875 7856937 7879201 7903620 7929422 7957920 7991366
57088 7991366 8029110 8067592 8104290 8139208 8172276 8201660 8225060 8240413 8244998 8236164 8213703 8179764
57076 8179764 8135924 8081799 8016500 7939377 7849011 7743450 7622129 7486223 7336994 7175136
57066 7175136 7001250 6814715 6611692 6385767 6130788 5841991 5515034 5145541 4728897
57057 4728897 4258727 3726439 3124046 2446167 1686792 835050 -123677 -1204103 -2421197
57048 -2421197 -3792362 -5336179 -7070778 -9017095 -11202489 -13657804 -16413255 -19502018
57040 -19502018 -22966419 -26856588 -31225704 -36131432 -41637504 -47804448 -54677889 -62289655
57032 -62289655 -70663102 -79803481 -89681781 -100236871 -111391172 -123053096 -135109643
57025 -135109643 -147431595 -159861875 -172118897 -183636006 -193501022 -200652269 -204286949
57018 -204286949 -204243040 -201114046 -196021438 -190159832 -184348119 -178818129 -173326523 -167460726
57010 -167460726 -160903843 -153520911 -145308673 -136326328 -126668442 -116469297 -105912551 -95231338
57002 -95231338 -84688881 -74540616 -64997096 -56206405 -48254046 -41168491 -34930037 -29485265
56994 -29485265 -24761819 -20677459 -17146491 -14088050 -11432065 -9118482 -7094280 -5314005
56986 -5314005 -3741166 -2346254 -1103824 7856 1006715 1908249 2725713 3468303 4141740
56977 4141740 4752095 5307106 5812958 6272585 6688576 7065213 7406183 7713042 7987810
56968 7987810 8234771 8457937 8659046 8839843 9004110 9155566 9295775 9425768 9547501
56959 9547501 9661776 9766746 9860242 9941543 10009142 10059199 10088630 10098057 10089704 10064273 10022183
56948 10022183 9966046 9899194 9822517 9734548 9633470 9517337 9383881 9232298 9064383 8882636
56938 8882636 8688813 8485133 8272811 8044671 7780775 7457426 7064206 6612450 6127947
56929 6127947 5637055 5158077 4700532 4268369 3863588 3488460 3145329 2834866 2554902
56920 2554902 2300965 2068001 1852189 1651769 1466277 1295223 1137977 994544 865256
56911 865256 749443 645341 551575 467825 394008 329934 275835 231789 196409 167592 144964
56900 144964 130001 123259 123234 128555 139188 154058 169095 179403 182678 179580 171906 161589 150493
56887 150493 139776 129761 120966 114395 110395 108415 108564 112096 119520 129613 141295 155202 172265
56874 172265 191910 212999 235678 261115 289888 321080 351783 376772 390335 390101 378619 360439
56862 360439 338650 314906 291057 268964 249342 232019 216768 203029 189787 176759 164790
56851 164790 154134 143498 131955 120754 111868 105575 100756 96849 94140 92760 92618 93807 95993
56838 95993 98022 99305 101079 105262 112514 122386 134736 149803 167219 186068 205892 227010 249978
56825 249978 274999 301247 326301 346897 360783 367518 367663 362426 354274 346266 339922 334810 330624
56812 330624 328046 326887 325325 322527 320670 322922 330550 343390 361730 385854 414533 445858 479239
56799 479239 515018 552179 587540 617049 637276 646384 644881 635194 620057 601744 582845 566115
56787 566115 552612 541478 532689 528512 530763 538101 548056 560811 579069 604804 638056 678550
56775 678550 726674 782861 847117 918431 992686 1061201 1113227 1140964 1142432 1120727 1082049 1033820
56763 1033820 982464 931867 884089 840975 804113 773667 748632 728469 713725 705171 703138 707669
56751 707669 718672 735959 759651 790496 829317 875846 927332 977255 1015842 1034104 1028949 1004069
56739 1004069 965780 919240 868646 818335 771469 728587 688951 652588 619937 590794 565195
56728 565195 544483 530000 521444 517794 518964 525187 535777 550058 568525 590999 613890 631031
56716 631031 637396 631372 614308 589336 560085 528960 496625 463860 433024 406429 383971 363665
56704 363665 343959 324503 305589 288307 274370 264234 256048 247896 240315 234971 231653 228391 224088
56691 224088 219361 215201 212326 211340 211834 211747 209295 205195 201485 198685 195792 192564 189843 187820 185783
56676 185783 183532 181411 179053 175725 171790 168299 165273 162063 159134 157713 157636 157318 156078 154798 153999
56661 153999 152772 150144 146277 141938 137811 134633 133029 132861 133261 133217 131719 128066 123038 119129 118341
56646 118341 120028 121914 122724 122773 122652 122671 123088 123575 122907 120302 116483 112355 107680 102425 98262 96833
56630 96833 97291 97469 96790 96188 95908 95525 95650 97395 100331 102879 104569 106109 107605 108620 109536 110889
56614 110889 111748 110765 108477 106487 104893 102831 101117 101707 104534 107368 108969 110098 111384 112615 114207
56599 114207 116957 120072 121891 122739 124601 127717 130190 131345 132667 134720 136049 136231 137206 140170 143491
56584 143491 145311 146090 147011 147741 147438 146458 145547 144587 143412 142662 142693 142779 142339 141884 141991 142493 143336 145012
56566 145012 147553 150348 153331 156942 160553 162640 163002 163186 164163 165352 166462 168305 171080 173763 176131
56551 176131 179482 184399 189597 194036 198350 203158 207697 211180 213717 214894 213466 209784 206521 205383
56537 205383 204945 203475 202066 202812 205258 207020 207228 207205 208074 209358 209925 209163 207406 205976 206266 208093
56521 208093 209648 209769 209316 209503 210057 210119 209952 210424 211488 212533 213769 216079 219652 223729 227650 231537
56505 231537 236009 241496 247598 253120 257305 261072 266276 273634 282057 290044 296883 302599 307770 313397
56491 313397 319882 326151 330862 334269 337594 340805 342685 343025 343001 343234 343241 342911 342661 341866 339174 334917 331322
56474 331322 329791 329690 330152 330979 331301 329594 325941 322192 319081 315257 310110 305276 302023 299250 295569
56459 295569 291551 288357 285698 282649 279155 275476 271499 267771 265833 266271 267605 268038 267136 265145 262218
56444 262218 259122 257041 255846 254129 251602 249618 248664 247547 245942 245357 246367 247295 247121 247357 249355
56429 249355 252025 254100 256514 260417 264694 267666 269609 271515 272854 272772 272228 272809 274456 276243 278395
56414 278395 281805 286511 292117 298613 305438 311036 314725 317692 320933 323863 326265 329683 335086 340868
56400 340868 345089 348168 351610 355641 359890 364766 370372 375680 380456 386128 392887 398051 399586 399218
56386 399218 399577 400174 398993 396259 393578 390754 386727 382675 380998 381727 382681 382709 382200 380968 378318 374959
56370 374959 372409 370600 368142 364738 361473 359040 357322 356158 354969 352504 348533 344687 341853 338217
56356 338217 332080 325251 321012 319732 319134 318036 317061 316205 314526 312171 310343 309288 308266 307258 306833
56341 306833 306675 306105 305599 306094 307350 308576 309858 311332 312124 311986 312707 315773 319867 322983 325603 329134
56325 329134 332476 333334 332298 332419 334897 337933 339892 341118 342477 344330 347083 351006 355489 359745 363659
56310 363659 366790 367913 367298 367869 371881 377859 383057 387259 391471 394637 395007 393637 393192 394106 395081 396442
56294 396442 399575 403728 406842 409109 412413 416661 420010 422430 425700 430116 434436 438816 444468 450617
56280 450617 455252 458839 463932 471023 478137 484570 491619 499490 506977 514498 523995 535290 545752 554081
56266 554081 561388 568411 574947 582224 592193 603944 614424 623365 633821 646975 660230 671703 682939
56253 682939 695484 708139 719656 731289 744535 758609 771968 784415 796153 806535 815147 822640
56241 822640 829481 835341 840310 845161 850009 854348 858552 863609 869565 876240 884986 897173 911280 924312
56227 924312 936019 948837 963885 980373 998981 1022054 1049698 1079014 1108213 1138462 1170926
56216 1170926 1205197 1241622 1282125 1327508 1376592 1428824 1485018 1544953 1607290 1672677 1743919
56205 1743919 1822208 1906299 1996122 2093874 2200529 2314666 2436034 2566927 2708562 2859339
56195 2859339 3018208 3186617 3365269 3551835 3743675 3940027 4139488 4337770 4529924
56186 4529924 4712728 4883268 5037199 5170125 5279266 5363005 5420700 5453563 5463568 5451020
56176 5451020 5415598 5360143 5290590 5211456 5124004 5029061 4928426 4822868 4712165 4598041
56166 4598041 4483717 4369587 4252743 4131901 4009251 3886205 3760977 3632044 3500702
56157 3500702 3368521 3235536 3102666 2972686 2846962 2724147 2603768 2488099 2378896
56148 2378896 2275303 2176633 2084144 1998421 1918040 1842480 1773362 1711257 1654310 1601503 1554031
56137 1554031 1511951 1472912 1435949 1403114 1375453 1350730 1326955 1304823 1284700 1264782 1244472
56126 1244472 1226212 1211622 1199039 1187135 1177737 1172515 1169798 1167130 1164360 1162233 1160803 1161237 1166206
56113 1166206 1176228 1188190 1199186 1209209 1218977 1228633 1239993 1256128 1276718 1297488 1316114 1334911
56101 1334911 1355834 1377068 1396806 1416186 1435784 1453379 1468017 1482479 1498862 1515548 1531341
56090 1531341 1548691 1569839 1593556 1618667 1647126 1680706 1718517 1760747 1810848 1870850 1938486
56079 1938486 2012143 2094525 2188096 2291192 2402480 2525158 2662550 2813063 2973238 3141812
56069 3141812 3316353 3489372 3652398 3801706 3937005 4058156 4166974 4268630 4366672 4458696
56059 4458696 4539606 4605643 4652482 4674256 4669272 4643584 4604917 4555927 4496208 4426242 4344927
56048 4344927 4247210 4129141 3992794 3843064 3683392 3518203 3355146 3200486 3055714 2922000
56038 2922000 2803255 2700751 2609690 2525935 2451624 2389456 2336197 2287217 2242919 2205191 2171735
56027 2171735 2139584 2110315 2086300 2065560 2045470 2027478 2012998 1999027 1983284 1969277 1960690
56016 1960690 1955243 1949786 1946667 1948869 1953647 1957602 1963619 1975881 1992257 2008449 2025558 2046540 2069177
56003 2069177 2089734 2110022 2134040 2161263 2189678 2221320 2257876 2295020 2328186 2359989 2395148
55992 2395148 2432521 2469185 2507527 2550647 2595550 2638843 2684527 2737932 2796420 2854402 2912851
55981 2912851 2975329 3039348 3100736 3162303 3229256 3300215 3371454 3445386 3525902 3610130 3694098
55970 3694098 3781438 3876918 3976636 4074898 4175580 4286125 4405448 4528686 4658547 4800349
55960 4800349 4950832 5103780 5262044 5432139 5611937 5796081 5988735 6198238 6423755
55951 6423755 6659996 6910175 7180966 7469553 7769284 8083263 8418671 8773037 9140542
55942 9140542 9526363 9939722 10378423 10835993 11318313 11836644 12389813 12970487 13583391
55933 13583391 14239600 14938834 15676042 16459221 17300605 18195753 19132035 20112543 21150815
55924 21150815 22248101 23398240 24609144 25896161 27260081 28695755 30215911 31840899
55916 31840899 33571873 35401423 37343662 39425194 41654467 44031434 46579046 49330951
55908 49330951 52296100 55472173 58886263 62584731 66594764 70941732 75696129 80956397
55900 80956397 86797101 93289715 100567085 108812058 118198338 128911249 141212978 155415538
55892 155415538 171823166 190808313 212910485 238705255 268559797 302589025 340561923
55885 340561923 381116084 420578471 452973491 472219296 475170095 462943889 439607244
55878 439607244 409772718 377085762 344003058 312061634 282091625 254431587 229188645
55871 229188645 206375240 185902888 167602160 151302990 136852414 124065877 112734251
55864 112734251 102689209 93811470 85975903 79040135 72888072 67436331 62594517 58261850
55856 58261850 54365318 50860996 47694390 44796103 42119695 39649514 37367758 35245492
55848 35245492 33268267 31438150 29744452 28159656 26668373 25274160 23973720 22749280
55840 22749280 21590897 20502804 19483132 18518906 17605156 16748415 15947390 15189703 14471376
55831 14471376 13800652 13178886 12595645 12046316 11537108 11068677 10630945 10217688 9830851
55822 9830851 9467473 9117709 8779140 8458443 8155822 7861912 7573073 7295676 7031936
55813 7031936 6774893 6520998 6275134 6039679 5810304 5585571 5369325 5160914 4954003
55804 4954003 4747473 4546923 4353638 4162896 3974945 3796778 3631215 3474772 3327830
55795 3327830 3196101 3080211 2974268 2876152 2788509 2708186 2626006 2539385 2454611 2374553 2294899
55784 2294899 2214874 2140638 2074729 2012309 1951232 1896099 1849080 1806071 1765146 1729564 1699324
55773 1699324 1669014 1637452 1610380 1589979 1570475 1547828 1525202 1504949 1483461 1458239 1432360
55762 1432360 1407779 1381327 1351310 1321218 1293222 1264565 1233756 1203872 1176575 1149394 1121806
55751 1121806 1097279 1076295 1054237 1029423 1006534 988815 973511 958370 945996 938087 931720 925127
55739 925127 921119 921064 921254 918818 915495 912028 904704 891504 876312 863080 850611 836623 822056
55726 822056 807873 792433 775529 760404 748506 736843 723667 712027 704480 698939 692947 687441
55714 687441 682891 676298 665595 653077 641291 629496 617036 605890 596792 586968 574782 562648
55702 562648 552459 542441 531397 521612 514071 504980 490836 473534 457143 442927 430491 420299
55690 420299 411990 403563 395122 390039 389766 391040 391039 391500 394613 398356 399291 396952 392525 386273 379124 373686
55674 373686 370748 367728 363176 359645 359401 360638 360861 360691 361161 360356 356179 349897 343869 338143 332087
55659 332087 326803 323051 319138 313644 308109 304569 302613 301010 299838 298941 296945 293981 292665 294248
55645 294248 296531 297713 299264 302686 306455 308715 310094 311295 310796 307657 303909 301508 299578 297221
55631 297221 296317 298719 303163 307574 312015 316898 320983 323795 327421 333204 339143 343258 346906 351959
55617 351959 357225 360594 362323 363198 361768 356512 348872 341284 334036 326633 320178 315735 312283 308922
55603 308922 307147 308363 311067 312958 313914 314607 314521 313925 315479 320862 327656 332244 334029 334379 333650 332040
55587 332040 331289 332489 333756 332671 329406 325123 319379 311752 303986 297714 291752 284340 276224 268874
55573 268874 261565 252997 243945 235579 226973 217165 207858 201118 196052 190680 185420 181725 178834 174969
55559 174969 170391 166368 162501 158044 154581 154276 156383 158196 158540 157915 156479 154453 153341 154198 155800
55544 155800 156708 157657 159460 160271 157794 152916 148473 145558 143539 142308 141989 141741 141261 141921 144138 145520
55528 145520 144271 142318 142150 142705 141787 140500 141385 143739 144807 144439 144630 145505 145837 146782 150844 157259
55512 157259 162332 164562 165997 168424 171543 175182 180162 186622 194136 203416 215029 226483 233567 234871
55498 234871 232482 228445 223353 218130 213879 209519 202550 192867 183295 175835 169718 163681 157849 152660
55484 152660 147858 143111 138122 132149 125121 119004 116155 116379 117298 117316 116425 114717 112324 110540 110790 112616
55468 112616 114484 116124 118113 119802 119932 118843 117808 116686 114559 112197 111396 112120 112682 112443 112010 111146
55452 111146 109038 106391 104766 103969 102509 100402 99046 98516 97521 95820 94137 91862 87611 82212 78432
55437 78432 77371 77468 77203 76427 74966 72454 69887 68957 69492 69614 68467 66721 64620 62025 60123 60321
55421 60321 61455 60873 58420 56514 56114 55672 54435 53595 53300 51693 48209 45061 43995 43878 42921 41267
55405 41267 40063 39727 40254 41591 42837 42714 41591 41363 42689 44079 44307 43880 43509 42907 41804 40401
55389 40401 38303 34757 30512 27625 26938 27396 28099 28984 29251 27501 24156 21558 20898 21030 20924 21060 21662
55372 21662 21835 21449 21707 22911 23801 24099 25438 28461 31224 31953 31487 31449 31769 31638 31351 31546 31812 31561
55354 31561 31233 31444 31943 32598 34318 37858 42510 46832 49921 51533 52113 53132 55976 59871 62269 61906
55338 61906 59999 57962 55795 53593 52708 53854 55460 55345 53176 50213 47597 45883 45298 45526 45911 46419
55322 46419 47482 48663 48803 48029 48036 49606 51328 51635 50670 49168 47015 44193 41915 41244 41258 39917 36476
55305 36476 32246 29267 28740 30337 32590 34198 34918 34841 33512 30883 28477 27895 28393 27705 25220 22446
55289 22446 20395 18690 17500 17979 20012 21796 22591 23914 26893 30319 32380 32632 31245 28238 24709
55274 24709 22947 23820 25456 25909 25701 26365 27841 28885 28944 28217 26689 24420 22111 20430 19487 19528 20995
55257 20995 23241 24466 23766 22132 20733 19615 18756 18801 19794 20681 21123 22279 24752 27330 28953 30355
55241 30355 32387 34266 35115 35830 37631 39723 40203 38690 36624 35387 35240 35670 35897 35519 35186 35837 37036
55224 37036 37252 36170 35193 35083 34978 34532 35005 36900 38416 37878 36174 35091 34668 33889 32715 31683 30582
55207 30582 29185 28256 28370 28765 28825 29397 31117 32707 32704 31685 31007 30576 29778 29444 30634 32352 32734 31964
55189 31964 31904 33260 35073 36615 37845 38311 37480 35968 34674 33046 30024 26428 24424 24597 25387 25559
55173 25559 25515 25917 26625 27520 29087 31668 35026 38838 42764 46028 47739 47680 46176 43567 40558 38509
55157 38509 38288 39133 39600 39169 38090 36420 34450 33350 33903 35047 35195 34659 35182 37382 40279 43186
55141 43186 46177 48520 48555 45985 42937 41798 42799 44406 45332 45463 45238 44934 44625 44427 44511 44717 44440
55124 44440 43337 42012 41273 40786 39477 37426 36111 36196 36347 35130 32887 30772 29029 27491 26723 27133
55108 27133 27608 26657 24595 23316 24076 26617 30097 33731 36633 38104 38183 37519 36973 37533 39571 41696
55092 41696 41722 39816 39253 42494 47744 51212 51783 51254 50689 49187 46522 44555 44974 47052 48672 48710 47670
55075 47670 46556 45793 45176 44549 44230 44315 43912 42204 40505 41658 46485 52129 55171 55246 54370 53999 54461
55058 54461 56173 59259 62423 64065 64257 64116 63732 62465 60813 60129 60643 61565 62903 65341 68396 70543
55042 70543 71319 71573 71609 70894 69749 69451 70252 70984 71140 71674 73134 74595 75287 75925 77423 79310 80350
55025 80350 80021 78672 76785 74746 72967 71765 71232 71245 71377 71084 70420 70197 70954 72319 73979 76419 79751
55008 79751 82682 84062 84775 86446 88709 89579 88463 87086 87131 88473 90035 91061 91176 90320 88989 87800
54992 87800 86788 85912 85802 86781 87479 85959 82274 78641 77045 77819 80305 83383 85472 85589 84586 84019
54976 84019 83904 83159 82025 82080 83690 85466 86638 87932 89434 89678 87988 85997 85508 86176 86589 86607 87263
54959 87263 89028 91304 93239 94285 94466 94646 96009 98723 101612 103463 104143 104217 104304 105100 107088 109613
54943 109613 110844 109318 105374 100954 98232 98232 100147 102116 103090 103616 104332 104639 104020 103753 105533 108711
54927 108711 110851 110886 109821 108181 104963 99845 94592 91181 89926 90340 92453 96184 100466 104113 106950
54912 106950 109470 112016 114753 117623 119929 120783 120338 119778 119879 120537 121752 123770 126013 127246 127424 128200
54896 128200 131080 136032 142193 148738 154783 159843 164907 171746 180702 190457 200354 211220 223262 234891
54882 234891 244725 253396 262300 271746 281184 289806 295920 297220 293098 285679 277473 269073 260131 251060
54868 251060 242212 232630 221417 209575 198820 189246 179901 171164 164747 161358 159758 158233 155802
54855 155802 152084 147362 143071 141076 141882 144084 145966 147262 149269 153538 160474 168901 176943 183539
54841 183539 189214 195529 203956 215026 227974 241109 252930 262871 270662 275428 276218 273127 266910
54828 266910 257752 245635 231803 218473 206866 196698 187663 179875 172525 163852 153288 142399
54816 142399 133087 126060 121542 119848 120210 120441 118961 116148 112850 108841 103964 99633 97712 98513 100898
54801 100898 103687 105982 106890 105998 103772 100863 97722 95276 94780 96060 97036 96032 93748 92108 92097 93520
54785 93520 95683 97229 96612 94030 91772 91262 90831 88028 83150 78759 76351 75295 74649 74214 73831 73154
54769 73154 72384 72191 72866 74279 76448 79343 82459 85291 87821 89915 90959 90927 91062 92627 95616 99459
54753 99459 103881 108095 110483 110628 110662 112851 116592 119482 120607 120978 121293 121475 122241 125114 130587 137731
54737 137731 145645 153898 161911 169596 178393 189731 202520 214283 224955 237305 252817 269345
54725 269345 284015 296585 308417 319507 328259 333466 334999 333017 327852 320568 312539 304379 295972
54712 295972 287479 279649 273070 267724 263393 259969 257100 253946 249966 246063 244452 246705 251874 257076
54698 257076 260248 261992 264509 269161 275597 282991 291425 301801 314594 329056 343912 358868 374932
54685 374932 392930 412251 431715 450879 469190 484287 493034 494625 491095 484233 473638 458584
54673 458584 440084 419801 398302 375845 353788 333670 315647 299232 284768 272721 262153
54662 262153 251409 239991 228576 217813 208370 201476 197899 196654 195916 194774 193050 190219 186076
54649 186076 181837 178919 176890 174121 170134 165985 162770 161215 162085 165151 168132 168654 167173 166205 166862
54634 166862 168110 169383 171639 175239 178678 180209 179490 177332 175218 175213 178603 184055 188508 190313 190265 189609
54618 189609 188826 188616 189946 192451 194630 196452 199907 206058 213355 219985 226060 232087 237086 240159 242721
54603 242721 247080 253380 259696 264748 268882 272558 275408 277126 278276 279856 282549 286387 290829 295353
54589 295353 300307 306742 315067 324355 333408 341978 350507 359444 369493 381812 397012 414259 432220
54576 432220 450545 469531 488584 506005 520528 532248 541629 548008 549524 544502 532765 515629
54564 515629 494803 471578 447126 423152 401535 383206 367707 353955 341162 329096 317958
54553 317958 308256 300547 295096 291768 289977 288515 285903 281468 275982 270722 266070 261536 256857 252327
54539 252327 248077 243740 238886 233389 227378 221336 215924 211184 206286 200766 195590 191941 189205 185346
54525 185346 179416 172694 167120 163474 161231 159398 157169 154424 151746 149652 147942 146244 144624 142910
54511 142910 140165 136052 132073 129883 128762 126605 123186 120362 118868 117268 114905 113709 115663 120073
54497 120073 124792 128789 131921 133317 132018 128915 126430 126154 127714 129880 131895 133727 135753 138394
54483 138394 141723 145452 149354 153397 157389 160992 164296 167902 172246 177287 182939 189270 196354 204486
54469 204486 214240 225325 235715 243374 248940 255130 263146 271250 277385 281392 283657 283311 279308 272131
54455 272131 263013 252490 241172 230915 223451 218274 213444 208037 202328 195970 187899 178346 169380
54442 169380 162765 158249 154572 151349 149222 148476 148193 146916 143956 139895 135896 132824 131238 131613 133724
54427 133724 135946 136276 134382 131890 130395 130032 130181 130539 131085 131990 133989 137725 142134 144740 144416 142678
54411 142678 141336 140187 138293 136298 135650 136286 136897 137141 137864 139246 140432 141117 141989 143202 143788 143054
54395 143054 141589 140318 139441 138666 137750 136338 134001 131033 128715 128168 129073 129907 129411 127662 125731 124392
54379 124392 123372 122090 120921 121021 122673 124516 125034 124321 123766 124342 125944 128047 130207 131916 132640 132214
54363 132214 130929 129274 127829 127130 127273 127818 128350 128823 129160 129033 128602 128951 131103 134840 139074 143164
54347 143164 147295 151818 156848 162394 168274 173970 178971 183291 187394 191777 196862 202913 209631 216127
54333 216127 221705 226453 230750 234503 237206 238395 237858 235897 233691 232661 232875 232648 230381 226331 221936
54318 221936 217983 214241 210414 206499 202414 198155 194337 191776 190419 189129 186651 182602 177729 173391
54304 173391 170518 168898 167760 166935 166665 166338 164680 161726 159319 158762 159209 159508 160431 163431 168001 172118
54288 172118 175015 177749 181076 184477 187524 190678 194176 197455 200336 203706 208294 213453 217862 221051
54274 221051 223636 226294 228837 230281 229858 227993 225945 224244 222061 218675 214851 211802 209259 205762
54260 205762 200681 194757 188578 181758 173953 165695 157781 150631 144622 140287 137657 135905 134054 131704
54246 131704 128959 126093 123467 121259 119194 117030 115280 114757 115171 114871 112437 108175 103750 100670 99414
54231 99414 99643 100800 102380 103778 104226 103378 101944 101173 101413 101733 101410 100985 101099 101005 99480 96981 95541
54214 95541 96306 98220 99529 99755 99637 99768 99963 99804 99338 99143 99725 100910 101970 102358 102072 101288 100202
54197 100202 99426 99867 101696 103982 105760 106919 107601 107573 106892 106277 105834 104260 100603 96203 93430 92818
54181 92818 92906 92651 92433 92582 92452 91442 89906 88680 88591 90438 94317 98795 101907 103271 104221 105740 107410
54164 107410 108712 109995 111499 112452 111962 110134 107773 105506 103616 102127 100780 99393 98320 97885 97446
54149 97446 96034 93980 92760 92965 93610 93872 94359 96021 98805 101991 104951 106939 107179 105955 104800 104741
54133 104741 105050 104523 103265 102337 102162 102171 101706 100616 99245 98373 98756 100209 101642 102482 103457 105342 107517
54116 107517 108563 107956 106421 104949 104061 103717 103240 101685 99018 96727 96503 98316 100390 101072 100252 98963
54100 98963 98146 97974 98145 98645 100072 102889 106279 108265 107434 104277 100501 97367 95131 93697 93021 92821
54084 92821 92485 91580 90171 88503 86667 84848 83640 83738 85167 87093 88516 89030 88797 88131 87519 87733 89193
54067 89193 91222 92599 92939 92755 92085 90240 87427 85377 85425 86963 88890 91513 95501 99683 101819 101480
54051 101480 100461 100191 100176 99287 97315 94906 93020 92523 93233 93345 91130 87348 84699 84786 86891 89688
54035 89688 92331 93636 92277 88747 85507 84184 84012 83857 84129 85479 87174 88258 89222 90958 92878
54020 92878 93533 92510 90581 88626 87422 87715 89326 90914 91695 92603 94687 97318 99237 100407 101299 101317
54004 101317 99867 98346 98931 101470 103523 103670 102976 102804 102998 103011 103386 105015 107763 110758 113556 116379
53988 116379 119480 122747 125856 128696 131794 136052 141579 147073 151071 153632 156066 159174 162698 166530
53974 166530 171318 177422 184137 190571 196751 203250 210130 216871 223184 229395 235908 242647 249102 254821
53960 254821 259726 264066 268233 272620 277299 281639 284645 286176 287555 290253 294008 297036 298133 297708
53946 297708 296508 294389 290957 286646 282391 278677 275456 272539 269587 266156 262193 258037 253723 249002
53932 249002 244242 240304 237029 233062 227971 223371 220813 219544 217668 214749 211825 209430 207177 204980
53918 204980 203278 202120 201260 201047 201986 203522 204432 204330 203730 202847 201620 200745 201173 202493 203273 203271 203915 206174
53900 206174 209170 211396 212149 211341 209080 206183 204127 203673 204170 204598 204564 203833 201957 199198 197214 197933
53884 197933 201951 208343 215525 221962 226728 230103 233314 237295 241973 246953 252286 258112 264077 269579
53870 269579 274252 277904 280504 282636 285339 288877 292065 293542 293507 293539 294723 296642 298368 299980 302598
53855 302598 307018 312707 318434 323668 328927 334723 340827 346913 353284 360277 367355 373727 379723 386560
53841 386560 394515 402143 407687 410667 411758 411605 410351 408200 406011 405062 405968 407752 408390 406679 403266
53826 403266 399486 395668 391103 385062 376968 366161 352904 339472 328702 321035 314122 305771 296229
53813 296229 287100 279209 272373 266398 261367 257327 254257 251874 249104 244555 238129 231458 226039 221528
53799 221528 216628 211039 205655 201228 197765 194994 192648 190405 188123 185945 183664 180428 175772 170625
53785 170625 166496 163938 162596 162486 164083 166970 169372 169616 167623 164809 162959 163162 165121 167134 167385
53770 167385 165716 163839 163460 164593 166036 167073 168102 169751 171979 174167 175745 176490 176443 175833 175123 174981
53754 174981 175927 177766 179464 179954 179308 178934 180266 183304 186675 189169 190939 193153 196706 201449 206433
53739 206433 210711 214112 217548 222497 229790 238676 247210 253807 258494 262605 267200 271810 274984 276266
53725 276266 277306 280502 286486 293525 299465 303521 305933 307006 307416 308641 311688 315568 318255 319072 318940
53710 318940 318392 316882 314393 312145 310875 309616 307061 303169 298550 293310 287532 282090 277915 275077
53696 275077 273444 273324 274375 274807 273079 269806 266643 263949 261043 258146 256190 254886 252796 249473 245952
53681 245952 242889 239857 236745 234254 232485 230494 227892 225448 223414 220619 216260 211456 207995 206328
53667 206328 205742 205707 206124 206853 207918 209677 212040 214011 214738 214619 214764 215904 218383 222558 228331 234650
53651 234650 240255 244714 248266 251154 253663 256306 259271 262106 264701 268103 273369 279830 285549 289572
53637 289572 292925 297037 301878 306149 309053 311416 314873 320026 325610 329733 331815 333000 334831 337986
53623 337986 342257 347017 351432 354858 357400 359660 361775 363289 364150 365024 366224 367179 367579 368169 369514
53608 369514 370631 369977 367522 364820 363171 362601 362594 362853 363192 363482 363984 365001 365995 365643 363180 359224 354984
53591 354984 351195 348219 346659 347108 349323 352152 354410 355493 355226 353693 351532 349864 349332 349361 348926 347931
53575 347931 347147 346869 346607 346442 347691 351331 356452 361288 365335 369364 373592 377094 379218 380581 382298
53560 382298 384949 388505 392598 396637 400262 403887 408290 413699 419817 426494 433553 440292 446354 452915
53546 452915 461517 471493 480160 486081 490687 495923 501815 507506 513385 520728 529986 540595 551876 563026
53532 563026 572841 580670 587261 593820 600753 608073 616064 624359 631184 635110 637168 639804 643999 648783
53518 648783 653315 657908 662907 668007 672917 677487 680970 682409 682212 682128 683156 684411 684636 683976 683498 683648
53502 683648 683942 683883 683504 683043 682440 681304 679482 677724 677408 679176 682072 684558 686124 687287 688335 689035
53486 689035 689553 690698 692962 696069 699666 703760 708225 712586 716669 720892 725519 730159 734384 738495
53472 738495 743314 749577 757738 767882 779479 791490 803089 814138 824975 836135 848433 862790
53460 862790 879505 897917 917094 936766 957420 979592 1003180 1027382 1051320 1075019 1099763
53449 1099763 1127204 1157909 1190896 1224629 1258303 1292247 1327354 1364234 1402777 1442531 1483536
53438 1483536 1526497 1571859 1618934 1666370 1713458 1760624 1808679 1857901 1907884 1957984 2007957
53427 2007957 2058275 2109566 2161565 2212931 2262602 2310932 2358954 2406820 2453784 2499593 2544974
53416 2544974 2590516 2635839 2680235 2723532 2765835 2806821 2845814 2882448 2916979 2949962 2981822
53405 2981822 3012695 3042535 3071162 3098016 3121965 3141955 3158075 3171483 3182813 3191204 3195575 3196341
53393 3196341 3194774 3190765 3182422 3168249 3148937 3126603 3102892 3078169 3051933 3023443 2992307 2958815
53381 2958815 2923563 2886662 2847788 2807061 2765277 2722983 2680046 2636608 2593808 2552851 2513618
53370 2513618 2474911 2435943 2397099 2359445 2324096 2291971 2263511 2238364 2215767 2195421 2177603
53359 2177603 2162320 2148899 2136904 2127092 2120766 2118263 2118863 2122464 2130501 2144331 2163141 2184467 2206874
53346 2206874 2231150 2258665 2289605 2323465 2360318 2400431 2443033 2486709 2531167 2577751 2628057
53335 2628057 2682712 2741648 2804668 2871197 2940134 3010782 3083827 3160791 3242316 3327403 3414663
53324 3414663 3504087 3596979 3693937 3793471 3893238 3992398 4091972 4192922 4294848 4396837 4498637
53313 4498637 4600278 4701308 4801113 4899370 4995362 5087364 5173627 5253543 5327076 5393578 5452306
53302 5452306 5503763 5549273 5589276 5623114 5650419 5671511 5686294 5693937 5693942 5686449 5671167 5647152
53290 5647152 5614270 5573953 5527771 5475774 5416681 5349144 5272506 5187169 5094874 4998085 4898495
53279 4898495 4796511 4692534 4588075 4484957 4383799 4283969 4184878 4086897 3991108 3898344
53269 3898344 3808283 3719345 3629871 3539636 3450060 3363046 3280016 3201805 3128515 3059261 2993018
53258 2993018 2930117 2872099 2819566 2771078 2724906 2681153 2641176 2605359 2572532 2541540 2512475
53247 2512475 2486150 2462953 2442517 2424338 2408432 2395279 2385014 2376935 2370193 2364919 2362086 2362242
53235 2362242 2365050 2370192 2377883 2388162 2400500 2414644 2431058 2449848 2470080 2491189 2514504 2542263
53223 2542263 2575183 2611898 2650576 2690230 2730548 2771514 2813443 2856640 2900673 2944459 2987223
53212 2987223 3028830 3069128 3107681 3144349 3179487 3213154 3244644 3273186 3298561 3320511 3338138
53201 3338138 3350842 3359748 3367164 3374124 3379030 3379242 3373664 3363212 3349103 3331570 3310366 3285593 3257339
53188 3257339 3224975 3187638 3145452 3099757 3052062 3003051 2952522 2899833 2844463 2786661 2727640
53177 2727640 2668759 2610435 2552224 2493981 2436408 2380301 2325818 2272886 2221957 2173824 2128626
53166 2128626 2085276 2042040 1997824 1953035 1909091 1866968 1826357 1786515 1747658 1711010 1677453
53155 1677453 1646574 1617161 1588304 1559950 1532712 1507250 1483681 1461503 1440059 1418808 1396987
53144 1396987 1373618 1348450 1322578 1297457 1273452 1249963 1226801 1204612 1183927 1164426 1145210
53133 1145210 1125377 1104474 1082931 1061866 1041888 1022391 1002659 983041 964019 944718 923823
53122 923823 901837 880839 861839 843795 825502 807010 788893 771517 755485 741251 727789
53111 727789 713170 697161 681722 668228 655881 643801 632718 623140 613569 602378 590181 578419
53099 578419 566763 553982 540564 528271 517575 507557 498034 489649 481979 473685 464799 456991 451077
53086 451077 445946 440445 434823 429701 424997 420561 416737 413657 410914 408396 406445 404773 402321 398810
53072 398810 395436 393325 392126 390752 388809 386619 384468 382399 380292 377769 374612 371660 370535 371849
53058 371849 374189 375449 374839 373172 371663 370942 370949 371262 371465 371272 370280 367925 364304 360910 359757 361543
53042 361543 365247 369597 374175 378868 383118 386353 388679 390672 392779 395123 397404 398791 398440 396390
53028 396390 393454 390035 385704 380268 374596 369879 366430 363531 360013 354938 348452 342354 338916 338500
53014 338500 338911 337741 334724 331091 327338 322793 317055 310653 304184 297724 291379 285645 280830 276658
53000 276658 272823 269461 266678 264002 260864 257414 254322 251801 249405 246967 245062 244018 242984 240887
52986 240887 238168 236510 236509 236577 234897 231653 228362 225474 221917 216910 211181 206123 202619 200892 200691 201192
52970 201192 201313 200529 199086 197382 195721 194657 194749 195665 196262 195914 195123 194457 193664 192327 190749 189524 188693
52953 188693 187920 187247 187123 187934 189756 192187 194153 194486 193123 191204 189544 187672 184984 182151 180379
52938 180379 179691 179030 177997 177490 178437 180702 183489 186176 188378 189684 189820 189014 187930 187278 187403 188127
52922 188127 188993 189812 190886 192590 194843 197224 199416 201305 202714 203334 202940 201627 199965 198970 199600 201974
52906 201974 205328 208935 212791 217097 221473 225227 228293 231349 234957 238978 242893 246489 250127 254458
52892 254458 259823 265908 272136 278336 284598 290534 295450 299609 304397 310423 316113 319261 319579 318607 317471
52877 317471 316132 314824 314477 315043 314790 312338 308472 304867 301809 298374 294337 290551 287629 285444 283825
52862 283825 282539 280578 276836 271899 267849 265643 263864 260960 257708 256176 256927 258670 260275 261617
52848 261617 262430 261933 260177 258525 258027 258217 258289 258543 259569 260694 260582 259274 258481 259600 262291 265207
52832 265207 267363 268469 268659 268415 268351 268649 268971 269120 269284 269281 268122 265114 261236 258665 258685 260513 262343
52815 262343 263190 263411 263829 264871 266529 268565 270436 271352 270884 269571 268676 269314 271824 275689 279719 282577
52799 282577 283726 283967 284552 285779 287052 288281 290262 293255 296114 297706 298509 299897 302336 305240 308129
52784 308129 310720 312197 312063 311897 314670 321444 329861 336796 341487 345041 347872 349334 349542 349810 350879
52769 350879 352038 352658 353485 355481 358157 360334 362156 364899 368530 370865 370050 367032 364359 362954 361345
52754 361345 358087 353615 349230 345331 341442 337228 332668 327749 322778 318526 315266 312071 307879 302835
52740 302835 297765 292785 287642 283066 280314 279102 277312 273270 267460 261586 256780 253153 250207 247116
52726 247116 243308 239278 236259 234669 233558 231970 230084 228424 226831 224968 223269 222405 222117 221363 219523
52711 219523 216896 214186 211785 209382 206057 201331 196363 193329 193009 193818 193954 193656 194146 195004 194263 191150
52695 191150 187259 184472 182863 181411 179870 178874 178546 178056 176767 175113 173853 172832 171148 168519 165831
52680 165831 163875 162119 159460 155973 153010 151455 150803 150233 149695 149368 148842 147631 146062 144871 144242 143923
52664 143923 144005 144785 145925 146394 145420 143182 140615 138711 137735 136914 135329 133303 132328 133102 134328 134213 132651
52647 132651 131021 130175 129631 128593 126866 124751 122862 122111 123093 125374 127873 129902 131285 131856 131758 132137
52631 132137 134426 138782 144044 149305 154455 158988 161657 162184 162444 164852 169782 175406 179910 183226 186465
52616 186465 190248 193944 196523 197802 198565 199497 200483 201175 201581 201486 199900 196060 190800 185866 181873 177937
52600 177937 173376 168540 163688 158297 152269 146876 143590 142595 143103 144417 145919 146779 146684 146306 146014 144680
52584 144680 140991 135693 131204 128990 128519 128866 129836 130855 130214 126821 122206 119504 120366 123644 127147
52569 127147 129886 132221 134451 135929 135651 133421 130289 127837 127016 127644 128916 130165 131029 131187 130404 128943
52553 128943 127585 127023 127404 128472 129857 130954 130912 129253 126476 123631 121338 119566 118354 118170 119320
52538 119320 121399 123630 125539 127192 129009 131523 134900 138542 141462 143310 144666 146098 147431 148359
52524 148359 149311 151137 154184 158173 162699 167251 170968 173136 173899 174028 174039 174029 174242 175094 176623 178457
52508 178457 180361 182392 184607 187098 190148 193679 196828 198930 200748 203555 206942 208825 208126 206213
52494 206213 204950 204439 203691 202649 202218 202750 203724 204713 205608 206025 205623 205061 205521 206971 207889 207187 205694
52477 205694 205164 206365 208608 210731 212030 212573 213003 213845 214645 214137 211690 208408 206377 206900 209716 213628
52461 213628 217443 220568 223361 226884 231663 236493 239044 238024 234407 230359 227382 225670 224705 223861 222806
52446 222806 221911 222012 223197 224147 223523 221871 221084 221899 222995 222959 222023 221075 220036 218447 217017 217031 218291
52429 218291 219004 218120 216797 217079 219876 224621 230093 234983 238302 240038 241228 242905 245129 247289 248945
52414 248945 250028 250596 250901 251371 252110 252724 253160 254308 257016 260692 263683 265098 265552 265927 266149 265594 264171
52397 264171 262439 260935 259937 259804 261017 263700 267360 271182 274455 276630 277265 276240 274067 271764 270194
52382 270194 269469 269131 268913 269193 270506 272797 275432 277990 280699 283955 287682 291446 294972 298155 300731
52367 300731 302514 304016 306189 309184 311827 312788 311899 309846 307026 303601 300439 298833 298884 299001 297621
52352 297621 294882 292111 290200 289087 288333 287482 286176 284640 283810 284308 285512 286364 286855 287782 289182 290139
52336 290139 290344 290695 291775 292759 292727 292286 292867 294719 296670 297935 299177 301441 304764 308336 311630 314738
52320 314738 317696 320012 321225 321708 322555 324537 327253 329455 330182 329471 328073 326770 326116 326659 328944 332950
52304 332950 337573 341138 342868 343829 346036 350503 356378 361950 366100 368661 370027 370920 372201 374252 376592
52289 376592 378622 380705 383982 388959 394635 399317 402215 404178 406865 411135 416215 420597 423625 425787
52275 425787 427570 428894 430028 432015 435301 438737 441126 443279 447155 453053 459113 463788 467413 470888
52261 470888 474123 476779 479570 483781 489845 497149 504934 512770 520485 528189 536238 544869 554060 563790
52247 563790 573968 584061 593528 602882 613556 626401 641076 657218 675132 694639 714206 732299
52235 732299 749010 765580 782911 801352 821147 841985 862768 882966 903747 926559 951056
52224 951056 975702 999960 1024369 1048761 1072187 1094806 1118060 1142376 1166192 1187950 1207679
52213 1207679 1225874 1242157 1256170 1268708 1280818 1292611 1304002 1315681 1327889 1338977 1346882
52202 1346882 1351859 1356186 1361008 1364987 1366494 1365780 1364173 1362195 1359437 1355666 1351085 1345842 1340246 1335395
52188 1335395 1332765 1332918 1335093 1338130 1341389 1344711 1348036 1351470 1355401 1360145 1365645 1371881 1379512 1389588
52174 1389588 1402382 1416744 1430979 1444341 1457509 1471611 1487050 1503291 1519466 1534903 1549229
52163 1549229 1562317 1574224 1585033 1594737 1603457 1611579 1619197 1625391 1628654 1628514 1626258 1623443 1619960
52150 1619960 1614390 1606199 1596572 1586818 1576888 1566171 1555083 1544789 1535490 1525801 1514018 1499585 1483472
52137 1483472 1467632 1454012 1443394 1434924 1426984 1418491 1409042 1398300 1386233 1374036 1363741 1356304
52125 1356304 1350675 1345305 1340068 1336100 1334139 1333722 1333887 1333981 1333607 1332208 1329178 1324461 1318987 1314243 1311083
52110 1311083 1308915 1306247 1302029 1296337 1290038 1284284 1280171 1278019 1276676 1274146 1269278 1262556 1255149 1247950
52096 1247950 1241844 1237978 1236761 1236910 1236359 1234132 1230834 1227410 1224013 1220114 1215226 1209378 1203129 1197223
52082 1197223 1192128 1187904 1184394 1181160 1177243 1171639 1164461 1157134 1151011 1146149 1141915 1138265 1135681 1134090
52068 1134090 1132587 1130220 1126579 1121738 1116137 1110472 1105232 1100467 1096301 1093274 1091582 1090422 1088944 1087681
52054 1087681 1088064 1090407 1093232 1094956 1095661 1096832 1099800 1104771 1111129 1118391 1126852 1137183 1149295 1161993
52040 1161993 1174205 1186436 1200472 1217747 1238281 1260841 1283505 1304549 1323845 1343513 1366265
52029 1366265 1392838 1421653 1450878 1479825 1508252 1535573 1561601 1587224 1613380 1639698 1664767
52018 1664767 1687568 1708022 1726439 1742938 1757429 1769823 1780314 1789519 1798054 1805866 1812264 1816634
52006 1816634 1818643 1817813 1813737 1807157 1799971 1793490 1787148 1779527 1770141 1759537 1748179 1736280 1724576
51993 1724576 1714285 1706054 1699510 1693939 1688838 1683755 1678246 1672383 1666934 1662833 1660569 1660006 1660420 1660810
51979 1660810 1660744 1661046 1663145 1667498 1673090 1678708 1684226 1690243 1696880 1703515 1709588 1715111 1720293 1724953 1728414
51964 1728414 1729875 1729038 1726612 1724094 1722605 1721776 1719980 1715817 1709238 1701234 1692659 1683444 1672749 1659802
51950 1659802 1644721 1628573 1612397 1596194 1579129 1560682 1540991 1519919 1496684 1471009 1444124
51939 1444124 1417698 1392070 1366279 1339533 1311684 1282530 1251925 1220678 1190053 1160005 1129113
51928 1129113 1096783 1064238 1032598 1001393 970059 939649 911479 884999 858771 832911 808692
51917 808692 786089 763716 741238 719794 699644 679495 658931 639599 622712 606988 590545
51906 590545 573690 558248 544994 533312 522697 512913 503083 492305 481190 471391 463476 456526
51894 456526 449926 444198 439685 435603 430965 425550 419546 413214 407404 403477 401873 401359 400361 398420 395756
51879 395756 392103 386989 380761 374358 368294 362740 358362 355807 354146 351083 345544 339300 335099 333505
51865 333505 332444 329762 325419 320963 317583 315192 313074 310913 309058 307930 307200 305714 302557 298358
51851 298358 295158 294585 296282 298348 299208 298641 297233 295475 293680 292277 291598 291383 290868 289456 287153 284342
51835 284342 281369 278503 276063 274272 272954 271617 269978 268236 266659 265045 262957 260458 258204 256581
51821 256581 255103 253060 250695 249380 250447 253855 258063 261200 262514 262754 263132 264043 264981 265463 265416 264710
51805 264710 263120 261220 260592 262282 265433 268311 270452 272852 276055 279209 281430 283147 285409 288416
51791 288416 291518 294293 296839 299101 300618 301099 300813 300252 299655 299008 298332 297891 298115 299261 301007 302518
51775 302518 303128 302948 302571 302186 301279 299349 296765 294694 294177 295413 297921 301208 305071 309204 312766 314600
51759 314600 314062 311656 308723 306435 305099 304546 304979 306893 309876 312095 311756 309091 306158 304500 303651
51744 303651 302263 300098 298315 298211 300150 303472 306892 309143 309743 309215 308487 308355 309510 312369 316336
51729 316336 319890 322099 323601 325374 327075 327573 326746 325670 325262 325893 328170 332625 338284 342912 345433
51714 345433 347168 349913 353638 356896 358888 360182 361681 363671 365830 367645 368847 369753 371107 373512
51700 373512 377220 382365 388841 395852 402434 408791 416378 426069 436850 446994 455929 464002 470828 475193
51686 475193 476768 476851 476730 475999 473394 469141 465513 464588 466024 467758 468573 469008 469681 469975 469247 468364 468647
51669 468647 469690 469697 468097 466474 466511 468173 470534 473319 476706 480241 482902 484042 483755 482553 481062 479751
51653 479751 478602 477282 475753 474374 473370 472724 472584 473029 473416 472871 471649 470960 471127 471056 470059 468995 468753
51636 468753 468762 468173 467586 468266 470230 472436 474490 476872 479702 482456 484909 487295 489585 491609 493993 498011
51620 498011 504195 511608 518598 523834 526829 528098 528746 529351 529362 528086 525937 523974 522420 520354 516841
51605 516841 511754 505564 498953 492505 486255 479681 472624 465774 459663 453702 447127 440478 435004 430750
51591 430750 426436 421318 416087 411624 407768 403716 399016 393858 388855 384661 381491 379012 377011 375733
51577 375733 374996 373611 370741 367554 366230 367339 369284 370410 370425 369570 367835 365614 363943 363138 361998
51562 361998 359297 355535 352366 350587 349469 347902 345495 342533 339536 337224 336570 338240 341642 344854
51548 344854 346179 345850 345597 346446 347854 349370 351902 356286 361518 365836 369040 372309 376062 379543 382471
51533 382471 385610 389519 394017 399015 404638 410416 415722 421031 427246 433718 438828 442828 447923 454570
51519 454570 459830 460977 459048 457041 455879 454097 450669 446119 441288 436837 433787 432900 433449 433947 434125
51504 434125 434991 436974 439360 441658 444219 447161 449946 452456 455548 459903 465101 470330 475333 480124
51490 480124 484347 487547 489769 491437 492799 493838 494531 494903 494935 494594 493888 492907 491953 491635 492558 494708 497236
51473 497236 499060 499820 500306 501813 504855 508497 511187 512165 511706 510108 507205 503226 499399 496949 495703
51458 495703 494325 491861 488523 485028 481660 478094 473901 469182 464777 461643 459856 458543 457038 455609
51444 455609 454595 453311 450678 446799 443063 440544 439008 437745 436702 436295 436497 436763 436749 436722 437051 437590
51428 437590 437828 437747 438273 440605 444962 450239 455041 458943 462559 466627 471334 476494 482001 487918 494264
51413 494264 500912 507800 515179 523434 532537 541819 550551 558664 566512 573971 580312 585274 589817 595252
51399 595252 601740 608092 613121 616767 619722 622265 623962 624604 624949 626014 627741 628984 629001 628327 627738 626960
51383 626960 625209 622581 619880 617179 613590 608687 603153 597676 592079 586065 579976 574118 567948 560805
51369 560805 553012 545441 538279 531128 524198 518513 514584 511515 507904 503456 499390 497240 497368 498733
51355 498733 500063 501032 502082 503239 503734 502981 501575 500893 501772 503760 505635 506549 506700 506904 507537 508019 507312
51338 507312 504581 499340 491714 483051 475519 470037 465028 458262 449725 441405 434365 427548 419768 411393
51324 411393 403338 395625 387882 380309 373221 366350 359453 352990 347403 342317 337105 331644 325977 320012
51310 320012 314203 309564 306175 302582 297625 292014 287065 282904 279116 276200 274693 273589 271479 268918
51296 268918 267754 268098 267934 266069 263739 262531 262201 261491 260048 258573 257808 258160 259712 261914 263664 264399
51280 264399 264821 266129 268719 271905 274641 276263 276774 276694 276646 277115 278633 281801 286676 292366 297676 302060
51264 302060 305700 309046 312767 317565 323205 328068 330587 330972 330741 330901 331480 332337 333027 332063 327896 320967
51248 320967 313466 306695 300012 292873 286418 282074 279552 277215 273731 268642 262193 255577 250672 248418
51234 248418 247756 246900 245239 243250 241158 238820 236653 235440 235090 234595 233577 233073 234294 237064 239973
51219 239973 241786 242286 241866 240734 238795 236129 233289 230959 229417 228445 227645 226704 225471 224006 222563
51204 222563 221308 220116 218752 217163 215438 213642 211968 210867 210634 210913 210910 210111 208533 206389 203722 200349
51188 200349 196193 191928 189238 189614 192476 195301 196345 196536 197746 199882 200966 199764 196881 193344 189568
51173 189568 186033 183705 183183 184247 186472 189373 191873 192859 192693 192977 194346 195728 196303 196807 197924 198741
51157 198741 198142 196792 196270 196781 197140 196781 196452 196905 198014 199335 200725 202256 204040 206140 208240 209638
51141 209638 210224 211162 213809 217977 221989 224521 225786 226879 228541 230649 232429 233036 232333 231119 230384
51126 230384 230509 231559 233883 237527 241158 242648 241268 238746 237522 238224 239295 238918 236774 233801 230746
51111 230746 227454 223618 219724 216855 215612 215520 215552 215025 214024 213131 212712 212180 210187 206011 200808 196973
51095 196973 196105 197860 200668 203030 204145 204056 203577 203569 204056 204460 204775 205736 207548 209216 209673 209045 208323 208260
51077 208260 209009 210237 211151 210986 210042 209643 210480 211607 211733 210921 210176 209875 209506 208647 207361 205896 204771
51060 204771 204758 205891 206797 206017 203848 201855 200733 199773 198523 197719 198111 199237 199982 199775 198932 198421 199515
51043 199515 202843 207263 210306 210433 208476 206384 204997 203815 202668 202646 204914 209191 213901 217822 221079
51028 221079 224309 227244 228664 227822 225418 222976 221698 222159 224493 228163 231871 234364 235441 235761 235894
51013 235894 236115 236829 238299 239889 240518 240229 240503 242400 244973 246330 245911 244892 244423 244449 244657 245755 248842
50996 248842 253637 258169 260645 261144 261114 261562 262294 262667 262490 262139 262254 263375 265376 267186 267547 266251 264379
50979 264379 263316 263849 265954 268745 270687 270820 270061 270437 272657 275244 276502 276374 275842 275517 275762 277283
50963 277283 280280 283476 285153 285017 284155 283585 283835 285520 288994 293447 297569 301173 305117 309553 313479
50948 313479 316353 318954 322160 325811 329423 333257 337982 343816 350533 357919 365758 373627 381079 387934
50934 387934 394433 401483 410502 422215 435510 448327 459945 471648 484799 499187 513804 528467
50922 528467 543874 560649 579189 600074 623702 649568 676638 704586 734144 766095 800326
50911 800326 836142 873399 913044 956404 1003924 1054819 1108182 1164350 1224746 1290418 1361015
50900 1361015 1435157 1511356 1588494 1665953 1743553 1821101 1897732 1971847 2041696 2105878 2163463
50889 2163463 2214138 2258132 2295428 2325148 2346423 2359839 2367195 2369644 2367064 2359547 2348437 2335164
50877 2335164 2320042 2303211 2285980 2269846 2254489 2238053 2219545 2199811 2179793 2158777 2134832
50866 2134832 2106328 2072517 2033349 1989472 1942158 1892417 1840134 1784489 1725364 1663989 1602152
50855 1602152 1541166 1481771 1424612 1370288 1319044 1270805 1225575 1183389 1143885 1106475 1071293
50844 1071293 1039511 1012172 988966 968752 951046 936250 924414 914573 905737 897987 892174 888875
50832 888875 888010 889128 891642 894975 898833 903230 907970 912283 915413 917553 919885 923647 929333 936815
50818 936815 945968 956967 969941 984434 999417 1014131 1028916 1044988 1063214 1083318 1104494 1126666
50806 1126666 1150781 1177784 1207628 1239660 1273914 1311473 1353288 1399019 1447633 1499058 1554626
50795 1554626 1615903 1683691 1758307 1839907 1928091 2022134 2122517 2231559 2351479 2482080
50785 2482080 2621336 2767847 2921493 3081903 3247793 3418123 3592416 3769060 3944209
50776 3944209 4113131 4272058 4418230 4549039 4662141 4756031 4829833 4882926 4915379 4928429
50766 4928429 4924059 4904694 4873881 4836455 4796774 4756788 4716635 4677012 4640024 4607520 4579285
50755 4579285 4553159 4526434 4496835 4462517 4421549 4371655 4310705 4237665 4152853 4057107 3951036
50744 3951036 3835484 3712403 3584545 3454224 3322852 3191860 3063645 2941153 2826444
50735 2826444 2719787 2620409 2528284 2444929 2372059 2309757 2256762 2212576 2178232 2154472 2140177
50724 2140177 2133542 2134032 2141866 2155871 2173277 2191798 2210710 2229507 2246714 2260890 2271954 2280481
50712 2280481 2285926 2286553 2281246 2270830 2257371 2242565 2226892 2209913 2190906 2169358 2145237 2119039
50700 2119039 2091478 2062996 2033689 2003877 1974615 1947299 1922676 1900525 1880475 1862913 1848818
50689 1848818 1838877 1832990 1830598 1831284 1835139 1842663 1854227 1869516 1887680 1908232 1931640 1958890 1990676
50676 1990676 2027326 2069369 2117719 2173120 2235660 2305028 2381144 2464326 2554670 2651235 2752089
50665 2752089 2855364 2960121 3065772 3170830 3272853 3369752 3460346 3543102 3614985 3672551
50655 3672551 3714127 3740193 3751586 3748162 3729683 3697515 3654830 3605276 3551851 3496955 3442912
50644 3442912 3391958 3345823 3305561 3271624 3243593 3219842 3198178 3177357 3157512 3138424 3117755
50633 3117755 3091915 3058624 3017730 2969608 2914098 2851649 2784418 2715228 2646060 2578364 2514123
50622 2514123 2455383 2403010 2356993 2317833 2286557 2263362 2247412 2238302 2236858 2244119 2260378 2285691
50610 2285691 2320516 2365143 2418972 2481106 2551362 2629959 2716095 2807325 2900508 2993046 3083135
50599 3083135 3169159 3249409 3322694 3389044 3449322 3503927 3552286 3594050 3630337 3663022 3692754
50588 3692754 3718448 3739025 3754981 3767744 3777947 3785012 3788294 3788059 3785424 3781976 3779615 3780136 3784535
50575 3784535 3792972 3805716 3823585 3846726 3873196 3899768 3924461 3947466 3969102 3987850 4001472
50564 4001472 4009447 4012870 4012062 4005837 3993579 3976717 3957330 3936392 3914464 3893186 3874795 3860509
50552 3860509 3850523 3845273 3845367 3850242 3858102 3867569 3878569 3891204 3904386 3915919 3923352 3924569 3918102
50539 3918102 3903256 3879582 3846057 3801245 3744430 3676191 3597752 3510400 3415800 3316218 3213844
50528 3213844 3110064 3005748 2901997 2800210 2701515 2606486 2515585 2429805 2350630 2278987
50518 2278987 2214211 2154566 2099217 2049239 2006127 1969708 1938459 1911739 1890623 1876101 1867291
50507 1867291 1862072 1859137 1859085 1863780 1874815 1892164 1914129 1938921 1966393 1997899 2034638 2076966
50495 2076966 2125320 2180577 2242794 2310526 2382369 2458636 2540497 2627905 2719503 2814509 2913389
50484 2913389 3016371 3122193 3228944 3335344 3440276 3541511 3636178 3723121 3804242 3882802
50474 3882802 3960540 4037012 4111600 4185181 4259333 4334724 4411247 4489321 4569942 4653401 4739145
50463 4739145 4827380 4919943 5018863 5124473 5235360 5349528 5465000 5579806 5692274 5801185
50453 5801185 5904943 6000600 6084317 6152853 6204249 6237120 6249951 6241334 6210612 6158269 6086013
50442 6086013 5996669 5893720 5780678 5660688 5536443 5410373 5285231 5164843 5054055 4957327
50432 4957327 4877095 4813530 4765722 4732859 4714462 4709958 4717982 4735531 4757566 4777932 4791159 4793353
50420 4793353 4781334 4751580 4700816 4627729 4533547 4420819 4292238 4150961 4001234 3847443
50410 3847443 3692412 3537399 3383851 3234225 3090661 2953873 2824227 2703122 2592114
50401 2592114 2491007 2398170 2312700 2235097 2165654 2103532 2047996 1999342 1957875 1922906 1893650
50390 1893650 1870282 1853084 1841096 1832691 1827182 1824998 1826656 1832537 1843327 1859439 1879930 1903067
50378 1903067 1928118 1955696 1986213 2019056 2053644 2090372 2129872 2172025 2216225 2261990 2308755
50367 2308755 2355703 2402602 2450391 2500088 2551259 2602286 2652060 2700774 2749129 2797550 2846282
50356 2846282 2895515 2945059 2994404 3043518 3093201 3144320 3197105 3251546 3307965 3366572 3426803
50345 3426803 3487785 3549262 3611239 3672838 3732478 3789228 3842936 3892646 3936020 3971151 3997971
50334 3997971 4016794 4026223 4023775 4008126 3979271 3936834 3879979 3809358 3727573 3636987 3538422 3432847
50322 3432847 3323153 3213072 3105273 3001730 2905278 2819103 2744598 2680883 2626661 2581853
50312 2581853 2547217 2523067 2508634 2502319 2502385 2507368 2515597 2524278 2529822 2529592 2522682 2508420 2485010
50299 2485010 2450913 2407095 2356519 2301470 2242591 2180503 2116882 2053402 1990764 1929303 1869708
50288 1869708 1812559 1757887 1705744 1656515 1610308 1566789 1526112 1489205 1456583 1427692 1402099
50277 1402099 1380384 1362823 1347954 1333758 1320019 1308329 1299863 1294397 1291683 1292532 1297759 1306779 1317934
50264 1317934 1329838 1341913 1354087 1366767 1380999 1397878 1417427 1438425 1459654 1481135 1503827
50253 1503827 1528323 1554363 1581593 1610051 1639421 1668357 1695417 1720704 1745856 1772167 1799166
50242 1799166 1825205 1848922 1869841 1888056 1903799 1917036 1927125 1933166 1934969 1933361 1929230 1922667
50230 1922667 1913463 1902071 1889467 1876093 1861319 1843796 1822133 1795802 1766023 1735409 1705872
50219 1705872 1676965 1647003 1615614 1584142 1553503 1522929 1491558 1460315 1431188 1405063 1381169
50208 1381169 1358421 1336244 1314021 1290767 1266116 1241295 1218621 1199895 1185384 1174028 1164390
50197 1164390 1155496 1147159 1139709 1133453 1128420 1124558 1121963 1120763 1120884 1122122 1124161 1126222 1126851 1124802
50183 1124802 1120451 1115900 1113153 1112333 1112103 1111501 1110553 1109105 1106133 1100946 1094561 1089024 1085363 1082719 1079526
50168 1079526 1075011 1069395 1063180 1056683 1050187 1044116 1038776 1033942 1028907 1023329 1018027 1014580 1013863 1015205
50154 1015205 1017247 1019272 1021292 1023180 1024498 1025308 1026530 1029046 1032684 1036335 1039025 1040774 1042457 1044755
50140 1044755 1047161 1048332 1047695 1046318 1045496 1044758 1042216 1036966 1030208 1023649 1017743 1012104 1006785 1002147 997957
50125 997957 993604 988991 984340 979296 973169 966115 959214 953192 947773 942548 937716 933426 928957 923237
50111 923237 916145 908830 902616 897781 893612 889746 887126 887071 889349 892077 893963 895732 898280 900163 898482
50096 898482 892246 883455 874651 866849 860175 854804 850184 844702 837579 830316 824940 821442 818207 814403
50082 814403 810525 806896 803254 799957 798222 798697 800698 803063 804912 805563 804912 804244 805535 809430 814716
50067 814716 820142 825820 832406 839936 848142 857013 866291 875202 883479 891915 900985 909649 916602 922210
50053 922210 928037 934779 941848 948883 956349 964343 971928 978249 983533 988330 992300 994549 995060 995160 996380
50038 996380 999179 1003053 1007730 1013721 1021392 1029961 1038198 1046026 1054588 1064462 1074782 1084729 1094990 1106738
50024 1106738 1119803 1133197 1147135 1163052 1181315 1200236 1218025 1234853 1252249 1271120 1291216
50013 1291216 1312235 1334645 1359320 1386717 1416446 1447450 1478619 1509352 1539505 1568994 1597832
50002 1597832 1626487 1655585 1685059 1714116 1742334 1770441 1799767 1831342 1865705 1902929 1942230
49991 1942230 1982048 2021362 2061006 2103186 2149715 2201096 2257168 2317940 2383573 2453806 2527603
49980 2527603 2603159 2678182 2750276 2817092 2876098 2924725 2961556 2987575 3005614 3018100 3025641
49969 3025641 3028262 3027503 3026163 3025586 3023915 3017720 3004923 2985321 2958569 2922996 2876934 2820234 2753777
49956 2753777 2678435 2595766 2509191 2422901 2339270 2258358 2180151 2106015 2037415 1974362 1916037
49945 1916037 1862174 1812886 1767781 1726272 1688302 1653748 1621464 1590066 1559530 1530859 1504140
49934 1504140 1478036 1451506 1424947 1399200 1374405 1350418 1327589 1306274 1286063 1266260 1246849
49923 1246849 1228385 1211141 1194981 1179957 1166408 1154362 1143218 1132139 1120721 1109485 1099860
49912 1099860 1093287 1089876 1088184 1086733 1085525 1085611 1087441 1090446 1094257 1099457 1106715 1115729 1125545 1135614
49898 1135614 1145998 1156697 1167231 1177006 1185872 1194377 1203666 1214945 1228568 1243528 1258276 1272373
49886 1272373 1287206 1304758 1325727 1349199 1374207 1401207 1431607 1466018 1503558 1543127 1585011
49875 1585011 1630862 1682142 1739076 1801234 1868843 1943183 2025693 2116982 2216846 2325097 2441999
49864 2441999 2567423 2699415 2833778 2965404 3090161 3205703 3310946 3405468 3489631 3564778
49854 3564778 3632679 3694723 3751812 3804747 3854028 3899006 3937635 3967293 3985462 3989206 3974701
49843 3974701 3938694 3881148 3805916 3718170 3621239 3516129 3403393 3284534 3161705 3037063
49833 3037063 2912714 2790543 2671552 2555829 2443539 2335406 2231879 2132558 2037268 1947222
49823 1947222 1864053 1787843 1717083 1650687 1589082 1533021 1482347 1436479 1395191 1358009 1323459
49812 1323459 1290083 1258111 1229072 1203474 1179714 1155742 1131209 1107316 1084883 1063464 1042486
49801 1042486 1022546 1004910 989886 976470 963874 952763 944335 938357 932912 926252 918387 910577
49789 910577 903805 898236 893896 891205 890608 891774 893281 893383 891539 889175 888415 889885 892296 894393 896527
49774 896527 899768 904269 909425 915191 922014 929543 936650 943119 950404 960145 972534 986543 1001251
49761 1001251 1016402 1032096 1048593 1066362 1085988 1108000 1132763 1160323 1190430 1223227 1259962
49750 1259962 1302341 1350856 1404493 1462569 1526063 1596271 1672677 1753356 1837325 1925102 2016377
49739 2016377 2108070 2195482 2274808 2343859 2401150 2445906 2479288 2504411 2524209 2539780 2551543
49728 2551543 2561249 2571403 2582467 2591722 2595259 2590127 2574029 2544280 2498709 2437526 2363248 2278915
49716 2278915 2187368 2091990 1996476 1903104 1812083 1723367 1638449 1559697 1488357 1423860 1364866
49705 1364866 1310514 1260878 1216653 1178201 1144644 1114119 1085162 1057579 1031852 1008356 987468
49694 987468 969783 955391 943189 931585 919864 908493 898354 890171 884440 881154 879425 877803
49682 877803 875234 871613 867459 863221 858915 854443 850295 847585 846917 847281 846865 845161 843528 843360 844458
49667 844458 845762 846828 847807 848572 848896 849127 849830 851008 852405 854136 856011 856579 854155 848934 843150 838930
49651 838930 836835 836510 837609 839543 841267 842055 842111 841896 841287 839915 838070 836807 837189 839510 842972 845956
49635 845956 846987 845912 844197 843951 846378 850914 855796 859700 862862 866204 869432 870960 870245 869181 870008
49620 870008 872421 874046 873561 871886 870292 868884 867615 867412 869209 872441 875511 877448 878484 879210 879855
49605 879855 880397 880999 882051 883695 885455 886741 887908 890172 893914 897710 900013 901260 903025 905375 906717
49590 906717 906470 906235 907577 910073 912461 914543 916792 918932 920119 920143 919531 918877 918672 919273 920361 921061
49574 921061 921323 922479 925558 929759 933596 937015 941150 946339 951675 956435 960827 965252 969779 974451
49560 974451 979214 983448 986523 989063 992779 998595 1005540 1011940 1017337 1022775 1029507 1037844 1047278 1057494
49546 1057494 1068968 1082307 1097087 1111909 1125825 1139286 1153319 1168357 1184420 1201921 1221377
49535 1221377 1242482 1264316 1286601 1309985 1334920 1360868 1387047 1413564 1441353 1471022 1502160
49524 1502160 1533932 1566245 1599901 1635388 1671975 1708583 1745262 1783021 1822330 1862846 1904732
49513 1904732 1949016 1996054 2044740 2094109 2144824 2198103 2253923 2311259 2369538 2428923 2489707
49502 2489707 2552319 2617217 2683798 2750221 2815481 2880836 2947724 3015108 3080665 3143982 3206418
49491 3206418 3268059 3327267 3383645 3439058 3494607 3548455 3597815 3641623 3680053 3712821 3739587
49480 3739587 3761235 3779244 3794031 3804813 3810809 3812077 3809740 3805758 3801563 3796349 3787813 3775446 3761993
49467 3761993 3750683 3742126 3735189 3729776 3726869 3726473 3727458 3729422 3733058 3738605 3745551 3754183 3765868 3781141
49453 3781141 3798746 3817356 3837282 3859696 3884841 3911743 3939078 3965614 3990311 4012746 4033202
49442 4033202 4051747 4067516 4079451 4087425 4091876 4092466 4087920 4077436 4061458 4040607 4014464 3982238
49430 3982238 3944394 3902563 3857488 3807933 3752449 3691604 3627430 3561005 3491919 3420285 3347705
49419 3347705 3275432 3202792 3128724 3054055 2980773 2909614 2840051 2772524 2708729 2649117 2591800
49408 2591800 2534998 2479378 2426698 2377025 2328768 2281163 2235289 2192484 2152830 2115551 2080162
49397 2080162 2046904 2016433 1989255 1965094 1942884 1921834 1902388 1885483 1870908 1857210 1843395
49386 1843395 1829933 1817861 1807679 1799475 1793243 1788371 1783460 1777522 1771088 1765479 1761355 1758485 1756498
49373 1756498 1755125 1754129 1753865 1755579 1760214 1767093 1774603 1782016 1789762 1798281 1807843 1819367 1833960 1851484
49359 1851484 1870991 1892842 1918589 1947782 1976486 2000452 2018988 2034640 2050037 2066308 2083596
49348 2083596 2101278 2118043 2133381 2148943 2167082 2188184 2210827 2234424 2259972 2287864 2316620
49337 2316620 2344567 2371536 2398112 2424334 2450117 2476150 2503292 2531445 2559775 2587795 2615588
49326 2615588 2643192 2670288 2696464 2721569 2745992 2770589 2795830 2820892 2844276 2865678 2886703
49315 2886703 2909348 2934211 2960514 2987302 3014149 3041038 3068135 3095552 3123131 3150759 3178942
49304 3178942 3208469 3239317 3270663 3302422 3336052 3373050 3413110 3454561 3496332 3538701 3582311
49293 3582311 3627363 3673937 3722381 3772914 3825180 3878557 3932914 3988849 4047078 4107690 4170223
49282 4170223 4234522 4301181 4370867 4443568 4519028 4597600 4679941 4765998 4855150 4947185 5042106
49271 5042106 5138933 5236006 5332939 5431049 5531174 5632275 5733108 5834090 5936046 6037960
49261 6037960 6137705 6234723 6330397 6425623 6519360 6609823 6695863 6776703 6851409 6919307 6980297
49250 6980297 7034292 7080969 7120464 7153638 7181073 7202279 7216480 7223795 7225142 7221285 7212681 7200129
49238 7200129 7184840 7167567 7148031 7125585 7100425 7073997 7048223 7024395 7002832 6983399 6966086
49227 6966086 6951061 6938435 6928240 6920728 6916607 6916831 6921929 6931342 6943562 6957230 6972148 6989020
49215 6989020 7008282 7029492 7051803 7074554 7097266 7119382 7140151 7158487 7172944 7182161 7185395 7182257
49203 7182257 7172195 7154940 7131353 7102754 7069130 7028878 6980820 6925548 6864371 6798017 6727157
49192 6727157 6653019 6576155 6495455 6410025 6321782 6234593 6150674 6069007 5987486 5905348 5823155
49181 5823155 5741629 5661361 5582985 5506869 5432868 5360751 5290480 5221899 5154617 5088653 5024834
49170 5024834 4964131 4906696 4851761 4798417 4746356 4695938 4647515 4600748 4554990 4510558 4469111
49159 4469111 4432216 4399770 4370510 4343763 4319986 4299656 4282554 4268163 4256006 4245456 4235937
49148 4235937 4227560 4220842 4215589 4210844 4206275 4202979 4202359 4204711 4209236 4214955 4221214 4227809 4235195 4244275
49134 4244275 4255523 4268493 4282523 4297679 4314600 4333600 4354256 4375832 4397877 4420470 4444121
49123 4444121 4469406 4496578 4525339 4554798 4583721 4611447 4639050 4669093 4703228 4740054 4776239
49112 4776239 4809996 4842570 4875916 4909944 4942961 4974269 5005122 5037013 5069806 5101951 5132091
49101 5132091 5160105 5186862 5213488 5240951 5269923 5300409 5331429 5361566 5390303 5418642 5448133
49090 5448133 5479446 5512210 5545937 5580563 5616196 5652883 5690712 5729693 5769408 5808976 5847247
49079 5847247 5882983 5915378 5944947 5973471 6002309 6031078 6058739 6085537 6112743 6140665 6168319
49068 6168319 6195255 6222298 6249857 6276731 6301482 6324135 6345581 6366006 6384909 6402332 6419099
49057 6419099 6435773 6451933 6466475 6478507 6488223 6497043 6506377 6516011 6524354 6530607 6535981 6542120 6548982
49044 6548982 6555116 6559669 6563346 6567517 6572958 6579306 6585291 6589740 6592757 6595722 6599854 6605168 6611172 6617875
49030 6617875 6625372 6633000 6640017 6646970 6655394 6665919 6677334 6687781 6696420 6703625 6709976 6715615 6720653
49017 6720653 6725851 6732230 6739628 6746119 6749663 6750263 6749711 6749177 6748189 6746236 6744067 6742400 6740240 6735671 6727972
49002 6727972 6717974 6706611 6693981 6679629 6663032 6644000 6623097 6601349 6579036 6555338 6529771
48991 6529771 6503109 6476001 6447511 6416489 6383720 6351131 6319098 6286233 6251916 6217358 6183730
48980 6183730 6150743 6117777 6085160 6053588 6023331 5994772 5968759 5945510 5923909 5902708 5881951
48969 5881951 5862549 5845004 5829254 5815256 5802910 5791710 5781202 5771655 5763759 5757795 5753452 5750341
48957 5750341 5748419 5748101 5750099 5754763 5761412 5768793 5776481 5785303 5796004 5808014 5820000 5831193 5841674
48944 5841674 5851763 5861586 5870986 5879340 5885716 5889636 5891430 5891631 5890448 5888161 5885437 5882580 5878926 5873760
48930 5873760 5867560 5861540 5855976 5849655 5841015 5829400 5815277 5799817 5784220 5768960 5753677 5738056
48918 5738056 5722480 5707156 5690959 5672103 5650141 5626452 5602491 5578318 5553331 5527715 5502496
48907 5502496 5478444 5455509 5433125 5410598 5387321 5363139 5338603 5314626 5291893 5270695 5251139
$$ [...]
##END NTUPLES=NMR SPECTRUM
##END=
