##TITLE=coffee_type TOFR01-feb23
COFFEE_meoh_noesyp64 COFFEE_meoh {C:\Bruker\TOPSPIN} Administrator 1
##JCAMPDX= 6.0         $$ Bruker NMR JCAMP-DX V2.0
##DATA TYPE= NMR SPECTRUM
##DATA CLASS= NTUPLES
##ORIGIN= Bruker BioSpin GmbH
##OWNER= Administrator
$$ 1.72 TOPSPIN		Version 2.1
$$ 2012-05-18 15:43:08.354 -0700  Administrator@X
$$ Compression mode = diff/dup
##.OBSERVE FREQUENCY= 400.13188235
##.OBSERVE NUCLEUS= ^1H
##.ACQUISITION MODE= SIMULTANEOUS (DQD)
##.ACQUISITION SCHEME= undefined
##.AVERAGES= 64
##.DIGITISER RES= 22
##SPECTROMETER/DATA SYSTEM= spect
##.PULSE SEQUENCE= noesygpps1d.comp
##.SOLVENT NAME= COFFEE_meoh
##.SHIFT REFERENCE= INTERNAL, COFFEE_meoh, 1, 14.98061
##AUDIT TRAIL= $$ (NUMBER, WHEN, WHO, WHERE, PROCESS, VERSION, WHAT)
$$ ##TITLE= Audit trail, TOPSPIN		Version 2.1
$$ ##JCAMPDX= 5.01
$$ ##ORIGIN= Bruker BioSpin GmbH
$$ ##OWNER= Administrator
$$ $$ C:\Bruker\TOPSPIN/data/Administrator/nmr/12-COFFEE-2302/22/pdata/1/auditp.txt
$$ ##AUDIT TRAIL=  $$ (NUMBER, WHEN, WHO, WHERE, PROCESS, VERSION, WHAT)
(   1,<2012-02-23 19:16:00.219 -0500>,<Administrator>,<TOPSPIN>,<go>,<TOPSPIN 2.1>,
      <created by zg
	started at 2012-02-23 19:04:29.906 -0500,
	POWCHK enabled, PULCHK disabled,
       configuration hash MD5:
       B0 76 FB 9C 50 81 44 7D 18 B3 26 32 4E 60 AD 96
       data hash MD5: 64K
       25 C4 21 7B 9F A0 1D 1D 77 62 C7 35 43 EB FA 2D>)
(   2,<2012-02-23 19:16:03.156 -0500>,<Administrator>,<TOPSPIN>,<proc1d>,<TOPSPIN 2.1>,
      <Start of raw data processing
       efp LB = 0.3 FT_mod = 6 PKNL = 1 PHC0 = 0 PHC1 = 0 SI = 128K 
       data hash MD5: 128K
       5B 2B DB 24 ED 5F CD 7D 9B 9C 07 26 41 A3 CD 12>)
(   3,<2012-02-23 19:16:04.344 -0500>,<Administrator>,<TOPSPIN>,<proc1d>,<TOPSPIN 2.1>,
      <pk PHC0 = 24.06555 PHC1 = 0 
       data hash MD5: 128K
       FC FF 2B 23 BC FC C6 2E 0D 46 CE CF 5B 7C 07 6F>)
(   4,<2012-02-23 19:16:04.625 -0500>,<Administrator>,<TOPSPIN>,<proc1d>,<TOPSPIN 2.1>,
      <abs ABSG = 1 
       data hash MD5: 128K
       16 C9 2E C4 9F 09 DA C5 B5 30 A3 00 54 0D CD FB>)
(   5,<2012-02-23 19:16:04.781 -0500>,<Administrator>,<TOPSPIN>,<proc1d>,<TOPSPIN 2.1>,
      <abs ABSG = 2 
       data hash MD5: 128K
       88 17 26 BB 36 A5 E4 A9 02 8E 24 EB 47 7A 93 85>)
(   6,<2012-02-23 19:16:04.969 -0500>,<Administrator>,<TOPSPIN>,<proc1d>,<TOPSPIN 2.1>,
      <abs ABSG = 3 
       data hash MD5: 128K
       ED 3F F9 88 49 5A 34 0F 44 B2 F6 97 3E CD 9E AC>)
(   7,<2012-02-23 19:16:05.062 -0500>,<Administrator>,<TOPSPIN>,<proc1d>,<TOPSPIN 2.1>,
      <abs ABSG = 4 
       data hash MD5: 128K
       9A 1B 60 22 8D D0 86 CA 25 8D 20 1D 91 31 E8 A4>)
(   8,<2012-02-23 19:16:05.125 -0500>,<Administrator>,<TOPSPIN>,<proc1d>,<TOPSPIN 2.1>,
      <abs ABSG = 5 
       data hash MD5: 128K
       41 0A 97 34 27 29 B0 25 4D 70 5E 03 2F E6 85 0D>)
(   9,<2012-02-23 19:16:05.281 -0500>,<Administrator>,<TOPSPIN>,<audit>,<TOPSPIN 2.1>,
      <user comment:
       ICON-NMR User ID: Administrator
$$ [...]
150 150 150 150 150 150 150 150
##$TP07= 0
##$TPNAME0= <>
##$TPNAME1= <>
##$TPNAME2= <>
##$TPNAME3= <>
##$TPNAME4= <>
##$TPNAME5= <>
##$TPNAME6= <>
##$TPNAME7= <>
##$TPOAL= (0..7)
0.5 0.5 0.5 0.5 0.5 0.5 0.5 0.5
##$TPOFFS= (0..7)
0 0 0 0 0 0 0 0
##$TUNHIN= 0
##$TUNHOUT= 0
##$TUNXOUT= 0
##$USERA1= <user>
##$USERA2= <user>
##$USERA3= <user>
##$USERA4= <user>
##$USERA5= <user>
##$V9= 5
##$VALIST= <valist>
##$VCLIST= <CCCCCCCCCCCCCCC>
##$VD= 0
##$VDLIST= <DDDDDDDDDDDDDDD>
##$VPLIST= <PPPPPPPPPPPPPPP>
##$VTLIST= <TTTTTTTTTTTTTTT>
##$WBST= 1024
##$WBSW= 4
##$XGAIN= (0..3)
0 0 0 0
##$XL= 0
##$YL= 0
##$YMAX_a= 15176325
##$YMIN_a= -7119990
##$ZGOPTNS= <>
##$ZL1= 120
##$ZL2= 120
##$ZL3= 120
##$ZL4= 120
##$ABSF1= 14.98061
##$ABSF2= -5.57192
##$ABSG= 5
##$ABSL= 3
##$ALPHA= 0
##$AQORDER= 0
##$ASSFAC= 0
##$ASSFACI= 0
##$ASSFACX= 0
##$ASSWID= 0
##$AUNMP= <proc_prof1d_extract>
##$AXLEFT= 0
##$AXNAME= <>
##$AXNUC= <1H>
##$AXRIGHT= 0
##$AXTYPE= 0
##$AXUNIT= <>
##$AZFE= 0.1
##$AZFW= 0.1
##$BCFW= 0
##$BC_mod= 0
##$BYTORDP= 0
##$COROFFS= 0
##$CY= 15
##$DATMOD= 1
##$DC= 0
##$DFILT= <>
##$DTYPP= 0
##$F1P= 0
##$F2P= 0
##$FCOR= 0.5
##$FTSIZE= 131072
##$FT_mod= 6
##$GAMMA= 0
##$GB= 0
##$INTBC= 1
##$INTSCL= 1
##$ISEN= 128
##$LB= 0.3
##$LEV0= 0
##$LPBIN= 0
##$MAXI= 10000
##$MC2= 0
##$MEAN= 0
##$ME_mod= 0
##$MI= 0
##$NCOEF= 0
##$NC_proc= -3
##$NLEV= 6
##$NOISF1= 0
##$NOISF2= 0
##$NSP= 0
##$NTH_PI= 0
##$NZP= 0
##$OFFSET= 14.98061
##$PC= 1
##$PHC0= 24.06555
##$PHC1= 0
##$PH_mod= 1
##$PKNL= yes
##$PPARMOD= 0
##$PPDIAG= 0
##$PPIPTYP= 0
##$PPMPNUM= 2147483647
##$PPRESOL= 1
##$PSCAL= 4
##$PSIGN= 0
##$PYNMP= <proc.py>
##$REVERSE= no
##$SF= 400.13
##$SI= 131072
##$SIGF1= 0
##$SIGF2= 0
##$SINO= 400
##$SIOLD= 131072
##$SPECTYP= <>
##$SREGLST= <1H.CDCl3>
##$SSB= 0
##$STSI= 131072
##$STSR= 0
##$SW_p= 8223.68421052632
##$SYMM= 0
##$S_DEV= 0
##$TDeff= 65536
##$TDoff= 0
##$TI= <>
##$TILT= no
##$TM1= 0
##$TM2= 0
##$TOPLEV= 0
##$USERP1= <user>
##$USERP2= <user>
##$USERP3= <user>
##$USERP4= <user>
##$USERP5= <user>
##$WDW= 1
##$XDIM= 131072
##$YMAX_p= 511854178
##$YMIN_p= -208376237
##$CURPLOT= <Network HP LaserJet P1505>
##$CURPRIN= <$Network HP LaserJet P1505>
##$DFORMAT= <normdp>
##$LAYOUT= <+/1D_H.xwp>
##$LFORMAT= <normlp>
##$PFORMAT= <normpl>
##$SURQMSG= 1
$$ End of Bruker specific parameters
$$ ---------------------------------
##NTUPLES= NMR SPECTRUM
##VAR_NAME=  FREQUENCY,     SPECTRUM/REAL,   SPECTRUM/IMAG
##SYMBOL=    X,             R,               I
##VAR_TYPE=  INDEPENDENT,   DEPENDENT,       DEPENDENT
##VAR_FORM=  AFFN,          ASDF,            ASDF
##VAR_DIM=   131072,        131072,          131072
##UNITS=     HZ,            ARBITRARY UNITS, ARBITRARY UNITS
##FACTOR=    0.0627417313425165, 1,          1
##FIRST=     8223.62146879498, -246,         -101509
##LAST=      0,             5387,            -102564
##MIN=       0,             -208376237,      0
##MAX=       8223.62146879498, 511854178,    0
$$ Real data points
##PAGE= N=1
##DATA TABLE= (X++(R..R)), XYDATA
$$ [...]
62924C026603K9099K6803K3337J8023J1309M506j864q687j6893k6107l5313m4337
62912C006479n3726o3283p1601p7323q0303q1348q1320q0780p9907p8382p5677
62901B182829p1923o8187o5371o3016n9695n4599m8383m2535l8319l6212l5708
62890A598881l5350l3503k9790k5606k2747k1586k1046k0265j9529j9301j9179
62879A330979j8537j7659j7282j7230j6612j5467j5083j6031j6923j5989j3410
62868A150756j1092j0418j0955j1363j0819r581q621q661r229r000p525n994n553
62855A031945n516m498k886k520l833m929m259k776k473l744n276n893n419m066
62841I73857k030K50K002K428J146j292l257l276j754p27j405k716k959k041j313
$$ y = [3026603, 3055702, 3082505, 3105842, 3123865, 3135174, 3139680, 3137816, 3129129, 3112236, 3086129, 3050816, 3006479, 2952753, 2889470, 2817869, 2740546, 2660243, 2578895, 2497575, 2416795, 2336888, 2258506, 2182829, 2110906, 2042719, 1977348, 1914332, 1854637, 1800038, 1751655, 1709120, 1670801, 1634589, 1598881, 1563531, 1530028, 1500238, 1474632, 1451885, 1430299, 1409253, 1388988, 1369459, 1350158, 1330979, 1312442, 1294783, 1277501, 1260271, 1243659, 1228192, 1213109, 1197078, 1180155, 1164166, 1150756, 1139664, 1129246, 1118291, 1106928, 1096109, 1086528, 1077907, 1069246, 1060017, 1051017, 1043492, 1037498, 1031945, 1026429, 1021931, 1019045, 1016525, 1012692, 1007763, 1003504, 1000728, 998255, 994511, 989235, 983342, 977923, 973857, 971827, 972077, 974079, 976507, 977653, 976361, 973104, 969828, 968074, 967347, 965942, 963226, 960267, 958226, 956913]
62826I56913j786l399n503p155p425o302n003m613m795m565l789l018k455k063
62812H95042k166k765k749j154J051J847P22q83j626j460q72l25n53j956l470
62797H78683l514k346j959l120m151l529k162j862k764l579l584k992j974o24
62783H40523M17L87n89j632k090j764o29R74K156K327J951J803J806J383O81N12
62767H48216J176K029K351J935Q81n41j688j825r14J64M39k60j246j629j003M80
62751H48565K556N084P575Q940Q417O696N318M900M918N314O966R927J2570J3726
62737I51472J4624J7186K0969K3592K4094K4179K5647K8069K9922L1063L2876
62726A223693L6236M0186M3029M4390M5907M9601N5617O2022O7035P0982P5530
$$ y = [956913, 955127, 951728, 946225, 939070, 931645, 925343, 920340, 915727, 910932, 906367, 902578, 899560, 897105, 895042, 892876, 890111, 887362, 886208, 887259, 889106, 889828, 888945, 887319, 885859, 884987, 884662, 884109, 882153, 878683, 875169, 872823, 870864, 867744, 863593, 860064, 857902, 856040, 853276, 849697, 846113, 843121, 841147, 840523, 840940, 841327, 840738, 839106, 837016, 835252, 834623, 835597, 837753, 840080, 842031, 843834, 845640, 847023, 847704, 848216, 849392, 851421, 853772, 855707, 856588, 856047, 854359, 852534, 851620, 851784, 852223, 851963, 850717, 849088, 848085, 848565, 851121, 856205, 863780, 872720, 881137, 887833, 893151, 898051, 902969, 908283, 915249, 925176, 937746, 951472, 966096, 983282, 1004251, 1027843, 1051937, 1076116, 1101763, 1129832, 1159754, 1190817, 1223693, 1259929, 1300115, 1343144, 1387534, 1433441, 1483042, 1538659, 1600681, 1667716, 1738698, 1814228]
62715A814228Q1435Q7841R3565R8235J02105J05555J08809J11431J11941J08800
62705B823945J02185R3969Q5396P5418O2093M5288K7041R231q112k5749m3144
62694C247561n8527p1045q1770r1903j00700j06308j08435j08889j09098j08288
62684B302598j05015r9507r3479q8008q2796p7350p1875o6863o2571n8923n5369
62673A440842n0988m5577m0536l7592l6411l4540l0312k4910k0771j8612j6984
62662A083609j4590j1976j0536j0464j0411r152p000n158l975k506J17L553O868
62649A008379R648J1997J3908J5452J7229J9813K2830K5442K7674L0537L4658
62638A237567L9519M4250M8570N2692N6916O1466O6266P0628P3709P5407P6371
$$ y = [1814228, 1895663, 1983504, 2077069, 2175304, 2277409, 2382964, 2491773, 2603204, 2715145, 2823945, 2926130, 3020099, 3105495, 3180913, 3243006, 3288294, 3315335, 3324566, 3316454, 3290705, 3247561, 3189034, 3117989, 3036219, 2944316, 2843616, 2737308, 2628873, 2519984, 2410886, 2302598, 2197583, 2098076, 2004597, 1916589, 1833793, 1756443, 1684568, 1617705, 1555134, 1496211, 1440842, 1389854, 1344277, 1303741, 1266149, 1229738, 1195198, 1164886, 1139976, 1119205, 1100593, 1083609, 1069019, 1057043, 1046507, 1036043, 1025632, 1016480, 1009480, 1004322, 1000347, 997841, 997958, 1001511, 1008379, 1018027, 1030024, 1043932, 1059384, 1076613, 1096426, 1119256, 1144698, 1172372, 1202909, 1237567, 1277086, 1321336, 1369906, 1422598, 1479514, 1540980, 1607246, 1677874, 1751583, 1826990, 1903361]
62627A903361P6991P7001P6098P4190P0706O4600N5657M5154L4357K2850R253
62616B510218o443k2176l5653m6353n5408o3893p1637p7613q1087q2215q1697
62605A886043q0202p8206p5971p3405p0115o6021o1699n7800n4211n0336m6134
62594A171943m2303l9267l6484l3206k9570k6529k4781k4078k3679k3228k2861
62583H45957k2475k1298j8818j5961j4448j4635j4762j3169j0540q977r197r865
62571F71812r646q723p923p372o706n829m939m187l719l607l452k549q61O67J120
62556F04086O11k5m9R21K994N781Q361R922J0392J0274J0067J0114J0631J1691
62542F95771J3205J5125J7479K0182K3003K5674K7856K9335L0605L2909L6939
$$ y = [1903361, 1980352, 2057353, 2133451, 2207641, 2278347, 2342947, 2398604, 2443758, 2478115, 2500965, 2510218, 2503775, 2481599, 2445946, 2399593, 2344185, 2280292, 2208655, 2131042, 2049955, 1967740, 1886043, 1805841, 1727635, 1651664, 1578259, 1508144, 1442123, 1380424, 1322624, 1268413, 1218077, 1171943, 1129640, 1090373, 1053889, 1020683, 991113, 964584, 939803, 915725, 892046, 868818, 845957, 823482, 802184, 783366, 767405, 752957, 738322, 723560, 710391, 699851, 690874, 681677, 671812, 662166, 653443, 645520, 638148, 631442, 625613, 620674, 616487, 612768, 609161, 605709, 603160, 602299, 602966, 604086, 604697, 604672, 604623, 605544, 608538, 614319, 622680, 632602, 642994, 653268, 663335, 673449, 684080, 695771, 708976, 724101, 741580, 761762, 784765, 810439, 838295, 867630, 898235, 931144, 968083]
62531I68083M1651M5304M7619M9903N2990N6133N8205N8943N8460N6625N3594
62520A547510N0017M5860L9882L1264K1134J1420K714n773j4518k3087l1061l8427
62508A636935m4816m9219n0867n0106m8170m6292m5025m4094m2896m1105l8724
62497A135621l5750l2342k9364k7861k7703k7425k5931k3729k1967k0896j9930
62486H42723j8645j7047j5405j4363j4546j5383j5074j2634r365p287o710o475
62474F89789n980n497m792k901M17M072O674P456O451M701M052N517P851R067
62460G26877R223J0292J3138J6298J8356J9937K2310K5263K7555K8752K9504L0555
62448I78060L2354L5169L8712M1921M3888M4706M4836M4191M2504M0067L7145
$$ y = [968083, 1009734, 1055038, 1102657, 1152560, 1205550, 1261683, 1319888, 1378831, 1437291, 1493916, 1547510, 1597527, 1643387, 1683269, 1714533, 1735667, 1747087, 1749801, 1744028, 1729510, 1706423, 1675362, 1636935, 1592119, 1542900, 1492033, 1441927, 1393757, 1347465, 1302440, 1258346, 1215450, 1174345, 1135621, 1099871, 1067529, 1038165, 1010304, 982601, 955176, 929245, 905516, 883549, 862653, 842723, 824078, 807031, 791626, 777263, 762717, 747334, 732260, 719626, 710261, 702974, 696264, 689789, 683809, 678312, 673520, 670619, 671036, 675108, 681782, 689238, 695689, 700390, 704442, 709959, 717810, 726877, 736100, 746392, 759530, 775828, 794184, 814121, 836431, 861694, 889249, 918001, 947505, 978060, 1010414, 1045583, 1084295, 1126216, 1170104, 1214810, 1259646, 1303837, 1346341, 1386408, 1423553]
62437A423553L2981K6496J7951Q894M06p729j5770k2812k7520k9715l0702l2081
62425A343952l4482l7223l8918l8469l5907l2422k9415k7414k5902k4082k1570
62414I98148j8361j4650j1119q984q914r833r653p664n396m569m818m441k824
62401H86922q90P41K600M902O529O395N186M698N630O967P393O764N994O059P225
62386I63115Q884R932R631Q325P125O528N501K407k859q146j1087j1757j2441
62373I75158j4709j7640j9522k0280k1099k2172k2282k0561j7493j3959j0443
62362G74998p507n843n274m588l092j547r25r47o37L58J775L507N461P083P969
62347G70791Q596R629J0823J1512J1932J2872J4141J4442J3013J0485P990O253
$$ y = [1423553, 1456534, 1483030, 1500981, 1509875, 1510281, 1502552, 1486782, 1463970, 1436450, 1406735, 1376033, 1343952, 1309470, 1272247, 1233329, 1194860, 1158953, 1126531, 1097116, 1069702, 1043800, 1019718, 998148, 979787, 965137, 954018, 945034, 936120, 926287, 916634, 908970, 903574, 899005, 894187, 889746, 886922, 886032, 886773, 889373, 894275, 900804, 907199, 912385, 917083, 922713, 929680, 937073, 943837, 949831, 955890, 963115, 971999, 981931, 991562, 999887, 1007012, 1013540, 1019041, 1021448, 1018589, 1010443, 999356, 987599, 975158, 960449, 942809, 923287, 903007, 881908, 859736, 837454, 816893, 799400, 785441, 774998, 767491, 761648, 756374, 751786, 748694, 747147, 746222, 745275, 744638, 744996, 746771, 750278, 755739, 762822, 770791, 779387, 789016, 799839, 811351, 823283, 836155, 850296, 864738, 877751, 888236, 896226, 902479]
62335I02479N751O698Q312Q875P244L937M04k253l547l479k727k424k928l214
62321I23128k145L1K139L604M801O173P962J0578J4235J8155K1290K3954K7652
62308A061557L2888L8301M2553M6035M9755N3559N6795O0001O4330O9397P3258
62297A648429P4872P5281P5748P5784P3777O8804O1184N1721M1064K9481J6959
62286B293104L942p926j6765k2707k8185l5209m3052m9578n3950n6849n8717n9374
62274A864734n9131n8588n7262n3902m8737m3997m1404m0180l8338l5188l1720
62263A356287k9104k7641k6857k5976k4398k2246k0115j8166j5904j3139j0486
62252A122255q472o781n008l477k661k350k200k469l294l804l232k514l325n497
$$ y = [902479, 908230, 914928, 923240, 932115, 939359, 943296, 943700, 941447, 937900, 934421, 931694, 929270, 926342, 923128, 920983, 921014, 923153, 926757, 931558, 937731, 945693, 956271, 970506, 988661, 1009951, 1033905, 1061557, 1094445, 1132746, 1175299, 1221334, 1271089, 1324648, 1381443, 1441444, 1505774, 1575171, 1648429, 1723301, 1798582, 1874330, 1950114, 2023891, 2092695, 2153879, 2205600, 2246664, 2276145, 2293104, 2297046, 2289120, 2272355, 2249648, 2221463, 2186254, 2143202, 2093624, 2039674, 1982825, 1924108, 1864734, 1805603, 1747015, 1689753, 1635851, 1587114, 1543117, 1501713, 1461533, 1423195, 1388007, 1356287, 1327183, 1299542, 1272685, 1246709, 1222311, 1200065, 1179950, 1161784, 1145880, 1132741, 1122255, 1113783, 1107002, 1101994, 1098517, 1095856, 1093506, 1091306, 1088837, 1085543, 1081739, 1078507, 1075993, 1072668, 1067171]
62238A067171o883o241m869m557n122n033l710j993o79J82P44J099J785L545O240
62223A041679Q698R936J0095R841R607R782J1047J3607J6444J8111J8377J8458
62211A195682J9499K1416K3490K5545K8078L1419L5287L9188M2992M6912N1046
62200A560554N5105N8737O2066O5601O9431P2710P4309P3762P1263O6899O0523
62189B290960N2291M2793L2385K1075R163k635j3991k5140l5720m4281m9830n3370
62177B223700n6809o0510o2903o2600n9895n5963n1437m6443m1446l7239l4152
62166A654303l1702k9108k5916k2097j7869j3679j0143p689o021m335k379r68
62154A482397p96j070k78J569K631J702m1n17P61K660M155N080N650O367Q097
$$ y = [1067171, 1060288, 1054047, 1049178, 1044621, 1039499, 1034466, 1030756, 1028763, 1028084, 1028266, 1029010, 1030109, 1031894, 1035439, 1041679, 1050377, 1060313, 1070408, 1080249, 1089856, 1099638, 1110685, 1124292, 1140736, 1158847, 1177224, 1195682, 1215181, 1236597, 1260087, 1285632, 1313710, 1345129, 1380416, 1419604, 1462596, 1509508, 1560554, 1615659, 1674396, 1736462, 1802063, 1871494, 1944204, 2018513, 2092275, 2163538, 2230437, 2290960, 2343251, 2386044, 2418429, 2439504, 2448667, 2446032, 2432041, 2406901, 2371181, 2326900, 2277070, 2223700, 2166891, 2106381, 2043478, 1980878, 1920983, 1865020, 1813583, 1767140, 1725694, 1688455, 1654303, 1622601, 1593493, 1567577, 1545480, 1527611, 1513932, 1503789, 1496100, 1490079, 1485744, 1483365, 1482397, 1481601, 1480531, 1480253, 1481822, 1484453, 1486155, 1486114, 1485597, 1486358, 1489018, 1493173, 1498253, 1503903, 1510270, 1518367]
62139A518367J1107J4328J6592J8318K0754K3809K6118K7285K8568L0971L3945
62128A770162L6375L7757L8042L7527L7268L8265L9694L9253L6065L2009K9272
62117B171689K7779K6207K4467K3670K4167K5139K6085K7621L0538L4714L9173
62106B481249M2928M5822M8551N1463N3375N2398M8136M2162L6020K9836K3411
62095B955351J7451J2586Q227L501j308n431q926j2153j4575j5452j5306j5180
62083B908785j4785j2837r229n388k270O91M177P588R682J0065R640R807J1288
62070B927214J3478J5203J6320J8014K1019K4366K6811K8683L0979L3289L4422
62059C189798L4882L6842M1211M6162M9216M9673M8498M6957M6108M6666M8583
$$ y = [1518367, 1529474, 1543802, 1560394, 1578712, 1599466, 1623275, 1649393, 1676678, 1705246, 1736217, 1770162, 1806537, 1844294, 1882336, 1919863, 1957131, 1995396, 2035090, 2074343, 2110408, 2142417, 2171689, 2199468, 2225675, 2250142, 2273812, 2297979, 2323118, 2349203, 2376824, 2407362, 2442076, 2481249, 2524177, 2569999, 2618550, 2670013, 2723388, 2775786, 2823922, 2866084, 2902104, 2931940, 2955351, 2972802, 2985388, 2993615, 2997116, 2995808, 2990377, 2981451, 2969298, 2954723, 2939271, 2923965, 2908785, 2894000, 2881163, 2871934, 2866546, 2864276, 2864967, 2869144, 2876732, 2886414, 2896479, 2906119, 2915926, 2927214, 2940692, 2955895, 2972215, 2990229, 3011248, 3035614, 3062425, 3091108, 3122087, 3155376, 3189798, 3224680, 3261522, 3302733, 3348895, 3398111, 3447784, 3496282, 3543239, 3589347, 3636013, 3684596]
62048C684596N1059N3309N4881N5463N5260N5483N7251N9876O1497O1707O2163
62037D312545O4137O6971O9665P2519P6106P9840Q2843Q5231Q7249Q8011Q6575
62026E171692Q3775Q1438Q0124P9142P8706Q0391Q4895R0369R3734R3240Q9504
62015F107010Q4486P9818P5928P2600P0211O9793P1597P4234P6061P6903P7547
62004F936188P7814P6409P2754O7849O2818N7456N0871M2909L4302K5753J7571
61993G522694J0052L484k319q121j4644k1950k9457l6312m1656m4798m5616m4897
61981G246460m3928m3377m2667m0783l7589l4020l0998k8720k7027k5805k4606
61970F866940k2525j9247j5882j4065j4132j4852j4909j4124j3034j1981j1050
$$ y = [3684596, 3735655, 3788964, 3843845, 3899308, 3954568, 4010051, 4067302, 4127178, 4188675, 4250382, 4312545, 4376682, 4443653, 4513318, 4585837, 4661943, 4741783, 4824626, 4909857, 4997106, 5085117, 5171692, 5255467, 5336905, 5417029, 5496171, 5574877, 5655268, 5740163, 5830532, 5924266, 6017506, 6107010, 6191496, 6271314, 6347242, 6419842, 6490053, 6559846, 6631443, 6705677, 6781738, 6858641, 6936188, 7014002, 7090411, 7163165, 7231014, 7293832, 7351288, 7402159, 7445068, 7479370, 7505123, 7522694, 7532746, 7536230, 7533911, 7525790, 7511146, 7489196, 7459739, 7423427, 7381771, 7336973, 7291357, 7246460, 7202532, 7159155, 7116488, 7075705, 7038116, 7004096, 6973098, 6944378, 6917351, 6891546, 6866940, 6844415, 6825168, 6809286, 6795221, 6781089, 6766237, 6751328, 6737204, 6724170, 6712189, 6701139]
61959F701139j0499j0640j1296j1834j1790j1318j0900j0766j0720j0461r984
61948F580931r706j0159j1487j3192j4488j4995j5045j5186j5552j6032j6916
61937F428173j8797k1744k5142k8730l3330l9873m8047n6503o4140p0415p4608
61926E946844p6040p5420p4894p5866p7185p6425p2714o7688o3668o1530o0420
61915E164994n8968n6500n3410n0646m8811m7541m5895m3320m0135l6989l4117
61904D648662l1424k9268k8519k9369l0362k9558k6884k4464k4032k4693k4155
61893D345934k1630j8269j4992j1460p505m005j414J428N710J0668J4555J7315
61881D316335K0768K6016L1937L6782M0396M4019M8504N3479N8159O2280O6058
$$ y = [6701139, 6690640, 6680000, 6668704, 6656870, 6645080, 6633762, 6622862, 6612096, 6601376, 6590915, 6580931, 6571225, 6561066, 6549579, 6536387, 6521899, 6506904, 6491859, 6476673, 6461121, 6445089, 6428173, 6409376, 6387632, 6362490, 6333760, 6300430, 6260557, 6212510, 6156007, 6091867, 6021452, 5946844, 5870804, 5795384, 5720490, 5644624, 5567439, 5491014, 5418300, 5350612, 5286944, 5225414, 5164994, 5106026, 5049526, 4996116, 4945470, 4896659, 4849118, 4803223, 4759903, 4719768, 4682779, 4648662, 4617238, 4587970, 4559451, 4530082, 4499720, 4470162, 4443278, 4418814, 4394782, 4370089, 4345934, 4324304, 4306035, 4291043, 4279583, 4272078, 4268073, 4266659, 4268087, 4273797, 4284465, 4299020, 4316335, 4337103, 4363119, 4395056, 4431838, 4472234, 4516253, 4564757, 4618236, 4676395, 4738675, 4804733]
61870D804733O9661P3167P6939Q1583Q7280R3459R9531J05870J13575J23274J34741
61859E863813J47812J62924J80404J99934K21428K45846K74208L06073L39983
61850G942425L75417M13439M55181N00468N48179N97319O47369O98154P49800
61841A2927751Q02245Q54163R02328R42044R67558R71674R45657Q80815P71094
61832B0965329O15143M17575J89741n1034k85057m95304o70660q06013r00916
61823A8978804r58518r84326r84387r64146r28697q83015q30999p74911p16736
61814A0953069o59610o06463n57560n11054m66288m24854l87754l53421l20129
61805F665936k88827k61578k38023k15681j93548j73138j55628j40019j24878
$$ y = [4804733, 4874394, 4947561, 5024500, 5106083, 5193363, 5286822, 5386353, 5492223, 5605798, 5729072, 5863813, 6011625, 6174549, 6354953, 6554887, 6776315, 7022161, 7296369, 7602442, 7942425, 8317842, 8731281, 9186462, 9686930, 10235109, 10832428, 11479797, 12177951, 12927751, 13729996, 14584159, 15486487, 16428531, 17396089, 18367763, 19313420, 20194235, 20965329, 21580472, 21998047, 22187788, 22136754, 21851697, 21356393, 20685733, 19879720, 18978804, 18020286, 17035960, 16051573, 15087427, 14158730, 13275715, 12444716, 11669805, 10953069, 10293459, 9686996, 9129436, 8618382, 8152094, 7727240, 7339486, 6986065, 6665936, 6377109, 6115531, 5877508, 5661827, 5468279, 5295141, 5139513, 4999494, 4874616]
61796D874616j10113r6080q2463o9229n7369m7482l8686l0150k2676j7444j4105
61785D288819j1650j0332j1005j3118j5202j7105j9822k3004k4581k3413k0639
61774D098948j7740j4775j1358p894m650p61M432R731J3059J3678J2358R858O508
61761D111394L015K92j804m439q043j1398j2850j1786q481l225L677J1518J9554
61748D087424K7775L6784M6959N8135P0039Q2564R5446J08205J20599J32909J45518
61737E012357J58599J72544J88281K06466K26371K46252K65182K84185L05262
61728G065499L29534L56596L85567M16607M51357M91809N38557N90354O45862
61719A1271742P05674P71806Q45097R24187J007621J095791J189521J287386J386039
$$ y = [4874616, 4764503, 4668423, 4585960, 4516731, 4459362, 4411880, 4373194, 4343044, 4320368, 4302924, 4288819, 4277169, 4266837, 4255832, 4242714, 4227512, 4210407, 4190585, 4167581, 4143000, 4119587, 4098948, 4081208, 4066433, 4055075, 4047181, 4042531, 4041770, 4046202, 4055933, 4068992, 4082670, 4095028, 4104886, 4111394, 4114409, 4114701, 4112897, 4108458, 4100415, 4089017, 4076167, 4064381, 4055900, 4052675, 4056352, 4067870, 4087424, 4115199, 4151983, 4198942, 4257077, 4327116, 4409680, 4505126, 4613331, 4733930, 4866839, 5012357, 5170956, 5343500, 5531781, 5738247, 5964618, 6210870, 6476052, 6760237, 7065499, 7395033, 7751629, 8137196, 8553803, 9005160, 9496969, 10035526, 10625880, 11271742, 11977416, 12749222, 13594319, 14518506, 15526127, 16621918, 17811439, 19098825, 20484864]
61710B0484864J482992J576991J664473J736602J780803J784323J735066J620009
61702C3866123J426240J147173P89748L76424n9955m84571q67638j188303j436080
61693C3569161j610220j716790j764786j763883j724459j657647j573594j479546
61685B0278236j380118j278988j179432j083551r92292r06606q27715p56043o90950
61676A1182541o31955n79305n32663m90365m50968m14790l82646l53673l25844
61667G020332k98625k73563k51926k33050k15709k00000j86796j76099j67028
61658E017536j59043j52094j45748j39246j32516j26166j20312j14366j08255
61649C819790j02787r8161r3161q6750p9763p3861o9393o5555o2320o0579o0097
$$ y = [20484864, 21967856, 23544847, 25209320, 26945922, 28726725, 30511048, 32246114, 33866123, 35292363, 36439536, 37229284, 37605708, 37545753, 37061182, 36193544, 35005241, 33569161, 31958941, 30242151, 28477365, 26713482, 24989023, 23331376, 21757782, 20278236, 18898118, 17619130, 16439698, 15356147, 14363855, 13457249, 12629534, 11873491, 11182541, 10550586, 9971281, 9438618, 8948253, 8497285, 8082495, 7699849, 7346176, 7020332, 6721707, 6448144, 6196218, 5963168, 5747459, 5547459, 5360663, 5184564, 5017536, 4858493, 4706399, 4560651, 4421405, 4288889, 4162723, 4042411, 3928045, 3819790, 3717003, 3618842, 3525681, 3438931, 3359168, 3285307, 3215914, 3150359, 3088039, 3027460, 2967363]
61638B967363n9047n6356n3268n1531n0915m9728m7193m4148m1715m0300l9757
61627B433405l9521l8622l6494l3836l1935l1156l0889l0718l0629l0157k8531
61616B070917k6015k3952k3094k2797k2341k1906k1599k0597j8322j5742j4373
61605A840179j4398j4723j4576j4060j3391j2598j1891j1485j0989r779p871n781
61593A698637l579j019J458K872L111L180L753M265L945K995K194K006K549L757
61579A730124M962N013L573J765P67L63k29p63m19M95Q14N40J119L208N419O005
61563A762756M750K462m16l704o745q973j0792j2926j5123j6437j6501j5731j4552
61550A648068j3342j2859j3548j4542j4494j3385j2363j1811j0907r381q195p896
$$ y = [2967363, 2908316, 2851960, 2798692, 2747161, 2696246, 2646518, 2599325, 2555177, 2513462, 2473162, 2433405, 2393884, 2355262, 2318768, 2284932, 2252997, 2221841, 2190952, 2160234, 2129605, 2099448, 2070917, 2044902, 2020950, 1997856, 1975059, 1952718, 1930812, 1909213, 1888616, 1870294, 1854552, 1840179, 1825781, 1811058, 1796482, 1782422, 1769031, 1756433, 1744542, 1733057, 1722068, 1712289, 1704418, 1698637, 1695058, 1694039, 1695497, 1698369, 1701480, 1704660, 1708413, 1712678, 1716623, 1719618, 1721812, 1723818, 1726367, 1730124, 1735086, 1740099, 1743672, 1745437, 1746204, 1746567, 1746338, 1745575, 1745156, 1745651, 1746465, 1747005, 1748124, 1751332, 1756751, 1762756, 1767506, 1769968, 1769552, 1765848, 1759103, 1750130, 1739338, 1726412, 1711289, 1694852, 1678351, 1662620, 1648068, 1634726, 1621867, 1608319, 1593777, 1579283, 1565898, 1553535, 1541724, 1530817, 1521436, 1513241, 1505345]
61538A505345p604o506n154m248l292j673j88K4m33K12K486N122O959Q119R229
61523A508398J0590J2421J4855J7367J9029J9750K0516K2129K4338K6577K8934
61512A724904L1898L5524L9164M1836M2890M2811M3318M5940N0308N4327N6215
61501B209135N5862N4156N1808M9265M7052M5552M4619M3762M2631M1209L9695
61490B724746L8231L6507L3801K9820K5327K1371J8029J4602J0916P555M672J529
61478B967106k480p103j1732j5792j8328j8248j5655j2200r422p176m287j15N036
61465B849604J0538J5741K0198K4324K9444L6535M5150N4129O2970P1953Q1371
61454C301957R1365J02311J14646J28370J43136J58688J74914J91752K09418K28215
$$ y = [1505345, 1497741, 1491235, 1486081, 1481833, 1478541, 1476868, 1476680, 1476704, 1476271, 1476483, 1478969, 1484091, 1491050, 1499169, 1508398, 1518988, 1531409, 1546264, 1563631, 1582660, 1602410, 1622926, 1645055, 1669393, 1695970, 1724904, 1756802, 1792326, 1831490, 1873326, 1916216, 1959027, 2002345, 2048285, 2098593, 2152920, 2209135, 2264997, 2319153, 2370961, 2420226, 2467278, 2512830, 2557449, 2601211, 2643842, 2685051, 2724746, 2762977, 2799484, 2833285, 2863105, 2888432, 2909803, 2927832, 2942434, 2953350, 2960905, 2965577, 2967106, 2964626, 2957523, 2945791, 2929999, 2911671, 2893423, 2877768, 2865568, 2856146, 2848970, 2844683, 2844568, 2849604, 2860142, 2875883, 2896081, 2920405, 2949849, 2986384, 3031534, 3085663, 3148633, 3220586, 3301957, 3393322, 3495633, 3610279, 3738649, 3881785, 4040473, 4215387, 4407139, 4616557, 4844772]
61444D844772K47746K66918K85317L04013L24092L44617L62774L75605L80874
61435G736728L76711L61627L35119K97535K49393J91704J26992N9301p184o9067
61425I658859j23543j68279k02138k25786k41206k50452k54425k52551k43904
61416G696575k29204k11310j93185j75589j57383j37751j17314r7186p7998n9913
61406F239742m2807k6164r604O348K0712L3327M4999N6161O6214P4539Q1315Q6841
61394F631623R0710R2230R1375Q8996Q6382Q4763Q4639Q5251Q5357Q4776Q4569
61383G590671Q5232Q5666Q4642Q2673Q1237Q0456P8635P4300O7834O0668N3547
61372H425561M6146L8009K9190J9920J0132l08j1062k1255l0006l6957m2381m6967
$$ y = [4844772, 5092518, 5359436, 5644753, 5948766, 6272858, 6617475, 6980249, 7355854, 7736728, 8113439, 8475066, 8810185, 9107720, 9357113, 9548817, 9675809, 9735110, 9727926, 9658859, 9535316, 9367037, 9164899, 8939113, 8697907, 8447455, 8193030, 7940479, 7696575, 7467371, 7256061, 7062876, 6887287, 6729904, 6592153, 6474839, 6377653, 6299655, 6239742, 6196935, 6170771, 6161167, 6167515, 6188227, 6221554, 6266553, 6322714, 6388928, 6463467, 6544782, 6631623, 6722333, 6814563, 6905938, 6994934, 7081316, 7166079, 7250718, 7335969, 7421326, 7506102, 7590671, 7675903, 7761569, 7846211, 7928884, 8010121, 8090577, 8169212, 8243512, 8311346, 8372014, 8425561, 8471707, 8509716, 8538906, 8558826, 8568958, 8568650, 8557588, 8536333, 8506327, 8469370, 8426989, 8380022]
61360H380022n1425n5743n8785n9107n6581n2720m8952m4971l9535l2535k5297
61349G854371j9001j3727r240n725l361k013j809l216o049r084j1336j3011j4495
61336G742304j5025j3311q945k217P193K0119L6513N5132P4838R5368J16831J39453
61324H248253J64000J91354K20940K50563K78514L05140L31342L56218L77228
61315A0723552L92329M00731M01656L93488L74455L43268K99151K42630J76913
61306A3748173J07373L8630k7478r0573j49451k02257k48233k87821l21105l47296
61296A2219962l65981l77783l83569l83764l78880l70008l58468l45406l31640
61287H924463l17129l00616k80932k59000k37531k18169j99831j80542j60029
$$ y = [8380022, 8328597, 8272854, 8214069, 8154962, 8098381, 8045661, 7996709, 7951738, 7912203, 7879668, 7854371, 7835370, 7821643, 7812403, 7806678, 7803317, 7801304, 7799495, 7796279, 7790230, 7781146, 7769810, 7756799, 7742304, 7727279, 7713968, 7705023, 7702806, 7709999, 7730118, 7766631, 7821763, 7896601, 7991969, 8108800, 8248253, 8412253, 8603607, 8824547, 9075110, 9353624, 9658764, 9990106, 10346324, 10723552, 11115881, 11516612, 11918268, 12311756, 12686211, 13029479, 13328630, 13571260, 13748173, 13855546, 13894176, 13866698, 13776125, 13626674, 13424417, 13176184, 12888363, 12567258, 12219962, 11853981, 11476198, 11092629, 10708865, 10329985, 9959977, 9601509, 9256103, 8924463, 8607334, 8306718, 8025786, 7766786, 7529255, 7311086, 7111255, 6930713, 6770684]
61278F770684j39673j20604j02878q6136p0100n4411l8720k2968p427P299K0198
61267F155264L0453L8437M5472N2209N7947O1950O4460O5792O5502O3332O0086
61256F760904N6500N2139M6570M0817L6297L2904K9436K5303K0539J4858Q303
61245G124570K040l223r052j7511k7847l7118m4013m9866n5905o1743o6995p2047
61233F681290p6579p9596q1659q4736q8766r0739q8627q4006p9091p3388o5497
61222E788606n6429m8584m2517l7188l2536k9291k6830k3708k0285j8493j8815
61211E433930j9559j9549j9554k0396k1252k0707j8296j4292r019l121K317O706
61199E277208J0572J4833J9946K6026L3324M2095N2259O3501P5610Q8692J02973
$$ y = [6770684, 6631011, 6510407, 6407529, 6321393, 6251293, 6196882, 6158162, 6135194, 6127767, 6135066, 6155264, 6185717, 6224154, 6269626, 6321835, 6379782, 6441732, 6506192, 6571984, 6637486, 6700818, 6760904, 6817404, 6869543, 6916113, 6956930, 6993227, 7026131, 7055567, 7080870, 7101409, 7116267, 7124570, 7126610, 7123387, 7114335, 7096824, 7068977, 7031859, 6987846, 6937980, 6882075, 6820332, 6753337, 6681290, 6604711, 6525115, 6443456, 6358720, 6269954, 6179215, 6090588, 6006582, 5927491, 5854103, 5788606, 5732177, 5683593, 5641076, 5603888, 5571352, 5542061, 5515231, 5491523, 5471238, 5452745, 5433930, 5414371, 5394822, 5375268, 5354872, 5333620, 5312913, 5294617, 5280325, 5271306, 5268185, 5270502, 5277208, 5287780, 5302613, 5322559, 5348585, 5381909, 5424004, 5476263, 5539764, 5615374, 5704066, 5807039]
61188E807039J18177J32977J45505J54593J60068J61725J58734J50292J35720
61179G124830J13443Q1366L9779p058n3689r7359j37756j73694k02251k21425
61169F466186k31941k35957k35219k30824k23545k13708k01554j88080j74696
61160D530662j61873j48936j35408j21741j08600r6365q5572p6903p0377o5116
61150C459771o0156n4927m8973m2062l4614k7238j9901j2343n112Q93N770J0320
61138C171428J4384J6828J7423J7315J7221J6476J4500J1997R791P403L702j500
61126C316968p104j1705j4650j6708j9587k4149k9126l2637l4709l6941l9777
61115C049875m1915m2860m4083m6715m9698n1471n2060n2180n1677n0415m9603
$$ y = [5807039, 5925216, 6058193, 6203698, 6358291, 6518359, 6680084, 6838818, 6989110, 7124830, 7238273, 7319639, 7359418, 7352360, 7298671, 7201312, 7063556, 6889862, 6687611, 6466186, 6234245, 5998288, 5763069, 5532245, 5308700, 5094992, 4893438, 4705358, 4530662, 4368789, 4219853, 4084445, 3962704, 3854104, 3757739, 3672167, 3595264, 3524887, 3459771, 3399615, 3344688, 3295715, 3253653, 3219039, 3191801, 3171900, 3159557, 3154445, 3155338, 3161108, 3171428, 3185812, 3202640, 3220063, 3237378, 3254599, 3271075, 3285575, 3297572, 3307363, 3314766, 3318468, 3316968, 3309864, 3298159, 3283509, 3266801, 3247214, 3223065, 3193939, 3161302, 3126593, 3089652, 3049875, 3007960, 2965100, 2921017, 2874302, 2824604, 2773133, 2721073, 2668893, 2617216, 2566801, 2517198]
61104B517198n0343n1547n1113m8924m7030m6859m7724m8057m6917m4128m0127
61093A994429l6081l3181l1536l0296k9052k8487k9387l1542l3746l4681l3842
61082A642598l1928l0177k9045k7822k5790k3302k1071j8829j5509j0775n720
61071A402630j889R0Q48J497K587L874N117O763R221J1707J2815J2412J2033J2929
61057A492634J4564J5608J5549J4778J3888J3560J4331J5615J5775J4051J1760
61046A652113J0549J0115Q744N728K000j405m359p015r120j0280j0456j0013r514
61033A627087r298r199r006r173j0346j2136j3373j3860j4596j5725j5867j4506
61021A480002j3458j4306j5752j5418j3375j1763j1440j1247j0429r604r158q540
$$ y = [2517198, 2466855, 2415308, 2364195, 2315271, 2268241, 2221382, 2173658, 2125601, 2078684, 2034556, 1994429, 1958348, 1925167, 1893631, 1863335, 1834283, 1805796, 1776409, 1744867, 1711121, 1676440, 1642598, 1610670, 1580493, 1551448, 1523626, 1497836, 1474534, 1453463, 1434634, 1419125, 1408350, 1402630, 1400741, 1400831, 1401679, 1403176, 1405763, 1409637, 1414754, 1421517, 1430738, 1442445, 1455260, 1467672, 1479705, 1492634, 1507198, 1522806, 1538355, 1553133, 1567021, 1580581, 1594912, 1610527, 1626302, 1640353, 1652113, 1662662, 1672777, 1681521, 1687249, 1689249, 1687844, 1683485, 1676470, 1667350, 1657070, 1646614, 1636601, 1627087, 1617789, 1608590, 1599584, 1590411, 1580065, 1567929, 1554556, 1540696, 1526100, 1510375, 1494508, 1480002, 1466544, 1452238, 1436486, 1421068, 1407693, 1395930, 1384490, 1373243, 1362814, 1353210, 1344052, 1335512]
61009A335512p484o266m494j475J868L370K628J872K816M269M190K785K036K876
60995A344503M458N865P180Q674R884R990Q919P763P946R695J1521J1714J0372
60982A458484R314R845J1277J2108J2094J2508J4407J7198J9336K0225K0916K2568
60970A640280K4790K6419K7695L0205L4233L7683L8691L8193L8595M0728M3469
60959B020981M5780M7619M9274N1245N4536N9626O5310O9929P3687P8531Q5778
60948B702296R4882J04563J14073J23504J33735J45799J59517J73365J86409J99451
60938D137594K13224K26949K40364K55831K76192L01476L29859L60875L95250
60929F737614M32755M72955N17552N69445O30735P04103P93757R00850J020225
$$ y = [1335512, 1328028, 1321762, 1317268, 1315793, 1317661, 1321031, 1323659, 1325531, 1328347, 1332616, 1336806, 1339591, 1341627, 1344503, 1348961, 1354826, 1362006, 1370680, 1380564, 1390554, 1399473, 1407236, 1415182, 1424877, 1436398, 1448112, 1458484, 1467798, 1477643, 1488920, 1501028, 1513122, 1525630, 1540037, 1557235, 1576571, 1596796, 1617712, 1640280, 1665070, 1691489, 1719184, 1749389, 1783622, 1821305, 1859996, 1898189, 1936784, 1977512, 2020981, 2066761, 2114380, 2163654, 2214899, 2269435, 2329061, 2394371, 2464300, 2537987, 2616518, 2702296, 2797178, 2901741, 3015814, 3139318, 3273053, 3418852, 3578369, 3751734, 3938143, 4137594, 4350818, 4577767, 4818131, 5073962, 5350154, 5651630, 5981489, 6342364, 6737614, 7170369, 7643324, 8160876, 8730321, 9361056, 10065159, 10858916, 11759766, 12779991]
60920A2779991J147147J285464J442971J621414J820315K049175K323845K650008
60912B7120330L023504L442203L878864M212731M220167L709708K713627J529164
60904E3850298N32759n8344k48827j44504J52645N07243O82323M16949l73782
60895E5316760j491716k577763l349152l730399l801933l679064l448181l168598
60887C0069954k881068k603110k333917k072665j826655j602769j401604j223210
60879A4124956j070887r45532q41807p53381o77876o14338n60031n12563m71790
60870G676751m37082m05489l74734l45309l17922k91771k67193k46785k31669
60861D758797k19305k07263j96452j88070j79952j69135j56309j44755j35932
$$ y = [12779991, 13927138, 15212602, 16655573, 18276987, 20097302, 22146477, 24470322, 27120330, 30143834, 33586037, 37464901, 41677632, 45897799, 49607507, 52321134, 53850298, 54383057, 54324713, 54075886, 53931382, 54084027, 54591270, 55273593, 55690542, 55316760, 53825044, 51247281, 47898129, 44167730, 40365797, 36686733, 33238552, 30069954, 27188886, 24585776, 22251859, 20179194, 18352539, 16749770, 15348166, 14124956, 13054069, 12108537, 11266730, 10513349, 9835473, 9221135, 8661104, 8148541, 7676751, 7239669, 6834180, 6459446, 6114137, 5796215, 5504444, 5237251, 4990466, 4758797, 4539492, 4332229, 4135777, 3947707, 3767755, 3598620, 3442311, 3297556, 3161624]
60852C161624j28641j21608j14501j07014r9043r1330q4516p8193p2052o6835
60842B197891o2926n9272n5094n1328m8764m6226m2389l8014l4510l1512k8059
60831A699797k4937k3508k2991k1374j8577j6376j5413j4511j3047j1921j1911
60820A505231j2691j3825j5287j6838j8048j8966j9722j9841j9162j8834j9747
60809A312270k0468j8808j5292j2945j3190j4080j3349j1406r997r359q125n391
60797A159860j661J954M625O084O723P443R008J1448J4084J6114J7381J8638K0776
60784A292477K3524K5481K5810K5353K5411K5984K6025K4919K2754J9599J5770
60773A553107J2550J1234J1277J0633Q296N378L223J581n74l174n009n393n123
$$ y = [3161624, 3032983, 2911375, 2796874, 2689860, 2590817, 2499487, 2414971, 2336778, 2264726, 2197891, 2134965, 2075693, 2020599, 1969271, 1920507, 1874281, 1831892, 1793878, 1759368, 1727856, 1699797, 1674860, 1651352, 1628361, 1606987, 1588410, 1572034, 1556621, 1542110, 1529063, 1517142, 1505231, 1492540, 1478715, 1463428, 1446590, 1428542, 1409576, 1389854, 1370013, 1350851, 1332017, 1312270, 1291802, 1272994, 1257702, 1244757, 1231567, 1217487, 1204138, 1192732, 1182735, 1173376, 1165251, 1159860, 1158199, 1160153, 1164778, 1170862, 1177585, 1185028, 1194036, 1205484, 1219568, 1235682, 1253063, 1271701, 1292477, 1316001, 1341482, 1367292, 1392645, 1418056, 1444040, 1470065, 1494984, 1517738, 1537337, 1553107, 1565657, 1576891, 1588168, 1598801, 1607097, 1612475, 1615698, 1617279, 1616705, 1613531, 1608522, 1603129, 1598006]
60760A598006n570p135q856r624r658j0313j2251j4366j5072j4246j3266j3374
60748A464275j4660j6422j7734j7707j6044j3536j1452j0236r308q090o742n746
60736A316598n166m582l407j367J192L514N219O649Q203R671J0664J1377J2428
60723A370993J4180J6607J9397K1683K2229K0676J8420J7395J8074J9297J9818
60712A578769J9366J8317J7180J6377J5857J4977J3310J1468J0434J0258J0029
60701A736342R069P430N418L348J691P23P3p21j413j555j493j962k787l066k630
60686A748467k316k602k943k821k566k816l841n672q151j0503j1613j1253j0548
60673A670822j0713j1606j1924j0694q355o417o021o713o917n748l897k499j840
$$ y = [1598006, 1592436, 1585301, 1576445, 1566821, 1557163, 1546850, 1534599, 1520233, 1505161, 1490915, 1477649, 1464275, 1449615, 1433193, 1415459, 1397752, 1381708, 1368172, 1356720, 1346484, 1337176, 1329086, 1322344, 1316598, 1311432, 1306850, 1303443, 1302076, 1303268, 1306782, 1312001, 1318650, 1326853, 1336524, 1347188, 1358565, 1370993, 1385173, 1401780, 1421177, 1442860, 1465089, 1485765, 1504185, 1521580, 1539654, 1558951, 1578769, 1598135, 1616452, 1633632, 1650009, 1665866, 1680843, 1694153, 1705621, 1716055, 1726313, 1736342, 1745411, 1752841, 1758259, 1761607, 1763298, 1764021, 1764094, 1763373, 1761960, 1760405, 1758912, 1756950, 1754163, 1751097, 1748467, 1746151, 1743549, 1740606, 1737785, 1735219, 1732403, 1728562, 1722890, 1714739, 1704236, 1692623, 1681370, 1670822, 1660109, 1648503, 1636579, 1625885, 1617530, 1611113, 1605092, 1598379, 1591462, 1585714, 1581817, 1579318, 1577478]
60660A577478j684k049k750k862j812m90q6l66m67q15k501m944o260o087o089
60645A538216p090p768p101o196o382p004o678n611n059n291n547n717o577q562
60631A447633j1243j3906j5889j6702j6532j6341j6823j7642j8184j8418j8370
60620A267583j7554j5891j4419j3999j3903j2953j1532j0955j1024r920o820l165
60608A125448o15J032K950N183O606O741O540P150Q545R800J0371J0589J0852
60595A211192J0893J0256R201Q535Q534Q624Q298P879Q069R123J0630J1773J1715
60582A334722J0279Q463P697Q327R363R924J0206J0723J1500J2591J4476J7092
60570A465363J9194J9718J9213J8893J8880J8584J8322J8962K0001J9588J6852
$$ y = [1577478, 1575794, 1573745, 1570995, 1568133, 1566321, 1565831, 1565745, 1565379, 1564912, 1564097, 1561596, 1556652, 1550392, 1544305, 1538216, 1531126, 1523358, 1516257, 1510061, 1503679, 1496675, 1489997, 1484386, 1479327, 1474036, 1468489, 1462772, 1456195, 1447633, 1436390, 1422484, 1406595, 1389893, 1373361, 1357020, 1340197, 1322555, 1304371, 1285953, 1267583, 1250029, 1234138, 1219719, 1205720, 1191817, 1178864, 1167332, 1156377, 1145353, 1135433, 1128613, 1125448, 1124833, 1125865, 1128815, 1133998, 1140604, 1147345, 1153885, 1161035, 1169580, 1179380, 1189751, 1200340, 1211192, 1222085, 1232341, 1241542, 1250077, 1258611, 1267235, 1275533, 1283412, 1291481, 1300604, 1311234, 1323007, 1334722, 1345001, 1353464, 1361161, 1369488, 1378851, 1388775, 1398981, 1409704, 1421204, 1433795, 1448271, 1465363, 1484557, 1504275, 1523488, 1542381, 1561261, 1579845, 1598167, 1617129, 1637130, 1656718, 1673570]
60559A673570J2964R398O278L125J11k270m063n470o309o582p121q602j0295j0676
60545A644058r250o966m946l638l288m211o091p744q297q286r004j0818j2719
60532A548800j3505j2947j1598r797p353m192r66J276K096K165K646L980N495
60519A506100O198N838N030M530M568M839M959M845M775N011N327N068L878K269
60505A573235J164R45J230J409J085M3j579l061l609l354l376m412n989p034o891
60490A539806n465k925K36L308N980Q557J1273J3831J6063J8463K1438K4638K7656
60477A682859L0940L5210M0342M5655N0773N5356N8313N8469N5824N1121M4261
60466B209123L4327K1348O996o701j8391k6981l1526l2166l0327k7247k2814j6564
$$ y = [1673570, 1686534, 1695932, 1702210, 1705335, 1705446, 1703176, 1699113, 1693643, 1687334, 1680752, 1673631, 1665029, 1654734, 1644058, 1634808, 1627842, 1622896, 1619258, 1615970, 1611759, 1605668, 1597924, 1589627, 1581341, 1572337, 1561519, 1548800, 1535295, 1522348, 1510750, 1500953, 1493600, 1489408, 1488442, 1489718, 1491814, 1493979, 1496625, 1500605, 1506100, 1512298, 1518136, 1523166, 1527696, 1532264, 1537103, 1542062, 1546907, 1551682, 1556693, 1562020, 1567088, 1570966, 1573235, 1574399, 1575344, 1576574, 1577983, 1579068, 1579111, 1577532, 1574471, 1570862, 1567508, 1564132, 1559720, 1553731, 1546697, 1539806, 1534341, 1531416, 1531652, 1534960, 1540940, 1549497, 1560770, 1574601, 1590664, 1609127, 1630565, 1655203, 1682859, 1713799, 1749009, 1789351, 1835006, 1885779, 1941135, 1999448, 2057917, 2113741, 2164862, 2209123, 2243450, 2264798, 2271794, 2265093, 2246702, 2219721, 2188195, 2156029, 2125702, 2098455, 2075641, 2059077]
60454B059077r246k656K097N699R699J4554J8919K1302K2268K3957K7246L0763
60442B223679L3559L7285M3862N2131N9222O4818P1531Q0812R1153J01180J12097
60431B971329J25514J40771J56000J70477J84337J97370K09824K23364K39560
60422D618546K58227K78782L02343L30549L62624L95082M23613M43243M46885
60413G859894M26251L75737K95244J89718O7381o1303j84784k92539l77142m35280
60403G863177m67870m79200m74909m59726m36640m07599l74653l40464l07708
60394D114408k77684k49724k22987j98754j79432j64740j50808j34524j17375
60385B418380j03153r2963q4717p6806o9730o3918n8434n2662m7588m4373m2755
$$ y = [2059077, 2049831, 2047175, 2049272, 2054971, 2064670, 2079224, 2098143, 2119445, 2141713, 2165670, 2192916, 2223679, 2257238, 2294523, 2338385, 2390516, 2449738, 2514556, 2586087, 2666899, 2758052, 2859232, 2971329, 3096843, 3237614, 3393614, 3564091, 3748428, 3945798, 4155622, 4378986, 4618546, 4876773, 5155555, 5457898, 5788447, 6151071, 6546153, 6969766, 7413009, 7859894, 8286145, 8661882, 8957126, 9146844, 9214225, 9152922, 8968138, 8675599, 8298457, 7863177, 7395307, 6916107, 6441198, 5981472, 5544832, 5137233, 4762580, 4422116, 4114408, 3836724, 3587000, 3364013, 3165259, 2985827, 2821087, 2670279, 2535755, 2418380, 2315227, 2222264, 2137547, 2060741, 1991011, 1927093, 1868659, 1815997, 1768409, 1724036, 1681281]
60374A681281m1535l9743l6900l3153k9602k7480k6576k5365k3075k0496j8465
60363A358891j6733j4994j3722j3183j2573j1274j0073j0004j0546j0171q400
60352A227218o221m503l013j203P18J951K010J213M09K04M88P27P53R59J642K472
60336A225824K967L258L968N358O905P884Q072P710O917N508L563J830J228J876
60322A292868K823K693N91l166o831q219o819m692m325n572n943l962r90R11J402
60307A250769J290Q54J64QR58K114K304J985K494L765M524M512M797N704O238
60292A292480O020O180P525R030R173Q015P072P540R103J0334J0137R011Q531
60279A400151R089Q920O536L470K742M716O488N889M010K838K376J665J159K004
$$ y = [1681281, 1639746, 1600003, 1563103, 1529950, 1500348, 1472868, 1446292, 1420927, 1397852, 1377356, 1358891, 1342158, 1327164, 1313442, 1300259, 1287686, 1276412, 1266339, 1256335, 1245789, 1235618, 1227218, 1220997, 1216494, 1213481, 1212278, 1212996, 1214947, 1216957, 1218170, 1218579, 1218783, 1219271, 1219998, 1220751, 1221710, 1223352, 1225824, 1228791, 1232049, 1236017, 1241375, 1248280, 1256164, 1264236, 1271946, 1278863, 1284371, 1287934, 1289764, 1290992, 1292868, 1295691, 1298384, 1298975, 1295809, 1288978, 1280759, 1273940, 1269248, 1264923, 1259351, 1253408, 1249446, 1248456, 1249367, 1250769, 1252059, 1252913, 1253077, 1253085, 1254043, 1256157, 1258461, 1260446, 1262940, 1266705, 1271229, 1275741, 1280538, 1286242, 1292480, 1298500, 1304680, 1312205, 1321235, 1330408, 1338423, 1345495, 1353035, 1362138, 1372472, 1382609, 1391620, 1400151, 1409240, 1418160, 1424696, 1428166, 1430908, 1435624, 1442112, 1448001, 1452011, 1454849, 1457225, 1458890, 1460049, 1462053]
60265A462053L729M607M235M077N107O194N480K644q52l450m927n973o773o581
60251A469570n092l592l761n436o664o166m700l499k447p74J262K424K059Q10
60237A433994q2K94J993M070N120M562L164K122J953K629M099N995P290P260O600
60222A491063O798Q335J0242J1517J2226J2878J3363J3139J2209J1383J1464J2478
60210A627095J3887J5251J6539J7879J9302K0706K1976K3207K4965K7970L2116
60199A860893L6078L8681M0478M3100M7037N1199N4959N9229O4804P1046P7334
60188B444838Q4479R3175J02068J09353J15624J23188J32834J43232J53424J63741
60178C665956J74057J83190J90736J97574K03707K07288K06835K03044J97284
$$ y = [1462053, 1465782, 1470389, 1474624, 1478701, 1483808, 1490002, 1495482, 1498126, 1497274, 1493824, 1488897, 1482924, 1476151, 1469570, 1464478, 1460886, 1457125, 1451689, 1445025, 1438859, 1434159, 1430660, 1428213, 1427439, 1428701, 1431125, 1433184, 1433994, 1433912, 1434206, 1436199, 1440269, 1445389, 1449951, 1453115, 1455237, 1457190, 1459819, 1463918, 1469913, 1477203, 1484463, 1491063, 1497861, 1506196, 1516438, 1527955, 1540181, 1553059, 1566422, 1579561, 1591770, 1603153, 1614617, 1627095, 1640982, 1656233, 1672772, 1690651, 1709953, 1730659, 1752635, 1775842, 1800807, 1828777, 1860893, 1896971, 1935652, 1976130, 2019230, 2066267, 2117466, 2172425, 2231654, 2296458, 2367504, 2444838, 2529317, 2622492, 2724560, 2833913, 2949537, 3072725, 3205559, 3348791, 3502215, 3665956, 3840013, 4023203, 4213939, 4411513, 4615220, 4822508, 5029343, 5232387, 5429671]
60169E429671J89464J78517J64196J47373J29072J09822Q9478O7513M4344K2311
60159F571761L941j0940k4685l7972m8325n3283n3196m9689m3311l4290k3899
60148F196112j2980j21J6551L6358N6599P5652R3931J12118J30149J47766J64578
60137G016713J79349J90316J96372J97392J93722J85952J74561J59052J38294
60128H631723J12635Q4749N7205L0122K467k5338n1828p6510r9399j18897j32293
60117H414636j38649j39509j36500j29663j18433j02992q4271o3486m1699j9230
60107G440204M197K7903M9689O8015Q3903R9033J12707J22678J28186J29696J26090
60096H392301J15323R8528Q0582O5145N1289L6385K0250M804q399j8163k2546
$$ y = [5429671, 5619135, 5797652, 5961848, 6109221, 6238293, 6348115, 6437593, 6505106, 6549450, 6571761, 6575702, 6564762, 6540077, 6502105, 6453780, 6400497, 6347301, 6297612, 6254301, 6220011, 6196112, 6183132, 6183011, 6199562, 6235920, 6292519, 6368171, 6462102, 6574220, 6704369, 6852135, 7016713, 7196062, 7386378, 7582750, 7780142, 7973864, 8159816, 8334377, 8493429, 8631723, 8744358, 8829107, 8886312, 8916434, 8918901, 8893563, 8841735, 8765225, 8665826, 8546929, 8414636, 8275987, 8136478, 7999978, 7870315, 7751882, 7648890, 7564619, 7501133, 7459434, 7440204, 7444401, 7472304, 7521993, 7590008, 7673911, 7772944, 7885651, 8008329, 8136515, 8266211, 8392301, 8507624, 8606152, 8686734, 8751879, 8803168, 8839553, 8859803, 8864607, 8856208, 8838045, 8815499]
60085H815499k0186j2272j283J2095K9176N0599P4989J00646J27326J55812J86423
60074I518824K18617K51884K86515L23067L61073L98958M35772M72417N09867
60065A2776994N46405N78112O02499O20028O31365O34667O26979O07311N76858
60056A8201218N36951M88257M31673L68385K98936K23310J42217N7401k9316j16347
60046B0602685k01399k81049l51777m11246m58482m93272n15466n24708n20844
60037A6844442n04777m78673m44829m04572l58629l08330k55815k03133j51681
60028A3734003j02331n5530j1339K9864O6559R6533J18254J31301J35527J30710
60018A4273551J17404R7287P2073M2540R303k5969o0939r4198j25707j55672j83604
$$ y = [8815499, 8795313, 8783041, 8781758, 8793853, 8823029, 8873628, 8948617, 9049263, 9176589, 9332401, 9518824, 9737441, 9989325, 10275840, 10598907, 10959980, 11358938, 11794710, 12267127, 12776994, 13323399, 13901511, 14504010, 15124038, 15755403, 16390070, 17017049, 17624360, 18201218, 18738169, 19226426, 19658099, 20026484, 20325420, 20548730, 20690947, 20748348, 20719032, 20602685, 20401286, 20120237, 19768460, 19357214, 18898732, 18405460, 17889994, 17365286, 16844442, 16339665, 15860992, 15416163, 15011591, 14652962, 14344632, 14088817, 13885684, 13734003, 13631672, 13576142, 13564803, 13594667, 13661226, 13757759, 13876013, 14007314, 14142841, 14273551, 14390955, 14488242, 14560315, 14602855, 14612158, 14586189, 14525250, 14431052, 14305345, 14149673, 13966069]
60007A3966069k08695k30582k49360k65158k77859k86928k91408k90529k84594
59998A1580956k74784k61840k45424k25283k02342j77886j52048j24213r4868
59989I822268o5811l8189j1238J6396M4756P2635R8913J23043J44452J62151J74958
59978A0544334J81697J81429J73863J59544J39450J14560Q5907N4471K0767j4969
59968A1641053n1729q7441j20242j49631j75619j97346k13463k23586k28284k27535
59958I966177k20367k06537j87932j67517j46969j25643j01821p4993m6766j9385
59948H668247O651L3035O1352R0953J19794J47034J73808K01224K28269K52092
59938I982459K70045K81124K85617K83539K73741K54902K27420J93748J56531
$$ y = [13966069, 13757374, 13526792, 13277432, 13012274, 12734415, 12447487, 12156079, 11865550, 11580956, 11306172, 11044332, 10798908, 10573625, 10371283, 10193397, 10041349, 9917136, 9822268, 9756457, 9718268, 9707030, 9723426, 9768182, 9840817, 9939730, 10062773, 10207225, 10369376, 10544334, 10726031, 10907460, 11081323, 11240867, 11380317, 11494877, 11580784, 11635255, 11656022, 11641053, 11589324, 11501883, 11381641, 11232010, 11056391, 10859045, 10645582, 10421996, 10193712, 9966177, 9745810, 9539273, 9351341, 9183824, 9036855, 8911212, 8809391, 8734398, 8687632, 8668247, 8674898, 8707933, 8769285, 8860238, 8980032, 9127066, 9300874, 9502098, 9730367, 9982459, 10252504, 10533628, 10819245, 11102784, 11376525, 11631427, 11858847, 12052595, 12209126]
59929A2209126J17001P5581L3235q752m9850q9928j27994j62193j90981k13342
59919A1591903k27898k33188k29304k18368k02752j83443j60415j33952j04978
59910I897605p4573m3627j2696J8061M8387P7222J03095J25489J45258J63122
59900A0447343J78271J89026J94584J95522J92787J86818J77623J65257J50190
59891A2077421J33625J17454J03313R1483Q1092P1818O5039O2887O6474P5755
59881A2946361R0985J13091J42092J76238K13842K55276L01567L51341M00921
59872A4991714M47925M93068N37537N79836O16277O43291O57786O56221O35160
59863B0258815N92845N29083M44157L39311K18461Q8141m4606j73500k92604l96211
$$ y = [12209126, 12326127, 12401708, 12434943, 12426191, 12376341, 12286413, 12158419, 11996226, 11805245, 11591903, 11364005, 11130817, 10901513, 10683145, 10480393, 10296950, 10136535, 10002583, 9897605, 9823032, 9779405, 9766709, 9784770, 9833157, 9910379, 10013474, 10138963, 10284221, 10447343, 10625614, 10814640, 11009224, 11204746, 11397533, 11584351, 11761974, 11927231, 12077421, 12211046, 12328500, 12431813, 12523296, 12604388, 12676206, 12741245, 12804132, 12870606, 12946361, 13037346, 13150437, 13292529, 13468767, 13682609, 13937885, 14239452, 14590793, 14991714, 15439639, 15932707, 16470244, 17050080, 17666357, 18309648, 18967434, 19623655, 20258815, 20851660, 21380743, 21824900, 22164211, 22382672, 22470813, 22426207, 22252707, 21960103, 21563892]
59853B1563892m80234n43286n86204o10703o18388o10500n88574n55455n15017
59844A6455531m70156m21628l69669l16012k63032k11290j59581j07397n5970
59835A4080796o760L9740Q3249J23030J58304J88237K11043K24227K26265K17081
59825A5545212J96440J63085J16344N7847r147q1458j56182k29849k98431l58402
59815A4945459m07463m44631m70068m84754m89823m86105m74294m55529m31717
59806A0801075m05259l78173l51193l23975k96189k68124k40189k12748j86946
59797H138279j64868j47919j35560j26307j19294j14091j09961j06408j03672
59788G010199j01362r7548r0788q2283p4210o6609n8157m9523m3468m1437m2477
$$ y = [21563892, 21083658, 20540372, 19954168, 19343465, 18725077, 18114577, 17526003, 16970548, 16455531, 15985375, 15563747, 15194078, 14878066, 14615034, 14403744, 14244163, 14136766, 14080796, 14074036, 14113776, 14197025, 14320055, 14478359, 14666596, 14877639, 15101866, 15328131, 15545212, 15741652, 15904737, 16021081, 16078928, 16069781, 15988323, 15832141, 15602292, 15303861, 14945459, 14537996, 14093365, 13623297, 13138543, 12648720, 12162615, 11688321, 11232792, 10801075, 10395816, 10017643, 9666450, 9342475, 9046286, 8778162, 8537973, 8325225, 8138279, 7973411, 7825492, 7689932, 7563625, 7444331, 7330240, 7220279, 7113871, 7010199, 6908837, 6811289, 6720501, 6638218, 6564008, 6497399, 6439242, 6389719, 6346251, 6304814, 6262337]
59777F262337m5808n1932o0359o8592p4702p9162q2932q5303q4854q1208p4811
59766E472674o6199n6410m6822l7703k7981j7094n850N014J5479K4910L2081L7494
59754E329593M3748N2323O1839P0796P9991R0348J00059J06099J07551J05598
59744F147945J01290R5100Q7750P9699P0657O1045N2793M6971M1946L5978L0518
59733F851692K8604L0960L6251M4491N7203P4142R2642J11100J30880J53890J80041
59722G791896K08074K37472K68534L01582L36878L74692M14761M56001M96888
59713A0886778N35474N68708N91751N97610N77382N22522M29275L02173J53510
59704A5165183k37j42192k58595l42326l94042m19053m22952m10206l85126l51722
$$ y = [6262337, 6216529, 6164597, 6104238, 6035646, 5960944, 5881782, 5798850, 5713547, 5628693, 5547485, 5472674, 5406475, 5350065, 5303243, 5265540, 5237559, 5220465, 5214615, 5219629, 5235108, 5260018, 5292099, 5329593, 5373341, 5425664, 5487503, 5558299, 5638290, 5728638, 5828697, 5934796, 6042347, 6147945, 6249235, 6344335, 6432085, 6511784, 6582441, 6643486, 6696279, 6743250, 6785196, 6821174, 6851692, 6880296, 6911256, 6947507, 6991998, 7049201, 7123343, 7215985, 7327085, 7457965, 7611855, 7791896, 7999970, 8237442, 8505976, 8807558, 9144436, 9519128, 9933889, 10389890, 10886778, 11422252, 11990960, 12582711, 13180321, 13757703, 14280225, 14709500, 15011673, 15165183, 15164946, 15022754, 14764159, 14421833, 14027791, 13608738, 13185786, 12775580, 12390454, 12038732]
59694A2038732l12721k70311k27609j87499j50011j12579p3420l3456N184M1207
59684A0717517P4585J06316J38106J71140K04913K38277K71502L06134L42885
59675A2571375L81167M20768M62378N06202N51670N98983O49382P03102P58548
59666A7603575Q14453Q71620R31237R92198J051237J105309J152808J192534J222304
59657B6937275J239042J240240J225250J195450J153677J104171J052866J006287
59649C6154258R69240R43985R31800R33731R48587R71386R95522J015802J027890
59640D4892201J025990J003734R57504Q87215P94106O80081N49466M09307K67335
59631E1466939J31034Q407r3157j69890k21763k48837k49483k23121j72561j02016
$$ y = [12038732, 11726011, 11455700, 11228091, 11040592, 10890581, 10778002, 10704582, 10671126, 10676310, 10717517, 10792102, 10898418, 11036524, 11207664, 11412577, 11650854, 11922356, 12228490, 12571375, 12952542, 13373310, 13835688, 14341890, 14893560, 15492543, 16141925, 16845027, 17603575, 18418028, 19289648, 20220885, 21213083, 22264320, 23369629, 24522437, 25714971, 26937275, 28176317, 29416557, 30641807, 31837257, 32990934, 34095105, 35147971, 36154258, 37123498, 38067483, 38999283, 39933014, 40881601, 41852987, 42848509, 43864311, 44892201, 45918191, 46921925, 47879429, 48766644, 49560750, 50240831, 50790297, 51199604, 51466939, 51597973, 51606380, 51513223, 51343333, 51121570, 50872733, 50623250, 50400129, 50227568, 50125552]
59621E0125552j4354Q8204K02285L24148M51502N83058P17016Q51117R83087J109295
59611E5420910J223538J318447J387398J423642J418290J361213J244380J063809
59603F5861627Q19637N17153J69019k04820n80985r37178j254433j517952j718651
59594F1153417j854737j930908j954841j934072j876161j790967j691254j590323
59586D6530154j499894j430678j392876j392710j427125j483035j542821j590869
59578C4770146j616576j614778j585878j534971j468927j393450j312314j228170
59570B3015082j143088j058961r77916r01784q30803p63779p00244o41478n88550
59561A5408479n40302m94584m50956m10887l75477l44151l15623k89176k64752
$$ y = [50125552, 50111198, 50199402, 50401687, 50725835, 51177337, 51760395, 52477411, 53328528, 54311615, 55420910, 56644448, 57962895, 59350293, 60773935, 62192225, 63553438, 64797818, 65861627, 66681264, 67198417, 67367436, 67162616, 66581631, 65644453, 64390020, 62872068, 61153417, 59298680, 57367772, 55412931, 53478859, 51602698, 49811731, 48120477, 46530154, 45030260, 43599582, 42206706, 40813996, 39386871, 37903836, 36361015, 34770146, 33153570, 31538792, 29952914, 28417943, 26949016, 25555566, 24243252, 23015082, 21871994, 20813033, 19835117, 18933333, 18102530, 17338751, 16638507, 15997029, 15408479, 14868177, 14373593, 13922637, 13511750, 13136273, 12792122, 12476499, 12187323, 11922571]
59552A1922571k42586k23237k07594j96474j90080j87683j87800j89020j90798
59543A0107299j93300j96609k00440k04429k07845k09076k06442j99991j91500
59534H297667j82290j71905j59657j46344j33370j20827j07686r3549p9126o5178
59524G037735n1991l9767k8550j7727o595M378J3771K0975K6954L2899L8827M4167
59512G075076M9094N4355N9929O4864O8842P3117P9271Q7572R7407J08933J23005
59501G941465J39250J55766J71526J88010K07177K28607K50185K71231K93344
59492I846561L18004L44740L71956L98426M23501M46803M68149M86959N01552
59483A3606651N09958N11735N08132N00106M87113M68164M43264M13558L80684
$$ y = [11922571, 11679985, 11456748, 11249154, 11052680, 10862600, 10674917, 10487117, 10298097, 10107299, 9913999, 9717390, 9516950, 9312521, 9104676, 8895600, 8689158, 8489167, 8297667, 8115377, 7943472, 7783815, 7637471, 7504101, 7383274, 7275588, 7182039, 7102913, 7037735, 6985744, 6945977, 6917427, 6899700, 6893105, 6897483, 6911254, 6932229, 6959183, 6992082, 7030909, 7075076, 7124170, 7178525, 7238454, 7303318, 7372160, 7445277, 7524548, 7612120, 7709527, 7818460, 7941465, 8080715, 8236481, 8408007, 8596017, 8803194, 9031801, 9281986, 9553217, 9846561, 10164565, 10509305, 10881261, 11279687, 11703188, 12149991, 12618140, 13105099, 13606651, 14116609, 14628344, 15136476, 15636582, 16123695, 16591859, 17035123, 17448681, 17829365]
59474A7829365L46033L09691K70287K27430J84346J46365J16195R2296P2641N8162
59464A9652811N1282N2684O1399P6860R9020J26810J57774J88618K15056K31984
59454B0914298K35556K24607J98878J56777R6790K0717o6460j59920k56548l53110
59444B1011585m44958n27331n96791o50858o87652p06858p10188p00079o78500
59435A5308370o47354o09142n66382n20829m73879m27293l82706l40617l00416
59426A1039752k61418k23581j87215j52367j18667q5736n3622k2479Q148L9262
59416I982077P1254J03207J33999J63864J94002K24546K53831K80066L03072L23698
59406A2033616L41926L56096L63841L63022L51948L29522K95600K50830J95761
$$ y = [17829365, 18175398, 18485089, 18755376, 18982806, 19167152, 19313517, 19429712, 19522008, 19594649, 19652811, 19704093, 19756777, 19818176, 19895036, 19994056, 20120866, 20278640, 20467258, 20682314, 20914298, 21149854, 21374461, 21573339, 21730116, 21826906, 21847623, 21781163, 21621243, 21364695, 21011585, 20566627, 20039296, 19442505, 18791647, 18103995, 17397137, 16686949, 15986870, 15308370, 14661016, 14051874, 13485492, 12964663, 12490784, 12063491, 11680785, 11340168, 11039752, 10778334, 10554753, 10367538, 10215171, 10096504, 10010768, 9957146, 9934667, 9942815, 9982077, 10053331, 10156538, 10290537, 10454401, 10648403, 10872949, 11126780, 11406846, 11709918, 12033616, 12375542, 12731638, 13095479, 13458501, 13810449, 14139971, 14435571, 14686401, 14882162]
59397A4882162J30638N6694k2536j02033j77619k47113l09279l62516m05141m36414
59387A3006843m56762m67329m69716m65686m56369m42077m23385m01996l79709
59378I043814l56991l33429l09409k86155k64133k42653k21422k01438j83605
59369F644579j67223j50700j33467j16529j01135q7364p4273o1263m8854l7872
59359E665899k8193j9060j0403k791M249J2370K2122L1947M0509M8548N6495O1734
59347E883426O0946N5000M9063M7682N1821O0644P3412Q8733J04551J20298J37264
59336F732840J55471J71934J83725J91680J99727K11433K28367K50768K78282
59327H604227L10278L46199L85403M26787M69551N14414N62709O14175O67263
$$ y = [14882162, 15012800, 15069494, 15046958, 14944925, 14767306, 14520193, 14210914, 13848398, 13443257, 13006843, 12550081, 12082752, 11613036, 11147350, 10690981, 10248904, 9825519, 9423523, 9043814, 8686823, 8353394, 8043985, 7757830, 7493697, 7251044, 7029622, 6828184, 6644579, 6477356, 6326656, 6193189, 6076660, 5975525, 5888161, 5813888, 5752625, 5703771, 5665899, 5637706, 5618646, 5608243, 5605452, 5609701, 5622071, 5644193, 5676140, 5716649, 5765197, 5821692, 5883426, 5944372, 5999372, 6048435, 6096117, 6147938, 6208582, 6281994, 6370727, 6475278, 6595576, 6732840, 6888311, 7060245, 7243970, 7435650, 7635377, 7846810, 8075177, 8325945, 8604227, 8914505, 9260704, 9646107, 10072894, 10542445, 11056859, 11619568, 12233743, 12901006]
59318A2901006P21703P78586Q37174Q93841R45056R89022J023152J042509J043077
59309B1175126J024881R90278R40996Q78988Q08186P32905O55717N78768N05334
59300B8291179M37332L72833L08829K45258J83181J20221N1483k5156j07784j94089
59290B9683287k82775l71040m54062n28121n92045o45254o87268p19928p47203
59281B4655591p71275p90724q03530q09691q09861q03761p91365p73769p51421
59272A7550194p23307o89274o51539o12350n71779n29540m87380m47557m09871
59263A2427597l72413l34701k98276k64351k32616k02320j73211j45407j19475
59254A0284827r6726p8163o2930m8874l4922k2049j1579l605K322N813O078L393
$$ y = [12901006, 13622709, 14401295, 15238469, 16132310, 17077366, 18066388, 19089540, 20132049, 21175126, 22200007, 23190285, 24131281, 25010269, 25818455, 26551360, 27207077, 27785845, 28291179, 28728511, 29101344, 29410173, 29655431, 29838612, 29958833, 30010316, 29985160, 29877376, 29683287, 29400512, 29029472, 28575410, 28047289, 27455244, 26809990, 26122722, 25402794, 24655591, 23884316, 23093592, 22290062, 21480371, 20670510, 19866749, 19075384, 18301615, 17550194, 16826887, 16137613, 15486074, 14873724, 14301945, 13772405, 13285025, 12837468, 12427597, 12055184, 11720483, 11422207, 11157856, 10925240, 10722920, 10549709, 10404302, 10284827, 10188101, 10109938, 10047008, 9998134, 9963212, 9941163, 9929584, 9925979, 9928301, 9934114, 9940192, 9943585]
59242I943585j093p085j5451k6038l6364m3789m8441n2332n5799n6767n3987m8793
59230I497646m2487l3911k1561o615Q467K3624M0926O0923Q1638J01620J21716
59219I831986J43042J64919J85844K05069K22290K36847K48172K56123K60146
59210A1754438K58894K51250K36940K15583J86219J48631J04577N7034Q911l6938
59200A3185539p7390j10029j34451j52028j64477j72906j77921j80088j80323
59191A1835926j79830j79316j78329j75859j71794j67140j62525j57138j49708
59182A0314287j40098j29183j17232j03107q5525o4837m2891k0848K404K8956
59172I641926N9335R2136J26118J61515J98883K38001K78670L21444L66404M12034
$$ y = [9943585, 9942492, 9935407, 9919956, 9893918, 9857554, 9813765, 9765324, 9712992, 9657193, 9600426, 9546439, 9497646, 9455159, 9421248, 9399687, 9393072, 9401539, 9425163, 9466089, 9527012, 9608650, 9710270, 9831986, 9975028, 10139947, 10325791, 10530860, 10753150, 10989997, 11238169, 11494292, 11754438, 12013332, 12264582, 12501522, 12717105, 12903324, 13051955, 13156532, 13213566, 13222477, 13185539, 13108149, 12998120, 12863669, 12711641, 12547164, 12374258, 12196337, 12016249, 11835926, 11656096, 11476780, 11298451, 11122592, 10950798, 10783658, 10621133, 10463995, 10314287, 10174189, 10045006, 9927774, 9824667, 9739142, 9674305, 9631414, 9610566, 9612970, 9641926, 9701261, 9793397, 9919515, 10081030, 10279913, 10517914, 10796584, 11118028, 11484432, 11896466]
59162A1896466M56490M99321N40417N77601O06336O21747O20142N99221N58061
59153A6975802M96942M16573L18060K04358Q0677m7731j77284l04143m21728n22517
59143A7019009o02218o60606o98702p17320p18287p04823o80016o46290o06574
59134A0984173n64246n21548m79399m38909m01420l66772l33385l00733k70292
59125G307469k43412k19600j97482j76363j56367j38123j22530j09698r8002q5585
59115E760307p2787o1521n2239m3280l3475k3540j4312n469L403J2145K1036L0692
59103E520960M0295M7839N2965N7790O3974P0851P7385Q3967R0734R6030R8427
59092F301217R8864R8956R8161R4572Q7776P9222P0072O0148M8794L5719K1266
$$ y = [11896466, 12352956, 12852277, 13392694, 13970295, 14576631, 15198378, 15818520, 16417741, 16975802, 17472744, 17889317, 18207377, 18411735, 18492412, 18444681, 18267397, 17963254, 17541526, 17019009, 16416791, 15756185, 15057483, 14340163, 13621876, 12917053, 12237037, 11590747, 10984173, 10419927, 9898379, 9418980, 8980071, 8578651, 8211879, 7878494, 7577761, 7307469, 7064057, 6844457, 6646975, 6470612, 6314245, 6176122, 6053592, 5943894, 5845892, 5760307, 5687520, 5625999, 5573760, 5530480, 5497005, 5473465, 5459153, 5453684, 5457087, 5469232, 5490268, 5520960, 5561255, 5609094, 5662059, 5719849, 5783823, 5854674, 5932059, 6016026, 6106760, 6202790, 6301217, 6400081, 6499037, 6597198, 6691770, 6779546, 6858768, 6928840, 6988988, 7037782, 7073501, 7094767]
59081G094767O650o324j6631k4781l1751l7690m2070m4460m4643m2574l8615l3158
59069F738720k5837j5982m011Q706K1512L4867M8985O3573P9040R6180J14198
59058G159951J31011J46204J61879J79581J98236K16319K34165K52720K71557
59049H951623K89692L07040L23588L38402L50845L61467L70307L75592L75418
59040A2043974L69222L56185L33806K99963K54987K00013J34819N9674k1858j04302
59030A3926483j83660k57434l22557l76136m17920m49506m71185m81858m82118
59021A0484109m75050m63608m48946m31501m11916l90559l67707l44485l22245
59012F828092l01031k80117k60019k42144k26349k10814j94924j80437j68921
$$ y = [7094767, 7101417, 7095093, 7078462, 7053681, 7021930, 6984240, 6942170, 6897710, 6853067, 6810493, 6771878, 6738720, 6712883, 6696901, 6692890, 6701596, 6723108, 6757975, 6806960, 6870533, 6949573, 7045753, 7159951, 7290962, 7437166, 7599045, 7778626, 7976862, 8193181, 8427346, 8680066, 8951623, 9241315, 9548355, 9871943, 10210345, 10561190, 10922657, 11292964, 11668556, 12043974, 12413196, 12769381, 13103187, 13403150, 13658137, 13858150, 13992969, 14052643, 14030785, 13926483, 13742823, 13485389, 13162832, 12786696, 12368776, 11919270, 11448085, 10966227, 10484109, 10009059, 9545451, 9096505, 8665004, 8253088, 7862529, 7494822, 7150337, 6828092, 6527061, 6246944, 5986925, 5744781, 5518432, 5307618, 5112694, 4932257, 4763336]
59003D763336j59459j49955j39596j29042j19111j10173j02335r5292q8264q0828
58993C589281p3700o8263o5187o3632o1859n8754n4803n1352m8925m6852m4600
58982B951354m2718m1787m1154l9563l6705l3447l0754k8778k6772k3505j8389
58971B587782j2547q041n498l242M16M896Q248R678J0047J0241J0198R482P964
58958B629624N926L946K632K079J868J771J981K496K946L367M303N878P599R225
58944B685641J0780J1605J0896R506R371J0470J0337P682M499K944K132J03k595
58931B773371l712k760j283l23L74J086K072M276Q139J2091J4180J4836J6058
58918B838405J8324K0419K2070K4356K7311K9324K9654K9623L0685L2819L5517
$$ y = [4763336, 4603877, 4453922, 4314326, 4185284, 4066173, 3956000, 3853665, 3758373, 3670109, 3589281, 3515581, 3447318, 3382131, 3318499, 3256640, 3197886, 3143083, 3091731, 3042806, 2995954, 2951354, 2908636, 2866849, 2825695, 2786132, 2749427, 2715980, 2685226, 2656448, 2629676, 2606171, 2587782, 2575235, 2567194, 2561696, 2558454, 2558870, 2563766, 2572014, 2581692, 2591739, 2601980, 2612178, 2621660, 2629624, 2635550, 2639496, 2642128, 2644207, 2646075, 2647846, 2649827, 2652323, 2655269, 2658636, 2662939, 2668817, 2676416, 2685641, 2696421, 2708026, 2718922, 2728428, 2737799, 2748269, 2758606, 2766288, 2770787, 2773731, 2775863, 2775966, 2773371, 2769659, 2766899, 2765616, 2765293, 2765667, 2766753, 2768825, 2773101, 2781240, 2793331, 2807511, 2822347, 2838405, 2856729, 2877148, 2899218, 2923574, 2950885, 2980209, 3009863, 3039486, 3070171, 3102990, 3138507]
58907C138507L8881M2954M7036N0478N3318N5740N7594N8951O0404O2455O5003
58896C731321O7630P0129P2784P6271Q0921Q5838Q9527R1880R4703R9640J06529
58885D667173J14511J23533J33525J43306J51901J60328J70435J82484J95220
58876F042416K07890K20905K34974K50825K69191K89850L11234L32175L53376
58867H512836L76128M00635M26952M56296M89603N25807N63480O03290O46726
58858A3001753O93179P40522P88127Q37145Q88186R40644R93724J045955J094131
58849B1023366J134908J167114J190207J200929J193866J165037J112437J033436
58841C0221300R24736P85606O19156M30393K25511J3176j96442l95004n76893
$$ y = [3138507, 3177388, 3220342, 3267378, 3317856, 3371174, 3426914, 3484508, 3543459, 3603863, 3666318, 3731321, 3798951, 3869080, 3941864, 4018135, 4099056, 4184894, 4274421, 4366301, 4461004, 4560644, 4667173, 4781684, 4905217, 5038742, 5182048, 5333949, 5494277, 5664712, 5847196, 6042416, 6250306, 6471211, 6706185, 6957010, 7226201, 7516051, 7827285, 8159460, 8512836, 8888964, 9289599, 9716551, 10172847, 10662450, 11188257, 11751737, 12355027, 13001753, 13694932, 14435454, 15223581, 16060726, 16948912, 17889556, 18883280, 19929235, 21023366, 22158274, 23325388, 24515595, 25716524, 26910390, 28075427, 29187864, 30221300, 31146036, 31931642, 32550798, 32981191, 33206702, 33219878, 33023436, 32628432, 32051539]
58832C2051539p36916q69995r73970j050390j101655j129233j135296j123831
58824B3930253j098994j063868j021223r73651r22450q68368q13899p62719p16134
58815A5688947o72174o29031n87493n49170n14279m82310m53112m26248m00644
58806A0974486l75669l51476l27916l04671k82624k63242k46188k29424k11956
58797H381320j94497j77231j59368j41540j26014j13398j01353q7821p3445n9672
58787G146981m6559l3724k1519r794K768J6855L1527M6095O1191P7010R2352J06675
58775G469858J21221J36920J52934J68619J85123K03535K23052K42431K61881
58766I165574K82225L03685L26605L51942L79767M08966M39439M72913N10310
$$ y = [32051539, 31314623, 30444628, 29470658, 28420268, 27318613, 26189380, 25054084, 23930253, 22831259, 21767391, 20746168, 19772517, 18850067, 17981699, 17167800, 16405081, 15688947, 15016773, 14387742, 13800249, 13251079, 12736800, 12254490, 11801378, 11375130, 10974486, 10598817, 10247341, 9919425, 9614754, 9332130, 9068888, 8822700, 8593276, 8381320, 8186823, 8009592, 7850224, 7708684, 7582670, 7469272, 7367919, 7280098, 7206653, 7146981, 7100422, 7066698, 7045179, 7035385, 7038153, 7055008, 7086535, 7132630, 7193821, 7270831, 7363183, 7469858, 7591079, 7727999, 7880933, 8049552, 8234675, 8438210, 8661262, 8903693, 9165574, 9447799, 9751484, 10078089, 10430031, 10809798, 11218764, 11658203, 12131116, 12641426]
58757A2641426N50267N91645O35553O83095P32977P83387Q34741Q88325R43205
58748A9284621R96391J045125J087313J120546J142312J150343J141327J110150
58740B8078128J051983R64593Q47778P01995N29339L35215J27577q5013k93849
58731C2257746m90099o66201q17309r40977j036394j104453j147237j166722j165113
58722B3723241j146775j117526j080923j037127r86760r33641q81832q31838p82044
58713A4924775p32627o85861o43454o05529n71531n40417n10607m81205m52797
58704I700747m26016m00320l75224l51446l29578l08874k88694k69738k52512
58695F698345k35983k19344k03657j90068j77714j65193j52900j42130j32945
$$ y = [12641426, 13191693, 13783338, 14418891, 15101986, 15834963, 16618350, 17453091, 18341416, 19284621, 20281012, 21326137, 22413450, 23533996, 24676308, 25826651, 26967978, 28078128, 29130111, 30094704, 30942482, 31644477, 32173816, 32509031, 32636608, 32551595, 32257746, 31767647, 31101446, 30284137, 29343160, 28306766, 27202313, 26055076, 24888354, 23723241, 22576466, 21458940, 20378017, 19340890, 18354130, 17420489, 16538657, 15706819, 14924775, 14192148, 13506287, 12862833, 12257304, 11685773, 11145356, 10634749, 10153544, 9700747, 9274731, 8874411, 8499187, 8147741, 7818163, 7509289, 7220595, 6950857, 6698345, 6462362, 6243018, 6039361, 5849293, 5671579, 5506386, 5353486, 5211356, 5078411]
58686E078411j24627j17107j10276j03174r5512q8778q4069q0227p5877p1803
58676D126961o9251o7351o4656o1894o0638o0278n9108n7592n7737n9508o0586
58665C448362n9769n8324n7682n7780n7926n7798n7449n7419n8652o1051o2834
58654B801678o2489o0661n8816n7056n4792n2500n0937m9587m7658m5770m4757
58643B216655m3852m2026m0071l9113l7981l4712k9956k6391k5052k4693k4440
58632A848368k4592k4855k4218k2624k0710j8066j3883r325o875p064p894p698
58620A660564o628n177l309j492p60j335k490l891n499o355n268k909j435j740
58606A612276k531k347j121L74J459J762J501J400J480P91o76j016J030L775M800
$$ y = [5078411, 4953784, 4836677, 4726401, 4623227, 4527715, 4438937, 4354868, 4274641, 4198764, 4126961, 4057710, 3990359, 3925703, 3863809, 3803171, 3742893, 3683785, 3626193, 3568456, 3508948, 3448362, 3388593, 3330269, 3272587, 3214807, 3156881, 3099083, 3041634, 2984215, 2925563, 2864512, 2801678, 2739189, 2678528, 2619712, 2562656, 2507864, 2455364, 2404427, 2354840, 2307182, 2261412, 2216655, 2172803, 2130777, 2090706, 2051593, 2013612, 1978900, 1948944, 1922553, 1897501, 1872808, 1848368, 1823776, 1798921, 1774703, 1752079, 1731369, 1713303, 1699420, 1690095, 1683220, 1676156, 1668262, 1660564, 1653936, 1648759, 1645450, 1643958, 1643198, 1641863, 1639373, 1635482, 1629983, 1623628, 1618360, 1615451, 1614016, 1612276, 1609745, 1607398, 1606277, 1606651, 1608110, 1609872, 1611373, 1612773, 1614253, 1615044, 1614368, 1613352, 1614382, 1618157, 1622957]
58591A622957M418M706O153P837J0072J3883J8172K0506K0903K1977K5059K8770
58579A805413L1871L4796L7730L9829M1326M4096M9123N5256O1248O7154P3008
58568B340850P8201Q3095Q9313R7471J06353J15183J24919J36316J48479J60500
58558C480680J73056J87213K02872K19402K36703K54577K72123K88696L04661
58549E619983L20262L34412L45112L50261L47531L34403L09150K71628K22883
58540H455625J64523R8777K8753m1634j08074j66867k16066k55351k84489l02967
58530G372230l11612l13088l09581l01219k88200k72946k58023k43022k25884
58521D848655k06652j87577j69919j53121j37106j23028j11417j01578r3060q5958
$$ y = [1622957, 1627375, 1632081, 1638234, 1646071, 1656143, 1670026, 1688198, 1708704, 1729607, 1751584, 1776643, 1805413, 1837284, 1872080, 1909810, 1949639, 1990965, 2035061, 2084184, 2139440, 2200688, 2267842, 2340850, 2419051, 2502146, 2591459, 2688930, 2795283, 2910466, 3035385, 3171701, 3320180, 3480680, 3653736, 3840949, 4043821, 4263223, 4499926, 4754503, 5026626, 5315322, 5619983, 5940245, 6274657, 6619769, 6970030, 7317561, 7651964, 7961114, 8232742, 8455625, 8620148, 8718925, 8747678, 8706044, 8597970, 8431103, 8215037, 7959686, 7675197, 7372230, 7060618, 6747530, 6437949, 6136730, 5848530, 5575584, 5317561, 5074539, 4848655, 4642003, 4454426, 4284507, 4131386, 3994280, 3871252, 3759835, 3658257, 3565197, 3479239]
58511C479239p9707p3297o6927o1763n8021n4753n1469m8412m5586m3130m2239
58500B853935m3767m6237m7277m6909m7326m9512n2052n3321n3004n1446m9232
58489B313852m7264m5632m2931l8452l4268l2848l3361l2794l0150k6849k3647
58478A925656k0274j7801j7978k0018k1104k0568k0538k2107k3893k5008k6216
58467A690151k7320k6486k3401k0487j9692k0475k1775k3488k4947k4552k2127
58456A435401j9464j7550j5627j3720j3390j4710j5090j2787r471p702p712p989
58444A280189p389n430k172J110K601K257J897K524L277L492L820M635N335N870
58430A302016O974Q315Q528P592P069P431P391O492N881N852N069L158J747J861
$$ y = [3479239, 3399532, 3326235, 3259308, 3197545, 3139524, 3084771, 3033302, 2984890, 2939304, 2896174, 2853935, 2810168, 2763931, 2716654, 2669745, 2622419, 2572907, 2520855, 2467534, 2414530, 2363084, 2313852, 2266588, 2220956, 2178025, 2139573, 2105305, 2072457, 2039096, 2006302, 1976152, 1949303, 1925656, 1905382, 1887581, 1869603, 1849585, 1828481, 1807913, 1787375, 1765268, 1741375, 1716367, 1690151, 1662831, 1636345, 1612944, 1592457, 1572765, 1552290, 1530515, 1507027, 1482080, 1457528, 1435401, 1415937, 1398387, 1382760, 1369040, 1355650, 1340940, 1325850, 1313063, 1303592, 1295890, 1288178, 1280189, 1272800, 1267370, 1265198, 1266308, 1268909, 1271166, 1273063, 1275587, 1278864, 1282356, 1286176, 1290811, 1296146, 1302016, 1308990, 1317305, 1325833, 1333425, 1340494, 1347925, 1355316, 1361808, 1367689, 1373541, 1378610, 1381768, 1383515, 1385376]
58416A385376K437K308J579L11j987m802o671p441q350r496r765r537j0668j3106
58402A310188j4456j3704j2532j2044j1166r337p882p430o771n419m565m447l533
58389A196902j533l20o51r11l28m14j692k106l38K103L767N420P682R353R814
58374A226748J0543J2405J3925J3749J2567J1219R460P645O932O717M852J533
58362A338295k13Q69K539L180M025N770O793O512O853Q356Q573O524M993O008
58348A409077P598P610P286Q302R594R814R882J0506J0194Q167O056M499J513
58335A510098l273o492n969m236m320n460n813n825n952m658j763k49j491k322
58321A452275l0L341M948N566O477O068L448J728L322N557N191L905M792O697
$$ y = [1385376, 1387813, 1390121, 1391700, 1392011, 1390024, 1385222, 1378551, 1371110, 1362760, 1353264, 1343499, 1333962, 1323294, 1310188, 1295732, 1282028, 1269496, 1257452, 1246286, 1236949, 1229067, 1221637, 1214866, 1209447, 1204882, 1200435, 1196902, 1195369, 1195049, 1194398, 1193487, 1193159, 1192745, 1191053, 1188947, 1188609, 1190712, 1194479, 1199899, 1207581, 1216934, 1226748, 1237291, 1249696, 1263621, 1277370, 1289937, 1301156, 1310616, 1318261, 1325193, 1331910, 1336762, 1338295, 1338082, 1338951, 1341490, 1344670, 1348695, 1354465, 1361258, 1367770, 1374623, 1382979, 1391552, 1398076, 1403069, 1409077, 1416675, 1424285, 1431571, 1439873, 1449467, 1459281, 1469163, 1479669, 1489863, 1498030, 1504086, 1508585, 1510098, 1506825, 1500333, 1494364, 1490128, 1485808, 1480348, 1474535, 1468710, 1462758, 1458100, 1456337, 1456088, 1454597, 1452275, 1452245, 1455586, 1460534, 1466100, 1472577, 1478645, 1482093, 1483821, 1487143, 1492700, 1497891, 1501796, 1506588, 1513285]
58307A513285O797N899O570Q493R983J1563J3912J5011J3520J2110J3376J5302
58295A645821J5050J4079J5061J6859J7131J6953J8091J8763J6999J5121J5791
58284A825719J6521J3516Q262N001M030K832J447J442J749P09Q3K171N358P319
58270A896159R709J4571J9147J9915J8945K0372K3388K4646K4935K7098K9784
58259B128669K9693K7956K8037K9341K9097K8347K9792L1925L1734L0923L2850
58248B458364L5469L4317L0442K8294K7615K4676K0054J7841J8348J8646J9128
58237B733194K2496K7389K9975L0720L2907L5881L6811L7431M1617M7591N0086
58226C126098M9148M9339N1404N2264N2297N4793N8973O1030O1492O4176O8776
$$ y = [1513285, 1520082, 1525981, 1532551, 1541044, 1551027, 1562590, 1576502, 1591513, 1605033, 1617143, 1630519, 1645821, 1660871, 1674950, 1690011, 1706870, 1724001, 1740954, 1759045, 1777808, 1794807, 1809928, 1825719, 1842240, 1855756, 1864018, 1869019, 1873049, 1875881, 1877328, 1878770, 1880519, 1881228, 1881311, 1883482, 1888840, 1896159, 1905868, 1920439, 1939586, 1959501, 1978446, 1998818, 2022206, 2046852, 2071787, 2098885, 2128669, 2158362, 2186318, 2214355, 2243696, 2272793, 2301140, 2330932, 2362857, 2394591, 2425514, 2458364, 2493833, 2528150, 2558592, 2586886, 2614501, 2639177, 2659231, 2677072, 2695420, 2714066, 2733194, 2755690, 2783079, 2813054, 2843774, 2876681, 2912562, 2949373, 2986804, 3028421, 3076012, 3126098, 3175246, 3224585, 3275989, 3328253, 3380550, 3435343, 3494316, 3555346, 3616838, 3681014, 3749790]
58215C749790P1704P3341P7095Q2461Q6216Q9129R4108R9382J01091J00801J02782
58204D727900J06024J06891J07187J11091J16676J19299J20808J26223J34133
58195E776232J39771J44653J53207J63148J69589J75391J86409J99962K09599
58186G317961K17668K30850K46866K58715K68569K83841L02913L19321L36483
58177I783187L62893L95804M25744M54366M91095N35061N78096O22819O78915
58168A4327980P43500Q04742Q63386R30820J007589J084630J163993J256002J357045
58159B3539687J453220J545112J645571J755141J865382J984068K128192K292993
58151C8209366K458587K627621K824902L059735L322378L617559L965201M368646
$$ y = [3749790, 3821494, 3894835, 3971930, 4054391, 4140607, 4229736, 4323844, 4423226, 4524317, 4625118, 4727900, 4833924, 4940815, 5048002, 5159093, 5275769, 5395068, 5515876, 5642099, 5776232, 5916003, 6060656, 6213863, 6377011, 6546600, 6721991, 6908400, 7108362, 7317961, 7535629, 7766479, 8013345, 8272060, 8540629, 8824470, 9127383, 9446704, 9783187, 10146080, 10541884, 10967628, 11421994, 11913089, 12448150, 13026246, 13649065, 14327980, 15071480, 15876222, 16739608, 17670428, 18678017, 19762647, 20926640, 22182642, 23539687, 24992907, 26538019, 28183590, 29938731, 31804113, 33788181, 35916373, 38209366, 40667953, 43295574, 46120476, 49180211, 52502589, 56120148, 60085349, 64453995]
58143F4453995M823011N355889O016445O823187P767188Q860570J0122824J1521248
58135A25744357J2992172J4523973J6153630J7905424J9849152K2214530K5284324
58128B54667562K9102761L3375871L7580255M0806172M1350839L7005714K6570666
58121E00459840J1394338m895751j8536935k7650426l2462033l4156675l3869781
58114C60282577l2434551l0430512k8166645k5736195k3202842k0688115j8288177
58107A81335540j6029112j3939939j2077376j0449773q999564p688347o528036
58100A05623393n512953m600553l777571l060691k404462j693944q66751L4542
58092H3741010R54287J842314K492040K479768J460089m36873k594464m338541
$$ y = [64453995, 69277006, 74632895, 80649340, 87472527, 95239715, 104100285, 114223109, 125744357, 138736529, 153260502, 169414132, 187319556, 207168708, 229383238, 254667562, 283770323, 317146194, 354726449, 395532621, 436883460, 473889174, 500459840, 511854178, 506958427, 488421492, 460771066, 428309033, 394152358, 360282577, 327848026, 297417514, 269250869, 243514674, 220311832, 199623717, 181335540, 165306428, 151366489, 139289113, 128839340, 119839776, 112151429, 105623393, 100110440, 95509887, 91732316, 88671625, 86267163, 84573219, 83706468, 83741010, 84695297, 86537611, 89029651, 91509419, 92969508, 92532635, 89938171, 85599630]
58084H5599630n354099n722279n681462n427669n076527m694356m313187l937808
58076D5392243l565327l201830k860558k551392k276631k034658j823932j642718
58068B5435197j487359j353865j240742j147284j069468j001525r41341q89632
58060A6303981q43786p98126p50915p05084o61256o16557n71587n31321m96874
58051A0328475m63474m29284l99175l76515l57991l40315l25562l15697l07731
58042G012731k98726k90387k84429k78146k68763k57959k48196k38385k26570
58033D621170k13411k00121j86408j72793j61340j51991j42090j31229j22365
58024C139422j16505j10808j03826r7810r3744q8906q1847p5338p1765o9621o6732
$$ y = [85599630, 80245531, 74523252, 68841790, 63414121, 58337594, 53643238, 49330051, 45392243, 41826916, 38625086, 35764528, 33213136, 30936505, 28901847, 27077915, 25435197, 23947838, 22593973, 21353231, 20205947, 19136479, 18134954, 17193613, 16303981, 15460195, 14662069, 13911154, 13206070, 12544814, 11928257, 11356670, 10825349, 10328475, 9865001, 9435717, 9036542, 8660027, 8302036, 7961721, 7636159, 7320462, 7012731, 6714005, 6423618, 6139189, 5861043, 5592280, 5334321, 5086125, 4847740, 4621170, 4407759, 4207638, 4021230, 3848437, 3687097, 3535106, 3393016, 3261787, 3139422, 3022917, 2912109, 2808283, 2710473, 2616729, 2527823, 2445976, 2370638, 2298873, 2229252, 2162520]
58013B162520o3199n9282n4361m9557m7273m6699m4268l9791l7270l8042l8377
58002A644401l5828l2779l1400l0089k7483k5287k4518k3438k1584k1251k2729
57991A348015k2729k0008j7802j8130j8460j6705j4704j3849j2105q535o198o978
57979A171812p941o321m069l861m457l658k317j891j452l29l79k408l793k805
57965A126131j821k984m209l034j027p56j365q58l9n66j568j507j051j231j353
57950A102762j432l705q756j3126j4025j3468j4491j6228j6339j5530j5746j6147
57938I53769j4732j2142j0427r771r492j0313j2526j3951j2831j0829j0105r510
57926H17140o882l166q55p3N87J046P15Q75K767M796M844L956M524O051O031M168
$$ y = [2162520, 2099321, 2040039, 1985678, 1936121, 1888848, 1842149, 1797881, 1758090, 1720820, 1682778, 1644401, 1608573, 1575794, 1544394, 1514305, 1486822, 1461535, 1437017, 1413579, 1391995, 1370744, 1348015, 1325286, 1305278, 1287476, 1269346, 1250886, 1234181, 1219477, 1205628, 1193523, 1184988, 1178790, 1171812, 1163871, 1157550, 1153481, 1149620, 1145163, 1141505, 1139188, 1137297, 1135845, 1135516, 1135137, 1132729, 1128936, 1126131, 1124310, 1121326, 1117117, 1114083, 1113056, 1112300, 1110935, 1110077, 1110038, 1109472, 1107904, 1106397, 1105346, 1104115, 1102762, 1101330, 1097625, 1088869, 1075743, 1061718, 1048250, 1033759, 1017531, 1001192, 985662, 969916, 953769, 939037, 926895, 916468, 906697, 897205, 886892, 874366, 860415, 847584, 836755, 826650, 817140, 810258, 807092, 806237, 806164, 806751, 807797, 808512, 809387, 812154, 816950, 821794, 825750, 830274, 836325, 842356, 846524]
57910H46524K521K069J874J211L15o41j477j718j696k678m493m929l156j597k413
57895H29716m297n098n377o553p616o744m737l813m078l894k747j288M37K519
57881G76430L935L904L397L510L586K698J450N69n84k355l561l784m728p354r888
57866G67225j0811j1333j2654j3462j2774j2306j2988j2155p940l712l684o291
57854F47115o502l246K30K252M085N864N875M451M433O957R927J1381J1563J1216
57840G15601J0398R477R112Q913P967O516N457M657L573K743K711K373N81j698
57826G88381k986l905n875q273r490r639r786r613q498p517p653p328m872k076
57812F90870j920l849m792l939k929k028J02L228N677P330R200J0477R549P471
$$ y = [846524, 849045, 851114, 852988, 854199, 854514, 853873, 852396, 850678, 848982, 846304, 841811, 836882, 833726, 832129, 829716, 825419, 820321, 814944, 808391, 800775, 794031, 789294, 785481, 781403, 777509, 774762, 773474, 773911, 776430, 780365, 784269, 787666, 791176, 794762, 797460, 798910, 799479, 798895, 796540, 792979, 789195, 784467, 777113, 767225, 756414, 745081, 732427, 718965, 706191, 693885, 680897, 668742, 660802, 657090, 653406, 647115, 640613, 637367, 637597, 639849, 643934, 649798, 655673, 660124, 664557, 671514, 681441, 692822, 704385, 715601, 725999, 735476, 744588, 753501, 761468, 767984, 773441, 778098, 781671, 784414, 787125, 789498, 790079, 788381, 785395, 781490, 775615, 767342, 757852, 748213, 738427, 728814, 720316, 712799, 705146, 697818, 692946, 690870, 688950, 685101, 680309, 676370, 673441, 671413, 671515, 674743, 680420, 687750, 696950, 707427, 716976, 724447]
57798G24447O826P379O622M426L181L252K375L3j596j692k004l077l112j761j502
57783G43797l698o431p681p801p595o736n489n292o208o332n003m203n410p359
57769F58559q213q001p645p552q016r286j0404r986q651q610j0410j2266j3009
57756E36510j3266j3278j2292j0680r973j0054r094p041o186p099p159m640j420
57743D24328J38M45R68J567J663K138M001O507Q278R204J0132J1634J3691J5244
57729E09938J4185R785M983L582M987N079K781J707L887N985M380M70k185l107
57715E66457l953m716m427m014n019o627o915o094n719n635m561k863k051k081
57701E01782j780j365j843k374j007J949L933L832L289L732M375M026L113K773
$$ y = [724447, 731273, 738652, 745274, 749700, 752881, 756133, 758508, 758541, 756945, 755253, 753249, 750172, 747060, 745299, 743797, 740099, 733668, 725987, 718186, 710591, 703855, 698366, 693074, 686866, 680534, 675531, 671328, 665918, 658559, 650346, 642345, 634700, 627148, 619132, 609846, 599442, 589456, 580805, 572195, 561785, 549519, 536510, 523244, 509966, 497674, 486994, 477021, 466967, 457873, 450832, 444646, 437547, 430388, 425748, 424328, 424466, 424911, 425879, 427446, 429109, 431247, 435248, 441755, 450033, 459237, 469369, 481003, 494694, 509938, 524123, 533908, 538891, 542473, 547460, 552539, 555320, 557027, 560914, 566899, 571279, 571749, 569564, 566457, 562504, 557788, 553361, 549347, 544328, 537701, 530786, 524692, 518973, 513338, 508777, 505914, 503863, 501782, 500002, 498637, 496794, 494420, 493413, 495362, 499295, 503127, 506416, 510148, 514523, 518549, 521662, 524435]
57687E24435L118L483L612L761M129M732N552O420O958O788N847M528L660L900
57673E90923N103O440P326P803Q071Q197Q345Q728R320J0151J1838J4858J8365
57660G15468K0661K0991K0039J8823J8183J9153K2327K6653L0172L2270L3953
57649I78693L5945L8023M0257M3040M5643M6745M7009M8961N3467N8374O1814
57638A497971O4884O9558P5675Q1850Q8062R5460J04243J13445J22515J32091
57628B445754J43297J56917J72699J89225K05159K20742K37131K54338K71328
57619D296590K87992L05011L21291L33581L39270L37436L26711L04789K71426
57610G124097K29593J82210J30385P6661K6799j5438n4004r7606j50730k09173
$$ y = [524435, 527553, 531036, 534648, 538409, 542538, 547270, 552822, 559242, 566200, 572988, 578835, 583363, 587023, 590923, 596026, 602466, 609792, 617595, 625666, 633863, 642208, 650936, 660256, 670407, 682245, 697103, 715468, 736129, 757120, 777159, 795982, 814165, 833318, 855645, 882298, 912470, 944740, 978693, 1014638, 1052661, 1092918, 1135958, 1181601, 1228346, 1275355, 1324316, 1377783, 1436157, 1497971, 1562855, 1632413, 1708088, 1789938, 1878000, 1973460, 2077703, 2191148, 2313663, 2445754, 2589051, 2745968, 2918667, 3107892, 3313051, 3533793, 3770924, 4025262, 4296590, 4584582, 4889593, 5210884, 5544465, 5883735, 6221171, 6547882, 6852671, 7124097, 7353690, 7535900, 7666285, 7742946, 7769745, 7754307, 7700303, 7602697, 7451967, 7242794]
57600G242794k63526l05033l29062l36010l29981l15614k95860k72741k48719
57591D546248k25884k04579j84093j63972j43901j23699j04705q9530p8698o9004
57581C158183n7152m3836l2021k2369j2871k401Q015J7531K6851L6932M7981N9849
57569C184692P2206Q4296R5780J07633J21098J36035J51400J66678J81749J95999
57559D497566K09017K21440K33474K43056K47041K43858K33439K15056J87036
57550F530983J48657J01113M6804j0965o7911j19972j64801k01571k29921k50105
57540E782311k63241k70004k69796k62622k51023k38453k26288k14008k01593
57531C585283j89688j77861j64954j51296j38775j28416j19438j10898j02740
$$ y = [7242794, 6979268, 6674235, 6345173, 6009163, 5679182, 5363568, 5067708, 4794967, 4546248, 4320364, 4115785, 3931692, 3767720, 3623819, 3500120, 3395415, 3305885, 3227187, 3158183, 3101031, 3057195, 3025174, 3002805, 2989934, 2987533, 2995548, 3013079, 3039930, 3076862, 3124843, 3184692, 3256898, 3341194, 3436974, 3544607, 3665705, 3801740, 3953140, 4119818, 4301567, 4497566, 4706583, 4928023, 5161497, 5404553, 5651594, 5895452, 6128891, 6343947, 6530983, 6679640, 6780753, 6827557, 6816592, 6748681, 6628709, 6463908, 6262337, 6032416, 5782311, 5519070, 5249066, 4979270, 4716648, 4465625, 4227172, 4000884, 3786876, 3585283, 3395595, 3217734, 3052780, 2901484, 2762709, 2634293, 2514855, 2403957, 2301217]
57522B301217r4955q7113p9264p2308o6950o2887n9152n4847m9792m4860m1170
57511A587919l8504l5438l1532k8107k5982k3907k0604j6891j4095j1698q550
57500A332611n300l302k055J05L210N851P696R626J1774J3562J5433J8348K1816
57487A429375K4470K6448K9057L2343L5246L7922M1596M6121N0056N3265N7127
57476A863026O2157O7772P4488Q3470R3609J01980J08173J15375J25874J38002
57466B833926J49097J59252J69995J80932J89738J94712J95622J92404J84027
57457D449705J68548J44188J11186P2684L2780o321m4109p9169j08887j32141
57447D608464j50064j63361j70851j71884j68428j63201j56868j48489j37957
$$ y = [2301217, 2206262, 2119149, 2039885, 1967577, 1900627, 1837740, 1778588, 1723741, 1673949, 1629089, 1587919, 1549415, 1513977, 1482445, 1454338, 1428356, 1404449, 1383845, 1366954, 1352859, 1341161, 1332611, 1327311, 1324009, 1321954, 1322059, 1325269, 1331120, 1338816, 1348442, 1360216, 1373778, 1389211, 1407559, 1429375, 1453845, 1480293, 1509350, 1541693, 1576939, 1614861, 1656457, 1702578, 1752634, 1805899, 1863026, 1925183, 1992955, 2067443, 2150913, 2244522, 2346502, 2454675, 2570050, 2695924, 2833926, 2983023, 3142275, 3312270, 3493202, 3682940, 3877652, 4073274, 4265678, 4449705, 4618253, 4762441, 4873627, 4946311, 4979091, 4972770, 4928661, 4849492, 4740605, 4608464, 4458400, 4295039, 4124188, 3952304, 3783876, 3620675, 3463807, 3315318, 3177361]
57438C177361j26765j16756j08622j01235r2329q0835o8616n8706n1754m5594
57428B326149l8492l0965k3979j7317j0713m839R3N270J1581J8235K4327L0538
57416B289888L7901M5837N2985N9407O6679P5973Q7038R8743J09784J19197J26964
57405C170396J34070J41573J49711J57848J64609J67991J66224J58875J46443
57396D557740J28661J04104P1935L3464q319n0171q9415j24109j52892j74628
57386D296370j88655j95737j98057j97246j93131j85508j76060j66780j57296
57377B637900j46133j34141j23969j16008j07729r7823q8387q1682p7037p2536
57367A592455o7871o3753o0004n5974n1844m8021m4119l9791l5681l2454k9721
$$ y = [3177361, 3050596, 2933840, 2825218, 2723983, 2631654, 2550819, 2482203, 2423497, 2371743, 2326149, 2287657, 2256692, 2232713, 2215396, 2204683, 2199844, 2199937, 2205207, 2216788, 2235023, 2259350, 2289888, 2327789, 2373626, 2426611, 2486018, 2552697, 2628670, 2715708, 2814451, 2924235, 3043432, 3170396, 3304466, 3446039, 3595750, 3753598, 3918207, 4086198, 4252422, 4411297, 4557740, 4686401, 4790505, 4862440, 4895904, 4887585, 4837414, 4747999, 4623890, 4470998, 4296370, 4107715, 3911978, 3713921, 3516675, 3323544, 3138036, 2961976, 2795196, 2637900, 2491767, 2357626, 2233657, 2117649, 2009920, 1912097, 1823710, 1742028, 1664991, 1592455, 1524584, 1460831, 1400827, 1344853, 1293009, 1244988, 1200869, 1161078, 1125397, 1092943, 1063222]
57356A063222k7020k5025k4568k5199k5668k5332k4206k2321j9825j7303j5284
57345H11471j3864j3054j2817j2553j1416r485p760o782o125n392m645l802k691
57332G01085j751j429r79O62K871L979L856L996M814N112M543M320M758M409K641
57317G42887Q81K04k54j301k117k001j767k117k360j950j522j188J35K572M381
57302G34483M567M313M602M704M426N294P656R195Q574P924R228J0694R853Q028
57288H33541Q214J0196J1338J1149J1472J2916J4408J5691J7078J7263J4747J1247
57276I89260J0277J2224J3984J3739J2953J3071J3368J3120J3217J4303J5519
57265A135035J6214J7008J8148J8715J8495J8878K0612K2269K2298K1367K1347
$$ y = [1063222, 1036202, 1011177, 986609, 961410, 935742, 910410, 886204, 863883, 844058, 826755, 811471, 797607, 784553, 771736, 759183, 747767, 738282, 730522, 723740, 717615, 712223, 707578, 703776, 701085, 699334, 697905, 696926, 697588, 700459, 704438, 708294, 712290, 717104, 722216, 726759, 731079, 735837, 740246, 742887, 743768, 743972, 743718, 742417, 740300, 738299, 736532, 734415, 732055, 730105, 728583, 727395, 727530, 730102, 734483, 739050, 743363, 747965, 752669, 757095, 762389, 770045, 779240, 787814, 795738, 804966, 815660, 825513, 833541, 841755, 851951, 863289, 874438, 885910, 898826, 913234, 928925, 946003, 963266, 978013, 989260, 999537, 1011761, 1025745, 1039484, 1052437, 1065508, 1078876, 1091996, 1105213, 1119516, 1135035, 1151249, 1168257, 1186405, 1205120, 1223615, 1242493, 1263105, 1285374, 1307672, 1329039, 1350386]
57254A350386K2703K4224K4786K4608K4799K6183K8401L0192L0790L0749L0899
57243A648720L1084L0838L0831L2313L5341L8819M2144M5519M8647N0586N1290
57232B086132N2065N3933N6466N8724O0591O2784O6044P0730P6560Q2479Q7124
57221B813632Q9692R0286Q9488Q7744Q5134Q1623P7621P4059P1271O7949O2064
57210C690563N2961M1780K9904J8105P199j946r423j5818k0474k2003k0988k0057
57198C729803k0372k0137j7748j4116j0348n479J284Q162J3154J7152K2106K7448
57186C730909L1125L3053L4690L5991L5671L4080L2938L2480L1417K9590K8129
57175D090073K7023K5225K3303K3475K6487L0637L4511L8537M3301M8269N2972
$$ y = [1350386, 1373089, 1397313, 1422099, 1446707, 1471506, 1497689, 1526090, 1556282, 1587072, 1617821, 1648720, 1679804, 1710642, 1741473, 1773786, 1809127, 1847946, 1890090, 1935609, 1984256, 2034842, 2086132, 2138197, 2192130, 2248596, 2307320, 2367911, 2430695, 2496739, 2567469, 2644029, 2726508, 2813632, 2903324, 2993610, 3083098, 3170842, 3255976, 3337599, 3415220, 3489279, 3560550, 3628499, 3690563, 3743524, 3785304, 3815208, 3833313, 3840512, 3838566, 3829143, 3813325, 3792851, 3770848, 3749860, 3729803, 3709431, 3689294, 3671546, 3657430, 3647082, 3641603, 3642887, 3651049, 3664203, 3681355, 3703461, 3730909, 3762034, 3795087, 3829777, 3865768, 3901439, 3935519, 3968457, 4000937, 4032354, 4061944, 4090073, 4117096, 4142321, 4165624, 4189099, 4215586, 4246223, 4280734, 4319271, 4362572, 4410841, 4463813]
57164D463813N7753O2505O6103O7866O8610O9621P1357P3450P5206P5902P5152
57153E227338P3013O9434O4250N8165N2650M7991M2639L5725K8997K4593K2060
57142E746855J9407J6345J4499J4971J7373K0938K5058K9106L2975L7161M1458
57131F016146M4706M6898M9918N4770N9826O3460O6415O9626P1902P2320P2667
57120F688654P4405P5373P3013O9180O7753O8640O8267O5189O1105N6688N0612
57109G418879M2919L5556K9194K2848J7019J3769J3218J3008J1692R931Q256O499
57097G642788N367N742O360N019J766j841o074j2308j9657k5905l1289l7662m4299
57084G488007m8652n0951n3974n8187o1437o3770o8319p6763q7556r8976j10199
$$ y = [4463813, 4521566, 4584071, 4650174, 4718040, 4786650, 4856271, 4927628, 5001078, 5076284, 5152186, 5227338, 5300351, 5369785, 5434035, 5492200, 5544850, 5592841, 5635480, 5671205, 5700202, 5724795, 5746855, 5766262, 5782607, 5797106, 5812077, 5829450, 5850388, 5875446, 5904552, 5937527, 5974688, 6016146, 6060852, 6107750, 6157668, 6212438, 6272264, 6335724, 6402139, 6471765, 6543667, 6615987, 6688654, 6763059, 6838432, 6911445, 6980625, 7048378, 7117018, 7185285, 7250474, 7311579, 7368267, 7418879, 7461798, 7497354, 7526548, 7549396, 7566415, 7580184, 7593402, 7606410, 7618102, 7628033, 7636289, 7642788, 7648155, 7653897, 7660257, 7665276, 7667042, 7665201, 7659127, 7646819, 7627162, 7601257, 7569968, 7532306, 7488007, 7439355, 7388404, 7334430, 7276243, 7214806, 7151036, 7082717, 7005954, 6918398, 6819422, 6709223]
57073F709223j19415j25059j29159j35437j43986j51708j57737j64121j71722
57064E410879j80492j93439k14779k43892k76446l11801l53804m04291m61822
57055B770113n27307o04407o93412A54173g41897j012804j142581j284014j438773
57046e620069j611996j805687k018053k249676k503495k778810l072994l389167
57038b5049947l734736m113838m530550m998408n536914o158674o863247p630029
57030f8616343q406101r128909r797927j0494979j1251177j1873654j1996569
57023a41565659j1399749j0265122r049861q095261p389254o677188n716186m409701
57015b04567981k798131j010125Q00486K545493M250508N985229P740716R392891
$$ y = [6709223, 6589808, 6464749, 6335590, 6200153, 6056167, 5904459, 5746722, 5582601, 5410879, 5230387, 5036948, 4822169, 4578277, 4301831, 3990030, 3636226, 3231935, 2770113, 2242806, 1638399, 944987, 154173, -741897, -1754701, -2897282, -4181296, -5620069, -7232065, -9037752, -11055805, -13305481, -15808976, -18587786, -21660780, -25049947, -28784683, -32898521, -37429071, -42427479, -47964393, -54123067, -60986314, -68616343, -77022444, -86151353, -95949280, -106444259, -117695436, -129569090, -141565659, -152965408, -163230530, -172280391, -180375652, -187764906, -194442094, -200158280, -204567981, -207366112, -208376237, -207575751, -205030258, -200779750, -194794521, -187053805, -177660914]
57007a77660914J0778895J1784720J2369382J2549019J2381163J1946272J1321007
57000i4530456J0564659R728105Q862462Q011999P205851O461429N789431N191850
56992c2714670M661575M189129L767385L389478L048305K740692K467416K226776
56984f223914K012083J816995g55647G21607J328186J189992J063573R49964Q48336
56975F101658P57712O77614O05920N39021M75606M17755L67145L22454K81675
56966A0546560K44779K12677J85107J60696J37884J15001R0505O3732L5050N663
56956A1797654k2137m5604o3978p9523r4722j09277j21529j31668j41316j50676
56946A0837224j58334j63567j66664j67123j63502j55344j44227j33393j26997
$$ y = [-177660914, -166882019, -155097299, -142727917, -130178898, -117797735, -105851463, -94530456, -83965797, -74237692, -65375230, -57363231, -50157380, -43695951, -37906520, -32714670, -28053095, -23863966, -20096581, -16707103, -13658798, -10918106, -8450690, -6223914, -4211831, -2394836, -755647, 721607, 2049793, 3239785, 4303358, 5253322, 6101658, 6859370, 7536984, 8142904, 8681925, 9157531, 9575286, 9942431, 10264885, 10546560, 10791339, 11004016, 11189123, 11349819, 11487703, 11602704, 11693209, 11756941, 11791991, 11797654, 11775517, 11729913, 11665935, 11586412, 11491690, 11382413, 11260884, 11129216, 10987900, 10837224, 10678890, 10515323, 10348659, 10181536, 10018034, 9862690, 9718463, 9585070, 9458073]
56937I458073j28189j36543j49707j70220k08204k72378l57602m44451n12015
56928G078764n49784n58689n45441n17915m82770m44047m03490l62512l23207
56919B890909k87489k56365k30047k07740j87573j68116j49817j33777j19669
56910A150316j06266r3407q1579p0126n8027m6182l6666k9592k2960j5765r035
56899E80711l411K003P632J2344J5147J6051J4521R238O28q217j4593j8660k1554
56886E91840k2780k1401j8524j6335j5099j3224j0235p731o867o484m613r70L089
56873D50666O561R852J3803J8420K2696K5122K4066J8318Q283l273j2535j7347
56861E64632j8587j8732j9442k0636k1396k1170k0331j9796k0032k0411j9834
$$ y = [9458073, 9329884, 9193341, 9043634, 8873414, 8665210, 8392832, 8035230, 7590779, 7078764, 6528980, 5970291, 5424850, 4906935, 4424165, 3980118, 3576628, 3214116, 2890909, 2603420, 2347055, 2117008, 1909268, 1721695, 1553579, 1403762, 1269985, 1150316, 1044050, 950643, 869064, 798938, 740911, 694729, 658063, 628471, 605511, 589746, 580711, 577300, 579303, 586935, 599279, 614426, 630477, 644998, 654236, 654864, 646647, 632054, 613394, 591840, 569060, 547659, 529135, 512800, 497701, 484477, 474242, 466511, 459644, 453160, 448547, 447577, 450666, 457227, 467079, 480882, 499302, 521998, 547120, 571186, 589504, 597787, 594514, 581979, 564632, 546045, 527313, 507871, 487235, 465839, 444669, 424338, 404542, 384510, 364099, 344265]
56850C44265j8137j6288j5110j4395j3653j2981j2622j2237j1259r613p605n486
56838A94879l630k598k362j814K51L742P413J0188J2013J3581J5703J8785K2561
56825B88712K6290K9211L0567K9490K5653K0202J5099J1167P548L615N17p1J831
56812D89831M382N906O447P436J0132J4255J8016J9917K0408K1179K2922K4808
56800F65639K6393K8717L2682L7054L8834L5290K5524J1117m108j5910k2248k3959
56788H35025k2806j9734j5329j0585o265k219J882N941J0229J5759K2836L0021
56776H44755L5737M0486M6540N5517O6536P5910P8255O9312M9208K2787l909k6988
56764A354146m4532n5110n8350n6175n1597m6159l9636l1879k3672j5847q703
$$ y = [344265, 326128, 309840, 294730, 280335, 266682, 253701, 241079, 228842, 217583, 207970, 200365, 194879, 191249, 188651, 186289, 184475, 184726, 188468, 195881, 206069, 218082, 231663, 247366, 266151, 288712, 315002, 344213, 374780, 404270, 429923, 450125, 465224, 476391, 483939, 487554, 488071, 488000, 489831, 494213, 500119, 506566, 514002, 524134, 538389, 556405, 576322, 596730, 617909, 640831, 665639, 692032, 720749, 753431, 790485, 829319, 864609, 890133, 901250, 897142, 881232, 858984, 835025, 812219, 792485, 777156, 766571, 760306, 758087, 759969, 765910, 776139, 791898, 814734, 844755, 880492, 920978, 967518, 1023035, 1089571, 1165481, 1243736, 1313048, 1362256, 1385043, 1381134, 1354146, 1309614, 1254504, 1196154, 1139979, 1088382, 1042223, 1002587, 970708, 947036, 931189, 922486]
56753I22486k355L303Q979J5478K2734L0050L7133M4065M9968N2257M7598L4088
56741A265784J3164j0337l0752m4902n3007n6619n6712n3892m9202m3806l8379
56730H41340l3266k8451k3193j6764j0002m789j354K510Q522J5549K1198K4495
56718G95795K5568K3830J8256Q943k741j5058k5929l3152l5989l6017l5272l4272
56706F53962l2746l1126k9779k7835k4515k0965j8902j7996j6281j2921r070o258
56694D05568n239n947p222p197n382l636l550l894k649o54n52k582m153l813k895
56679C46203k646k327j204j26J16J99O84P25k33r57k16J020Q27q60k211j942n43
56662C36509P43J094L12j177k401k556j792r26l62J81Q54J084K07j508k929l308
$$ y = [922486, 920131, 923434, 932413, 947891, 970625, 1000675, 1037808, 1081873, 1131841, 1184098, 1231696, 1265784, 1278948, 1268611, 1237859, 1192957, 1139950, 1083331, 1026619, 972727, 923525, 879719, 841340, 808074, 779623, 756430, 739666, 729664, 724875, 723521, 726031, 734553, 750102, 771300, 795795, 821363, 845193, 863449, 872392, 869651, 854593, 828664, 795512, 759523, 723506, 688234, 653962, 621216, 590090, 560311, 532476, 507961, 486996, 468094, 450098, 433817, 420896, 411826, 405568, 400329, 394382, 387160, 379963, 374581, 370945, 367395, 363501, 360852, 360198, 359646, 357064, 352911, 349098, 346203, 343557, 341230, 340026, 339900, 340016, 340215, 340899, 341624, 341391, 340434, 340218, 341238, 342065, 341205, 338994, 337052, 336509, 337252, 338346, 338658, 337481, 335080, 332524, 330732, 329806, 329444, 329625, 330479, 331563, 331770, 330262, 327333, 324025]
56646C24025l103l223l733l954l685l494l576l243k047o59n3l64j171k207l180
56631B86333l460k880k287k490l066k932j809l59P58J344J554J852K553L050K283
56616B80444N29m53J70R03K82o34J55K410M018M055L442K734J521K17K98J955
56600C02046L281K939K271L450O423R040R799R211Q491P918P074O140O013O927
56586C91023P622O679M396K449J619R73m42k241l610m501n199n707o376q043j0494
56571C68148j1885j0968r019p990p627o219l748k271l016m759n589n045l933k941
56557B83138k135j342o51m27q02j122n27P69J430P41m19p39J64J942M015N297
56541B89332M691K707J457J932K603J874O17O19J645J953J043Q1o2L80Q55Q12
$$ y = [324025, 320922, 317699, 313966, 310012, 306327, 302833, 299257, 296014, 293967, 293308, 293255, 292891, 291720, 289513, 286333, 282873, 279993, 277706, 275216, 272150, 269218, 267409, 267050, 267808, 269152, 270706, 272558, 275111, 278161, 280444, 280973, 280520, 280690, 281593, 281875, 281241, 281396, 283806, 287824, 291879, 295321, 298055, 299576, 299793, 300091, 302046, 305327, 308266, 310537, 313987, 320410, 329450, 339249, 348460, 356951, 364869, 371943, 378083, 384096, 391023, 398645, 405324, 409720, 412169, 413788, 414761, 414319, 412078, 408468, 403967, 398768, 393061, 386685, 378642, 368148, 356263, 345295, 336276, 328286, 320659, 314440, 310692, 308421, 305405, 300646, 295057, 290012, 286079, 283138, 281003, 279661, 279010, 278583, 277781, 276659, 276132, 276901, 278331, 279072, 278653, 277914, 278078, 280020, 284035, 289332, 294023, 296730, 298187, 300119, 302722, 304596, 305213, 305832, 307477, 309430, 310473, 310554, 310492, 310872, 311727, 312539]
56525C12539l27k258l350k408l56R33Q43Jr82j481o50J235K253J278j75k26N46
56508C07415N49K25J141L002M120M343M930N966O393O355P017Q204Q551P986P651
56493C83848P522O509M874M075M149L754K922L133M347M633L378K275K334K363
56479D40116J351J58k82n04j212k171l147m371n373n037l510k337k196k215k030
56464D07240k490l598l852k674j697k403m082n176n355n126m661m073l848m045
56450C54160l872k845j606j090j451k098k258j552o04o69j885k636j702j26M63
56435C30229L75R36K029K663L063L935M428L412J987J980K643J896L12M22K292
56420C62602L366K883K763L672L917L024K658L006K070j15l52K668N781N957M457
$$ y = [312539, 312212, 309954, 306604, 304196, 303840, 304773, 305616, 305617, 304635, 303154, 302504, 303739, 305992, 307270, 307095, 306869, 307415, 307964, 308189, 309330, 312332, 316452, 320795, 325725, 331691, 338084, 344439, 351456, 359660, 368211, 376197, 383848, 391370, 397879, 402753, 406828, 410977, 414731, 417653, 420786, 425133, 429766, 433144, 435419, 437753, 440116, 441467, 441625, 441343, 440839, 439627, 437456, 434309, 429938, 424565, 419528, 416018, 413681, 411485, 409270, 407240, 404750, 401152, 397300, 394626, 392929, 390526, 386444, 381268, 375913, 370787, 366126, 362053, 358205, 354160, 350288, 347443, 345837, 344747, 343296, 341198, 338940, 337388, 336784, 336115, 334230, 331594, 329892, 329766, 330229, 330604, 331540, 333569, 336232, 339295, 343230, 347658, 351070, 353057, 355037, 357680, 359576, 359888, 360310, 362602, 365968, 368851, 371614, 375286, 379203, 382227, 384885, 387891, 389961, 389846, 389494, 392162, 397943, 403900, 408357]
56405D08357M008M617M730M229L808L305K729L175M844N936N248L955L326K687
56391D64954J302J33N8K40j33m97o55j556k888k462J77K188J515L5J98J127O88
56374D64424p41j511j782k532l092k532k081l305m993m620k067N17J696J423k51
56359D38553k815m513m088k654k032k185k161k227k878k932j046J637K680J597
56345D14936m7j188j932k273k002j547j344j019m28n56j799k485r53J814L558
56330D02735L866L913L929L005J222QK22J262K124K323J898J255Q04L91l54j049
56314D27554r21k11J99N40J730L040K638R76R09L420N930O197N190M469L556J992
56298D67208J270K325L346K563J062M83J35r72j466J41K400L106K747K959L222
$$ y = [408357, 412365, 416982, 421712, 425941, 429749, 433054, 435783, 438958, 443802, 449738, 454986, 458941, 462267, 464954, 466256, 466389, 466447, 466687, 466554, 466057, 465402, 463846, 460958, 458496, 458673, 460861, 462376, 462411, 462609, 463736, 464424, 463683, 462172, 460390, 457858, 454766, 452234, 450153, 446848, 441855, 437235, 435168, 435685, 437381, 438804, 438553, 435738, 431225, 427137, 424483, 422451, 420266, 418105, 415878, 413000, 410068, 409022, 410659, 413339, 414936, 414889, 413701, 411769, 409496, 407494, 405947, 404603, 403584, 403156, 402600, 400801, 398316, 397363, 399177, 402735, 406601, 410514, 414443, 417448, 418670, 418678, 418900, 420162, 422286, 424609, 426507, 427762, 428566, 428957, 428603, 427554, 426633, 426422, 426621, 427161, 428891, 431931, 434569, 435545, 436454, 439874, 445804, 452001, 457191, 461660, 465216, 467208, 468478, 470803, 474149, 476712, 477774, 478257, 478392, 477420, 475954, 476095, 478495, 481601, 484348, 487307, 490529]
56283D90529K215R96J557L394M553M972N851O734O361N552O120P598Q046P541
56269E62019P850R095R791J0022J1484J4162J5652J4493J2040J0436J0261J0666
56257F97971J0728J0523J1344J4217J7808J9159J7362J4789J3578J2959J1597
56246H52035J0187R565Q377N282J868O28J359K038K053K147K453K856M092O248
56232I11188P589O999O129O912Q791J0581J2964J6508J9372K0096K0647K3446
56220A071222K7201K9195K9919L1892L5314L8584M1836M6203N0648N3321N5226
56209A510561N9004O4867P1162P7949Q6482R5936J04282J11770J20165J29373
56199B431551J38226J47667J59433J72337J83533J92761K01694K09885K15313
$$ y = [490529, 492744, 493740, 495297, 498691, 503244, 508216, 514067, 520801, 527162, 532714, 538834, 546432, 554478, 562019, 569869, 578964, 588755, 598777, 610261, 624423, 640075, 654568, 666608, 677044, 687305, 697971, 708699, 719222, 730566, 744783, 762591, 781750, 799112, 813901, 827479, 840438, 852035, 862222, 871787, 880164, 885446, 887314, 887942, 889301, 891339, 893392, 895539, 897992, 900848, 904940, 911188, 918777, 925776, 931905, 938817, 947608, 958189, 971153, 987661, 1007033, 1027129, 1047776, 1071222, 1098423, 1127618, 1157537, 1189429, 1224743, 1263327, 1305163, 1351366, 1402014, 1455335, 1510561, 1569565, 1634432, 1705594, 1783543, 1870025, 1965961, 2070243, 2182013, 2302178, 2431551, 2569777, 2717444, 2876877, 3049214, 3232747, 3425508, 3627202, 3837087, 4052400]
56190D052400K18246K20459K20920K16383K06113J92180J75151J53542J27678
56181E783072J00235P2584M4102J5429j1041l4225n4816p2570q6280r6405j04647
56170E555438j11079j14825j17178j20569j24707j27205j28061j29980j34259
56161D447575j39399j43836j47063j48419j47711j46496j45775j43529j37862
56152C147485j31093j26701j23640j18243j10713j04575j00292r4762q7225q0402
56142B069839p5298o9809o3319n7830n3762m9135m3932m0776m0222l9533l7099
56131A499124l4053l0832k6445k1884j9838j9911j8464j4356j0519q721p127m477
56119A282497k373j737q43J290L221M308O159R308J1758J2417J2938J4796J7208
$$ y = [4052400, 4270646, 4491105, 4712025, 4928408, 5134521, 5326701, 5501852, 5655394, 5783072, 5883307, 5955891, 5999993, 6015422, 6004381, 5970156, 5915340, 5842770, 5756490, 5660085, 5555438, 5444359, 5329534, 5212356, 5091787, 4967080, 4839875, 4711814, 4581834, 4447575, 4308176, 4164340, 4017277, 3868858, 3721147, 3574651, 3428876, 3285347, 3147485, 3016392, 2889691, 2766051, 2647808, 2537095, 2432520, 2332228, 2237466, 2150241, 2069839, 1994541, 1924732, 1861413, 1803583, 1749821, 1700686, 1656754, 1615978, 1575756, 1536223, 1499124, 1465071, 1434239, 1407794, 1385910, 1366072, 1346161, 1327697, 1313341, 1302822, 1294101, 1286974, 1282497, 1280124, 1278387, 1277544, 1278834, 1282055, 1286363, 1292522, 1301830, 1313588, 1326005, 1338943, 1353739, 1370947]
56106A370947J8966J9783J9336J7639J6428J7208J8251J6822J3815J2354J2407
56095A553956J1304R255R426J2322J4909J5919J7407K0529K4284K8871L5545M2796
56083A796523M7636N1142N7625O7651P7153Q4345R2158J02618J14148J25847J39217
56072B756063J53994J66922J76049J81564J81496J72020J53825J33241J15466
56063D190640J00997Q9522Q1743P5816O7222N4142L8706K2123L702j4569k8229
56052D681815l6800m4867n5683o8766q4403j04194j25824j43377j54405j61057
56042C702439j63468j58787j47956j36267j25299j11516r4822q1034p2943o6228
56032B544119n7444m9140m3628l8474l1968k6827k4763k3071j9988j7684j7042
$$ y = [1370947, 1389913, 1409696, 1429032, 1446671, 1463099, 1480307, 1498558, 1515380, 1529195, 1541549, 1553956, 1565260, 1574515, 1583941, 1596263, 1611172, 1627091, 1644498, 1665027, 1689311, 1718182, 1753727, 1796523, 1844159, 1895301, 1952926, 2020577, 2097730, 2182075, 2274233, 2376851, 2490999, 2616846, 2756063, 2910057, 3076979, 3253028, 3434592, 3616088, 3788108, 3941933, 4075174, 4190640, 4291637, 4381159, 4462902, 4538718, 4605940, 4660082, 4698788, 4720911, 4724613, 4710044, 4681815, 4645015, 4600148, 4544465, 4475699, 4391296, 4287102, 4161278, 4017901, 3863496, 3702439, 3538971, 3380184, 3232228, 3095961, 2970662, 2859146, 2764324, 2683290, 2610347, 2544119, 2486675, 2437535, 2393907, 2355433, 2323465, 2296638, 2271875, 2248804, 2228816, 2211132, 2194090]
56021B194090j5407j2286j1070j2337j1906q311n567n509m297K80M866P147R556
56008B129249J3210J5094J4525J5402J8718K0115J8094J7158J9460K1060K0056
55997B322141K0462K4220K7283K7541K8619L2058L4068L3755L5885M1356M4213
55986B671601M2349M1668M4945M6606M3870M2958M8083N4032N6094N7672O1680
55975C211558O4022O2474O2458O7279P2118P4142P8364Q6758R2441R2221R3870
55964D057705J02655J11587J13929J14643J19984J26197J28206J29480J33773
55955E138159J37043J36976J40207J50607J60876J65277J69791J80042J90732
55946F569710J97255K05886K21443K36844K46229K56372K73579K91823L05736
$$ y = [2194090, 2178683, 2166397, 2155327, 2142990, 2131084, 2122773, 2117206, 2111697, 2107400, 2107680, 2112546, 2119693, 2129249, 2142459, 2157553, 2172078, 2187480, 2206198, 2226313, 2244407, 2261565, 2281025, 2302085, 2322141, 2342603, 2366823, 2394106, 2421647, 2450266, 2482324, 2516392, 2550147, 2586032, 2627388, 2671601, 2713950, 2755618, 2800563, 2847169, 2891039, 2933997, 2982080, 3036112, 3092206, 3149878, 3211558, 3275580, 3338054, 3400512, 3467791, 3539909, 3614051, 3692415, 3779173, 3871614, 3963835, 4057705, 4160360, 4271947, 4385876, 4500519, 4620503, 4746700, 4874906, 5004386, 5138159, 5275202, 5412178, 5552385, 5702992, 5863868, 6029145, 6198936, 6378978, 6569710, 6766965, 6972851, 7194294, 7431138, 7677367, 7933739, 8207318, 8499141, 8804877]
55937H804877L22578L48665L77118M01974M31016M71112N14639N54301N97309
55928A2823589O50591P06711P59157Q16265Q84912R56719J025901J103089J194657
55919B0921591J287144J370246J455853J555468J660172J763493J881170K025032
55911C3920169K180675K336252K509460K719813K959824L221936L526516L893396
55903E7268041M316444M800325N389426O122274O990362P978846R105196J0374024
55895A12344938J1745974J3208939J4827333J6659334J8693436K0945797K3534989
55888B31960740K6545567K9891911L3396512L6742644L8954853L8036468L1839352
55881D67368047J9916547M510860j0604512k2405643k9891566l3627096l4651421
$$ y = [8804877, 9127455, 9476120, 9853238, 10255212, 10686228, 11157340, 11671979, 12226280, 12823589, 13474180, 14180891, 14940048, 15756313, 16641225, 17597944, 18623845, 19726934, 20921591, 22208735, 23578981, 25034834, 26590302, 28250474, 30013967, 31895137, 33920169, 36100844, 38437096, 40946556, 43666369, 46626193, 49848129, 53374645, 57268041, 61584485, 66384810, 71774236, 77896510, 84886872, 92865718, 101970914, 112344938, 124090912, 137299851, 152127184, 168786518, 187479954, 208425751, 231960740, 258506307, 288398218, 321794730, 358537374, 397492227, 435528695, 467368047, 487284594, 491795454, 481190942, 458785299, 428893733, 395266637, 360615216]
55874C60615216l3892707l2093240k9776567k7205463k4495636k1773683j9179630
55867A72198290j6789671j4630491j2738199j1136499r788388q630924p637657
55860I0846461o804414o103700n499806m985072m559027m192644l851333l534080
55852E1316385l255121l005480k765660k538526k337204k155254j978643j813634
55844C1466863j674709j557001j446160j343702j258397j184131j109481j038575
55836B0854707r80668r29601q74379q19767p76141p38915o97819o57049o26794
55827A3753574o03553n77457n50705n30632n12538m87221m58256m34884m14776
55818I183552l90197l64320l45341l30798l13260k95209k83323k74131k60198
$$ y = [360615216, 326722509, 294629269, 264852702, 237647239, 213151603, 191377920, 172198290, 155408619, 140778128, 128039929, 116903430, 107115042, 98484118, 90846461, 84042047, 77938347, 72438541, 67453469, 62894442, 58701798, 54850465, 51316385, 48061264, 45055784, 42290124, 39751598, 37414394, 35259140, 33280497, 31466863, 29792154, 28235153, 26788993, 25445291, 24186894, 23002763, 21893282, 20854707, 19874039, 18944438, 18070059, 17250292, 16474151, 15735236, 15037417, 14380368, 13753574, 13150021, 12572564, 12021859, 11491227, 10978689, 10491468, 10033212, 9598328, 9183552, 8793355, 8429035, 8083694, 7752896, 7439636, 7144427, 6861104, 6586973, 6326775]
55809F326775k44495k34224k26289k13431j99068j91569j88954j83487j76548
55800D468710j74888j76365j73197j65680j59635j53888j42983j28746j17046
55791C076282j06771r4090q3655q2932q8639r0959q8351q6344q4871p9175p0899
55780B119596o6161o4122n8710n0197m4251m1044l5924k9439k6425k6510k5374
55769A651439k4026k6851l1961l3328l1366l1728l4784l5835l4731l5562l7503
55758A293764l5526l0028k6691k6799k6267k4202k3932k5377k4540k1016j8460
55747A010926j7396j4679j0113o818n142k738j75j4j091k34J378J04l183m744
55733I46081n170p922j2011j3367j2488j3465j6229j6961j5497j5132j5750j4279
$$ y = [6326775, 6082280, 5848056, 5621767, 5408336, 5209268, 5017699, 4828745, 4645258, 4468710, 4293822, 4117457, 3944260, 3778580, 3618945, 3465057, 3322074, 3193328, 3076282, 2969511, 2875421, 2791766, 2708834, 2620195, 2529236, 2440885, 2354541, 2269670, 2190495, 2119596, 2053435, 1989313, 1930603, 1880406, 1836155, 1795111, 1759187, 1729748, 1703323, 1676813, 1651439, 1627413, 1600562, 1568601, 1535273, 1503907, 1472179, 1437395, 1401560, 1366829, 1331267, 1293764, 1258238, 1228210, 1201519, 1174720, 1148453, 1124251, 1100319, 1074942, 1050402, 1029386, 1010926, 993530, 978851, 968738, 961920, 956778, 954040, 953865, 953851, 952760, 952526, 953904, 954008, 950825, 946081, 940911, 932989, 920978, 907611, 895123, 881658, 865429, 848468, 832971, 817839, 802089, 787810]
55721G87810j1504j1242j2973j2329q713n699m299k630j817n043j0801j4110j4497
55708F72153j5891j8778j9554j7852j7177j7807j6198j2335j0609j2219j3382
55697E00351j2416j2012j3131j3122j1570j1747j4347j5693j4169j2840j3418
55686C55886j3004r339m739k288j925k220k760l226l167l401m756n551l639m32
55672B95439R34O63J258K423J779o0l70K61j203m276n369m151l811m749l864p96
55656B74108Q87j73j233q32q15j808j725j46O20K5K79J737K076J108J615M220
55640B79943O003N392L963K483n5k592k207O13J832L27m69J283L058L064L113
55625C05751M422N249M835N234O965P080L884k08k543l293l060j426L44o71m309
$$ y = [787810, 776306, 765064, 752091, 739762, 731049, 725350, 721051, 718421, 716604, 711561, 700760, 686650, 672153, 656262, 637484, 617930, 600078, 582901, 565094, 548896, 536561, 525952, 513733, 500351, 487935, 475923, 462792, 449670, 438100, 426353, 412006, 396313, 382144, 369304, 355886, 342882, 333543, 328804, 326516, 324591, 322371, 319611, 316385, 313218, 309817, 305061, 299510, 295871, 295439, 296373, 297036, 298294, 300717, 302496, 302436, 302066, 302327, 301124, 296848, 291479, 287328, 283517, 278768, 274904, 274108, 274995, 274822, 273589, 272757, 271942, 270134, 268409, 268263, 268883, 268908, 269187, 270924, 273000, 274108, 275723, 279943, 285946, 291338, 295301, 297784, 297729, 295137, 292930, 293543, 295375, 295702, 295233, 296516, 299574, 302638, 305751, 310173, 315422, 320257, 325491, 332456, 339536, 343420, 343212, 340669, 337376, 334316, 332890, 333234, 332563, 328254]
55610C28254o467m926k268j189r15l38o52k445l708l166k337k149q85K257M817
55595C03883M687L234K714L184L830M692N358M493K179J72j134l184n895p120
55581C21093o515o323p170o890m951m141n881p590o923n289m957n735o556p460
55567B34712q052o913m413l336m926p031p624p340p094o268m714l659l199j976
55553A58167k97k56j620j484P58K098J004l13m18r78k578k777q77j54k404m560
55537A43311l966k746l346l836j765Q66R24n97r31n68j549k965k517q34k72q43
55521A18366r62r56k149l690l665k361j450j012l18j85j585k964j965R52L340
55506I9396M236M302L593J895M49P08J821J584m66k740l599k401M19K850K364
$$ y = [328254, 321787, 316861, 314593, 313404, 312489, 312151, 311499, 309054, 305346, 302180, 299843, 297694, 296809, 299066, 303883, 308570, 311804, 314518, 317702, 321532, 326224, 331582, 336075, 338254, 338426, 337292, 334108, 328213, 321093, 314578, 308255, 301085, 294195, 289244, 285103, 279222, 271632, 264709, 259420, 254463, 248728, 242172, 234712, 226660, 219747, 215334, 211998, 207072, 200041, 192417, 185077, 177983, 171715, 167001, 163342, 160143, 158167, 157870, 157614, 155994, 154510, 155268, 157366, 158370, 158057, 157639, 156661, 154083, 151306, 150429, 150275, 147871, 143311, 139345, 136599, 133253, 129417, 127652, 128518, 129442, 128845, 127914, 127346, 125797, 122832, 120315, 119481, 119209, 118366, 117404, 116448, 114299, 110609, 106944, 104583, 103133, 102121, 101803, 101618, 100033, 97069, 95104, 96056, 99396, 103632, 107934, 111527, 113422, 113871, 114579, 116400, 117984, 117518, 114778, 111179, 108778, 109197, 112047, 114411]
55491A14411r42l807l882k559k063j908m77J696K794K561K037J742J918L048M335
55476A18904L450p8l200l133r77O87J733L348M908N020M250L968L696K283N99
55461A45458L00R80J055M54K1o03k002k957k076n51p89l042n591p335q107p495
55445A07720n644m178m147m232l063j864k349l613l769l268l677m453l998k820
55431E6645k567k935k657k515l938n445m118m21K030J498l53j927l319m164l238
55416B2576r98M13L87N65J690K468K191J906K081J627K59n12Q0N73m09k012k462
55399C0423j170J259L643M303K172j417l536l066j824j602j865j351l79l9k15
55384B5336O4Q56J121J86j462k727k682j062J383L165L161J645N0m29M8L47j48
$$ y = [114411, 113469, 109662, 105780, 103221, 101158, 99250, 98773, 100469, 103263, 105824, 107861, 109603, 111521, 114569, 118904, 122354, 122276, 119076, 115943, 114966, 115653, 117386, 120734, 125642, 130662, 134912, 138880, 142576, 144859, 145458, 145758, 146738, 147793, 148247, 148268, 147665, 145663, 142706, 140630, 140079, 139290, 136248, 130657, 123322, 115215, 107720, 102076, 97898, 93751, 89519, 86456, 84592, 82243, 78630, 74861, 71593, 67916, 63463, 59465, 56645, 54078, 51143, 48486, 45971, 42033, 36588, 32470, 32049, 34079, 35577, 35224, 33297, 29978, 25814, 22576, 21578, 21991, 22378, 22943, 24633, 27101, 29292, 31198, 33279, 34906, 35165, 34653, 34733, 35306, 34897, 32885, 30423, 29253, 30512, 34155, 38458, 40630, 39213, 35677, 32611, 30787, 29185, 27320, 25969, 25590, 25551, 25336, 25400, 26256, 27377, 27563, 26101, 23374, 20692, 19630, 21013, 24178, 27339, 28984, 29034, 28605, 28653, 29000, 28852]
55367B8852p84o84m5L26M44R44J572J207l00j626j805j290o26N40K218L165K397
55350C4505O43o73j049p53o7N04K53o56j061m96J25R1q6O4J39o6j80p21k892n958
55330B1666o933m361m33K202L611M782M962L271J170N65Q12J50j177j796j979
55315B6512k732l170j717P21J687Q57J9k84j200k699l119k065j246j836k971C322
55298B96a571o9a2B181J730J268J219J237J316J749K294K670L288M143L815J416
55282B8326j354k183j538j735l055l357j603P17K016K264J782M07j408k369j922
55267A4988q27J02O70O87R4k55P38K803M494M823L684J227j713l219k146L0R43
55250B7123M90M33J324J943J577P35k69j377j621k1K262K888J584K90pk97j190
$$ y = [28852, 28068, 27384, 27339, 27665, 28109, 29053, 30625, 31832, 31532, 29906, 28101, 26811, 26185, 26725, 28943, 32108, 34505, 35148, 34475, 33426, 32673, 32606, 33110, 33363, 32707, 31646, 31150, 31275, 31366, 31280, 31344, 31483, 31417, 31237, 30516, 27624, 21666, 14733, 10372, 9939, 12141, 15752, 20534, 25496, 28767, 29937, 30502, 31314, 31464, 30287, 28491, 26512, 23780, 20610, 18893, 19614, 21301, 22158, 22177, 21893, 20693, 17994, 14875, 12810, 11564, 9728, 6757, 3322, 296, -1571, -1640, -12, 2181, 3911, 5179, 6398, 7635, 8951, 10700, 12994, 15664, 18952, 23095, 26910, 28326, 26972, 24789, 23251, 21516, 18461, 15104, 13501, 14218, 16234, 18498, 20280, 20687, 19279, 16910, 14988, 14161, 14263, 14933, 15620, 15714, 15459, 16197, 19000, 23494, 28317, 32001, 33228, 31515, 28296, 26150, 26180, 27123, 27613, 28046, 29370, 31313, 32890, 33625, 33356, 31979, 30358, 30337, 32599, 35487, 37071, 37361, 37354, 37057, 35867]
55233C5867j933k165k456k480j061J240J906Qk075j828K24J856K171J931J848
55218C3053J920J870J360K40j046j783j873j742j443p61o8M8j88j87j46m74n95
55201B8185J38P63n7j472j259O73J932J206j06n38p05j681l004l518k990j872
55185A5695n28N66Q75O22O46J069J164P97P07J068J020J35q87j284r96j21J181
55168B1729K154K061J366J109J125L75j064j935j769j224m52J046K801L469K838
55153C3629K029J484O29k98j58R47J573J328J205J096m03k932l789j844M25M07
55137C5328j128j861j363o94j10P57J414J208P12Q25J125O45k95o02j83P0j76
55120C5672m81p29j336k298k814k033J9K279L334K717J470Q76Q35K51j104k181
$$ y = [35867, 33934, 31769, 29313, 26833, 25772, 27012, 28918, 28926, 26851, 25023, 25247, 27103, 29274, 31205, 33053, 34973, 36843, 38203, 38443, 37397, 35614, 33741, 31999, 30556, 29795, 29727, 29775, 29587, 29400, 29254, 28780, 28185, 28323, 29086, 29029, 27557, 26298, 26971, 28903, 30109, 30003, 29465, 28760, 27079, 24075, 20557, 17567, 15695, 15167, 15733, 16608, 17230, 17876, 18945, 20109, 20906, 21613, 22681, 23701, 23836, 22949, 21665, 20669, 20548, 21729, 23883, 25944, 27310, 28419, 29544, 29919, 28855, 26920, 25151, 23927, 23475, 24521, 27322, 30791, 33629, 35658, 37142, 37771, 37473, 37315, 38262, 39835, 41163, 42368, 43464, 43061, 40129, 36340, 34496, 34921, 35328, 34200, 32339, 30976, 30282, 30172, 30929, 32343, 33551, 34263, 35088, 36213, 36858, 36563, 35961, 35778, 35848, 35672, 35191, 34462, 33126, 30828, 28014, 25981, 26000, 28279, 31613, 34330, 35800, 36676, 37511, 37762, 36658, 34477]
55104C4477k133j206l1R36J343J238J354K005K054M18j778k263p17R82J540J247
55088C9466K84j608l260k399J138M492N277M206L186K555J507j45j831k875k605
55073D7388q95R29J152L4m50M25J288J285J344K030K348J786J512K279K966K541
55057F7962J684J311J228J357K357L841L969K253P27Q81J384N62r52j768k043
55042H4753k283j747j18R44J21j326j635j229j260j145nJ242J618K289M212N214
55026H9645K826j231k950j822j087k289l226j961L16J526J456J045Q11R25J398
55011H5382J523N34q64j022K90J523J585R69L74j85n48j06R70J511P96o74k120
54994H9938l117l066j400J231K966K526M39j706k569j720J56J611J692R12L84
$$ y = [34477, 32344, 31138, 31107, 32043, 33386, 34624, 35978, 37983, 40037, 40455, 38677, 36414, 35697, 36679, 38219, 39466, 39750, 38142, 34882, 32483, 33621, 38113, 43390, 47596, 50782, 53337, 54844, 54699, 52868, 49993, 47388, 46493, 47422, 48574, 48608, 48158, 48583, 49871, 51156, 52500, 54530, 56878, 58664, 60176, 62455, 65421, 67962, 69646, 70957, 72185, 73542, 75899, 79740, 83709, 85962, 86689, 87570, 88954, 89516, 88564, 86796, 84753, 82470, 80723, 80605, 81549, 81670, 80344, 78709, 77480, 76220, 75075, 75070, 76312, 77930, 80219, 84431, 89645, 92471, 91240, 88290, 86468, 85381, 83092, 79866, 77905, 78221, 79747, 81203, 82248, 83059, 83984, 85382, 86905, 87439, 86575, 85553, 85843, 87366, 88951, 89920, 90294, 90109, 89561, 89455, 90425, 91936, 92732, 92058, 89938, 86821, 83755, 82355, 83586, 86552, 89078, 89517, 87811, 85242, 83522, 83678, 85289, 86981, 87893, 88277]
54979H8277L67L83M17Q91J705K247K192J482L2j605j825K32K936L724K273N95
54963A04323J8k05j003j895k025j458o13N95K258L764M244L300J014k079m674
54948A05564n163l106Q4K351K704J604J02j022j596j880k145k211j558k3J612
54933I5317J953M16j688k184o44P96K31j192q23J450K862J751k74j092r15r87
54917I4977j183p65j74j54l9J122K502K500J334O78J107J745K235L120M223M497
54901A17725L800L251L446L721L624L694M406N392O211O946P564P631P053O527
54887A90991O946Q732J1728J5052J7218J7194J5368J2969J0703Q577O514M243
54875C26235R18l956r337j3374j5313j5826j5585j4684j3338j2034j0732q901
$$ y = [88277, 88644, 89027, 89444, 90335, 92040, 94287, 96479, 97961, 97993, 96388, 94563, 94795, 97731, 101455, 103728, 104323, 104341, 104136, 103133, 101238, 99213, 97755, 97142, 97737, 99995, 103759, 108003, 111303, 112317, 110238, 105564, 100401, 97295, 97379, 99730, 102434, 104038, 104140, 103118, 101522, 99642, 97497, 95286, 93728, 93705, 95317, 97270, 97686, 95998, 93814, 93170, 93966, 94197, 93005, 92182, 93632, 96494, 98245, 97971, 96879, 95964, 94977, 93794, 93029, 92855, 92701, 92662, 93784, 96286, 98786, 100120, 100798, 101905, 103650, 105885, 109005, 113228, 117725, 121525, 124776, 128222, 131943, 135567, 139261, 143667, 149059, 155270, 162216, 169780, 177411, 184464, 190991, 197937, 206669, 218397, 233449, 250667, 267861, 283229, 296198, 306901, 315478, 321992, 326235, 327153, 323197, 313860, 300486, 285173, 269347, 253762, 239078, 225740, 213706, 202974, 194073]
54863A94073o591m671l841l993m697n561o058n671m470l053j885r44P5J528L490
54848A47731N329O092N750N542O568Q594J0789J2783J4261J4393J2791J0471Q836
54835B69930Q066P361O109L954N26l814p655j0117j1967j3996j5287j4760j3458
54822B04892j3263j3872j3260j0964q777p881p378o173m519l051j783q63r44k005
54808A10159k856k577j643j063j131j450j522r16L85J551J481J52j158j253k89
54793I7870M38k56k245l849l328r37J161J500Q54L82l43k035l677l753k754k333
54777G6695k375j176J446L500L690K886K226J558N96j07j26N7J12N23J543K491
54761I3539K735K463K055J575J221J285J371P23m29r38m05L49P68J284K141K784
$$ y = [194073, 187482, 182811, 178970, 174977, 170280, 164719, 158661, 152990, 148520, 145467, 143582, 142638, 142713, 144241, 147731, 153060, 159152, 164902, 170444, 177012, 185606, 196395, 209178, 223439, 237832, 250623, 261094, 269930, 277996, 285357, 291466, 295420, 295946, 292132, 284477, 274360, 262393, 248397, 233110, 218350, 204892, 191629, 177757, 164497, 153533, 144756, 136875, 129497, 123324, 118805, 115754, 113971, 113108, 112164, 110159, 107303, 104726, 103083, 102020, 100889, 99439, 97917, 97001, 97386, 98937, 100418, 100570, 99412, 98159, 97870, 98308, 98052, 95807, 91958, 88630, 87693, 88854, 90354, 91208, 91590, 91247, 89212, 85535, 81782, 79028, 76695, 74320, 73144, 74590, 78090, 81780, 84666, 86892, 88450, 89046, 88939, 88813, 88870, 88982, 89505, 91048, 93539, 96274, 98737, 100792, 102367, 103588, 104873, 106244, 106967, 106538, 105600, 105195, 105544, 106312, 107596, 109737, 112521]
54745A12521K933L231M111N110N839O619P568P943P190N966N467O194P786R513
54731A97991J0718J1243J1599J2285J3032J3266J3095J2989J2621J1040P937L875
54719C31691n36m774p891q956q099o348m750m202n367p513q314o483l835k879
54705B51744l056j819R84K658J928R13J803L908N299N598N833O818Q749J1328
54691C02688J3553J4513J4727J5519J6988J8206J9256K1011K2634K1888J8487
54680D99470J4529J0809N555j775q446j2241j4716j8112k1398k2279k1430k1395
54668C88571k2319k1931j9444j6597j4732j3366j1993j1139j0943j0489r201p608
54656B18809o290n138m070l473l544l918m188m215l847l016k100j582j351r24
$$ y = [112521, 115454, 118685, 122796, 127906, 133745, 140364, 147932, 155875, 163065, 169031, 174498, 180692, 188478, 197991, 208709, 219952, 231551, 243836, 256868, 270134, 283229, 296218, 308839, 319879, 327816, 331691, 331155, 326381, 318490, 309534, 301435, 295087, 290337, 286135, 280768, 273255, 264941, 258458, 254623, 251744, 248688, 246869, 247853, 250511, 252439, 253352, 255155, 259063, 264362, 269960, 275793, 282611, 291360, 302688, 316241, 330754, 345481, 361000, 377988, 396194, 415450, 436461, 459095, 480983, 499470, 513999, 524808, 530363, 528588, 520142, 507901, 493185, 475073, 453675, 431396, 409966, 388571, 366252, 344321, 324877, 308280, 293548, 280182, 268189, 257050, 246107, 235618, 226417, 218809, 212519, 207381, 203311, 199838, 196294, 192376, 188188, 183973, 180126, 177110, 175010, 173428, 172077, 171153]
54642A71153k93n9o27j659k229j526L41K136K626J957J240Q29J0j355k149j585
54626A68810l77M80J085J926K744L120L394L982M380L918L012K698L286M180M638
54611B11276M206L023K220L074N219O660O373N798O669Q453R306Q658P323N707
54597B93965L665J903J665K755L368K426J076J138K811M658N583O079P323R440
54583C47855J1363J2442J3343J4729J5881J5889J5716J7302K0590K3095K2838
54572E31043K0182J6279J1323N270j198p459j3398j8286k0601k0120j8854j8638
54560D65543j9027j8708j7784j7094j6479j5272j3737j2519j1342r647p793o317
54548B99824m804k877j417j375k100k425k576l393m313m082l062k875l857m686
$$ y = [171153, 170860, 170801, 170174, 168515, 166286, 164760, 165101, 167237, 169863, 171820, 173060, 173889, 173899, 172544, 170395, 168810, 168433, 168913, 169998, 171924, 174668, 177788, 181182, 185164, 189544, 193462, 196474, 199172, 202458, 206638, 211276, 215482, 218505, 220725, 223799, 229018, 235678, 242051, 247849, 254518, 262971, 272277, 280935, 288258, 293965, 297630, 299533, 301198, 303953, 307321, 309747, 310823, 311961, 314772, 319430, 325013, 331092, 338415, 347855, 359218, 371660, 385003, 399732, 415613, 431502, 447218, 464520, 485110, 508205, 531043, 551225, 567504, 578827, 584097, 582899, 575440, 562042, 543756, 523155, 503035, 484181, 465543, 446516, 427808, 410024, 392930, 376451, 361179, 347442, 334923, 323581, 313934, 306141, 299824, 295020, 292143, 290726, 289351, 287251, 284826, 282250, 278857, 274544, 270462, 267400, 264525, 260668, 255982]
54534B55982m657m679n649p121q025p865o913n916n565n688n330m184l308l595
54520A77487m306m152l161k307j971k044k793m210n083m339k843k274k602k384
54506A33018j299n16n20l04P92J923J920O53j110k339k249r26N77J470K159L154
54490A36403L660K579M44r79p65O90K751M758N617M858L802M065N125N107L783
54475A81898K891L513N012O646Q277R222Q483O772O399Q160J0135J0434R485Q495
54461B85822P247M852J623j394l993o604q968j0278j0528j0629j1068j1198j0159
54448B14725q152o501o312p148p359n951l770k419k414k964l151k659j681q36
54434A53408r07j921k835k896k774l312l788k680o2K112K264P37r55j519n76J167
$$ y = [255982, 251325, 246646, 240997, 233876, 225851, 217986, 211073, 205157, 199592, 193904, 188574, 184390, 181082, 177487, 173181, 169029, 165868, 163561, 161590, 159546, 156753, 152543, 147460, 143121, 140278, 138004, 135402, 133018, 131719, 131203, 130683, 130379, 131171, 133094, 135014, 135667, 134557, 132218, 129969, 129043, 129620, 131090, 133249, 136403, 140063, 142642, 143086, 142107, 141342, 142032, 144783, 149541, 155158, 160016, 163818, 167883, 173008, 178115, 181898, 184789, 188302, 193314, 199960, 208237, 217459, 225942, 232714, 239113, 247273, 257408, 267842, 277327, 285822, 293069, 297921, 299544, 298150, 294157, 287553, 278585, 268307, 257779, 247150, 236082, 224884, 214725, 206573, 200072, 193760, 186612, 179253, 173302, 169532, 167113, 164699, 161735, 158584, 155925, 154244, 153408, 152501, 150580, 147745, 144849, 142075, 138763, 134975, 132295, 132233, 134345, 136609, 137346, 136391, 134872, 134296, 135463]
54418A35463K445K695K472K215J469K40o8J394L044K789J096N6nn32j719k041
54402A51013j088k97l20p6P97Q97m22j607j336n80q49j822k173j544n01M41O99
54385A41232l26k103k984k245r72j90M43J116P24j252l112k887r75P01J284J153
54369A29607L43j237k442j669Q37K873K789J089o17j381j349j098r11n19M56J804
54353A28575K809L162L229L337L464L856N013O510O828N164K785J625K105L102
54339A81564L721M209N131O324O811N797L808K611L375N112N706M522K895K003
54325B43589J439L50j210k691l884m734n090n124n144m797l507j967j761k998
54311B02471l820l041j795j574k161k602k829k965k379j056o15k128l959l760
$$ y = [135463, 137908, 140603, 143075, 145290, 146759, 146999, 146931, 148325, 151369, 154158, 155254, 155310, 155305, 154773, 153054, 151013, 149925, 149628, 149308, 149232, 150029, 150926, 150504, 148897, 147561, 146981, 146132, 144310, 142137, 140593, 140092, 140533, 141232, 140906, 138803, 135819, 133574, 132602, 132412, 132855, 133971, 134695, 133443, 130331, 127444, 126469, 127170, 128454, 129607, 129950, 128713, 126271, 124602, 125439, 128312, 131101, 132190, 131573, 130192, 128843, 127745, 126834, 126315, 126771, 128575, 131384, 134546, 137775, 141112, 144576, 148432, 153445, 159955, 166783, 171947, 174732, 176357, 178462, 181564, 185285, 189494, 194625, 200949, 207760, 213557, 217365, 219976, 223351, 228463, 234169, 238691, 241586, 243589, 245028, 245378, 244168, 241477, 237593, 232859, 227769, 222645, 217501, 212704, 209197, 207230, 205469, 202471, 198651, 195610, 193815, 192241, 190080, 187478, 184649, 181684, 179305, 178249, 177634, 175506, 171547, 167787]
54297A67787j818l27N7O66J997K818K489K121K705L621L924L849M131M751N113
54282B03884M884M097L040K364K635L386L309J879J65n31k41J28L39R10J730J585
54266B33563k95k921m535m683m321m022l340k437k737m748o476n876m119m030
54252A79023n508n358k340L43p09m458p175p295o261n405m454k999j534o98o88
54237A24484j481k693l398l043k259j866j592r15m77j208k476k667j502k93P1
54222I8685ol6j26k72j86j6j53l00J32P85Q09M47O15R22P1j436j152J613L921
54203A04317K768p56k887k014j35M29k00n43k24p4n04q58n36P3K17OK50J175J934
54184A02438J717Q41J43j37l11m28l59m01q57j112j26J941L554L561K420J300
$$ y = [167787, 165969, 165642, 165699, 166365, 168362, 171180, 173669, 175790, 178495, 182116, 186040, 189889, 194020, 198771, 203884, 208768, 212865, 215905, 218269, 220904, 224290, 227599, 229478, 229643, 229112, 228871, 228999, 229338, 230248, 231978, 233563, 233268, 230347, 225812, 221129, 216808, 212786, 209446, 207009, 204272, 199524, 193048, 187172, 183053, 179023, 173515, 168157, 165817, 166160, 165451, 160993, 153818, 146523, 140262, 134857, 130403, 127404, 125870, 125172, 124484, 123003, 120310, 116912, 113869, 111610, 109744, 108152, 107237, 106760, 105552, 103076, 100409, 98907, 98614, 98685, 98679, 98643, 98517, 98245, 98059, 98043, 97890, 97590, 97722, 98507, 99316, 99763, 100378, 101300, 101371, 99935, 98783, 100396, 104317, 107085, 106329, 103442, 101428, 101293, 101722, 101522, 100979, 100755, 100681, 100177, 99319, 98783, 98856, 99073, 99079, 99329, 100504, 102438, 104155, 104996, 105139, 105002, 104691, 104263, 103904, 103503, 102646, 101534, 101408, 103349, 106903, 110464, 112884, 114184]
54168A14184P32O26Q62J300J649J823J988J815M09k310m633m482j770J404L011
54153A16608K802J753O10m54j316j810k052k304k368j614J24K030K942K366P12
54138A18029j197k588k979k475j709j199q88n54m22q11j413j599j346j201j323
54123I6325j309r51n03q3L54M97Kn77k29Q84J469J073P54J123J275O47N05J995
54105A03251L726L214K75k688l712l033j860q52j04M37R88J604J780J030k10j048
54089A02798j297j416j545j491j357j151j95J747L237K593N43l88O60J808J350
54074A05896r6j163j742k263k280j260J67R98J199J132N16q52j993j857r86p44
54058I4672j221j339r03r26j646j733k35J756K322J032p47j642j566j243r98n33
$$ y = [114184, 114916, 115542, 116404, 117704, 119353, 121176, 123164, 124979, 125388, 123078, 118445, 113963, 112193, 113597, 116608, 119410, 121163, 121773, 121319, 120003, 118193, 116141, 113837, 111469, 109855, 109979, 112009, 114951, 117317, 118029, 116832, 114244, 111265, 108790, 107081, 105882, 104994, 104440, 104018, 103207, 101794, 100195, 98849, 97648, 96325, 95016, 94065, 93562, 93479, 93833, 94330, 94332, 93755, 93526, 94410, 95879, 96952, 97706, 98829, 100104, 100751, 101256, 103251, 106977, 110191, 110466, 107778, 104066, 101033, 99173, 98321, 98217, 98654, 99642, 101246, 103026, 104056, 103846, 102798, 101501, 100085, 98540, 97049, 95692, 94541, 94346, 96093, 99330, 101923, 102466, 102078, 102738, 104546, 105896, 105800, 104637, 102895, 100632, 98352, 97092, 97259, 98257, 99456, 100588, 101104, 100252, 98259, 96402, 95416, 94672, 93451, 92112, 91209, 90283, 88637, 86904, 86669, 88425, 90747, 91779, 91032, 89390, 87824, 86581, 85583, 85050]
54042H5050K43P26M19o8L58J461J555j95k259k575j319l93m63k23J065K063J417
54025H6862k0l75O67J818K251K160J563K18j104q07J300L180K880Q79q66j456
54009I9150j619k118k721k734j854l78R52J462J336J567K682L841L958L116K099
53994A08739J006m21j416p23J315K734K542K024K720M141M619L657K438K363L784
53979A39522N845P048O423M563L085K813L165L623M687O668Q573R274Q999Q605
53965B22893Q160P409O908P182P324O118M354M178N873P089N995L691K423K598
53951C02195K790K099J133P30Q06P26K46l78r94j984l867o459q593q981p429n148
53935B66892l723l828m720n039m246l348l724n226o071n022k920j409q08k89K16
$$ y = [85050, 85293, 86019, 86438, 86370, 86728, 88189, 89744, 89549, 87290, 84715, 83396, 83003, 82540, 82317, 83382, 85445, 86862, 86842, 86467, 87134, 88952, 91203, 93363, 94926, 95144, 94040, 93233, 94533, 97713, 100593, 101472, 100606, 99150, 97531, 95413, 92692, 89958, 88104, 87726, 88678, 90140, 91476, 93043, 95725, 99566, 103524, 106640, 108739, 109745, 109324, 107908, 107185, 108500, 111234, 113776, 115800, 118520, 122661, 127280, 130937, 133375, 135738, 139522, 145367, 152415, 158838, 163401, 166486, 169299, 172464, 176087, 180774, 187442, 196015, 205289, 214288, 222893, 231053, 238462, 245370, 252552, 259876, 265994, 270348, 274526, 280399, 287488, 293483, 297174, 299597, 302195, 304985, 307084, 308217, 308947, 309753, 310479, 310725, 310347, 309353, 307369, 303502, 297043, 288450, 279469, 272040, 266892, 263169, 259341, 254621, 249582, 245336, 241988, 238264, 233038, 226967, 221945, 219025, 217616, 216808, 216519, 216735]
53920B16735k23j765l052k893j775j021j016j094p51j80K56M09J98k91m41M79
53904B03575K149L005J833n32j940j439k88j01o50m75P72J687J065m90j363p49
53888B06059P66K116K828L264L940M544L977J870l09n58J398L970N699O350O084
53873B51998N008L857L733M573N095M736M265L894K510j39k171j984n38L58P63
53858B85958J736K999L502L625M548N884O135N300M917N513O088O278O985Q457
53844C57925R662J0052J0243J0328R332O958M387K567J161j75r91j243j820k963
53830D15423l599l247l168m346n666n464l998k820k504k561l169n205q410j0907
53816C50359j1080r276p191o017n578n094m433m365n519p403q753q779p627n982
$$ y = [216735, 216512, 214747, 211695, 208802, 207027, 206006, 204990, 203896, 203145, 202965, 203221, 203630, 203828, 203537, 203096, 203575, 205724, 208729, 210562, 210030, 208090, 206651, 206363, 206262, 205612, 205137, 205909, 207596, 208661, 208171, 206808, 206059, 206825, 208941, 211769, 215033, 218973, 223517, 227494, 229364, 229055, 228497, 229895, 233865, 239564, 245914, 251998, 257006, 260863, 264596, 269169, 274264, 279000, 283265, 287159, 289669, 289530, 287359, 285375, 284837, 285195, 285958, 287694, 290693, 294195, 297820, 302368, 308252, 314387, 319687, 324604, 330117, 336205, 342483, 349468, 357925, 367587, 377639, 387882, 398210, 407542, 414500, 418887, 421454, 422615, 422440, 421449, 420206, 418386, 415423, 411824, 408577, 405409, 401063, 395397, 389933, 385935, 383115, 380611, 378050, 374881, 369676, 361266, 350359, 339279, 330003, 322812, 316795, 311217, 306123, 301690, 297325, 291806, 284403, 275650, 266871, 259244, 253262]
53802B53262m654m335m996n562n058l971l623m240m595l843k673k216k552k817
53788A98127k340j313o76j279k766l545k551p76j03r91k364l455m295m481l197
53773A63995q90P61J054R96J276J132J13o51j52P93R02M56N29J004Q78J03k36
53756A72063M00J213J087k05j790k400j459L09J666K259K663L136L319L340L964
53741A89565N190N864N417M831N087N692N728N433N688O633P665Q270Q043O734
53727B75840N029M414N326O208N382L145J080K6j88K19R81J405J082O43Q04J241
53711C12637J324J281J550J519L43j554k965l614m157m665m520l746l235l465
53697B86733l851l617k613j290m11n89j584k307k171j944k565l622l943l256k334
$$ y = [253262, 248608, 244273, 239277, 233715, 228657, 224686, 221063, 216823, 212228, 208385, 205712, 203496, 200944, 198127, 195787, 194474, 193798, 192519, 189753, 186208, 183657, 182881, 182778, 181787, 179423, 175968, 171673, 167192, 163995, 163105, 163866, 164920, 165916, 167192, 168324, 168437, 167786, 167634, 168427, 169329, 169785, 170314, 171318, 172196, 172299, 172063, 172463, 173676, 174763, 174558, 172768, 170368, 168909, 169218, 170884, 173143, 175806, 178942, 182261, 185601, 189565, 194755, 200619, 206036, 210867, 215954, 221646, 227374, 232807, 238495, 245128, 252793, 261063, 269106, 275840, 280869, 285283, 290609, 296817, 302199, 305344, 306424, 306450, 306262, 306481, 307462, 308867, 309949, 310592, 311396, 312637, 313961, 315242, 316792, 318311, 318654, 317100, 314135, 310521, 306364, 301699, 297179, 293433, 290198, 286733, 282882, 279265, 276652, 275362, 274951, 274362, 272778, 270471, 268300, 266356, 263791, 260169, 256226, 252970, 250636]
53682B50636j731j407j361j771k519l309m032m475m035k565j070o78j260j800
53668B18623j823j618j378j040o75l02L18J052J157M78J65J198K720L017J678
53653B23570j35j122n79J508M028N144M372L418L731M339L784K984L806N665O277
53638B70790N467N297O168N936L742J885K397M109M881M772N045N610N505M998
53624C36602N119N685N546M482L410K823K290J492P13K16j32n71j226j976k220
53609C62253j253O61K106K056J153O87P38K81j032k063j515M02K026J941N06n64
53593C68383k90L35j76j492j881r66n50j868l420k997j082m31k225m317m065j704
53577C41254K35L91Q0J073K972L824K975J889J880K203J424j39p63J97J466J831
$$ y = [250636, 248905, 247498, 246137, 244366, 241847, 238538, 234506, 230031, 225996, 223431, 222361, 221683, 220423, 218623, 216800, 215182, 213804, 212764, 212089, 211787, 212105, 213157, 214314, 214792, 214957, 216155, 218875, 221892, 223570, 223435, 222313, 221734, 223242, 227270, 232414, 236786, 240204, 243935, 248274, 252058, 255042, 258848, 264513, 270790, 276257, 281554, 287722, 293658, 297400, 299285, 301682, 305791, 310672, 315444, 320489, 326099, 331604, 336602, 341721, 347406, 352952, 357434, 360844, 363667, 365957, 367449, 368162, 368378, 368246, 367675, 366449, 364473, 362253, 361000, 361661, 363767, 365823, 366976, 367663, 368401, 368682, 367650, 365587, 364072, 364474, 366500, 368441, 368947, 368383, 368093, 368428, 368252, 366760, 364879, 363913, 363363, 361495, 358075, 355078, 353996, 353565, 351340, 347023, 342958, 341254, 341489, 341880, 341960, 343033, 346005, 349829, 352804, 354693, 356573, 358776, 360200, 360061, 359298, 359495, 360961, 362792]
53561C62792J751K468M278O286P335O817N146L735L954N675P331P651O835N823
53547D37877N159N043N708P031Q136Q181P423O978P493Q394Q530P512O387O611
53533E36463Q199R331Q595P039O843Q117Q656P196N235M742N580O463P219Q270
53519F37948Q787P318M233J680R06J109J264J590K441L125K882K164J818J589
53505F78854N85j069k104j788q20k73l15k87L46J479K522K837K229J178L25k40
53489F83459q39j294q39O48J950J922J156J293K692L935L927L429L763M833N371
53474G15406M737L489K358J648J659K791M767O420O863O627P154R198J1990J4075
53460G99182J4795J4827J5271J6498J8029J9384K0533K1522K2210K2711K3685
$$ y = [362792, 364543, 367011, 371289, 377575, 384910, 391727, 396873, 400608, 404562, 410237, 417568, 425219, 432054, 437877, 443036, 448079, 453787, 460818, 468954, 477135, 484558, 491536, 499029, 507423, 515953, 523465, 529852, 536463, 544662, 553993, 562588, 569627, 576470, 584587, 593243, 600439, 605674, 610416, 615996, 622459, 629678, 637948, 646735, 654053, 658286, 659966, 660872, 661981, 663245, 664835, 667276, 670401, 673283, 675447, 677265, 678854, 679439, 678370, 676266, 674478, 673658, 673385, 673070, 672783, 673129, 674608, 677130, 679967, 682196, 683374, 683699, 683459, 682620, 681326, 680487, 681135, 683085, 685007, 686163, 687456, 690148, 694083, 698010, 701439, 705202, 710035, 715406, 720143, 723632, 725990, 727638, 729297, 732088, 736855, 743275, 750138, 756765, 763919, 773117, 785107, 799182, 813977, 828804, 844075, 860573, 878602, 897986, 918519, 940041, 962251, 984962, 1008647]
53449A008647K5704K8360L0404L0871L0015K9118K9448L1220L3683L6173L8701
53438A352344M1253M3153M3868M4167M5348M7445M9286N0292N0996N1616N1596
53427A871364N1026N0963N1549N1410M9909M8525M8618M9329M9333M9307N0547
53416B421880N2157N1997M9945M7930M6799M5400M3010M0554L8935L7907L7064
53405B913578L6284L4777L1463K6911K3203K1233J9678J7446J5384J4420J3559
53394C167936J1192P341L166j030n815j1034j5485j8314j9976k1703k4361k7742
53382C044175l0906l3229l4965l6491l7512l7830l8309l9836m1715m2565m2628
53371B628189m3350m4598m4408m2155l9776l8703l7657l5081l2070l0680l0469
$$ y = [1008647, 1034351, 1062711, 1093115, 1123986, 1154001, 1183119, 1212567, 1243787, 1277470, 1313643, 1352344, 1393597, 1436750, 1480618, 1524785, 1570133, 1617578, 1666864, 1717156, 1768152, 1819768, 1871364, 1922390, 1973353, 2024902, 2076312, 2126221, 2174746, 2223364, 2272693, 2322026, 2371333, 2421880, 2474037, 2526034, 2575979, 2623909, 2670708, 2716108, 2759118, 2799672, 2838607, 2876514, 2913578, 2949862, 2984639, 3016102, 3043013, 3066216, 3087449, 3107127, 3124573, 3139957, 3154377, 3167936, 3179128, 3186469, 3189635, 3188605, 3182790, 3171756, 3156271, 3137957, 3117981, 3096278, 3071917, 3044175, 3013269, 2980040, 2945075, 2908584, 2871072, 2833242, 2794933, 2755097, 2713382, 2670817, 2628189, 2584839, 2540241, 2495833, 2453678, 2413902, 2375199, 2337542, 2302461, 2270391, 2239711, 2209242]
53360B209242k8953k5163k0692j7194j4491j1586q221m840j711J398M870Q591
53348B091250J1731J3592J4827J7162K1435K6582L0961L4003L6054L7566L9158
53337B374321M1751M5553M9516N2687N5557N9141O3149O6277O8215P0318P4013
53326C020498P9054Q3668Q6359Q7491Q8937R1868R5276R7460R8508J00008J02394
53315D031521J04248J04656J04515J04640J04242J02504J00191R8211R5801R1726
53305E042255Q6376Q0961P5399O8706O1024N3683M7374M1630L5843K9649K2633
53294E645533J4810P027j96p699j6338k5248l2923l9528m6573n4636o2933p0897
53282E310399p8553q5389r0524r4016r6677r8616r9367r9341r9587j00088r9867
$$ y = [2209242, 2180289, 2155126, 2134434, 2117240, 2102749, 2091163, 2082942, 2078102, 2076391, 2077789, 2082659, 2091250, 2102981, 2116573, 2131400, 2148562, 2169997, 2196579, 2227540, 2261543, 2297597, 2335163, 2374321, 2416072, 2461625, 2511141, 2563828, 2619385, 2678526, 2741675, 2807952, 2876167, 2946485, 3020498, 3099552, 3183220, 3269579, 3357070, 3446007, 3537875, 3633151, 3730611, 3829119, 3929127, 4031521, 4135769, 4240425, 4344940, 4449580, 4553822, 4656326, 4756517, 4854728, 4950529, 5042255, 5128631, 5209592, 5284991, 5353697, 5414721, 5468404, 5515778, 5557408, 5593251, 5622900, 5645533, 5660343, 5667370, 5667174, 5659475, 5643137, 5617889, 5584966, 5545438, 5498865, 5444229, 5381296, 5310399, 5231846, 5146457, 5055933, 4961917, 4865240, 4766624, 4667257, 4567916, 4468329, 4368241, 4268374]
53271D268374r8818r7747r6602r4436r1513q9497q8934q8205q5815q2127p7990
53260C276690p3280o7972o3311o0536n9151n7593n4981n1428m7391m3518m0491
53249B657038l8324l6279l4034l2041l0278k7664k3516j8708j4597j1605r581
53238B380411q524p981o771m489k333j070Q77N452J1546J5666J6256J5549J6574
53225B431163J9845K3867K7567L0917L3894L6169L7675L8712L9551M0487M1981
53214B801828M4039M5627M5572M4069M2520M1729M1051L9631L7566L5239L2221
53203C251092K7869K2657J8030J4911J3063J1797J0445Q221M523l46n471j0377
53191C366414j5094j9281k2457k5305k9368l4929m0316m4044m6404m8247m9512
$$ y = [4268374, 4169556, 4071809, 3975207, 3880771, 3789258, 3699761, 3610827, 3522622, 3436807, 3354680, 3276690, 3203410, 3135438, 3072127, 3011591, 2952440, 2894847, 2839866, 2788438, 2741047, 2697529, 2657038, 2618714, 2582435, 2548401, 2516360, 2486082, 2458418, 2434902, 2416194, 2401597, 2389992, 2380411, 2371887, 2363906, 2357135, 2352646, 2350313, 2349243, 2350120, 2355572, 2367118, 2382784, 2399040, 2414589, 2431163, 2451008, 2474875, 2502442, 2533359, 2567253, 2603422, 2641097, 2679809, 2719360, 2759847, 2801828, 2845867, 2891494, 2937066, 2981135, 3023655, 3065384, 3106435, 3146066, 3183632, 3218871, 3251092, 3278961, 3301618, 3319648, 3334559, 3347622, 3359419, 3369864, 3378085, 3382608, 3382262, 3376791, 3366414, 3351320, 3332039, 3309582, 3284277, 3254909, 3219980, 3179664, 3135620, 3089216, 3040969, 2991457]
53180B991457n0071n0824n2426n3967n4432n4550n5411n6106n4961n2690n1816
53169B404203n2810n3180n1118m7916m5710m4650m3615m2353m1327m0370l9031
53158A902123l7673l6982l6705l5886l4202l2096k9832k7361k5128k4055k4456
53147A557747k5382k5467k4210k2371k1183k1278k2276k3257k3462k2687k1410
53136A304764k0582k0801k1453k1301k0261j9793k0850k2272k2267k0874j9697
53125A074613j9611k0108k0689k1429k2155k2447k2567k3058k3354k2246j9892
53114H37057j7860j6913j6364j5874j6010j6484j5868j4035j2928j3619j4461
53103F66641j3711j2258j1830j2045j1484j0628j1106j2696j3414j2530j1246
$$ y = [2991457, 2941386, 2890562, 2838136, 2784169, 2729737, 2675187, 2619776, 2563670, 2508709, 2456019, 2404203, 2351393, 2298213, 2247095, 2199179, 2153469, 2108819, 2065204, 2022851, 1981524, 1941154, 1902123, 1864450, 1827468, 1790763, 1754877, 1720675, 1688579, 1658747, 1631386, 1606258, 1582203, 1557747, 1532365, 1506898, 1482688, 1460317, 1439134, 1417856, 1395580, 1372323, 1348861, 1326174, 1304764, 1284182, 1263381, 1241928, 1220627, 1200366, 1180573, 1159723, 1137451, 1115184, 1094310, 1074613, 1055002, 1034894, 1014205, 992776, 970621, 948174, 925607, 902549, 879195, 856949, 837057, 819197, 802284, 785920, 770046, 754036, 737552, 721684, 707649, 694721, 681102, 666641, 652930, 640672, 628842, 616797, 605313, 594685, 583579, 570883, 557469, 544939, 533693]
53092E33693j0352r295p907p001o694n974m640l970m659n502n237m445m490n506
53078D48021o468o625n883m342k473j225j168j805k376k917l769m574m713m336
53064C95347m062l785k911j694j237j801k148j182M74J366J135P24Q46J206J355
53049C83633J481J903K396K525K391K493L020L657L927L412K012M72K15J846L939
53034D19322M287K435Jj728l279n470p539q049p057o034n864o056n981n730n437
53019C57821m840l975l507l761m211m417m848n895o749o202m436k967k702k950
53005B96361k671k023k021l089m568n531n650n200m471l409j845j15P71N0j699
52990B54890k918k744j846j238r29n10l46j057k116k271j495j122j664j991j400
$$ y = [533693, 523341, 514046, 506139, 499138, 492444, 486470, 481830, 477860, 473201, 467699, 462462, 458017, 453527, 448021, 441553, 434928, 429045, 424703, 422230, 421005, 419837, 418032, 415656, 412739, 408970, 404396, 399683, 395347, 391285, 387500, 384589, 382895, 381658, 379857, 377709, 376527, 377001, 378367, 379502, 380226, 381072, 382278, 383633, 385114, 387017, 389413, 391938, 394329, 396822, 399842, 403499, 407426, 410838, 412850, 413322, 413537, 415383, 419322, 423609, 426044, 426045, 424317, 421038, 415568, 408029, 399980, 392923, 386889, 381025, 374969, 368988, 363258, 357821, 352981, 349006, 345499, 341738, 337527, 333110, 328262, 322367, 315618, 309416, 304980, 302013, 299311, 296361, 293690, 291667, 289646, 286557, 281989, 276458, 270808, 265608, 261137, 257728, 255883, 255768, 256539, 256589, 254890, 251972, 249228, 247382, 246144, 245215, 244705, 244359, 243302, 241186, 238915, 237420, 236298, 234634, 232643, 231243]
52975B31243j090k211l658l466j841q43j292j872j599j243j535j666q41l9n83
52960B07464j764j612Q2J281N77q63j118k79j19j323k379j635M55J943J828R61
52944B03499N42O37N87J77k54l93j81L34P95N81l64j085p69l3k88j814l391l754
52926A94826k680o46J570K859K357O07o51k98J143K494L113K764J454O6K11K306
52910B11495M470M514K688J309J833L459M792N638O443O817N775L360J195R43
52896B64731K565M518N591O022O667P581Q054P742P085O523N969N196M234L034
52882C45512J352o98k383l062k894k465k107j916k133k973m136m971n114m643
52868C07369l765k685j839j784k567l402l288k120j006j117k235k833j918l91
$$ y = [231243, 230153, 227942, 224284, 220818, 218977, 218134, 216842, 214970, 213371, 212128, 210593, 208927, 208086, 208047, 207464, 205700, 204088, 204170, 205451, 206028, 205165, 204047, 203768, 203649, 202326, 199947, 198312, 198767, 200710, 202538, 203499, 204041, 204678, 205265, 205442, 205188, 204795, 204614, 204948, 205743, 206324, 205960, 204875, 204106, 204073, 203785, 201971, 198580, 194826, 192146, 191500, 193070, 195929, 198286, 198893, 198242, 197944, 199087, 201581, 204694, 207458, 208912, 208978, 209189, 211495, 215965, 220479, 223167, 224476, 226309, 229768, 234560, 240198, 246641, 253458, 259233, 262593, 263788, 264731, 267296, 271814, 277405, 283427, 290094, 297675, 305729, 313471, 320556, 327079, 333048, 338244, 342478, 345512, 346864, 346166, 343783, 340721, 337827, 335362, 333255, 331339, 329206, 326233, 322097, 317126, 312012, 307369, 303604, 300919, 299080, 297296, 294729, 291327, 288039, 285919, 284913, 283796, 281561, 278728, 276810, 276419]
52854B76419n3j386l023l396k379j035k59m8Q3M01O80N32k5l90J02J531L265M313
52836B75332L890K079P5o81N4J199J816K043K211J995J149K56j97o42j257r94
52820B88328P26K248J596l37q02O93J822J278O04J150J673O95p04m91J177K428
52804C02084K421J845J215M03l82n46J0Q88J776K336K078J312J290K357K906J591
52788C23584k62k52J631L048K794K208K753L931M445M181M026M412M867M695L739
52773C69800K646K438L481M940N610N226M389L525K485J147k85j539k443k820
52759C98600k751k771l335m266m989n140m634l675k982l362m494m961m241l711
52745C43288m632o032o031m694l944m777o156o714o108m608k649j143r25j501
$$ y = [276419, 276366, 274980, 271957, 268561, 266182, 265147, 264888, 264840, 264923, 265324, 266004, 266536, 266511, 266121, 266223, 267754, 271019, 275332, 279222, 281301, 281376, 280695, 280749, 281948, 283764, 285807, 288018, 290013, 291162, 291418, 291221, 290579, 289322, 288328, 289054, 291302, 292898, 292561, 291759, 292452, 294274, 295552, 296156, 297306, 298979, 299674, 298970, 298479, 299656, 302084, 304505, 306350, 307565, 307968, 307586, 307040, 307050, 307938, 309714, 312050, 314128, 315440, 316730, 319087, 321993, 323584, 323322, 323070, 324701, 327749, 330543, 332751, 335504, 339435, 343880, 348061, 352087, 356499, 361366, 366061, 369800, 372446, 374884, 378365, 383305, 388915, 394141, 398530, 402055, 404540, 405687, 405402, 403863, 401420, 398600, 395849, 393078, 389743, 385477, 380488, 375348, 370714, 367039, 364057, 360695, 356201, 351240, 346999, 343288, 338656, 332624, 326593, 321899, 317955, 313178, 307022, 300308, 294200, 289592, 286943, 285800, 284875, 283374]
52731B83374j530q52p65j860k913k810k354l043m767n874n337l870k789k454k135
52716B40021j178l7J44j061k721l723m050m291m276l220j221L53M00o09j307j000
52700B12224k51j20j085k550l442l329k776k421k093j253N4J173J405L56j814
52685A94078l885m089k042L50Q97l29j489j628j519k032k956l648l789l335k558
52670A62026k251k986m047m083k854j435o10n7O35J165J130O34Ln36p38m51k4
52653A45521K3l46q04j156j145k68J355K427J918O05k1J57K62K76Q12J335P11
52636A51662m99m11J233K515K221J299Q19M94J05M89K016L757N159O810Q617R023
52620A95309P372N335M537M462M037L514L111J570j638m294m112k404k363m319
$$ y = [283374, 281844, 280992, 280227, 278367, 275454, 272644, 270290, 267247, 262480, 256606, 251269, 247399, 244610, 242156, 240021, 238843, 238806, 238950, 237889, 235168, 231445, 227395, 223104, 218828, 215608, 214387, 214740, 215140, 214531, 213224, 212224, 211973, 211853, 210768, 208218, 204776, 201447, 198671, 196250, 194157, 192904, 192958, 194131, 195536, 195892, 194078, 190193, 186104, 184062, 184412, 185309, 184980, 183491, 181863, 180344, 178312, 175356, 171708, 167919, 164584, 162026, 159775, 156789, 152742, 148659, 145805, 144370, 143760, 143703, 144338, 145503, 146633, 147267, 147270, 146734, 145996, 145545, 145521, 145544, 145198, 144394, 143238, 142093, 141825, 143180, 145607, 147525, 148130, 148109, 148266, 148528, 148804, 149616, 150951, 151662, 151163, 150752, 151985, 154500, 156721, 158020, 158839, 159333, 159438, 159927, 161943, 165700, 170859, 177669, 186286, 195309, 202681, 208016, 212553, 217015, 221052, 224566, 227677, 229247, 227609, 223315, 219203, 216799, 214436, 210117]
52606B10117n441m153k221j868k876l535l180k811l740n968p714p040m346k288
52592A52936k322k637j016J485J973M5j871k324k276k464j998o36n9j328k875
52577A34633k673j080J01L87O66J192J277Q42Q44J848L199L849L330J820j55j859
52561A48221k650k484j964j760k021k325k118j297l94j6r5Q6J041K459L444L249
52545A41376J765l64k063k540j929j133r62j433j788j116Q04L043M169L667K575
52530A44071K318L104L876L663K420P46o00q74J67J833K997L249L045K638J692
52515A74345K89m48L95K060K735J676K4n78L49K108L787M700M318K612O21q5J065
52498A99973K900L703K943J515M59Mk01l54k64L13J209J807J605Q75M09N10Q14
$$ y = [210117, 204676, 200523, 198302, 196434, 193558, 190023, 186843, 184032, 180292, 174324, 166610, 159570, 155224, 152936, 150614, 147977, 146961, 148446, 150419, 150464, 148593, 146269, 143993, 141529, 139531, 138895, 138836, 137508, 134633, 131960, 130880, 130981, 131368, 132034, 133226, 134503, 135345, 136189, 138037, 141236, 145085, 148415, 150235, 150080, 148221, 145571, 143087, 141123, 139363, 137342, 135017, 132899, 131602, 131208, 131192, 131097, 131183, 132224, 134683, 138127, 141376, 143141, 142777, 140714, 138174, 136245, 135112, 134150, 132717, 130929, 129813, 130617, 133660, 137829, 141496, 144071, 146389, 149493, 153369, 157032, 159452, 160198, 159598, 158724, 158891, 160724, 163721, 166970, 170015, 172653, 174345, 174634, 174186, 174581, 176641, 179376, 181052, 181076, 180498, 180847, 182955, 186742, 191442, 195760, 198372, 198993, 198908, 199973, 202873, 206576, 209519, 211034, 211493, 211497, 211296, 210942, 210678, 210991, 212200, 214007, 215612, 216487, 216896, 217406, 218220]
52481B18220J259K456M346N358M055J196j098j947k116k098j519o71q02k093k947
52466B21599k316j277j147j289l05J673L376M331M848M661L263J312J38j05l75
52451B38387r28r40q9P70Q44K06q54k196l167k665n04J961L147K745J669R67J037
52434B40390J514J713J318O47K9o54j340j301j20J292J604Q66L07N56J133J678
52418B49632K309K678K047P67L68J447K550K117O59qQ52K248K861K228O45j185
52402B72215k363k226r72L64Q46O05O62J624K628K199K56j422j260K84J765K762
52386B77967L701M172L232J353L69R21J627J384J046J678K596K482J429L70o80
52371C03647k080k892j687R84K754K506J620J499J396l2k147k880j578J84P53
$$ y = [218220, 219479, 221935, 226281, 231639, 235694, 236890, 235792, 233845, 231729, 229631, 228112, 227441, 226639, 224546, 221599, 219283, 218006, 216859, 215570, 215265, 216938, 220314, 224645, 229493, 234154, 237417, 238729, 238867, 238762, 238387, 237459, 236519, 236430, 237200, 238044, 238250, 237396, 235200, 232033, 229368, 228864, 230825, 233972, 236717, 238386, 239353, 240390, 241904, 243617, 244935, 245582, 245611, 244957, 243617, 242316, 242196, 243488, 245092, 245958, 246265, 246821, 247954, 249632, 251941, 254619, 256666, 257433, 257801, 259248, 261798, 263915, 264574, 264566, 265418, 267666, 270527, 272755, 273400, 272215, 269852, 267626, 266654, 267018, 267864, 268469, 269131, 270755, 273383, 275582, 275838, 274416, 273156, 273440, 275205, 277967, 281668, 285840, 289072, 290425, 290794, 291715, 293342, 294726, 295772, 297450, 300046, 302528, 303957, 304327, 303647, 301567, 298675, 296988, 297972, 300726, 303232, 304852, 306351, 307747, 307715, 305568, 302688, 301110, 301294, 302047]
$$ [...]
##END NTUPLES=NMR SPECTRUM
##END=
