##TITLE=Coffee green (TOIB01 0.1000g + 1.5mL buffer 50/50,  450uL extracto + 50uL (D2O+TMS))
without heating, vortex and centrifuged, temperature 0oC.
##JCAMPDX= 6.0         $$ Bruker NMR JCAMP-DX V2.0
##DATA TYPE= NMR SPECTRUM
##DATA CLASS= NTUPLES
##ORIGIN= Bruker BioSpin GmbH
##OWNER= Administrator
$$ 1.72 TOPSPIN		Version 2.1
$$ 2012-03-16 15:32:59.355 -0800  Administrator@X
$$ Compression mode = diff/dup
##.OBSERVE FREQUENCY= 400.13188168
##.OBSERVE NUCLEUS= ^1H
##.ACQUISITION MODE= SIMULTANEOUS (DQD)
##.ACQUISITION SCHEME= undefined
##.AVERAGES= 64
##.DIGITISER RES= 22
##SPECTROMETER/DATA SYSTEM= spect
##.PULSE SEQUENCE= noesygppr1d
##.SOLVENT NAME= H2O+D2O
##.SHIFT REFERENCE= INTERNAL, H2O+D2O, 1, 14.97894
##AUDIT TRAIL= $$ (NUMBER, WHEN, WHO, WHERE, PROCESS, VERSION, WHAT)
$$ ##TITLE= Audit trail, TOPSPIN		Version 2.1
$$ ##JCAMPDX= 5.01
$$ ##ORIGIN= Bruker BioSpin GmbH
$$ ##OWNER= Administrator
$$ $$ C:/Bruker/TOPSPIN/data/jwist/nmr/11-coffee-green-origin/131/pdata/1/auditp.txt
$$ ##AUDIT TRAIL=  $$ (NUMBER, WHEN, WHO, WHERE, PROCESS, VERSION, WHAT)
(   1,<2011-10-06 19:11:04.034 -0500>,<Administrator>,<TOPSPIN>,<go>,<TOPSPIN 2.1>,
      <created by zg
	started at 2011-10-06 19:02:08.112 -0500,
	POWCHK enabled, PULCHK disabled,
       configuration hash MD5:
       DA 63 81 1B EF 4C B5 72 B4 DF EA D9 B4 DB 4C 08
       data hash MD5: 64K
       FF B0 9A 4A 2B FD 66 24 42 76 F6 92 1B 58 19 E8>)
(   2,<2011-10-06 19:11:19.597 -0500>,<Administrator>,<TOPSPIN>,<proc1d>,<TOPSPIN 2.1>,
      <Start of raw data processing
       efp LB = 0 FT_mod = 6 PKNL = 1 PHC0 = 0 PHC1 = 0 SI = 32K 
       data hash MD5: 32K
       B0 48 6D A5 C6 55 6C AF CF C9 F1 59 74 79 62 FE>)
(   3,<2011-10-06 19:11:20.456 -0500>,<Administrator>,<TOPSPIN>,<proc1d>,<TOPSPIN 2.1>,
      <pk PHC0 = 25.6311 PHC1 = 0 
       data hash MD5: 32K
       10 78 B9 C7 2E 43 60 9B 52 9B 78 A0 44 49 E2 FA>)
(   4,<2011-10-06 19:42:03.784 -0500>,<Administrator>,<TOPSPIN>,<audit>,<TOPSPIN 2.1>,
      <user comment:
       TITLE=Coffee green (TOIB01 0.1000g + 1.5mL buffer 50/50,  450uL extracto + 50uL (D2O+TMS))
       without heating, vortex and centrifuged, temperature 0oC.TITLE_END
       data hash MD5: 32K
       10 78 B9 C7 2E 43 60 9B 52 9B 78 A0 44 49 E2 FA>)
$$ ##END=
$$ 
$$ $$ hash MD5
$$ $$ 2F 06 89 74 66 8E 10 EA E2 0B 25 2A F0 55 5D 91
##$RELAX= 
##$RELAX= 
##$RELAX= 
##$RELAX= 
##$RELAX= 
##$RELAX= 
$$ Bruker specific parameters
$$ --------------------------
##$DU= <Z:>
##$EXPNO= 131
##$NAME= <11-coffee-green-origin>
##$PROCNO= 1
##$TYPE= <nmr>
##$USER= <jwist>
##$ACQT0= -8.14109350058272
##$AMP= (0..31)
100 100 100 100 100 100 100 100 100 100 100 100 100 100 100 100 100 100
100 100 100 100 100 100 100 100 100 100 100 100 100 100
##$ANAVPT= -1
##$AQSEQ= 0
##$AQ_mod= 3
##$AUNM= <au_prof>
##$AUTOPOS= <>
##$BF1= 400.13
##$BF2= 400.13
##$BF3= 400.13
##$BF4= 400.13
##$BF5= 400.13
##$BF6= 400.13
##$BF7= 400.13
##$BF8= 400.13
##$BYTORDA= 0
##$CFDGTYP= 0
##$CFRGTYP= 9
$$ [...]
0 120 120 120 120 120 120 120
##$TP= (0..7)
150 150 150 150 150 150 150 150
##$TP07= 0
##$TPNAME0= <>
##$TPNAME1= <>
##$TPNAME2= <>
##$TPNAME3= <>
##$TPNAME4= <>
##$TPNAME5= <>
##$TPNAME6= <>
##$TPNAME7= <>
##$TPOAL= (0..7)
0.5 0.5 0.5 0.5 0.5 0.5 0.5 0.5
##$TPOFFS= (0..7)
0 0 0 0 0 0 0 0
##$TUNHIN= 0
##$TUNHOUT= 0
##$TUNXOUT= 0
##$USERA1= <user>
##$USERA2= <user>
##$USERA3= <user>
##$USERA4= <user>
##$USERA5= <user>
##$V9= 5
##$VALIST= <valist>
##$VCLIST= <CCCCCCCCCCCCCCC>
##$VD= 0
##$VDLIST= <DDDDDDDDDDDDDDD>
##$VPLIST= <PPPPPPPPPPPPPPP>
##$VTLIST= <TTTTTTTTTTTTTTT>
##$WBST= 2048
##$WBSW= 25
##$XGAIN= (0..3)
0 0 0 0
##$XL= 0
##$YL= 0
##$YMAX_a= 5151278
##$YMIN_a= -2176328
##$ZGOPTNS= <>
##$ZL1= 120
##$ZL2= 120
##$ZL3= 120
##$ZL4= 120
##$ABSF1= 0
##$ABSF2= 0
##$ABSG= 0
##$ABSL= 0
##$ALPHA= 0
##$AQORDER= 0
##$ASSFAC= 0
##$ASSFACI= 0
##$ASSFACX= 0
##$ASSWID= 0
##$AUNMP= <proc_prof1d>
##$AXLEFT= 0
##$AXNAME= <>
##$AXNUC= <1H>
##$AXRIGHT= 0
##$AXTYPE= 0
##$AXUNIT= <>
##$AZFE= 0.1
##$AZFW= 0.1
##$BCFW= 0
##$BC_mod= 0
##$BYTORDP= 0
##$COROFFS= 0
##$CY= 15
##$DATMOD= 1
##$DC= 0
##$DFILT= <>
##$DTYPP= 0
##$F1P= 0
##$F2P= 0
##$FCOR= 0.5
##$FTSIZE= 32768
##$FT_mod= 6
##$GAMMA= 0
##$GB= 0
##$INTBC= 1
##$INTSCL= 1
##$ISEN= 128
##$LB= 0
##$LEV0= 0
##$LPBIN= 0
##$MAXI= 10000
##$MC2= 0
##$MEAN= 0
##$ME_mod= 0
##$MI= 0
##$NCOEF= 0
##$NC_proc= -6
##$NLEV= 6
##$NOISF1= 0
##$NOISF2= 0
##$NSP= 0
##$NTH_PI= 0
##$NZP= 0
##$OFFSET= 14.97894
##$PC= 1
##$PHC0= 25.6311
##$PHC1= 0
##$PH_mod= 1
##$PKNL= yes
##$PPARMOD= 0
##$PPDIAG= 0
##$PPIPTYP= 0
##$PPMPNUM= 2147483647
##$PPRESOL= 1
##$PSCAL= 4
##$PSIGN= 0
##$PYNMP= <proc.py>
##$REVERSE= no
##$SF= 400.13
##$SI= 32768
##$SIGF1= 0
##$SIGF2= 0
##$SINO= 400
##$SIOLD= 32768
##$SPECTYP= <>
##$SREGLST= <1H.CDCl3>
##$SSB= 0
##$STSI= 32768
##$STSR= 0
##$SW_p= 8223.68421052629
##$SYMM= 0
##$S_DEV= 0
##$TDeff= 65536
##$TDoff= 0
##$TI= <>
##$TILT= no
##$TM1= 0
##$TM2= 0
##$TOPLEV= 0
##$USERP1= <user>
##$USERP2= <user>
##$USERP3= <user>
##$USERP4= <user>
##$USERP5= <user>
##$WDW= 1
##$XDIM= 32768
##$YMAX_p= 456321706
##$YMIN_p= -1679121
##$CURPLOT= <Network HP LaserJet P1505>
##$CURPRIN= <$Network HP LaserJet P1505>
##$DFORMAT= <normdp>
##$LAYOUT= <+/1D_H.xwp>
##$LFORMAT= <normlp>
##$PFORMAT= <normpl>
##$SURQMSG= 1
$$ End of Bruker specific parameters
$$ ---------------------------------
##NTUPLES= NMR SPECTRUM
##VAR_NAME=  FREQUENCY,     SPECTRUM/REAL,   SPECTRUM/IMAG
##SYMBOL=    X,             R,               I
##VAR_TYPE=  INDEPENDENT,   DEPENDENT,       DEPENDENT
##VAR_FORM=  AFFN,          ASDF,            ASDF
##VAR_DIM=   32768,         32768,           32768
##UNITS=     HZ,            ARBITRARY UNITS, ARBITRARY UNITS
##FACTOR=    0.250966925370065, 1,           1
##FIRST=     8223.43324360092, 7909,         -172753
##LAST=      0,             131703,          -48088
##MIN=       0,             -1679121,        0
##MAX=       8223.43324360092, 456321706,    0
$$ Real data points
##PAGE= N=1
##DATA TABLE= (X++(R..R)), XYDATA
$$ [...]
19696A822067Q3809K57053p10503M66453n8901O0937j42579O0780m6586m7450
19686A745080J32995k49342N5573j51949j57318M35515p6503M4177j72470J77305
19676A783063o2376J31886k77333J36363j77071j4949J97986R4103o2944p4684
19666A674044Q4205k04092o6775K59058m2601Q792l41626N17815l8371M214k47913
19655A606750j17839K42803j64453J09959j33605J17767O7953k94221J22794n7756
19645A500152K23772O8217J87643m30779J5478J34469o9953R3267l46574N93779
19635A969471l75190J9359J55392l64364J09168J36180l0620M4221j06921L1698
19625A588394r5601l8954J22264j46843N0706l1367j40357M2829R0897J03787
$$ plain form
19696 1822067 1905876 2162929 1452426 1918879 1859978 1920915 1778336 1839116 1792530 1745080
19686 1745080 1878075 1628733 1684306 1532357 1375039 1810554 1734051 1778228 1605758 1783063
19676 1783063 1720687 1852573 1575240 1711603 1534532 1519583 1717569 1811672 1748728 1674044
19666 1674044 1758249 1554157 1487382 1746440 1703839 1712631 1371005 1888820 1850449 1854663 1606750
19655 1606750 1488911 1731714 1567261 1677220 1543615 1661382 1729335 1435114 1557908 1500152
19645 1500152 1723924 1792141 1979784 1549005 1564483 1698952 1628999 1722266 1375692 1969471
19635 1969471 1594281 1613640 1769032 1404668 1513836 1650016 1619396 1663617 1556696 1588394
19625 1588394 1492793 1453839 1576103 1429260 1479966 1448599 1308242 1351071 1441968 1545755
19615A545755k18406K64390m29273N5465J36803J60856j97520k2025M1295q042
19605A329298n9006l8413J37846j93177k8136J66761l16641L76061k1246m3839
19595A309508J12170k53905M0169K2687q749j8169L2176J03401K8005j94818K04916
19584A377391j77312J44409j86677l68m8806J47532P5929p5938j07494J04876
19574A253542o7608j85056K47876j68356K3802O250J19661j10292J7707m9887
19564A087639N7914J12579k9510Q984O539q2711l2712q582J81426l6986k1858
19553A242722n2600j03766J15979l5481M6644n1432Q7308n2395J96802Q097Q1498
19542A483376j33934N6096j22881j87693k82997N02548k7561N1563l45322K47588
$$ plain form
19615 1545755 1327349 1591739 1162466 1217931 1354734 1515590 1318070 1296045 1337340 1329298
19605 1329298 1270292 1231879 1369725 1176548 1148412 1315173 998532 1374593 1353347 1309508
19595 1309508 1421678 1167773 1207942 1230629 1221880 1203711 1235887 1339288 1367293 1172475 1377391
19584 1377391 1200079 1344488 1157811 1157443 1108637 1256169 1332098 1256160 1148666 1253542
19574 1253542 1185934 1000878 1248754 1080398 1104200 1110450 1230111 1119819 1137526 1087639
19564 1087639 1145553 1258132 1228622 1237606 1244145 1161434 1128722 1120140 1301566 1264580 1242722
19553 1242722 1190122 1086356 1202335 1166854 1213498 1162066 1249374 1196979 1393781 1401878 1483376
19542 1483376 1349442 1405538 1282657 1094964 811967 1314515 1286954 1338517 993195 1240783
19532A240783j81878p9214J37520k6443p6778K05939j32836J90922j46672Q8547
19522A219890l1616n9740N8522J41744r7009m3397Q3533j34407l1732O0946r6964
19511A069770J29668j13316M7795j57463J21741J14238k93339K47048j21649L3552
19501A078045p8940K18151k85845J03900K29542j84579N6967k15846K47689J29976
19491A299060p8201j78207J51273K2812l57346L66257j16395J19478K5929J08161
19481A362821k24978j89988K3720j94215L7004L11377n39851K01303j16432J32323
19471H03084l2283N3890l7219j36187K38348j24845J15566j98757J81099j08221
19461G54475k6871j54995K50106j91287J64212q1008l8553p061J0525J60247j08819
$$ plain form
19532 1240783 1058905 979691 1117211 1090768 1013990 1219929 1087093 1278015 1131343 1219890
19522 1219890 1188274 1128534 1187056 1328800 1231791 1188394 1271927 1137520 1105788 1166734 1069770
19511 1069770 1199438 1086122 1133917 976454 1098195 1212433 919094 1166142 1044493 1078045
19501 1078045 999105 1217256 931411 1035311 1264853 1080274 1137241 921395 1169084 1299060
19491 1299060 1220859 1042652 1193925 1216737 859391 1225648 1109253 1228731 1254660 1362821
19481 1362821 1137843 947855 971575 777360 814364 1125741 585890 787193 670761 803084
19471 803084 770801 824691 787472 651285 889633 764788 880354 681597 862696 754475
19461 754475 727604 572609 822715 631428 795640 714632 676079 669018 679543 839790 730971
19450G30971O3739J23064j82178J01567R645O2712k76268K43638l291k04634J78815
19439H47780r6004J56689j64384L37658j24368j25837J40680j91531J84238k04186
19429G60735k44533J88513J0667O2906j73911j01886P0282L24889j60904M2560
19419G79318n086n403j89875K77032O6806k18631J46134j77390J0845M422J38290
19408H26462q9783r9043J99701j01279j14331Q2422M8160j80712K76490j48384
19398F99703J95981l43473K14423R6984j02160Q6582r7814J79638J26148k97196
19388G58816J61742q6467K04302l53281L15481l29158p2894K36472p6317m212
19378G54484j5147L1622n9928Q0312j44097L8594Q7882J10725j96587O2752J5246
$$ plain form
19450 730971 794710 917774 735596 837163 846808 909520 633252 876890 873599 668965 847780
19439 847780 751776 908465 744081 1081739 957371 831534 972214 780683 964921 760735
19429 760735 516202 704715 715382 778288 604377 502491 572773 897662 736758 779318
19419 779318 774232 768829 578954 855986 922792 704161 850295 672905 683750 688172 826462
19408 826462 736679 637636 837337 736058 621727 704149 752309 571597 848087 699703
19398 699703 895684 552211 766634 863618 761458 848040 750226 929864 1056012 758816
19388 758816 920558 834091 1038393 685112 1000593 671435 598541 835013 758696 754484
19378 754484 739337 770959 711031 791343 647246 685840 773722 884447 687860 750612 765858
19367G65858l8617J36430r997k46215j6302K93727Q7180k62467J11268p7085J62270
19356I06050j59315N5621j9646J12326j62756J46131q9260k15426M08493l00615
19346F81603J20562K65756k00483R0083j45160K92199k22054M5351J81075M2760
19336A151692j45670q0141k29133K78793j97736J65332j09014j86651K23079j44682
19326G25869k9379K71524l41198J97672J16021k47559J02381j61512J24159j34168
19316F23810J14780k29253K15272P8176j14996J51340k85098J3514J39469j55204
19306E51810K08008J8840k53477N6653p50j68020K66012j37893Q2729R9197p1723
19295F51386j13611J17351l0192N6421L4992p2221m1451J19287k78693R6610N1966
$$ plain form
19367 765858 727241 863671 853674 607459 591157 884884 972064 709597 820865 743780 906050
19356 906050 746735 802356 782710 895036 732280 878411 789151 573725 982218 681603
19346 681603 802165 1067921 867438 957521 812361 1104560 882506 927857 1108932 1151692
19336 1151692 1006022 925881 696748 975541 777805 943137 834123 647472 870551 725869
19326 725869 696490 968014 626816 824488 940509 692950 795331 633819 757978 623810
19316 623810 738590 509337 724609 802785 687789 839129 554031 567545 707014 551810
19306 551810 759818 778658 525181 581834 581084 413064 679076 541183 623912 723109 651386
19295 651386 537775 655126 624934 681355 716347 644126 602675 721962 443269 539879 591845
19284E91845J21857j593J50477k53441K00371j66043j35893K73778j2466o1764
19274G07128o592j58138L4257m5404L0837J18351p6113K78513J3542j87199P8438
19263G87620O8373j32855R9533j63968J16669P8739j32924J46785j58616o6052
19253F43304J00007j21625J94550j49577j40465R2546J14817n3833k7628j11007
19243E41089K59961J70426M286K66697j36812M3785n707j7144P1057k43874m5316
19232I08448j1884r4624k02878K5789M8227j57062L18396p9193P595j66206J61384
19221G57992j28210J62755q6223j08905J14220k1026J995o9104K7911J16381p5203
19210F92583O934n0995k15152J35804Q9978j11448J73094J54980o2493j64199
$$ plain form
19284 591845 713702 712109 862586 609145 809516 643473 507580 781358 768892 707128
19274 707128 700536 542398 576655 531251 562088 680439 604326 882839 896381 709182 787620
19263 787620 855993 723138 822671 658703 775372 854111 721187 867972 709356 643304
19253 643304 743311 621686 816236 666659 526194 618740 733557 679724 652096 541089
19243 541089 801050 971476 975762 1242459 1105647 1149432 1143725 1126581 1197638 953764 908448
19232 908448 896564 801940 599062 624851 673078 516016 834412 755219 762814 596608 757992
19221 757992 629782 792537 706314 597409 711629 690603 692598 623494 651405 767786 692583
19210 692583 699517 648522 433370 569174 659152 547704 720798 875778 813285 649086
19200F49086J30256n053j96693j4628K36183j95069J61774n0687k51324K70588
19190G34433J80068k01373M8457K29230k36591K81511k6875k69233M09919Q1216
19180A230762l76031L9320r9946J36418k76254N496K5878N2802J51877k8796n3159
19169H08367n6411K14457j48634K54974k5559K8306p2535L5667j08112M592j6692
19158I18420j36168J0244J06388k65963k4211L15140j14294n3722K69527j84156
19148H41205P0658j6406m5332R495q4549L3338O3825R1896K9189k0592M7654k13356
19136H07025k338J47162P1555j34736J64091K6865N561k060j09796K10321M2302
19125A225952j35651j66089M23631K1901J63994K6372l5737L91121K83537J67491
$$ plain form
19200 649086 779342 774289 577596 562968 799151 604082 765856 715169 463845 734433
19190 734433 914501 713128 761585 990815 754224 1035735 1008860 739627 1149546 1230762
19180 1230762 854731 894051 794105 930523 654269 659765 685643 738445 890322 861526 808367
19169 808367 751956 966413 817779 1072753 1047194 1075500 1002965 1038632 930520 935112 918420
19158 918420 782252 792496 898884 632921 608710 923850 809556 755834 1025361 841205
19148 841205 911863 895457 850125 859620 775071 808409 872234 964130 993319 972727 1020381 807025
19136 807025 804687 951849 1023404 888668 1052759 1079624 1085185 1083125 973329 1183650 1225952
19125 1225952 1090301 924212 1347843 1369744 1533738 1560110 1524373 1915494 2199031 2366522
19115B366522L43356Q31328J43604K92032L32226M44260M6740k72708j56978m80247
19105C890135l46587q43199m62210l36247J7375k06881J65701m85151J35186j56872
19095A371250L42680m12785q2870J00895J81929J20062O5034M61944J46262L03362
19085B597763N89593M41424L82840J57827N79145K77982M1551k86751j42808k92423
19075D346143j78543p0742k52041q2084k78214o61974l38497M0024k24751m71652
19065A827669J3907R6152k23961k03505k7971J84024r9084K49723j23329K33726
19055A927351j76656M53985M05191K94371L29246M22029M03120L23874K72870
19046D655381J91218j27656J8925p28016k73618n90426n75363m20371k87263J3039
$$ plain form
19115 2366522 2709878 3541206 3684810 3976842 4309068 4753328 4800068 4527360 4370382 3890135
19105 3890135 3543548 2700349 2238139 1901892 1919267 1712386 1878087 1392936 1528122 1371250
19095 1371250 1713930 1301145 1218275 1319170 1501099 1621161 1686195 2148139 2294401 2597763
19085 2597763 3187356 3628780 4011620 4169447 4748592 5026574 5068125 4781374 4638566 4346143
19075 4346143 4167600 4096858 3844817 3762733 3484519 2822545 2484048 2524072 2299321 1827669
19065 1827669 1841576 1937728 1713767 1510262 1482291 1666315 1567231 1816954 1693625 1927351
19055 1927351 1750695 2204680 2609871 2904242 3233488 3655517 4058637 4382511 4655381
19046 4655381 4846599 4718943 4737868 4009852 3736234 3145808 2570445 2150074 1862811 1875850
19036A875850j36994p2314R9348j40692N545J73881j02571J52723K21085K87190
19026B363051l8777L87063J44319L78723L28293K96971P31016N84531K34820N96039
19016F006049J25061L60533o6532N0754K08017L24333L81394P52231O16265J026152
19006I784257J453639J721329J676564K355359J842938J513843J293154Q03896
18998B2444979J26596j116179j807254k253490k576447k635338k406465j448467
18990H327935j250226j336521q85056n74099p51680k26918q9992n35207k57566
18981B420670r2213k4184p62614K23091j89031M01629j01335l72507M6809l4016
18971A516299j06311J92983q4146n2125j01997L91082j86513J97218j35277L02107
$$ plain form
19036 1875850 1738856 1666542 1765890 1625198 1630743 1804624 1702053 1854776 2075861 2363051
19026 2363051 2324274 2711337 2855656 3234379 3562672 3859643 4590659 5175190 5410010 6006049
19016 6006049 6131110 6491643 6425111 6475865 6683882 7008215 7389609 8141840 8758105 9784257
19006 9784257 11237896 12959225 14635789 16991148 18834086 20347929 21641083 22444979
18998 22444979 22571575 21455396 19648142 17394652 14818205 12182867 9776402 8327935
18990 8327935 7077709 5741188 4856132 4282033 3530353 3303435 3213443 2678236 2420670
18981 2420670 2328457 2304273 1541659 1764750 1575719 1977348 1876013 1503506 1550315 1516299
18971 1516299 1409988 1602971 1518825 1466700 1364703 1755785 1569272 1766490 1631213 1933320
18961A933320l38327J35866N0916m567j01623L56403p0251L22262M0624J47513
18951B472136K69030M3753J95852N21825N72612P11983P47401J074053J445680
18942H054325J472827J970739K206699K128702J830053J551830R65386N61722
18934B0742283m96669q86418k328498k329840k231413k311562k010417j417011
18926F730455j429341n52159j055973l39381l51822m05777k42497k42641l12890
18917A797974j21657o6382l80364J93558j11896o5169k12835L00611k57166m2880
18907A033794J09876o0057l76313O8303R8519p0496m0774N6453k5021q3349K88852
18896I99787j95638l4414L124k49682n133J48537R4626m9533j35567J33808l3181
$$ plain form
18961 1933320 1594993 1730859 1781775 1777208 1675585 2031988 1961737 2283999 2324623 2472136
18951 2472136 2741166 2784919 2980771 3502596 4075208 4787191 5534592 6608645 8054325
18942 8054325 9527152 11497891 13704590 15833292 17663345 19215175 20180561 20742283
18934 20742283 20245614 19359196 17030698 14700858 12469445 10157883 8147466 6730455
18926 6730455 5301114 4748955 3692982 3353601 3001779 2596002 2353505 2110864 1797974
18917 1797974 1676317 1609935 1229571 1423129 1311233 1246064 1033229 1333840 1076674 1033794
18907 1033794 1143670 1083613 707300 775603 874122 803626 762852 819305 794284 710935 999787
18896 999787 804149 769735 772859 523177 518044 666581 761207 711674 576107 709915 676734
18885F76734J1569j06031J22924N0978K1032j74900K5226k39172J64277Q9292
18875F41929j26125J41255L6807l5935j25114P8187M5733J49515k90511J73396
18865F89137k88514J87195O4211l09698K42323q3555L330K08929k15838p3335
18855D24185J35971P8872l6189J50806j77898j39623L49169j33019p710n4613
18845E89951J24286j41592j88646L2359O0349j08951J48567J48104l8628j45475
18835D80324M5523R0155K90499j89939m2994k68399J0632j13145L75103k40581
18825D37178K4976K0301K24697j72511J19372n4650k9881o5085J12656B63511
18814F55506J8944B99009M59063j78759m01M4653j4786j58149O0297J32865O0776
$$ plain form
18885 676734 688303 582272 705196 756174 777206 602306 627532 388360 552637 641929
18875 641929 515804 657059 693866 657931 532817 611004 656737 806252 515741 689137
18865 689137 400623 587818 652029 342331 584654 501099 504429 713358 497520 424185
18855 424185 560156 639028 602839 753645 575747 436124 785293 652274 644564 589951
18845 589951 714237 572645 383999 416358 476707 367756 516323 664427 625799 480324
18835 480324 525847 616002 906501 716562 673568 405169 415801 302656 677759 437178
18825 437178 462154 482455 707152 534641 654013 599363 569482 504397 617053 263511
18814 655506 674450 299009 758072 579313 578912 623565 608779 450630 510927 643792 704568
18803G04568j67325j30966K67165j28126q0696J3851K45126k74137j97209L54295
18793F06546J02686j70047r0802J13849J89768C67557J26697P8985K19742j96851
18783E96130R4687J2991l0824j83614J21325J02754j0301k70563K92290K4686
18773G49561k27163j02528K82819q3163j64468J91117k78790J65197M9192L38692
18763I20466D30904O2553K10175j60394m6324K60511B97910K90603l2787n192
18753E50534Q0564o2851j29634M7578M0266o9676K19656j72185P4950J75454C63894
18741G21757k23508n5315J73356k16429R3664J13945j02027J46294j68273J89846
18731F73310j26725q5153K6441p4301M6608k20443L75184p6283o8575p8668J86528
$$ plain form
18803 704568 537243 406277 673442 545316 464620 478471 723597 449460 252251 606546
18793 606546 709232 539185 448383 562232 752000 367557 494254 573239 792981 596130
18783 596130 690817 703808 672984 489370 610695 713449 703148 432585 724875 749561
18773 749561 522398 419870 702689 619526 455058 646175 367385 532582 581774 920466
18763 920466 430904 493457 703632 543238 496914 757425 297910 588513 555726 550534
18753 550534 631098 568247 438613 486191 526457 456781 676437 504252 579202 754656 363894
18741 721757 498249 442934 616290 399861 493525 607470 505443 651737 483464 673310
18731 673310 546585 461432 487873 413572 460180 239737 614921 538638 470063 391395 577923
18720E77923l3187J19248j67712A86656M30938j16955q569M0463L1501O1987k92647
18709C33374K60384O952j95856J01844l8119K235j0492R5674k6610J2369q557
18698E33198K21981l01757P5583j44017K24760Q2541j53522j37767Q988L60549
18688G70537L8707k81420J83943j66100j30895K44784j44151J20327B86328M34847
18678G21175j78775J28285P9681j97129k51578L13687K16335l43742J2961P7724
18668E78624J81660j30196L7040J3804N2418j05459l3967j77342k0050K02141
18658E98673B99201Q8516J94948Q9493k68230j10240J54417R8214k51648L03238
18648E97909j45j80939M0066Q273r7453K08811j23590J9242j79243Q4743L3213
$$ plain form
18720 577923 544736 663984 496272 186656 617594 500639 492070 532533 564034 626021 333374
18709 333374 593758 600710 404854 506698 468579 470814 460322 555996 529386 541755 533198
18698 533198 755179 453422 529005 384988 609748 692289 538767 401000 409988 770537
18688 770537 809244 527824 711767 545667 414772 659556 515405 635732 286328 721175
18678 721175 542400 670685 750366 553237 301659 615346 831681 487939 500900 578624
18668 578624 760284 630088 667128 680932 733350 627891 593924 416582 396532 598673
18658 598673 299201 387717 582665 672158 403928 293688 448105 546319 294671 597909
18648 597909 597764 416825 456891 465164 367711 576522 452932 472174 292931 377674 410887
18637D10887j8218O0109K0596N2773J35396j88225o598O8639m2346J93819k56977
18626D29855j23694O4552J12874l8658P8117J0620R0659K9884B37360J05063J38318
18615D80741r2974N3423K61993j74733N4448J424q0500J00905o6653K45385k10354
18604E73105M8262q0175Q3931j23184J55787N4044j00739L3111k03446J22523
18594E63219R9123r2R0863k78455J97245j7754j92593J86928p9881O3355m7708
18583E84250L9035o2099k79635K85127O5251r7997J32999M0622j92112K11778
18573G27219l6161k10180J11362P5230m7287M5927k21325K56299k22721J07418
18563E85781j14176J59783p1600r4197K8070J11775j89108R240N4963M6070B46330
$$ plain form
18637 410887 392669 452778 473374 526147 661543 473318 466720 535359 493013 686832 429855
18626 429855 306161 370713 483587 444929 523046 533666 624325 654209 237360 342423 480741
18615 480741 387767 441190 703183 528450 582898 584322 503822 604727 538074 783459 573105
18604 573105 621367 541192 625123 501939 657726 711770 611031 644142 440696 563219
18594 563219 662342 662250 753113 474658 671903 654149 461556 648484 568603 631958 584250
18583 584250 623285 561186 281551 566678 631929 533932 666931 707553 515441 727219
18573 727219 691058 480878 592240 667470 620183 666110 444785 701084 478363 585781
18563 585781 471605 631388 559788 465591 493661 605436 416328 425568 480531 526601 246330
18551E72473N3039q4425q4587k309J21330j54453N4926J08694k61010J26832J01615
18540E52125o5552l2318L5413j1875K38906l43165P3968J7377j39182k138K73473
18529E97032k6716l6335o3544j34144J65496N258P3998O3360k45742J80063j2157
18518E66569j00359M6422j10223J86953j88197m1497J87558r6148J91713B85899
18507F25703B49635K17153o0170K54588j40581j67696L15638j28657k390n7678
18497D79842Q745O9195M0664r8632p4200J03817N7853j613j50162M4859K74379
18486G54747l35796K34301j11914K4938K79138C57361Q0607L10086C26783L54593
18476F81376j18334k09212K53451N1542j16393P2177J15931j39875K0186n5625
$$ plain form
18551 572473 625512 541087 456500 454191 575521 421068 475994 584688 323678 450510 552125
18540 552125 486573 454255 489668 477793 716699 373534 447502 464879 325697 323559 597032
18529 597032 570316 533981 470437 336293 501789 507047 581045 644405 398663 578726 566569
18518 566569 466210 512632 402409 589362 401165 359668 547226 451078 642791 285899
18507 625703 249635 466788 406618 661206 520625 352929 668567 539910 537520 479842
18497 479842 488587 557782 598446 499814 425614 529431 587284 585671 435509 480368 754747
18486 754747 418951 653252 541338 566276 845414 357361 437968 748054 326783 681376
18476 681376 563042 353830 607281 658823 542430 614607 730538 590663 610849 555224
18466E55224P5926j50084R9206Q0639K64901k07806j3873m4078m328K36704j22786
18455G69645j74568N0673J4526l1786o1002O7487J39575j43083k43242Q1064j64392
18444C04897M39445k35114J30600B86993L08157J69820j57811j77207L63377j25610
18434F67719j68993K87875j49883N8147k07336J53221J43108j40880j68773J93789
18424F67994k17930K81315k51970J07583Q0921q9884k56626j27360J88050m5567
18414C36526L56505j25984j54494Q2782p3125M5083J37075P5194p7466j50036
18404D52060j90742K44221m8074o8569N5356J29128k79100K82595j47790J29904
18394E58989J65683k90506M5800J6615A80580M66952o8054q6730R1996j55071
$$ plain form
18466 555224 631150 481066 580272 660911 925812 718006 704133 660055 655727 892431 769645
18455 769645 595077 645750 660276 628490 567488 634975 774550 631467 388225 469289 304897
18444 304897 744342 509228 639828 286993 595150 764970 607159 429952 793329 667719
18434 667719 498726 786601 636718 694865 487529 640750 783858 642978 474205 667994
18424 667994 450064 731379 479409 586992 667913 578029 321403 194043 382093 336526
18414 336526 693031 567047 412553 495335 422210 467293 604368 679562 602096 452060
18404 452060 261318 505539 457465 388896 444252 573380 294280 576875 429085 558989
18394 558989 724672 434166 479966 496581 180580 647532 579478 492748 584744 429673
18384D29673o3275j77407L63190L981r1883j10456m0026l8326J64620l221J24749
18373E61619j23441R7650K6495B38366K77448j33987K75683q8801Q6257r5925
18363E59041J43216J1525j10515M5857k83997N3073Q468o4955K28633j22468J31351
18352E99229R277N769N6944J30136j53166K77J40874K6244j20954j80291K531
18341E16870J91636k95085K61802j41144L0269J8406L4336j81160K09283j50537
18331D94676j1762O7728j24662Q9342M1870J4304J8884m193q7643J18332k06217
18320D10659K52866q2290m9546l408l6963O2140M6900N6561n078q3535n4679j48268
18308C65359J24518J24327j67781K7102J5693k37866K19874J600k06511O3387
$$ plain form
18384 429673 366398 188991 552181 556162 464279 353823 313797 275471 440091 436870 561619
18373 561619 438178 535828 562323 238366 515814 381827 657510 568709 654966 559041
18363 559041 702257 713782 603267 649124 365127 418200 426668 361713 590346 467878 599229
18352 599229 608506 614275 671219 801355 648189 648466 789340 815584 694630 514339 516870
18341 516870 708506 413421 675223 534079 564348 582754 617090 435930 645213 494676
18331 494676 482914 550642 425980 515322 557192 571496 590380 586187 498544 616876 410659
18320 410659 663525 581235 531689 528281 491318 553458 600358 656919 651841 568306 513627 365359
18308 365359 489877 614204 446423 473525 489218 251352 471226 472826 266315 329702
18298C29702K88824j20649N0356j38700j23318K42033q2469J90425j81072j34069
18288C21063J52905G1272M27512L07470D02619K20053k40050Q2629K20520k28457
18278D57314N0523J40781o2912k17145N8713k0187J33326l0298l3270J22123n2095
18267E46873B54394L85071j42552K95198l35178o7794L5724L287p7574M8552O2569
18256D61697R1774K0252R832K1273k6464k49083K11637m0387j19373P9999J00138
18245E61295L776j22781P7196l646r5399Q8591M7455k09987L24992B37013J01572
18234C38585K36666j73652J04399j67652Q4267j15446M7631P9569j34269R2147
18224C92245L777J90955j6333J60137l18978J56514j44015M2087P2892j63177
$$ plain form
18298 329702 618526 497877 548233 409533 286215 528248 445779 636204 455132 321063
18288 321063 473968 71272 498784 806254 402619 622672 382622 465251 685771 457314
18278 457314 507837 648618 585706 368561 427274 407087 540413 510115 476845 598968 546873
18267 546873 254394 639465 496913 792111 456933 389139 424863 428150 350576 399128 461697
18256 461697 553471 573723 583555 604828 578364 329281 540918 500531 381158 461157 561295
18245 561295 565071 442290 519486 515840 420441 509032 556487 346500 671492 237013 338585
18234 338585 575251 401599 505998 338346 422613 307167 354798 434367 300098 392245
18224 392245 396022 586977 570644 730781 411803 568317 424302 466389 539281 376104
18214C76104j75733P6369L64281k90479J64864O0692j01951M9802m5509k2919
18204D55521l460K36432k88644k4381L39479K44534l63836Q4751j90764Q9662
18194E79294K29314j99960J08522l33938J65928L8724N1995J33134j62338j16765
18184D93910k9368j71141K10057A93207r934L45043k644n5725P9294j72454L0051
18173D06838K1939J94899k4000j3142j71732R5707j74280J77676J21229k76389
18163C58745K84486j91810J86714j72155J73096j37626J84070k84228J81768j65942
18153D17118J5510M3307j5095l0742r554N8076K5861J31169o6268L0675k03591
18142C96466A79741K05427L3281P7702K5439K25472l66776R4194R2565p2296J02384
$$ plain form
18214 376104 200371 276740 641021 350542 515406 576098 474147 523949 478440 455521
18204 455521 452061 688493 399849 375468 714947 959481 595645 680396 489632 579294
18194 579294 808608 608648 717170 383232 549160 587884 639879 773013 610675 493910
18184 493910 464542 293401 503458 193207 183273 528316 525672 469947 549241 376787 406838
18173 406838 428777 623676 599676 586534 414802 510509 336229 513905 635134 358745
18163 358745 643231 451421 638135 465980 639076 501450 685520 401292 583060 417118
18153 417118 432628 475935 460840 430098 420544 478620 504481 635650 569382 600057 396466
18142 396466 179741 385168 418449 496151 521590 747062 380286 474480 567045 494749 597133
18131E97133l7434n2921J2121Q3973r0463B42337Q0668J70001M9003j84035K14322
18120E72296p8582q8695L51726k92203j0561K12396j10186k20626M16170j91824
18110E59911j11378Q9572K3172J19860j41582q4494J83694j24832n1517j99241
18100B63165J82239J46594k64934o1918K75573n9479J29113R7782l08655j04661
18090B94819N9947L43939C43132J03371K4983o0803J23554j73741K56171j74342
18080D42325K96445l47256J79992K2177j58213r4166M2627m2899Q6616j65572
18070B62076K55983A65520J97654P5808k04608J88058J05014J9333n1470k13598
18060B81711K13750N5410j67238L9220m7550J71922R6263k58926J62786j50024
$$ plain form
18131 597133 559699 506778 518899 602872 512409 242337 323005 493006 542009 357974 572296
18120 572296 493714 405019 756745 464542 453981 666377 556191 335565 751735 559911
18110 559911 448533 538105 561277 681137 539555 455061 638755 513923 462406 263165
18100 263165 445404 591998 327064 265146 540719 481240 610353 708135 399480 294819
18090 294819 354766 698705 343132 446503 471486 410683 534237 360496 616667 442325
18080 442325 738770 391514 571506 593683 435470 341304 383931 341032 427648 262076
18070 262076 518059 165520 363174 438982 234374 422432 527446 546779 495309 281711
18060 281711 495461 550871 383633 422853 375303 547225 643488 384562 547348 397324
18050C97324J50792j19988j9560j41347K19262n6816p6602o0945L6211B3889K56880
18039B80769J76963k9355Q8543n1446J87265B39481j1570L07732k0409l0410j86599
18028B98225J43350R1789r0484p2397l2993K01766o289J74508l26044j2867J11581
18017D80145P7704n1188R7895r233j82549n8995Q1463j6052J03664K0990p0629
18006D73215N9820J19630B23080L54112B49725K70558J23015j7655j05593B26597
17995E59304N9702A68888M30952j15433j2304J71055C10341J80783l638J29370
17985F16856m0769J8384j07490j09730o9225O0400r5641J67557J55577P9059j88168
17974D86810J33001p8930m7997o2487J42287o0038j0005m8313j19053L70640k54786
$$ plain form
18050 397324 548116 428128 408568 267221 486483 429667 353065 292120 328331 23889 280769
18039 280769 457732 428377 516920 465474 652739 239481 227911 535643 515234 484824 298225
18028 298225 441575 533364 442880 370483 337490 539256 532967 707475 381431 368564 480145
18017 480145 557849 506661 604556 595323 412774 353779 435242 419190 522854 543844 473215
18006 473215 533035 652665 223080 577192 249725 520283 643298 625643 520050 226597
17995 559304 619006 168888 599840 484407 472103 643158 310341 491124 487486 616856
17985 616856 576087 594471 486981 377251 308026 368426 272785 440342 595919 674978 486810
17974 486810 619811 540881 492884 430397 572684 512646 502641 454328 335275 705915 451129
17963D51129q7574p230j63996J85587o1479J18680k1625P3797J80481k21857J21885
17952E67798j12618O4873k24854K19521j88987J99254J35153l11264n050L07300
17942F51126C22526J68650k3399o6656M0368k9775P8932J66980k09700J88230
17932F36156k40268Q3810j77947J88194K73864j24191N774m891K37988k35784
17922F42705j66541J08234J02331j64053m0423Q1100j414r2P3581R6597j31362
17911F00663P6977k07835J77653o5346J8997M4856j62827J24300j87881L64393
17901G83950j78152O4492m9371R4829l32702K03898k2610P508j2372j79183J45404
17890E25691l4017O9111k59530M70502k07283m2892J08733j27807L0232J19628
$$ plain form
17963 451129 363555 356325 192329 377916 316437 435117 413492 487289 667770 445913 567798
17952 567798 455180 520053 295199 514720 325733 524987 660140 348876 343826 651126
17942 651126 322526 491176 467777 401121 441489 411714 490646 657626 447926 636156
17932 636156 395888 479698 301751 489945 763809 639618 645392 640501 878489 642705
17922 642705 476164 584398 686729 522676 482253 563353 561939 561847 635428 732025 600663
17911 600663 677640 469805 647458 582112 601109 645965 483138 607438 419557 783950
17901 783950 605798 670290 620919 715748 383046 586944 564334 571842 559470 380287 525691
17890 525691 491674 560785 301255 771757 564474 521582 630315 502508 532740 652368
17880F52368j67362P6039o3737J3139J09715M3599J10486k41646J49064j26834
17870E54831Q6541L7418k58576J84005j30704o0861J80025Q558O3269m1673p3237
17859E49596J9758n2988J12046n7876K0986O4447l1591m8316M083Q8829j03163
17848E65811j20995O9389J82466M8360j6319J04641D15585J29245J00355O5809
17838G10994k8546q3686m0245O0009q8696M9542j70287K55422P9607p0774K04647
17827H77987l38709K29573k96625j806J98620K53517l57172K23316k0232O938
17817G75407J50689R0370k5905l1532J0265Q4543O355J697m4553L0100j29478
17806I17958k24651J12859m726K05705l96398K42220J50445n0438J61266j47263
$$ plain form
17880 652368 485006 561045 497308 510447 620162 663761 774247 532601 681665 554831
17870 554831 641372 678790 420214 604219 473515 412654 592679 601237 664506 622833 549596
17859 549596 569354 516366 628412 570536 591522 655969 624378 576062 580145 668974 565811
17848 565811 444816 514205 696671 745031 728712 833353 415585 544830 645185 710994
17838 710994 682448 598762 558517 618526 529830 579372 409085 664507 744114 673340 877987
17827 877987 539278 768851 472226 470420 669040 922557 565385 788701 768469 775407
17817 775407 926096 1016466 990561 959029 969294 1053837 1060192 1061889 1017336 1047436 917958
17806 917958 693307 806166 801440 1007145 610747 852967 1003412 952974 1114240 966977
17796I66977J86437k6580r1444l77061J0944r9176J62573l0117q1847L5733j70861
17785D85578O3042K3081j78971J31927J19636M3918k54254M34251k27407L8555
17775F79356j2639r5271O6632k15824O4891Q2048J32788q7060j42944K01691J6225
17764F89893k65989K00786K4738j39376k0980K72108j98961K64754K2485D13818
17753D23176k9486q244J4167K43664j20942R8750q0598J15221M3214j29687O4979
17742F34214J09756j81608J64307r2842j56531J05697j566L0409K1324r1538R0915
17731F32537l9839P4017j83618J25496k0901m3319N7935j3437O259O102q5634
17720E15598J7730J19036j95902J10619O3305J246o4909K01862k65011J71006
$$ plain form
17796 966977 1153414 1126834 1035390 658329 669273 570097 732670 702553 620706 656439 485578
17785 485578 548620 571701 392730 524657 644293 688211 433957 868208 640801 679356
17775 679356 666717 571446 638078 422254 487145 569193 701981 614921 471977 673668 689893
17764 689893 423904 624690 649428 510052 489072 761180 562219 826973 849458 413818
17753 423176 393690 385446 399613 643277 522335 621085 540487 655708 698922 569235 634214
17742 634214 743970 562362 726669 633827 477296 582993 581427 611836 633160 541622 632537
17731 632537 592698 666715 483097 608593 587692 544373 602308 588871 595130 601232 515598
17720 515598 533328 652364 456462 567081 630386 631632 566723 768585 503574 674580
17710F74580j93708K21594R2284j08370r7782j728k63999K24790K0443J21182
17700F89286j86663o925k1009K01743K453j9141J62187l02580K78122k24640m7619
17689E25214j56613L32457m1589q7647k23859K20647J62897k38799L61610p6154
17679G78164k06036B75695L28225J68670k48192J59182k8638J7570l29785M37650
17669G80377j73257l7646K40717j55024q7408J10228N2572K91655m90284M06568
17659I38498k65293O3924L7479p4802j85959K84077l53555L05809Q5670k88085
17649E47763J45418j36571L59950m46697J97326J29135k27381J17107J49674j56403
17639F79321K39524q8150M7043r2517m4256j8749L55148k0516j26573j37727J75034
$$ plain form
17710 674580 480872 702466 794750 686380 588598 586870 322871 547661 568104 689286
17700 689286 502623 495698 474689 676432 678885 659744 821931 519351 797473 572833 525214
17689 525214 368601 701058 659469 571822 347963 568610 731507 492708 854318 778164
17679 778164 572128 275695 603920 772590 524398 683580 654942 672512 342727 780377
17669 780377 607120 569474 810191 655167 567759 677987 730559 1022214 531930 938498
17659 938498 673205 737129 774608 699806 513847 797924 444369 750178 835848 547763
17649 547763 693181 556610 916560 469863 667189 796324 568943 686050 835724 679321
17639 679321 918845 830695 877738 785221 740965 722216 1077364 1056848 930275 792548 967582
17628I67582J22768m03367L66148k50845J55461J11172j87672N0642J93415m6171
17618A079133k61809n42m0537L38116l3903r2918J48512l5255m0671n182j09528
17607I45416J88638k39560K15438l0049k92199L10400j24074j05235J18687P362
17597I94824L5445J21567j32975N1487q4666K39617o0946l3351K6535m2191j18598
17586I96748j19975J87322j21889J08874K47924k38532K7602K82419j13293n8931
17576A198269m1610l6215J84684l4662K18753j22371j51004J9676k15269K53888
17566A274139j11986j8267p5462j45974M116M3534K77216J3684j55561O5724j28895
17555A042268j1568L9047P3916q116K88659l33739J08679j36025M93754l52906
$$ plain form
17628 967582 1090350 686983 1053131 802286 957747 1068919 881247 931889 1125304 1079133
17618 1079133 817324 816782 776245 1114361 1080458 987540 1136052 1100797 1060126 1054944 945416
17607 945416 1134054 894494 1109932 1079883 787684 1098084 974010 868775 987462 994824
17597 994824 1030269 1151836 1018861 1070348 985682 1225299 1164353 1131002 1157537 1115346 996748
17586 996748 876773 1064095 942206 1051080 1299004 1060472 1088074 1370493 1257200 1198269
17576 1198269 1156659 1120444 1305128 1270466 1489219 1366848 1215844 1235520 1020251 1274139
17566 1274139 1162153 1143886 1068424 922450 926566 970100 1247316 1261000 1105439 1171163 1042268
17555 1042268 1030700 1069747 1143663 1135547 1424206 1090467 1199146 1063121 1556875 1203969
17545A203969K58570J12462k62915M7988q789l298J05355k56892L7099P6350o4063
17534A245836j21045n3751K31156j619j34407K89940l52109n7586M01008j03263
17524A344160R709J32323k47395K48322l4448P0582k95380K21275L48166l47454
17514A449860L61991R9212n0296M1964L48382j34426K54677L6768k5005J70186
17504B553313J29655l7000k20023K86783r3280J82619K35155K44952M75816J75852
17494C933842J50478N28491N24496O44073R41477J453502K301106L781285N917321
17485B0176071Q463435J1824504J3769428J4656360J2158984R655694O551934
17478I7256410K784409k435920q852313j2477688j3560388j2150592q930727m168568
$$ plain form
17545 1203969 1462539 1575001 1312086 1360074 1351285 1347987 1453342 1196450 1233549 1309899 1245836
17534 1245836 1124791 1071040 1302196 1300577 1166170 1456110 1104001 1046415 1447423 1344160
17524 1344160 1353869 1486192 1238797 1487119 1452671 1523253 1227873 1449148 1797314 1449860
17514 1449860 1811851 1911063 1860767 1902731 2251113 2116687 2371364 2408132 2383127 2553313
17504 2553313 2682968 2645968 2425945 2712728 2619448 2802067 3037222 3282174 3757990 3933842
17494 3933842 4084320 4612811 5137307 5781380 6722857 8176359 10477465 14258750 20176071
17485 20176071 28639506 40464010 54233438 68889798 81048782 90704476 97256410
17478 97256410 100040819 97604899 88752586 76274898 62714510 50563918 41633191 37464623
17470C7464623R43623O462387J1011652J2949831J2243248R598399O711054L281894
17462A00666711j698465p395508j2914725j5674712j4991272j3603986j0737948
17455B3650095p785028n008107k527412j876462j137939p64748k78759k04660
17447D066980k93063j67034P0178j52911K44392j85417k3470j77397M2414l22167
17437C102505J4681k70192J09704j56904J2979K48549k67594J48019J16830K77781
17427C336358J15402n85494J85494m99632j6156k98401K49874m53103M1689J3420
17417B089451j81720L4442o9393K24730j12940j13293O1111J80326m13059K20315
17407A919970J22497K71734k40533L64364j60605K1389P5115r3978K48498K03551
$$ plain form
17470 37464623 38408246 44870633 55882285 68832116 81075364 90673763 97384817 100666711
17462 100666711 98968246 91572738 78658013 62983301 47992029 34388043 23650095
17455 23650095 15865067 10856960 8329548 6453086 5315147 4550399 4271640 4066980
17447 4066980 3773917 3606883 3677061 3524150 3768542 3583125 3559655 3382258 3424672 3102505
17437 3102505 3117186 2846994 2956698 2799794 2812773 3061322 2793728 2941747 3058577 3336358
17427 3336358 3451760 2866266 3051760 2552128 2535972 2237571 2487445 2034342 2076031 2089451
17417 2089451 1907731 1942173 1872780 2097510 1984570 1871277 1932388 2112714 1699655 1919970
17407 1919970 2042467 2314201 2073668 2438032 2277427 2298816 2373931 2279953 2528451 2732002
17397B732002J23582K44085J44191L48399O81922L51706L5898P86409L72160K07040
17387F027394K76172R9514J23387M6309m666m18722k40555k39530l17850j05332
17377E246121m1395L19956j31162R9933L23274K19473L47314N23792L95984j05144
17367G198146L01379L076N6028l0999l13136o5043j94195k56315q384j15896K37873
17356F812534L05K48022M41526K11327M13250P48877O33913N22168Q10241M80068
17346A1322231M59023O93200M281J65160J67813k6577o86195j85207l15157n41520
17336A1057052k08325l16028j89913J39321R8142L33659M12489K71887L86130
17327A1984414L02047L23646k01723J82112k59485P518n6208j3004n01194m55017
$$ plain form
17397 2732002 2855584 3099669 3243860 3592259 4274181 4625887 4661785 5448194 5820354 6027394
17387 6027394 6303566 6403080 6526467 6572776 6568110 6149388 5908833 5669303 5351453 5246121
17377 5246121 5204726 5524682 5393520 5493453 5816727 6036200 6383514 6907306 7303290 7198146
17367 7198146 7499525 7502601 7558629 7527630 7214494 7149451 6955256 6698941 6690557 6574661 6812534
17356 6812534 6812839 7060861 7502387 7713714 8126964 8875841 9509754 10031922 10842163 11322231
17346 11322231 11781254 12474454 12478735 12643895 12811708 12785131 12098936 11913729 11598572 11057052
17336 11057052 10848727 10532699 10342786 10482107 10580249 10913908 11326397 11598284 11984414
17327 11984414 12286461 12610107 12408384 12590496 12331011 12338529 12282321 12269317 11768123 11313106
17317A1313106n30506j40439p3934n40945j23149P5880j87437K60471k28017M00533
17307A0225563L92312L21471L32104J48022K08009K23462j9915k8612k27787l66191
17297A1208438j46907o46273k66030j56913k96253J82423N2864L4358J63974J34812
17287A0264493K92311J05743M7750j50164k66051r9694o15758k91580n27375q16654
17277G943021n15836q40284n81753m75629m15100k54305m61506k8307k55894j89952
17267C924455m9855q2540k5738r4826q8930l10693J38943p1727L8800l584k97069
17256C077236K79359k43702k4122k35599j04362K39432j90424k20791J72633P273
17246B756933q3426K67098k23638k00365M67600l35228o5606J79227k39131l147
$$ plain form
17317 11313106 10782600 10642161 10568227 10027282 9904133 9980013 9792576 10053047 9825030 10225563
17307 10225563 10617875 10939346 11271450 11419472 11627481 11850943 11831028 11802416 11574629 11208438
17297 11208438 11061531 10415258 10149228 9992315 9696062 9878485 9931349 9965707 10129681 10264493
17287 10264493 10556804 10662547 10710297 10560133 10294082 10194388 9578630 9287050 8759675 7943021
17277 7943021 7427185 6586901 6005148 5529519 5114419 4860114 4398608 4370301 4114407 3924455
17267 3924455 3874600 3792060 3766322 3671496 3582566 3271873 3410816 3339089 3377889 3374305 3077236
17256 3077236 3356595 3112893 3088771 2853172 2748810 2988242 2797818 2577027 2749660 2756933
17246 2756933 2673507 2940605 2716967 2516602 2984202 2648974 2583368 2762595 2523464 2520317
17236B520317Q8927M0520l5988j30993j43589k12573J48432J0018m513L2161o1954
17225B250765K1050J26745J36435j65530m8470j49693J77811P6976K55566k11510
17215B470145k2233q4240J16843q8791N6022j19117L23473k87677j47202J08212
17205B325435j49217M11817l88760j25781j10995K28320n7291m5186k78022j1561
17195A798759j19314L28537n44664J03380k2165K7717n6568K338p4471M0827L7590
17184A521966P2378j00908M3697p5352n9984N5226j5020J81750j35441P463j47939
17173A347836L22026r1045K074J27219j92475K80565l6943J13334p0909R793j43844
17162A667631J8503L1783Q5335j17868R3835j2596p6643J79995J2009Q860M9720
$$ plain form
17236 2520317 2609244 2649764 2613776 2482783 2339194 2126621 2275053 2285071 2280558 2312719 2250765
17225 2250765 2271815 2398560 2534995 2369465 2320995 2171302 2349113 2426089 2681655 2470145
17215 2470145 2447912 2363672 2480515 2391724 2447746 2328629 2652102 2364425 2217223 2325435
17205 2325435 2176218 2588035 2199275 2073494 1962499 2190819 2133528 2088342 1810320 1798759
17195 1798759 1679445 2007982 1463318 1566698 1544533 1572250 1515682 1518020 1443549 1484376 1521966
17184 1521966 1594344 1493436 1537133 1461781 1401797 1457023 1442003 1623753 1488312 1495775 1347836
17173 1347836 1669862 1578817 1580891 1708110 1515635 1796200 1759257 1872591 1801682 1811475 1667631
17162 1667631 1686134 1717917 1803252 1685384 1779219 1766623 1689980 1869975 1881984 1890844 1940564
17151A940564l4810m8833J00510P7207l97502O42356l68287N0494O3233K66384
17141B291316p4249o438j07176l5755P6496J56302k01474K11100N197l80424J97088
17130B131983k01927l1937o2362J85738K2755q2289J6840K88000N5069j56293
17120B165577m1957P7776N182R0303j48855m4537J26143N8697J27996l00559J55062
17109B270828j01071M29726L1402l8569l20455K69436j58857R9112k65839l7542
17099B178171J63025j0340j91144O873O5854l35728j46640l94812K20649m30896
17089A125012L49622j79072k7426j04288j125J28n7720J57922j43122J04561J0021
17078A234513R5173k81821P8779R6337j43394R7168K9520j47635Q8431K07535
$$ plain form
17151 1940564 1905754 1856921 1957431 2034638 1637136 2279492 1911205 1961699 2024932 2291316
17141 2291316 2217067 2210629 2103453 2067698 2144194 2300496 2099022 2310122 2315319 1934895 2131983
17130 2131983 1930056 1898119 1835757 2021495 2044250 1961961 1978801 2266801 2321870 2165577
17120 2165577 2123620 2201396 2206578 2296881 2148026 2103489 2229632 2288329 2416325 2115766 2270828
17109 2270828 2169757 2599483 2630885 2592316 2271861 2541297 2382440 2481552 2215713 2178171
17099 2178171 2341196 2330856 2139712 2146585 2212439 1876711 1730071 1335259 1555908 1125012
17089 1125012 1474634 1295562 1268136 1163848 1162723 1162851 1105131 1263053 1119931 1224492 1234513
17078 1234513 1329686 1047865 1126644 1222981 1079587 1176755 1206275 1058640 1147071 1354606
17068A354606j91509j51340J68575l2366p4406K96176k17234J59764q985j44964
17058A158317J52473J36930m006K55948L72724L3180K42064J66152J69676j64432
17048B519026M7771Q9233q7930K2241K20937K05973l06206K86176J67625p5739
17038C089107j87255J45972k10000K09590l42970r087k73600k89203p082l32278
17028A793194K11218l86511j1362K89150l08756k45952P8868q5847R2397J3511
17018A439910j52608j25144o6984J69694m22155K44139J51495k36216K31340l06816
17008I26655J26503j76k18924J67401p4005K95542J2071l7024j06136P9191q557
16997A162541j92320L15649j01744M5008L972j51506K46554k18902j48383L4057
$$ plain form
17068 1354606 1163097 1011757 1180332 1147966 1073560 1369736 1152502 1312266 1303281 1158317
17058 1158317 1310790 1447720 1443714 1699662 2072386 2105566 2347630 2513782 2683458 2519026
17048 2519026 2566797 2656030 2568100 2590341 2811278 3017251 2711045 2997221 3164846 3089107
17038 3089107 2901852 3047824 2837824 3047414 2704444 2695357 2421757 2132554 2125472 1793194
17028 1793194 2004412 1617901 1606539 1895689 1586933 1340981 1419849 1334002 1426399 1439910
17018 1439910 1287302 1162158 1095174 1264868 842713 1086852 1238347 1002131 1233471 926655
17008 926655 1053158 1052982 834058 1001459 927454 1222996 1235067 1198043 1091907 1171098 1162541
16997 1162541 970221 1285870 1184126 1229134 1233106 1081600 1328154 1109252 960869 994926
16987I94926K11331J94335j29561r3081j08454K10595O6249j0784j33304k5049
16977A177203N86652l22111n1846P7502j47828k5246J55952J35907r0405K53018
16967A748798J2094J12361j93600L05886n7601L27895m7016J31857J14442j30204
16957B324912P0132m5750J97359p4569j47161K0430k1766j27111j75763J32438
16947B153151j09205J09037m56156J75484l29868J36841k12309k44508K26665
16938A449132l58359K78980m9299k26114J71213l00528Q1146q242J5017R851q867
16927A053930J00060K5175k61105P3548j65091K01757p9453j02671r1492J34419
16917H89077q1432L75166j40230k38191K20486J22050l38662O0395K8070k4076
$$ plain form
16987 994926 1206257 1400592 1271031 1177950 1069496 1280091 1346340 1335556 1202252 1177203
16977 1177203 1763855 1441744 1389898 1467400 1319572 1294326 1450278 1586185 1495780 1748798
16967 1748798 1760892 1873253 1679653 1985539 1927938 2255833 2208817 2340674 2455116 2324912
16957 2324912 2395044 2349294 2546653 2472084 2324923 2345353 2323587 2196476 2020713 2153151
16947 2153151 2043946 2152983 1696827 1872311 1542443 1679284 1466975 1222467 1449132
16938 1449132 1090773 1369753 1320454 1094340 1265553 965025 1046171 1037929 1052946 1062797 1053930
16927 1053930 1153990 1179165 918060 991608 826517 1028274 948821 846150 754658 889077
16917 889077 807645 1182811 1042581 804390 1024876 1146926 808264 868659 896729 872653
16907H72653q2294l3444J53711j31383J0736J42475o7806P9112M8875k88694N1039
16896G54980n0593l3080J34174n3661o2206K82682k40876K33864k67947k33438
16886D63899J02407J35377n7020q9384Q5831m007P5723n152O3933j58994K70393
16875H83006J2210m0076p1118j21739n905J50036M0210p8151J00615m0700J09755
16864I38143j12515R5068m0862p8798R7429q3007j05917M4039J03202j09697q7785
16853F59300J51677J17785p1212j9975j6145J19429k81599J58118r8665l17149
16843D01564J80713J58813O1630j19616K44465l76683J80650L8644K99900k31536
16833H38544M9266P6508l7817j26902K59436k06391L7411J38271R1321J72333
$$ plain form
16907 872653 790359 756915 910626 779243 789979 932454 864648 943760 992635 703941 754980
16896 754980 704387 671307 805481 751820 689614 972296 731420 965284 697337 463899
16886 463899 566306 701683 644663 555279 641110 637103 712826 707674 771607 612613 883006
16875 883006 895216 855140 784022 662283 656378 806414 846624 768473 869088 828388 938143
16864 938143 825628 920696 879834 801036 898465 815458 709541 753580 856782 747085 659300
16853 659300 810977 928762 857550 837575 821430 940859 659260 817378 718713 401564
16843 401564 582277 741090 802720 683104 927569 550886 731536 770180 1070080 838544
16833 838544 887810 964318 926501 799599 1059035 852644 890055 1028326 1119647 1291980
16823A291980k26164K06354Q4908O8049q2243L81560j5446m5450K42715K21954
16813B128217k94100O240Q7358j85648J85535p154k83669J6601J21298P5842J42606
16802A993126r4148k35582j09190q208j03803J43998j70363J36765l50429L16573
16792A518739m23358J3055J51127k08142j19895q1871k05078P3216J64501j41295
16782G40999n315m873Q6910p1393j84502J35077P3144m6301R548k21067M03590
16771I15817j39135p905p2614M3254K57636j05595R949j1714k22033L8751j5510
16760F90901N2581J18367R7865j62187P1820P1336j96024o7409j86737J82506
16750F73019L41936l10565J74085j77162j09098l8800J25649J54557L957j18029
$$ plain form
16823 1291980 1065816 1272170 1357078 1425127 1342884 1724444 1708998 1663548 1906263 2128217
16813 2128217 1834117 1840357 1927715 1742067 1927602 1920448 1636779 1653380 1774678 1850520 1993126
16802 1993126 1898978 1663396 1554206 1545998 1442195 1586193 1415830 1552595 1202166 1518739
16792 1518739 1095381 1108436 1259563 1051421 931526 849655 644577 717793 882294 740999
16782 740999 735684 730811 817721 746328 561826 696903 770047 723746 733294 512227 915817
16771 915817 776682 768777 696163 739417 997053 891458 901407 889693 667660 706411 690901
16760 690901 743482 861849 959714 797527 869347 940683 744659 677250 490513 673019
16750 673019 1014955 704390 878475 701313 592215 553415 679064 833621 837578 719549
16740G19549L5136k48643O9341J15938q9926O4105Q2709r304m4052K21487k40867
16729F75473J06844m7718K97181l89616K85652j33508q0268M54J12985N5673j50934
16718G32218L12163j21325j85664L3794Q6725L4862j7202l3829K50051l20532
16708G71261M91359J5397J39795P7320N2972m1582J59111J62770j83697L59173
16698B003879j87750l47507P6265J26835k24476L73959k07661K98689j31855J64069
16688A944447p1472J16527j03499j92054k42725l2456q8331o3301j8639k78431
16678I70066J57099q606K02135n06672L48544j06965J26524M8805J25557L11710
16668A668197j2269K26309l08846M30192O7089j63869j95314p805L6734p7164
$$ plain form
16740 719549 754685 506042 575383 691321 601395 665500 748209 738905 694853 916340 675473
16729 675473 782317 734599 1031780 642164 927816 794308 714040 714494 827479 883152 732218
16718 732218 1044381 923056 737392 771186 857911 892773 875571 841742 1091793 771261
16708 771261 1262620 1278017 1417812 1495132 1548104 1506522 1665633 1828403 1644706 2003879
16698 2003879 1816129 1468622 1544887 1671722 1447246 1821205 1613544 1912233 1780378 1944447
16688 1944447 1872975 1989502 1886003 1693949 1451224 1418768 1330437 1267136 1248497 970066
16678 970066 1127165 1118559 1320694 814022 1162566 1055601 1182125 1230930 1356487 1668197
16668 1668197 1655928 1882237 1573391 2003583 2070672 1906803 1711489 1703684 1740418 1663254
16658A663254K75893j64100j01170m2018K68183L8785q5782n325k41315j06778
16648A499627J31745l33342l32991K68877j23998r9367K1556l59404K86017k41725
16638G16995j67643K56112j67919k3111p6425N80813E29167Q6079K64853m7377
16628H32722J1196j27116O0070l7620p7019K3580K07986k93877K12123L4670j69398
16617F77317J08497k0426j45720K45495O6916N4846k86284J62023l6865M5723
16607H71522k92389K28481P4821R9980k945R974j54371L0110R3581J9513K7938
16596A006215k00667j5679M8102L11989Q7173k22162j00402n9945M2184J02442
16586I99250N1518j60493P3360M5569j99882K33026j78912J35863j40912M2423
$$ plain form
16658 1663254 1939147 1775047 1673877 1631859 1900042 1938827 1853045 1847720 1606405 1499627
16648 1499627 1631372 1298030 965039 1233916 1109918 1010551 1032107 672703 958720 716995
16638 716995 549352 805464 637545 614434 538009 1118822 529167 615246 880099 832722
16628 832722 843918 716802 776872 739252 662233 685813 893799 599922 812045 846715 677317
16617 677317 785814 765388 619668 865163 932079 986925 700641 862664 825799 871522
16607 871522 579133 807614 882435 982415 979470 989444 835073 865183 958764 978277 1006215
16596 1006215 805548 789869 837971 1149960 1237133 1014971 914569 854624 896808 999250
16586 999250 1050768 890275 963635 1009204 809322 1042348 863436 999299 858387 900810
16576I00810k16078P0352o9248J90731p2177J7838r7783O4480n824J1775k279
16565G92597q3995K12542j91423J3213k19249J39258J10809L3498k01786J50159
16555G55623j73743J84940k00304J88075l7590J94571J3385j36587k61287O35792
16545A162875n33401K20764J37175D83430N5928L5673j88459J11974L8000L0572
16535E67118j70650J41295j9370j9712K95603k91228K68432j66715P8785K10816
16525H94374j73695o187j04907J77246O601j56469J44943m8072p0683r9424J71549
16514G35276p4667K09354R5277J9390j06062J57301k36920J04586L3895q4939
16504H52491L14880k55503q6489J64719k28188M7315J36187l0558q5481p549J91133
$$ plain form
16576 900810 684732 755084 685836 876567 804390 822228 724445 788925 783101 794876 792597
16565 792597 708602 921144 729721 742934 523685 662943 773752 807250 605464 755623
16555 755623 581880 766820 566516 754591 717001 911572 924957 788370 527083 1162875
16545 1162875 629474 850238 987413 483430 539358 575031 386572 498546 536546 567118
16535 567118 396468 537763 518393 498681 794284 503056 771488 604773 683558 894374
16525 894374 720679 714492 609585 786831 793432 636963 781906 733834 663151 563727 735276
16514 735276 660609 869963 965240 984630 878568 1035869 798949 903535 937430 852491
16504 852491 1167371 911868 825379 990098 761910 809225 945412 914854 829373 821824 1012957
16493A012957k6782P4372k69657k0006o345K4817j76095B85374K16868A87150
16482B98677A46154j1474n8684K53181K02175j2238o2727J94311r0268J63125
16472G23555L07675p2513j17687J46289p7363K73313P5487l7696K87394N5323
16462A563777J98962j31963K74574j23828K07088m62320k32143j7989j55010l83551
16452G37597j39713k79424r1173p6075J22508K4927o118J54016N3524q9126L42655
16441G53598j27917K53615O3973P8903O54555J59829J84959M32429K26683J6079
16431B696706K87558L41243J5175j40682q6950M50545j45645J1376Q9056j0064
16421C508318K7097N28572J49687M02815N19924O82745Q25819Q03922J097248
$$ plain form
16493 1012957 986175 1060547 790890 770884 764539 789356 613261 285374 502242 187150
16482 298677 146154 134680 75996 329177 531352 519114 456387 650698 560430 723555
16472 723555 1031230 958717 841030 987319 909956 1183269 1258756 1221060 1508454 1563777
16462 1563777 1762739 1630776 1905350 1781522 1988610 1526290 1294147 1276158 1121148 737597
16452 737597 597884 318460 227287 151212 273720 298647 292529 446545 500069 410943 753598
16441 753598 625681 879296 943269 1022172 1676727 1836556 2021515 2453944 2680627 2696706
16431 2696706 2984264 3325507 3340682 3200000 3113050 3563595 3417950 3429326 3518382 3508318
16421 3508318 3535415 4063987 4213674 4616489 5136413 5819158 6644977 7448899 8546147
16412H546147R34490J158891J171006J183431R58532J080527J333791J153590
16404A7520405J378841J328460J264562J185313J281182J157370R39854J282745
16396B7338732K025919K600063L902069M441308O808716J1693644J4394776J1111235
16388H4316462L373959l562140o641494p537395o543864m332841j190117L396318
16380F1278888O480138N273162k83843o399799j0980973j1373916r260443o256387
16372B8476827m179364l142262k356225k374793k056943j605288j477328j063790
16364A0220834j146960n47267j035325l69586p63554r53301j72504k91882k51440
16355D689015n26642n32869n52093k07762m19517m13739l23337O3131l41400l37946
$$ plain form
16412 8546147 9480637 10639528 11810534 12993965 13952497 15033024 16366815 17520405
16404 17520405 18899246 20227706 21492268 22677581 23958763 25116133 26055987 27338732
16396 27338732 29364651 31964714 35866783 40308091 47116807 58810451 73205227 84316462
16388 84316462 87690421 84128281 77486787 69949392 63405528 59072687 57882570 61278888
16380 61278888 67759026 73032188 72748345 66348546 55367573 43993657 34733214 28476827
16372 28476827 24297463 21155201 18798976 16424183 14367240 12761952 11284624 10220834
16364 10220834 9073874 8526607 7491282 7121696 6358142 5404841 5232337 4940455 4689015
16355 4689015 4162373 3629504 3077411 2869649 2450132 2036393 1713056 1776187 1434787 1096841
16345A096841D80379a77777l46290k15114n41146j10136k05451q0614k593J86796
16335a492325K59932L94680J89274J95200J18512j46046N9606Q5077l19988J57072
16325d99006q3844K58030k52812J88267l7624a29907k6750A5109R3376a73035
16314d4928C1420c22416i5408k03517a19489j35529j76643a41538d7123q0267
16304a27390C0917K06399a07276B47452k9580K25531m913J2987K49134j12408
16294E88203J44014j31180R5708J36153O7340l68607K96501j79235p2555O8450
16284F44792k04030m7531J9851j48297J8901A1657K4263b0262k02996A77309a72789
16272b87238J35488e7735K2879r552A44209F9151a36143a6051m3494j00117D4546
$$ plain form
16345 1096841 480379 -177777 -524067 -739181 -1280327 -1390463 -1595914 -1676528 -1679121 -1492325
16335 -1492325 -1232393 -837713 -648439 -453239 -334727 -480773 -421167 -336090 -656078 -499006
16325 -499006 -582850 -324820 -577632 -389365 -426989 -129907 -156657 15109 108485 -173035
16314 -44928 31420 -322416 -95408 -298925 -119489 -255018 -431661 -141538 -47123 -127390
16304 -127390 30917 237316 -107276 247452 217872 443403 438490 451477 700611 588203
16294 588203 732217 601037 696745 832898 900238 531631 828132 648897 576342 644792
16284 644792 440762 393231 413082 264785 283686 11657 35920 -20262 -223258 177309 -172789
16272 -287238 -151750 -57735 -34856 -44408 144209 69151 -136143 -16051 -59545 -159662 44546
16260I7076K09233J41418A62034k7966L8667J99222N7374j3178p5208J52124J54727
16249F47796j75783j03758J47502j79006o8538K06330N8689k31752J04181J06658
16239E12319k7086j87089M17364m7282n9312k55641J55172k40168N5197I5921
16228B76292J84736r6096j71219O3029O5259r1150K87949j57366l7122K24768
16218E49080k21857J12192j61778K32216K0677L08411l87919K1696q3605K26017
16208F15130j22867m2506k874L7712J3025J19070j22566L8185M6052j3942L6212
16197F00631L583r3253K41293l10466J01246K15378C49566J48684j13101J3261
16187C98410l7463K35762k58247J04715P5133n4609K22646l38601L35036l05906
$$ plain form
16260 97076 306309 447727 162034 134068 172735 371957 429331 416153 340945 493069 647796
16249 647796 472013 368255 515757 336751 268213 474543 533232 301480 405661 512319
16239 512319 485233 298144 715508 668226 608914 353273 508445 268277 323474 95921
16228 276292 461028 364932 193713 256742 322001 230851 518800 361434 324312 549080
16218 549080 327223 439415 277637 509853 530530 838941 451022 472718 389113 615130
16208 615130 492263 449757 446883 484595 497620 616690 494124 532309 578361 564419 600631
16197 600631 604214 510961 752254 441788 543034 758412 349566 498250 385149 398410
16187 398410 360947 596709 338462 443177 518310 463701 686347 347746 682782 376876
16177C76876P8736K6916K5589j5716N8913J88618j39385o8968K8598K03368k49912
16166E13633o0461M2083m4553J12330m6010p7903k11117K91590J80750N8941C77022
16154E84177k17029J85898j06156O2811M7372j43048J24357o1232j1536J98997
16144F64611m1208r7057j81363J74202N6745L1624j91893J25503r1657J79809
16134F29316m8454J06618K3348q4971j95751P2989K34120K3977j13069n9356J61773
16123G50540K4326L8524j6053k20503N1150p4845J23701p2831N0774K13132k01828
16112F66087R3320K14423k27009k7064m5726L01745j50882j76117Q0026L2236
16102G61039j70315J46402J44745l32659L30154p5845P2131r9983J09734J37210
$$ plain form
16177 376876 455612 482528 508117 492401 551314 739932 600547 531579 560177 763545 513633
16166 513633 453172 495255 450702 563032 517022 439119 228002 519592 700342 759283 377022
16154 584177 367148 553046 446890 509701 557073 414025 538382 477150 465614 664611
16144 664611 623403 526346 344983 519185 575930 607554 415661 541164 449507 629316
16134 629316 580862 687480 710828 625857 430106 503095 737215 761192 648123 588767 750540
16123 750540 774866 813390 797337 576834 627984 553139 676840 604009 654783 867915 666087
16112 666087 759407 973830 746821 719757 674031 975776 824894 648777 728803 761039
16102 761039 590724 737126 881871 549212 879366 803521 875652 775669 885403 1022613
16092A022613l48595Q5278J19738K03686j34113J39306j5443k55566J7472K02913
16082A037289m11542R3861K13944R7158J84135k95069J88275q8818j98063K91406
16072A112576j96638Q7354J72093j53859o7584J79068P5300J43327k09786k6193
16062A115658K47052O5323j31536k27002L47043j36201o7662J67119q4108Q6428
16052A382114J97976p4514L1275K18144k61094J03147m9814j21513R9522j63375
16042A361868J15534j01496p8533J25692J28967o9452j9859n591J92075l12652
16032A336553J29527J34120j02563j10870J00913K69724j30394L25944k92093
16023A660861J78355O136N7887J16827l07928J59446K90384K5572j70302n7280
$$ plain form
16092 1022613 674018 759296 879034 1082720 948607 1087913 1072470 816904 834376 1037289
16082 1037289 625747 719608 933552 1030710 1214845 919776 1108051 1019233 821170 1112576
16072 1112576 915938 1003292 1175385 1021526 953942 1133010 1208310 1351637 1141851 1115658
16062 1115658 1362710 1428033 1296497 1069495 1416538 1280337 1212675 1379794 1295686 1382114
16052 1382114 1580090 1505576 1536851 1754995 1493901 1597048 1547234 1425721 1525243 1361868
16042 1361868 1477402 1375906 1297373 1423065 1552032 1482580 1462721 1457130 1649205 1336553
16032 1336553 1466080 1600200 1497637 1386767 1487680 1757404 1627010 1952954 1660861
16023 1660861 1839216 1845352 1903239 2020066 1712138 1871584 2161968 2187540 2017238 1959958
16013A959958j90681J13344L0804J56250k91927j26917K71744K643j79761o3362
16003A682095j73331L11072N6839r5044N2551j47207J52858n7616j23464K07533
15993A866286k28514J80873M9449r6552L39512k07496q9217O9693P6168J18335
15983B078537j9937J93227q2634j44311P0994j19595L9092r1429L08600l80971
15973A851573J99005j17829K37544k44857J23270l35731K64555Q5286N6109j42173
15963A976752q5547P6677k47173J89162l0179J09936J01680j34919K1047J0061
15953A987497k32983M17295k14656j05432L66914j87910q3164M2056N2580J66592
15943B208789J64085l92991K46582J38615l18126R0469p8226O976K19953j28888
$$ plain form
16013 1959958 1769277 1882621 1913425 2069675 1777748 1650831 1922575 1925218 1745457 1682095
16003 1682095 1508764 1819836 1876675 1781631 1834182 1686975 1839833 1782217 1658753 1866286
15993 1866286 1637772 1818645 1868094 1771542 2111054 1903558 1814341 1884034 1960202 2078537
15983 2078537 2058600 2251827 2169193 2024882 2095876 1976281 2015373 1923944 2232544 1851573
15973 1851573 2050578 1932749 2170293 1925436 2048706 1712975 1977530 2062816 2118925 1976752
15963 1976752 1891205 1967882 1720709 1909871 1879692 1989628 2091308 1956389 1977436 1987497
15953 1987497 1754514 2171809 1957153 1851721 2218635 2030725 1947561 1989617 2042197 2208789
15943 2208789 2372874 1979883 2226465 2365080 2046954 2137423 2059197 2066173 2286126 2157238
15933B157238R5773M8330P8036o0846J19199K8861K82220J61756l7021M2423M53887
15922C369856j66920L7105K24668L22011N98962L17665M46325R62190J224626
15913G336488J437069K587403L264906M559460N932106O902091Q066174P827196
15905D7912893P429145N945784L949829J050803j493130m716630p015843q324611
15897D4738240q745502p748529o698234n310030m007838k874229j759823j302617
15889F291438r28016n28466p71052j77060m50428l33539j74731m21451K32484
15880B739179l28294o699k62672J94429l42868N8157L01929K3031q1646J95069
15870B489615o7883N6890J9821l6395k0074k46450j19006K80620j48456j5563
$$ plain form
15933 2157238 2253011 2301341 2379377 2318531 2437730 2466591 2748811 2910567 2873546 2915969 3369856
15922 3369856 3202936 3240041 3464709 3786720 4385682 4703347 5149672 6111862 7336488
15913 7336488 8773557 11360960 14625866 19185326 25117432 32019523 40085697 47912893
15905 47912893 55342038 61287822 65237651 66288454 64795324 60078694 53062851 44738240
15897 44738240 35992738 28244209 21545975 16235945 12228107 9353878 7594055 6291438
15889 6291438 5363422 4834956 4063904 3886844 3436416 3102877 2928146 2506695 2739179
15880 2739179 2410885 2404186 2141514 2335943 1993075 2051232 2353161 2376192 2294546 2489615
15870 2489615 2421732 2478622 2498443 2462048 2441974 2195524 2076518 2357138 2208682 2193119
15860B193119p3504j64305J39891j09559N2194K6611L4124j00878j8006L3844
15850B013531o1106J58507l48650l2347Q9001Q9423J94309j79990J51644j02792
15840A971530J31136M8708K7095J70822M8758j30798q7779L62069j44851O612
15830B403302N0365k35509O1713N8050m13405K64261k52589j3309n1270O6007
15820A937616K2786q7798L7087N7170o5438K27451j08375L4640L5544J23631o5497
15809B148817J63621n5750J5617j23738k1518N1848Q0869L18869l95268L57279
15799B540646j17237K9241J53301J01871M47729j90133K6456J83296M687l367
15789C176490J62896n9402J31226J14481k5254p1536K47035j3937N66727R1076
$$ plain form
15860 2193119 2119615 1955310 2095201 1985642 2037836 2064447 2098571 1997693 1979687 2013531
15850 2013531 1952425 2110932 1762282 1729935 1818936 1908359 2102668 1922678 2074322 1971530
15840 1971530 2102666 2151374 2178469 2349291 2398049 2267251 2179472 2541541 2396690 2403302
15830 2403302 2453667 2218158 2279871 2337921 1924516 2188777 1936188 1922879 1871609 1937616
15820 1937616 1960402 1872604 1909691 1966861 1901423 2128874 2020499 2055139 2090683 2214314 2148817
15809 2148817 2312438 2256688 2272305 2148567 2127049 2178897 2259766 2578635 2183367 2540646
15799 2540646 2423409 2452650 2605951 2707822 3155551 2965418 2991874 3175170 3179857 3176490
15789 3176490 3339386 3279984 3411210 3525691 3500437 3428901 3675936 3661999 4228726 4319802
15779D319802L5676J34543l8402J70076j1591k9246N2039k82929j01405J42706
15769D391269J76161p3263K86817k60132J01130j3964P755K61242P5855J43810
15759E096680k41426K72139p2668L659j6968q4980P4005k0751Q9775k01262N26213
15748E424416L6122j5277K08309J13326N87734M8597R3576L68876J4288K55124
15738G135091r2891K87768m4290J27368j07402O1341R5146O7310J35156j12224
15728G552373J05468k34986M6650j023l35683k45907k40415k40865m444m14931
15718E986237K79448J40955j09535p0436l5920J33104j59928J18685k08672L78072
15708F452010l03062K39411J62102m298M51838K65067K10401L46792M8594J54434
$$ plain form
15779 4319802 4355478 4490021 4451619 4621695 4610104 4580858 4632897 4349968 4248563 4391269
15769 4391269 4567430 4494167 4780984 4520852 4621982 4608018 4615773 4877015 4952870 5096680
15759 5096680 4855254 5127393 5054725 5058384 5041416 4956436 5030441 5009690 5099465 4898203 5424416
15748 5424416 5460538 5445261 5653570 5766896 6354630 6403227 6496803 6865679 6879967 7135091
15738 7135091 7042200 7329968 7285678 7413046 7305644 7366985 7462131 7529441 7664597 7552373
15728 7552373 7657841 7422855 7469505 7468482 7132799 6886892 6646477 6405612 6401168 5986237
15718 5986237 6265685 6406640 6297105 6226669 6190749 6323853 6163925 6282610 6073938 6452010
15708 6452010 6148948 6388359 6550461 6546163 6998001 7263068 7473469 7820261 7868855 8023289
15698H023289O718N4917M7902MO1008J57790j85057K46375m30395R3845k04491
15687G871905l78999O9069j98329r9954l36256J62727k37886J11968J3464m09171
15677F568538l0102n5758l5426j88860n3388m5374k50584K0456L0204L393n6230
15666E906869p5796J90720J55547K17018K08509K16133K59322K07021O34632K20582
15656H140557L44377M37966O89332N42406J85182J009497M43832N47608L71945
15647A2712702Q73494J78589O40213P28318M86843Q77174R26415M84631J088208
15638A8996587J258922Q92556N49244N60817k42948L09285k98842m11639k61124
15629B1352858j02246k43347L5829K11911K49543J48259L3617m33966m05468m96657
$$ plain form
15698 8023289 8030007 8084924 8132826 8132830 8193838 8351628 8166571 8412946 7982551 8076396 7871905
15687 7871905 7492906 7561975 7363646 7263692 6927436 7090163 6852277 6964245 6977709 6568538
15677 6568538 6538436 6482678 6447252 6258392 6205004 6159630 5909046 5929502 5959706 5963099 5906869
15666 5906869 5831073 6021793 6177340 6394358 6602867 6819000 7078322 7285343 7919975 8140557
15656 8140557 8484934 8922900 9612232 10154638 10339820 11349317 11793149 12340757 12712702
15647 12712702 13586196 13764785 14404998 15133316 15620159 16497333 17423748 17908379 18996587
15638 18996587 20255509 21148065 21697309 22258126 22015178 22324463 22025621 21613982 21352858
15629 21352858 21250612 21007265 21043094 21255005 21504548 21652807 21686424 21252458 20846990 20350333
15619B0350333r94021j159005r91800j160432n67710o65824r78352k43292n2969
15610A3536928o41357k15723m56997l72045r6384n68419k91605m40818j20537
15601A0333043j83620j73038K53357k99156r1135P8379N04251Q78004J880989
15592A3181074L415231N146484Q323378J2962498J7697124J4364025J0003460
15585H5093274P797636O249495M016287m272939j5338014j7506049j5421834j3511798
15577C7106058j1970160p838499m387374j907462j172444p23041l04527J05382
15569H907933Q2126q725J21596K56621j3155K1622M10836O2384M29685N57001
15559A0827924J619902K640276N233866P595888J2051758J8879394K3254990J6645063
$$ plain form
15619 20350333 19356312 18197307 17205507 16045075 15477365 14811541 13833189 13589897 13536928
15610 13536928 12895571 12679848 12222851 11850806 11754422 11186003 10894398 10453580 10333043
15601 10333043 10149423 9976385 10229742 9930586 9839451 9917830 10422081 11300085 13181074
15592 13181074 16596305 21742789 30066167 43028665 60725789 75089814 85093274
15585 85093274 92890910 99140405 103156692 98883753 83545739 66039690 50617856 37106058
15577 37106058 25135898 17297399 12910025 11002563 9830119 9107078 8802551 8907933
15569 8907933 8990059 8981334 9102930 9359551 9346396 9368018 9778854 9841238 10270923 10827924
15559 10827924 12447826 15088102 20321968 27917856 39969614 58849008 82103998 98749061
15551I8749061J2293467R428594P277307L601820j0380505k1746632k1850571
15544G7372541j9948417j7353422j4401104r068665m830882k543395j222912o54124
15536G349620p58192k88500j88759m60658J88838m76860M2577m34859M0269l86350
15526D627126K63313l53154j98018j08446n9710k53360J64915l35571K5582R8881
15516C871558j22385R6893J59288N4763K14050P5471J64829L0670J78969j05390
15506D618716n47j25063k26612K20198N7050j84533j41262o9097k32548J16539
15496D032841q0677K85393r1407K33014J6325M8292J16782J09941j08305m119
15486D558080N42737J55825J72704K71015J79969Q2041K81880K5161j24647K2698
$$ plain form
15551 98749061 111042528 120471122 127748429 131350249 120969744 99223112 77372541
15544 77372541 57424124 40070702 25669598 16600933 11770051 9226656 8003744 7349620
15536 7349620 6591428 6302928 6114169 5653511 5842349 5365489 5408066 4973207 5013476 4627126
15526 4627126 4890439 4537285 4339267 4230821 4171111 3917751 4082666 3747095 3772677 3871558
15516 3871558 3749173 3846066 4005354 4060117 4274167 4349638 4514467 4545137 4724106 4618716
15506 4618716 4618169 4493106 4266494 4486692 4543742 4359209 4217947 4148850 3916302 4032841
15496 4032841 3952164 4237557 4146150 4379164 4395489 4443781 4560563 4670504 4562199 4558080
15486 4558080 5100817 5256642 5429346 5700361 5880330 5962371 6244251 6269412 6144765 6167463
15476F167463l6789R7247j46347M38470L62615Q32300P52838Q98366R14877K90914
15466A0571954K99120K64552J26993k92302n64177n76489m81602k09965o5393
15457I072691J32259N54666O21183M71180O51652K29646K52360K2410k56965n01866
15447A1249216m97660o24321q66408l1885m35554p6803L91804k42599L54116L22160
15437I542066Q881n09301L30285n52303m31509m75905k10269o58369r2689K17277
15427G168164l93499p4056l62559m4596j96952k0388j25939n41131k9274j09481
15417E270289k56295j69967j90388P0576o8590l98461L26699k83554J48076O9427
15407D517812l12878M47312k94697M12053j42961R791J58086J19917J18858j85591
$$ plain form
15476 6167463 6130674 6227921 6081574 6520044 6882659 7714959 8467797 9366163 10281040 10571954
15466 10571954 10871074 11135626 11262619 10970317 10406140 9829651 9348049 9138084 9072691
15457 9072691 9204950 9759616 10380799 10851979 11503631 11733277 11985637 12008047 11751082 11249216
15447 11249216 10751556 10127235 9260827 9228942 8793388 8716585 9108389 8865790 9219906 9542066
15437 9542066 9550947 9041646 9371931 8819628 8388119 7912214 7701945 7043576 6950887 7168164
15427 7168164 6774665 6700609 6338050 6293454 6096502 6076114 5950175 5409044 5379770 5270289
15417 5270289 5013994 4844027 4653639 4724215 4655625 4257164 4583863 4300309 4448385 4517812
15407 4517812 4204934 4652246 4357549 4769602 4626641 4636432 4794518 4914435 5033293 4847702
15397D847702L1523Q24q0744j34297J82721M9438K1736j61472L7791p3360J89789
15386D911651K2759N978J67039l5628O2374K15347k37072K23072k17062j10293
15376E008165L93328k04830J5823K142j23589q0928L46740k62552L19260j46924
15366E266635J26082J47911J74446J4007K21588K11572J17550o2745K65942p6926
15356F406062J25054K41478L39302L23838N32563J019918J083942K527140L207626
15347A5806923N382445P601520R792230P629532O129279M656805L566777J622414
15339F2187925l295299p621059r089514p613604p026926n762140l831142k308165
15331A5640076q40937m93512m15097l28888o70201k48579k46657m94866N7937
$$ plain form
15397 4847702 4879225 4880049 4799305 4665008 4847729 4897167 4918903 4757431 4795222 4721862 4911651
15386 4911651 4934410 4940388 5107427 5071799 5134173 5349520 5112448 5335520 5118458 5008165
15376 5008165 5401493 5196663 5212486 5214628 5091039 5010111 5356851 5094299 5413559 5266635
15366 5266635 5392717 5540628 5715074 5729081 5950669 6162241 6279791 6217046 6482988 6406062
15356 6406062 6531116 6772594 7111896 7435734 7968297 8988215 10072157 12599297 15806923
15347 15806923 21189368 28790888 38583118 46212650 52341929 56998734 60565511 62187925
15339 62187925 58892626 51271567 42182053 34568449 27541523 21779383 17948241 15640076
15331 15640076 14799139 14305627 13890530 13561642 12891441 12642862 12396205 11901339 11959276
15322A1959276P1352J32140Q52407M12591Q65851K173124L284504N442031P838405
15313C3031681J1971338J5510643J5881598J4064853J0299513Q038701M109657
15306A12907984j978603r426495j5243802j7096066j6110821j3713091j0762089
15299B8577017p420243m163646k164557j092120p12134k09117k095j1568l23571
15290A2477966j05835j53893J73263k18468k93507j26597K59466O53051J088018
15281A3753464K734809L736982N418132P913585Q860467O558172N485008L824240
15273E8284859K674726M45726m365124q284230q763447p877429o990120n931777
15265A9193184l695539k078618j212390j252958p53305p62480l97663n20288l8702
$$ plain form
15322 11959276 12030628 12162768 13015175 13427766 14293617 16466741 19751245 25193276 33031681
15313 33031681 45003019 60513662 76395260 90460113 100759626 108798327 112907984
15306 112907984 110929381 101502886 86259084 69163018 53052197 39339106 28577017
15299 28577017 21156774 16993128 14828571 13736451 13024317 12815200 12813105 12801537 12477966
15290 12477966 12372131 12218238 12391501 12173033 11879526 11752929 12012395 12665446 13753464
15281 13753464 16488273 20225255 25643387 33556972 42417439 48975611 54460619 58284859
15273 58284859 60959585 61405311 57040187 48755957 39992510 32115081 25124961 19193184
15265 19193184 15497645 13419027 12206637 10953679 10200374 9437894 9040231 8519943 8481241
15256H481241L21621J9880K17252J47880L72669N76472n0544m1310m7442k93181
15246I704538K51423l21750l63402l23099m00066j68358j05693k29127k53968
15237G790498K9714M50167J70428O63132M03117N63520N7519M77938K06060k72917
15227A0539176j48266l91099k17717m65680o27697j93471o4710L2091Q5192k0577
15217H527242N73211K0218M82593N65241J05485K86186J82687k14450k76740j60898
15207A0090775n82742m88397o81460n49965n38042l27452k77571m27327J80351
15198F398170r4009j56324k49097j25441J10500K35750l1352q0337J91706L00827
15188F500393r378K63718o8143J52112j79708J5513N5971l3212K93915J77299
$$ plain form
15256 8481241 8802862 8822742 9039994 9187874 9560543 10137015 10086471 10045161 9997719 9704538
15246 9704538 9955961 9634211 9270809 8947710 8547644 8379286 8273593 8044466 7790498
15237 7790498 7820212 8270379 8440807 9103939 9507056 10070576 10128095 10606033 10812093 10539176
15227 10539176 10390910 9999811 9782094 9316414 8688717 8495246 8430536 8462627 8547819 8527242
15217 8527242 9100453 9120671 9603264 10168505 10273990 10560176 10742863 10528413 10251673 10090775
15207 10090775 9508033 9019636 8338176 7788211 7250169 6922717 6645146 6217819 6398170
15198 6398170 6304161 6147837 5898740 5773299 5883799 6119549 6088197 6007860 6199566 6500393
15188 6500393 6491015 6754733 6686590 6838702 6658994 6674507 6730478 6697266 6991181 7168480
15178G168480K71596r7171L36466J6336q2881r7326K89903j22944L3691k15344
15168G500806J40176k90262P3873J25471K57607l77417N24376p5017k13884L12964
15158G978693K36980J80665K75056j1076p5812J4129j29161J50948j5108k55573
15148H349741k19251r816O2654J52249j59652k09126K01912k22048J65258j22595
15138G989326O8959J69601j30750M00191m69430L09457l20145N8227l71093K06311
15128G910654J92725L6638j46042K05581j27771J69251j82710m296j45681l48583
15118G559766L10904l10095p0726M5282J42124o0708l5405K04411k70442K04625
15108G719736L2744J61930J48024J94277J40037M16848J56887L48783L73874j85814
$$ plain form
15178 7168480 7440076 7342905 7679371 7695707 7612826 7515500 7805403 7682459 7716150 7500806
15168 7500806 7640982 7350720 7424593 7550064 7807671 7430254 7954630 7879613 7665729 7978693
15158 7978693 8215673 8396338 8671394 8660318 8584506 8598635 8469474 8620422 8605314 8349741
15148 8349741 8130490 8120674 8183328 8335577 8175925 7966799 8168711 7946663 8111921 7989326
15138 7989326 8058285 8227886 8097136 8497327 8027897 8337354 8017209 8075436 7704343 7910654
15128 7910654 8103379 8140017 7993975 8199556 8071785 8241036 8058326 8054030 7908349 7559766
15118 7559766 7870670 7560575 7489849 7535131 7677255 7616547 7581142 7785553 7515111 7719736
15108 7719736 7752480 7914410 8062434 8256711 8396748 8813596 8970483 9319266 9693140 9507326
15098I507326L39650L25122K88966N66301L99218P73081J215806J750676K577187
15089A7743333L301892L400046L138115K084352K133017J155001R373p61794k570205
15080B9633130k473727k159133j587590k26234P18972K762284L220751K891061
15072C2779514K663846J741835J505063P15691m54919j956893j229402r91682
15064C4773053J172450L908808M715531L587726L862441L386843M035767K524254
15056F1966873n22574k278315j903018k003917r65431K49188J831405L288679
15048E9662890L349026K809868K429465K593938J960159K140749Q17488r81611
15040G4781972k261257j835497k053053j149738j038120m16379P05607J335273
$$ plain form
15098 9507326 9846976 10172098 10461064 11027365 11426583 12199664 13415470 15166146 17743333
15089 17743333 21045225 24445271 27583386 29667738 31800755 32955756 32965129 32203335 29633130
15080 29633130 27159403 25000270 23412680 23186446 23905418 26667702 29888453 32779514
15072 32779514 35443360 37185195 38690258 39405949 38951030 36994137 35764735 34773053
15064 34773053 35945503 39854311 44569842 48157568 52020009 55406852 59442619 61966873
15056 61966873 61444299 59165984 57262966 55259049 54293618 54542806 56374211 59662890
15048 59662890 63011916 65821784 68251249 70845187 72805346 74946095 75763583 74781972
15040 74781972 72520715 70685218 68632165 67482427 66444307 66027928 66733535 68068808
15032F8068808L147861M535975O950070Q667380P316206N585346L573953K165273
15024A10010872K09205k972077o897797q305721q017338p403126n947784l400862
15016F7275372j239325P69631J144244J205623R46189Q36586l57585j932041l872299
15007F4776395l978739l747869l485388k834736k338759j325448m55389O08470
14999D7218537J712540J898628K469248K309545J621779J136131O60665j05973
14991E8921100j933379k288708k095860j223002j7039N09094K00985R41095J364932
14982E4379218J370411J242262j319076k857152l332440l655043l791571m041096
14974C7995513l685143k855041j813186j662890q23834k88725L31625Q96340M18614
$$ plain form
15032 68068808 71216669 75752644 82702714 91370094 98686300 104271646 107845599 110010872
15024 110010872 110220077 107248000 100350203 92044482 84027144 76624018 70676234 67275372
15016 67275372 66036047 66805678 67949922 69155545 70101734 70938320 70580735 68648694 64776395
15007 64776395 60797656 57049787 53564399 50729663 48390904 47065456 46610067 47218537
14999 47218537 48931077 50829705 53298953 55608498 57230277 58366408 59027073 58921100
14991 58921100 56987721 54699013 52603153 51380151 51363112 51872206 52073191 53014286 54379218
14982 54379218 55749629 56991891 55672815 52815663 49483223 45828180 42036609 37995513
14974 37995513 34310370 31455329 29642143 27979253 27155419 26866694 27198319 28094659 28513273
14965B8513273P71950P67493Q79095J369672J182358K249288K992100M532327
14957D3257556P029084J0562762J4542341J8945188K5519131L1631500L5250427
14950A86737989L9235144M3534141M4325894M2479686L7309510L1891071K2766066
14943D48279501Q042205p419723j7109755k2355240k8315361l6601823l9400740
14936C05119064l5163341k8351314k1964068j6725145j3727185j2938803j3798783
14929A62450425j3835291j3188060j3178249j1265766q814197o176362l242845
14922I2749655j670226j717836k413668k202513k413873m382706q376511j0837598
14914E8734724j0758549r101741q427077o438633m177852k822656j422935q27954
$$ plain form
14965 28513273 29285223 30052716 30931811 32301483 33483841 35733129 38725229 43257556
14957 43257556 50286640 60849402 75391743 94336931 119856062 151487562 186737989
14950 186737989 225973133 269507274 313833168 356312854 393622364 425513435 448279501
14943 448279501 456321706 448901983 431792228 409436988 381121627 344519804 305119064
14936 305119064 269955723 241604409 219640341 202915196 189188011 176249208 162450425
14929 162450425 148615134 135427074 122248825 110983059 102168862 95992500 92749655
14922 92749655 91079429 89361593 86947925 84745412 82331539 77948833 69572322 58734724
14914 58734724 47976175 38874434 30447357 24008724 19830872 17008216 15585281 14757327
14906A4757327l52988p2430P57584M92491J113579J467747J946306J985317K428125
14897B4523058K865101M360733N935401O218449N121056M117157K799648J386791
14889E7327394P6966l253063o071720p257574p010186o473799n008721l654540
14881A8674757k018581p13951o16691J59938N42603O48326J305854J524104Q80797
14872B0387156P09527N64814J66980P00485o54385o29880m85979p68819N14227
14863B0504126P63904K191394L502433N981181Q588017J0754174J2173891J2509768
14855G6968888J3125910J2063114R397554L643234j619503n701353q713754j2525419
14847H6638671j4942860j4164827j1999952r232269p529022n101490l175791j750122
$$ plain form
14906 14757327 14404339 14331909 15089493 15581984 16695563 18163310 20109616 22094933 24523058
14897 24523058 27388159 31748892 37684293 43902742 49023798 53140955 55940603 57327394
14889 57327394 57404360 54151297 48079577 40822003 33811817 27338018 22329297 18674757
14881 18674757 16656176 15942225 15325534 15485472 16028075 16676401 17982255 19506359 20387156
14872 20387156 21096683 21661497 21828477 22528962 21874577 21244697 20758718 19989899 20504126
14863 20504126 21268030 23459424 26961857 32943038 41531055 52285229 64459120 76968888
14855 76968888 90094798 102157912 111555466 115198700 113579197 107877844 99164090 86638671
14847 86638671 71695811 57530984 45531032 36298763 28769741 23668251 20492460 18742338
14839A8742338j208113p28263q58804p2508k72373m57534R5142l13979J56909
14830A5082815p2935K08370M26884P01740J115992J169407J407724K068384L048606
14821B5156987M717530O646714Q775199R901391R213486O605398N028494L058101
14813G9103300k89493m646644r212545j1070876j0878810r754827p942285n679619
14805A9628201l818525j769006j522642o81379p42939j68544o59206R3518n50860
14796I808618l01902k91090o78023N7115j11232n88236k4964k57763J81457n3315
14786G740665m28563K22293J97452K37121N54949M67186O37134R34707J029827
14777A1592771R24007J94509L60545N74861m14651k65248q32577r98694r14343
$$ plain form
14839 18742338 17534225 16805962 15947158 15874650 15602277 15144743 15239885 14925906 15082815
14830 15082815 15009880 15218250 15645134 16346874 17462866 18632273 20039997 22108381 25156987
14821 25156987 29874517 36521231 45296430 55197821 64411307 71016705 76045199 79103300
14813 79103300 78813807 74167163 64954618 53883742 43004932 33250105 25307820 19628201
14805 19628201 15809676 14040670 12518028 11836649 11093710 10925166 10265960 10359478 9808618
14796 9808618 9506716 9215626 8537603 8594718 8483486 7895250 7870286 7612523 7793980 7740665
14786 7740665 7312102 7534395 7731847 7968968 8523917 8991103 9628237 10562944 11592771
14777 11592771 12516778 12711287 13071832 13646693 13232042 12966794 12134217 11135523 10221180
14768A0221180j067569l23417n67356J36840O7495K8643P9358K59571K43452K78173
14758I356370J52337M09591K99289K41562J85866k15620K18569J76657r2100j31801
14748A0600720K45040Q6190K39612M27063J14028M83052M95895J225920N73278
14739A4490798J270149J351783K073488K570441M349485N996705Q730054J3376750
14731E4209653J8958953K7057313L6314953M1974513M3230469M1728149L6059983
14724B99533986K5886202J2063209n636696k1075905l4136032m4742450m7684806
14717A84207508m4031090l6686943k8526146k0453368j3676782q893332n615611
14710B6324236l928280k828307k276175j787840j149686j324427j126617q36673
$$ plain form
14768 10221180 9153611 8830194 8262838 8399678 8467173 8495816 8575174 8834745 9078197 9356370
14758 9356370 9508707 9918298 10217587 10459149 10645015 10429395 10647964 10824621 10732521 10600720
14748 10600720 10845760 10931950 11171562 11598625 11712653 12195705 12691600 13917520 14490798
14739 14490798 15760947 17112730 19186218 21756659 26106144 32102849 40832903 54209653
14731 54209653 73168606 100225919 136540872 178515385 221745854 263474003 299533986
14724 299533986 325420188 337483397 331846701 310770796 276634764 231892314 184207508
14717 184207508 140176418 103489475 74963329 54509961 40833179 31939847 26324236
14710 26324236 22395956 19567649 17291474 15503634 14353948 13029521 11902904 11066231
14702A1066231q13968n81951n18432o98774k94528n62633r7285l49001k12664
14693F936995J40058j90899r44J33761p4296J66137K36195Q3767l31044n5733
14683G043997K80207M8954K32760K35214K85716L05943O04390J166678Q99505
14674A1103364O87294M15912M22816K5364l86615r70879j216064j080294q23532
14665H177366q57580p05485R7647n84208Q5479p6299K03104j33216k18553l588
14655E984667m35735J76656l33088J82478J22031O1019j74993n9711L77283l27592
14645E573015K74131l4920L3651O0904n5671L53798M17696K50403M57293R10141
14635H240441P2923Q16229K80936L06419q2484m84327n79178m12204q41560r58064
$$ plain form
14702 11066231 10252263 9670312 9151880 8453106 8158578 7595945 7498660 7149659 6936995
14693 6936995 7077053 6886154 6885210 7018971 6944675 7110812 7347007 7430774 7099730 7043997
14683 7043997 7324204 7373158 7605918 7841132 8126848 8432791 9037181 10203859 11103364
14674 11103364 11790658 12206570 12629386 12654750 12268135 11297256 10081192 9000898 8177366
14665 8177366 7319786 6614301 6711948 6127740 6213219 6136920 6340024 6206808 5988255 5984667
14655 5984667 5548932 5725588 5392500 5574978 5697009 5758028 5583035 5523324 5900607 5573015
14645 5573015 5847146 5812226 5845877 5906781 5851110 6204908 6622604 6873007 7330300 8240441
14635 8240441 8313364 9129593 9410529 9716948 9634464 9150137 8570959 8158755 7317195 6359131
14625F359131p21194m11994k45869k88854l33654K2788q7862J5098p3963q2179
14615D151448q9435j09198j37502k20623J42104M0708k22816j87184J3746j73472
14605C207776o1439J25827k353J20725K80899N83632L24831N11824R13370M00734
14595F405826O88310K09796J65707l08703m23753m92074p08083p73796o03521
14586D159709j55436j06709l76277J87328J07746K6836q25M5208K97004j85898
14576C998686K04217J08092n8927N8925L4825K67001j12999L45734J74272J40884
14566E160710M72729P37720R42645J601171K124460L454737N651179P784455J0614515
14557C8544321R142361O527279N242150M168523K419862k503171p890061r348841
$$ plain form
14625 6359131 5637937 5225943 4980074 4691220 4357566 4380354 4292492 4307590 4233627 4151448
14615 4151448 4062013 3952815 3815313 3594690 3736794 3777502 3554686 3367502 3381248 3207776
14605 3207776 3146337 3272164 3269811 3390536 3671435 4255067 4579898 5091722 6005092 6405826
14595 6405826 7094136 7303932 7469639 7160936 6737183 6245109 5537026 4763230 4159709
14586 4159709 4004273 3897564 3521287 3708615 3816361 3843197 3842372 3887580 4184584 3998686
14576 3998686 4202903 4310995 4252068 4310993 4345818 4612819 4499820 4845554 5019826 5160710
14566 5160710 5633439 6371159 7313804 8914975 11039435 14494172 20145351 27929806 38544321
14557 38544321 47686682 54213961 59456111 63624634 66044496 63541325 55651264 46302423
14549D6302423q726663p000324n256909j722327K042197N537860R397535J0190016
14541E0763808P447556N551363M259294K745489p62740o823590j0077501j0260420
14533D2843259r329289q067833n624805l598869j377592l20215n4564K99299M8496
14524A4817887q7861O42535J089361J855545L553481N896017P450164N578440
14516D0795569M467563L627947K461817R83906l118509n981193o255164n511428
14508C1470508m431949k311603P0255K996186M925706O906380O143823M610147
14500E0379453K990736K016728J025073k267365o230795p906335p174675o085842
14492B6746978n520659m318354k886961j339324j486338j173897j164623j012784
$$ plain form
14549 46302423 37575760 30575436 25318527 23596200 25638397 31176257 40573792 50763808
14541 50763808 58211364 63762727 68022021 70767510 70004770 63181180 53103679 42843259
14533 42843259 33513970 25446137 19821332 16222463 14844871 14524656 14470092 14769391 14817887
14524 14817887 14730026 15372561 16461922 18317467 21870948 27766965 35217129 40795569
14516 40795569 45263132 48891079 51352896 52336802 49218293 43237100 36981936 31470508
14508 31470508 27038559 24726956 24797211 27793397 32719103 39625483 45769306 50379453
14500 50379453 53370189 55386917 56411990 54144625 47913830 40007495 32832820 26746978
14492 26746978 21226319 16907965 14021004 12681680 11195342 10021445 8856822 7844038
14484G844038j087229r12778p85963o37817k40012j64771j2438p8024o2287o4534
14474C798185j258j60470O54061M11137M86537M59483Q249L82725P5198L76232
14464F490079o1243k37784m76431K45513q2579N04011O3418L41687M63574k3504
14454G226741J89797j73788k02293n52220l23827j08838j8519n2764J00180M17576
14444F502045J97747L73027L76651K09739L64141K39114K91640j52122J86947
14435H588929L53222L41384O76641J342654J531518K716501M358864N620071P227234
14426C2757018P417460P029322N295893M353562K394810l68548l391032o348459
14418D9140026p180831p433211o931932n719770m391962l203989j929322j319828
$$ plain form
14484 7844038 6756809 5844031 5058068 4420251 4180239 4015468 4003030 3925006 3862719 3798185
14474 3798185 3796927 3636457 4290518 4701655 5188192 5647675 5655924 6038649 6113847 6490079
14464 6490079 6428836 6191052 5714621 5960134 5877555 6381566 6444984 6786671 7250245 7226741
14454 7226741 7416538 7242750 7040457 6488237 6164410 6055572 6037053 5984289 6084469 6502045
14444 6502045 6699792 7072819 7449470 7659209 8023350 8262464 8554104 8401982 8588929
14435 8588929 8942151 9283535 9960176 11302830 12834348 15550849 19909713 25529784 32757018
14426 32757018 40174478 47203800 52499693 56853255 59248065 58879517 55488485 49140026
14418 49140026 41959195 34525984 27594052 21874282 17482320 14278331 12349009 11029181
14410A1029181j080952p60333n34637m4744q4525M4731l9672n6276r9867L72756
14400H745662k867L7649R11196J185658J567533K752872L914939O190122Q487879
14391C3790643J0817602J2652961J2884207J1010419Q525632O102558J738842
14384I7522864k589790q176737j1323251j3012210j2619941j1399889r372644
14377B9028402o875729m731271k850223k103722j414505o38420o90626j71310
14369I552596l55612j06449K1797k37294q1736J59669J51321O89887J25351R70103
14359A0889633J498454J705275K568400L890090M111383O394256O742126P323880
14351D5123497P241564P031482O606850O849729O157751N513060N322178M121123
$$ plain form
14410 11029181 9948229 9187896 8653259 8608515 8523990 8568721 8529049 8472773 8372906 8745662
14400 8745662 8742795 8780444 9691640 10877298 12444831 15197703 19112642 25302764 33790643
14391 33790643 44608245 57261206 70145413 81155832 89681464 95784022 97522864
14384 97522864 94933074 86756337 75433086 62420876 49800935 38401046 29028402
14377 29028402 22152673 17421402 14571179 12467457 11052952 10414532 9723906 9552596
14369 9552596 9196984 9090535 9112332 8875038 8793302 8952971 9104292 9794179 9919530 10889633
14359 10889633 12388087 14093362 16661762 20551852 24663235 31057491 37799617 45123497
14351 45123497 52365061 59396543 66003393 72853122 79010873 84523933 89846111 93967234
14343I3967234K644905J451894P1353k061939n081362p604906r222729j0048004
14335F4116446r550191r035570p722308n618779m032473l140326l605097l601868
14327A7809834l319681k622604k007537j821177j331297n04898n61341n27427
14319E113872m68852k83084m14958r4912k68008l78976J60647j66914o4131n4653
14309C080031j97135q493l7820Q4842l85922J78425j08972N1058j26272m177J03173
14298B628738L8280R3091m3544l9702k14365J8258j03102P9739j1481j1671n2496
14287B381745l19108l5765J45856J04920k98951M19903j54767R5486J23864p0391
14277B392792J00068j67391K77775k03819L2405R4955J1306q8004j24546j11654
$$ plain form
14343 93967234 96612139 98064033 98135386 96073447 90992085 83387179 74164450 64116446
14335 64116446 54566255 45530685 37808377 32189598 28157125 25016799 21411702 17809834
14327 17809834 14490153 11867549 9860012 8038835 6707538 6202640 5641299 5113872
14319 5113872 4645020 4361936 3946978 3852066 3584058 3205082 3365729 3198815 3134684 3080031
14309 3080031 2882896 2874403 2836583 2921425 2535503 2713928 2604956 2656014 2529742 2525565 2628738
14298 2628738 2667018 2760109 2716565 2676863 2462498 2480756 2377654 2457393 2445912 2434241 2381745
14287 2381745 2062637 2026872 2172728 2277648 1978697 2398600 2243833 2339319 2463183 2392792
14277 2392792 2492860 2325469 2603244 2399425 2431830 2526785 2538091 2450087 2325541 2213887
14267B213887J44713q4549q8938Q6316j0733K93106j37085k43645K20362j58327
14257B235107o6687k96760K7418l2441M6122Q1431j45345J93981k07142J95795
14247B031479O7048j33633j63302J61364k26928L1361j8911J0969J88241k26648
14237A721040J69300Q0704j70204L4374P3776j56840J52512J16068r4888k12668
14227A713174j4332q10q999J0765j33651J54889m8140K98790k8543L7817J64699
14216B145659P7090k03088J53804k50301L69806M9615K73195j3501O80892N38746
14206C821917K24586J85178k1930K43756L39010n36838m83448n55074m75462o17348
14196B124347j94078j77838o1859j23956K57943P6115l9496K65575j51104q3393
$$ plain form
14267 2213887 2358600 2274051 2185113 2271429 2260696 2553802 2416717 2173072 2393434 2235107
14257 2235107 2168420 1871660 1899078 1866637 1912759 1994190 1848845 2042826 1835684 2031479
14247 2031479 2098527 1964894 1801592 1962956 1736028 1767389 1748478 1759447 1947688 1721040
14237 1721040 1890340 1971044 1800840 1835214 1908990 1752150 1904662 2020730 1925842 1713174
14227 1713174 1698842 1698032 1689033 1699798 1566147 1721036 1672896 1971686 1943143 1980960 2145659
14216 2145659 2222749 2019661 2173465 1923164 2292970 2342585 2615780 2602279 3283171 3821917
14206 3821917 4046503 4231681 4209751 4453507 4792517 4255679 3772231 3217157 2741695 2124347
14196 2124347 1930269 1752431 1690572 1566616 1824559 1900674 1861178 2126753 1975649 1892256
14186A892256k5102r9513R8015k09746J16958l9928l2587J24651L19235K59530
14176B403769j01279N3448K67094J28383m25676R5396j0613k93905j50272j24324
14166A842021r1501r5654k3208R9605M5432q6016K4372Q4868O9505J01732m7974
14155A923182J7640K16883N0142n9655P0690K4659N8328j21164j35758M14214
14145B459161l66793K59139N46827L91470M36915O33066J141454O49319R44297
14136G094855P16972N55016K8992k57232n52421r47462o87324n51353o27015j468983
14126C304045J1883k64991j60065l50336J62917L10611K57758j7497L40318K23345
14116C817988j29306J49520o8581k96380k43074k33181k68451k01053j26925k56022
$$ plain form
14186 1892256 1867154 1767641 1865656 1655910 1772868 1732940 1700353 1825004 2144239 2403769
14176 2403769 2302490 2355938 2623032 2751415 2325739 2421135 2410522 2116617 1966345 1842021
14166 1842021 1750520 1654866 1631658 1731263 1776695 1690679 1715051 1799919 1869424 1971156 1923182
14155 1923182 1940822 2157705 2207847 2148192 2218882 2243541 2301869 2180705 2044947 2459161
14145 2459161 2092368 2351507 2898334 3289804 3726719 4359785 5501239 6150558 7094855
14136 7094855 7811827 8366843 8395835 8138603 7586182 6638720 5951396 5400043 4773028 3304045
14126 3304045 3315928 3050937 2890872 2540536 2703453 3014064 3271822 3254325 3594643 3817988
14116 3817988 3688682 3838202 3769621 3473241 3230167 2996986 2728535 2527482 2400557 2144535
14106B144535J17676P222M3719Q5212K21013J38535j26573N47993K68420K43399
14096C691151O97158K43976L77963j6934K82199k71605k38415J98578j46565J90741
14086E008247o6017O33542O01781L86552P46829O74360Q63834M05054J253997
14077A0508179O27526J033427J419154K431576L048913M318331N791045P335460
14069C6513611R181121J0622028J0593802Q777695P372010N284479J766373j756351
14061H8354768o263321q974647j0761216j1396828j0494866r260374o789644n140775
14053A9273097l559217k770476k111158j750331r41395r33149m86550p18844j8014
14044E983963j83336k56797l8283j72994J23084o08617k79586l81657k43799m06827
$$ plain form
14106 2144535 2262211 2269433 2313152 2398364 2619377 2757912 2631339 3179332 3447752 3691151
14096 3691151 4388309 4632285 5010248 4993314 5275513 5003908 4765493 4964071 4817506 5008247
14086 5008247 4942230 5575772 6177553 6564105 7310934 7985294 8849128 9254182 10508179
14077 10508179 11135705 12169132 13588286 16019862 19068775 23387106 29178151 36513611
14069 36513611 45694732 56316760 66910562 75688257 83060267 88344746 90111119 88354768
14061 88354768 82091447 73116800 62355584 50958756 40463890 31203516 24413872 19273097
14053 19273097 15713880 12943404 10832246 9081915 8140520 7207371 6720821 6001977 5983963
14044 5983963 5800627 5543830 5505547 5332553 5455637 4847020 4567434 4185777 3941978 3535151
14034C535151p3930l55247P227l11282P1952l11161j32012j58974J13138k02007
14024B182855j36802p4650m1952J08271O3617k42780J62713j46432K36631j3039
14014B098432k59k77828K36504K19225j07860J48549k59457Q0225J53276j91224
14004B099583k20479J280Q0213j26460J12502j18752K82334l22398N4054N3864
13994A895741M4383m2839K83319J96220J71262M01724N54111N57197R67173J274184
13984F302475R00426J226354N96378Q06247L61730j59410o73138q71772j129352
13975G359938j105026q47643p01316n78591k48365n40719k8388K0796L2477k74794
13965C088369l2734k71677J30968l80407j26218j73412m1001l04350J71652j08353
$$ plain form
14034 3535151 3461221 3105974 3113201 2801919 2873871 2562710 2430698 2271724 2384862 2182855
14024 2182855 2046053 1971403 1929451 2037722 2101339 1858559 2021272 1874840 2111471 2098432
14014 2098432 2098173 1820345 2056849 2276074 2168214 2316763 2057306 2137531 2290807 2099583
14004 2099583 1879104 1880384 1960597 1834137 1946639 1827887 2110221 1787823 1841877 1895741
13994 1895741 1940124 1897285 2180604 2376824 2548086 2949810 3503921 4061118 5028291 6302475
13984 6302475 7202901 8429255 9025633 9831880 10193610 10034200 9361062 8489290 7359938
13975 7359938 6254912 5407269 4705953 4127362 3878997 3338278 3309890 3330686 3363163 3088369
13965 3088369 3055635 2783958 2914926 2534519 2408301 2234889 2193888 1889538 2061190 1952837
13955A952837j13939K45838p9368J99484o1940L0537N6696K09376j35165K15106
13945B519462K72696L20486M40705N94567J218592J562000J929524K111103K001078
13936A2970213J994309J621549P61290k62190j133244j519295k112980k339664
13928I979988k042576k034335j454215j070383o86331k93485j37813m71697L58237
13919B147390l99858r6323J9881P1783j4416j03576j51456L40848k48376j39999
13909A425898L4189k52146K15232j67682q536J92703Q2268j53072K3156R7213
13899A489223J13428k15531J0619k8442j19486m2637K29564j43636N4354J20131
13889A467587m5432q6885j24674Q5665J23388j05367m0854J4392k761r9644J67830
$$ plain form
13955 1952837 1838898 2084736 2005368 2204852 2142912 2173449 2230145 2439521 2304356 2519462
13945 2519462 2792158 3112644 3553349 4147916 5366508 6928508 8858032 10969135 12970213
13936 12970213 14964522 16586071 17347361 17085171 15951927 14432632 12319652 9979988
13928 9979988 7937412 5903077 4448862 3378479 2692148 2398663 2260850 1789153 2147390
13919 2147390 1747532 1651209 1671090 1742873 1728457 1624881 1473425 1814273 1565897 1425898
13909 1425898 1460087 1207941 1423173 1255491 1246955 1439658 1521926 1368854 1392010 1489223
13899 1489223 1602651 1387120 1397739 1369297 1249811 1207174 1436738 1293102 1347456 1467587
13889 1467587 1422155 1335270 1210596 1296261 1419649 1314282 1273428 1287820 1285059 1185415 1353245
13878A353245k8472j44602J55160J40902k49459M13143m28186P4039j53779M6918
13868A178909K75232r9789J50015J73630q9824J5732p7390k11398L63064j16569
13858A561612q7910M6431l9105m6047m4094o466r8309k3748k887J89718J1460
13847A460655k14720J89022o1864n3607J19575k76498K27687j79439k161m8033
13837A160617N777q2290J97535J69106N1643l39396l85J70239j07946K58310r2695
13826A390515j79616J71518k09354K74544l22553l7279J6455J94422p4441j50392
13816A073819R7069n0662j5078J79284l9535J14758j62256j46742J68304j44588
13806A074373l3542K48796j25522J75413p3795J48202l05124L60923j81655r5645
$$ plain form
13878 1353245 1324773 1180171 1335331 1476233 1226774 1639917 1211731 1285770 1131991 1178909
13868 1178909 1454141 1354352 1504367 1677997 1588173 1603905 1526515 1315117 1678181 1561612
13858 1561612 1473702 1520133 1481028 1434981 1390887 1384421 1286112 1262364 1259477 1449195 1460655
13847 1460655 1245935 1434957 1373093 1319486 1439061 1162563 1390250 1210811 1208650 1160617
13837 1160617 1166394 1084104 1281639 1450745 1502388 1162992 1162607 1332846 1224900 1483210 1390515
13826 1390515 1210899 1382417 1173063 1447607 1125054 1087775 1104230 1298652 1224211 1073819
13816 1073819 1170888 1120226 1105148 1284432 1244897 1359655 1197399 1050657 1218961 1074373
13806 1074373 1040831 1289627 1164105 1339518 1265723 1413925 1108801 1469724 1288069 1192424
13796A192424L53603m56741J18529M293M7063k51422J64750J39472j51390J2140
13786A172721J59654j09560j73448N6835K22540K89127l82794J08178K6131P3135
13776A442519K77228K6681j57881m2540o6984K23169l23728J22P3601l50158K05709
13765A307738l21699L6096J60061Q648p45P99j2852M1432l32732L73702l28209
13754I32239O4811K45921O5046L00352l75976J13429j1778p2068J19132P2037
13744A453145J68754j68196j2047M93776k59793P3495j08448p756J38407J25659
13734A896996j45554k3077p3251r474J0615M5107Q3924Q0910R0540k76889N7908
13723A737755J20159J22825j57434K56877m6285o2886J79835M1684p3305O0138
$$ plain form
13796 1192424 1546027 1089286 1207815 1212108 1259171 1007749 1172499 1311971 1160581 1172721
13786 1172721 1332375 1222815 1049367 1106202 1328742 1617869 1235075 1343253 1369384 1442519
13776 1442519 1719747 1746428 1588547 1546007 1479023 1702192 1378464 1378586 1452187 1102029 1307738
13765 1307738 986039 1022135 1182196 1190844 1190099 1190898 1178046 1219478 886746 1260448 932239
13754 932239 997050 1242971 1308017 1608369 1232393 1345822 1334044 1261976 1381108 1453145
13744 1453145 1621899 1453703 1441656 1935432 1675639 1749134 1640686 1632930 1771337 1896996
13734 1896996 1751442 1728365 1655114 1645640 1656255 1701362 1785286 1866196 1956736 1679847 1737755
13723 1737755 1857914 1980739 1823305 2080182 2033897 1971011 2150846 2192530 2119225 2179363
13713B179363p2045J66183L4855J77296k47749O0530o6164k8242J40435k29905
13703B114557Q9635p7043l1083n000l7823J2000n5326J08968O4138q3843M77171
13692B576351l75462N43178j30632M4001j00853p5379k31937j22524K0528k44636
13682A902635q3077K76453k8133l77371M29658l37753J39739j39009J4246j72031
13672A625357K66706k16844K27336j05747J28777l9631J59841K63167j20115J13748
13662B302595K44280K55549l56712J64201j81298P1221k47108O7113m7012k08378
13652B064451j97753O319K0389R5059j09830m5002J35333r2555j44522M2200j15
13641A773974r2194O0428M44237l94955J90697L3999K36939J48606l2154K26207
$$ plain form
13713 2179363 2107318 2273501 2308356 2485652 2237903 2298433 2232269 2204027 2344462 2114557
13703 2114557 2204192 2127149 2096066 2091066 2053243 2065243 2009917 2118885 2183023 2099180 2576351
13692 2576351 2200889 2744067 2613435 2657436 2556583 2481204 2249267 2126743 2147271 1902635
13682 1902635 1819558 2096011 2067878 1690507 2120165 1782412 1922151 1783142 1797388 1625357
13672 1625357 1892063 1675219 1902555 1796808 1925585 1885954 2045795 2308962 2188847 2302595
13662 2302595 2546875 2802424 2445712 2609913 2428615 2499836 2252728 2319841 2272829 2064451
13652 2064451 1866698 1873017 1893406 1988465 1878635 1833633 1968966 1876411 1731889 1774089 1773974
13641 1773974 1681780 1742208 2186445 1791490 1982187 2016186 2253125 2401731 2369577 2595784
13631B595784j45633J10794j93715m9018l7291n14842K34012q6229k39710o3493
13621A610659k4788j8197k2578Q4092J43796l09950P044K04221K7845J83024k77640
13610A607528J90123J1321m3944J66761J53763K1396J10377k18206p7206J15013
13600B036926k57874j65060K70543N0359n0722j73982J09648j6157m5722j3600
13590A744359L68411j88178o3241j7801k14347J63609j4043k21171J22182n1251
13580A628529j08387l0009m0515O8115k1318J58375j58125N1136j0985K9900J03525
13569A670241L8280j49961O710P8489l0527k70326J06156J07872j89265Q8364
13559A456033j5848j6641k4426J33050k89037L22697k72215K17679Q0622k55662
$$ plain form
13631 2595784 2450151 2560945 2367230 2318212 2280921 1766079 2000091 1913862 1674152 1610659
13621 1610659 1585871 1567674 1545096 1629188 1772984 1463034 1470078 1674299 1702144 1885168 1607528
13610 1607528 1797651 1808972 1765028 1931789 2085552 2106948 2217325 1999119 1921913 2036926
13600 2036926 1779052 1613992 1884535 1934894 1884172 1710190 1819838 1803681 1757959 1744359
13590 1744359 2112770 1924592 1861351 1843550 1629203 1792812 1778769 1557598 1679780 1628529
13580 1628529 1520142 1490133 1449618 1517733 1496415 1654790 1496665 1547801 1536816 1566716 1670241
13569 1670241 1708521 1558560 1565270 1643759 1613232 1342906 1449062 1556934 1367669 1456033
13559 1456033 1440185 1423544 1399118 1532168 1243131 1565828 1293613 1511292 1591914 1336252
13549A336252J41433j93202J80851J8887J92632J01019K56086K17344q5912Q8946
13539B254336k08682J94100j19299K29834m36221L0558j74311j43115l6437o3097
13529A527666K58668j84529N8859J58639j8819L59526k45399N29260k81333k17419
13519A945119L17776k83420l69011k75242N3686L7913j85825K15386k376n2087
13509A401919j67807R5335Q4765k04101K84038l86854J42206j69164J93509j59993
13499A113853P960m715J03821p4747J50494J71480j19235Q0601l15040Q7628L16491
13488A518591k40986j48439k35673K07887K81808l27414m1705L05711k0552j52224
13478A147004r2154K6189L5190J12132j85497J19733j92806J46528J31582j35653
$$ plain form
13549 1336252 1477685 1284483 1465334 1484221 1676853 1777872 2033958 2251302 2165390 2254336
13539 2254336 2045654 2239754 2120455 2350289 1914068 1944626 1770315 1627200 1590763 1527666
13529 1527666 1786334 1601805 1660664 1819303 1800484 2160010 1914611 2443871 2162538 1945119
13519 1945119 2262895 1979475 1610464 1335222 1388908 1426821 1240996 1456382 1454006 1401919
13509 1401919 1234112 1329447 1414212 1210111 1494149 1107295 1249501 1080337 1273846 1113853
13499 1113853 1121813 1117098 1220919 1146172 1296666 1468146 1348911 1429512 1114472 1202100 1518591
13488 1518591 1277605 1129166 893493 1101380 1383188 1055774 1014069 1319780 1299228 1147004
13478 1147004 1054850 1081039 1116229 1228361 1042864 1162597 969791 1116319 1247901 1112248
13468A112248J2642Q5715r7696N0153R8031j56986N29876l14578l9931J20752
13458A400226j08011P7531j58411L17085K34751k20329M02575J45611n1298K78357
13448B318087k74773J47894j83323k1572n9140k60668k59787N3406j48269j13396
13438A198459R6153J72320N599R6656k14913k6570J07696j97592L46077l04308
13428A279577O3433r495R5036R8694j5100M77426j1988J14931J3303J55277j1288
13417B249806r5363p003J00582p1961k86518M9972k83651o5950J0299J38881L4780
13406A773874m96938K44445r4928k5595P5644p8815j34611J98267K17153k56971
13396A421525M788n7754L01432n7570J17973J9926j2589J07437J70989J8066l895
$$ plain form
13468 1112248 1124890 1210605 1112909 1163062 1261093 1104107 1633983 1319405 1279474 1400226
13458 1400226 1292215 1369746 1211335 1528420 1763171 1542842 1945417 2091028 2039730 2318087
13448 2318087 2043314 2191208 2007885 1986313 1927173 1666505 1406718 1460124 1311855 1198459
13438 1198459 1294612 1466932 1472531 1569187 1354274 1327704 1435400 1237808 1583885 1279577
13428 1279577 1343010 1333515 1428551 1527245 1512145 1989571 1977583 2092514 2105817 2261094 2249806
13417 2249806 2154443 2147440 2248022 2176061 1889543 1939515 1655864 1589914 1600213 1739094 1773874
13406 1773874 1276936 1521381 1426453 1400858 1476502 1397687 1263076 1461343 1678496 1421525
13396 1421525 1426313 1368559 1669991 1612421 1730394 1750320 1737731 1845168 2016157 2034223 2030328
13385B030328M3881J91637K40182k76267K22597j67403M0623p5964M3271j04240
13375B188645j34975j17046p2284J53155k57239j00032K42864J13578P9354j74780
13365A921240K70181l7282N2024j41045o4472m8961L68n3819K5213L3308J05696
13354B062451l5360J95998Q2102k33202L78437k90288n925R1982k20220J39416
13344B165391p9542j06864M1300l33982L95277q1103j71284n3747J1553m7948
13334A739051J58365J47856j67721K18170j34230p2392Q9301k06474J71050L4328
13324A977304n6220K51248j37558j3146L3344J36496J5838M3318n1114K69550
13314B469060q7513K76605M4907j5026J28570J21865l0222j2895j41481p5838
$$ plain form
13385 2030328 2074209 2265846 2506028 2229761 2452358 2284955 2325578 2249614 2292885 2188645
13375 2188645 2053670 1936624 1864340 2017495 1760256 1660224 1903088 2016666 2096020 1921240
13365 1921240 2191421 2154139 2206163 2065118 2000646 1951685 1952053 1898234 1923447 1956755 2062451
13354 2062451 2027091 2223089 2305191 2071989 2450426 2160138 2154213 2246195 2025975 2165391
13344 2165391 2085849 1978985 2020285 1686303 2081580 2000477 1829193 1775446 1786999 1739051
13334 1739051 1897416 2045272 1877551 2095721 1961491 1889099 1978400 1771926 1942976 1977304
13324 1977304 1921084 2172332 2034774 2021628 2054972 2191468 2207306 2250624 2199510 2469060
13314 2469060 2381547 2658152 2703059 2688033 2816603 2938468 2908246 2895351 2753870 2678032
13304B678032J66059k55204J53991k38070L71411k64243K21135J13495L80991
13295C327597p6054j33663P7813J60992j50750l609j05503J00849k73590N4251
13285B978333j79698L52464l38008K29275j42941M25318l64058K79483j74990
13276C065178J84772K68568k94608L1361J62253J14000m4733n7358O6721R790
13266C505944J68913j47675K46513J81301r0039K37328l25414K99232O0964K57559
13256D394626M286Q7501K44833j07014J45715J91360K48013j0447J92336M7954
13246E439163P5937P9204J40081J0064L20881k87172M12013j80839P9800Q8021
13236F177153J44357l0899j8320R3191J73832k494L06897p3704L45314p1799L67351
$$ plain form
13304 2678032 2844091 2588887 2742878 2504808 2876219 2611976 2833111 2946606 3327597
13295 3327597 3251543 3117880 3195693 3356685 3205935 3202326 3096823 3197672 2924082 2978333
13285 2978333 2798635 3151099 2813091 3042366 2899425 3324743 2960685 3240168 3065178
13276 3065178 3249950 3518518 3223910 3255271 3417524 3531524 3486791 3429433 3496154 3505944
13266 3505944 3674857 3527182 3773695 3954996 3864957 4102285 3776871 4076103 4137067 4394626
13256 4394626 4398912 4486413 4731246 4624232 4769947 4961307 5209320 5198873 5391209 5439163
13246 5439163 5515100 5594304 5734385 5744449 6065330 5778158 6190171 6009332 6089132 6177153
13236 6177153 6321510 6290611 6272291 6365482 6539314 6536820 6843717 6770013 7115327 7043528 7410879
13225G410879K22931N7874J98187Q6849K31824L6908K03743P3537p4614j15397
13215H332721J57388j94599K8869j92617n5166m7146k60224P0009o2100p1613
13205G705522k7205j71679R3802m01867J15006j1318J38914k37037J55787o2460
13195G297465j37407K544l95549L96080o0649k11882l46331P2625k24424k70149
13185F122323J53152j34047k7492k41477r1986m1620l21474J29109N3565k44035
13175E356018l9100j53847j01361K25132l7042j36006k14133K71410m4282J98653
13165E325442K09528o2158N0617N10943J89999R4147M63590L96619L38810K33414
13155G750951K31596l4688k5842J05599j60253k92483j06353L6492k41754Q2675
$$ plain form
13225 7410879 7633810 7691684 7889871 7976720 8208544 8245452 8449195 8522732 8448118 8332721
13215 8332721 8490109 8295510 8324379 8131762 8076596 8029450 7769226 7839235 7777135 7705522
13205 7705522 7678317 7506638 7600440 7198573 7313579 7302261 7441175 7204138 7359925 7297465
13195 7297465 7160058 7162602 6767053 7163133 7102484 6890602 6544271 6616896 6392472 6122323
13185 6122323 6275475 6141428 6113936 5872459 5780473 5738853 5417379 5546488 5600053 5356018
13175 5356018 5316918 5163071 5061710 5286842 5249800 5113794 4899661 5171071 5126789 5325442
13165 5325442 5534970 5472812 5523429 6034372 6224371 6318518 6782108 7178727 7517537 7750951
13155 7750951 7982547 7947859 7922017 8027616 7867363 7574880 7468527 7505019 7263265 7345940
13145G345940k46440K61090j50853P7094k83330j59938k61205j82420m63590k10196
13135E726152o06601l78459m3048l02415l05841M9796j66660O9699j3976K13471
13125D242118J9939j89630p9472N8851l08916n9239K64403m60473P8564l13148
13115C252997m972R3566L2253j19491P7638K3780j89998J69318P5887N6416j22964
13104C344430P2488L42851m1604M57072J82497K95311K76036M79530M97632M47675
13094F353918O48789M49306n228L26253M1416j58897j51459J06353p3173L6709
13084G573987l38013N6153m4703J7968r0817k22904l79855l80544l93747o99938
13074E097587o1673p24939k00938k72442l28740n6417k13134j66507K39391m12349
$$ plain form
13145 7345940 7099500 7360590 7209737 7286831 7003501 6843563 6582358 6399938 5936348 5726152
13135 5726152 5119551 4741092 4698044 4395629 4089788 4139584 3972924 4042623 4028647 4242118
13125 4242118 4262057 4072427 3992955 4051806 3742890 3683651 3948054 3487581 3566145 3252997
13115 3252997 3248025 3341591 3373844 3254353 3331991 3355771 3165773 3335091 3410978 3467394 3344430
13104 3344430 3416918 3759769 3718165 4175237 4357734 4653045 4929081 5408611 5906243 6353918
13094 6353918 7002707 7452013 7446785 7773038 7814454 7655557 7504098 7610451 7537278 7573987
13084 7573987 7235974 7292127 7247424 7265392 7174575 6951671 6571816 6191272 5797525 5097587
13074 5097587 5035914 4310975 4110037 3837595 3508855 3452438 3239304 3072797 3312188 2899839
13064B899839K12324P9942k10203K15275j36686J81165J40757q3225k60621Q3059
13054C121626J65365j16507N6971j91169P8591k49156J64129j86376K04634O5747
13044C113855j11522K06456j57722k38416M41188l21540J68954J22966o9934K68948
13034C423233p3978O428j44769M26758l6010N3070J8223K48074l43681L2844J29486
13023C739678K15183Q8920p5074n1642J74332k5945M0116L30685j68385J2467
13013D280335K60027k42694L06314m6805L81626j15588J50959m2944P755N51250
13003E490235j49633o5963K59988R9549j07453J58865L26981q6055n223P5201
12993E996492K33948r5057L3804j02744J45791j8234J28814j8982N8841J16752
$$ plain form
13064 2899839 3112163 3192105 2981902 3197177 3060491 3241656 3382413 3299188 3038567 3121626
13054 3121626 3286991 3170484 3227455 3036286 3114877 2865721 3029850 2843474 3048108 3113855
13044 3113855 3002333 3208789 3051067 2812651 3253839 2932299 3101253 3224219 3154285 3423233
13034 3423233 3349255 3355683 3210914 3637672 3601662 3654732 3672955 3921029 3577348 3610192 3739678
13023 3739678 3954861 4043781 3968707 3917065 4091397 4065452 4105568 4436253 4267868 4280335
13013 4280335 4540362 4297668 4603982 4557177 4938803 4823215 4974174 4931230 4938985 5490235
13003 5490235 5340602 5274639 5534627 5634176 5526723 5685588 6012569 5926514 5921291 5996492
12993 5996492 6230440 6135383 6169187 6066443 6212234 6194000 6322814 6303832 6362673 6479425
12983F479425k23953O8443p1134J05404J78806p8063j46547j70548j9954J16250
12973F238129q5619l37944K55586k44352j02237j90544P1614j9532J9568K86817
12963E891486l77138J63328l92582K35299M0197l44750K67919r1912l003M1394
12953E430238j13387J32579j95047K99684m6595k07976K11120J48742j06545k8138
12943E524675k22906L46836k23368m7231L09317r0067j42071r2632K98547j46142
12933E514958J46992J07603J9551R8131q5544P3530J67003m25329O0710k39279
12923E438326n1893o9370N0572j53300J49361j08970j31601K99924l64279K44884
12913E303654l61473j49141j06994j54354m4600J78166j87099n4489k92722k1641
$$ plain form
12983 6479425 6255472 6323915 6252781 6358185 6536991 6458928 6312381 6141833 6121879 6238129
12973 6238129 6152510 5814566 6070152 5825800 5723563 5533019 5604633 5585101 5604669 5891486
12963 5891486 5514348 5677676 5285094 5520393 5560590 5215840 5483759 5391847 5388844 5430238
12953 5430238 5316851 5449430 5254383 5554067 5507472 5299496 5510616 5659358 5552813 5524675
12943 5524675 5301769 5648605 5425237 5378006 5687323 5597256 5455185 5362553 5661100 5514958
12933 5514958 5661950 5769553 5789104 5887235 5801691 5875221 6042224 5616895 5677605 5438326
12923 5438326 5386433 5317063 5367635 5214335 5363696 5254726 5123125 5423049 5058770 5303654
12913 5303654 4942181 4793040 4686046 4531692 4487092 4665258 4478159 4423670 4130948 4109307
12903D109307M5377Q320j4836j12416j78072p3732l0419N8516k7160m34037J94134
12892C544982j1598J85123j51508j09530J55509j73127j90026J32415O2148p2708
12882C371680j69357J84685k24888J85912j36536J49794q6444N0653j70951R6781
12872C251329j78826k16654J68209k26408j339j06601K37867j90201L29736l48219
12862B718893j31822m1154J85037P7593l10944N65863k95970j24817J34677J4525
12852B791881j76529K38548j6278k31931l1249Q1045j63264K52360l66818Q6706
12842B464471o6811K21666j06842K17744j72702J16738j78312J95622J46671j42114
12832B696131O0678k00428r2100J28461l3407o7732J40356J4478M546j00380r7937
$$ plain form
12903 4109307 4154684 4163004 4148168 4035752 3857680 3783948 3753529 3812045 3784885 3350848 3544982
12892 3544982 3533384 3718507 3566999 3457469 3612978 3439851 3249825 3382240 3444388 3371680
12882 3371680 3202323 3387008 3162120 3348032 3211496 3361290 3274846 3325499 3154548 3251329
12872 3251329 3072503 2855849 3024058 2797650 2796311 2689710 2927577 2737376 3067112 2718893
12862 2718893 2587071 2545917 2730954 2808547 2497603 3063466 2767496 2642679 2777356 2791881
12852 2791881 2615352 2853900 2837622 2605691 2574442 2655487 2492223 2744583 2377765 2464471
12842 2464471 2397660 2619326 2512484 2730228 2557526 2674264 2495952 2691574 2838245 2696131
12832 2696131 2756809 2556381 2464281 2592742 2559335 2491603 2631959 2646437 2650983 2550603 2452666
12821B452666K06989j24610m7862K7617N0585K6357J13184Q2350k68257m16q4950
12810B433653J57590k6104j18795J20169M6272k7382Q4463l3535k03307J67779
12800B600803P6530k1760J17097j02546j383p4940O8018J27005k4211j66090M954
12789B603477J69406k0641q0213j3316J37603J18640k82205P6225p1238k8141
12779B609597L69995j23051j19499k54964K8851J11367n2782K13244k12626J18705
12769B688837N6988R196J0312K72776Q518l88840J41586L51318m31953l1269P9467
12758B766936J7680J59117k07185K24992j07344k39991L99046k16779n4177J8254
12748B760549M6745j34209j1784J76417o2782q6566K57844J22975k20381O0262
$$ plain form
12821 2452666 2659655 2535045 2487183 2514800 2565385 2591742 2704926 2787276 2519019 2518603 2433653
12810 2433653 2591243 2565139 2446344 2566513 2612785 2585403 2669866 2636331 2433024 2600803
12800 2600803 2677333 2655573 2772670 2670124 2668741 2593801 2661819 2788824 2764613 2598523 2603477
12789 2603477 2772883 2752242 2672029 2658713 2796316 2914956 2632751 2708976 2637738 2609597
12779 2609597 2979592 2856541 2737042 2482078 2510929 2622296 2569514 2782758 2570132 2688837
12769 2688837 2745825 2755021 2765333 3038109 3046627 2657787 2799373 3150691 2718738 2687469 2766936
12758 2766936 2784616 2943733 2736548 2961540 2854196 2614205 3013251 2796472 2742295 2760549
12748 2760549 2807294 2673085 2661301 2837718 2774936 2688370 2946214 3069189 2848808 2909070
12738B909070r039J6704k13772K89162j17966O5713J40285j56925N0916Q7688
12728C061836j71861k8902K15427l32478J41974J88945N4206k04862K62840J6482
12718C203607k34320O2022j67167L56822K2601j03373q0663K84291K3387j05968
12708C261239R5109k05192K47637O370K32608K48168O9850R3584K577P3289L20333
12697D445572J96242L38784j55432N05301N54383j4766P16937J75985K38248O63136
12687G664390J52221j96733l25671M3058l79517j94250m63142o47824n67100j66872
12677D918560j31073m083n45595l7310O4032r693L9425p813J37296J62960P5334
12666D662040J37846K0441k6014J80662K92003k78592m3909K87013n7933Q1426
$$ plain form
12738 2909070 2900031 2916735 2702963 2992125 2874159 2939872 3080157 2923232 2974148 3061836
12728 3061836 2889975 2861073 3076500 2744022 2885996 3074941 3129147 2924285 3187125 3203607
12718 3203607 2969287 3031309 2864142 3220964 3243565 3140192 3059529 3343820 3367207 3261239
12708 3261239 3356348 3151156 3398793 3405163 3637771 3885939 3955789 4049373 4051950 4125239 4445572
12697 4445572 4641814 4980598 4825166 5330467 5884850 5870084 6587021 6763006 7001254 7664390
12687 7664390 7816611 7619878 7294207 7337265 6957748 6763498 6300356 5652532 5085432 4918560
12677 4918560 4787487 4783404 4237809 4200499 4264531 4254838 4294263 4286450 4423746 4586706 4662040
12666 4662040 4799886 4820327 4794313 4974975 5266978 4988386 4944477 5231490 5173557 5254983
12656E254983P9568M19001M30917O6954K46467J95572K44938L4296J61076k07377
12646F926395l52255j70396J7170l69468M4077M1984q7404L22853j86507L39301
12636F525750p3347L38492R8654J61664J68619J03359K11013J93247K1630k04953
12626G544128k13888j76412j78861n20699j33504l98271k84493j42385m23917
12617E071698m5986l88381J37205Q4254J42176L11815J08141M43817O49945K87888
12607F802572O50611L67521J97974L77979q4519j68714m21598l15561k13547o72959
12597F519759l13641k2378m58042J53044k9259J64172J24500L92903k20611J21892
12587F432339r5174K50890l96922m4240j88383q8905j43910K90543n6688L62428
$$ plain form
12656 5254983 5334551 5753552 6184469 6251423 6497890 6693462 6938400 6972696 7133772 6926395
12646 6926395 6574140 6403744 6420914 6051446 6095523 6137507 6050103 6372956 6186449 6525750
12636 6525750 6452403 6790895 6889549 7051213 7219832 7323191 7534204 7727451 7749081 7544128
12626 7544128 7330240 7153828 6974967 6454268 6320764 5922493 5638000 5495615 5071698
12617 5071698 5025712 4637331 4774536 4858790 5000966 5312781 5420922 5864739 6514684 6802572
12607 6802572 7453183 7820704 8018678 8396657 8312138 8143424 7721826 7406265 7192718 6519759
12597 6519759 6206118 6183740 5725698 5878742 5849483 6013655 6138155 6531058 6310447 6432339
12587 6432339 6337165 6588055 6191133 6146893 5958510 5869605 5725695 6016238 5959550 6321978
12577F321978j6241L62598j23619M42815l33485k41526j52097k39634l70336m08489
12567E241964l42596j33543n13671L97711L3642O3351O95l72820L27140j8085
12557D683788l6414K7081J10120m20485J67745N2449j81822K87446O3700n2488
12547D701120K9468j73663L2093L8043J8120K13331J04549J20434k83798P8940
12537D878637J37293o5798j46518n7354L5047j41682l45120Q5934R8426l32425
12527D146440L28195j35621J15018j42036J51912L66122l18105J31628L1849k76397
12517D399005L76305K4187j35483J68321J01391L31010O7574M15337K32992J26592
12507F107231j58074k4582M1247j31122l01950j93817n77061p9338J09624j32077
$$ plain form
12577 6321978 6305737 6668335 6544716 6987531 6654046 6412520 6260423 6020789 5650453 5241964
12567 5241964 4899368 4765825 4252154 4649865 4683507 4746858 4747553 4374733 4701873 4683788
12557 4683788 4647374 4674455 4784575 4364090 4531835 4584284 4402462 4689908 4753608 4701120
12547 4701120 4730588 4556925 4589018 4627061 4645181 4858512 4963061 5083495 4799697 4878637
12537 4878637 5015930 4950132 4803614 4746260 4781307 4639625 4294505 4380439 4478865 4146440
12527 4146440 4474635 4339014 4454032 4311996 4463908 4830030 4511925 4643553 4675402 4399005
12517 4399005 4775310 4799497 4664014 4832335 4933726 5264736 5332310 5747647 5980639 6107231
12507 6107231 5949157 5924575 5965822 5834700 5532750 5338933 4761872 4682534 4792158 4660081
12497D660081K5096L1396r2452L1230J52937O8093j61189j85822K46270M9993
12487D825633k9200j08125K56272q4575K65247K6265J8770J80712k2664K60716
12477E589051L9810k73968M0579n2009k67650O1015k05523l17148R8103J5494
12467D727754J58031L0595K16376J16689k67716j35975N01264j79690M8543m3860
12457E172011R9753r2074R2033q111J73168J52033j59842J54640J47123K29880
12447E960614N8892J5364J45135J23526J62329J81044M06823r1602J74906J75907
12437G312938K36940J75839P1378J01070R1013j97954M62556k21458M01015L9249
12427H472586P7504J35884J22209J0298O7286L543Q289Q5081Q9356J75131J40913
$$ plain form
12497 4660081 4685177 4716573 4624121 4655351 4808288 4876381 4715192 4529370 4775640 4825633
12487 4825633 4796433 4688308 4944580 4860005 5125252 5151517 5170287 5350999 5328335 5589051
12477 5589051 5628861 5354893 5395472 5343463 5075813 5136828 4931305 4614157 4712260 4727754
12467 4727754 4885785 4916380 5132756 5249445 4981729 4845754 5347018 5167328 5215871 5172011
12457 5172011 5271764 5179690 5271723 5263612 5436780 5588813 5428971 5583611 5730734 5960614
12447 5960614 6019506 6034870 6180005 6303531 6465860 6646904 7053727 6962125 7137031 7312938
12437 7312938 7549878 7725717 7797095 7898165 7989178 7791224 8253780 8032322 8433337 8472586
12427 8472586 8550090 8685974 8808183 8818481 8885767 8889310 8897599 8982680 9072036 9247167 9388080
12416I388080M65842r0672N26638K90560L38561K61482L50506L17685k3741M32168
12406A2257109k58934m6587J23507m31967K08276k7329k06235j55391J97672l30688
12396A1329433o6368k5758l2843J68345L03940j4411M9626K47479K82179M40579
12386A2682201N36953K1803N41130R9485N53361K22367J41642R1504L1342N09698
12376A5431486N0996k918R8777J62420o5227K8770K87255m0509k98947M3581o2818
12365A5632866K2252p1659j02530L0384m80767q6740Q282M5029k89339j95498
12355A4512280j05419j97562k65054l1924j42708m49359k45011J27480l06323
12346A2896400l64437j51591O0735j00532L30134j68610K63607M47128K42686
$$ plain form
12416 9388080 9853922 9763250 10289888 10580448 10919009 11180491 11530997 11848682 11824941 12257109
12406 12257109 11998175 11951588 12075095 11643128 11851404 11824075 11617840 11462449 11660121 11329433
12396 11329433 11263065 11237307 11204464 11372809 11676749 11662338 11711964 11959443 12241622 12682201
12386 12682201 13219154 13240957 13782087 13881572 14434933 14657300 14798942 14890446 14921788 15431486
12376 15431486 15482482 15479564 15578341 15740761 15675534 15704304 15991559 15951050 15652103 15695684 15632866
12365 15632866 15655118 15583459 15480929 15511313 15030546 14943806 14952088 14997117 14707778 14512280
12355 14512280 14406861 14209299 13944245 13912321 13769613 13320254 13075243 13202723 12896400
12346 12896400 12531963 12380372 12441107 12340575 12670709 12502099 12765706 13212834 13455520
12337A3455520L99309L41872K82402K13277L22266M81478L83447R2623N07602
12328A6479796K07944L04289L30329L52611J10589j91888M50164p1286K00690
12319A8173238M611J09200j60303m7375j55128K65417j78630J71226J91056N0167
12309A8423479J45122K10512L43530K34258N57939J01306P82887J00705P7763
12300B0977501J16703j08288k32882o75248o62610p2754p49384n33313l56290
12291A7703435l60654k00721K24368l19037k41025l38686k49520o11913j68123
12282A5438124o76581o42333j51633o64303l23671m40658n80026M6654k61284
12273A1744289j55870j03308k64658M0412J1342j8639J33117j73492k39748Q2363
$$ plain form
12337 13455520 13854829 14196701 14479103 14692380 15014646 15496124 15879571 15972194 16479796
12328 16479796 16687740 16992029 17322358 17674969 17785558 17593670 18043834 17972548 18173238
12319 18173238 18177849 18287049 18126746 18079371 17924243 18189660 18011030 18182256 18373312 18423479
12309 18423479 18568601 18779113 19122643 19356901 19914840 20016146 20799033 20899738 20977501
12300 20977501 21094204 20985916 20753034 20077786 19415176 19342422 18593038 18059725 17703435
12291 17703435 17342781 17142060 17366428 17047391 16806366 16467680 16218160 15606247 15438124
12282 15438124 14761543 14119210 13967577 13303274 12979603 12538945 11958919 12005573 11744289
12273 11744289 11588419 11485111 11220453 11260865 11272207 11253568 11386685 11213193 10973445 11055808
12263A1055808J8930p0549j4994k65666K28470j45408J37191j40892L63990N71519
12253A1738399K5059O85247K93972O86812P31690Q17635J005713J064081O37886
12244A7686494J291553J097385R94791P96625N53904K06084K97731N3828k64172
12235B2714223M829l96165j85739j96954j56663L9584N0431o33000j07593j016080
12225B0116873l70424j161355r66837r88090j180485q80948r88997n21664r16606
12216A2141467m24676l07891m00961k86101k31872m02158Q4544k25393k29635
12207I717324l65613l20672k4631n8404j06284L38878l86571r0296L02630j52325
12197H854036J81008R1605k38176K44574q2636J77950K80389q6808R4775N17222
$$ plain form
12263 11055808 11074738 11004189 10989195 10723529 10951999 10806591 10943782 10802890 11166880 11738399
12253 11738399 11763458 12448705 12742677 13429489 14161179 14978814 15984527 17048608 17686494
12244 17686494 18978047 20075432 21070223 21866848 22420752 22626836 22924567 22978395 22714223
12235 22714223 22719052 22322887 22137148 21940194 21783531 21823115 21873546 21240546 21132953 20116873
12225 20116873 19746449 18585094 17618257 16630167 15449682 14568734 13579737 13058073 12141467
12216 12141467 11716791 11408900 11007939 10721838 10489966 10087808 10172352 9946959 9717324
12207 9717324 9351711 9031039 9006408 8948004 8841720 9180598 8794027 8703731 9006361 8854036
12197 8854036 9035044 9126649 8888473 9133047 9050411 9228361 9508750 9421942 9516717 10033939
12187A0033939K69497J66956j54116L84879L7337j2720K95095K47677J97096n8577
12177A1407063r3652q1959k07240q785p5674l2780o6060N1379K27029j7451L05636
12166A1407506J21526J47055L31718K87550N35926K32148O17647K12624P28720
12157A4622420K05645L38490k35573o50115Q7205m53208l33060K26363l13890
12148A3494277O03455L44948P4549M86966K74639L39083R6046L65537L53882J45797
12138A6579179L32653Q39027L62672P01691J043599J182165J517949J176961J825789
12129B5561685J901716J791406K126614J663892J701656J715113J421789R24462
12121C8808333L75143r6829K30716K644n73360q36097n76631m94996q73947n83025
$$ plain form
12187 10033939 10303436 10470392 10316276 10701155 10738492 10725772 11020867 11268544 11465640 11407063
12177 11407063 11313411 11231452 11024212 11015427 10939753 10906973 10840913 10892292 11119321 11101870 11407506
12166 11407506 11529032 11676087 12007805 12295355 12831281 13063429 13681076 13893700 14622420
12157 14622420 14828065 15166555 14930982 14280867 14368072 13914864 13581804 13808167 13494277
12148 13494277 14097732 14442680 14517229 15004195 15278834 15617917 15713963 16079500 16433382 16579179
12138 16579179 16911832 17750859 18113531 18815222 19858821 21040986 22558935 23735896 25561685
12129 25561685 27463401 29254807 31381421 33045313 34746969 36462082 37883871 38808333
12121 38808333 39183476 39086647 39317363 39320007 38746647 37910550 37333919 36838923 35964976 35381951
12111C5381951p55755p99316p25564n94072m14968m06562l47388J45218J30264
12102C1613808M46326K59234l1869M82371O7375k9563m15911o03330r35146q90148
12092B9963147q48642p50128o68102n7104O14298J32694Q54167N93715J152567
12083C0986612P42365M01257K45144K80938j58096M61396l11064J70962k82566
12074C2536948K83817J49924j40118k87387l13821n79451o24428p61174j063702
12065B9200608q52065j119377j107301j022540o90341p67871m20664k47570o50509
12056B2322370j48118m31029l67399m85936k46260n73440n90972k83736l75298
12047A8820182k65047m33545l27316l49929j11153l12410n33075k64407m08120
$$ plain form
12111 35381951 34626196 33826880 33101316 32507244 32092276 31685714 31338326 31483544 31613808
12102 31613808 32060134 32319368 32287499 32769870 32837245 32807682 32391771 31788441 30853295 29963147
12092 29963147 29114505 28364377 27696275 27639171 28253469 28386163 29240330 29834045 30986612
12083 30986612 31728977 32130234 32375378 32656316 32498220 32959616 32648552 32819514 32536948
12074 32536948 32820765 32970689 32830571 32543184 32229363 31649912 31025484 30264310 29200608
12065 29200608 28348543 27229166 26121865 25099325 24408984 23641113 23220449 22972879 22322370
12056 22322370 22174252 21743223 21375824 20889888 20643628 20070188 19479216 19195480 18820182
12047 18820182 18555135 18121590 17794274 17444345 17333192 17020782 16487707 16223300 15815180
12038A5815180l12160j33097n38909m0230l84605j0343K59439n0416O39697P00348
12028A5944904J48994O92089L06163O0981J31336k41705j40233l67106r01508
12019A5633915n08593o80065n08737m15879j38352p3761m47169k54385l81913
12010A2225061k40895m90675m48865r3421j46343P9965K04765J83966K80152L50336
12000A1904046J21615R808j46203l94434P2819m67293n18691m49816j72975m69649
11990I489227N7391q1288P207n5769k13765L9400k32090l58558k37008l89591
11980H025156k86871m36734R0468k45703K16797j88941j7433L767j08179o3155
11970F989172m22719k58594p4329k01531n103m09452J04059j30118j004J0281
$$ plain form
12038 15815180 15503020 15369923 14831014 14790784 14406179 14395836 14655275 14604859 15244556 15944904
12028 15944904 16093898 16785987 17092150 17153131 17284467 17042762 16902529 16535423 15633915
12019 15633915 15125322 14445257 13936520 13520641 13382289 13308528 12861359 12606974 12225061
12010 12225061 11984166 11493491 11044626 10951205 10804862 10884827 11089592 11273558 11553710 11904046
12000 11904046 12025661 12035469 11889266 11494832 11567651 11100358 10581667 10131851 9958876 9489227
11990 9489227 9546618 9465330 9472537 9416768 9203003 9242403 9010313 8651755 8414747 8025156
11980 8025156 7738285 7301551 7392019 7146316 7363113 7174172 7156739 7160506 7052327 6989172
11970 6989172 6566453 6307859 6233530 6031999 6026896 5617444 5721503 5591385 5590381 5600662
11960E600662k61052L16704J26580K52029L24783Q2852K285J01203j29032J28295
11950F545309k54978j62865K72349j23612J62858L9986J08768J08697L23900M58985
11940G479397j31187J16549M0r498m0098K45913q9243J22955o7974J03658j43038
11929G587474K47037J047R8143l96011o3692j65479k09610j22512n8043l49212
11919F569142n0757j36423k60745j746J13549j48402r388l773M39562M42517O78564
11908G632100J795749J177803Q10624M77641M83775O80674l4634j747053j627432
11899I649247j282651j219230j305938m11166k29854l07487K32963r2003L17853
11890E351734k41872O22041K7642P13025K66484R34237P77146P64602J81216O52556
$$ plain form
11960 5600662 5339610 5656314 5782894 6034923 6359706 6442558 6444843 6546046 6417014 6545309
11950 6545309 6290331 6127466 6399815 6276203 6439061 6479047 6587815 6696512 7020412 7479397
11940 7479397 7348210 7464759 7464799 7455301 7415203 7661116 7571873 7694828 7626854 7730512 7587474
11929 7587474 7834511 7835558 7933701 7537690 7473998 7308519 7098909 6976397 6918354 6569142
11919 6569142 6518385 6381962 6121217 6119471 6233020 6084618 6075230 6071457 6511019 6953536 7632100
11908 7632100 9427849 10605652 11416276 11893917 12377692 13058366 13023732 11276679 9649247
11899 9649247 8366596 7147366 5841428 5430262 5200408 4892921 5125884 5033881 5351734
11890 5351734 5109862 5731903 5759545 6472570 6739054 7673291 8450437 9215039 9396255 10048811
11880A0048811J60895K52331m19165m05873p20108n22178q88860m90635k24617
11871F790601n25875m25340l78517k72067j75726N361k51895k78025k8004o8075
11861D392438J54133k36531K01142k51630J32674l66395M88388k61345J70253
11852D423127J4640K90057J14225k65745K62836M01077n5072N94199L25016Q47671
11842F952031J79262Q86530K36742l4185N81629R1886j10553m37180l91536k32713
11832G721913j78127j46155J11607J63263q6772n6241m01063k19210l26164o15996
11822E967055k10177p22931l20196l66407m35715l9279k99696J17882l9367J00275
11812C751444o2490o8613j19999m2987R7633j7924k0437j9974R9986k3122l29051
$$ plain form
11880 10048811 10209706 10462037 10042872 9636999 8916891 8394713 7505853 7015218 6790601
11871 6790601 6264726 5839386 5460869 5188802 5013076 5018437 4766542 4488517 4460513 4392438
11861 4392438 4546571 4310040 4511182 4259552 4392226 4025831 4514219 4252874 4423127
11852 4423127 4437767 4727824 4842049 4576304 4839140 5240217 5185145 5779344 6104360 6952031
11842 6952031 7131293 8017823 8254565 8220380 8802009 8893895 8783342 8346162 7954626 7721913
11832 7721913 7543786 7397631 7509238 7672501 7585729 7529488 7128425 6909215 6583051 5967055
11822 5967055 5756878 5033947 4713751 4347344 3911629 3872350 3572654 3690536 3651169 3751444
11812 3751444 3688954 3620341 3500342 3457355 3554988 3537064 3516627 3496653 3596639 3573517 3244466
11801C244466L10548k23865K22718P6638j77853N20251l74009K50113o1884K74500
11791D061623K12237L43466K95600Q04177L41820J20958L19958Q8039L1866j75121
11781F444623m68106o71263n15374k82927n70519k99279j6648j72786j6096k52766
11771C178859J29692k28556j49137K51482j68163L8916j3368k9186n3432m0250
11761B916857O4566M909j87303L0167P4808j52553N9716j95911M06883p8796O2023
11750C005366k02190j16999J56030p0494O8663n1467k7677J38994J1919q7225
11740B824920j78987N3590o0052K01045p3945R8248l79230L23050k85023P4623
11730B598239J17168k53761J07019R1248l84886K03490J37427l21780L18010O9175
$$ plain form
11801 3244466 3555014 3331149 3553867 3630505 3452652 3972903 3598894 3849007 3787123 4061623
11791 4061623 4273860 4617326 4912926 5717103 6058923 6179881 6499839 6587878 6619744 6444623
11781 6444623 5976517 5305254 4789880 4506953 3936434 3637155 3620507 3447721 3431625 3178859
11771 3178859 3308551 3079995 2930858 3182340 3014177 3053093 3039725 3010539 2957107 2916857
11761 2916857 2981423 2986332 2799029 2829196 2904004 2751451 2811167 2615256 3022139 2943343 3005366
11750 3005366 2803176 2686177 2842207 2771713 2840376 2788909 2761232 2900226 2912145 2824920
11740 2824920 2645933 2699523 2639471 2840516 2766571 2864819 2485589 2808639 2523616 2598239
11730 2598239 2715407 2461646 2568665 2659913 2275027 2478517 2615944 2294164 2612174 2681349
11720B681349l05885K30573k50433K76267j68050J88642k0638r4251N94J37586
11710B675754j01999J74937j06156J54498k37420J62665j09892n5420R0323o0189
11700B587101m145K51100L3767J8876J65965j25435n9715O8929Q8601r0576k43467
11689B691001N09973n6111j00675m7178K31395j17824M46635k82267K4378J07478
11679C406805J66145l685j07486J38283K13041k98055J9368j57610J93662j05881
11669C464587J29848K20009k16238o195M0880l2194q4994J50075k34483J20050
11659C551345j19004k7667j49703j5002J57450k16226K11617k07877K29319k68117
11649C146135j71909M00473p5215j82122O6638O2513M4983j65573L2228o3238
$$ plain form
11720 2681349 2375464 2606037 2355604 2631871 2463821 2652463 2631825 2537574 2538168 2675754
11710 2675754 2573755 2748692 2642536 2797034 2559614 2722279 2612387 2556967 2647290 2587101
11700 2587101 2582956 2834056 2867823 2886699 3052664 2927229 2867514 2936443 3025044 2934468 2691001
11689 2691001 3200974 3144863 3044188 2997010 3228405 3110581 3557216 3274949 3299327 3406805
11679 3406805 3572950 3569265 3461779 3600062 3813103 3515048 3534416 3376806 3570468 3464587
11669 3464587 3594435 3814444 3598206 3592011 3632891 3600697 3515703 3665778 3431295 3551345
11659 3551345 3432341 3404674 3254971 3239969 3397419 3181193 3392810 3184933 3414252 3146135
11649 3146135 2974226 3374699 3299484 3117362 3184000 3246513 3291496 3125923 3158151 3094913
11639C094913J26264j89086L3957j56295L85367l85545J18950J45133j39645R8232
11629C132245q6500k15769J22708j6990q6629q2681N0365q0807M2166k0753J91540
11618B948895l37240L81468j87126j96607J48117J20132l5594K7238m586j09910
11608B754787K11250J47154j4785k67162P3520K19955J25418o9186J31120k93916
11598C018155J38810l9149Q0951j88321J1852J9387J35760K59361p8186k29141
11588C129479k977j43153J48110R0257k06160J93384j11347J25351j2433k05798
11578C004713M66040k17609P0076K0570J79060J13928j63221k05177J21086j90617
11568C198849K47561j90677J00135j30363J24683L3768r2464K31016K908q1602
$$ plain form
11639 3094913 3221177 3032091 3066048 2909753 3295120 2909575 3028525 3173658 3034013 3132245
11629 3132245 3045745 2829976 2952684 2935694 2849065 2766384 2816749 2735942 2778108 2757355 2948895
11618 2948895 2611655 2993123 2805997 2609390 2757507 2877639 2842045 2869283 2864697 2754787
11608 2754787 2966037 3113191 3098406 2831244 2904764 3124719 3250137 3180951 3312071 3018155
11598 3018155 3156965 3117816 3198767 3010446 3022298 3041685 3177445 3436806 3358620 3129479
11588 3129479 3126502 2983349 3131459 3221716 3015556 3208940 3097593 3222944 3210511 3004713
11578 3004713 3470753 3253144 3323220 3343790 3522850 3636778 3473557 3268380 3389466 3198849
11568 3198849 3446410 3255733 3355868 3225505 3350188 3383956 3291492 3522508 3525416 3443814
11558C443814J43344l47677K76785K4462p11J4462r5236M5191j79147R0324o1909
11547C353702l1171J0883l6460R5287k68842n1975K01431k33534K79193k20050
11537C098464J28378k7777j12555J6120J46701k24979P9005K26696k47775P7654
11527C159932n3204j5002M287K66403l08267R542J85523j42179J9444J68152N131
11516C299762j36887r5521L66828Q3376j98405o3196j777J10453L8725L7783K363
11505C443504P8097J11295k08394j19835k789J81657J60700p8153j78395K61695
11495C649382j99539p7063J39065k15449J36657K88134L9983M7972l03913L42375
11485C847604J46706k43221k3774j06373K72516j72509j6536o7100J23518j1908
$$ plain form
11558 3443814 3587158 3239481 3516266 3540728 3540017 3554479 3459243 3504434 3325287 3415611 3353702
11547 3353702 3322531 3333414 3296954 3392241 3123399 3071424 3272855 3039321 3318514 3098464
11537 3098464 3226842 3199065 3086510 3102630 3249331 3024352 3103357 3330053 3082278 3159932
11527 3159932 3106728 3091726 3096013 3362416 3054149 3063691 3249214 3107035 3126479 3294631 3299762
11516 3299762 3162875 3067354 3434182 3517558 3319153 3255957 3254180 3364633 3403358 3441141 3443504
11505 3443504 3521601 3632896 3424502 3304667 3301878 3483535 3644235 3566082 3387687 3649382
11495 3649382 3449843 3372780 3511845 3296396 3433053 3721187 3761170 3809142 3505229 3847604
11485 3847604 3994310 3751089 3727315 3620942 3893458 3720949 3704413 3637313 3760831 3748923
11475C748923K87907k64244K48028k57571j0229j73685J47995k13180L05125j58006
11465C661063n0741j65037J87450j26175R6532j42229Q6949n4219j36336N1752
11455C409009K35111j39407o1667K99117k16384K54570o8681m39537K69556j19645
11445C422042J94295J15852l8790P0569J24759J88174j01427j4402n6190M811
11435C909693K49118O231j75462K16819j19044K04295Q7762j44878J33733k6933
11425D341334L3160q1148k5179Q5369j32622J55225n5376o0940Q7252k28149K49495
11414D368421P7057k5132M9432k922j02456K19789N3817r1722J6444J29772J77929
11403D870429k6932j24156J20213K81321k04090J87423J15916J33620Q3756o9152
$$ plain form
11475 3748923 4036830 3772586 4020614 3763043 3752814 3579129 3727124 3513944 3819069 3661063
11465 3661063 3610322 3445285 3632735 3506560 3603092 3460863 3547812 3493593 3357257 3409009
11455 3409009 3644120 3504713 3443046 3742163 3525779 3780349 3711668 3272131 3541687 3422042
11445 3422042 3616337 3732189 3693399 3763968 3888727 4076901 3975474 3961072 3904882 3909693
11435 3909693 4158811 4165042 3989580 4206399 4087355 4291650 4379412 4234534 4368267 4341334
11425 4341334 4374494 4293346 4268167 4353536 4220914 4376139 4320763 4259823 4347075 4118926 4368421
11414 4368421 4445478 4420346 4469778 4466856 4364400 4584189 4638006 4546284 4562728 4692500 4870429
11403 4870429 4843497 4719341 4839554 5120875 4916785 5104208 5220124 5353744 5437500 5368348
11393E368348K81047l03586K20075R3400L18131l39456L49424Q9592J1424o1150
11383F027249L30441m5576O1876j15729Q4355K11592j94230N5437J06156K6614
11373F548185r1216K82899J09783r2897Q8288R2602J29232k12135J65573J72296
11363G192610r4191O8306j57133L38263j65019j62666p9253J99818L597j11690
11353G032642K55942p3591L1232j71072P8980O5773L28843k60071j03629n8933
11343G126116K33523O7883j41938R3695l26235J44902j21372q6778O5115j61772
11333F893139M9166j92645R2649K8003l33462R4214m970m05012J47081Q4338j89468
11322F263033j227m0653o2103k05482j08497K07910j38097j08779p0385o1747
$$ plain form
11393 5368348 5649395 5345809 5565884 5659284 5977415 5637959 5987383 6076975 6088399 6027249
11383 6027249 6357690 6312114 6373990 6258261 6342616 6554208 6359978 6415415 6521571 6548185
11373 6548185 6456969 6739868 6849651 6756754 6845042 6937644 7066876 6854741 7020314 7192610
11363 7192610 7098419 7166725 7009592 7347855 7182836 7020170 6940917 7140735 7144332 7032642
11353 7032642 7288584 7214993 7246225 7075153 7154133 7219906 7548749 7288678 7185049 7126116
11343 7126116 7359639 7427522 7285584 7379279 7053044 7197946 7076574 6989796 7054911 6893139
11333 6893139 6942305 6749660 6842309 6870312 6536850 6631064 6626094 6221082 6368163 6452501 6263033
11322 6263033 6261806 6221153 6159050 5953568 5845071 6052981 5914884 5806105 5735720 5673973
11312E673973j97800k23065R6024l61725j42854K85187m11456k8264j1714j42444
11302D535862n8341o7748Q653k25255m1255j9489J2276k94113m6541K29666j65489
11291C868226O8354j46563k78624N1638j92531L73802m69155M5154q2382J03828
11281C341747o7680r1141l3371m0900j30266p9776K79955p059j27866j0590j83013
11270B850040M9459j75198N2339K62072j60486j02346Q4103k25969K88375r4303
11260B828086j20900K0708J47249k84139J4117K56811l66627K22399q9873L0679
11250B658510k91534N8327R1726Q3857M8471j0854k22504J61711q9710J94685
11240B682685l4067k12298J65108k20561J18464N3708K13160j94020n9766J17479
$$ plain form
11312 5673973 5476173 5253108 5349132 4987407 4844553 5129740 4718284 4690020 4678306 4535862
11302 4535862 4477521 4409773 4418426 4193171 4151916 4132427 4144703 3850590 3804049 4033715 3868226
11291 3868226 3936580 3790017 3511393 3563031 3370500 3744302 3275147 3320301 3237919 3341747
11281 3341747 3274067 3182926 3149555 3108655 2978389 2898613 3178568 3171509 3043643 3033053 2850040
11270 2850040 2899499 2724301 2776640 3038712 2878226 2775880 2859983 2634014 2922389 2828086
11260 2828086 2707186 2727894 2875143 2591004 2605121 2861932 2495305 2717704 2627831 2658510
11250 2658510 2366976 2425303 2517029 2600886 2649357 2638503 2415999 2577710 2488000 2682685
11240 2682685 2648618 2436320 2601428 2380867 2499331 2553039 2766199 2572179 2512413 2629892
11230B629892n348r7786L90163J37355K85752K68319N55101P71338J095398M45364
11220F475548Q64521J8197N67797J08103p63527j227453p50999n34090o85974
11211D072123q42916l6509k38202j67962k43820J37140j9894J01853j9698k31320
11201B510795L99121k80600L23787J97050P6090N94171P18658Q05729J049272
11192F394073N55412M36121J06549M58190j88060l96797r66801r05729r13937
11183D579021o96293n30221m4328k02385j19616j69340J26729Q4315j14649j85481
11173B727752K46749R0969J60383l07399Q3737J05807j74728P2287j00973O4924
11163B969508J28632j80019L18182j4722j25406j67178J73709J93399Q6108l49057
$$ plain form
11230 2629892 2624544 2526758 2916921 3054276 3340028 3608347 4163448 4934786 6030184 6475548
11220 6475548 7340069 7358266 7926063 8034166 7270639 6043186 5292187 4758097 4072123
11211 4072123 3229207 3192698 2954496 2786534 2542714 2679854 2659960 2761813 2742115 2510795
11201 2510795 2909916 2629316 2953103 3150153 3226243 3820414 4539072 5344801 6394073
11192 6394073 6949485 7385606 7492155 7950345 7762285 7365488 6398687 5492958 4579021
11183 4579021 3882728 3352507 3308179 3105794 2986178 2816838 2943567 3027882 2913233 2727752
11173 2727752 2974501 3065470 3225853 2918454 3002191 3107998 2933270 3005557 2904584 2969508
11163 2969508 3098140 2918121 3236303 3221581 3096175 2928997 3102706 3296105 3382213 3033156
11153C033156J16738P9966k2886k1822j42591j67624K97534j92086K24508P7246
11143C282139j05444o1003J61430Q8630j21593n5878L7569R1054M9522j2063j91767
11132C162596L53981j21540n9112K75352n5130m0496J26085j57768O8621J21941
11122C674530o0302N0273J8537J7413k3385L7408J18469N0320p8516J1992P7136
11111C893875K2213m7519o090j74972K7251K7445m2125P2875j48692Q0813P1247
11100C776321m9962j03050m0008Q125j6756n0394R1976j40264j32656N8233l3680
11089C367885L27548k45392M9357k37727M31120l64121P7978Q3177L041l5807
11079C457059n7862J65647j12570k6769o2946L4375K2671Q3785J01731k787p0568
$$ plain form
11153 3033156 3149894 3229860 3206974 3185152 3042561 2874937 3172471 2980385 3204893 3282139
11143 3282139 3176695 3115692 3277122 3365752 3244159 3188281 3225850 3316904 3366426 3354363 3162596
11132 3162596 3516577 3395037 3335925 3611277 3556147 3515651 3641736 3483968 3552589 3674530
11122 3674530 3614228 3664501 3683038 3700451 3677066 3714474 3832943 3883263 3804747 3816739 3893875
11111 3893875 3916088 3868569 3862479 3687507 3714758 3742203 3700078 3772953 3624261 3705074 3776321
11100 3776321 3726359 3623309 3583301 3591426 3574670 3524276 3616252 3475988 3343332 3401565 3367885
11089 3367885 3695433 3450041 3499398 3261671 3692791 3328670 3406648 3489825 3492866 3457059
11079 3457059 3399197 3564844 3452274 3425505 3362559 3396934 3419605 3503390 3605121 3602334 3531766
11068C531766p0063J69153j01563K88404m3330J28636k20214L3111P7606K38181
11058D031687q3858K1571R6738k7241p1066M238O7460K5766j33586J48399j20016
11047C960092K86700k03424p8061L73975l31040K22072j56643J56127k1302J39601
11037D348097J88955n4382j89730L36069j00575K01253j04052L24089J36735r5276
11027D991183J44532L90060O8051J2789J03783P8294J6584p9056M00146L7707
11017F164073p3220O4492J19001J47338k0187K21199j95069K09415J24579j81436
11007F580185K45191J36607R8044L23301j58223L07780j38839M29042J77131o9262
10997G930957K14637N43799q7454J24859L102K20342J1729l0868K74810M3883
$$ plain form
11068 3531766 3461703 3630856 3529293 3817697 3774367 3903003 3682789 3715900 3793506 4031687
11058 4031687 3947829 3969400 4066138 4038897 3967831 3972069 4039529 4065295 3931709 4080108 3960092
11047 3960092 4246792 4043368 3965307 4339282 4008242 4230314 4073671 4229798 4208496 4348097
11037 4348097 4537052 4482670 4292940 4629009 4528434 4729687 4625635 4949724 5086459 4991183
11027 4991183 5135715 5525775 5593826 5606615 5710398 5788692 5805276 5726220 6126366 6164073
11017 6164073 6090853 6155345 6274346 6421684 6401497 6622696 6427627 6637042 6761621 6580185
11007 6580185 6825376 6961983 7060027 7383328 7225105 7532885 7394046 7823088 8000219 7930957
10997 7930957 8145594 8689393 8601939 8726798 8729900 8950242 8961971 8931103 9205913 9249796
10987I249796K61390K822M0192k3974K49709L83205p399N36625J15420J33228
10977A0941014K34614J52933J60597k1386N2165K67492j26943K35749L03175J10403
10967A2309813L44674J89965K53658K98099L85258J28908J32673J23879K00917
10958A4367844L64869J76749L20141L65429L40891L54474J10256L99114K65830
10949A7065597L96911J91348K23528R7293L32818L26765N00453K22231L48069
10940A9705013N2004M72554L09532L04889L01158K43934L56833M49811O64061
10931B2859789J90446L88195N50031M64242J82737Q57278K28197R22970M17996
10922B7061881Q25281J25042N35161J95434M67863l4060j1083n0132J75124Q816
$$ plain form
10987 9249796 9511186 9514008 9554200 9530226 9779935 10163140 10155741 10692366 10807786 10941014
10977 10941014 11175628 11328561 11489158 11467772 11519937 11787429 11660486 11896235 12199410 12309813
10967 12309813 12654487 12844452 13098110 13396209 13781467 13910375 14043048 14166927 14367844
10958 14367844 14732713 14909462 15229603 15595032 15935923 16290397 16400653 16799767 17065597
10949 17065597 17462508 17653856 17877384 17974677 18307495 18634260 19134713 19356944 19705013
10940 19705013 19757017 20229571 20539103 20843992 21145150 21389084 21745917 22195728 22859789
10931 22859789 23050235 23438430 23988461 24452703 24635440 25492718 25720915 26643885 27061881
10922 27061881 27887162 28012204 28547365 28742799 29210662 29176602 29165519 29115387 29290511 29299327
10912B9299327J19983m9244j29144Q7682J9306L28151j81377L4711k0780Q62Q4402
10901B9593879K03483J25591K73161n9300K87965k12646N89778L14660L34953
10892C1451524K3111O41929L62014M26349O53345M48751O01650R91627R40151
10883C6540451J046942R90874J519527J350176J781121J561031K182570K202743
10875D9175435K350442K369599K443927K610447K338161K044473J740717J565049
10867F6638250R04130O21587K60910o91903r86605j296734j399804j994617k307249
10858E9747965k463284j975663k634986k309341k455221k588148k156061k547001
10850D0618260j812183k300724k327321j678588j976861j495727j554700j769354
$$ plain form
10912 29299327 29419310 29370066 29240922 29328604 29347910 29676061 29494684 29529395 29508615 29509477 29593879
10901 29593879 29797362 29922953 30196114 30136814 30424779 30212133 30801911 31116571 31451524
10892 31451524 31474635 32116564 32478578 32904927 33558272 34007023 34608673 35600300 36540451
10883 36540451 37587393 38578267 40097794 41447970 43229091 44790122 46972692 49175435
10875 49175435 51525877 53895476 56339403 58949850 61288011 63332484 65073201 66638250
10867 66638250 67542380 68163967 68424877 67732974 66746369 65449635 64049831 62055214 59747965
10858 59747965 57284681 55309018 52674032 50364691 47909470 45321322 43165261 40618260
10850 40618260 38806077 36505353 34178032 32499444 30522583 29026856 27472156 25702802
10842B5702802j425037j692207r12809j089622j190505j055743r14940r28252
10834A6493687n80596q39197q37269n08544q21473m14033p16750l79868j85804
10825A1210153o69983m91764l13887m44593l72804j11467k35900k00031m08854
10816G960870j01741J6899j95060k1268O8727m18987R4535l69031k44770j50087
10806F640087j89226l29246k94032k23703o8495j47708k63530o4326p1718q3103
10796D905000j86266k67577M4129n6578l08365K06341l44773L95434k36749o4417
10786D086179J54369r6775j60088j29190Q9242j66995Q5414J06938k17385r2583
10776C659126j71371j53541L32478l32599Q236j68097r6722J36956l8916j276
$$ plain form
10842 25702802 24277765 22585558 21672749 20583127 19392622 18336879 17421939 16493687
10834 16493687 15913091 15073894 14236625 13728081 12906608 12492575 11775825 11395957 11210153
10825 11210153 10540170 10048406 9734519 9289926 8917122 8805655 8569755 8369724 7960870
10816 7960870 7859129 7876028 7680968 7659700 7728427 7309440 7403975 7034944 6790174 6640087
10806 6640087 6450861 6121615 5827583 5603880 5535385 5387677 5124147 5059821 4988103 4905000
10796 4905000 4718734 4451157 4495286 4438708 4130343 4336684 3991911 4387345 4150596 4086179
10786 4086179 4240548 4143773 3983685 3854495 3943737 3776742 3862156 3969094 3751709 3659126
10776 3659126 3487755 3334214 3666692 3334093 3342329 3174232 3077510 3214466 3175550 3174274
10766C174274J96838m13114K03487j13008r2185L66286l77061j34133J93902j48231
10756B857055J51172K1436J12512P721j08143l0800K16833k16258j16421J86125
10746C081232j06936m4529j70293j27288n2460N9302n4882Q4341k9016J423o5783
10735B575111L21136k90182L09326N9300k79955l4172j02159K65864K55498L3384
10725C113151k08678k21304n5517K41781P6568j42958k37074J18132L47764m07419
10715B624446K74412l38426j2151K10831j9762m7394J00980k22628K51788K3811
10705B845907j66325j08194K839J93575k3681O3996k47437J07931j32490K1296
10695B557417k75206K5787N4450J28738o2473K09470M3173k9552j78655l0604
$$ plain form
10766 3174274 3371112 2957998 3161485 3048477 2956292 3322578 2945517 2811384 3005286 2857055
10756 2857055 3008227 3029663 3142175 3149896 3041753 3010953 3227786 3011528 2895107 3081232
10746 3081232 2974296 2929767 2759474 2632186 2579726 2639028 2584146 2668487 2639471 2640894 2575111
10735 2575111 2896247 2606065 2915391 2974691 2694736 2660564 2558405 2824269 3079767 3113151
10725 3113151 2904473 2683169 2627652 2869433 2946001 2803043 2565969 2684101 3031865 2624446
10715 2624446 2898858 2560432 2548281 2759112 2739350 2691956 2792936 2570308 2822096 2845907
10705 2845907 2679582 2571388 2574227 2767802 2744121 2808117 2560680 2668611 2536121 2557417
10695 2557417 2282211 2307998 2362448 2491186 2428713 2638183 2681356 2651804 2473149 2442545
10685B442545k40985J70398J47687j42665j59278K17136N6104k81032J96310k53548
10675B152672J20061J69127k48899Q3084l22274P3361O432L6595L5121j08440
10665A996840N0346K71948l92103M9344j21441O2685n7573P2769j63336L13349
10655B082828j02901Q9819J74027k57489j2601O0738j62328r1675K03149K4129
10645B007696k8515j24287N1961p6403J41459q8908J31787k92668K38045l49212
10635A610955J49134q357n0329j64360M28884m60780J1468K01065j38421J10654
10625A689913j74182L87530k88088L7985K68106l14676J22777J13788J068p3929
10615A770292j36029J49298J9876l22714L94392j32430R0k02481L17200k23889
$$ plain form
10685 2442545 2201560 2371958 2519645 2376980 2217702 2434838 2490942 2209910 2406220 2152672
10675 2152672 2272733 2441860 2192961 2276045 1953771 2027132 2033564 2070159 2105280 1996840
10665 1996840 2047186 2319134 1927031 1976375 1854934 1917619 1860046 1932815 1769479 2082828
10655 2082828 1979927 2069746 2243773 1986284 1973683 2034421 1872093 1780418 1983567 2007696
10645 2007696 1979181 1854894 1906855 1830452 1971911 1883003 2014790 1722122 1960167 1610955
10635 1610955 1760089 1751732 1701403 1537043 1965927 1505147 1516615 1717680 1579259 1689913
10625 1689913 1515731 1903261 1615173 1653158 1921264 1606588 1729365 1843153 1844221 1770292
10615 1770292 1634263 1783561 1803437 1480723 1875115 1742685 1742775 1540294 1857494 1633605
10605A633605J78501k12028J12026J63638N0285j41958m3037l33J33058j48632
10595A725125n4746J20502J49622k77937n4287J44373k60976J30212J2729Q5264
10585A719881o043j99934L55460j10265j24p1166L04696j91009j76637k748K953
10574A625064J63236m386N7833p3117m02279J5810j3016L04704j73032j50610
10564A350207n4659K25026l43483K70363j53667O0503J80803j74184J24000q3174
10554A401735l01679L36348j42699m7867K9451N5374j80647J13770K33o3045J14442
10543A315416j17838J07758j83989K19120J52485Q0752m33415J32450O8352r0559
10533A250532N8983J80952k96404P7532K08863j14307L08290j17206P789J11891
$$ plain form
10605 1633605 1812106 1600078 1712104 1875742 1926027 1784069 1741032 1740699 1873757 1725125
10595 1725125 1670379 1790881 1940503 1662566 1608279 1752652 1491676 1621888 1634617 1719881
10585 1719881 1713838 1513904 1869364 1759099 1758975 1687809 1992505 1801496 1624859 1622111 1625064
10574 1625064 1788300 1783914 1841747 1768630 1366351 1382161 1369145 1673849 1500817 1350207
10564 1350207 1295548 1520574 1177091 1447454 1293787 1354290 1535093 1360909 1484909 1401735
10554 1401735 1100056 1436404 1293705 1245838 1275289 1330663 1150016 1263786 1264019 1200974 1315416
10543 1315416 1197578 1305336 1121347 1340467 1492952 1573704 1140289 1272739 1341091 1250532
10533 1250532 1309515 1490467 1194063 1271595 1480458 1366151 1674441 1557235 1565024 1676915
10523A676915k45093O69470l01281J17340M14265L6093K50683p7872o7928k21335
10513B251257K90011l18954j32770n2753k85112N2200m5079k3511k66842K55832
10503A724279j13719J42621j37401K62894n0070R488l8773k37768J74706J30006
10493A866263L49019j30804P1863L42834o6714K85766O7559j1223j97742k23103
10483B353718J77615m42793j2053p8812j75622O2055J48126k5659k40665l2402
10473A733508K69264j20802O8419J6025K09522j48365N6241R0395K40306K62711
10463B677224K1762N6142Q9019m1632j14810k29716k4166L89156l5669l1570k20446
10452B535294J93030l2736R5498k98544M3301o3810j40169J40184q0911q9140
$$ plain form
10523 1676915 1431822 2101292 1800011 1917351 2331616 2367709 2618392 2540520 2472592 2251257
10513 2251257 2541268 2222314 2089544 2036791 1751679 1803879 1758800 1735289 1468447 1724279
10503 1724279 1610560 1753181 1615780 1878674 1828604 1838092 1799319 1561551 1736257 1866263
10493 1866263 2215282 2084478 2156341 2499175 2432461 2718227 2785786 2774563 2576821 2353718
10483 2353718 2531333 2088540 2076487 1997675 1822053 1884108 2032234 2006575 1765910 1733508
10473 1733508 2002772 1881970 1950389 1966414 2175936 2027571 2083812 2174207 2414513 2677224
10463 2677224 2698986 2755128 2844147 2802515 2687705 2457989 2433823 2822979 2787310 2755740 2535294
10452 2535294 2728324 2695588 2791086 2492542 2535843 2472033 2331864 2472048 2391137 2301997
10442B301997k78337L41856l9472M19380L24278L33914j81897L78412J20342k3841
10432C696632k34942j38264m68688q9192l84154J8323m78021O8683K4703n6605
10422A958475J50068l7252m4298j08752J91288K9285j3347l7548K16982K69826
10412B574727J25015L84754K6174L11826N21845K15943K92042L93716P1160k63961
10402D653241J4728K14927q0037O5683l7427L94264L88720N3907M90191J91475
10392F349672J13827J93531J48682N2037j17479q4723j16048p4619j68975q212
10382F287693l91904Q8876N7371q3899J24964K51640J76666n9805M002J54049
10372F609653J53787J48801j31992K46705N2977M40003j12165J39621l9959j93470
$$ plain form
10442 2301997 2023660 2365516 2326044 2745424 3069702 3403616 3221719 3600131 3720473 3696632
10432 3696632 3461690 3323426 2854738 2765546 2381392 2399715 1921694 1990377 2015080 1958475
10422 1958475 2108543 2071291 2026993 1918241 2109529 2138814 2125467 2087919 2304901 2574727
10412 2574727 2699742 3084496 3110670 3422496 3944341 4160284 4452326 4846042 4917202 4653241
10402 4653241 4667969 4882896 4802859 4868542 4831115 5225379 5614099 5668006 6158197 6349672
10392 6349672 6463499 6657030 6805712 6857749 6740270 6655547 6539499 6464880 6295905 6287693
10382 6287693 5895789 5984665 6042036 5958137 6083101 6334741 6511407 6451602 6455604 6609653
10372 6609653 6763440 6912241 6780249 7026954 7079931 7519934 7407769 7547390 7507431 7313961
10362G313961j81980o6909p9575m27321p5698l21907j98531k16995l4537l09609
10352E400899P3099l56900J3144k69079j47303l67027r0892m4882O18j64910O8365
10341D115132r4465L6356J57103K98294j09674P791J55356j72878j19514K87546
10331D561047k44744O9605j28959j38901M1536l00874K20370m3717J05824j79428
10321C961759j85629L59768N8671L1955j37698O9340k7232m10291K56836L61885
10311D339364m229j51660L11042R3735K78908p1762o1724J1241K37871k26844
10301D755942J02714k73188r9505n3486j39217L46031p3753R8043l3609P9581
10291D709553K06442L4571J09670J58679J74754K91364J79556K34499K36141M98959
$$ plain form
10362 7313961 7131981 7065072 6985497 6558176 6482478 6160571 5962040 5745045 5710508 5400899
10352 5400899 5473998 5117098 5130242 4861163 4713860 4346833 4255941 4211059 4211677 4046767 4115132
10341 4115132 4020667 4057023 4214126 4512420 4402746 4410537 4565893 4393015 4273501 4561047
10331 4561047 4316303 4385908 4256949 4118048 4159584 3858710 4079080 4035363 4141187 3961759
10321 3961759 3776130 4135898 4194569 4226524 4088826 4158166 4130934 3720643 3977479 4339364
10311 4339364 4335135 4183475 4494517 4588252 4867160 4795398 4733674 4744915 4982786 4755942
10301 4755942 4858656 4585468 4485963 4432477 4293260 4639291 4565538 4663581 4629972 4709553
10291 4709553 4915995 4950566 5060236 5218915 5393669 5685033 5864589 6099088 6335229 6834188
$$ [...]
##END NTUPLES=NMR SPECTRUM
##END=
