##TITLE=coffee_type TOLI01-ROVE100E_50-50%
COFFEE_meoh_noesyp64 COFFEE_meoh {C:\Bruker\TOPSPIN} Administrator 16
##JCAMPDX= 6.0         $$ Bruker NMR JCAMP-DX V2.0
##DATA TYPE= NMR SPECTRUM
##DATA CLASS= NTUPLES
##ORIGIN= Bruker BioSpin GmbH
##OWNER= Administrator
$$ 1.72 TOPSPIN		Version 2.1
$$ 2012-05-18 15:49:15.057 -0700  Administrator@X
$$ Compression mode = diff/dup
##.OBSERVE FREQUENCY= 400.13188235
##.OBSERVE NUCLEUS= ^1H
##.ACQUISITION MODE= SIMULTANEOUS (DQD)
##.ACQUISITION SCHEME= undefined
##.AVERAGES= 64
##.DIGITISER RES= 22
##SPECTROMETER/DATA SYSTEM= spect
##.PULSE SEQUENCE= noesygpps1d.comp
##.SOLVENT NAME= COFFEE_meoh
##.SHIFT REFERENCE= INTERNAL, COFFEE_meoh, 1, 14.98061
##AUDIT TRAIL= $$ (NUMBER, WHEN, WHO, WHERE, PROCESS, VERSION, WHAT)
$$ ##TITLE= Audit trail, TOPSPIN		Version 2.1
$$ ##JCAMPDX= 5.01
$$ ##ORIGIN= Bruker BioSpin GmbH
$$ ##OWNER= Administrator
$$ $$ C:\Bruker\TOPSPIN/data/Administrator/nmr/12-COFFEE-2402/182/pdata/1/auditp.txt
$$ ##AUDIT TRAIL=  $$ (NUMBER, WHEN, WHO, WHERE, PROCESS, VERSION, WHAT)
(   1,<2012-02-25 00:55:20.625 -0500>,<Administrator>,<TOPSPIN>,<go>,<TOPSPIN 2.1>,
      <created by zg
	started at 2012-02-25 00:43:50.391 -0500,
	POWCHK enabled, PULCHK disabled,
       configuration hash MD5:
       B0 76 FB 9C 50 81 44 7D 18 B3 26 32 4E 60 AD 96
       data hash MD5: 64K
       88 CF AB A7 5F 01 33 35 B6 E3 31 A8 9A CC 50 40>)
(   2,<2012-02-25 00:55:23.297 -0500>,<Administrator>,<TOPSPIN>,<proc1d>,<TOPSPIN 2.1>,
      <Start of raw data processing
       efp LB = 0.3 FT_mod = 6 PKNL = 1 PHC0 = 0 PHC1 = 0 SI = 128K 
       data hash MD5: 128K
       20 EC BC CA 35 79 43 F2 BD 49 02 16 34 81 79 68>)
(   3,<2012-02-25 00:55:24.562 -0500>,<Administrator>,<TOPSPIN>,<proc1d>,<TOPSPIN 2.1>,
      <pk PHC0 = 24.22485 PHC1 = 0 
       data hash MD5: 128K
       A8 9F C2 F5 34 1A 3A BB FB CC F8 E0 8D 38 70 EA>)
(   4,<2012-02-25 00:55:24.828 -0500>,<Administrator>,<TOPSPIN>,<proc1d>,<TOPSPIN 2.1>,
      <abs ABSG = 1 
       data hash MD5: 128K
       E5 2D 58 19 96 97 8F 10 FE D3 EF 9F 5A F8 22 64>)
(   5,<2012-02-25 00:55:24.906 -0500>,<Administrator>,<TOPSPIN>,<proc1d>,<TOPSPIN 2.1>,
      <abs ABSG = 2 
       data hash MD5: 128K
       20 79 66 BF 4A A1 C5 C9 C4 D1 31 A0 E2 CF 24 A5>)
(   6,<2012-02-25 00:55:24.953 -0500>,<Administrator>,<TOPSPIN>,<proc1d>,<TOPSPIN 2.1>,
      <abs ABSG = 3 
       data hash MD5: 128K
       00 42 BE E2 59 F6 6B A4 7A A3 FA 2E 8D A5 80 45>)
(   7,<2012-02-25 00:55:25.297 -0500>,<Administrator>,<TOPSPIN>,<proc1d>,<TOPSPIN 2.1>,
      <abs ABSG = 4 
       data hash MD5: 128K
       C1 E7 B5 33 54 5A 0B E9 99 37 53 E4 DF 26 DB 23>)
(   8,<2012-02-25 00:55:25.375 -0500>,<Administrator>,<TOPSPIN>,<proc1d>,<TOPSPIN 2.1>,
      <abs ABSG = 5 
       data hash MD5: 128K
       A7 90 A1 1B BC 75 D8 9E 02 D8 2A DC 06 00 46 81>)
(   9,<2012-02-25 00:55:25.500 -0500>,<Administrator>,<TOPSPIN>,<audit>,<TOPSPIN 2.1>,
      <user comment:
       ICON-NMR User ID: Administrator
$$ [...]
150 150 150 150 150 150 150 150
##$TP07= 0
##$TPNAME0= <>
##$TPNAME1= <>
##$TPNAME2= <>
##$TPNAME3= <>
##$TPNAME4= <>
##$TPNAME5= <>
##$TPNAME6= <>
##$TPNAME7= <>
##$TPOAL= (0..7)
0.5 0.5 0.5 0.5 0.5 0.5 0.5 0.5
##$TPOFFS= (0..7)
0 0 0 0 0 0 0 0
##$TUNHIN= 0
##$TUNHOUT= 0
##$TUNXOUT= 0
##$USERA1= <user>
##$USERA2= <user>
##$USERA3= <user>
##$USERA4= <user>
##$USERA5= <user>
##$V9= 5
##$VALIST= <valist>
##$VCLIST= <CCCCCCCCCCCCCCC>
##$VD= 0
##$VDLIST= <DDDDDDDDDDDDDDD>
##$VPLIST= <PPPPPPPPPPPPPPP>
##$VTLIST= <TTTTTTTTTTTTTTT>
##$WBST= 1024
##$WBSW= 4
##$XGAIN= (0..3)
0 0 0 0
##$XL= 0
##$YL= 0
##$YMAX_a= 13074892
##$YMIN_a= -6116124
##$ZGOPTNS= <>
##$ZL1= 120
##$ZL2= 120
##$ZL3= 120
##$ZL4= 120
##$ABSF1= 14.98061
##$ABSF2= -5.57192
##$ABSG= 5
##$ABSL= 3
##$ALPHA= 0
##$AQORDER= 0
##$ASSFAC= 0
##$ASSFACI= 0
##$ASSFACX= 0
##$ASSWID= 0
##$AUNMP= <proc_prof1d_extract>
##$AXLEFT= 0
##$AXNAME= <>
##$AXNUC= <1H>
##$AXRIGHT= 0
##$AXTYPE= 0
##$AXUNIT= <>
##$AZFE= 0.1
##$AZFW= 0.1
##$BCFW= 0
##$BC_mod= 0
##$BYTORDP= 0
##$COROFFS= 0
##$CY= 15
##$DATMOD= 1
##$DC= 0
##$DFILT= <>
##$DTYPP= 0
##$F1P= 0
##$F2P= 0
##$FCOR= 0.5
##$FTSIZE= 131072
##$FT_mod= 6
##$GAMMA= 0
##$GB= 0
##$INTBC= 1
##$INTSCL= 1
##$ISEN= 128
##$LB= 0.3
##$LEV0= 0
##$LPBIN= 0
##$MAXI= 10000
##$MC2= 0
##$MEAN= 0
##$ME_mod= 0
##$MI= 0
##$NCOEF= 0
##$NC_proc= -3
##$NLEV= 6
##$NOISF1= 0
##$NOISF2= 0
##$NSP= 0
##$NTH_PI= 0
##$NZP= 0
##$OFFSET= 14.98061
##$PC= 1
##$PHC0= 24.22485
##$PHC1= 0
##$PH_mod= 1
##$PKNL= yes
##$PPARMOD= 0
##$PPDIAG= 0
##$PPIPTYP= 0
##$PPMPNUM= 2147483647
##$PPRESOL= 1
##$PSCAL= 4
##$PSIGN= 0
##$PYNMP= <proc.py>
##$REVERSE= no
##$SF= 400.13
##$SI= 131072
##$SIGF1= 0
##$SIGF2= 0
##$SINO= 400
##$SIOLD= 131072
##$SPECTYP= <>
##$SREGLST= <1H.CDCl3>
##$SSB= 0
##$STSI= 131072
##$STSR= 0
##$SW_p= 8223.68421052632
##$SYMM= 0
##$S_DEV= 0
##$TDeff= 65536
##$TDoff= 0
##$TI= <>
##$TILT= no
##$TM1= 0
##$TM2= 0
##$TOPLEV= 0
##$USERP1= <user>
##$USERP2= <user>
##$USERP3= <user>
##$USERP4= <user>
##$USERP5= <user>
##$WDW= 1
##$XDIM= 131072
##$YMAX_p= 496610348
##$YMIN_p= -340304012
##$CURPLOT= <Network HP LaserJet P1505>
##$CURPRIN= <$Network HP LaserJet P1505>
##$DFORMAT= <normdp>
##$LAYOUT= <+/1D_H.xwp>
##$LFORMAT= <normlp>
##$PFORMAT= <normpl>
##$SURQMSG= 1
$$ End of Bruker specific parameters
$$ ---------------------------------
##NTUPLES= NMR SPECTRUM
##VAR_NAME=  FREQUENCY,     SPECTRUM/REAL,   SPECTRUM/IMAG
##SYMBOL=    X,             R,               I
##VAR_TYPE=  INDEPENDENT,   DEPENDENT,       DEPENDENT
##VAR_FORM=  AFFN,          ASDF,            ASDF
##VAR_DIM=   131072,        131072,          131072
##UNITS=     HZ,            ARBITRARY UNITS, ARBITRARY UNITS
##FACTOR=    0.0627417313425165, 1,          1
##FIRST=     8223.62146879498, -6683,        -86207
##LAST=      0,             -2703,           -88666
##MIN=       0,             -340304012,      0
##MAX=       8223.62146879498, 496610348,    0
$$ Real data points
##PAGE= N=1
##DATA TABLE= (X++(R..R)), XYDATA
$$ [...]
63019A206441J5251J5904J4593J2615J1067J0173R900J0143J0597J1026J1250
63008A338960J0688Q811O445N438O298P322O971O010O102P347Q508R022R438J0286
62994A447646J1687J3741J6140J7866J8374J8826K0901K4540K7983L0040L1197
62983A678941L2397L3773L4897L5442L5324L4729L4303L4823L6456L8576M0249
62972B069910M0760L9936L8309L6737L5550L4290L2481L0053K6705K1587J4498
62961B420816O702l45o752j3644k1149k7964l2882l5855l7489l8241l8364l7968
62949B136865l6906l4919l1954k8097k3479j8478j3586q739l388K267O929R999
62937A956514J2816J6913K1668K5203K7151K8798L0657L1843L2025L2099L2215
$$ y = [1206441, 1221692, 1237596, 1252189, 1264804, 1275871, 1286044, 1295944, 1306087, 1316684, 1327710, 1338960, 1349648, 1358459, 1364904, 1370342, 1376640, 1383962, 1390933, 1396943, 1403045, 1410392, 1418900, 1427922, 1437360, 1447646, 1459333, 1473074, 1489214, 1507080, 1525454, 1544280, 1565181, 1589721, 1617704, 1647744, 1678941, 1711338, 1745111, 1780008, 1815450, 1850774, 1885503, 1919806, 1954629, 1991085, 2029661, 2069910, 2110670, 2150606, 2188915, 2225652, 2261202, 2295492, 2327973, 2358026, 2384731, 2406318, 2420816, 2427518, 2427173, 2420421, 2406777, 2385628, 2357664, 2324782, 2288927, 2251438, 2213197, 2174833, 2136865, 2099959, 2065040, 2033086, 2004989, 1981510, 1963032, 1949446, 1940707, 1937319, 1939586, 1946515, 1956514, 1969330, 1986243, 2007911, 2033114, 2060265, 2089063, 2119720, 2151563, 2183588, 2215687, 2247902]
62926B247902L1136K8592K6508K6294K6332K4154K0084J6549J3946R695J971p594
62914B465569j6242k3721l1844m1071m9429n5207n9231o3430o7902p0721p0593
62903A916178o8587o6786o5998o5324o3558o0376n6374n2440m9024m5763m2027
62892A279921l7987l4722l2828l1452k9389k6704k4447k3042k1942k0722j9529
62881I77157j8349j6902j5474j4692j4194j2682r994q038q473j0281j0989r867
62869H27222q599q708r723j0277r883q878p451n675m102l385l338l162k614k157
62855G39270j803p50J169K467J501j216l357l519k583j948j552n77P07J072J29
62840G29010j176j980k452k931l043k214o57P72J581K061K737L562L748K439j67
$$ y = [2247902, 2279038, 2307630, 2334138, 2360432, 2386764, 2410918, 2431002, 2447551, 2461497, 2471192, 2473163, 2465569, 2449327, 2425606, 2393762, 2352691, 2303262, 2248055, 2188824, 2125394, 2057492, 1986771, 1916178, 1847591, 1780805, 1714807, 1649483, 1585925, 1525549, 1469175, 1416735, 1367711, 1321948, 1279921, 1241934, 1207212, 1174384, 1142932, 1113543, 1086839, 1062392, 1039350, 1017408, 996686, 977157, 958808, 941906, 926432, 911740, 897546, 884864, 874870, 866832, 858359, 848078, 837089, 827222, 818623, 809915, 800192, 789915, 780032, 771154, 763703, 758028, 753926, 750541, 747203, 744041, 741427, 739270, 737467, 736717, 737886, 740353, 741854, 740638, 737281, 733762, 731179, 729231, 727679, 727102, 727809, 728881, 729010, 727834, 725854, 723402, 720471, 717428, 715214, 714557, 715329, 716910, 718971, 721708, 725270, 729018, 731457, 731290]
62825G31290k548l052j465Q66K474K939K689K207J776J659K110L115M210M621
62811G52891L892K579J947K482K963J819p20k703k831j891j454k068l265m575
62797G49066n693o095n497m376l425k685j871j223j232j625j528p22J7J7n14j021
62781G11593j283j218p08J17Q25J365K193L308L710K636Q96P3N01J013Q99J002
62765G26922K254L950M543L762K772K266J560P0j380j505k52J280K192K266J401
62750G52101l22k024k526j772r64r18j089o58J40N52N99J089K472M267N595N860
62734G62402N251M907O161R021J1743J2632J2020J1696J2601J4023J5003J5556
62722H93016J6311J7816K0455K4147K7723K9662L0036L0880L3714L7516M0343
$$ y = [731290, 728742, 725690, 724225, 725091, 727565, 730504, 733193, 735400, 737176, 738835, 740945, 744060, 748270, 752891, 756783, 759362, 761309, 763791, 766754, 768573, 767853, 765150, 762319, 760428, 758974, 756906, 753641, 749066, 743373, 737278, 731781, 727405, 723980, 721295, 719424, 718201, 716969, 715344, 713816, 713094, 713111, 713128, 712614, 711593, 710310, 709092, 708384, 708501, 709326, 710691, 712884, 716192, 719902, 722538, 723434, 723507, 724008, 725021, 725920, 726922, 729176, 733126, 737669, 741431, 744203, 746469, 748029, 748099, 746719, 745214, 744962, 746242, 748434, 750700, 752101, 751779, 749755, 747229, 745457, 744493, 743575, 742486, 741828, 741968, 742520, 743119, 744208, 746680, 750947, 756542, 762402, 767653, 772560, 778721, 787742, 799485, 812117, 824137, 835833, 848434, 862457, 877460, 893016, 909327, 927143, 947598, 971745, 999468, 1029130, 1059166, 1090046, 1123760, 1161276, 1201619]
62711A201619M2284M5245M9770N3776N5155N4352N3239N2296N0300M6610M2227
62700A746873L8130L3552K6787J7344O511m015j3418k1694k9040l5626m1572m6684
62688A677148n0436n2533n3316n3329n2690n1286m9474m8080m7475m6951m5295
62677A126283m1893l7365l3169l0497k9246k8142k6062k3110k0090j7248j4319
62666H25142j1617j0071r704r120p213m714l063k336j410qQ16M69n3N60K314M252
62650G74244N852P371R121J1053J2952J4608J5865J6905J8352K0852K4458K8565
62638I60198L2303L4971L6553L8059M0877M5410N0524N4708N7512N9560O1616
62627A472291O4071O6927O9497P0345O8322O3706N7709N0911M2900L3482K3345
$$ y = [1201619, 1243903, 1289148, 1338918, 1392694, 1447849, 1502201, 1555440, 1607736, 1658036, 1704646, 1746873, 1785003, 1818555, 1845342, 1862686, 1869197, 1865182, 1851764, 1830070, 1801030, 1765404, 1723832, 1677148, 1626712, 1574179, 1520863, 1467534, 1414844, 1363558, 1314084, 1266004, 1218529, 1171578, 1126283, 1084390, 1047025, 1013856, 983359, 954113, 925971, 899909, 876799, 856709, 839461, 825142, 813525, 803454, 793750, 784630, 777417, 772703, 769640, 767304, 765894, 765886, 766702, 767171, 767118, 767678, 769992, 774244, 780096, 787467, 796588, 807641, 820593, 835201, 851066, 867971, 886323, 907175, 931633, 960198, 992501, 1027472, 1064025, 1102084, 1142961, 1188371, 1238895, 1293603, 1351115, 1410675, 1472291, 1536362, 1603289, 1672786, 1743131, 1811453, 1875159, 1932868, 1983779, 2026679, 2060161, 2083506]
62616B083506J3067K226r815k2547l4450m4359n2277n8823o4295o8442p0938p1860
62604A600993p1618p0498o8460o5471o1850n8073n4330n0589m7012m3872m1077
62593I68143l8170l5017l2121k9987k8393k6561k3892k0532j7366j5456j5164
62582F85484j5631j5472j4196j2694j2037j2173j2076j1036r321p648o364n282
62570E51554m153l122k669l083m092n085n603n462m554l009j501q45j013j010
62556E06353j37J030J350O66N6O52K563M962O801P491P302P152P602Q078P546
62541E69467O130N366O436Q647J0393J1294J2425J4341J6044J6542J6622J7952
62529G11659K0728K3424K4989K6050K7442K8604K8436K7064K5666K4739K3628
$$ y = [2083506, 2096573, 2098799, 2088984, 2066437, 2031987, 1987628, 1935351, 1876528, 1812233, 1743791, 1672853, 1600993, 1529375, 1458877, 1390417, 1324946, 1263096, 1205023, 1150693, 1100104, 1053092, 1009220, 968143, 929973, 894956, 862835, 832848, 804455, 777894, 754002, 733470, 716104, 700648, 685484, 669853, 654381, 640185, 627491, 615454, 603281, 591205, 580169, 570848, 563200, 556836, 551554, 547401, 544279, 541610, 538527, 534435, 529350, 523747, 518285, 513731, 510722, 509221, 508376, 507363, 506353, 506216, 507246, 508596, 509262, 509318, 509970, 512533, 517495, 524296, 531787, 539089, 546241, 553843, 561921, 569467, 575597, 580963, 587399, 596046, 606439, 617733, 630158, 644499, 660543, 677085, 693707, 711659, 732387, 755811, 780800, 806850, 834292, 862896, 891332, 918396, 944062, 968801, 992429]
62518I92429K1653J8803J5181J0701N656Q09l403p274j1141j4845j8170k1180
62506I89219k3784k5527k6206k6231k5986k5297k3963k2335k0892j9613j8322
62495G31063j7212j6446j5606j4196j2548j1497j1239j1115j0557r736r057q505
62483E83349p730o630n562m982m920m862m255l089j810p89j29J08n7k05J52Q41
62467E39430J274J628K976N633Q105Q579P223O169P192R977J2751J4177J4490
62454F39604J5007J6544J8501J9817K0655K2336K5416K8839L1600L4167L7259
62443I09745M0024M0839L9583L7797L6497L5114L2678K8957K4089J8138J1447
62432A254908M719j664p781j3411j7907k1223k4309k8031l2103l5444l7051l6457
$$ y = [992429, 1014082, 1032885, 1048066, 1058767, 1064423, 1065232, 1061829, 1054555, 1043414, 1028569, 1010399, 989219, 965435, 939908, 913702, 887471, 861485, 836188, 812225, 789890, 768998, 749385, 731063, 713851, 697405, 681799, 667603, 655055, 643558, 632319, 621204, 610647, 600911, 591854, 583349, 575619, 568989, 563427, 558445, 553525, 548663, 544408, 541319, 539509, 538720, 538591, 538699, 538642, 538437, 538589, 539430, 540704, 542332, 545308, 550941, 559046, 567625, 574848, 581017, 588209, 598186, 610937, 625114, 639604, 654611, 671155, 689656, 709473, 730128, 752464, 777880, 806719, 838319, 872486, 909745, 949769, 990608, 1030191, 1067988, 1104485, 1139599, 1172277, 1201234, 1225323, 1243461, 1254908, 1259627, 1257963, 1250182, 1236771, 1218864, 1197641, 1173332, 1145301, 1113198, 1077754, 1040703, 1004246]
62420A004246l4014l1132k9366k8735k7614k4836k1264j8547j6936j5339j3212
62409G43251j1289j0301r928r313q096o471m750l329k702k888k942j745N35K326
62395F72358K494J834K058L542N002N451N420N819O467O570N987N157M287L427
62381G35873K905K790K321R74m02p57q22k355n388p905q686q775r374r906r356
62366F81137q224p653p473o625n081l904l625l761l828l702l068j590K66J654
62352F24523K573L698M944N332M684M330N540P980J0382J2109J3293J3936J3699
62339G27023J2600J1359J0915J1659J3029J3829J3234J1618R999Q713P270N696
62327H56944N064N944P049O588M775L769M982P414R099R337Q972R123J0313J2404
$$ y = [1004246, 970232, 939100, 909734, 880999, 853385, 828549, 807285, 788738, 771802, 756463, 743251, 731962, 721661, 711733, 702420, 694324, 687853, 683103, 679774, 677072, 674184, 671242, 669497, 670032, 672358, 674852, 676686, 678744, 682286, 687288, 692739, 698159, 703978, 710445, 717015, 723002, 728159, 732446, 735873, 738778, 741568, 743889, 744863, 744461, 743704, 742882, 740527, 735139, 727234, 718548, 709773, 700399, 690493, 681137, 672913, 665260, 657787, 651162, 646081, 642177, 638552, 634791, 630963, 627261, 624193, 622603, 622869, 624523, 627096, 630794, 635738, 641070, 645754, 650084, 655624, 663604, 673986, 686095, 699388, 713324, 727023, 739623, 750982, 761897, 773556, 786585, 800414, 813648, 825266, 835265, 843978, 851248, 856944, 862008, 867952, 875001, 881589, 886364, 890133, 895115, 902529, 911628, 920965, 929937, 939060, 949373, 961777]
62313I61777J4737J6697J8625K1698K6309L1128L4697L7552M1502M6952N2270
62302A303944N6186N9479O3573O8452P2979P6652P9997Q3406Q6296Q7316Q4954
62291B123234P8388O8420N7185M6322L5723K4629J3318K686p416j8037k9231l9512
62279B355709m7638n3954n9359o3789o6510o7460o7374o6533o4202n9804n4321
62268A684765m9802m7154m4951m1228l6178l2093l0453l0170k9287k7301k4881
62257A291267k2370j9829j7807j6605j5174j2296q588n816m381l185j970j844
62245A161402l059m110l911l340l610m472n084n380n441m622k659q17o04j835
62231A112458l137l759l798l180j719J05J562K773M377O321P898Q880R736J0805
$$ y = [961777, 976514, 993211, 1011836, 1033534, 1059843, 1090971, 1125668, 1163220, 1204722, 1251674, 1303944, 1360130, 1419609, 1483182, 1551634, 1624613, 1701265, 1781262, 1864668, 1950964, 2038280, 2123234, 2201622, 2270042, 2327227, 2373549, 2409272, 2433901, 2447219, 2449905, 2442489, 2424452, 2395221, 2355709, 2308071, 2254117, 2194758, 2130969, 2064459, 1996999, 1929625, 1863092, 1798890, 1739086, 1684765, 1634963, 1587809, 1542858, 1501630, 1465452, 1433359, 1402906, 1372736, 1343449, 1316148, 1291267, 1268897, 1249068, 1231261, 1214656, 1199482, 1187186, 1178598, 1172782, 1168401, 1165216, 1163246, 1161402, 1158343, 1154233, 1150322, 1146982, 1143372, 1138900, 1133816, 1128436, 1122995, 1118373, 1115714, 1114897, 1114293, 1112458, 1109321, 1105562, 1101764, 1098584, 1096865, 1096970, 1098532, 1101305, 1105682, 1112003, 1119901, 1128781, 1138517, 1149322]
62217A149322J2085J3725J5943J8387K0393K1940K3764K6464K9911L3522L6765
62206A402221L9533M2285M5592M9350N2934N6334O0426O5616P1025P5679P9760
62195B040755Q3663Q6597Q7284Q5605Q2331P7515P0331O0447M8500L5321K1735
62184B780084R018j696j0716j9552k9126l8870m7620n4552n9189o1431o1816o1095
62172B343439n9510n6904n3426m9342m4483l8792l3206k8921k5889k3097k0149
62161A909720j7300j4079r610m657j646j732l044k848n29K457M765O240P398Q806
62147A883941J0737J2878J4562J5600J6487J7667J9124K0860K2894K4643K5321
62136B084714K5386K6429K8937L1426L2630L3420L5295L7979M0000M1043M2223
$$ y = [1149322, 1161407, 1175132, 1191075, 1209462, 1229855, 1251795, 1275559, 1302023, 1331934, 1365456, 1402221, 1441754, 1484039, 1529631, 1578981, 1631915, 1688249, 1748675, 1814291, 1885316, 1960995, 2040755, 2124418, 2211015, 2298299, 2383904, 2466235, 2543750, 2614081, 2674528, 2723028, 2758349, 2780084, 2789102, 2787406, 2776690, 2757138, 2728012, 2689142, 2641522, 2586970, 2527781, 2466350, 2404534, 2343439, 2283929, 2227025, 2173599, 2124257, 2079774, 2040982, 2007776, 1978855, 1952966, 1929869, 1909720, 1892420, 1878341, 1868731, 1864074, 1862428, 1860696, 1857652, 1854804, 1854275, 1856732, 1861497, 1867737, 1875135, 1883941, 1894678, 1907556, 1922118, 1937718, 1954205, 1971872, 1990996, 2011856, 2034750, 2059393, 2084714, 2110100, 2136529, 2165466, 2196892, 2229522, 2262942, 2298237, 2336216, 2376216, 2417259, 2459482]
62125B459482M4278M6925M9616N1551N1232M7738M2591L8651L6763L5135L2637
62114B936599L0883L1820L4792L7963M1638M7902N6791O5045O9621P1175P2735
62103C496964P5806P9097Q0812Q0699P9331P6504P1283O3364N3779M4250L6185
62092D238074L0017K5050K0018J4320Q696M350J525n14k154k758j682O58L260
62079D338860N680Q118J0501J2231J3070J3861J5873J9447K3516K6574K8031K8465
62067D544227K8746K9220K9896L0996L2822L5135L7197L8627L9799M1147M2479
62056D930291M3398M4246M5893M8371N0298N0335M9048M8542M9928N1829N2137
62045E464316N0721M9429M9449M9956M9671M8721M8168M8479M9381N0550N1574
$$ y = [2459482, 2503760, 2550685, 2600301, 2651852, 2703084, 2750822, 2793413, 2832064, 2868827, 2903962, 2936599, 2967482, 2999302, 3034094, 3072057, 3113695, 3161597, 3218388, 3283433, 3353054, 3424229, 3496964, 3572770, 3651867, 3732679, 3813378, 3892709, 3969213, 4040496, 4103860, 4157639, 4201889, 4238074, 4268091, 4293141, 4313159, 4327479, 4336175, 4340525, 4342050, 4341536, 4339382, 4336624, 4334942, 4335600, 4338860, 4344540, 4352658, 4363159, 4375390, 4388460, 4402321, 4418194, 4437641, 4461157, 4487731, 4515762, 4544227, 4572973, 4602193, 4632089, 4663085, 4695907, 4731042, 4768239, 4806866, 4846665, 4887812, 4930291, 4973689, 5017935, 5063828, 5112199, 5162497, 5212832, 5261880, 5310422, 5360350, 5412179, 5464316, 5515037, 5564466, 5613915, 5663871, 5713542, 5762263, 5810431, 5858910, 5908291, 5958841, 6010415]
62034F010415N1730N0955N0507N1561N3402N4360N4348N4957N6804N8531N9104
62023F606674N9661O1831O5254O8123O9589P0328P0875P0509O8042O3042N6184
62012G330112M8787M2216L7345L4475L3569L4050L4313L2175K6515J8301R665
62001G681523K196l725q651j3650j9580k6106l1830l6092m0015m4913n0152n3904
61989G355101n5924n8252o2587o8054p2324p4333p4964p5330p5310p4147p1952
61978F591924o9923o8944o8450o7178o4859o2585o1375o1038o0857o0724o0899
61967E885092o1141o1035o1071o2357o4930o7113o7224o5483o3695o3122o3271
61956E184650o2922o1803o0770o0307n9533n7211n3508m9951m7537m5565m2789
$$ y = [6010415, 6062145, 6113100, 6163607, 6215168, 6268570, 6322930, 6377278, 6432235, 6489039, 6547570, 6606674, 6666335, 6728166, 6793420, 6861543, 6931132, 7001460, 7072335, 7142844, 7210886, 7273928, 7330112, 7378899, 7421115, 7458460, 7492935, 7526504, 7560554, 7594867, 7627042, 7653557, 7671858, 7681523, 7683719, 7679994, 7671343, 7657693, 7638113, 7612007, 7580177, 7544085, 7504070, 7459157, 7409005, 7355101, 7299177, 7240925, 7178338, 7110284, 7037960, 6963627, 6888663, 6813333, 6738023, 6663876, 6591924, 6522001, 6453057, 6384607, 6317429, 6252570, 6189985, 6128610, 6067572, 6006715, 5945991, 5885092, 5823951, 5762916, 5701845, 5639488, 5574558, 5507445, 5440221, 5374738, 5311043, 5247921, 5184650, 5121728, 5059925, 4999155, 4938848, 4879315, 4822104, 4768596, 4718645, 4671108, 4625543, 4582754]
61945D582754l9113l5497l2544k9851k6833k3599k1040k0225k1586k4406k7426
61934D280634l0211l3500l7833m2459m6416n0080n4514n9491o3455o5593o6651
61923C730431o7282o6781o4316o0547n7002n4274n1808m9187m6767m5020m3922
61912C123525m3119m2315m1310m0008l8382l6286l3513l0335k7788k6804k6972
61901B736693k6755k5152k2772k0839j9423j7229j3250q161l628m60K071N062
61889B586157Q635J2136J5271J8567K2750K8029L3914L9392M3480M6017M7971
61878B902319N0463N3503N6102N7589N8381N9334O0907O3013O5127O6377O6151
61867C559266O4924O3964O3929O4335O4668O5333O6970O9644P3337P8700Q6416
$$ y = [4582754, 4543641, 4508144, 4475600, 4445749, 4418916, 4395317, 4374277, 4354052, 4332466, 4308060, 4280634, 4250423, 4216923, 4179090, 4136631, 4090215, 4040135, 3985621, 3926130, 3862675, 3797082, 3730431, 3663149, 3596368, 3532052, 3471505, 3414503, 3360229, 3308421, 3259234, 3212467, 3167447, 3123525, 3080406, 3038091, 2996781, 2956773, 2918391, 2882105, 2848592, 2818257, 2790469, 2763665, 2736693, 2709938, 2684786, 2662014, 2641175, 2621752, 2604523, 2591273, 2583112, 2579484, 2579024, 2581095, 2586157, 2594792, 2606928, 2622199, 2640766, 2663516, 2691545, 2725459, 2764851, 2808331, 2854348, 2902319, 2952782, 3006285, 3062387, 3119976, 3178357, 3237691, 3298598, 3361611, 3426738, 3493115, 3559266, 3624190, 3688154, 3752083, 3816418, 3881086, 3946419, 4013389, 4083033, 4156370, 4235070, 4321486]
61856D321486R6311J07924J21568J37724J55683J73872J91662K09958K29783K51045
61846E997016K72904K94721L16579L39397L64425L91906M20358M47948M74370
61837I319624N00083N23624N40840N46944N37826N09011M55429L74038K66500
61828A3573919J38917J34j39150k67929l78228m67025n34003n78613o01052o04886
61818A0142084n95823n77692n51636n19237m83771m47624m10802l73397l37572
61809E844530l05518k76870k49887k24141k00357j78525j58004j39013j22242
61800C989973j07083r1899p6189o1148m7743l5582k4098j3699n049K107Q674J5013
61788C553277K0483K4140K5656K5518K4243K1573J6850J0317L301l183r215j4757
$$ y = [4321486, 4417797, 4525721, 4647289, 4785013, 4940696, 5114568, 5306230, 5516188, 5745971, 5997016, 6269920, 6564641, 6881220, 7220617, 7585042, 7976948, 8397306, 8845254, 9319624, 9819707, 10343331, 10884171, 11431115, 11968941, 12477952, 12933381, 13307419, 13573919, 13712836, 13712970, 13573820, 13305891, 12927663, 12460638, 11926635, 11348022, 10746970, 10142084, 9546261, 8968569, 8416933, 7897696, 7413925, 6966301, 6555499, 6182102, 5844530, 5539012, 5262142, 5012255, 4788114, 4587757, 4409232, 4251228, 4112215, 3989973, 3882890, 3790991, 3714802, 3653654, 3605911, 3570329, 3546231, 3532532, 3527483, 3529590, 3538264, 3553277, 3573760, 3597900, 3623556, 3649074, 3673317, 3694890, 3711740, 3722057, 3725358, 3722175, 3712960, 3698203]
61776C698203j8609j9684j8603j6712j3988r410l299K431O635J0000J3230J5505
61764C645699J5630J3618J0149N356r08q115j5379k2357k9013l4713l8366l9496
61752C502105l8581l6288l2762k7807k1555j4784q294j813O019J5852K6124L4433
61740C402649M0591M7111N6170O7123P7815Q7290R6164J04995J13761J22781J32890
61729D349340J44443J56935J69906J83644J98781K15694K34537K55438K78499
61720F187217L03827L31758L62880L97761M36638M79243N24879N72936O23444
61711A0220583O76819P32905P90607Q48524R05227R58285J003281J034114J043771
61702A8214116J024345R67085Q64160P11808N12966K78129K4141k29193m63692
$$ y = [3698203, 3679594, 3659910, 3641307, 3624595, 3610607, 3601197, 3597898, 3600329, 3606964, 3616964, 3630194, 3645699, 3661329, 3674947, 3685096, 3690452, 3689544, 3681429, 3666050, 3643693, 3614680, 3579967, 3541601, 3502105, 3463524, 3427236, 3394474, 3366667, 3345112, 3330328, 3322034, 3320221, 3326240, 3342092, 3368216, 3402649, 3443240, 3490351, 3546521, 3613644, 3691459, 3778749, 3874913, 3979908, 4093669, 4216450, 4349340, 4493783, 4650718, 4820624, 5004268, 5203049, 5418743, 5653280, 5908718, 6187217, 6491044, 6822802, 7185682, 7583443, 8020081, 8499324, 9024203, 9597139, 10220583, 10897402, 11630307, 12420914, 13269438, 14174665, 15132950, 16136231, 17170345, 18214116, 19238461, 20205546, 21069706, 21781514, 22294480, 22572609, 22596750, 22367557, 21903865]
61693B1903865o66049q28266r46834j022714j061107j069268j053597j018990
61685A4237040r70328r13093q52002p89835p27919o67249o08906n54090n03993
61676G649625m59119m18709l81519l47264l16514k89206k64280k41086k20082
61667D711846k01618j85032j69639j55599j43023j31215j20039j11188j06410
61658C388083j04680j02789r8991r4589r1466q9314q6346q1791p6451p1133o5754
61647B424779o0201n5221n1871n0334m9608m8349m5918m2725l9698l7541l6426
61636A906887l6157l6265l6086l5174l3756l2503l1592l0445k8667k6793k5643
61625A553806k5283k5228k5255k5253k4494k2177j8982j6895j6897j7630j7168
$$ y = [21903865, 21237816, 20409550, 19462716, 18440002, 17378895, 16309627, 15256030, 14237040, 13266712, 12353619, 11501617, 10711782, 9983863, 9316614, 8707708, 8153618, 7649625, 7190506, 6771797, 6390278, 6043014, 5726500, 5437294, 5173014, 4931928, 4711846, 4510228, 4325196, 4155557, 3999958, 3856935, 3725720, 3605681, 3494493, 3388083, 3283403, 3180614, 3081623, 2987034, 2895568, 2806254, 2719908, 2638117, 2561666, 2490533, 2424779, 2364578, 2309357, 2257486, 2207152, 2157544, 2109195, 2063277, 2020552, 1980854, 1943313, 1906887, 1870730, 1834465, 1798379, 1763205, 1729449, 1696946, 1665354, 1634909, 1606242, 1579449, 1553806, 1528523, 1503295, 1478040, 1452787, 1428293, 1406116, 1387134, 1370239, 1353342, 1335712, 1318544]
61614A318544j5397j3664j2623j1615j0034q204o739n921n832o313o670o245n372
61601A203915m849m528l528k165k120l828n079l604k43J999J650Q5o65pJ468L041
61585A181542M195M712M800M596L622J536p01j623j291j251k127k707k039r86
61571A192278n99k18J318L535N109O038P230Q261P635N460L814L698L428J100
61557A248087k835o749j0169j3337j5513j5722j4777j4559j5235j5000j3019j0834
61545A100338j0074j0237r881q869q142p934p454o137m270k544j669k040l105
61532A017982l523k725j800j864k220j432K35J224J539L156O942J0845J2468J2089
61518A052916J1801J2539J3700J5044J7180K0065K2578K4123K5514K7610L0034
$$ y = [1318544, 1303147, 1289483, 1276860, 1265245, 1255211, 1247007, 1240268, 1234347, 1228515, 1222202, 1215532, 1209287, 1203915, 1199066, 1194538, 1191010, 1188845, 1186725, 1182897, 1177818, 1174214, 1173971, 1175970, 1177620, 1177705, 1177040, 1177033, 1178501, 1181542, 1185737, 1190449, 1195249, 1199845, 1203467, 1205003, 1204302, 1202679, 1201388, 1200137, 1198010, 1195303, 1193264, 1192278, 1191679, 1191461, 1192779, 1196314, 1201423, 1207461, 1214691, 1222952, 1230587, 1236047, 1239861, 1243559, 1246987, 1248087, 1245252, 1238503, 1228334, 1214997, 1199484, 1183762, 1168985, 1154426, 1139191, 1124191, 1111172, 1100338, 1090264, 1080027, 1070146, 1061277, 1053135, 1045201, 1037747, 1031610, 1027340, 1024796, 1023127, 1021087, 1017982, 1014459, 1011734, 1009934, 1008070, 1005850, 1004418, 1004653, 1005877, 1007416, 1010572, 1017514, 1028359, 1040827, 1052916, 1064717, 1077256, 1090956, 1106000, 1123180, 1143245, 1165823, 1189946, 1215460, 1243070, 1273104]
61507A273104L1901L3102L4111L5030L5557L5644L5492L5013L3952L2468L1016
61496A646390K9696K8237K6694K5499K4709K3869K2854K2116K1628K0388J7776
61485A909856J4784J2826J1721J0026P253M310J684j252m524o730p062o896p901
61472A938095r451r443p183l780j47L734P580J0660J3215J6506K0896K5273K8927
61459B034882L2655L7341M2717M8414N4959O2718P0815P8350Q5937R4823J05112
61448B748723J15985J27166J38871J50633J61557J71844J82904J95495K08437
61439D201615K19436K26700K29499K27472K19725K04758J81549J50676J14139
61430E975569P4116L2615p736m3900p4313r9750j21368j38504j49482j54022j53670
$$ y = [1273104, 1305005, 1338107, 1372218, 1407248, 1442805, 1478449, 1513941, 1548954, 1582906, 1615374, 1646390, 1676086, 1704323, 1731017, 1756516, 1781225, 1805094, 1827948, 1850064, 1871692, 1892080, 1909856, 1924640, 1937466, 1949187, 1959213, 1966466, 1970776, 1972460, 1971208, 1966684, 1959954, 1952892, 1945996, 1938095, 1928644, 1919201, 1912018, 1908238, 1908091, 1911825, 1919405, 1930065, 1943280, 1959786, 1980682, 2005955, 2034882, 2067537, 2104878, 2147595, 2196009, 2250968, 2313686, 2384501, 2462851, 2548788, 2643611, 2748723, 2864708, 2991874, 3130745, 3281378, 3442935, 3614779, 3797683, 3993178, 4201615, 4421051, 4647751, 4877250, 5104722, 5324447, 5529205, 5710754, 5861430, 5975569, 6049685, 6082300, 6074564, 6030664, 5956351, 5856601, 5735233, 5596729, 5447247, 5293225, 5139555]
61419E139555j50073j44016j36003j26684j16383j05097r3156q1169o9302n7259
61409D060413m5082l3278k2134j1662k256N486J1903J8294K5382L2332L7926M2188
61397D119512M6217N0600N4688N7577N9242O0253O0539N9298N6540N4067N3813
61386D732346N5402N6530N5943N4711N4023N3120N0598M6622M2345L7881L2619
61375E272140K7039K2498J9127J5661J1611P960N181K061k584q119j2987j6592
61363E342996j9341k1502k3083k4510k6463k8866l0665l0931k9923k8863k8463
61352E050386k7825k5242k0449j5541j2984j2988j3706j3885j4180j5618j7830
61341D860138j9445j9612j8463j6467j3939j0932p223k451L601J1033K0078L0936
$$ y = [5139555, 4989482, 4845466, 4709463, 4582779, 4466396, 4361299, 4268143, 4186974, 4117672, 4060413, 4015331, 3982053, 3959919, 3948257, 3946001, 3951487, 3963390, 3981684, 4007066, 4039398, 4077324, 4119512, 4165729, 4216329, 4271017, 4328594, 4387836, 4448089, 4508628, 4567926, 4624466, 4678533, 4732346, 4787748, 4844278, 4900221, 4954932, 5008955, 5062075, 5112673, 5159295, 5201640, 5239521, 5272140, 5299179, 5321677, 5340804, 5356465, 5368076, 5376036, 5381217, 5383278, 5380694, 5372575, 5359588, 5342996, 5323655, 5302153, 5279070, 5254560, 5228097, 5199231, 5168566, 5137635, 5107712, 5078849, 5050386, 5022561, 4997319, 4976870, 4961329, 4948345, 4935357, 4921651, 4907766, 4893586, 4877968, 4860138, 4840693, 4821081, 4802618, 4786151, 4772212, 4761280, 4754057, 4751606, 4755207, 4766240, 4786318, 4817254]
61329D817254M3274N6393P0073Q4866J01311J19057J36925J53725J69017J83346
61319E935241J97571K11694K24414K34077K39594K40136K34524K21772K01897
61310G940920J75353J42106J02482N8833J5083k5755o2836r6373j26453j53172
61300G970188j76621j96185k10899k20839k27178k30301k29220k23603k15213
61291F040129k06150j96567j85347j72364j58721j45137j31524j18210j06314
61282D619795r6518q8278q0675p3464o6810o0468n3593m5496l6345k7127j8781
61271C972240j1321l952L879J1744J8672K4176K8556L2309L5390L7190L7306L6226
61259D222415L4952L3739L1791K8528K4736K1638J9202J6326J2615Q920N925L211
$$ y = [4817254, 4860528, 4916921, 4986994, 5071860, 5173171, 5292228, 5429153, 5582878, 5751895, 5935241, 6132812, 6344506, 6568920, 6802997, 7042591, 7282727, 7517251, 7739023, 7940920, 8116273, 8258379, 8360861, 8419694, 8434777, 8409022, 8346186, 8249813, 8123360, 7970188, 7793567, 7597382, 7386483, 7165644, 6938466, 6708165, 6478945, 6255342, 6040129, 5833979, 5637412, 5452065, 5279701, 5120980, 4975843, 4844319, 4726109, 4619795, 4523277, 4434999, 4354324, 4280860, 4214050, 4153582, 4099989, 4054493, 4018148, 3991021, 3972240, 3960919, 3956967, 3960846, 3972590, 3991262, 4015438, 4043994, 4076303, 4111693, 4148883, 4186189, 4222415, 4257367, 4291106, 4322897, 4351425, 4376161, 4397799, 4417001, 4433327, 4445942, 4454862, 4460787, 4463998]
61247D463998K40k590m501n388n787o250p201q976j1558j4645j8291k3088k9309
61234D326654l6201m2447m7050m9667n0598n0669n0595n0140m8403m5122m1137
61223C814625l7216l3104k8358k3583k0136j8591j7890j6269j3070r667q191q968
61211C579582r766q288m896j797J3J511L570N932Q662J2796J8623K4776L0173
61198C660891L5532M1830M8425N4000N8379O2037O4751O6168O7082O8643P0865
61187D298603P3254P6116P9518Q1385P8642P0276N7740M2284K3633J540k2935
61176D860056m8270p3177r5901j14259j27226j35506j39953j40561j37609j32635
61166C714959j27046j20620j12448j02835r3206q4659p7637p2546o9429o7045
$$ y = [4463998, 4464238, 4461648, 4457147, 4451759, 4445972, 4439722, 4432521, 4423545, 4411987, 4397342, 4379051, 4355963, 4326654, 4290453, 4248006, 4200956, 4151289, 4100691, 4050022, 3999427, 3949287, 3900884, 3855762, 3814625, 3777409, 3744305, 3715947, 3692364, 3672228, 3653637, 3635747, 3619478, 3606408, 3596741, 3588550, 3579582, 3569816, 3561528, 3556632, 3554835, 3554848, 3556359, 3559929, 3565861, 3574523, 3587319, 3605942, 3630718, 3660891, 3696423, 3738253, 3786678, 3840678, 3899057, 3961094, 4025845, 4092013, 4159095, 4227738, 4298603, 4371857, 4447973, 4527491, 4608876, 4687518, 4757794, 4815534, 4857818, 4881451, 4882991, 4860056, 4811786, 4738609, 4642708, 4528449, 4401223, 4265717, 4125764, 3985203, 3847594, 3714959, 3587913, 3467293, 3354845, 3252010, 3158804, 3074145, 2996508, 2923962, 2854533, 2787488]
61156B787488o3480n7996n1561m5433l9983l5095l0645k6097k0510j3863p873
61145B394952m468l540l111j786o9J034J799L376O106R158J1651J3448J4789J5895
61131B459234J7078J8692K0494K1384K0058J5929R401J597o112j2722j8104k2686
61119B524243k6568k9153l0030l0035l0837l3316l6565l8947m0029m0985m2934
61108B144844m5504m7571m8847m9765n0160m9284m7260m5195m3461m1322l8839
61097A637636l7466l7515l6614l2567k6679k2146j9844j7905j5155j2322r660
61086A369763n921p74L828N964N865M560J904k420p052r789j0020r161q750q943
61072A329054q772p331m729k003R3J942M154O205P124P346Q347J0295J1623J1366
$$ y = [2787488, 2724008, 2666012, 2614451, 2569018, 2529035, 2493940, 2463295, 2437198, 2416688, 2402825, 2394952, 2390484, 2386944, 2383833, 2382047, 2381978, 2383012, 2384811, 2388187, 2394293, 2403451, 2415102, 2428550, 2443339, 2459234, 2476312, 2495004, 2515498, 2536882, 2556940, 2572869, 2582270, 2583867, 2577755, 2565033, 2546929, 2524243, 2497675, 2468522, 2438492, 2408457, 2377620, 2344304, 2307739, 2268792, 2228763, 2187778, 2144844, 2099340, 2051769, 2002922, 1953157, 1902997, 1853713, 1806453, 1761258, 1717797, 1676475, 1637636, 1600170, 1562655, 1526041, 1493474, 1466795, 1444649, 1424805, 1406900, 1391745, 1379423, 1369763, 1363842, 1363068, 1366896, 1372860, 1378725, 1383285, 1385189, 1382769, 1375717, 1365928, 1355908, 1346747, 1337997, 1329054, 1320282, 1312951, 1308222, 1306219, 1306312, 1308254, 1312408, 1318613, 1325737, 1333083, 1341430, 1351725, 1363348, 1374714]
61058A374714J0371R500Q333O580N240N102N290M534K930J373K16l96J00J740
61044A435627L376L964L694L024J743J22m05P35J671K61l000o024q260j0872j4190
61029A411466j7065j8734j9498j9362j7722j4919j2721j2380j3016j2744j1015
61018A242290r330r484j1234j2176j0487p466o125p287q592p801n365k818m92
61005A143633J696K822K233J239J445K328K299J485J305J794J625O87N13J888
60991A166992L917N855Q092J0654J2335J2152J0836J0117J1058J3242J5150J5422
60979A295822J4401J4125J6099J9448K2119K3495K4589K6099K7566K8481K8991
60968A541235K9438L0105L1432L3612L6033L7871L9120M0322M1585M2646M3516
$$ y = [1374714, 1385085, 1394585, 1402918, 1409498, 1414738, 1419840, 1425130, 1429664, 1432594, 1433967, 1434183, 1433787, 1433887, 1435627, 1439003, 1442967, 1446661, 1449685, 1451428, 1451550, 1451145, 1451880, 1453551, 1453812, 1450812, 1444788, 1436528, 1425656, 1411466, 1394401, 1375667, 1356169, 1336807, 1319085, 1304166, 1291445, 1279065, 1266049, 1253305, 1242290, 1232960, 1223476, 1212242, 1200066, 1189579, 1182113, 1175988, 1168701, 1160109, 1152308, 1146943, 1144125, 1143633, 1145329, 1148151, 1150384, 1151623, 1153068, 1155396, 1157695, 1159180, 1160485, 1162279, 1163904, 1164591, 1165104, 1166992, 1170909, 1176764, 1184856, 1195510, 1207845, 1219997, 1230833, 1240950, 1252008, 1265250, 1280400, 1295822, 1310223, 1324348, 1340447, 1359895, 1382014, 1405509, 1430098, 1456197, 1483763, 1512244, 1541235, 1570673, 1600778, 1632210, 1665822, 1701855, 1739726, 1778846, 1819168, 1860753, 1903399, 1946915]
60957A946915M4236M4385M3757M3179M3731M5477M7743N0242N3138N6489O0347
60946B479639O4952P0170P5471Q1008Q7857R6472J05995J15748J26016J36594
60936C439922J46223J54837J64760J78122J94386K11955K30531K50122K69226
60927E240084K86208L01373L16003L30807L47006L67186L92912M22996M56182
60918H460757M93543N36087N82265O30852O84222P46195Q18871R04328J006164
60909A4863284J125829J261003J411526J582533J777455J995294K243011K542310
60901B8802245K910538L341441L820544M342523M863030N212699N114406M373770
60893F2781196L090600J654464M96113j65527l53544j89413J95698O04961P31796
$$ y = [1946915, 1991151, 2035536, 2079293, 2122472, 2166203, 2211680, 2259423, 2309665, 2362803, 2419292, 2479639, 2544591, 2614761, 2690232, 2771240, 2859097, 2955569, 3061564, 3177312, 3303328, 3439922, 3586145, 3740982, 3905742, 4083864, 4278250, 4490205, 4720736, 4970858, 5240084, 5526292, 5827665, 6143668, 6474475, 6821481, 7188667, 7581579, 8004575, 8460757, 8954300, 9490387, 10072652, 10703504, 11387726, 12133921, 12952792, 13857120, 14863284, 15989113, 17250116, 18661642, 20244175, 22021630, 24016924, 26259935, 28802245, 31712783, 35054224, 38874768, 43217291, 48080321, 53293020, 58407426, 62781196, 65871796, 67526260, 68022373, 67856846, 67503302, 67313889, 67509587, 68114548, 68846344]
60884F8846344K90144p61976k147611l444922m346750m779542m836499m653991
60876D4165197m345004l988319l628075l276603k932283k598890k285928j998339
60868A9111756j736124j501833j300435j132636r94329q81599p91053p16648o51671
60859I405428n93703n43468m99626m58904m20461l85799l54655l25019k97047
60850E526746k73325k55087k40976k29208k18348k06694j93734j81309j70669
60841C557396j59705j46288j32795j23366j17724j11779j03901r6342r0509q5090
60831B389897p9416p4820p1611o8053o3433n9287n6635n4606n2568n1064m9922
60820A708482m7906m4967m2517m0870l8819l6301l4998l5423l5734l4407l2172
$$ y = [68846344, 69136488, 68374512, 66226901, 62781979, 58435229, 53655687, 48819188, 44165197, 39820193, 35831874, 32203799, 28927196, 25994913, 23396023, 21110095, 19111756, 17375632, 15873799, 14573364, 13440728, 12446399, 11564800, 10773747, 10057099, 9405428, 8811725, 8268257, 7768631, 7309727, 6889266, 6503467, 6148812, 5823793, 5526746, 5253421, 4998334, 4757358, 4528150, 4309802, 4103108, 3909374, 3728065, 3557396, 3397691, 3251403, 3118608, 2995242, 2877518, 2765739, 2661838, 2565496, 2474987, 2389897, 2310481, 2235661, 2164050, 2095997, 2032564, 1973277, 1916642, 1862036, 1809468, 1758404, 1708482, 1660576, 1615609, 1573092, 1532222, 1493403, 1457102, 1422104, 1386681, 1350947, 1316540, 1284368]
60809A284368l0336k8904k7135k4568k0966j6572j2632j0227q727o812m638l081
60797A089770j560J065L811M556L625L573N224O752P212P953R702J0956J0550
60784A163189R446Q836Q509Q232Q603R400Q978O450K878n12l452n393n293l625
60770A216246k602l336m576n214o076q029j0192j1390j1778j1907j1673j1229
60758A118244j1319j1655j0695q113n854n561o594p699q742r476q572n636k532
60745A015796q61L86K668M851M694K611J509L050O005Q490J0149J1626J3101J4057
60731A098132J4115J3683J3722J4772J6301J7366J7607J7038J5390J2781J0648
60720A261555J0435J1487J1846J1154J0718J0562Q804M863R67q45j199j484j534
$$ y = [1284368, 1254032, 1225128, 1197993, 1173425, 1152459, 1135887, 1123255, 1113028, 1104301, 1097489, 1092851, 1089770, 1088210, 1089275, 1093086, 1097642, 1101267, 1104840, 1110064, 1116816, 1124028, 1131981, 1141683, 1152639, 1163189, 1172635, 1181471, 1189980, 1198212, 1206815, 1216215, 1225193, 1231643, 1234521, 1234009, 1230557, 1225164, 1219871, 1216246, 1213644, 1210308, 1205732, 1200518, 1194442, 1186413, 1176221, 1164831, 1153053, 1141146, 1129473, 1118244, 1106925, 1095270, 1084575, 1076462, 1070608, 1065047, 1058453, 1050754, 1042012, 1032536, 1023964, 1018328, 1015796, 1014935, 1015321, 1017989, 1022840, 1027534, 1030145, 1031654, 1034704, 1040709, 1049199, 1059348, 1070974, 1084075, 1098132, 1112247, 1125930, 1139652, 1154424, 1170725, 1188091, 1205698, 1222736, 1238126, 1250907, 1261555, 1271990, 1283477, 1295323, 1306477, 1317195, 1327757, 1336561, 1341424, 1342391, 1341546, 1340347, 1338863, 1337329]
60707A337329r35p94j978l074k347o24Jn18o23k45r48l016m853n554o010o825
60691A298986p130o323n400n445n921n631m583l745l473l265k954l090l883m534
60677A233609m189l218k882l748m959n237m190k343l99J108J837J815J377N14
60663A209095j218l701n756o388o063n855n850n471m903m911n436n766n989o893
60649A134895q301q995q557q039q379r350j0445j1604j2659j3147j3217j3667
60637A008535j4765j5949j6912j7787j8028j6571j3678j1229j0373j0214r527
60626H53502q528p946p447o323m903m075l785l146j799l39N60Q29Q40R12J055
60611H09407J132J329K250M179O546Q585J0061J0913J0773R756R001R342J0055
$$ y = [1337329, 1336394, 1335600, 1333622, 1330548, 1328201, 1327577, 1327578, 1327060, 1326437, 1326192, 1325244, 1322228, 1317375, 1311821, 1305811, 1298986, 1291856, 1285533, 1280133, 1274688, 1268767, 1263136, 1258553, 1254808, 1251335, 1248070, 1245116, 1242026, 1238143, 1233609, 1229420, 1226202, 1223320, 1219572, 1214613, 1209376, 1205186, 1202843, 1202444, 1203552, 1205389, 1207204, 1208581, 1209095, 1207877, 1204176, 1198420, 1192032, 1185969, 1180114, 1174264, 1168793, 1163890, 1158979, 1153543, 1147777, 1141788, 1134895, 1126594, 1117599, 1109042, 1101003, 1092624, 1083274, 1072829, 1061225, 1048566, 1035419, 1022202, 1008535, 993770, 977821, 960909, 943122, 925094, 908523, 894845, 883616, 873243, 863029, 853502, 844974, 837028, 829581, 823258, 818355, 814280, 810495, 807349, 805550, 805211, 805771, 806600, 807440, 808352, 809407, 810539, 811868, 814118, 818297, 824843, 833428, 843489, 854402, 865175, 874931, 883932, 893274, 903329]
60598I03329J0224J0594J2246J4160J4216J2578J1764J3083J5201J6717J8007
60587A052119J9661K1033K1376K0850J9590J7314J4571J2827J2550J2710J2691
60576A237292J3010J3501J2869J0894R190Q676Q200O772N240M462L626J813n33
60563A335012k990o161r932j2582j3330j3820j5292j6231j4968j2777j1906j2061
60551A192962j1488j0232r426q237m732L84L891M308L674M493O978R940J2543
60538A195058J4208J4247J2755J1109J0686J1363J1696J0403P497M144J549P0
60526A304785m76r6J102K334K946L590N189O882O739M804L382L758M724N049N181
60511A359893N260L926P86k061l082l890o520r826j1205j0570r915r974r917r633
$$ y = [903329, 913553, 924147, 936393, 950553, 964769, 977347, 989111, 1002194, 1017395, 1034112, 1052119, 1071780, 1092813, 1114189, 1135039, 1154629, 1171943, 1186514, 1199341, 1211891, 1224601, 1237292, 1250302, 1263803, 1276672, 1287566, 1296756, 1305432, 1313632, 1320404, 1325644, 1330106, 1333732, 1335545, 1335012, 1332022, 1325861, 1315929, 1303347, 1290017, 1276197, 1260905, 1244674, 1229706, 1216929, 1205023, 1192962, 1181474, 1171242, 1161816, 1153579, 1148847, 1149231, 1153122, 1157430, 1161104, 1165597, 1172575, 1182515, 1195058, 1209266, 1223513, 1236268, 1247377, 1258063, 1269426, 1281122, 1291525, 1299022, 1303166, 1304715, 1304785, 1304309, 1304213, 1305315, 1307649, 1310595, 1314185, 1319374, 1326256, 1332995, 1337799, 1341181, 1344939, 1349663, 1354712, 1359893, 1365153, 1369079, 1369865, 1367804, 1364722, 1360832, 1354312, 1344486, 1333281, 1322711, 1312796, 1302822, 1292905, 1283272]
60497A283272r625r071o648l147r11o47r30p86o52n57N55L148O315R042J1071
60482A280429J2496J3634J5301J8104K1632K5256K9116L3350L7264M0614M4780
60471A571976N0934N7929O3850O8981P5170Q2659Q9514R3886R5044R2547Q6257
60460B428747P6973O5400N1063L4014J6904L282n749j1144j2966j0446m688J313
60448B632703N756Q919J0950J1055R137O033K000k903o720o479j784M547J0068
60435B683282J5013K0781K8171L7662M9241O1362P2096Q1844R2840J05412J17006
60424C364710J25623J31985J37325J41333J43672J45587J48763J54217J63384
60415D656599J78439K00124K26731K56605K90238L28837L72234M19323M68925
$$ y = [1283272, 1273647, 1264576, 1257928, 1254781, 1253870, 1253223, 1252293, 1251507, 1250855, 1250298, 1250853, 1254001, 1260316, 1269358, 1280429, 1292925, 1306559, 1321860, 1339964, 1361596, 1386852, 1415968, 1449318, 1486582, 1527196, 1571976, 1622910, 1680839, 1744689, 1813670, 1888840, 1971499, 2061013, 2154899, 2249943, 2342490, 2428747, 2505720, 2571120, 2622183, 2656197, 2673101, 2676383, 2670634, 2659490, 2646524, 2636078, 2631390, 2632703, 2638459, 2647378, 2658328, 2669383, 2678520, 2684553, 2686553, 2683650, 2676930, 2670451, 2668667, 2673214, 2683282, 2698295, 2719076, 2747247, 2784909, 2834150, 2895512, 2967608, 3049452, 3142292, 3247704, 3364710, 3490333, 3622318, 3759643, 3900976, 4044648, 4190235, 4338998, 4493215, 4656599, 4835038, 5035162, 5261893, 5518498, 5808736, 6137573, 6509807, 6929130, 7398055]
60406G398055N18602N63524N97602O14509O06864N66443M87781L71742K25277
60397A1950399N9063j13614k77685m19295n29455o05062o47545o61310o52582
60388H102914o27875n92662n51077n06099m59907m14666l72786l35489l01483
60379C940870k68745k37744k11007j89155j69567j50091j31939j17375j06218
60370B359029r6536q7569p9994p3903o8476o3357n8946n5284n1802m8144m4465
60359A630553m1134l8687l7580l7260l6034l2757k8373k4930k3338k2757k1913
60348A285790k0372j8575j7067j5796j4112j1667r181p806p816q473r094r382
60336A136449q887p144m499j932N2J438J798P42o60m15J831M003M055K232L68
$$ y = [7398055, 7916657, 8480181, 9077783, 9692292, 10299156, 10865599, 11353380, 11725122, 11950399, 12009462, 11895848, 11618163, 11198868, 10669413, 10064351, 9416806, 8755496, 8102914, 7475039, 6882377, 6331300, 5825201, 5365294, 4950628, 4577842, 4242353, 3940870, 3672125, 3434381, 3223374, 3034219, 2864652, 2714561, 2582622, 2465247, 2359029, 2262493, 2174924, 2094930, 2021027, 1952551, 1889194, 1830248, 1774964, 1723162, 1675018, 1630553, 1589419, 1550732, 1513152, 1475892, 1439858, 1407101, 1378728, 1353798, 1330460, 1307703, 1285790, 1265418, 1246843, 1229776, 1213980, 1199868, 1188201, 1179020, 1171214, 1163398, 1154925, 1145831, 1136449, 1127562, 1120418, 1115919, 1113987, 1114039, 1115477, 1117275, 1118017, 1117357, 1116942, 1118773, 1122776, 1126831, 1129063, 1129431]
60321A129431k13L32P24m16l169n966p451q220r476j0531r621o994m882m204l779
60306A055565l179l628n034m902k094P32O20j489k346q41J228K046J491M83J55
60291A038807J130K630L103K521K690M263N300M266K690K757L939M363M210N013
60277A087682O400O445M968L932M412N474O291P186Q286R013R413J0304J1806
60264A181612J3148J4152J5303J6211J5710J3857J2107J0999R311O199K655j08
60252A311156k357m892p371q786q984q788q819q955q791q265p836q089q864q963
60238A201396p234m066j140L01M89M13N69O24l0j426k615k490j294o72j544k675
60222A178606k321o39Q85J969L835O872R765J1458J2527J3793J4798J4708J3830
$$ y = [1129431, 1129218, 1129550, 1130274, 1129858, 1126689, 1120723, 1113272, 1105052, 1095576, 1085045, 1075424, 1068430, 1063548, 1059344, 1055565, 1052386, 1048758, 1043724, 1038822, 1036728, 1037460, 1038080, 1036591, 1034245, 1033404, 1034632, 1036678, 1038169, 1038652, 1038807, 1039937, 1042567, 1045670, 1048191, 1050881, 1055144, 1060444, 1064710, 1067400, 1070157, 1074096, 1078459, 1082669, 1087682, 1094082, 1100527, 1105495, 1109427, 1113839, 1119313, 1125604, 1132790, 1141076, 1150089, 1159502, 1169806, 1181612, 1194760, 1208912, 1224215, 1240426, 1256136, 1269993, 1282100, 1293099, 1302410, 1308609, 1311264, 1311156, 1308799, 1303907, 1296536, 1287750, 1278766, 1269978, 1261159, 1252204, 1243413, 1235148, 1227312, 1219223, 1210359, 1201396, 1194162, 1190096, 1188956, 1189257, 1189746, 1190159, 1190728, 1191352, 1191322, 1189896, 1187281, 1184791, 1183497, 1182825, 1181281, 1178606, 1176285, 1175646, 1176531, 1178500, 1182335, 1189207, 1198972, 1210430, 1222957, 1236750, 1251548, 1266256, 1280086]
60209A280086J3089J2607J1950J1401J1837J3381J5169J6541J7696J9037K0592
60198A443386K2359K4563K7145K9497L1261L3049L5767L9477M3535M7705N2343
60187A830087N7392O2201O6711P2043P8960Q6292R1826R4831R7031J00949J07584
60176B745907J15558J22188J25545J25802J24374J21696J16698J08943J00109
60167C806820R2107Q4503P5384O4278N2548M1020K9194J7004N598m235j2716j9551
60155D231954k3434k4050k3051k1785j9310j4019o319J834R420J7158K6055L6325
60143D190778M7581N9267P0806Q1739R1646R9945J06427J11860J17072J21202
60133E098323J22008J18320J10940J00641Q7030P0359N2969L7156K2554P141r676
$$ y = [1280086, 1293175, 1305782, 1317732, 1329133, 1340970, 1354351, 1369520, 1386061, 1403757, 1422794, 1443386, 1465745, 1490308, 1517453, 1546950, 1578211, 1611260, 1647027, 1686504, 1730039, 1777744, 1830087, 1887479, 1949680, 2016391, 2088434, 2167394, 2253686, 2345512, 2440343, 2537374, 2638323, 2745907, 2861465, 2983653, 3109198, 3235000, 3359374, 3481070, 3597768, 3706711, 3806820, 3898927, 3983430, 4058814, 4123092, 4175640, 4216660, 4245854, 4262858, 4268456, 4264221, 4251505, 4231954, 4208520, 4184470, 4161419, 4139634, 4120324, 4106305, 4099986, 4101820, 4111240, 4128398, 4154453, 4190778, 4238359, 4297626, 4368432, 4450171, 4541817, 4641762, 4748189, 4860049, 4977121, 5098323, 5220331, 5338651, 5449591, 5550232, 5637262, 5707621, 5760590, 5797746, 5820300, 5827441, 5817765]
60122E817765k6369m1128n3046o1830o7646p1140p2615p1332o6406n8018m7017
60111E181218l3821j8622k194J4390L0589M6181O0779P4244Q6871R8272J06677
60100E644584J10254J08608J02192R1228P6443N9994M4136K9196J4218p47j4302
60089F265804k5341l3648l9015m1077m0095l6766l1054k2166r759N621K3142M1884
60077F057530O0723P9179R8428J20288J44871J70131J94054K16605K39159K62528
60067G643496K86030L08336L28880L48071L65844L80446L89406L91637L87566
60058A0829712L77165L59330L33612L01139K62997K19170J70151J18179O5425
60049A3036880J2107m2078r5792j46918j94518k37877k74381l00722l16256l23330
$$ y = [5817765, 5791396, 5750268, 5697222, 5635392, 5567746, 5496606, 5423991, 5352659, 5286253, 5228235, 5181218, 5147397, 5128775, 5126581, 5140971, 5171560, 5217741, 5278520, 5352764, 5439635, 5537907, 5644584, 5754838, 5863446, 5965638, 6056866, 6133309, 6193303, 6237439, 6266635, 6280853, 6280106, 6265804, 6240463, 6206815, 6167800, 6126723, 6086628, 6049862, 6018808, 5996642, 5986883, 5992504, 6015646, 6057530, 6118253, 6197432, 6295860, 6416148, 6561019, 6731150, 6925204, 7141809, 7380968, 7643496, 7929526, 8237862, 8566742, 8914813, 9280657, 9661103, 10050509, 10442146, 10829712, 11206877, 11566207, 11899819, 12200958, 12463955, 12683125, 12853276, 12971455, 13036880, 13048987, 13006909, 12911117, 12764199, 12569681, 12331804, 12057423, 11756701, 11440445, 11117115]
60039A1117115l24269l19636l09325k93499k72261k45994k16384j85713j54835
60030H795199j23099r0391n7945k6898K606L0494N5913P7607R4260J04653J08608
60019H971007J07635J03428R5796Q3487O6965M8637K9981J0142j1928l5372n8413
60008I411365q0301j01224j21031j39054j54725j67672j77333j83008j84343j81759
59998G920915j76478j69852j62251j52911j41262j27911j13701r8412q1376o3006
59988F633755m4565k6583q564R793K8049M5713O2431P7443Q9722R8609J03720
59977G069523J04406J00152R1348P8870O3200M4669K4108K335k0468m3778o5844
59966G448521q5117j02016j17696j31520j41426j46399j46925j43306j35703j25789
$$ y = [11117115, 10792846, 10473210, 10163885, 9870386, 9598125, 9352131, 9135747, 8950034, 8795199, 8672100, 8581709, 8523764, 8496866, 8499472, 8529966, 8585879, 8663486, 8757746, 8862399, 8971007, 9078642, 9182070, 9277866, 9361353, 9428318, 9476955, 9506936, 9517078, 9505150, 9469778, 9411365, 9331064, 9229840, 9108809, 8969755, 8815030, 8647358, 8470025, 8287017, 8102674, 7920915, 7744437, 7574585, 7412334, 7259423, 7118161, 6990250, 6876549, 6778137, 6696761, 6633755, 6589190, 6562607, 6554043, 6563836, 6591885, 6637598, 6700029, 6777472, 6867194, 6965803, 7069523, 7173929, 7274081, 7365429, 7444299, 7507499, 7552168, 7576276, 7578611, 7558143, 7514365, 7448521, 7363404, 7261388, 7143692, 7012172, 6870746, 6724347, 6577422, 6434116, 6298413, 6172624]
59956F172624j15958j06222r3976p7688n9087m0820k3648p021R271K5360M1942
59945E724777N9180P5887R1153J05963J21718J37597J50750J59222J63471J64823
59935F954541J63256J57264J45608J28763J08494Q6336O2828L8102J2588j3163
59925G844617l8614o2760q4141j01989j16647j28036j34567j34784j29536j21195
59915F792348j11024r8671q3929o7678n0954l4268j7810j366J5728L3463N0306
59904F426145O4765P7382Q9675J01378J10337J15242J16849J16341J14034J10001
59894G442149J04588R7868Q9781Q1017P2609O4562N6173M7788M1013L7117L6462
59883H171127L9401M6172N6049O8118Q3109J02746J27167J54521J83170K12583
$$ y = [6172624, 6056666, 5950444, 5856468, 5778780, 5719693, 5678873, 5655225, 5648204, 5657475, 5682835, 5724777, 5783957, 5859844, 5950997, 6056960, 6178678, 6316275, 6467025, 6626247, 6789718, 6954541, 7117797, 7275061, 7420669, 7549432, 7657926, 7744262, 7807090, 7845192, 7857780, 7844617, 7806003, 7743243, 7659102, 7557113, 7440466, 7312430, 7177863, 7043079, 6913543, 6792348, 6681324, 6582653, 6498724, 6431046, 6380092, 6345824, 6328014, 6326648, 6342376, 6375839, 6426145, 6490910, 6568292, 6657967, 6759345, 6869682, 6984924, 7101773, 7218114, 7332148, 7442149, 7546737, 7644605, 7734386, 7815403, 7888012, 7952574, 8008747, 8056535, 8097548, 8134665, 8171127, 8210528, 8256700, 8312749, 8380867, 8463976, 8566722, 8693889, 8848410, 9031580, 9244163]
59873I244163K42091K70792K99038L27637L54856L76230L88284L90790L84516
59864A2278397L68464L40322K98228K41507J71568R2988J1987o7252j43336k14239
59854A3378634k75347l22434l54999l75202l84934l85293l77490l62572l41022
59845A0199341l13837k83206k51055k17929j84142j50807j18682q7153n5535k4457
59835H512538N006L2547N8045Q0868J00560J17133J29895J37203J38050J32380
59825I444225J19255R6711O4699K6398j4898n8408j03821j48558j89131k23941
59815I012531k52676k74260k87714k94175k95875k93572k86830k76181k63161
59806F488087k48716k33240k17467k01675j84763j66084j47455j31278j17243
$$ y = [9244163, 9486254, 9757046, 10056084, 10383721, 10738577, 11114807, 11503091, 11893881, 12278397, 12646861, 12987183, 13285411, 13526918, 13698486, 13791474, 13803461, 13736209, 13592873, 13378634, 13103287, 12780853, 12425854, 12050652, 11665718, 11280425, 10902935, 10540363, 10199341, 9885504, 9602298, 9351243, 9133314, 8949172, 8798365, 8679683, 8592530, 8536995, 8512538, 8517544, 8550091, 8608136, 8689004, 8789564, 8906697, 9036592, 9173795, 9311845, 9444225, 9563480, 9660191, 9724890, 9751288, 9736390, 9677982, 9574161, 9425603, 9236472, 9012531, 8759855, 8485595, 8197881, 7903706, 7607831, 7314259, 7027429, 6751248, 6488087, 6239371, 6006131, 5788664, 5586989, 5402226, 5236142, 5088687, 4957409, 4840166]
59797D840166j03065q8151p4210o2372n2038m2938l6139l2245l0328k9260k8735
59786D260685k8382k7266k4905k1789j8431j4954j1751r390p598n609l905m417
59774D082288q379j4971k2667l0765l8884m5932n0646n2720n2637n0848m7800
59763C666039m4430m1598l8998l5338k9881k3326j6863j0766m396K760J0801K0040
59751C454044L0899M2679N3431O1860O8575P4504P8884Q0318P9208P7305P4993
59740D176700P1031O5303N9648N5144N0303M3183L3950K4318J5735R210N737N582
59728D615844Q077J2918K0637L0981M2325N3894O7049Q2831R9670J15473J30988
59717E280687J48929J70306J93596K17236K40990K64886K88470L11261L32315
$$ y = [4840166, 4737101, 4648950, 4574740, 4512368, 4460330, 4417392, 4381253, 4349008, 4318680, 4289420, 4260685, 4232303, 4205037, 4180132, 4158343, 4139912, 4124958, 4113207, 4103817, 4096219, 4090610, 4086705, 4082288, 4073909, 4058938, 4036271, 4005506, 3966622, 3920690, 3870044, 3817324, 3764687, 3713839, 3666039, 3621609, 3580011, 3541013, 3505675, 3475794, 3452468, 3435605, 3424839, 3420443, 3423203, 3434004, 3454044, 3484943, 3527622, 3581053, 3642913, 3711488, 3785992, 3864876, 3945194, 4024402, 4101707, 4176700, 4247731, 4313034, 4372682, 4427826, 4478129, 4521312, 4555262, 4579580, 4595315, 4604525, 4610262, 4615844, 4623921, 4636839, 4657476, 4688457, 4730782, 4784676, 4851725, 4934556, 5034226, 5149699, 5280687, 5429616, 5599922, 5793518, 6010754, 6251744, 6516630, 6805100, 7116361, 7448676]
59708G448676L48842L56288L49917L25649K80127K12412J26862L3541n5445j30649
59698I296220j87465k25287k45682k51314k45776k32996k15589j93829j67340
59689G330942j37762j08502q1641n6653l2620r885J1391L2528N4594P6721R7750
59678G176863J18281J39381J60439J80371K00138K21875K45859K70447K94929
59669I008583L20532L48397L78252M09402M41632M74685N08001N41341N75025
59660A3005850O09372O44405O79710P13619P42815P63763P74632P75401P66725
59651A9476292P49580P25593O96800O65524O35061O09516N91713N81757N78321
59642B5310157N80313N86008N91757N93319N87936N73699N47756N07180M51527
$$ y = [7448676, 7797518, 8153806, 8503723, 8829372, 9109499, 9321911, 9448773, 9482314, 9426869, 9296220, 9108755, 8883468, 8637786, 8386472, 8140696, 7907700, 7692111, 7498282, 7330942, 7193180, 7084678, 7003037, 6946384, 6913764, 6903879, 6915270, 6947798, 7002392, 7079113, 7176863, 7295144, 7434525, 7594964, 7775335, 7975473, 8197348, 8443207, 8713654, 9008583, 9329115, 9677512, 10055764, 10465166, 10906798, 11381483, 11889484, 12430825, 13005850, 13615222, 14259627, 14939337, 15652956, 16395771, 17159534, 17934166, 18709567, 19476292, 20225872, 20951465, 21648265, 22313789, 22948850, 23558366, 24150079, 24731836, 25310157, 25890470, 26476478, 27068235, 27661554, 28249490, 28823189, 29370945, 29878125, 30329652]
59633C0329652L83102L05176K21469J36673N5507j8872q4115j36821j73338j92302
59623C0826131j94793j82110j55211j16139o7878j2225N0755J20870J96701K76444
59613C0742545L58414M40523N20606N97233O68732P31380P79951Q10037Q18050
59604C6467471P98998P46460O55934N27165L63139J68910m7352k73421m94816
59595C8912488o97972q72296j011043j111509j174382j202527j200353j173617
59587C0468789j128495j070616j005412r39023q78130q29210p98382p90313q04817
59578B2224391q34628q68380q96438r13379r16426r04401q78698q42981q00661
59569A4368399p53704p03827o53148o02995n53640n05785m61055m20450l83566
$$ y = [30329652, 30712754, 31017930, 31239399, 31376072, 31431579, 31412707, 31328592, 31191771, 31018433, 30826131, 30631338, 30449228, 30294017, 30177878, 30110000, 30097775, 30148530, 30269400, 30466101, 30742545, 31100959, 31541482, 32062088, 32659321, 33328053, 34059433, 34839384, 35649421, 36467471, 37266469, 38012929, 38668863, 39196028, 39559167, 39728077, 39680725, 39407304, 38912488, 38214516, 37342220, 36331177, 35219668, 34045286, 32842759, 31642406, 30468789, 29340294, 28269678, 27264266, 26325243, 25447113, 24617903, 23819521, 23029208, 22224391, 21389763, 20521383, 19624945, 18711566, 17795140, 16890739, 16012041, 15169060, 14368399, 13614695, 12910868, 12257720, 11654725, 11101085, 10595300, 10134245, 9713795, 9330229]
59560I330229l49771l18862k90251k63070k37631k15338j96373j78910j61505
59551G118518j45141j31789j21912j14366j08165j03382j00565r9950j01099j03250
59541E988899j06129j10104j14974j19071j20461j18840j15403j11272j07011
59532D965634j03026r8968r3207q4645p4864o6573o0047n3018m4282l5292k7566
59521D224146k0514j2899m901K335Q119J2455J5882J9565K4428K9799L4062L6918
59509D369395L9587M2588M5116M7165N0247N5053O0101O4009O7642P2684P9331
59498D992918Q6873R5480J05840J17552J29325J40515J51566J63201J75893J89756
59488F348919K04389K19224K34291K49848K64951K77498K86479K93182K99087
$$ y = [9330229, 8980458, 8661596, 8371345, 8108275, 7870644, 7655306, 7458933, 7280023, 7118518, 6973377, 6841588, 6719676, 6605310, 6497145, 6393763, 6293198, 6193248, 6092149, 5988899, 5882770, 5772666, 5657692, 5538621, 5418160, 5299320, 5183917, 5072645, 4965634, 4862608, 4763640, 4670433, 4585788, 4510924, 4444351, 4384304, 4331286, 4287004, 4251712, 4224146, 4203632, 4190733, 4185832, 4188167, 4196286, 4208741, 4224623, 4244188, 4268616, 4298415, 4332477, 4369395, 4408982, 4451570, 4496686, 4543851, 4594098, 4649151, 4709252, 4773261, 4840903, 4913587, 4992918, 5079791, 5175271, 5281111, 5398663, 5527988, 5668503, 5820069, 5983270, 6159163, 6348919, 6553308, 6772532, 7006823, 7256671, 7521622, 7799120, 8085599, 8378781, 8677868]
59479H677868L03253L03018K96971K86104K72206K56106K37890K17817J96059
59470A1047292J71634J42871J09990P6805M8409K6802J0134l437j2959j6918j6124
59459A1584499j2209m507Q996K8263N1155P6209J02642J27838J47722J60245J65713
59448A2436566J63088J48773J20513Q0177L1180k4706q6265j50292k12381k69410
59438A2237243l19806l62060l94378m15673m26086m26778m19304m04736l83487
59429H684935l56813l27880k99663k72070k43056k12571j83185j56662j32191
59420F500844j08680q6330o5109m4074k3268m048J3688L2236N2689P3035R1400
59409F432383J08931J27531J46637J64320J79932J93493K04010K10515K13501
$$ y = [8677868, 8981121, 9284139, 9581110, 9867214, 10139420, 10395526, 10633416, 10851233, 11047292, 11218926, 11361797, 11471787, 11548592, 11597001, 11623803, 11633937, 11630500, 11617541, 11600623, 11584499, 11572290, 11567783, 11576779, 11605042, 11656197, 11732406, 11835048, 11962886, 12110608, 12270853, 12436566, 12599654, 12748427, 12868940, 12949117, 12980297, 12955591, 12869326, 12719034, 12506653, 12237243, 11917437, 11555377, 11160999, 10745326, 10319240, 9892462, 9473158, 9068422, 8684935, 8328122, 8000242, 7700579, 7428509, 7185453, 6972882, 6789697, 6633035, 6500844, 6392164, 6305834, 6240725, 6196651, 6173383, 6169335, 6183023, 6215259, 6267948, 6340983, 6432383, 6541314, 6668845, 6815482, 6979802, 7159734, 7353227, 7557237, 7767752, 7981253]
59400G981253K13228K07807J95030J74985J48879J16575P7595L3612j2442n9037
59390I077485j05580j49974j89077k21416k47401k67133k80080k86836k89078
59381G040910k87464k81211k70064k55436k39475k23985k09909j96635j82328
59372D894403j66219j50237j36826j25737j14691j02823r1494q1680p2634o3538
59362C788524n4670m6258l7678k8607j9846j2270n837j87M805R629J5392K2623
59350C635620L0425L7518M3582M8603N1332M9686M3345L5482L0909L2193L7914
59339D076609M4990N2157O0611P1467Q3597R4169J00860J03414J03589J03912
59329D895375J06388J12141J21889J35803J52619J70093J87351K05843K26987
$$ y = [7981253, 8194481, 8402288, 8597318, 8772303, 8921182, 9037757, 9115352, 9148964, 9136522, 9077485, 8971905, 8821931, 8632854, 8411438, 8164037, 7896904, 7616824, 7329988, 7040910, 6753446, 6472235, 6202171, 5946735, 5707260, 5483275, 5273366, 5076731, 4894403, 4728184, 4577947, 4441121, 4315384, 4200693, 4097870, 4006376, 3924696, 3852062, 3788524, 3733854, 3687596, 3649918, 3621311, 3601465, 3589195, 3583358, 3583171, 3587976, 3597605, 3612997, 3635620, 3666045, 3703563, 3747145, 3795748, 3847080, 3896766, 3940111, 3975593, 4006502, 4038695, 4076609, 4121599, 4173756, 4234367, 4305834, 4389431, 4483600, 4584460, 4687874, 4791463, 4895375, 5001763, 5113904, 5235793, 5371596, 5524215, 5694308, 5881659, 6087502, 6314489]
59320F314489K49985K73447K97937L24806L53399L82094M11570M44088M79407
59311I531222N14311N46632N76736O04253O26264O39941O44228O37798O18640
59302A4940025N87677N50007N10205M68631M24473L79790L37651K98401K60639
59293A8757499K24318J89813J55332J18196P7655L3797j5002p0116j29056j87013
59283A9155423k41767k93988l42983l85620m19959m46958m67702m81521m87976
59274A5586949m88463m84424m75570m61120m41677m18708l93082l65207l36136
59265A1722562l07707k81423k57489k35101k13901j94903j79437j67414j57760
59256I727427j50507j46794j46375j47107j47773j49404j52438j54729j54264
$$ y = [6314489, 6564474, 6837921, 7135858, 7460664, 7814063, 8196157, 8607727, 9051815, 9531222, 10045533, 10592165, 11168901, 11773154, 12399418, 13039359, 13683587, 14321385, 14940025, 15527702, 16077709, 16587914, 17056545, 17481018, 17860808, 18198459, 18496860, 18757499, 18981817, 19171630, 19326962, 19445158, 19522813, 19556610, 19541608, 19471492, 19342436, 19155423, 18913656, 18619668, 18276685, 17891065, 17471106, 17024148, 16556446, 16074925, 15586949, 15098486, 14614062, 14138492, 13677372, 13235695, 12816987, 12423905, 12058698, 11722562, 11414855, 11133432, 10875943, 10640842, 10426941, 10232038, 10052601, 9885187, 9727427, 9576920, 9430126, 9283751, 9136644, 8988871, 8839467, 8687029, 8532300, 8378036]
59247H378036j51987j49636j46497j40891j33475j26177j18827j09790r9333q9373
59237G112050q0157p0119n9068m8626l9162k9026j7508o062M187J3993K4253L4728
59225F839483M5386N7167P0368Q3731R6094J07811J19782J32179J44699J56958
59215G853658J68072J76802J82701J86314J87897J86592J81168J70936J55904
59206I450044J36573J13359Q5814N3112J5974k2671n9974r5087j27775j56354
59196I393015j78774j94825k05537k11609k14630k18478k26238k35735k41056
59187G466133k38845k30643k18923k04035j86081j66892j48325j30386j12643
59178E829360r5899q0915o6755n1856l6076k0410n292R896K6000M3366O1617P9934
$$ y = [8378036, 8226049, 8076413, 7929916, 7789025, 7655550, 7529373, 7410546, 7300756, 7201423, 7112050, 7031893, 6961774, 6902706, 6854080, 6814918, 6785892, 6768384, 6762322, 6766509, 6780502, 6804755, 6839483, 6884869, 6942036, 7012404, 7096135, 7192229, 7300040, 7419822, 7552001, 7696700, 7853658, 8021730, 8198532, 8381233, 8567547, 8755444, 8942036, 9123204, 9294140, 9450044, 9586617, 9699976, 9785790, 9838902, 9854876, 9832205, 9772231, 9677144, 9549369, 9393015, 9214241, 9019416, 8813879, 8602270, 8387640, 8169162, 7942924, 7707189, 7466133, 7227288, 6996645, 6777722, 6573687, 6387606, 6220714, 6072389, 5942003, 5829360, 5733461, 5652546, 5585791, 5533935, 5497859, 5477449, 5472157, 5482053, 5508053, 5551419, 5613036, 5692970]
59166E692970R8097J17095J38008J60466J83300K06585K31608K58583K85724L11204
59156G683640L34945L57806L79451L97310M07319M05951L92226L67410L32289
59147A1058347K85682K26740J57808Q3265O218p1801j48259k18922k79931l28823
59137A0770324l63610l83043l88474l83648l71919l54763l33145l08624k82516
59128G600582k55506k28673k03598j80855j59697j39639j21115j04183q8020p2263
59118F047033n7590m4361l1910j9823q758P78R479J8285K7034L4663M0237M3461
59106F058528M4657M4437M2977L9724L4365K7647K0456J2424K575q988k1021l2494
59094F265287m3001n2164n9857o6645p2791p7113p8134p6210p3302p0738o8206
$$ y = [5692970, 5791067, 5908162, 6046170, 6206636, 6389936, 6596521, 6828129, 7086712, 7372436, 7683640, 8018585, 8376391, 8755842, 9153152, 9560471, 9966422, 10358648, 10726058, 11058347, 11344029, 11570769, 11728577, 11811842, 11818060, 11746259, 11598000, 11379078, 11099147, 10770324, 10406714, 10023671, 9635197, 9251549, 8879630, 8524867, 8191722, 7883098, 7600582, 7345076, 7116403, 6912805, 6731950, 6572253, 6432614, 6311499, 6207316, 6119296, 6047033, 5989443, 5945082, 5913172, 5893349, 5884591, 5885369, 5894848, 5913133, 5940167, 5974830, 6015067, 6058528, 6103185, 6147622, 6190599, 6230323, 6264688, 6292335, 6312791, 6325215, 6327790, 6318802, 6297781, 6265287, 6222286, 6170122, 6110265, 6043620, 5970829, 5893716, 5815582, 5739372, 5666070, 5595332, 5527126]
59083E527126o4540n8553m9711l9196k9603k2282j5805q297p1P667J5282K3542
59071E285559L1264L6959M2143M9891O0385P0703P9053Q6376R3715J00892J08207
59060F045147J16600J25493J33002J38783J44195J49115J51456J50600J48471
59051G302862J46253J42681J36761J29611J22265J14040J04497R4853Q5838P6266
59041H455927O5356N4747M6520M0598L5411K9663K2123J0939n380k7090n3847
59030H674967q5042j19084j53811j88053k21256k51275k74669k89899k98288l01297
59020F492293k98968k91900k82208k71166k57942k42047k25196k09299j94354
59011D219213j79741j65920j53392j41492j29844j19552j11523j04751r7650r0126
$$ y = [5527126, 5462586, 5404033, 5354322, 5315126, 5285523, 5263241, 5247436, 5239139, 5239068, 5246735, 5262017, 5285559, 5316823, 5353782, 5395925, 5445816, 5506201, 5576904, 5655957, 5742333, 5836048, 5936940, 6045147, 6161747, 6287240, 6420242, 6559025, 6703220, 6852335, 7003791, 7154391, 7302862, 7449115, 7591796, 7728557, 7858168, 7980433, 8094473, 8198970, 8293823, 8379661, 8455927, 8521283, 8576030, 8622550, 8663148, 8698559, 8728222, 8750345, 8761284, 8755904, 8728814, 8674967, 8589925, 8470841, 8317030, 8128977, 7907721, 7656446, 7381777, 7091878, 6793590, 6492293, 6193325, 5901425, 5619217, 5348051, 5090109, 4848062, 4622866, 4413567, 4219213, 4039472, 3873552, 3720160, 3578668, 3448824, 3329272, 3217749, 3112998, 3015348, 2925222]
59001B925222q3171p7325p2477o8288o4105n9404n4647n0626m6904m2489l8041
58990B267745l5342l4338l2962l0415k8176k7071k5864k3748k1714k0158j7629
58979A970328j3411r077n940l202r9K489M184O534J0234J3167J3402J2263J2252
58966B013124J3615J5190J6981J9439K1384K1073J8633J5539J2544R753P918P807
58954B193000Q851R749R843R034P336N424M547M889N186M639L850L217K164O52
58940B272381m58j409l774p719j1274j3425j5492j8140j9724j9260j8441j8604
58928B124661j8334j6210j3528j1795r879o389k736q52L36L151P343J0846J3058
58915B079672J4626J5251J4629J4464J6776K0893K4653K7656L0884L3992L5672
$$ y = [2925222, 2842051, 2764726, 2692249, 2623961, 2559856, 2500452, 2445805, 2395179, 2348275, 2305786, 2267745, 2232403, 2198065, 2165103, 2134688, 2106512, 2079441, 2053577, 2029829, 2008115, 1987957, 1970328, 1956917, 1947840, 1941900, 1938698, 1938599, 1941088, 1945272, 1951806, 1962040, 1975207, 1988609, 2000872, 2013124, 2026739, 2041929, 2058910, 2078349, 2099733, 2120806, 2139439, 2154978, 2167522, 2177275, 2185193, 2193000, 2201851, 2211600, 2221443, 2230477, 2237813, 2243237, 2247784, 2252673, 2257859, 2262498, 2266348, 2269565, 2271729, 2272381, 2271923, 2270514, 2266740, 2259021, 2247747, 2234322, 2218830, 2200690, 2180966, 2161706, 2143265, 2124661, 2106327, 2090117, 2076589, 2064794, 2054915, 2048526, 2045790, 2044938, 2045274, 2048425, 2055768, 2066614, 2079672, 2094298, 2109549, 2124178, 2138642, 2155418, 2176311, 2200964, 2228620, 2259504, 2293496, 2329168]
58904B329168L6059L6410L6831L6580L5965L5834L5793L5006L4153L4612L6334
58893B722745L8318M0449M3133M6082M9093N2996N8114O3065O6887P0840P6146
58882C327868Q1621Q5826Q9919R5647J02122J07504J12563J19359J27346J34159
58872D383934J39801J46854J56486J67097J77181J87094J97762K09581K22780
58863E988570K37379K52994K69820K88836L09815L30647L50499L71916L97407
58854H797883M25648M53771M81777N11544N42808N73522O03264O32661O59981
58845A3682859O81733O96260P03374P00714O84097O51606O04045N41148M60923
58836A9406759L63559K52906J33336P975j19019k41235l52657m49924n31398n95964
$$ y = [2329168, 2365227, 2401637, 2438468, 2475048, 2511013, 2546847, 2582640, 2617646, 2651799, 2686411, 2722745, 2761063, 2801512, 2844645, 2890727, 2939820, 2992816, 3050930, 3113995, 3180882, 3251722, 3327868, 3409489, 3495315, 3585234, 3680881, 3783003, 3890507, 4003070, 4122429, 4249775, 4383934, 4523735, 4670589, 4827075, 4994172, 5171353, 5358447, 5556209, 5765790, 5988570, 6225949, 6478943, 6748763, 7037599, 7347414, 7678061, 8028560, 8400476, 8797883, 9223531, 9677302, 10159079, 10670623, 11213431, 11786953, 12390217, 13022878, 13682859, 14364592, 15060852, 15764226, 16464940, 17149037, 17800643, 18404688, 18945836, 19406759, 19770318, 20023224, 20156560, 20164535, 20045516, 19804281, 19451624, 19001700, 18470302, 17874338]
58826A7874338o43404o74337o89385o89882o79318o62076o40447o14537n84901
58817A1996051n53371n21301m89118m57703m28384m01481l76470l53350l32244
58808H082629l12204k92276k73126k55653k38890k21520k04582j89913j76841
58799E917624j63389j50102j39305j30728j21357j09918r8301q8077p8648o9501
58789D768298o1236n3624m5310l6290k8065k0625j2033j906P462J4730K1815L1102
58777D584318M2222N2953O1842O8995P5586Q3289R2940J03568J13915J24587J36817
58766E541032J49635J60845J70814J82587J97694K14298K30210K45480K61259
58757G353854K78154K96479L16435L37551L59563L83764M11433M41176M70227
$$ y = [17874338, 17230934, 16556597, 15867212, 15177330, 14498012, 13835936, 13195489, 12580952, 11996051, 11442680, 10921379, 10432261, 9974558, 9546174, 9144693, 8768223, 8414873, 8082629, 7770425, 7478149, 7205023, 6949370, 6710480, 6488960, 6284378, 6094465, 5917624, 5754235, 5604133, 5464828, 5334100, 5212743, 5102825, 5004524, 4916447, 4837799, 4768298, 4707062, 4653438, 4608128, 4571838, 4543773, 4523148, 4511115, 4509209, 4516671, 4531401, 4553216, 4584318, 4626540, 4679493, 4741335, 4810330, 4885916, 4969205, 5062145, 5165713, 5279628, 5404215, 5541032, 5690667, 5851512, 6022326, 6204913, 6402607, 6616905, 6847115, 7092595, 7353854, 7632008, 7928487, 8244922, 8582473, 8942036, 9325800, 9737233, 10178409, 10648636]
58748A0648636M98401N27921N59034N88765O14611O36526O54125O64626O64826
58739A6057471O52767O26332N82763N21089M43111L50791K44835J27262L320j20795
58729A9488946k40578l52366m51739n34856o00497o49540o83125p02218p08076
58720A4565951p02192o86379o63200o35514o05195n73077n40081n07429m75820
58711I177064m45534m17116l90942l66525l43465l22394l03552k85356k66349
58702F035831k47659k31472k17775k04873j92283j80481j68618j55506j42456
58693D294708j31953j23600j14557j04054r4253q6330p8984p1356o4318n8157
58683C367146n1985m5994m1462l7785l2641k5940k0554j8236j7688j7667j8956
$$ y = [10648636, 11147037, 11674958, 12233992, 12822757, 13437368, 14073894, 14728019, 15392645, 16057471, 16710238, 17336570, 17919333, 18440422, 18883533, 19234324, 19479159, 19606421, 19609741, 19488946, 19248368, 18896002, 18444263, 17909407, 17308910, 16659370, 15976245, 15274027, 14565951, 13863759, 13177380, 12514180, 11878666, 11273471, 10700394, 10160313, 9652884, 9177064, 8731530, 8314414, 7923472, 7556947, 7213482, 6891088, 6587536, 6302180, 6035831, 5788172, 5556700, 5338925, 5134052, 4941769, 4761288, 4592670, 4437164, 4294708, 4162755, 4039155, 3924598, 3820544, 3726291, 3639961, 3560977, 3489621, 3425303, 3367146, 3315161, 3269167, 3227705, 3189920, 3157279, 3131339, 3110785, 3092549, 3074861, 3057194, 3038238]
58672C038238k2037k5611k8701l1687l4238l4999l4352l4681l6795l8896m0201
58661B676040m2450m6410n0000n1765n3258n5856n7886n7314n5183n4023n4414
58650B097481n5094n5042n3700n0485m5655m0755l7117l4791l3404l2620l1508
58639A627310k9180k6344k4352k2778k0151j7051j5800j6848j8383j9649k1442
58628A395332k2969k1913j8563j6127j5691j4483j0788o830m718l096l17K266
58616A262103L016L315N275Q193R893R907R036P434N167L238K232J423N34O32
58602A331398J992L034K624J567O21q15k960m838o317q527j1226j2356j1294r694
58588A273209q114n007n37K271K205K376N582J0183J3213J4816J6881J9605K2029
$$ y = [3038238, 3016201, 2990590, 2961889, 2930202, 2895964, 2860965, 2826613, 2791932, 2755137, 2716241, 2676040, 2633590, 2587180, 2537180, 2485415, 2432157, 2376301, 2318415, 2261101, 2205918, 2151895, 2097481, 2042387, 1987345, 1933645, 1883160, 1837505, 1796750, 1759633, 1724842, 1691438, 1658818, 1627310, 1598130, 1571786, 1547434, 1524656, 1504505, 1487454, 1471654, 1454806, 1436423, 1416774, 1395332, 1372363, 1350450, 1331887, 1315760, 1300069, 1285586, 1274798, 1267968, 1263250, 1260154, 1259837, 1262103, 1265119, 1268434, 1273709, 1281902, 1291795, 1301702, 1310738, 1318172, 1323339, 1326577, 1328809, 1330232, 1330766, 1331398, 1333390, 1336424, 1339048, 1340615, 1341236, 1340421, 1337461, 1332623, 1326306, 1317779, 1306553, 1294197, 1282903, 1273209, 1265095, 1260088, 1259551, 1261822, 1264027, 1266403, 1271985, 1282168, 1295381, 1310197, 1327078, 1346683, 1368712]
58575A368712K4103K6028K7472K9186L3075L8920M3636M5670M7318N0734N4691
58564A789545N7618O0756O5531P0630P4627P8922Q5210R2591J00082J09282J21260
58553B706054J33231J41976J48613J56618J66612J76369J84539J91199J95800
58544D201011J97364J95754J90598J80158J63142J40061J11168P5483L4016q532
58534E480223m7874q3635j16282j43349j62052j73500j80804j84625j83743j78514
58524D025845j70526j60271j48123j36255j26548j17701j07142r4757q2366p0935
58514B811221o0715n2618m6948m2094l6814l2282k9782k8183k5900k3349k1173
58503B411363j8240j4006j0550r539r515r078j0370j6001k4643l3058m0480m7499
$$ y = [1368712, 1392815, 1418843, 1446315, 1475501, 1508576, 1547496, 1591132, 1636802, 1684120, 1734854, 1789545, 1847163, 1907919, 1973450, 2044080, 2118707, 2197629, 2282839, 2375430, 2475512, 2584794, 2706054, 2839285, 2981261, 3129874, 3286492, 3453104, 3629473, 3814012, 4005211, 4201011, 4398375, 4594129, 4784727, 4964885, 5128027, 5268088, 5379256, 5454739, 5488755, 5480223, 5432349, 5348714, 5232432, 5089083, 4927031, 4753531, 4572727, 4388102, 4204359, 4025845, 3855319, 3695048, 3546925, 3410670, 3284122, 3166421, 3059279, 2964522, 2882156, 2811221, 2750506, 2697888, 2650940, 2608846, 2572032, 2539750, 2509968, 2481785, 2455885, 2432536, 2411363, 2393123, 2379117, 2368567, 2359028, 2349513, 2340435, 2330065, 2314064, 2289421, 2256363, 2215883, 2168384]
58491B168384n2710n4388n4015n4285n4847n3600n0945m8986m7585m4972m1563
58480A610488l9527l8885l7403l4161l0389k6974k3827k1472k0788k1277k1545
58469A294240k1087j9991j7820j4509j1383r678r152r334j0510j2103j2270j0673
58457A135730r486r914j0231r031p686p451p035n361l831l377k249N57K841K945
58443A066421K836M421O064O044O087P940R742R669R773J2111J4403J4061J3315
58430A182887J5465J8802J9426J7665J6552J6017J3710R926O685L477j381o661
58418A312570r958j2026j4966j7843j8572j8349j9633k1381k0919j8944j8151
58407A121828j8382j7601j6126j5513j4923j2859j0688j0231r930p689n113m423
$$ y = [2168384, 2115674, 2061286, 2007271, 1952986, 1898139, 1844539, 1793594, 1744608, 1697023, 1652051, 1610488, 1570961, 1532076, 1494673, 1460512, 1430123, 1403149, 1379322, 1357850, 1337062, 1315785, 1294240, 1273153, 1253162, 1235342, 1220833, 1209450, 1199772, 1190620, 1181286, 1170776, 1158673, 1146403, 1135730, 1126244, 1116330, 1106099, 1097068, 1089382, 1081931, 1074896, 1069535, 1065704, 1062327, 1060078, 1060635, 1063476, 1066421, 1069257, 1073678, 1079742, 1085786, 1091873, 1099813, 1109555, 1119224, 1128997, 1141108, 1155511, 1169572, 1182887, 1198352, 1217154, 1236580, 1254245, 1270797, 1286814, 1300524, 1310450, 1317135, 1320612, 1319231, 1312570, 1302612, 1290586, 1275620, 1257777, 1239205, 1220856, 1201223, 1179842, 1158923, 1139979, 1121828, 1103446, 1085845, 1069719, 1054206, 1039283, 1026424, 1015736, 1005505, 995575, 987886, 982773, 978350]
58395I78350l853j055J796J613K82J252L089K658J908M689R155J0484R361J0320
58381A030049J3049J3050J0260R417J1775J3689J3765J4432J5928J5335J2552
58370A173301J1025J1594J1324R093O818M773J221l045n275o039q386j1777j2617
58357A182010j0911j0295j1204j0110o233l092k419j930j65J644L100N382P976
58344A143753R350J0516J3306J5810J4822J1831J0777J0861P867J948k506m448
58332A243887o854j0011j1044j0258j1099j3340j3268j1087j1169j3927j4327
58321A117503r829l475K131P719J3033J5624J5495J5577J6670J6828J5965J5882
58309A239123J6048J4689J3269J4138J5112J2864J0131J2155J7331J9341J7644
$$ y = [978350, 974497, 973442, 975238, 976851, 977133, 978385, 981474, 984132, 986040, 990729, 999884, 1010368, 1019729, 1030049, 1043098, 1056148, 1066408, 1075825, 1087600, 1101289, 1115054, 1129486, 1145414, 1160749, 1173301, 1184326, 1195920, 1207244, 1216337, 1223155, 1227928, 1229149, 1226104, 1220829, 1214790, 1206404, 1194627, 1182010, 1171099, 1160804, 1149600, 1139490, 1133257, 1130165, 1127746, 1125816, 1125651, 1127295, 1130395, 1135777, 1143753, 1153103, 1163619, 1176925, 1192735, 1207557, 1219388, 1230165, 1241026, 1248893, 1250841, 1248335, 1243887, 1237033, 1227022, 1215978, 1205720, 1194621, 1181281, 1168013, 1156926, 1145757, 1131830, 1117503, 1107674, 1104199, 1106330, 1114049, 1127082, 1142706, 1158201, 1173778, 1190448, 1207276, 1223241, 1239123, 1255171, 1269860, 1283129, 1297267, 1312379, 1325243, 1335374, 1347529, 1364860, 1384201, 1401845]
58298A401845J7337J9281J9269J7021J6971J9565K0505J9297J9841K2048K1722
58287A614702J9314J9540K1658J9786J3918J0663J1468J0285M942Q09N94L57j464
58274A746572p79L360O063N839P425J2413J6243J7320J9841K4578K6508K4683
58262A910066K4817K8576L0058K6696K3994K5516K7469K7212K7814L0245L0356
58251B212819K7600K7530L1847L5091L4686L4714L6370L4810K9175K5525K6034
58240B556201K5643K3193K4696L1327L5512L3856L2862L6662M0282M0404M1563
58229B922201M5943M8199M6308M6615N2218N7130N7745N9084O4074O7905O8710
58218C536132P2277Q0478Q6769Q8780R3095J01868J07737J08054J10582J18389
$$ y = [1401845, 1419182, 1438463, 1457732, 1474753, 1491724, 1511289, 1531794, 1551091, 1570932, 1592980, 1614702, 1634016, 1653556, 1675214, 1695000, 1708918, 1719581, 1731049, 1741334, 1746276, 1747085, 1747679, 1748036, 1746572, 1745793, 1749153, 1755216, 1761055, 1768480, 1780893, 1797136, 1814456, 1834297, 1858875, 1885383, 1910066, 1934883, 1963459, 1993517, 2020213, 2044207, 2069723, 2097192, 2124404, 2152218, 2182463, 2212819, 2240419, 2267949, 2299796, 2334887, 2369573, 2404287, 2440657, 2475467, 2504642, 2530167, 2556201, 2581844, 2605037, 2629733, 2661060, 2696572, 2730428, 2763290, 2799952, 2840234, 2880638, 2922201, 2968144, 3016343, 3062651, 3109266, 3161484, 3218614, 3276359, 3335443, 3399517, 3467422, 3536132, 3608409, 3688887, 3775656, 3864436, 3957531, 4059399, 4167136, 4275190, 4385772, 4504161]
58208D504161J23116J20559J18741J22588J24901J21018J18261J21840J25647
58199E600832J26060J30466J42757J54978J63037J75787J98349K21459K37893
58190G151618K54265K75688K94441L05373L16989L35428L53115L65161L80728
58181A0032806M05729M31037M50817M75385N12202N51405N84467O19789O65260
58172A4728897P13179P57539Q07944Q70764R34772R90832J046830J108136J164646
58163B3123539J213832J274142J357279J449616J538968J635247J745177J853612
58155C5191412J952571K062215K199139K350846K505447K677254K877691L093596
58147E4910171L323411L601264L954318M372015M849961N423325O118744O916599
$$ y = [4504161, 4627277, 4747836, 4866577, 4989165, 5114066, 5235084, 5353345, 5475185, 5600832, 5726892, 5857358, 6000115, 6155093, 6318130, 6493917, 6692266, 6913725, 7151618, 7405883, 7681571, 7976012, 8281385, 8598374, 8933802, 9286917, 9652078, 10032806, 10438535, 10869572, 11320389, 11795774, 12307976, 12859381, 13443848, 14063637, 14728897, 15442076, 16199615, 17007559, 17878323, 18813095, 19803927, 20850757, 21958893, 23123539, 24337371, 25611513, 26968792, 28418408, 29957376, 31592623, 33337800, 35191412, 37143983, 39206198, 41405337, 43756183, 46261630, 48938884, 51816575, 54910171, 58233582, 61834846, 65789164, 70161179, 75011140, 80434465, 86553209, 93469808]
58139I3469808P803756Q817313R987698J1286271J2678722J4175774J5786642
58132A74005984J7514216J9481855K1969659K5195409K9103831L3403684L7531676
58125C58206314M0235255L9383290L2937760K0709931N137798r976325k1668469
58118D64965554k8989327l2562175l3536616l2948744l1542320k9727381k7634126
58111B48024865k5302573k2834135k0362045j7967123j5694130j3605536j1760362
58104A20498961j0167317q801322p643889o676213n857860n146375m525540l992836
58096F7687609l532904l121162k741346k384397k039306j696408j353543j011795
58088D9806748o68250l15021N5165M39467Q24422J206086J607765K067092K625965
$$ y = [93469808, 101273564, 110090877, 120078575, 131364846, 144043568, 158219342, 174005984, 191520200, 211002055, 232971714, 258167123, 287270954, 320674638, 358206314, 398441569, 437824859, 470762619, 491472550, 496610348, 486634023, 464965554, 435976227, 403414052, 369877436, 336928692, 305386372, 275658991, 248024865, 222722292, 199888157, 179526112, 161558989, 145864859, 132259323, 120498961, 110331644, 101530322, 93886433, 87210220, 81352360, 76205985, 71680445, 67687609, 64154705, 61033543, 58292197, 55907800, 53868494, 52172086, 50818543, 49806748, 49138498, 48823477, 48878642, 49318109, 50142531, 51348617, 52956382, 55023474, 57649439]
58079E7649439L356893M330905N418367O095326N630593L673906O79187k356526
58071H4478090m600692n816974o217732o107902n727598n261408m819354m407492
58063D1518938l988957l566949l172857k809927k462358k138989j861886j627609
58055A9889406j418984j240330j105444j004356r15007q35727p76387p29775o80660
58046A1182736o32108n95511n64518n24624m79024m40700m08006l71325l35009
58037F831911l09917k92266k71423k50718k39643k33197k19699k02128j91736
58028D621184j86984j78179j66824j61420j59681j53233j44590j41747j40941
58019C187585j32457j19103j11715j10152j05282r6393r0658q8179q2803p5338
$$ y = [57649439, 61006332, 65337237, 70755604, 76850930, 82481523, 86155429, 86834616, 84478090, 79877398, 74060424, 67842692, 61734790, 56007192, 50745784, 45926430, 41518938, 37529981, 33963032, 30790175, 27980248, 25517890, 23378901, 21517015, 19889406, 18470422, 17230092, 16124648, 15120292, 14205285, 13369558, 12593171, 11863396, 11182736, 10550628, 9955117, 9390599, 8865975, 8386951, 7946251, 7538245, 7166920, 6831911, 6521994, 6229728, 5958305, 5707587, 5467944, 5234747, 5015048, 4812920, 4621184, 4434200, 4256021, 4089197, 3927777, 3768096, 3614863, 3470273, 3328526, 3187585, 3055128, 2936025, 2824310, 2714158, 2608876, 2512483, 2421825, 2333646, 2250843, 2175505]
58009B175505p1746p0552o5482n7955n4316n3477m9699m4413m3168m4075m1175
57998A579447l6011l4302l4759l2520k9775l1353l3902l1168k6079k5753k8394
57987A235431k7167k3371k3417k5913k4194j9006j6705j7143j5001j0931r942
57976A022641j0758q113l725l912p937r447p881q024r996r997r273j1879j5368
57963I06331j3983r432q195r799q274l768k052l450k729O52K138J446K544M922
57949H56351M424K160K986N830N191J802J981O388R048P953P384R173J0423J0493
57935I41587J1733J2986J0660O557O303R770J1183Q830O521N242J796l883q167
57922A021118j0907j5315k0484k1868j9527j8035j8148j6449j3274j2644j3983
$$ y = [2175505, 2103759, 2033207, 1967725, 1909770, 1855454, 1801977, 1752278, 1707865, 1664697, 1620622, 1579447, 1543436, 1509134, 1474375, 1441855, 1412080, 1380727, 1346825, 1315657, 1289578, 1263825, 1235431, 1208264, 1184893, 1161476, 1135563, 1111369, 1092363, 1075658, 1058515, 1043514, 1032583, 1022641, 1011883, 1003770, 1000045, 996133, 988196, 978749, 970868, 962844, 952848, 942851, 933578, 921699, 906331, 892348, 882916, 874721, 864922, 856648, 852880, 850828, 847378, 844649, 845301, 847439, 848885, 851429, 856351, 860775, 862935, 865921, 871751, 876942, 878744, 880725, 887113, 896161, 904114, 911498, 920671, 931094, 941587, 953320, 966306, 976966, 983523, 989826, 999596, 1010779, 1019609, 1026130, 1031372, 1033168, 1029285, 1021118, 1010211, 994896, 974412, 952544, 933017, 914982, 896834, 880385, 867111, 854467, 840484]
57911H40484j2328p376m134l918l017q70j052l039j824K812N137L436K782N630
57897H22723P858O814N553O077N484J873k489o421j1818j7845j9700j5948j1178
57884G70983q873p379n139l810l781k409P73K602K124K444M834O635O916Q329
57870G74249J1249J2008R380O993O667N032l11o555j0584j3275j6061j7814j7776
57857G43202j7551j7876j7461j6682j7901k0536k0519j6544j2148r862q215o230
57845E61677n661o563n760k351K6r44k611k136n39O15K276N034O903O649N934
57830E62549O096O143N611N847O914O811N175M073M134L831L271M240N545L513
57816F33753j767n760o490o876q512q890p089o434q498r792p669m650l626l338
$$ y = [840484, 828156, 820780, 816646, 812728, 809711, 808841, 807789, 804750, 802926, 805738, 810875, 814311, 817093, 822723, 830581, 837395, 842948, 849025, 854509, 856382, 853893, 847472, 835654, 817809, 798109, 782161, 770983, 762110, 754731, 749592, 745782, 742001, 739592, 740365, 742967, 745091, 747535, 752369, 759004, 765920, 774249, 785498, 797506, 806886, 813879, 820546, 825578, 825267, 818712, 808128, 794853, 778792, 760978, 743202, 725651, 707775, 690314, 673632, 655731, 635195, 614676, 598132, 585984, 576122, 567907, 561677, 556016, 549453, 543693, 541342, 541368, 540424, 537813, 535677, 535138, 535753, 538029, 543063, 549966, 556615, 562549, 568645, 574788, 580399, 586246, 593160, 599971, 605146, 609219, 613353, 617184, 620455, 624695, 630240, 633753, 631986, 626226, 619736, 612860, 604348, 595458, 588369, 581935, 573437, 563645, 555976, 551326, 547700, 544362]
57802E44362j980q99j207q83J486L872M790O090Q676R716P507N186N849P604P222
57787F07391N326M264L910L140K662K988K348j74k204j920j521l592o705p902
57773F08011p149o214n434m576m724o387p836p756p399p780p414n311l518l862
57759E22651m742m065k876l122m084m124m002n367p555q620q339p882p696p610
57745D42567p720p729o885n593n152n145l680j077r7j380k061n85P47k9j268j019
57729C93894k01O5J109M033P279R362J1233J3625J4984J4465J3782J3708J2072
57716E09410P935M349L905M692L910K326J801J384n44k879m037n106p323q973
57702E10850q255o840p062p935p475o617p217q370q277p649p627o658l228M41
$$ y = [544362, 542382, 541483, 540276, 539393, 540879, 544751, 549541, 555631, 564307, 574023, 581530, 586716, 592565, 600169, 607391, 612717, 616981, 620891, 624031, 626693, 629681, 632029, 631855, 629651, 627731, 626210, 622618, 615913, 608011, 600862, 594648, 589214, 584638, 579914, 573527, 565691, 557935, 550536, 542756, 535342, 530031, 526513, 522651, 517909, 513844, 510968, 507846, 503762, 499638, 495636, 490269, 482714, 474094, 465755, 457873, 450177, 442567, 434847, 427118, 420233, 414640, 409488, 404343, 400663, 399586, 399489, 398109, 396048, 395463, 396210, 396181, 394913, 393894, 393693, 393758, 394867, 398900, 406179, 415541, 426774, 440399, 455383, 469848, 483630, 497338, 509410, 517345, 521694, 525599, 530291, 534201, 536527, 538328, 539712, 539168, 536289, 532252, 527146, 519823, 510850, 502595, 495755, 488693, 480758, 473283, 466666, 459449, 451079, 442802, 435153, 427526, 420868, 417640, 418081]
57688D18081J481J210K619M882M789K441R93J432J835J434J594K775L904M709
57674D54179N768O433N539L823L199M005N133O134P045P152O202N765P177R316
57660E36870J0520J1162J2087J2369J1351J0918J2769J5193J5805J5681J7250
57649F81975J9570J9740J7968J7369J9053K1019K1785K2028K2588K3672K5789
57638I12556K9048L1936L3230L4437L7796M2675M6497M8516N0036N1676N3124
57627A371527N4918N7960O1849O6006P1429P9025Q7499R5506J04460J16218J29425
57616B295822J41421J52585J65222J79103J91715K02395K12432K21291K26108
57607C988094K25158K18960K07947J91447J68266J35558Q8552K5473m6968j16171
$$ y = [418081, 419562, 420772, 423391, 428273, 433062, 435503, 436496, 437928, 439763, 441197, 442791, 445566, 449470, 454179, 459947, 466380, 471919, 475742, 478941, 482946, 488079, 494213, 501258, 508410, 514612, 520377, 527554, 536870, 547390, 558552, 570639, 583008, 594359, 605277, 618046, 633239, 649044, 664725, 681975, 701545, 721285, 739253, 756622, 775675, 796694, 818479, 840507, 863095, 886767, 912556, 941604, 973540, 1006770, 1041207, 1079003, 1121678, 1168175, 1216691, 1266727, 1318403, 1371527, 1426445, 1484405, 1546254, 1612260, 1683689, 1762714, 1850213, 1945719, 2050179, 2166397, 2295822, 2437243, 2589828, 2755050, 2934153, 3125868, 3328263, 3540695, 3761986, 3988094, 4213252, 4432212, 4640159, 4831606, 4999872, 5135430, 5223982, 5249455, 5202487, 5086316]
57597E086316j72042k10940k33088k40438k37236k28615k17280k03550j88371
57588C154756j73501j59001j43647j27848j13282r9950q6652p4124o4365n6917
57578B055469m9148m0455l2830k7044k1582j5754j0497n542P83Q190J4213J8246
57566A894049K2683K8908L5267M0283M5098N1259N8466O5901P3685Q1850Q9767
57555B487216R7486J05850J14610J22315J28434J33491J36745J36113J30813J21743
57545C714816J08678Q9663O3983L3565P82l2866o5317r3764j16994j35792j50292
57534C416462j59096j61931j60879j57938j53216j46450j38389j29748j20565
57525B088250j11411j03477r6776r0000q2756p6158p0605o4974n8687n2764m8064
$$ y = [5086316, 4914274, 4703334, 4470246, 4229808, 3992572, 3763957, 3546677, 3343127, 3154756, 2981255, 2822254, 2678607, 2550759, 2437477, 2337527, 2250875, 2176751, 2112386, 2055469, 2006321, 1965866, 1933036, 1905992, 1884410, 1868656, 1858159, 1852617, 1853400, 1861590, 1875803, 1894049, 1916732, 1945640, 1980907, 2021190, 2066288, 2117547, 2176013, 2241914, 2315599, 2397449, 2487216, 2584702, 2690552, 2805162, 2927477, 3055911, 3189402, 3326147, 3462260, 3593073, 3714816, 3823494, 3913157, 3977140, 4010705, 4011487, 3978621, 3913304, 3819540, 3702546, 3566754, 3416462, 3257366, 3095435, 2934556, 2776618, 2623402, 2476952, 2338563, 2208815, 2088250, 1976839, 1873362, 1776586, 1686586, 1603830, 1527672, 1457067, 1392093, 1333406, 1280642, 1232578]
57514A232578m4242m0958l8430l6168l2972k8830k5188k2878k1260j9698j8263
57503I03691j6815j5097j3816j3693j3587j1641q281n743m692l717k305j495j173
57490G91636M61L941P474R656J1022J2286J3340J4507J6373J8050J8154J7791
57478I34691J9633K3574K6525K7325K8369L1099L3446L3762L4151L7394M2988
57467A272957M8557N3206N7350O1030O4432O8586P3885P9336Q4520R0381R6900
57456B051140J02016J04321J04639J03365R8507Q8298P3756N6618L6691J3456
57446B832807j1274l4506n4737p1762q5241r5148j02339j07010j07900j04666
57436B058224r9518r4734q9953q3672p6146o8862o2283n5917m9647m3434l6778
$$ y = [1232578, 1188336, 1147378, 1108948, 1072780, 1039808, 1010978, 985790, 962912, 941652, 921954, 903691, 886876, 871779, 857963, 844270, 830683, 819042, 810761, 805018, 800326, 796609, 794304, 792809, 791636, 792097, 796038, 803512, 813168, 824190, 836476, 849816, 864323, 880696, 898746, 916900, 934691, 954324, 977898, 1004423, 1031748, 1060117, 1091216, 1124662, 1158424, 1192575, 1229969, 1272957, 1321514, 1374720, 1432070, 1493100, 1557532, 1626118, 1700003, 1779339, 1863859, 1954240, 2051140, 2153156, 2257477, 2362116, 2465481, 2563988, 2652286, 2726042, 2782660, 2819351, 2832807, 2821533, 2787027, 2732290, 2660528, 2575287, 2480139, 2377800, 2270790, 2162890, 2058224, 1958706, 1863972, 1774019, 1690347, 1614201, 1545339, 1483056, 1427139, 1377492, 1334058, 1297280]
57425A297280k9945k4603k1689j9870j7531j4936j2731r726m412K236P556J0370
57413A161999J1756J3176J5267J8108K1439K4861K8606L3380L8890M3662M7226
57402A458370N1123N6762O3453O9707P5142P9999Q4113Q7496R0580R2603R1109
57391B300457Q4509P3875O0794M4825K4755J219k3509m7436o9230q7673j02207
57380B260379j13144j20262j22341j19208j13144j06944j01554r6493r1242q5167
57370A190880p7688o9743o3537n9584n5773n0682m5834m2983m1188l8671l5693
57359F09504l3312l0963k7707k4500k2762k1949k0909k0239k0637k0286j7060
57348C49180j2552j0651j2247j4270j4087j2263j0546r548q988q452p379n750
$$ y = [1297280, 1267335, 1242732, 1221043, 1201173, 1183642, 1168706, 1155975, 1146249, 1141837, 1144073, 1151629, 1161999, 1173755, 1186931, 1202198, 1220306, 1241745, 1266606, 1295212, 1328592, 1367482, 1411144, 1458370, 1509493, 1566255, 1629708, 1699415, 1774557, 1854556, 1938669, 2026165, 2116745, 2209348, 2300457, 2384966, 2458841, 2519635, 2564460, 2589215, 2590434, 2566925, 2519489, 2450259, 2362586, 2260379, 2147235, 2026973, 1904632, 1785424, 1672280, 1565336, 1463782, 1367289, 1276047, 1190880, 1113192, 1043449, 979912, 920328, 864555, 813873, 768039, 725056, 683868, 645197, 609504, 576192, 545229, 517522, 493022, 470260, 448311, 427402, 407163, 386526, 366240, 349180, 336628, 325977, 313730, 299460, 285373, 273110, 262564, 253016, 244028, 235576, 228197, 222447]
57336B22447m785n633p434q191p407o320n705n044l845k360r90j46n11k225m095
57321A57756m719m049k884j510M5J100J005L6j467l847o837q752q538p366o632
57306A03341n700l627j602j212j541o48R73J303M22K06Q22P47K44J463M501O429
57290A06121N341K795J014R0o28m92J173L084L135J027j354j968m28J825K781
57275A23516J644m74j829j709o06O48J267Q12o4N3J482K845L155L285M204N203
57259A43432N471N965P772R846J0552J0306J0421J0605J0132J0311J2660J5393
57247B62866J5142J1959R264Q751Q781Q243Q498J0302J1932J2044J1993J3546
57235C93321J6168J8039J8357J7591J6699J6801J8335K0069K0379J9665J9845
$$ y = [222447, 217662, 212029, 204595, 196404, 188997, 182677, 176972, 171928, 168083, 165723, 164733, 164587, 164076, 161851, 157756, 153037, 148988, 146104, 144594, 144639, 145739, 146744, 146780, 145313, 141466, 134629, 125877, 117339, 109973, 103341, 97641, 94014, 92412, 91200, 89659, 89011, 89984, 91287, 91709, 91915, 92737, 93484, 93728, 95191, 99692, 106121, 111462, 114257, 115271, 115361, 114733, 114241, 115414, 118498, 121633, 122660, 121306, 119338, 118910, 120735, 123516, 125160, 124686, 122857, 121148, 120542, 121190, 122457, 123269, 123205, 123258, 124740, 127585, 130740, 134025, 138229, 143432, 148903, 154868, 162640, 172486, 183038, 193344, 203765, 214370, 224502, 234813, 247473, 262866, 278008, 289967, 299231, 307982, 316763, 325006, 333504, 343806, 355738, 367782, 379775, 393321, 409489, 427528, 445885, 463476, 480175, 496976, 515311, 535380, 555759, 575424, 595269]
57224E95269K1387K2815K3384K3978K4934K5292K4843K4783K5547K6117K6065
57213H64414K6145K6112K4336K0511J6446J3145R534N255K082Q99m54m181r114
57200I95130j2310j2723j1495r776q064o728n584l489N50O479J3838K2030K9384
57187I97242L3825L5595L7585M1656M6140M8468M8691M8745M9487N0365N1075
57176A488874N1729N1814N0483M7688M4042M0078L6520L4713L5835L9926M6068
57165A967770N3036N9644O5381P0962P7148Q2918Q6193Q6646Q6253Q6644Q7399
57154B809994Q7406Q6175Q3244P8160P1971O7127O5075O5313O7199P0745P5135
57143C627544P8506Q0210Q1272Q2009Q1421P9787P9250Q0471Q1340Q0458P9397
$$ y = [595269, 616656, 639471, 662855, 686833, 711767, 737059, 761902, 786685, 812232, 838349, 864414, 890559, 916671, 941007, 961518, 977964, 991109, 1000643, 1005898, 1007980, 1008879, 1008425, 1004244, 995130, 982820, 970097, 958602, 948826, 940762, 934034, 928450, 924961, 925511, 931990, 945828, 967858, 997242, 1031067, 1066662, 1104247, 1145903, 1192043, 1240511, 1289202, 1337947, 1387434, 1437799, 1488874, 1540603, 1592417, 1642900, 1690588, 1734630, 1774708, 1811228, 1845941, 1881776, 1921702, 1967770, 2020806, 2080450, 2145831, 2216793, 2293941, 2376859, 2463052, 2549698, 2635951, 2722595, 2809994, 2897400, 2983575, 3066819, 3144979, 3216950, 3284077, 3349152, 3414465, 3481664, 3552409, 3627544, 3706050, 3786260, 3867532, 3949541, 4030962, 4110749, 4189999, 4270470, 4351810, 4432268, 4511665]
57132D511665P9741Q0463Q0327Q0484Q2183Q4074Q4314Q3620Q3752Q4561Q4972
57121E420156Q5342Q6473Q7657Q8082Q8723R0582R2455R2816R2481R3006R3926
57110F411699R4012R3710R3638R2095Q7071P9573P2112O4935N6582M7306L8924
57099G231657L1898K5335J9233J4209R664M879J151K98J891M536Q893J6400K5753
57086G395797L3604L8096L9031L5612K7369J6551O078m619j8408l5464n2940o9499
57074G411208q6704j05488j24468j42512j60664j80952k04989k33314k64428k95665
57064E612024l27308l64233m10918m66733n29150n99216o79710p70124E96324
57054c79088j094267j224416j364257j516633j686904j876815k085935k317269
$$ y = [4511665, 4591406, 4671869, 4752196, 4832680, 4914863, 4998937, 5083251, 5166871, 5250623, 5335184, 5420156, 5505498, 5591971, 5679628, 5767710, 5856433, 5947015, 6039470, 6132286, 6224767, 6317773, 6411699, 6505711, 6599421, 6693059, 6785154, 6872225, 6951798, 7023910, 7088845, 7145427, 7192733, 7231657, 7263555, 7288890, 7308123, 7322332, 7331996, 7336875, 7338026, 7338324, 7340215, 7344751, 7353644, 7370044, 7395797, 7429401, 7467497, 7506528, 7542140, 7569509, 7586060, 7592138, 7587519, 7569111, 7533647, 7480707, 7411208, 7324504, 7219016, 7094548, 6952036, 6791372, 6610420, 6405431, 6172117, 5907689, 5612024, 5284716, 4920483, 4509565, 4042832, 3513682, 2914466, 2234756, 1464632, 596324, -379088, -1473355, -2697771, -4062028, -5578661, -7265565, -9142380, -11228315, -13545584]
57046a3545584k574884k857812l163929l498714l872761m292584m762817n295436
57038d3864521n905805o599898p375895q237160r191380j0237532j1364873j2557413
57030a15334477j3779986j4970642j6081720j7118258j8064569j8737015j8788481
57023b32875148j7981546j6489020j4849197j3544730j2596991j1552843r833875
57016c29723350p114600l466062P49815N096537R239117J2989573J6235507J8859790
57008b77133673K0744536K1836115K2178518K1881330K1072843J9881827J8434395
57001a31104109J6843343J5198742J3571409J2017573J0574361R257340Q069484
56994d5571857P010736O077839N262005M552542L940113L413994K960472K567660
$$ y = [-13545584, -16120468, -18978280, -22142209, -25640923, -29513684, -33806268, -38569085, -43864521, -49770326, -56370224, -63746119, -71983279, -81174659, -91412191, -102777064, -115334477, -129114463, -144085105, -160166825, -177285083, -195349652, -214086667, -232875148, -250856694, -267345714, -282194911, -295739641, -308336632, -319889475, -329723350, -336837950, -340304012, -339554197, -334457660, -325218543, -312228970, -295993463, -277133673, -256389137, -234553022, -212374504, -190493174, -169420331, -149538504, -131104109, -114260766, -99062024, -85490615, -73473042, -62898681, -53641341, -45571857, -38561121, -32483282, -27221277, -22668735, -18728622, -15314628, -12354156, -9786496]
56986i786496K229029J939866J693421J482694a138956H643J011674Q91252P87007
56977B698576O99157O24633N60817N08466M67784M34299M01882L67877L32853
56968G096344K97561K62941K31086K03151J77556J52465J28338J05764Q2586N6121
56958H793913K7022j863k9515n7065q4542j09893j31275j48518j62527j74930
56948G920807j88227k04831k25470k48920k72716k93711l09159l18274l22077
56939E537422l20975l13775k99888k81109k59841k36622k10623j81745j51045
56930C281799j19702q8171n5590j9910K0108O2965J05902J46679J79608J89864
56920C703552J58934Q1624k4035j27683k06526k53730k73188k73210k63758k52287
$$ y = [-9786496, -7557467, -5617601, -3924180, -2441486, -1138956, 8643, 1020317, 1911569, 2698576, 3397733, 4022366, 4583183, 5091649, 5559433, 5993732, 6395614, 6763491, 7096344, 7393905, 7656846, 7887932, 8091083, 8268639, 8421104, 8549442, 8655206, 8737792, 8793913, 8820935, 8819072, 8789557, 8732492, 8647950, 8538057, 8406782, 8258264, 8095737, 7920807, 7732580, 7527749, 7302279, 7053359, 6780643, 6486932, 6177773, 5859499, 5537422, 5216447, 4902672, 4602784, 4321675, 4061834, 3825212, 3614589, 3432844, 3281799, 3162097, 3073926, 3018336, 2998426, 3018534, 3081499, 3187401, 3334080, 3513688, 3703552, 3862486, 3944110, 3920075, 3792392, 3585866, 3332136, 3058948, 2785738, 2521980, 2269693]
56910B269693k39471k21984j99806j77222j56683j36309j14667r3778p5621n9288
56900G94864m3926l1248k2622j6152r516l902k516o359j3473k1426k8524l3352
56888E61848l5082l4213l2074k9808k8081k6823k4859k0942j5668j1069p902m775
56876B90552n72L986P893J1198J3936J5477J6035J6986J8328J7568J2713M917
56864D29017l262j0626j6829k0876k2359k2847k3886k4522k2880j9410j6372j4717
56852B10431j3651j2824j2687j2780j1826r791q089p515p431p115o496n558m497
56839I0171m457o392r061r886q251o285n713n638m411k279p16O2J321L686O029
56824C8180O845O078N048M837N204N311N084N354O645Q466J0110J1653J3623J5954
$$ y = [2269693, 2030222, 1808238, 1608432, 1431210, 1274527, 1138218, 1023551, 929773, 854152, 794864, 750938, 719690, 697068, 680916, 671400, 667498, 664982, 658623, 645150, 623724, 595200, 561848, 526766, 492553, 460479, 430671, 402590, 375767, 350908, 329966, 314298, 303229, 295327, 290552, 289980, 293966, 301859, 313057, 326993, 342470, 358505, 375491, 393819, 411387, 424100, 429017, 425755, 415129, 398300, 377424, 355065, 332218, 308332, 283810, 260930, 241520, 225148, 210431, 196780, 183956, 171269, 158489, 146663, 136872, 128783, 121268, 113837, 106722, 100226, 94668, 90171, 85714, 79322, 70261, 60375, 52124, 45839, 40126, 34488, 30077, 27798, 27082, 27144, 28465, 32151, 38180, 45025, 51103, 56151, 60988, 66192, 71503, 76587, 81941, 88586, 97052, 107162, 118815, 132438, 148392]
56810A48392J7844J8757J9174K0161K2134K4262K5401K5728K6729K9281L2607
56799D10470L5916L9729M3765M4632L8374K5633J1711Q80o964j3309j7656j9007
56787E94174j8235j6571j3476q285k394K591P512J3873K0710K6085L0775L7414
56775F74173M6395N5685O4317P2611P8389P6328O2847L9816J2672j3200l3712
56764A136321m6522n2231n3786n3273n0256m4023l5981k8422k1974j5622q656
56753G25575j525M991J0793J6700K3792L2172M0457M6869N0244M9278M1782K6627
56741A067755O268j4213l0749m1960m7891m9297m8048m6076m3347l8664l2642
56730F81136k7564k3944j9672j3620p562l140Q11N987J1534J5390J7439J9070
$$ y = [148392, 166236, 184993, 204167, 224328, 246462, 270724, 296125, 321853, 348582, 377863, 410470, 446386, 486115, 529880, 574512, 612886, 638519, 650230, 651110, 644146, 630837, 613181, 594174, 575939, 559368, 545892, 537607, 535213, 537804, 545316, 559189, 579899, 605984, 636759, 674173, 720568, 776253, 840570, 913181, 991570, 1067898, 1130745, 1170561, 1183233, 1170033, 1136321, 1089799, 1037568, 983782, 930509, 880253, 836230, 800249, 771827, 749853, 734231, 725575, 724050, 729041, 739834, 756534, 780326, 812498, 852955, 899824, 950068, 999346, 1041128, 1067755, 1074023, 1059810, 1029061, 987101, 939210, 889913, 841865, 795789, 752442, 713778, 681136, 653572, 629628, 609956, 596336, 588774, 585634, 586445, 592432, 603966, 619356, 636795, 655865]
56718F55865K0237J8954J3550M179p507j9014k7776l2535l3986l3610l2304l0511
56706D95542k8612k6433k3280j9417j6465j5417j5083j3686j1158q725o992n749
56694C04525n122n468o298o457n482m029k891k211j648r39k71r8m49o71m59o48
56678B61384j997l584l777k646j730j427o20P89J180r3j411j502j372k276l534
56663B37384l920l617l223k400j134o65j494k124j634j639l396m896l798j691
56649B01753j941m195m814k661o24p29j336o10L03l99j931k288j488j258k218
56634A75564l201l195k639k569l284m059l922k661j076j42l0k29k70M4P69J715
56618A50815K509L205M272N486N692M501L348L583M280L470J196l43K73K075L238
$$ y = [655865, 676102, 695056, 708606, 712785, 705278, 686264, 658488, 625953, 591967, 558357, 526053, 495542, 466930, 440497, 417217, 397800, 381335, 365918, 350835, 337149, 325991, 317266, 310274, 304525, 299403, 293935, 287637, 281180, 275698, 271669, 268778, 266567, 264919, 263980, 263709, 263611, 263162, 262491, 262032, 261384, 259387, 255803, 252026, 249380, 247650, 246223, 245603, 246392, 247572, 247479, 246068, 244566, 243194, 240918, 237384, 233464, 229847, 226624, 224224, 223090, 222425, 220931, 218807, 217173, 215534, 212138, 207242, 203444, 201753, 199812, 195617, 190803, 188142, 187518, 186789, 185453, 184843, 185146, 184747, 182816, 180528, 179040, 177782, 175564, 172363, 169168, 166529, 163960, 160676, 156617, 152695, 150034, 148958, 148816, 148786, 148557, 148287, 148331, 149100, 150815, 153324, 156529, 160801, 166287, 171979, 176480, 179828, 183411, 187691, 191161, 192357, 192014, 192287, 194362, 197600]
56603A97600K983J626j68j760k789l291l201k133l15Q88M30r04j587j493j632
56588A84254k115j967j015m37j083k285k720j777p6Q12l71k822l928k404k91k71
56572A61504j860k339q90N53O83N57J400K656L136K432O32j849l578k901k20K082
56556A61998K630K442K694K901K392J945K513L485L645L023K585K719K977K770
56542B00719J695j79j788j720m9J475J688J401J713K106J571P01J198L463N952
56527B19946O986O473N565N153M912L879J958M31N56J956L156L373K911K159J431
56512B70845J564L110M920N112L839L323M635O198O389N950O512Q122R743J1130
56498C51392J2703J4161J4696J4230J3439J2857J2770J3424J4581J5388J5465
$$ y = [197600, 200583, 202209, 202041, 200281, 197492, 194201, 191000, 188867, 188552, 189440, 189870, 188966, 187379, 185886, 184254, 182139, 180172, 179157, 178720, 177637, 175352, 172632, 170855, 170779, 171591, 171220, 168398, 164470, 162066, 161775, 161504, 159644, 157305, 156415, 156968, 157651, 158208, 159608, 162264, 165400, 167832, 168464, 166615, 163037, 160136, 159916, 161998, 164628, 167070, 169764, 172665, 175057, 177002, 179515, 183000, 186645, 189668, 192253, 194972, 197949, 200719, 202414, 202235, 200447, 198727, 198678, 200153, 201841, 203242, 204955, 207061, 208632, 209333, 210531, 213994, 219946, 226932, 233405, 238970, 244123, 249035, 252914, 254872, 255303, 255859, 257815, 260971, 264344, 267255, 269414, 270845, 272409, 275519, 280439, 285551, 289390, 292713, 297348, 303546, 309935, 315885, 322397, 330519, 340262, 351392, 364095, 378256, 392952, 407182, 420621, 433478, 446248, 459672, 474253, 489641, 505106]
56487E05106J5469J5751J5225J2685Q743N306L403K448J439m2j951m081o173q086
56473E65242r821j1133j1559j1185j0836j1129j1767j2192j2366j2449j2287j1771
56461D26747j1153j0442r177p448o528p489r482j0411r332p463o599p084p693
56448C16446p246n864m470l464k566j924k354l933n191m711k928j333n00r0j26
56433B69746p29j011k4J373J530Q24J179K495K118j126m555m936k519j12O33M33
56417B65319O56J876L654M829M507L294K666K826K504J446J346L160N251N662
56403C08996M889M624M994M945M487M622N442O106O397O796P196P048O559O379
56389C89480O156M899K868J813K822M805N562M034J383k1J068L218L641J371j506
$$ y = [505106, 520575, 536326, 551551, 564236, 572979, 578285, 581688, 584136, 585575, 585533, 583582, 579501, 573328, 565242, 555421, 544288, 532729, 521544, 510708, 499579, 487812, 475620, 463254, 450805, 438518, 426747, 415594, 405152, 395975, 388527, 381999, 374510, 365028, 354617, 345285, 337822, 331223, 324139, 316446, 309200, 303336, 298866, 295402, 292836, 290912, 288558, 284625, 279434, 274723, 271795, 270462, 269962, 269872, 269746, 269017, 268006, 267982, 269355, 270885, 271709, 272888, 275383, 277501, 276375, 271820, 266884, 264365, 264253, 264886, 265319, 265975, 267851, 271505, 276334, 280841, 284135, 286801, 289627, 292131, 293577, 294923, 298083, 303334, 308996, 313885, 318509, 323503, 328448, 332935, 337557, 342999, 349105, 355502, 362298, 369494, 376542, 383101, 389480, 395636, 400535, 403403, 405216, 408038, 412843, 418405, 422439, 423822, 423801, 424869, 428087, 431728, 433099, 431593]
56374D31593k280n17J904K853J469j514m188m860l727k607k702l540m473n781
56360D01630p453q220p127n115l711l021k217j253p78r53j558k706m285n278m854
56345C43101l672l076l393l965m178l604j850N22J690N37j556k258j185J0J59
56330C17282j86k6P62J651K161K182J957J783J619J241Q97J137J832K197J923
56315C38412J415Q10p5o13K74K161L113K372J383J408J678J085Q4k79J04R88K354
56298C56674L489L179J946K148M437O208N324L310K709L249L211K819L413M411
56284D06527M083K602J564J068j04j746k261j305j06P23J617K498K820L037M112
56269D25129N701O540O418O029N401M296L714M875O927P717O860O212P229R387
$$ y = [431593, 429313, 428796, 430700, 433553, 435022, 433508, 429320, 424460, 420733, 418126, 415424, 411884, 407411, 401630, 394177, 385957, 378830, 373715, 370004, 366983, 364766, 363513, 362735, 361782, 360224, 357518, 353233, 347955, 343101, 339429, 336353, 332960, 328995, 324817, 321213, 319363, 319885, 321575, 322112, 320556, 318298, 317113, 317123, 317282, 317096, 317070, 317832, 319483, 321644, 323826, 325783, 327566, 329185, 330426, 331323, 332460, 334292, 336489, 338412, 339827, 340637, 340562, 339949, 340223, 342384, 345497, 347869, 349252, 350660, 352338, 353423, 353507, 353228, 353332, 354320, 356674, 360163, 363342, 365288, 367436, 371873, 378081, 383405, 386715, 389424, 392673, 395884, 398703, 402116, 406527, 410610, 413212, 414776, 415844, 415740, 413994, 411733, 410428, 410322, 411045, 412662, 415160, 417980, 421017, 425129, 430830, 437370, 443788, 449817, 455218, 459514, 463228, 468103, 475030, 482747, 489607, 495819, 503048, 512435]
56255E12435J1301J2088J1781J1359J2023J3458J3774J2062R823Q595P796O587
56243F43082O045P214Q597Q168O627N965O023N263L969L674M147L923L253L574
56229G19524M557M585L752L532L882L678L599N510Q997J1557J2212J2301J2764
56216H10450J3474J4983J7919K0819K1607K1201K2515K5977K9266L1558L4571
56205A064340L8978M3128M6077M8802N1749N4114N6281O0076O5862P1995P7654
56194A679056Q3562Q9650R4887R9804J06057J13046J17981J19861J20315J20073
56184B744292J17822J13139J07075R9114Q7042P0937N4051L8529K3526Q539m880
56173C459186j6073k6563l6760m4566m8988n2157n5895n9138o0528o0909o1357
$$ y = [512435, 523736, 535824, 547605, 558964, 570987, 584445, 598219, 610281, 620104, 628699, 636495, 643082, 649127, 656341, 664938, 673106, 679733, 685698, 691721, 696984, 700953, 704627, 708774, 712697, 715950, 719524, 724081, 728666, 732418, 735950, 739832, 743510, 747109, 752619, 761616, 773173, 785385, 797686, 810450, 823924, 838907, 856826, 877645, 899252, 920453, 942968, 968945, 998211, 1029769, 1064340, 1103318, 1146446, 1192523, 1241325, 1293074, 1347188, 1403469, 1463545, 1529407, 1601402, 1679056, 1762618, 1852268, 1947155, 2046959, 2153016, 2266062, 2384043, 2503904, 2624219, 2744292, 2862114, 2975253, 3082328, 3181442, 3268484, 3339421, 3393472, 3432001, 3455527, 3464066, 3459186, 3443113, 3416550, 3379790, 3335224, 3286236, 3234079, 3178184, 3119046, 3058518, 2997609, 2936252]
56162B936252o1273o0275n9752o0700o2081o2849o3628o5132o6904o8674p0882
56151B234102p2996p3516p2437p1354p0530o8505o5211o2468o0606n7652n2863
56140A505964m7994m4116m0365l6793l4981l4535l2590k8350k4694k3606k3366
56129A134574k2124k0686j9809j8177j5347j3538j3968j4348j2416r305p168o042
56117I61646n187m928n050l873r64J651K759L850N974P611P580P301Q142R153
56103I95665R433J0064J1848J3659J4740J6083J7897J8511J7310J5947J5301J4334
56091A170792J3142J3568J5419J5905J4498J4262J6541J8551J8453J8593K1372
56080A351096K6089L2361M2074N4942O6377P3210P7747Q3261Q9541R6015J04816
$$ y = [2936252, 2874979, 2814704, 2754952, 2694252, 2632171, 2569322, 2505694, 2440562, 2373658, 2304984, 2234102, 2161106, 2087590, 2015153, 1943799, 1873269, 1804764, 1739553, 1677085, 1616479, 1558827, 1505964, 1457970, 1413854, 1373489, 1336696, 1301715, 1267180, 1234590, 1206240, 1181546, 1157940, 1134574, 1112450, 1091764, 1071955, 1053778, 1038431, 1024893, 1010925, 996577, 984161, 974856, 967688, 961646, 956459, 951531, 946481, 942608, 941644, 943295, 946054, 949904, 955878, 963489, 971069, 978370, 986512, 995665, 1005098, 1015162, 1027010, 1040669, 1055409, 1071492, 1089389, 1107900, 1125210, 1141157, 1156458, 1170792, 1183934, 1197502, 1212921, 1228826, 1243324, 1257586, 1274127, 1292678, 1311131, 1329724, 1351096, 1377185, 1409546, 1451620, 1506562, 1572939, 1646149, 1723896, 1807157, 1896698, 1992713, 2097529]
56069B097529J16950J29461J40267J52064J67610J84702J99554K11235K18973
56060C618345K19103K09357J92975J74486J54786J34352J17213J06394R8095Q5381
56050E110487O5767M1478J4958j1691l5173n3176o6493p6732q4637r3028j07172
56039D704588j28570j51829j70868j84494j92952j94064j87022j75574j62916
56030C156299j47675j29231j12116j00094r0277p8417o5962n6575m9742m3271
56020B282939l8241l6067l4386l1030k8223k7819k6585k1520j5438j1906r205
56009B002519m892j334p71J02M182P844P554P260J1826J8134K0680K1181K4265
55996B118550K8136K8289K6641K8076L1322L1980L1444L4073L8431L9863L9069
$$ y = [2097529, 2214479, 2343940, 2484207, 2636271, 2803881, 2988583, 3188137, 3399372, 3618345, 3837448, 4046805, 4239780, 4414266, 4569052, 4703404, 4820617, 4927011, 5025106, 5110487, 5176254, 5217732, 5232690, 5220999, 5185826, 5132650, 5066157, 4989425, 4904788, 4811760, 4704588, 4576018, 4424189, 4253321, 4068827, 3875875, 3681811, 3494789, 3319215, 3156299, 3008624, 2879393, 2767277, 2667183, 2576906, 2498489, 2432527, 2375952, 2326210, 2282939, 2244698, 2208631, 2174245, 2143215, 2114992, 2087173, 2060588, 2039068, 2023630, 2011724, 2002519, 1997627, 1996293, 1995522, 1995624, 1999806, 2007650, 2015204, 2022464, 2034290, 2052424, 2073104, 2094285, 2118550, 2146686, 2174975, 2201616, 2229692, 2261014, 2292994, 2324438, 2358511, 2396942, 2436805, 2475874]
55985B475874L9919M1672M1480M1449M4923M9120M9781M9755N4331O1555O5849
55974C015708O7713P1021P4580P5487P6897Q2939Q9816R1693R1332R5023J01306
55963C933515J05286J09489J19194J30977J37747J41448J49207J60526J70135
55954E157524J79728J94691K12743K27861K41482K57712K72395K80059K86570
55945G310765L00735L18475L30316L39398L55875L78339L98056M17382M45911
55936A0595252M81641N14330N44818N82558O26583O67789P07754P56155Q11521
55927A6288401Q63593R12205R64649J018029J065174J114277J180505J261496
55919B4668329J343514J427211J522850J625451J722096J819834J937725K074902
$$ y = [2475874, 2515793, 2557465, 2598945, 2640394, 2685317, 2734437, 2784218, 2833973, 2888304, 2949859, 3015708, 3083421, 3154442, 3229022, 3304509, 3381406, 3464345, 3554161, 3645854, 3737186, 3832209, 3933515, 4038801, 4148290, 4267484, 4398461, 4536208, 4677656, 4826863, 4987389, 5157524, 5337252, 5531943, 5744686, 5972547, 6214029, 6471741, 6744136, 7024195, 7310765, 7611500, 7929975, 8260291, 8599689, 8955564, 9333903, 9731959, 10149341, 10595252, 11076893, 11591223, 12136041, 12718599, 13345182, 14012971, 14720725, 15476880, 16288401, 17151994, 18064199, 19028848, 20046877, 21112051, 22226328, 23406833, 24668329, 26011843, 27439054, 28961904, 30587355, 32309451, 34129285, 36067010, 38141912]
55911C8141912K216086K364308K536505K732213K942202L183610L488741L863444
55903F1469021M297116M807490N428934O160999O979757P896338Q948831J0141109
55895A16129595J1452282J2901787J4537502J6375632J8443005K0858859K3745454
55888B34444116K7051504L0583019L4114188L7086703L8042805L4825225K6044153
55881D62191713J2610281k394351j5560860k4952797l0425742l2800877l3061650
55874C35605717l2045863l0351760k8282621k5941147k3423083k0877731j8419873
55867A56263639j6096072j3952980j2058538j0440389r067970p909554o954391
55860G9783745o172540n507909m926064m428025m008885l642419l313938l030396
$$ y = [38141912, 40357998, 42722306, 45258811, 47991024, 50933226, 54116836, 57605577, 61469021, 65766137, 70573627, 76002561, 82163560, 89143317, 97039655, 105988486, 116129595, 127581877, 140483664, 155021166, 171396798, 189839803, 210698662, 234444116, 261495620, 292078639, 326192827, 363279530, 401322335, 436147560, 462191713, 474801994, 472407643, 456846783, 431893986, 401468244, 368667367, 335605717, 303559854, 273208094, 244925473, 218984326, 195561243, 174683512, 156263639, 140167567, 126214587, 114156049, 103715660, 94647690, 86738136, 79783745, 73611205, 68103296, 63177232, 58749207, 54740322, 51097903, 47783965, 44753569]
55852D4753569k789031k568950k361200k176740k018262j872441j735084j616383
55844B7615478j515944j418485j319102j228202j147580j066215r84001r15463
55836A8020486q64439q17506p67763p23589o88480o53082o13308n77191n47914
55827A1767214n18045m85894m59931m41859m22231l97926l77433l63901l49106
55818G950888l29310l11268k97176k79264k55222k34340k22088k12107j99303
55809E610810j87757j79765j69710j55120j42368j35577j30583j24909j23072
55800D261949j26942j31077j32325j34171j37281j35886j27981j19467j13806
55791C103013j06990r6837q7900q2767p7433o9435o2097n6944n0280m0802l2354
$$ y = [44753569, 41964538, 39395588, 37034388, 34857648, 32839386, 30966945, 29231861, 27615478, 26099534, 24681049, 23361947, 22133745, 20986165, 19919950, 18935949, 18020486, 17156047, 16338541, 15570778, 14847189, 14158709, 13505627, 12892319, 12315128, 11767214, 11249169, 10763275, 10303344, 9861485, 9439254, 9041328, 8663895, 8299994, 7950888, 7621578, 7310310, 7013134, 6733870, 6478648, 6244308, 6022220, 5810113, 5610810, 5423053, 5243288, 5073578, 4918458, 4776090, 4640513, 4509930, 4385021, 4261949, 4135007, 4003930, 3871605, 3737434, 3600153, 3464267, 3336286, 3216819, 3103013, 2996023, 2899186, 2811286, 2728519, 2651086, 2581651, 2519554, 2462610, 2412330, 2371528, 2339174]
55780B339174k6257j9481j3288j4433k4264l5358m2251m6860n0355m9214m3349
55769A974064l8863l8332l6804l1577k7343k7189k7231k5023k4980l0022l5486
55758A631214l6856l6659l8438m0494m0626m0767m2085m1437l7319l3534l2645
55747A210354l1580k7845k4173k2886k1515j8105j4987j3349j0069m134j31q72
55735A020708k395q76J126J09k160k772l155n567q548j0261j2135j5041j6360
55722I42673j4795j3554j4684j4978j1786q208p855q672o913l566k161l298n540
55709H26663q739j2595j4792j4099j2594j1969j0804q177o151n836m945k397j349
55696G12216m063p642q589p922q094q097n651j438K268M759N794M238L53l330
$$ y = [2339174, 2312917, 2293436, 2280148, 2265715, 2241451, 2206093, 2163842, 2116982, 2066627, 2017413, 1974064, 1935201, 1896869, 1860065, 1828488, 1801145, 1773956, 1746725, 1721702, 1696722, 1666700, 1631214, 1594358, 1557699, 1519261, 1478767, 1438141, 1397374, 1355289, 1313852, 1276533, 1242999, 1210354, 1178774, 1150929, 1126756, 1103870, 1082355, 1064250, 1049263, 1035914, 1025845, 1021711, 1021580, 1020708, 1018313, 1017437, 1018563, 1018672, 1016512, 1013740, 1010585, 1005018, 996470, 986209, 974074, 959033, 942673, 927878, 914324, 899640, 884662, 872876, 864668, 856813, 848141, 841228, 837662, 835501, 832203, 826663, 817924, 805329, 790537, 776438, 763844, 751875, 741071, 732894, 726743, 720907, 715962, 713565, 712216, 708153, 700511, 691922, 684000, 675906, 667809, 662158, 660720, 662988, 667747, 673541, 677779, 678132, 674802]
55682F74802n850r264j4170j7533j7418j5988j5261j3962j1386j0050j1177j1569
55670E21174q622m766l408l959m316m693n627n705m663n157q074r833p875m971
55656D39505m337m513l219k421m631p503p218m596l041k661j249P66J178M50J057
55641C97567L233M889M835L224J79l373n155m312k922k683k526j682j907l872
55627C85495m580j772K197M297N598Q278J0758J0233P747O438O546O124M996M147
55613D56502K790k19l565n446o763q936j0460r167o309m800m816m532l702l194
55599C87383k498r85j21j273k839k688j660j495j313L54K017J500L0K02J313O81
55583C78608j557k811k322j587j435j833l564o795r182q621o779o604p711p706
$$ y = [674802, 668952, 659688, 645518, 627985, 610567, 594579, 579318, 565356, 553970, 543920, 532743, 521174, 512552, 507786, 504378, 500419, 496103, 491410, 485783, 480078, 475415, 470258, 462184, 452351, 444476, 439505, 435168, 430655, 427436, 425015, 420384, 412881, 405663, 401067, 398026, 395365, 394116, 394882, 396060, 396510, 397567, 400800, 405689, 410524, 413748, 413927, 410554, 405399, 401087, 398165, 395482, 392956, 391274, 389367, 385495, 380915, 379143, 381340, 385637, 391235, 399513, 410271, 420504, 428251, 434689, 441235, 447359, 452355, 456502, 459292, 459073, 455508, 450062, 443299, 434363, 423903, 414736, 408427, 403627, 398811, 394279, 390577, 387383, 384885, 383900, 383779, 382506, 379667, 376979, 375319, 373824, 372511, 372865, 374882, 376382, 376412, 376614, 377927, 378608, 377051, 374240, 371918, 370331, 368896, 367063, 363499, 356704, 347522, 338901, 332122, 325518, 317807, 310101]
55569C10101o659o498o977o221m590m318n606o480o247o053o199n813m819l845
55555B29776k721j263n35j071j289j24N93q33k483j728J73J35j647k415j557p39
55539B12272l47M45Q52n14k484k735j688j557k342k338j755k063k498j090J317
55524A93475J935M99q34j405k014j637J508N744P173N405L904M378M956M593N006
55509B32686P077R116J0075J1178J3069J4398J4447J4299J4280J2928R618N727
55497C68898K238j414n292q071r159r714j0723j1912j2928j3879j4506j4548j4748
55484B44242j5512j5258j2373q294n882n253m225k474j906k919l692l575l870
55471A59009m727m406k339o0J574L208M449L562N71k010k515j683l78J503L179
$$ y = [310101, 303442, 296944, 289967, 283746, 279156, 274838, 269232, 262752, 256505, 250452, 244253, 238440, 233621, 229776, 227055, 225792, 225257, 224186, 222897, 222773, 223366, 222533, 220050, 218322, 218495, 218630, 216983, 214568, 213011, 212272, 211925, 212370, 213222, 212708, 210224, 207489, 205801, 204244, 201902, 199564, 197809, 195746, 193248, 192158, 193475, 195410, 195909, 195075, 193670, 191656, 190019, 191527, 197271, 204444, 209849, 213753, 218131, 223087, 227680, 232686, 239763, 248879, 258954, 270132, 283201, 297599, 312046, 326345, 340625, 353553, 363171, 368898, 371136, 369722, 364430, 356359, 347200, 337486, 326763, 314851, 301923, 288044, 273538, 258990, 244242, 228730, 213472, 201099, 192805, 186923, 181670, 177445, 174971, 173065, 170146, 166454, 162879, 159009, 154282, 149876, 147537, 147477, 149051, 152259, 156708, 160270, 160841, 158831, 156316, 154633, 154255, 155758, 158937]
55456A58937K954J099J45J225K463K000L68j104k118k712k744k702l235l663k981
55441A47932k178k977m384l648r19N28n74j623o97M71k37j961k823k749k478j915
55425A19768j230j654l505n144n345m945m806m139k297m33K14J21K36L29j69j013
55409H5988j772k262j777L59K824L017O52j472j521j079k107l653l603k087r58
55394G0549r25j111p70j0Q48J431J309M97m67j285j961k057j025N27J299J196
55378F8045J357K033K053Q17p41j707k088j899r12K23K54p51j288o33M35J269
55362F6467J987K298J715J061J649K682J912n71j966j023jr93k656k375K05L356
55346G3747N456N649L881J523N52J078J184n9j239j153o47p73j011p02m69p92
$$ y = [158937, 161891, 162990, 163135, 164360, 166823, 168823, 169191, 168087, 165969, 163257, 160513, 157811, 154576, 150913, 147932, 145754, 142777, 138393, 134745, 133826, 134354, 133780, 132157, 131460, 131931, 131694, 129733, 126910, 124161, 121683, 119768, 118538, 116884, 113379, 108235, 102890, 97945, 93139, 89000, 86703, 86270, 86484, 86605, 86841, 87170, 87001, 85988, 84216, 81954, 80177, 80536, 83360, 86377, 87029, 85557, 84036, 82957, 80850, 77197, 73594, 71507, 70549, 69624, 68513, 67743, 67733, 68581, 70012, 71321, 71818, 71351, 70066, 68105, 66048, 65023, 65550, 66849, 68045, 69402, 71435, 73488, 74305, 73564, 71857, 69769, 67870, 66958, 67181, 67435, 66684, 65396, 64763, 65198, 66467, 68454, 70752, 72467, 73528, 75177, 77859, 79771, 79200, 77234, 76211, 76210, 75217, 72561, 70186, 70391, 73747, 79203, 84852, 88733, 90256, 90808, 91886, 93070, 93011, 91772, 90619, 89972, 89199, 88188, 87486, 87017, 86225]
55330H6225p67L10J541J841J316K96j322k768k439m53Q07J73l39J201L369L484
55314I2475J424q38k308l422m294m507m192l770l149k410k437l469l812j631K391
55299E6051N383N145J953j944m069l574j977j337j677j327J33J075N42j76K59
55284E4460J170J294P58L08j47q47j197o29M14J376K358L134K652N42j920l316
55268F0410l479k741j160P20J732J597J351J515J335M34m10q11j272j479k87J723
55252E9178K151L82j107p35l71j885l654l168j117L7R0O29J670J745Q43M44Q23
55235E5955P47p3l22Q68K683L697L067R34j367j928k17K075K936K071L20j676
55219F9770l177l021j117P56J039L74J84M70M02Kl24q44j634j790r16k15n13o22
$$ y = [86225, 85458, 85768, 87309, 89150, 90466, 90762, 89440, 86672, 84233, 83780, 84587, 84760, 84421, 85622, 88991, 92475, 93899, 93061, 90753, 87331, 83037, 78530, 74338, 70568, 67419, 65009, 62572, 59103, 55291, 53660, 56051, 61434, 66579, 68532, 66588, 62519, 58945, 56968, 55631, 53954, 52627, 52760, 53835, 54377, 54201, 54460, 55630, 56924, 57682, 57990, 57843, 56996, 55799, 55170, 55584, 56960, 59318, 62452, 65104, 65646, 63726, 60410, 56931, 54190, 53030, 53750, 55482, 57079, 58430, 59945, 61280, 61714, 61304, 60493, 59221, 57742, 57455, 59178, 61329, 61711, 60604, 59869, 59498, 57613, 53959, 50791, 49674, 49711, 49801, 50430, 52100, 53845, 54688, 55132, 55955, 56702, 56629, 56307, 57175, 59858, 63555, 66622, 67556, 66189, 64261, 64044, 66119, 69055, 71126, 71446, 69770, 66593, 63572, 62455, 63211, 64250, 64624, 64808, 65278, 65680, 65682, 65358, 64514, 62880, 61090, 60174, 59959, 59446, 58824]
55201E8824N88J991K072J566J915K405J421m08j045m54l91j149j230k11N60M44
55185F6898L34N83K12j200k516k535j290M26J646J427k13j661j365M7O47p2q75
55168F0493r65p26l56M99J581J976J588J307J487J482R37L88L62P47J159J158
55152G3117K79j295k462k479j982j735j154N28K415K949K284J767J477K29j928
55137G2010l270k860j718j095j066j240j430j113M30K790M377M200K781J034o06
55122G3224j667j568p39o12j674k498j692q5K50j070k059r91J116J648r8j794
55106E9691j116R78J419q48l654m714m181l297k224n85J022J635J401J158J126
55091D7811J076J239J821K259K068J893K541L416L120J325q96k261k093n53J114
$$ y = [58824, 59412, 61403, 63475, 65041, 66956, 69361, 70782, 70374, 69329, 68875, 68484, 67335, 66105, 65894, 66454, 66898, 67232, 67815, 68027, 66827, 64311, 61776, 60486, 60912, 62558, 63985, 63772, 62111, 60746, 60793, 61440, 61368, 60493, 59528, 58802, 58446, 58945, 60526, 62502, 64090, 65397, 66884, 68366, 69303, 69691, 70053, 70800, 71959, 73117, 73396, 72101, 69639, 67160, 65178, 63443, 62289, 62817, 65232, 68181, 70465, 72232, 73709, 73938, 72010, 68740, 65880, 64162, 63067, 62001, 60761, 59331, 58218, 58648, 61438, 65815, 70015, 72796, 73830, 73224, 71557, 69989, 69250, 68638, 66964, 64466, 62774, 62689, 62939, 61869, 59810, 58819, 59935, 61583, 61485, 59691, 58575, 59553, 60972, 60124, 56470, 51756, 47575, 44278, 42054, 41469, 42491, 44126, 45527, 46685, 47811, 48887, 50126, 51947, 54206, 56274, 58167, 60708, 64124, 67244, 68569, 67673, 65412, 63319, 62766, 63880]
55076F3880J230m41k179k458j721j095m71P17J769J403j95j532j689r02L33J619
55060E8268K405K320J556N09l52m7K158M941N589L520J392J386K209J544k75j363
55044H5760j390j268r02J52Q33l7j257p86R02J487M29o84j023j169j095o5J364
55027H1251J693Q56J52n0l14j54J352L186L274J787R28J341J562J224J684K851
55011A02623K523k2k539l177k720k242j103R72K168R97j293k498k282j547m92
54996H9368J021K149J893N74o88j344j392p87K06Q40Q62R36J473J899J648R44
54980I9602J78o23j162q53J61R63J236J549J988J860J209J179K111K714J929L98
54964A14439p49j364j714j546p33J78Q00J399J923J608M05l79J77J151J091J4
$$ y = [63880, 65110, 64669, 62490, 60032, 58311, 57216, 56745, 57462, 59231, 60634, 60439, 58907, 57218, 56316, 56649, 58268, 60673, 62993, 64549, 65058, 64706, 64659, 66817, 71758, 77347, 80867, 82259, 83645, 85854, 87398, 87123, 85760, 84370, 83102, 82200, 82352, 83185, 83148, 81891, 81105, 82007, 83494, 83923, 83239, 82216, 81047, 79952, 79887, 81251, 82944, 83800, 83952, 83902, 83588, 83434, 84786, 87972, 91246, 93033, 93961, 95302, 96864, 98088, 99772, 102623, 105146, 105124, 102585, 99408, 96688, 94446, 93343, 94315, 96483, 97480, 96187, 93689, 91407, 89860, 89368, 90389, 92538, 94431, 95005, 94317, 92973, 91581, 90794, 91000, 91840, 92702, 93638, 95111, 97010, 98658, 99602, 99780, 99157, 97995, 97142, 97303, 98266, 99502, 101051, 103039, 104899, 106108, 107287, 109398, 112112, 114041, 114439, 113690, 112326, 110612, 109066, 108333, 108511, 109311, 110710, 112633, 114241, 114646, 114267, 114444, 115595, 116686, 116700]
54948A16700q78r20m73j25j15k73q9P74J832K088J318L58r2k64o14j002r85n21
54930A16719n8k12j179k289k483j659q42n16J85J603K206P80j139j193J76N89
54914A10688k70l17J117K132J558P98J187J895J743J057L44q73k454k672n91K058
54898A17400L018K448K153K865L860M520M832M799M506M478N135O299P575Q656
54884A82544Q969P984O286N295N531O223O926Q124R722J0513J0022R405R358Q450
54870B95352M886p58n800q143q142q076r960j3267j5080j3437j0138q637r424
54857A89376r680p726n315m552m871m507l219j923r94l85k99m54J75J807L063
54842A50496K827J826J496K345M145O499Q464R142R254J0500J2650J3307J1525
$$ y = [116700, 115822, 114902, 114429, 114304, 114189, 113916, 113827, 114601, 116433, 118521, 119839, 120197, 120105, 119841, 119227, 118225, 117240, 116719, 116661, 116449, 115270, 112981, 110498, 108839, 107997, 107481, 107666, 109269, 111475, 112255, 111116, 109923, 110099, 110688, 110418, 110101, 111218, 113350, 114908, 115706, 116893, 118788, 120531, 121588, 121932, 121059, 118605, 115933, 115342, 117400, 120418, 122866, 125019, 127884, 131744, 136264, 141096, 145895, 150401, 154879, 160014, 166313, 173888, 182544, 191513, 199497, 205783, 211078, 216609, 222832, 229758, 237882, 247604, 258117, 268139, 277544, 286902, 295352, 300238, 299480, 293680, 285537, 277395, 269319, 259359, 246092, 231012, 217575, 207437, 198800, 189376, 179696, 171970, 166655, 162103, 157232, 152725, 149506, 147583, 146589, 146204, 145905, 145451, 145626, 147433, 150496, 153323, 155149, 156645, 158990, 163135, 169634, 178098, 187240, 196494, 206994, 219644, 232951, 244476]
54829B44476R348Q325O912L275j422m972p454j0046j2019j1793j0067r036q994
54816A96533q361o853o004o420o834o293n375m715l962k759j541q94r38j457j887
54801A32240j328M79K332K684J430k06j201j355p76J95Q23O00j30p95j468k444
54785A31080l451l934l732k909j633n99o27j245r39M37Q60j053l808n049m581
54770I8817l717k740j001J065K046J552L85r36k383l285k737j066M21J293K234
54755H9948L418L892K956J194j65l12P00K052K771K692K538K832L235L402L556
54740A24709L702L240K261K178L913O242P189O518N644N589O079O401O226N803
54726A95694N911P238R460J1574J3301J5057J6277J5501J2717R820P722M967O43
$$ y = [244476, 253824, 262149, 269061, 272336, 270914, 265942, 258488, 248442, 236423, 224630, 214563, 205527, 196533, 188172, 181319, 175315, 168895, 162061, 155768, 150393, 145678, 141716, 138957, 137416, 136522, 135584, 134127, 132240, 130912, 131391, 133723, 136407, 137837, 137631, 136430, 135075, 134299, 134494, 135317, 135917, 135787, 134992, 133524, 131080, 127629, 123695, 119963, 117054, 115421, 114822, 114195, 112950, 112011, 112448, 113308, 112255, 108447, 103398, 98817, 95100, 92360, 91359, 92424, 94470, 96022, 96407, 95471, 93088, 89803, 87066, 86000, 86421, 87714, 89948, 93366, 97258, 100214, 101408, 101243, 100931, 101631, 103683, 106454, 109146, 111684, 114516, 117751, 121153, 124709, 128411, 131651, 133912, 136090, 140003, 146245, 153434, 159952, 165596, 171185, 177264, 183665, 189891, 195694, 201605, 208843, 218303, 229877, 243178, 258235, 274512, 290013, 302730, 312550, 320272, 325239, 325882]
54713C25882l349m880m852n678p745r527j0084r369p119l786j624k318m209m274
54699B47068k345q81r59j162m69L62P56J469L182N538P933R843J0442R483Q462
54684B98722R157J1006J1715J0358Q129O100M288L019L074L929L633J215k276
54671C72069n519q363j0995j3083j4265j4662j4530j4157j3940j3674j2275r354
54659B27252o515n581o103o195n326m442l824k995k493l387m961n072l224j240
54645A65894o28j114k055l157l439j648J586L835L840K671J642R65Q93J992L474
54630A74751L327J063j378k282j890q71Q06K447K374N61n26O69K324J965R3r35
54614A82498l45Q73K224L950N456N623M718M261M810N271M732L780L392L401K847
$$ y = [325882, 322533, 317653, 312801, 307123, 299378, 289851, 279767, 270398, 263279, 259493, 257869, 255551, 251342, 247068, 244723, 243842, 242883, 241721, 241252, 241614, 242370, 243839, 247021, 252559, 260492, 270335, 280777, 290260, 298722, 307879, 318885, 330600, 340958, 349087, 355187, 359475, 362494, 365568, 369497, 373130, 374345, 372069, 366550, 358187, 347192, 334109, 319844, 305182, 290652, 276495, 262555, 248881, 236606, 227252, 220737, 215156, 209053, 202858, 197532, 193090, 189266, 186271, 183778, 180391, 175430, 170358, 167134, 165894, 165266, 164152, 162097, 158940, 155501, 153853, 155439, 159274, 163114, 165785, 167427, 168392, 169285, 171277, 174751, 178078, 179141, 177763, 175481, 173591, 172720, 173526, 175973, 178347, 178908, 178382, 179051, 181375, 183340, 183433, 182498, 182153, 183026, 185250, 189200, 194656, 200279, 204997, 209258, 214068, 219339, 224071, 227851, 231243, 234644, 237491]
54599B37491J523M89P77J991K663K119J338J572K765M034N070O086O787O600N764
54584B87069N077M673M267M497O637J0613J4440J6082J5231J3144J1316J0185
54572D03231Q534M656j243o450q716q936r533j1104j2430j2980j3191j2728j0924
54559C08186q750p982q373p979o365m941m024k436m93l11k101l085j641J62j68
54544B49699k044l470m069m508m654m239l924l999l531k183j300j625j785q29
54530B07539l20j742l571l468k038j697k747l226k303j167p25n52m07q71k058
54515A80647l156l407k743j467k24J39m15q20m37p4m64q36k83M34J04q41j162
54498A64995r30j028j135j98J473K515K647K666K550J594L00K05J429K325J963
$$ y = [237491, 239014, 239503, 240280, 242271, 244934, 247053, 248391, 249963, 252728, 256762, 261832, 267918, 274705, 281305, 287069, 292146, 296819, 301086, 305583, 312220, 322833, 337273, 353355, 368586, 381730, 393046, 403231, 411765, 416421, 415178, 408728, 400012, 391076, 381543, 370439, 358009, 345029, 331838, 319110, 308186, 299436, 291454, 283081, 275102, 268737, 263796, 259772, 257336, 256843, 256532, 254431, 251346, 249705, 249867, 249699, 247655, 244185, 240116, 235608, 230954, 226715, 222791, 218792, 215261, 213078, 211778, 210153, 208368, 207539, 207219, 205477, 201906, 198438, 196400, 194703, 191956, 188730, 186427, 185260, 184535, 183983, 183576, 182705, 180647, 177491, 174084, 171341, 169874, 169650, 169789, 169374, 168554, 168117, 168043, 167579, 166743, 166460, 166894, 166998, 166157, 164995, 164065, 163037, 161902, 161704, 163177, 165692, 168339, 171005, 173555, 175149, 175449, 175654, 177083, 179408, 181371]
54483A81371J355J632K496L122L280K976K107J080P35J185J732K270L611N797
54469B14749P357P141O034N693O186N922L878R07j273j970j971k404l513m608
54455B42128n051m915m747n007n786o622o599n156k970j457j159j247q59j81J37
54440A90509j32r93k448l849l892k109J94J333J082M15R3L13J169K425L311L324
54424A90745K950K723K339J513J039J805L255M040L875L553L295K450Q51o05r15
54409B22913J50K100L955M646L941K814K148J560L63q32q16K70J035Q33L74K36
54393B45690J27j66k55LJ85J45J75J15p04k229l393l510l037k547j994j539j982
54376B25084l500m802m576l228k158j778j382p97p72j446j565q0K136L143K346
$$ y = [181371, 182726, 184358, 186854, 189976, 193256, 196232, 198339, 199419, 200154, 201339, 203071, 205341, 208952, 214749, 222106, 229247, 235281, 240974, 247160, 253082, 256960, 257867, 256594, 254624, 252653, 250249, 246736, 242128, 237077, 232162, 227415, 222408, 216622, 210000, 203401, 198245, 195275, 193818, 192659, 191412, 190553, 190372, 190509, 190377, 189384, 186936, 183087, 179195, 177086, 177280, 178613, 179695, 180110, 180203, 180516, 181685, 184110, 187421, 190745, 193695, 196418, 198757, 200270, 201309, 203114, 206369, 210409, 214284, 217837, 221132, 223582, 224433, 223828, 222913, 223063, 225163, 229118, 233764, 237705, 240519, 242667, 244227, 244590, 243758, 242942, 243212, 244247, 245080, 245454, 245690, 245817, 245651, 245396, 245399, 245584, 245729, 245904, 246019, 245315, 243086, 239693, 236183, 233146, 230599, 228605, 227066, 225084, 221584, 216782, 212206, 208978, 206820, 205042, 203660, 202863, 202091, 200645, 199080, 199000, 201136, 204279, 206625]
54361B06625J089O80P75L19o20q71J22J631K764L366L561L246K584K285K723L357
54345B33636L589L672M093M649M932N309O248P002O245M221L014L988N803N921
54331C02322L692R61l55l88n78j551k583k996l204l878m801n236n059m859n010
54316B66477n289n381n205m747m101l641l587l562l156k731k848l108k539j163
54302B15419j46k02p87j078q40j20Q59J324N98o49r52j20O04Q60J915M155N626
54285B26466M595K323J420K212K528R71j260k081q72J158K223J441m81j971k232
54270B36440j956k277l482n007o074o032m742l037k121k250k794l622n075o349
54256A81622n712l219j414j962l259l094k085k245l292l103j454n41j438k398
$$ y = [206625, 207714, 208394, 209169, 209488, 208868, 207997, 208119, 209750, 212514, 215880, 219441, 222687, 225271, 227556, 230279, 233636, 237225, 240897, 244990, 249639, 254571, 259880, 266128, 273130, 279375, 283596, 286610, 290598, 296401, 302322, 306014, 306975, 306620, 306232, 305654, 304103, 301520, 298524, 295320, 291442, 286641, 281405, 276346, 271487, 266477, 261188, 255807, 250602, 245855, 241754, 238113, 234526, 230964, 227808, 225077, 222229, 219121, 216582, 215419, 215273, 215071, 214284, 213206, 212366, 212246, 213105, 214429, 215027, 214378, 213426, 213306, 213910, 214770, 216685, 220840, 226466, 231061, 233384, 234804, 237016, 239544, 240515, 239255, 237174, 236302, 237460, 239683, 241124, 240643, 238672, 236440, 234484, 232207, 228725, 223718, 217644, 211612, 206870, 203833, 201712, 199462, 196668, 193046, 187971, 181622, 175910, 172691, 171277, 169315, 166056, 162962, 160877, 158632, 155340, 152237, 150783, 150242, 148804, 146406]
54242A46406j551M60J556P59j236l175m178m111l473k778k027j161o17p74j195
54227A22905j389j872l311m806m440j800J232K658K403J655J057L31p17j542j433
54212A10931m98J54m74j980k798j892J88K045K655J830K89n14L87J977K186P58
54196A15244j44R18K414K140M93l59K69J033Q46L2o93j014q28m96q45j871j989
54179A15150j17K203K464O76p56n46Q5k43j149j598j368p12K75J297J804J692
54163A19157J325P34l24j427j718j229r61j422k108k548k861l027k592j399J55
54148I9755J698K958L351K524J254P14P94K90j060j958j333J79J112Q19j91j064
54132A09842j436j700k417l295l275j923j48J035J571J567O23r20j310L67K285
$$ y = [146406, 144855, 145315, 146871, 147630, 146394, 143219, 139041, 134930, 131457, 128679, 126652, 125491, 124874, 124100, 122905, 121516, 119644, 116333, 111527, 107087, 105287, 106519, 109177, 111580, 113235, 114292, 114623, 113906, 112364, 110931, 110433, 110587, 110113, 108133, 105335, 103443, 103631, 105676, 108331, 110161, 110450, 109936, 110323, 112300, 114486, 115244, 115100, 116018, 118432, 120572, 121065, 120706, 120975, 122008, 122854, 122886, 122193, 121179, 120351, 119855, 119010, 117139, 115150, 115033, 117236, 119700, 120376, 119620, 119074, 119159, 118916, 117767, 116169, 114801, 114089, 114364, 115661, 117465, 119157, 120482, 121216, 120892, 119465, 117747, 116518, 115557, 114135, 112027, 109479, 106618, 103591, 100999, 99600, 99755, 101453, 104411, 107762, 110286, 111540, 112254, 113048, 113338, 112278, 110320, 108987, 109166, 110278, 111097, 110906, 109842, 108406, 106706, 104289, 100994, 97719, 95796, 95648, 96683, 98254, 99821, 100444, 99524, 98214, 98581, 100866]
54117A00866K065J61j029p60m54q77j230j199j591k435k540j541n71l60l29o9
54101H8107q4m80n75k39o9Q1R73K020J494o28k005j099Q24J879J984J920J664
54084I5767J025O27Q59R02O2r46j141q37q61j059o38N29J712K089J315Ok69J439
54066A00581L767M236K509Q32Q48J610J605R49M10k25j328k199k000j219r91j643
54050A07742k746l750l881k448r2J284P34n31r81o59l54r2M26Q17O21J91j1k48
54032I6022q24j313j178l86J075L198M992M923L051J283O12j51j812k849j757
54017A04886K43R00J94j44N13J370K148L242M226M068K821J521N59l71q11K34
54001A25599K437L930L461J756L50l1L25Q41J105J065Q76N59O2k38L16J582K431
$$ y = [100866, 102931, 103092, 102063, 101303, 100849, 99972, 98742, 97543, 95952, 93517, 90977, 89436, 88865, 88505, 88176, 88107, 88023, 87543, 86968, 86729, 86660, 86741, 87714, 89734, 91228, 90600, 88595, 87496, 88320, 90199, 92183, 94103, 95767, 96792, 97419, 98278, 99180, 99242, 98296, 97155, 96318, 95457, 94398, 93760, 94289, 96001, 98090, 99405, 99411, 99142, 100581, 104348, 108584, 111093, 111925, 112773, 114383, 115988, 116937, 117347, 117122, 115794, 113595, 111595, 110376, 109385, 107742, 104996, 101246, 97365, 94917, 94825, 96109, 96843, 96312, 95331, 94672, 94318, 94226, 94652, 95469, 96090, 96281, 96270, 96022, 95198, 93885, 92707, 92321, 93396, 96594, 101586, 106509, 109560, 110843, 111455, 111304, 109492, 106643, 104886, 105129, 106029, 106223, 106079, 106592, 107962, 110110, 113352, 117578, 121646, 124467, 125988, 126547, 126176, 125365, 125599, 128036, 131966, 135427, 137183, 137533, 137502, 137827, 138668, 139773, 140838, 141714, 142273, 142335, 142097, 142413, 143995, 146426]
53984A46426K076J046L71M15J045K114L129L219K228J156R30J466K445L989N722
53969A77777O342N224L755L739N229O871P743P761O969N698M912N225N965O128
53955B59338N736N272M524L176K027K195L324L833K890J239N9j83J42L27k8n42
53939B93329o28o96j885m211n982n878m681m089m647n693o568o937o607n852n263
53924B23712m655l105p65N47m63k883m935n789n105k518R21K359K67l044m049
53909A90495k414q70j309k978m251m280k864l88J931K842K213P56q13j592n62
53894A75916J891L578L046J611J259J708J418N77P13J941K845K985L275L985M430
53879B11178M605N177N760N268M170M440O689R014R337P552N059L362L291M415
$$ y = [146426, 148502, 149548, 149919, 150334, 151379, 153493, 156622, 159841, 162069, 163225, 164155, 165621, 168066, 172055, 177777, 184119, 189343, 193098, 196837, 202066, 208937, 216680, 224441, 231410, 237108, 242020, 247245, 253210, 259338, 265074, 270346, 274870, 278046, 280073, 282268, 285592, 289425, 292315, 293554, 293613, 293430, 293572, 293899, 293871, 293329, 292701, 292005, 290120, 285909, 279927, 274049, 269368, 265279, 260632, 254939, 248371, 241434, 234827, 228975, 223712, 219057, 215952, 215187, 215734, 215271, 212388, 207453, 201664, 196559, 194041, 194962, 197321, 197588, 194544, 190495, 188081, 187211, 185902, 182924, 178673, 174393, 171529, 171141, 173072, 175914, 178127, 178883, 178070, 176478, 175916, 177807, 181385, 184431, 186042, 187301, 189009, 190427, 191004, 191717, 193658, 196503, 199488, 202763, 206748, 211178, 215783, 220960, 226720, 231988, 236158, 240598, 247287, 256301, 265638, 273190, 278249, 281611, 284902, 289317]
53865B89317M983L587Q85j213j746j038M94K370L426K945K014K106K760K540J793
53850C15223K255M089N695O411P054P651P195O159O603Q856J0487R788Q127P413
53836D13006P117N548K749L93n34n27n54j109k015k605k489k248k772m038n343
53821D04579o542p902q899q636p382o440o350o625p033p624p637o301m760n076
53807C07372p119q492q025p155p182p341o665n653m922l966k570j835k517l667
53793B30263m178m352m841n238m872l903k754j551p99j238k277k243r95n13j717
53778A88792k689j660P7J61j233k097j838j617j890j764q07J48K75k81r31j309
53762A71337j306j007n98p7N69Q70L36n04n16L51R76J002J418K563L223K697K217
$$ y = [289317, 294300, 297887, 298772, 297559, 295813, 294775, 295269, 297639, 301065, 304010, 306024, 308130, 310890, 313430, 315223, 317478, 321567, 327262, 333673, 340727, 348378, 355573, 361732, 368335, 377191, 387678, 397466, 405593, 413006, 420123, 425671, 428420, 428813, 428279, 427752, 427198, 426089, 424074, 421469, 418980, 416732, 413960, 409922, 404579, 398037, 390135, 381236, 372600, 365218, 358778, 352428, 345803, 338770, 331146, 323509, 317208, 312448, 307372, 300253, 291761, 283736, 276581, 269399, 262058, 255393, 249740, 244818, 240852, 238282, 236447, 233930, 230263, 226085, 221733, 216892, 211654, 206782, 202879, 200125, 198574, 197775, 196537, 194260, 192017, 191022, 190509, 188792, 186103, 184443, 184520, 184681, 183448, 181351, 179513, 177896, 176006, 174242, 173435, 173583, 173858, 173577, 172646, 171337, 170031, 169024, 168426, 168349, 168918, 169788, 170124, 169620, 169104, 169455, 170431, 171433, 172851, 175414, 178637, 181334, 183551]
53745A83551L078M555N091M452L529K955L116M404O220O851N747M697N360O832
53731B50438P414P507Q536R856R338O883M946N190O528P118O653N948N426M904
53717C46685M146L130K034J126L32q03k323l457l769m154n663p666q370p252n779
53702C08217n462o002n938m614k987k416k917l076k020r07j482l414m510l777
53688B58695k642k483k550j628l46k41j431k727l425l464k502m65J376J512K29
53673B37908q36r95r29r47m00R47K311L006L118K775J767K46j050j676j960k371
53657B40914k849k965k371j114K39J027J330J849K569K308M25j808k510j401L51
53642B35994J918L136L531K589R65Q2L70J012J531K243L006K908J813R77J482
$$ y = [183551, 186629, 191184, 196275, 200727, 204256, 207211, 210327, 214731, 220951, 227802, 233549, 238246, 243606, 250438, 257852, 265359, 273895, 283751, 293089, 299972, 304918, 310108, 316636, 323754, 330407, 336355, 341781, 346685, 350831, 353961, 355995, 357121, 357453, 356650, 354327, 350870, 347101, 342947, 337284, 329618, 321248, 313996, 308217, 302755, 296753, 290815, 286201, 283214, 280798, 277881, 274805, 272785, 271878, 270396, 266982, 262472, 258695, 256053, 253570, 251020, 249392, 249046, 248805, 247374, 244647, 241222, 237758, 235256, 234791, 236167, 237679, 237908, 237072, 236077, 235148, 234201, 233801, 234748, 237059, 240065, 243183, 245958, 247725, 247971, 246921, 245245, 243285, 240914, 238065, 235100, 232729, 231615, 231854, 232881, 234211, 236060, 238629, 240937, 241362, 239554, 237044, 235643, 235994, 237912, 241048, 244579, 247168, 248133, 248215, 248585, 249597, 251128, 253371, 256377, 259285, 261098, 262075, 263557]
53627B63557K856M023M736N319N615N085L835K735K486K991L703M243M454M080
53613C19718K822J007j80K24J622K255J242m06j132o21K66P56P24L41k27q02j256
53596C26353j392q72L01J154O30p03r50M25J481L91j912l049k289r07J9M90N02
53579C19672k14j187j269j35J243J915J894J614J280J017R42R22Q33J091K200
53564C31818L760M731M699M172L541K616J441P50J147K250L195L725M283N143
53550C77271N767N435M471M314N714P398P373N626M237M640O064P263Q340R744
53536D63657J0684J0067Q294O750N972N630N759O622P610P643O715N895N747N732
53522E62777N191M149L189L029L895M888M579K910J572J692K211J773J033J453
$$ y = [263557, 266413, 270436, 275172, 280491, 286106, 291191, 295026, 297761, 300247, 303238, 306941, 311184, 315638, 319718, 322540, 323547, 323367, 323591, 325213, 327468, 328710, 328304, 327172, 326551, 326817, 327573, 328297, 328638, 328411, 327609, 326353, 324961, 324089, 324390, 325544, 326174, 325471, 324521, 324946, 326427, 326818, 324906, 321857, 319568, 318661, 318680, 319170, 319672, 319458, 318271, 317002, 316867, 318110, 320025, 321919, 323533, 324813, 325830, 326772, 327694, 328527, 329618, 331818, 335578, 340309, 345008, 349180, 352721, 355337, 356778, 357528, 358675, 360925, 364120, 367845, 372128, 377271, 383038, 388473, 392944, 397258, 402972, 410370, 417743, 423369, 427606, 432246, 438310, 445573, 453913, 463657, 474341, 484408, 492702, 499452, 505424, 511054, 516813, 523435, 531045, 538688, 545403, 551298, 557045, 562777, 567968, 572117, 575306, 578335, 582230, 587118, 591697, 594607, 596179, 597871, 600082, 601855, 602888, 604341]
53508F04341K681L089K330J409O08o16j806j627l6J501K080K047J637P72K68J196
53492F19874K762K882J296O8M13J131J036Q50J457K176K187K156K919L850M016
53477F49073L828M232N064N622O046O778P396P296P034P749R500J1216J2057J2144
53463G55035J2216J3082J5057J7396J8800J8950J8915J9707K1227K3005K5014
53452I58404K7003K8088K7948K7605K8189K9560L0975L2281L3599L4658L5539
53441A293849L7311M0668M4416M6561M6629M5869M5400M5241M5070M4956M5309
53430A781279M6573M8795N1013N1652N0190M7971M6605M6206M6067M6224M7055
53419B309630M7865M7448M5992M4986M5076M5346M4920M4015M2966M1531L9704
$$ y = [604341, 607022, 610111, 612441, 613850, 614458, 613842, 612036, 610409, 610373, 611874, 613954, 616001, 617638, 618410, 618678, 619874, 622636, 625518, 626814, 626882, 627295, 628426, 629462, 630312, 631769, 633945, 636132, 638288, 641207, 645057, 649073, 652901, 657133, 662197, 667819, 673865, 680643, 688039, 695335, 702369, 710118, 719618, 730834, 742891, 755035, 767251, 780333, 795390, 812786, 831586, 850536, 869451, 889158, 910385, 933390, 958404, 985407, 1013495, 1041443, 1069048, 1097237, 1126797, 1157772, 1190053, 1223652, 1258310, 1293849, 1331160, 1371828, 1416244, 1462805, 1509434, 1555303, 1600703, 1645944, 1691014, 1735970, 1781279, 1827852, 1876647, 1927660, 1979312, 2029502, 2077473, 2124078, 2170284, 2216351, 2262575, 2309630, 2357495, 2404943, 2450935, 2495921, 2540997, 2586343, 2631263, 2675278, 2718244, 2759775, 2799479]
53408B799479L8003L6160L2685K6966K0964J7412J6563J6115J4417J2326J1240
53397C042330J0549Q351M228o8k980n089q073j2432j7078k0866k3652k5915k8078
53384B921227l0466l3247l6051l8033l8715l8699l9187m0823m3072m4733m5067
53373B493134m4425m3713m3245m2486m0981l9099l7393l5664l3292l0304k7427
53362B075105k5174k3417k1802k0033j7661j4229r791m934k47L946P505J0530
53350A959798J3364J6233J9167K2554K7045L2230L6218L7775L8331M0470M4565
53339B287750M8586N1182N3206N5734N8374O0502O2807O6329P0850P5315P9261
53328B969896Q2866Q6131Q8901R1411R4002R6543R8706J00511J02150J03611J04849
$$ y = [2799479, 2837482, 2873642, 2906327, 2933293, 2954257, 2971669, 2988232, 3004347, 3018764, 3031090, 3042330, 3052879, 3061230, 3065458, 3065390, 3062410, 3057321, 3049248, 3036816, 3019738, 2998872, 2975220, 2949305, 2921227, 2890761, 2857514, 2821463, 2783430, 2744715, 2706016, 2666829, 2626006, 2582934, 2538201, 2493134, 2448709, 2404996, 2361751, 2319265, 2278284, 2239185, 2201792, 2166128, 2132836, 2102532, 2075105, 2049931, 2026514, 2004712, 1984679, 1967018, 1952789, 1942998, 1938064, 1937817, 1941763, 1949268, 1959798, 1973162, 1989395, 2008562, 2031116, 2058161, 2090391, 2126609, 2164384, 2202715, 2243185, 2287750, 2336336, 2387518, 2440724, 2496458, 2554832, 2615334, 2678141, 2744470, 2815320, 2890635, 2969896, 3052762, 3138893, 3227794, 3319205, 3413207, 3509750, 3608456, 3708967, 3811117, 3914728, 4019577]
53317D019577J05929J06658J06540J05406J03659J01607R9185R6452R3641R0456
53307E029110Q6141Q0550P4258O7326N9263N0705M3658L8924L4512K8107K0199
53296E612753J3118P479J481o309j5128k3504l1235l9196m7952n7239o6390p4842
53284E273036q2485q9756r6966j03445j07785j09365j09269j09244j09904j10316
53274D244501j09482j07680j05951j04566j02821j00447r8270r6881r5451r2834
53264C230118q9318q6163q3709q1095p7740p3834o9388o4132n8567n3729m9621
53253B442822m5191m0313l6313l3818l1538k8005k3373j8679j4503j1206r187
53242B150696p924n946k873j58J326L082O808J1671J5504J7785J9504K0967K1750
$$ y = [4019577, 4125506, 4232164, 4338704, 4444110, 4547769, 4649376, 4748561, 4845013, 4938654, 5029110, 5115251, 5195801, 5270059, 5337385, 5396648, 5447353, 5491011, 5529935, 5564447, 5592554, 5612753, 5625871, 5633350, 5634831, 5628522, 5613394, 5589890, 5558655, 5519459, 5471507, 5414268, 5347878, 5273036, 5190551, 5100795, 5003829, 4900384, 4792599, 4683234, 4573965, 4464721, 4354817, 4244501, 4135019, 4027339, 3921388, 3816822, 3714001, 3613554, 3515284, 3418403, 3322952, 3230118, 3140800, 3054637, 2970928, 2889833, 2812093, 2738259, 2668871, 2604739, 2546172, 2492443, 2442822, 2397631, 2357318, 2321005, 2287187, 2255649, 2227644, 2204271, 2185592, 2171089, 2159883, 2150696, 2142772, 2136826, 2133953, 2133795, 2135121, 2138203, 2145011, 2156682, 2172186, 2189971, 2209475, 2230442, 2252192]
53229B252192K2295K3521K5059K5917K6758K9434L4111L8745M1782M3648M5170
53218B608632M6280M6922M7566M8035M7200M4684M1673L9347L7625L6158L5224
53207C079346L4621L2927K9157K4452K0804J8541J6320J3294R978O999M083P51
53195C291273k766o010r287j3474j8749k4048k8287l1771l5733m0537m5180m8907
53183B986524n2334n6289o0263o3005o4185o4313o3527o1689n9551n8317n7933
53172B325118n7052n5129n3181n2034n1099m9744m8706m8916m9774m9882m9012
53161A760589m8045m7101m5173m1955l8800l7127l6504l5263l2768l0130k8533
53150A339190k7615k6202k4119k2414k1747k1467k0725j9891k0081k1568k3239
$$ y = [2252192, 2274487, 2298008, 2323067, 2348984, 2375742, 2405176, 2439287, 2478032, 2519814, 2563462, 2608632, 2654912, 2701834, 2749400, 2797435, 2844635, 2889319, 2930992, 2970339, 3007964, 3044122, 3079346, 3113967, 3146894, 3176051, 3200503, 3221307, 3239848, 3256168, 3269462, 3279440, 3286439, 3290522, 3291273, 3288507, 3282497, 3273210, 3259736, 3240987, 3216939, 3188652, 3156881, 3121148, 3080611, 3035431, 2986524, 2934190, 2877901, 2817638, 2754633, 2690448, 2626135, 2562608, 2500919, 2441368, 2383051, 2325118, 2268066, 2212937, 2159756, 2107722, 2056623, 2006879, 1958173, 1909257, 1859483, 1809601, 1760589, 1712544, 1665443, 1620270, 1578315, 1539515, 1502388, 1465884, 1430621, 1397853, 1367723, 1339190, 1311575, 1285373, 1261254, 1238840, 1217093, 1195626, 1174901, 1155010, 1134929, 1113361, 1090122]
53139A090122k3662k2390k0222j8484j7848j7744j7184j6219j6014j7078j8251
53128H85026j8208j7331j7097j7841j8381j7851j6900j6587j6922j6982j6085
53117F94841j4483j3115j2780j3381j3984j3834j3064j2179j1338j0646j0614
53106E55423j1468j2309j2025j0849j0007r916r892r679r922j0664j0694r250
53094D28748p330o362o152n304l420j915k382m722p128p773o444m521l399l159
53080C58737k906k127j151m53j59k54o41r71r84j019j467j889j607j135j688k977
53064C37309k996r42J091P82j093j684r9J566J369j1o96j53P28J170R45j78k182
53047C34926m049m429l316k187k090k363j820m74P50J518K205K661K086N43n11
$$ y = [1090122, 1066460, 1044070, 1023848, 1005364, 987516, 969772, 952588, 936369, 920355, 903277, 885026, 866818, 849487, 832390, 814549, 796168, 778317, 761417, 744830, 727908, 710926, 694841, 680358, 667243, 654463, 641082, 627098, 613264, 600200, 588021, 576683, 566037, 555423, 543955, 531646, 519621, 508772, 498765, 488849, 478957, 469278, 459356, 448692, 437998, 428748, 421418, 415056, 408904, 403600, 400180, 398265, 395883, 391161, 384033, 376260, 369816, 365295, 361896, 358737, 355831, 353704, 352553, 352100, 351941, 351687, 351046, 350075, 349091, 348072, 346605, 344716, 343109, 341974, 340286, 337309, 334313, 333371, 334462, 335244, 334151, 332467, 332368, 333934, 335303, 335292, 334596, 334443, 335171, 336341, 337286, 337108, 334926, 330877, 326448, 323132, 320945, 318855, 316492, 314672, 314198, 314948, 316466, 318671, 321332, 323418, 323961, 323450]
53032C23450N7J385J570J09j363r03J625M449N672N032L738K650J187j365m004
53017C43289m783l551k473l275n203o654p354p640o817m289j655j380l350m828
53003B80037m335l559m480o309o738n190l309k644l023l218k471j241o21j056
52989B31843j665j355m54l21j220j740r34O7m18k176l407l064j886j089j039j400
52973B09742j799j941j536o41O9k66j714l153l228j843m27m10j748l336m348m565
52957A78856l745j848K05J078O52J31K19K06o15j707k210k260k515k951l013k475
52941A58008j423J56J856K497J287q02j799j016K62M30o10j510r69Q26K222J784
52925A61199P6p84K42J688J573J22o72M3Q65K39j459k526j876J59K464L880L677
$$ y = [323450, 323507, 324892, 326462, 326571, 325208, 324305, 325930, 330379, 336051, 341083, 344821, 347471, 348658, 347293, 343289, 338506, 334955, 332482, 329207, 324004, 317350, 309996, 302356, 295539, 291250, 289595, 288215, 284865, 280037, 275702, 272143, 267663, 261354, 254616, 249426, 246117, 243473, 240450, 237232, 234761, 233520, 232899, 231843, 230178, 228823, 228369, 228048, 226828, 225088, 224154, 224221, 223803, 221627, 218220, 215156, 213270, 212181, 211142, 209742, 207943, 206002, 204466, 203825, 203894, 203628, 201914, 198761, 195533, 193690, 193263, 192853, 191105, 187769, 183421, 178856, 175111, 173263, 173468, 174546, 175198, 175329, 175548, 175754, 175139, 173432, 171222, 168962, 166447, 163496, 160483, 158008, 156585, 156741, 158597, 161094, 162381, 161579, 159780, 158764, 159026, 159456, 158846, 157336, 156367, 157193, 159415, 161199, 161275, 160491, 160733, 162421, 163994, 164116, 163444, 163487, 164352, 164591, 163132, 160606, 158730, 158889, 161353, 165233, 168910]
52908A68910K006N2o56N28K687L924K933K79k006k312q48R76K215K960L526L807
52892A88981L669L367L168K856K051R43M00J245L415N985P995R198R800R638Q133
52877B60844N361K660J502J935K673K708K127J315J36j537l019l275k190q58n29
52862B69853j452k840l712l757l444l333l334k860j751p63o90j279j546j179r47
52847B36966j482k275k412j906j593j883k355k600k738k822k450j447m90m69j343
52832B08701k121j946q43N38J617K259K623K820K654J828L46j388k779l165k046
52817B09098K19K121K146M83j197j804j788j646p27J467L674M042K579J105P53
52802B20525P97K02p89j144m71O39J285J033L20J04P47J430J147J32m07J00R92
$$ y = [168910, 170916, 170968, 170312, 170840, 173527, 177451, 180384, 180663, 178657, 176345, 175497, 176473, 178688, 181648, 185174, 188981, 192650, 196017, 199185, 202041, 204092, 205035, 205435, 206680, 210095, 216080, 224075, 233273, 243073, 252711, 260844, 266205, 268865, 270367, 272302, 274975, 277683, 279810, 281125, 281261, 279724, 276705, 273430, 271240, 270382, 269853, 268401, 265561, 261849, 258092, 254648, 251315, 247981, 245121, 243370, 242607, 241917, 240638, 239092, 237913, 236966, 235484, 233209, 230797, 228891, 227298, 225415, 223060, 220460, 217722, 214900, 212450, 211003, 210513, 210044, 208701, 206580, 204634, 203791, 204329, 205946, 208205, 210828, 213648, 216302, 218130, 218476, 217088, 214309, 211144, 209098, 209317, 211438, 213584, 214067, 212870, 211066, 209278, 207632, 206905, 208372, 212046, 216088, 218667, 219772, 220525, 221322, 221524, 220735, 219591, 219120, 219759, 221044, 222077, 222397, 222501, 223248, 224678, 225825, 225957, 225550, 225650, 226642]
52785B26642J420J241Q52P60J393K616L525L418K900K998L432K909J321K53P38
52770B56418J775J875J112O76J083J813K256K232J863J544J740K332K510J764
52756B80993O25j5R5N40P09L8j658l601m437l760k718k586l282l803l608k934
52740B50598k243k023k692m085n273n425m668l732l176l214l804m455m525m039
52726A97244l607l195k034k67M39r20k855l123j777q81j403k045j443j42L48l71
52710A73968j403j897j919j951k100k022j575j131j086j256j207r36o22M4J267
52695A56174J992P20k089l950l470k172k133l014l096k116j247q42k64K95j31
52680A34657j162j103L54J168k26k565l415k260p11k61q53j481j315k26J221K206
$$ y = [226642, 228062, 229303, 230155, 230915, 232308, 234924, 238449, 241867, 244767, 247765, 251197, 254106, 255427, 255680, 256418, 258193, 260068, 261180, 261856, 262939, 264752, 267008, 269240, 271103, 272647, 274387, 276719, 279229, 280993, 281618, 281603, 281698, 282238, 282947, 282985, 281327, 277726, 273289, 269529, 266811, 264225, 260943, 257140, 253532, 250598, 248355, 246332, 243640, 239555, 234282, 228857, 224189, 220457, 217281, 214067, 210263, 205808, 201283, 197244, 193637, 190442, 188408, 188141, 188580, 187660, 184805, 181682, 179905, 179024, 177621, 175576, 174133, 173991, 174339, 173968, 172565, 170668, 168749, 166798, 164698, 162676, 161101, 159970, 158884, 157628, 156421, 155485, 154863, 154907, 156174, 158166, 158886, 156797, 152847, 149377, 147205, 145072, 142058, 138962, 136846, 135599, 134757, 134493, 134788, 134657, 133495, 132392, 132746, 133914, 133688, 131123, 127708, 125448, 124737, 124476, 123623, 122142, 120827, 120601, 121822, 124028]
52664A24028K288J567L13j224k559l052k624j952j676j752j848j979k280k347
52650A04903j378P66K946L576K279M19m11k89o11j824k514j403O88J900J853J664
52634A12564J754J186l78j476n65J815L626L729K821K145K010J869J368Q97J088
52619A34453J984K844K858K039J331J715L155M460M462L423K848L481M056K958
52605A76067P21l94M50J530J191K02J85R37Q94l65j778k632l159l367k909k247
52589A65326k432l328l522k531j725k257l312l420k555j731j133P7K053L512L025
52574A46047O35k122l608l402k301j395j275j944k883l070j646R23K900L128K292
52559A32279J603Q92p55k870l675k414l62R20J216J120R48Q23J043J672K220K195
$$ y = [124028, 126316, 127883, 128196, 126972, 124413, 121361, 118737, 116785, 115109, 113357, 111509, 109530, 107250, 104903, 103525, 104291, 107237, 110813, 113092, 113511, 113100, 112811, 112200, 110376, 107862, 106459, 107147, 109047, 110900, 112564, 114318, 115504, 115126, 113650, 113085, 114900, 118526, 122255, 125076, 127221, 129231, 131100, 132468, 133365, 134453, 136437, 139281, 142139, 144178, 145509, 147224, 150379, 154839, 159301, 162724, 165572, 169053, 173109, 176067, 176788, 176394, 176844, 178374, 179565, 179767, 179952, 180889, 181783, 181418, 179640, 177008, 173849, 170482, 167573, 165326, 162894, 159566, 156044, 153513, 151788, 149531, 146219, 142799, 140244, 138513, 137380, 137457, 139510, 143022, 146047, 146682, 144560, 140952, 137550, 135249, 133854, 132579, 130635, 127752, 124682, 123036, 123959, 126859, 129987, 132279, 133882, 134774, 134019, 131149, 127474, 125060, 124698, 125618, 126834, 127954, 128902, 129725, 130768, 132440, 134660, 136855]
52543A36855J549M28q74j603r69P15K194K847L341M221M750L899J912J55l80J09
52527A59149N70R1j142j815r02Q95J872J464O53K48J0p9P90K621L754K943J522
52510A72644J940M493O865O883M636J751m23j523j807j562q05M41J665K012J190
52495A98400q2q14o56J28J110J801J756J054L04j38n33j010j129o64k10l64p46
52478A98207m73N89J758K400K406J968J322N86l23j272j460j16K100L346K773
52463B13811J550J080J221J105P55O79O30J44k97o6J67o32j774j457L63J523N74
52446B19376j275j891p32J086K310K341J399N55R19K044K029l6k422k647n85J406
52430B23877J357k73j474p36J871M823N985M062M1l204l400j113R88J086j92j149
$$ y = [136855, 138404, 138832, 137958, 136355, 135386, 136101, 138295, 141142, 144483, 148704, 153454, 157353, 159265, 159420, 159040, 159149, 159719, 159810, 158668, 156853, 155951, 156846, 158718, 160182, 160835, 161083, 161093, 161014, 161804, 164425, 168179, 171122, 172644, 174584, 179077, 185942, 192825, 197461, 199212, 198789, 197266, 195459, 193897, 193092, 193533, 195198, 197210, 198400, 198318, 197504, 196848, 196976, 198086, 199887, 201643, 202697, 203001, 202863, 202330, 201320, 200191, 199527, 199317, 198953, 198207, 197734, 198323, 200081, 202481, 204887, 206855, 208177, 208763, 208440, 207168, 205708, 205592, 207692, 211038, 213811, 215361, 216441, 217662, 218767, 219522, 220201, 220831, 220975, 220678, 220612, 220779, 220147, 218373, 216916, 217279, 218802, 219376, 218101, 216210, 215478, 216564, 218874, 221215, 222614, 223169, 224088, 226132, 228161, 228125, 225703, 223056, 222471, 223877, 225234, 224961, 223487, 222751, 224622, 229445, 235430, 239492, 239533, 236329, 232929, 231816, 232804, 233890, 233698, 232549]
52414B32549j139n85L56J916L594M219L568K837K865K930K123J042Q29J232J003
52399B59339N8l80J71P15N81M85J094J674J345O97Q57J481J079o25k026j660J0
52382B64895J315J235n5j778l059l185k164r19l39k53M3L44l16j847k549j261
52366B50107P62J341L60k21O57J645J135m04j328j259j252j746j712j80K209L787
52350B53901L673K612K020K337K555J580j43q99K35K285L633L751L090J981N87
52335B83198n67r72r36j085j231p33J58M19o6r1J209L180M662N223M815L183O35
52318C01001j306j198M95J917K088J757J829J999J496M68k14k12p8k66m25Q6J388
$$ y = [232549, 231410, 230825, 231181, 233097, 236691, 240910, 244478, 247315, 250180, 253110, 255233, 256275, 257104, 258336, 259339, 259397, 259017, 259188, 259903, 260484, 260969, 262063, 263737, 265082, 265779, 266636, 268117, 269196, 268571, 266545, 264885, 264895, 266210, 267445, 267390, 265612, 262553, 259368, 257204, 256285, 255946, 255693, 255736, 256080, 255764, 253917, 251368, 250107, 250869, 252210, 252570, 252349, 253006, 254651, 255786, 255382, 254054, 252795, 251543, 249797, 248085, 247905, 250114, 253901, 257574, 260186, 262206, 264543, 267098, 268678, 268535, 267636, 267871, 270156, 273789, 277540, 280630, 282611, 283198, 282631, 281659, 280723, 279638, 278407, 277674, 277832, 278251, 278185, 278094, 279303, 282483, 287145, 292368, 297183, 300366, 301001, 299695, 298497, 298992, 300909, 302997, 304754, 306583, 308582, 310078, 310546, 310332, 310120, 310042, 309776, 309351, 309437, 310825]
$$ [...]
##END NTUPLES=NMR SPECTRUM
##END=
