##TITLE=coffee_type TOLI01-ROVE100E_60-40%
COFFEE_meoh_noesyp64 COFFEE_meoh {C:\Bruker\TOPSPIN} Administrator 14
##JCAMPDX= 6.0         $$ Bruker NMR JCAMP-DX V2.0
##DATA TYPE= NMR SPECTRUM
##DATA CLASS= NTUPLES
##ORIGIN= Bruker BioSpin GmbH
##OWNER= Administrator
$$ 1.72 TOPSPIN		Version 2.1
$$ 2012-05-18 15:48:52.214 -0700  Administrator@X
$$ Compression mode = diff/dup
##.OBSERVE FREQUENCY= 400.13188235
##.OBSERVE NUCLEUS= ^1H
##.ACQUISITION MODE= SIMULTANEOUS (DQD)
##.ACQUISITION SCHEME= undefined
##.AVERAGES= 64
##.DIGITISER RES= 22
##SPECTROMETER/DATA SYSTEM= spect
##.PULSE SEQUENCE= noesygpps1d.comp
##.SOLVENT NAME= COFFEE_meoh
##.SHIFT REFERENCE= INTERNAL, COFFEE_meoh, 1, 14.98061
##AUDIT TRAIL= $$ (NUMBER, WHEN, WHO, WHERE, PROCESS, VERSION, WHAT)
$$ ##TITLE= Audit trail, TOPSPIN		Version 2.1
$$ ##JCAMPDX= 5.01
$$ ##ORIGIN= Bruker BioSpin GmbH
$$ ##OWNER= Administrator
$$ $$ C:\Bruker\TOPSPIN/data/Administrator/nmr/12-COFFEE-2402/162/pdata/1/auditp.txt
$$ ##AUDIT TRAIL=  $$ (NUMBER, WHEN, WHO, WHERE, PROCESS, VERSION, WHAT)
(   1,<2012-02-25 00:08:55.156 -0500>,<Administrator>,<TOPSPIN>,<go>,<TOPSPIN 2.1>,
      <created by zg
	started at 2012-02-24 23:57:24.937 -0500,
	POWCHK enabled, PULCHK disabled,
       configuration hash MD5:
       B0 76 FB 9C 50 81 44 7D 18 B3 26 32 4E 60 AD 96
       data hash MD5: 64K
       7E 86 48 96 8B 11 F6 48 D7 B3 E3 27 FD 96 95 CC>)
(   2,<2012-02-25 00:08:57.844 -0500>,<Administrator>,<TOPSPIN>,<proc1d>,<TOPSPIN 2.1>,
      <Start of raw data processing
       efp LB = 0.3 FT_mod = 6 PKNL = 1 PHC0 = 0 PHC1 = 0 SI = 128K 
       data hash MD5: 128K
       30 EF 6C 12 D3 A7 73 A7 ED 14 03 AC F2 28 E6 23>)
(   3,<2012-02-25 00:08:59.734 -0500>,<Administrator>,<TOPSPIN>,<proc1d>,<TOPSPIN 2.1>,
      <pk PHC0 = 25.05981 PHC1 = 0 
       data hash MD5: 128K
       75 D1 54 47 81 3C F7 9D 42 11 F6 C8 B5 D5 8B 33>)
(   4,<2012-02-25 00:08:59.953 -0500>,<Administrator>,<TOPSPIN>,<proc1d>,<TOPSPIN 2.1>,
      <abs ABSG = 1 
       data hash MD5: 128K
       94 E6 C1 15 C6 E4 9D 65 C5 97 AE C2 68 0D 95 AA>)
(   5,<2012-02-25 00:09:00.062 -0500>,<Administrator>,<TOPSPIN>,<proc1d>,<TOPSPIN 2.1>,
      <abs ABSG = 2 
       data hash MD5: 128K
       53 D8 F7 E9 24 E0 E0 91 CA 5D 82 53 BF 9D C8 4E>)
(   6,<2012-02-25 00:09:00.109 -0500>,<Administrator>,<TOPSPIN>,<proc1d>,<TOPSPIN 2.1>,
      <abs ABSG = 3 
       data hash MD5: 128K
       85 8D 80 20 FE D6 EC 2D B9 C7 88 80 32 BB 78 0F>)
(   7,<2012-02-25 00:09:00.187 -0500>,<Administrator>,<TOPSPIN>,<proc1d>,<TOPSPIN 2.1>,
      <abs ABSG = 4 
       data hash MD5: 128K
       30 5F 68 36 9D 83 FB 06 E7 9F 88 36 37 0F C1 8C>)
(   8,<2012-02-25 00:09:00.234 -0500>,<Administrator>,<TOPSPIN>,<proc1d>,<TOPSPIN 2.1>,
      <abs ABSG = 5 
       data hash MD5: 128K
       73 8A C0 84 CB 1F 17 38 5C 35 88 81 05 45 7A 60>)
(   9,<2012-02-25 00:09:00.359 -0500>,<Administrator>,<TOPSPIN>,<audit>,<TOPSPIN 2.1>,
      <user comment:
       ICON-NMR User ID: Administrator
$$ [...]
150 150 150 150 150 150 150 150
##$TP07= 0
##$TPNAME0= <>
##$TPNAME1= <>
##$TPNAME2= <>
##$TPNAME3= <>
##$TPNAME4= <>
##$TPNAME5= <>
##$TPNAME6= <>
##$TPNAME7= <>
##$TPOAL= (0..7)
0.5 0.5 0.5 0.5 0.5 0.5 0.5 0.5
##$TPOFFS= (0..7)
0 0 0 0 0 0 0 0
##$TUNHIN= 0
##$TUNHOUT= 0
##$TUNXOUT= 0
##$USERA1= <user>
##$USERA2= <user>
##$USERA3= <user>
##$USERA4= <user>
##$USERA5= <user>
##$V9= 5
##$VALIST= <valist>
##$VCLIST= <CCCCCCCCCCCCCCC>
##$VD= 0
##$VDLIST= <DDDDDDDDDDDDDDD>
##$VPLIST= <PPPPPPPPPPPPPPP>
##$VTLIST= <TTTTTTTTTTTTTTT>
##$WBST= 1024
##$WBSW= 4
##$XGAIN= (0..3)
0 0 0 0
##$XL= 0
##$YL= 0
##$YMAX_a= 13478244
##$YMIN_a= -6227044
##$ZGOPTNS= <>
##$ZL1= 120
##$ZL2= 120
##$ZL3= 120
##$ZL4= 120
##$ABSF1= 14.98061
##$ABSF2= -5.57192
##$ABSG= 5
##$ABSL= 3
##$ALPHA= 0
##$AQORDER= 0
##$ASSFAC= 0
##$ASSFACI= 0
##$ASSFACX= 0
##$ASSWID= 0
##$AUNMP= <proc_prof1d_extract>
##$AXLEFT= 0
##$AXNAME= <>
##$AXNUC= <1H>
##$AXRIGHT= 0
##$AXTYPE= 0
##$AXUNIT= <>
##$AZFE= 0.1
##$AZFW= 0.1
##$BCFW= 0
##$BC_mod= 0
##$BYTORDP= 0
##$COROFFS= 0
##$CY= 15
##$DATMOD= 1
##$DC= 0
##$DFILT= <>
##$DTYPP= 0
##$F1P= 0
##$F2P= 0
##$FCOR= 0.5
##$FTSIZE= 131072
##$FT_mod= 6
##$GAMMA= 0
##$GB= 0
##$INTBC= 1
##$INTSCL= 1
##$ISEN= 128
##$LB= 0.3
##$LEV0= 0
##$LPBIN= 0
##$MAXI= 10000
##$MC2= 0
##$MEAN= 0
##$ME_mod= 0
##$MI= 0
##$NCOEF= 0
##$NC_proc= -3
##$NLEV= 6
##$NOISF1= 0
##$NOISF2= 0
##$NSP= 0
##$NTH_PI= 0
##$NZP= 0
##$OFFSET= 14.98061
##$PC= 1
##$PHC0= 25.05981
##$PHC1= 0
##$PH_mod= 1
##$PKNL= yes
##$PPARMOD= 0
##$PPDIAG= 0
##$PPIPTYP= 0
##$PPMPNUM= 2147483647
##$PPRESOL= 1
##$PSCAL= 4
##$PSIGN= 0
##$PYNMP= <proc.py>
##$REVERSE= no
##$SF= 400.13
##$SI= 131072
##$SIGF1= 0
##$SIGF2= 0
##$SINO= 400
##$SIOLD= 131072
##$SPECTYP= <>
##$SREGLST= <1H.CDCl3>
##$SSB= 0
##$STSI= 131072
##$STSR= 0
##$SW_p= 8223.68421052632
##$SYMM= 0
##$S_DEV= 0
##$TDeff= 65536
##$TDoff= 0
##$TI= <>
##$TILT= no
##$TM1= 0
##$TM2= 0
##$TOPLEV= 0
##$USERP1= <user>
##$USERP2= <user>
##$USERP3= <user>
##$USERP4= <user>
##$USERP5= <user>
##$WDW= 1
##$XDIM= 131072
##$YMAX_p= 490638283
##$YMIN_p= -345494360
##$CURPLOT= <Network HP LaserJet P1505>
##$CURPRIN= <$Network HP LaserJet P1505>
##$DFORMAT= <normdp>
##$LAYOUT= <+/1D_H.xwp>
##$LFORMAT= <normlp>
##$PFORMAT= <normpl>
##$SURQMSG= 1
$$ End of Bruker specific parameters
$$ ---------------------------------
##NTUPLES= NMR SPECTRUM
##VAR_NAME=  FREQUENCY,     SPECTRUM/REAL,   SPECTRUM/IMAG
##SYMBOL=    X,             R,               I
##VAR_TYPE=  INDEPENDENT,   DEPENDENT,       DEPENDENT
##VAR_FORM=  AFFN,          ASDF,            ASDF
##VAR_DIM=   131072,        131072,          131072
##UNITS=     HZ,            ARBITRARY UNITS, ARBITRARY UNITS
##FACTOR=    0.0627417313425165, 1,          1
##FIRST=     8223.62146879498, -9340,        -89861
##LAST=      0,             -3879,           -94677
##MIN=       0,             -345494360,      0
##MAX=       8223.62146879498, 490638283,    0
$$ Real data points
##PAGE= N=1
##DATA TABLE= (X++(R..R)), XYDATA
$$ [...]
60716A407450R915P511N154M089M242M275L365K023R42R3q26j928l209m347m514
60701A434235l378k060j982k904l402l065k745k770k667k746m040o175p171o169
60687A382961m693m353m813n030n027n247n283m588l578l109l408m280n536o670
60673A317346o832n778m207k787j652r80j054j605k084k603l398l690k824k219
60659A275633l870o707p255m560j682j075j455j000p70k388m651n449n341o297
60645A223133q120r112r414j0723j3176j5222j6360j7391j8196j7824j6843j7010
60633A053742j8241j8329j6278j3713j2268j1640j1030j0691j0917j0956j0044
60622I09635q502o926n225l313j837j373j417q99N71K317L210K656J387J033K407
$$ y = [1407450, 1417365, 1424876, 1430030, 1434119, 1438361, 1442636, 1446001, 1448024, 1448966, 1449059, 1448233, 1446305, 1443096, 1438749, 1434235, 1430857, 1428797, 1426815, 1423911, 1420509, 1417444, 1414699, 1411929, 1409262, 1406516, 1402476, 1396301, 1389130, 1382961, 1378268, 1373915, 1369102, 1364072, 1359045, 1353798, 1348515, 1343927, 1340349, 1337240, 1333832, 1329552, 1324016, 1317346, 1310514, 1304736, 1300529, 1297742, 1296090, 1295110, 1294056, 1292451, 1290367, 1287764, 1284366, 1280676, 1277852, 1275633, 1271763, 1265056, 1257801, 1253241, 1251559, 1250484, 1249029, 1248029, 1247259, 1244871, 1240220, 1234771, 1229430, 1223133, 1215013, 1205901, 1196487, 1185764, 1172588, 1157366, 1141006, 1123615, 1105419, 1087595, 1070752, 1053742, 1035501, 1017172, 1000894, 987181, 974913, 963273, 952243, 941552, 930635, 919679, 909635, 901133, 894207, 888982, 885669, 883832, 882459, 881042, 880143, 880714, 883031, 886241, 888897, 890284, 891317, 893724]
60607H93724M444N646O107P118R036J0861J1878J2422J2741J2500J1806J1601
60595A009884J2340J3191J3264J2913J3148J4208J5315J5737J5650J5943J7258
60584A168851J9137K0298J9919J8324J6228J4034J2386J2506J4801J7517J8124
60573A352125J6165J3651J2531J2677J2499J0619O734J782k445m669n518o924
60561A419227r845j3227j5413j5976j5757j5711j6086j6415j5894j3989j0953
60550A259961p800n684n081n252m628k301Q12L022M212N981R048J1875J2889J2838
60536A289892J3405J4459J4396J2620R862O574K921K09O8J998L607L794L710M176
60522A381691M273L615L873O300R256J0083Q565O647N366M011K153O12k18j446
$$ y = [893724, 898168, 903814, 909921, 917039, 926075, 936936, 948814, 961236, 973977, 986477, 998283, 1009884, 1022224, 1035415, 1048679, 1061592, 1074740, 1088948, 1104263, 1120000, 1135650, 1151593, 1168851, 1187988, 1208286, 1228205, 1246529, 1262757, 1276791, 1289177, 1301683, 1316484, 1334001, 1352125, 1368290, 1381941, 1394472, 1407149, 1419648, 1430267, 1437001, 1438783, 1436338, 1431669, 1426151, 1419227, 1409382, 1396155, 1380742, 1364766, 1349009, 1333298, 1317212, 1300797, 1284903, 1270914, 1259961, 1252161, 1246477, 1241396, 1236144, 1231516, 1229215, 1230027, 1233049, 1237261, 1243242, 1252290, 1264165, 1277054, 1289892, 1303297, 1317756, 1332152, 1344772, 1354634, 1361208, 1364129, 1364338, 1364406, 1366404, 1370011, 1373805, 1377515, 1381691, 1385964, 1389579, 1393452, 1399752, 1409008, 1419091, 1427656, 1434303, 1439669, 1443680, 1445833, 1446445, 1446227, 1444781]
60508A444781m134p498r735j0403j0878j2179j3209j2132r206p032p470r352j0112
60495A321441q931p014n289l522j701o42o47p72o8J497L930P700J2399J6090J7343
60480A351814J7301J8389K1372K4946K8067L1295L5635M1217M7628N4647O2011
60469A734322O9072P5398Q1303Q7078R1733R3191Q9902Q1913P0325N6301M0951
60458B571489K5634J1631k83r393j4406j4235r609l054L128Q163J1904J3761J3385
60445B608115J1569R364O856L867J365Q29K414N066Q543J3976K1951L1237M0245
60432B765397M9015N8976P1013Q4379R7357J08651J18201J26762J34716J41541
60422C756008J46606J50182J53286J57079J63147J73885J91422K16007K46198
$$ y = [1444781, 1440647, 1433149, 1423414, 1413011, 1402133, 1389954, 1376745, 1364613, 1355407, 1348375, 1340905, 1331553, 1321441, 1312510, 1305496, 1300207, 1296685, 1294984, 1294342, 1293695, 1292923, 1292855, 1294352, 1298282, 1305982, 1318381, 1334471, 1351814, 1369115, 1387504, 1408876, 1433822, 1461889, 1493184, 1528819, 1570036, 1617664, 1672311, 1734322, 1803394, 1878792, 1960095, 2047173, 2138906, 2232097, 2321999, 2403912, 2474237, 2530538, 2571489, 2597123, 2608754, 2608471, 2599078, 2584672, 2570437, 2560828, 2557774, 2560902, 2569065, 2580969, 2594730, 2608115, 2619684, 2629048, 2635904, 2639771, 2641136, 2641965, 2644379, 2649445, 2657988, 2671964, 2693915, 2725152, 2765397, 2814412, 2873388, 2944401, 3028780, 3126137, 3234788, 3352989, 3479751, 3614467, 3756008, 3902614, 4052796, 4206082, 4363161, 4526308, 4700193, 4891615, 5107622, 5353820]
60413E353820K80739L19528L62879M10682M62072N14409N61869N95812O07378
60404I469188N89904N39604M55640L40541K00205M3392j18306k70741m00073m97557
60394A0351797n61822n96535o06786n98034n76467n47846n15472m80041m41664
60385E427130m01461l61520l24148k91174k63135k38868k16380j94459j73374
60376B962611j54163j37493j23177j10568r9319q9732q2201p6364p1261o6321
60366A952012o1707n7504n3330m9109m5508m2931m0620l7652l4333l1679k9681
60355A467958k7269k4177k1623k0574k0300j9452j7922j6543j5455j3984j2150
60344A258509j0992j0869j0604r178p379o679o913o443m590k618j941k349k544
$$ y = [5353820, 5634559, 5954087, 6316966, 6727648, 7189720, 7704129, 8265998, 8861810, 9469188, 10059092, 10598696, 11054336, 11394877, 11595082, 11638474, 11520168, 11249427, 10849354, 10351797, 9789975, 9193440, 8586654, 7988620, 7412153, 6864307, 6348835, 5868794, 5427130, 5025669, 4664149, 4340001, 4048827, 3785692, 3546824, 3330444, 3135985, 2962611, 2808448, 2670955, 2547778, 2437210, 2337891, 2248159, 2165958, 2089594, 2018333, 1952012, 1890305, 1832801, 1779471, 1730362, 1684854, 1641923, 1601303, 1563651, 1529318, 1497639, 1467958, 1440689, 1416512, 1394889, 1374315, 1354015, 1334563, 1316641, 1300098, 1284643, 1270659, 1258509, 1247517, 1236648, 1226044, 1216866, 1209487, 1202808, 1195895, 1189452, 1184862, 1182244, 1180303, 1177954, 1175410]
60331A175410j729p9J772L185L778L629K957J697j05j640k100k072k958m760n892
60316A171093n767n991p813r911j0170q599o799n451m119k892k212j474K06J938
60302A102039J784j97j683j351m57l79l68Q68K745L483K544J070K57M11J357K733
60286A114856L737L627K740K605M383P320R327R303Q393Q368R246R555Q720P781
60272A209961P392O715N294M496N715Q145R925J0710J1528J2705J3552J3724J3445
60259A333307J2792J1913J1214R981O104q00p151r006p253o320q043r983r962
60246A326793q838p933o995o109o585q251q464n893k915k134k534j540P72K135
60232A261509J663N62r9l23k52N3K69M72J519L606N328N446M634M357M980O185
$$ y = [1175410, 1173681, 1173602, 1175374, 1178559, 1182337, 1185966, 1188923, 1190620, 1190515, 1188875, 1186775, 1184703, 1181745, 1176985, 1171093, 1165326, 1159335, 1151522, 1141611, 1131441, 1122842, 1116043, 1110592, 1106473, 1103581, 1101369, 1099895, 1100101, 1102039, 1103823, 1103626, 1101943, 1100592, 1100135, 1099756, 1099388, 1100256, 1103001, 1106484, 1109028, 1110098, 1110355, 1110766, 1112123, 1114856, 1118593, 1122220, 1124960, 1127565, 1131948, 1139268, 1148595, 1157898, 1166291, 1174659, 1183905, 1193460, 1202180, 1209961, 1217353, 1224068, 1229362, 1233858, 1239573, 1247718, 1257643, 1268353, 1279881, 1292586, 1306138, 1319862, 1333307, 1346099, 1358012, 1369226, 1379207, 1385311, 1384511, 1377360, 1368354, 1361101, 1354781, 1346738, 1336755, 1326793, 1317955, 1310022, 1303027, 1296918, 1290333, 1282082, 1273618, 1267725, 1264810, 1262676, 1260142, 1258602, 1259374, 1261509, 1263172, 1263734, 1263635, 1263312, 1263060, 1263113, 1263382, 1263854, 1265373, 1268979, 1274307, 1279753, 1284387, 1288744, 1293724, 1299909]
60216A299909Q079J0321J1420J0535R048Q727R463J0404J1995J4751J7216J7710
60204A439578J7248J8167K0352K1592K1490K2055K4190K6494K8362L1493L6893
60193A707914M2642M6387M8544N1237N5255N9765O4315O9446P5401Q1580Q7396
60182B389882R2950R8699J04896J11458J18077J24375J30070J34848J38025J38635
60172C581915J36155J31128J24914J18516J11541J02475R0356P6013O1297M7240
60162D581550L3707K0656Q727j643j0596j7912k2786k5139k6085k6299k4925k1073
60150D468182j5299q566n99R320K0700L2455M4590N7904P2238Q6323R9150J10312
60138D976710J19258J25408J28881J30082J28774J24529J17697J08800R7452Q3057
$$ y = [1299909, 1307988, 1318309, 1329729, 1340264, 1349312, 1358039, 1367502, 1377906, 1389901, 1404652, 1421868, 1439578, 1456826, 1474993, 1495345, 1516937, 1538427, 1560482, 1584672, 1611166, 1639528, 1671021, 1707914, 1750556, 1796943, 1845487, 1896724, 1951979, 2011744, 2076059, 2145505, 2220906, 2302486, 2389882, 2482832, 2581531, 2686427, 2797885, 2915962, 3040337, 3170407, 3305255, 3443280, 3581915, 3718070, 3849198, 3974112, 4092628, 4204169, 4306644, 4397000, 4473013, 4534310, 4581550, 4615257, 4635913, 4644640, 4642997, 4632401, 4614489, 4591703, 4566564, 4540479, 4514180, 4489255, 4468182, 4452883, 4444317, 4443718, 4453038, 4473738, 4506193, 4550783, 4608687, 4680925, 4767248, 4866398, 4976710, 5095968, 5221376, 5350257, 5480339, 5609113, 5733642, 5851339, 5960139, 6057591, 6140648]
60128F140648O6287M8495L0112J1067p594k4261l8818n2447o5098p4801p9915
60117E953675q0681p8191p3135o5885n6491m4218k8440j0446P139K3274L9338
60106E585939N6416P3309Q8303J01153J11680J17645J16399J08402R7276Q5863
60096F542385P3721N9087M2097K5007R855k965j3900k3066l0241l5175l7193l5088
60084F574524k8346j8259o708O060K1361L9617N9509Q0128J02360J26881J52194
60073G109321J76397K00049K25315K52647K80209L06644L32409L57961L82205
60064I623157M03367M20085M30956M34373M29734M17985M00140L75957L44779
60055A3280533L06853K63012K13795J59846J02833M4796j3337p1666j29539j84494
$$ y = [6140648, 6206935, 6255430, 6285542, 6296609, 6289015, 6264754, 6225936, 6173489, 6108391, 6033590, 5953675, 5872994, 5794803, 5721668, 5655783, 5599292, 5555074, 5526634, 5516188, 5523327, 5546601, 5585939, 5642355, 5715664, 5803967, 5905120, 6016800, 6134445, 6250844, 6359246, 6456522, 6542385, 6616106, 6675193, 6717290, 6742297, 6752152, 6749187, 6735287, 6712221, 6681980, 6646805, 6609612, 6574524, 6546178, 6527919, 6521211, 6527271, 6548632, 6588249, 6647758, 6727886, 6830246, 6957127, 7109321, 7285718, 7485767, 7711082, 7963729, 8243938, 8550582, 8882991, 9240952, 9623157, 10026524, 10446609, 10877565, 11311938, 11741672, 12159657, 12559797, 12935754, 13280533, 13587386, 13850398, 14064193, 14224039, 14326872, 14371668, 14358331, 14286665, 14157126, 13972632]
60045A3972632k33442k74542l07407l31803l47001l52714l50035l40616l25249
60036A1109823l04019k77794k48429k17250j84271j49395j13528p7969m3511j0798
60026I482859J9203M5774O8718Q7517J01085J08974J11763J09491J01143Q6849
60016A0323376O9126N0166K9166M508k2309m7543o9841r1385j14071j36795j57288
60005I837110j74505j88079j97141k01173k01063j98138j92832j85086j75339
59996H123754j64297j52159j38729j23895j07674r0189p1757n2536l2140j0443
59986G179935J1287L1140M8645O4992Q0735R4376J03963J09146J10701J08531
59976G943451J01329Q8360P0949N1661L2069J1654j0747l4790n8670q1118j02090
$$ y = [13972632, 13739190, 13464648, 13157241, 12825438, 12478437, 12125723, 11775688, 11435072, 11109823, 10805804, 10528010, 10279581, 10062331, 9878060, 9728665, 9615137, 9537168, 9493657, 9482859, 9502062, 9547836, 9616554, 9704071, 9805156, 9914130, 10025893, 10135384, 10236527, 10323376, 10392502, 10442668, 10471834, 10476342, 10454033, 10406490, 10336649, 10245264, 10131193, 9994398, 9837110, 9662605, 9474526, 9277385, 9076212, 8875149, 8677011, 8484179, 8299093, 8123754, 7959457, 7807298, 7668569, 7544674, 7437000, 7346811, 7275054, 7222518, 7190378, 7179935, 7191222, 7222362, 7271007, 7335999, 7416734, 7511110, 7615073, 7724219, 7834920, 7943451, 8044780, 8133140, 8204089, 8255750, 8287819, 8299473, 8288726, 8253936, 8195266, 8114148, 8012058]
59965H012058j20972j35715j44933j49753j52054j51749j47443j39076j28068
59956F742295j15234j00551q4740o9035n3280l6169j7689N01J7481L4123N1359
59945F369061O9131Q7474J06731J25965J42938J56516J67480J76147J80953J80408
59935G762804J74870J65116J50639J30817J06709Q0353N3049K5319k382k9949
59925H617345n7581q4272j07170j23667j33627j38684j40108j38190j32960j24395
59915G436691j12476r7902q2123o5970m8978l0824j2500M933K1881L9373N7255
59904G109360P4298Q9548J02606J13076J20699J25717J28265J27913J24521J18976
59894H234979J12237J04231R4612Q4015P3612O3875N4868M7358M2624M1241M2979
$$ y = [8012058, 7891086, 7755371, 7610438, 7460685, 7308631, 7156882, 7009439, 6870363, 6742295, 6627061, 6526510, 6441770, 6372735, 6319455, 6283286, 6265597, 6266098, 6283579, 6317702, 6369061, 6438192, 6525666, 6632397, 6758362, 6901300, 7057816, 7225296, 7401443, 7582396, 7762804, 7937674, 8102790, 8253429, 8384246, 8490955, 8571308, 8624357, 8649676, 8647294, 8617345, 8559764, 8475492, 8368322, 8244655, 8111028, 7972344, 7832236, 7694046, 7561086, 7436691, 7324215, 7226313, 7144190, 7078220, 7029242, 6998418, 6985918, 6990851, 7012732, 7052105, 7109360, 7183658, 7273206, 7375812, 7488888, 7609587, 7735304, 7863569, 7991482, 8116003, 8234979, 8347216, 8451447, 8546059, 8630074, 8703686, 8767561, 8822429, 8869787, 8912411, 8953652, 8996631]
59883H996631M7805N6201O8636Q5354J06475J31672J59820J89629K20595K53032
59873A0315850K87235L22619L57220L87881M11783M28018M36795M36701M24018
59864A3808120L95646L51642K93814K23147J40711N0693l9739j24343k00338k66693
59854A4632660l21539l62595l89428m03963m08660m04982l93653l75486l51471
59845A1220883l22580k90262k56658k23349j89909j54808j18063q1811m7667j4885
59835I520891J7626M8642P5787R8637J18543J35446J46880J50511J45826J32757
59825A0591546J10517P8875L9365n696n4237j03867j51526j94822k32813k64890
59815I812452k89992l07734l19081l24841l24510l17708l05898k91506k75983
$$ y = [8996631, 9044436, 9100637, 9169273, 9254627, 9361102, 9492774, 9652594, 9842223, 10062818, 10315850, 10603085, 10925704, 11282924, 11670805, 12082588, 12510606, 12947401, 13384102, 13808120, 14203766, 14555408, 14849222, 15072369, 15213080, 15263773, 15224034, 15099691, 14899353, 14632660, 14311121, 13948526, 13559098, 13155135, 12746475, 12341493, 11947840, 11572354, 11220883, 10898303, 10608041, 10351383, 10128034, 9938125, 9783317, 9665254, 9583443, 9535776, 9520891, 9538517, 9587159, 9662946, 9761583, 9880126, 10015572, 10162452, 10312963, 10458789, 10591546, 10702063, 10780938, 10820303, 10814607, 10760370, 10656503, 10504977, 10310155, 10077342, 9812452, 9522460, 9214726, 8895645, 8570804, 8246294, 7928586, 7622688, 7331182, 7055199]
59806G055199k59633k42701k25498k07960j90055j72282j55153j38641j22640
59797E340636j07422r3229q0267o9452o1996n7624n4314n0641m7219m4937m3170
59786D630365m0928l8517l6383l3398k8298k2407j8836j8857k0720k2443k4380
59775D325198k8210l4308m1020m6404n0110n3106n5765n6843n5002n0824m6240
59764C807366m2117l7752l2729k7543k1947j4525n052M295J1486J7220K3641L1548
59752C713891M0389N0068O0704P1191P9576Q4967Q7800Q8473Q7011Q3989Q0497
59741D528556P7010P3127O8467O3094N6966M9638M0700L0491K0577J3440J0830
59730E032896J2185J5542K0179K7201L7205M8993O1450P5154R0901J08067J25925
$$ y = [7055199, 6795566, 6552865, 6327367, 6119407, 5929352, 5757070, 5601917, 5463276, 5340636, 5233214, 5139985, 5059718, 4990266, 4928270, 4870646, 4816332, 4765691, 4718472, 4673535, 4630365, 4589437, 4550920, 4514537, 4481139, 4452841, 4430434, 4411598, 4392741, 4372021, 4349578, 4325198, 4296988, 4262680, 4221660, 4175256, 4125146, 4072040, 4016275, 3959432, 3904430, 3853606, 3807366, 3765249, 3727497, 3694768, 3667225, 3645278, 3630753, 3625701, 3629996, 3641482, 3658702, 3682343, 3713891, 3754280, 3804348, 3865052, 3936243, 4015819, 4100786, 4188586, 4277059, 4364070, 4448059, 4528556, 4605566, 4678693, 4747160, 4810254, 4867220, 4916858, 4957558, 4988049, 5008626, 5022066, 5032896, 5045081, 5060623, 5080802, 5108003, 5145208, 5194201, 5255651, 5330805, 5421706, 5529773, 5655698]
59719E655698J45409J67894J93119K19999K48544K78991L09672L37744L61783
59710G918853L81542L94792L95830L77774L35775K69006J81872Q4077j2123r6569
59700A0230829j64025k13333k45141k60763k62428k53452k37438k16953j93142
59691H184154j66865j39670j12854q6179n8982l2240p668J5241L8984O4205Q8510
59680G786636J10204J30871J52646J75158J97351K20278K45509K72245K98704
59671I589602L25346L54151L85482M18171M52191M88710N27662N67518O07406
59662A3716239O47435O87157P25439P61511P94251Q20801Q37943Q44525Q40829
59653B0676130Q26553Q02037P71022P39301P10398O84989O64477O52053O49226
$$ y = [5655698, 5801107, 5969001, 6162120, 6382119, 6630663, 6909654, 7219326, 7557070, 7918853, 8300395, 8695187, 9091017, 9468791, 9804566, 10073572, 10255444, 10339521, 10327398, 10230829, 10066804, 9853471, 9608330, 9347567, 9085139, 8831687, 8594249, 8377296, 8184154, 8017289, 7877619, 7764765, 7678586, 7619604, 7587364, 7579696, 7594937, 7633921, 7698126, 7786636, 7896840, 8027711, 8180357, 8355515, 8552866, 8773144, 9018653, 9290898, 9589602, 9914948, 10269099, 10654581, 11072752, 11524943, 12013653, 12541315, 13108833, 13716239, 14363674, 15050831, 15776270, 16537781, 17332032, 18152833, 18990776, 19835301, 20676130, 21502683, 22304720, 23075742, 23815043, 24525441, 25210430, 25874907, 26526960, 27176186]
59644B7176186O53798O62375O72708O82313O86694O80629O60575O25172N74435
59635C3074885N09355M31705L44004K50104J55502O5803j4935q3656j37134j73054
59625C4422579j91820j95230j83688j56628j15385o3202k273O7142J44481K28070
59615C3954046L16880M10539N06802O01107O89540P70240Q40859Q96272R29666
59606C9915951R34350R03912Q32846P18716N62992L69611J44870j00227l49551
59597D3933470n86073p96572r72594j109277j205198j262368j284797j277114
59589C5439477j244963j195419j135815j072581j011814r60254r24654r09984
59581B6983993r17512r43279r78256j011541j034622j042974j034860j010640
$$ y = [27176186, 27829984, 28492359, 29165067, 29847380, 30534074, 31214703, 31875278, 32500450, 33074885, 33584240, 34015945, 34359949, 34610053, 34765555, 34831358, 34816423, 34732767, 34595633, 34422579, 34230759, 34035529, 33851841, 33695213, 33579828, 33516626, 33514353, 33581495, 33725976, 33954046, 34270926, 34681465, 35188267, 35789374, 36478914, 37249154, 38090013, 38986285, 39915951, 40850301, 41754213, 42587059, 43305775, 43868767, 44238378, 44383248, 44283021, 43933470, 43347397, 42550825, 41578231, 40468954, 39263756, 38001388, 36716591, 35439477, 34194514, 32999095, 31863280, 30790699, 29778885, 28818631, 27893977, 26983993, 26066481, 25123202, 24144946, 23133405, 22098783, 21055809, 20020949, 19010309]
59573A9010309r73378r28047q78850q27751p75440p22516o69537o17335n67448
59564A2050007n21124m78099m37660m00521l67694l37853l08281k78743k51887
59555H668145k29148k08792j89025j70768j55820j44259j35167j28371j23920
59546G182875j21152j19560j19513j21169j23900j27411j31815j35781j36680
59537F045894j33881j30103j27779j25683j20970j13165j04190r5416q6705p7825
59527D930177o8989o0133n0980m1682l2586k3728j5219p519o81N990J2806J9010
59515D666466K3880K7713L1063L3922L6300L8741M1538M4357M7182N0666N4997
59504E096825N9613O4583P0960P9051Q7622R5677J03820J13140J24049J36887
$$ y = [19010309, 18036931, 17108884, 16230034, 15402283, 14626843, 13904327, 13234790, 12617455, 12050007, 11528883, 11050784, 10613124, 10212603, 9844909, 9507056, 9198775, 8920032, 8668145, 8438997, 8230205, 8041180, 7870412, 7714592, 7570333, 7435166, 7306795, 7182875, 7061723, 6942163, 6822650, 6701481, 6577581, 6450170, 6318355, 6182574, 6045894, 5912013, 5781910, 5654131, 5528448, 5407478, 5294313, 5190123, 5094707, 5008002, 4930177, 4861188, 4801055, 4750075, 4708393, 4675807, 4652079, 4636860, 4629341, 4628660, 4634650, 4647456, 4666466, 4690346, 4718059, 4749122, 4783044, 4819344, 4858085, 4899623, 4943980, 4991162, 5041828, 5096825, 5156438, 5221021, 5291981, 5371032, 5458654, 5554331, 5658151, 5771291, 5895340, 6032227]
59494F032227J52117J68939J85285K00341K15637K32508K49993K66524K82085
59485G985656K97095L10573L21271L29455L35671L38668L36410L28651L16845
59476A0900295L02184K85257K66948K47604K25479J97980J65057J30383R8784
59467A2819971P3003N2833L6507K2780J2110O126O121J2456K5024M3302O5915
59456A3176148R0949J16731J41187J60788J71793J72732J63884J44278J11597
59447A4450087O5905J1104m8666j12083j78574k45039l06615l59558m01966m32951
59437A2441644m52703m62427m62846m53765m36087m12903l87299l60366l32428
59428H680820l04383k76465k47538k17475j88642j63079j39692j16254r2643p0012
$$ y = [6032227, 6184344, 6353283, 6538568, 6738909, 6954546, 7187054, 7437047, 7703571, 7985656, 8282751, 8593324, 8914595, 9244050, 9579721, 9918389, 10254799, 10583450, 10900295, 11202479, 11487736, 11754684, 12002288, 12227767, 12425747, 12590804, 12721187, 12819971, 12892974, 12945807, 12982314, 13005094, 13017204, 13023330, 13029451, 13041907, 13066931, 13110233, 13176148, 13267097, 13383828, 13525015, 13685803, 13857596, 14030328, 14194212, 14338490, 14450087, 14515992, 14527096, 14478430, 14366347, 14187773, 13942734, 13636119, 13276561, 12874595, 12441644, 11988941, 11526514, 11063668, 10609903, 10173816, 9760913, 9373614, 9013248, 8680820, 8376437, 8099972, 7852434, 7634959, 7446317, 7283238, 7143546, 7027292, 6934649, 6864637]
59418F864637m8171k6257m772J5536L5843N7792Q0654J02394J22860J43440J64182
59407G508138J83754K01759K18456K32331K40721K42949K40344K32860K18138
59398I519450J94516J62923J25057Q1728L3902j6231o6354j15155j61646k04124
59388I554066k40432k68896k88978l01579l08434l10662l08212l01240k91146
59379F934487k79410k66257k51557k35974k20020k03108j85198j68316j54429
59370D970218j42577j30237j16973j04600r4033q4186p4083o3942n4007m4131
59360D061449l4795k6843j9948j2869n279K008Q621J4901K0789K6203L2340M0437
59348D107014M8950N3980N3393M8962M4066M0843M0306M3320N0048N9217O9179
$$ y = [6864637, 6816466, 6790209, 6785437, 6800973, 6836816, 6894608, 6975262, 7077656, 7200516, 7343956, 7508138, 7691892, 7893651, 8112107, 8344438, 8585159, 8828108, 9068452, 9301312, 9519450, 9713966, 9876889, 10001946, 10083674, 10117576, 10101345, 10034991, 9919836, 9758190, 9554066, 9313634, 9044738, 8755760, 8454181, 8145747, 7835085, 7526873, 7225633, 6934487, 6655077, 6388820, 6137263, 5901289, 5681269, 5478161, 5292963, 5124647, 4970218, 4827641, 4697404, 4580431, 4475831, 4381798, 4297612, 4223529, 4159587, 4105580, 4061449, 4026654, 3999811, 3979863, 3966994, 3961715, 3963723, 3972344, 3987245, 4008034, 4034237, 4066577, 4107014, 4155964, 4209944, 4263337, 4312299, 4356365, 4397208, 4437514, 4480834, 4530882, 4590099, 4659278]
59337D659278P9369R0096J01175J11224J18341J21688J22887J25506J32637J44945
59327E807146J61161J79740J99521K19828K40989K64146K89809L17374L46876
59318H026590L79756M16596M55329M93461N31006N69157O06857O40726O67882
59309A2787360O86795O96004O94302O82104O60601O29866N89958N43693M95828
59300A8466511M49164M03603L59164L17316K78538K40797K01643J60188J16248
59291B0993172O9170J8623l4713r0168j47646k06280k63375l15575l60786l98871
59281A9263551m31029m58465m80924m96910n06035n10337n11827n09468n00503
59272A4858053m84486m63950m41105m16097l88775l60118l31114l02032k73545
$$ y = [4659278, 4738647, 4828743, 4929918, 5041142, 5159483, 5281171, 5404058, 5529564, 5662201, 5807146, 5968307, 6148047, 6347568, 6567396, 6808385, 7072531, 7362340, 7679714, 8026590, 8406346, 8822942, 9278271, 9771732, 10302738, 10871895, 11478752, 12119478, 12787360, 13474155, 14170159, 14864461, 15546565, 16207166, 16837032, 17426990, 17970683, 18466511, 18915675, 19319278, 19678442, 19995758, 20274296, 20515093, 20716736, 20876924, 20993172, 21062342, 21080965, 21046252, 20956084, 20808438, 20602158, 20338783, 20023208, 19662422, 19263551, 18832522, 18374057, 17893133, 17396223, 16890188, 16379851, 15868024, 15358556, 14858053, 14373567, 13909617, 13468512, 13052415, 12663640, 12303522, 11972408, 11670376, 11396831]
59263A1396831k47030k23050k00971j80787j63869j51209j42076j35331j30895
59254I821613j29128j29575j31106j32832j34553j36647j39539j42623j44110
59245H601500j42715j39106j34750j29882j23824j16571j08466r8960q7567p5748
59235G443911o5687n7284m8284l7518k5966j4486k639R795K2247L4977M9286O5219
59223G373571Q0809R4596J07457J21010J35429J49813J63576J76670J89108K00687
59213H792726K10518K16843K18325K15297K08515J96919J78419J52919J22797
59204A0513278Q9935N4059J4685k6667o7055j03990j36253j63566j85790k02329
59194I786307k13099k20657k29440k40977k51082k54277k50043k41990k31953
$$ y = [11396831, 11149801, 10926751, 10725780, 10544993, 10381124, 10229915, 10087839, 9952508, 9821613, 9692485, 9562910, 9431804, 9298972, 9164419, 9027772, 8888233, 8745610, 8601500, 8458785, 8319679, 8184929, 8055047, 7931223, 7814652, 7706186, 7607226, 7519659, 7443911, 7378224, 7320940, 7272656, 7235138, 7209172, 7194686, 7192047, 7201842, 7224089, 7259066, 7308352, 7373571, 7454380, 7548976, 7656433, 7777443, 7912872, 8062685, 8226261, 8402931, 8592039, 8792726, 9003244, 9220087, 9438412, 9653709, 9862224, 10059143, 10237562, 10390481, 10513278, 10603213, 10657272, 10671957, 10645290, 10578235, 10474245, 10337992, 10174426, 9988636, 9786307, 9573208, 9352551, 9123111, 8882134, 8631052, 8376775, 8126732, 7884742, 7652789]
59185G652789k18494k01226j82718j65081j47777j29998j12375r5139p7147n8098
59175F264736l9519k2338n558J1769K9508M8243O9598R3445J17323J39957J63128
59164F870292J88722K16304K44973K75097L06436L36884L64987L91452M16054
59155I611201M35064M43847M40359M24158L94116L49673K92848K26425J51242
59146A2768933O7768k0453j07282j87596k58701l18895l66524m00486m20514m27354
59136A0328896m23416m12268l96341l75880l50907l23133k94922k67604k41670
59127G242755k17363j94146j71055j48543j28405j10934r4068p6747o0959m8595
59117E991940l8152k6857j4577l361N979J4461K2817L0820L8230M4786M9742N2785
$$ y = [7652789, 7434295, 7233069, 7050351, 6885270, 6737493, 6607495, 6495120, 6399981, 6322834, 6264736, 6225217, 6202879, 6197321, 6209090, 6238598, 6286841, 6356439, 6449884, 6567207, 6707164, 6870292, 7059014, 7275318, 7520291, 7795388, 8101824, 8438708, 8803695, 9195147, 9611201, 10046265, 10490112, 10930471, 11354629, 11748745, 12098418, 12391266, 12617691, 12768933, 12836701, 12816248, 12708966, 12521370, 12262669, 11943774, 11577250, 11176764, 10756250, 10328896, 9905480, 9493212, 9096871, 8720991, 8370084, 8046951, 7752029, 7484425, 7242755, 7025392, 6831246, 6660191, 6511648, 6383243, 6272309, 6178241, 6101494, 6040535, 5991940, 5953788, 5926931, 5912354, 5908993, 5914972, 5929433, 5952250, 5983070, 6021300, 6066086, 6115828, 6168613]
59105F168613N4749N6065N5506N1859M5888L9129L1696K2714J2043R5j2911k5994
59093F499452l6961m4782n1368n9018o7030p2842p5665p6816p6923p5001p0325
59082E792721o3492n5608m7625m0284l3376k5605j6313o810J292Q346J5937K4537
59070E553720L3420M2212N1038N9618O7739P6207Q5990R6768J07553J18193J29036
59059F421494J39765J49798J59213J68070J75428J80433J83577J85600J85938
59050G949316J83747J79734J75387J70948J65557J58791J50552J40155J27192
59041I401379J12998R9628Q7454P4864N9966M1407J8176j0165m3130q0010j20220
59030I642347j62204k02982k39827k71563k97570l16973l29750l36979l38646
$$ y = [6168613, 6223362, 6279427, 6334933, 6386792, 6432680, 6471809, 6503505, 6526219, 6538262, 6538357, 6525446, 6499452, 6462491, 6417709, 6366341, 6307323, 6240293, 6167451, 6091786, 6014970, 5938047, 5863046, 5792721, 5729229, 5673621, 5625996, 5585712, 5552336, 5526731, 5510418, 5503608, 5504900, 5513246, 5529183, 5553720, 5587140, 5629352, 5680390, 5740008, 5807747, 5883954, 5969944, 6066712, 6174265, 6292458, 6421494, 6561259, 6711057, 6870270, 7038340, 7213768, 7394201, 7577778, 7763378, 7949316, 8133063, 8312797, 8488184, 8659132, 8824689, 8983480, 9134032, 9274187, 9401379, 9514377, 9614005, 9701459, 9776323, 9836289, 9877696, 9895872, 9885707, 9842577, 9762567, 9642347, 9480143, 9277161, 9037334, 8765771, 8468201, 8151228, 7821478, 7484499, 7145853]
59021G145853l33170l20833l05663k91513k77950k62589k45842k30173k15838
59012D662282k00926j85282j71009j58959j47817j36930j27227j18743j10077
59003C305312j01092r3608q8398q3774p8228p2483o7634o3113n7994n2823m8734
58992B497431m5669m2806m0118l8284l7306l6124l3700l0157k6722k4478k3120
58981B118947k1314j8323j4710j1190p812m696k440q60J469N280R266J1852J3250
58968B078719J4315J4644J3635J2446J2745J4095J4632J3895J2975J2138J0438
58957B224677P690M983L090J993J963L409N669P437Q356Q769Q345O746N290N909
58943B304326Q373J0463J0845R783P058J772n146j0502j2272j1862j1929j3232
$$ y = [7145853, 6812683, 6491850, 6186187, 5894674, 5616724, 5354135, 5108293, 4878120, 4662282, 4461356, 4276074, 4105065, 3946106, 3798289, 3661359, 3534132, 3415389, 3305312, 3204220, 3110612, 3022214, 2938440, 2860212, 2787729, 2720095, 2656982, 2598988, 2546165, 2497431, 2451762, 2408956, 2368838, 2330554, 2293248, 2257124, 2223424, 2193267, 2166545, 2142067, 2118947, 2097633, 2079310, 2064600, 2053410, 2045598, 2040902, 2038462, 2037602, 2039071, 2044351, 2053617, 2065469, 2078719, 2093034, 2107678, 2121313, 2133759, 2146504, 2160599, 2175231, 2189126, 2202101, 2214239, 2224677, 2232367, 2237350, 2240440, 2242433, 2244396, 2247805, 2253474, 2260911, 2269267, 2278036, 2286381, 2293127, 2298417, 2304326, 2312699, 2323162, 2334007, 2343790, 2350848, 2352620, 2347474, 2336972, 2324700, 2312838, 2300909, 2287677]
58931B287677j4592j4859j3872j2256j0903j0077q775n803j661J694L256M068
58919B203897N514P699R991J2211J4528J6857J8986K0908K2618K3967K5051K6421
58907B408648K8654L1760L5073L7738L9452M0745M2151M3305M3473M2814M2123
58896B835936M1546M0891M1233M4237M9457N4317N7766O1703O7502P3388P7271
58885C445247Q0221Q4665R0599R6177J01031J06398J12786J19749J27441J36087
58875D500401J44613J51910J58842J66890J75720J84423J94197K07006K22217
58866F106219K37490K52704K70020K90085L11146L32285L54745L79440M05654
58857H939788M32904M61878M92897N25403N59343N95096O31724O67327P01285
$$ y = [2287677, 2273085, 2258226, 2244354, 2232098, 2221195, 2211118, 2202343, 2196540, 2194879, 2196573, 2199829, 2203897, 2209411, 2217110, 2227101, 2239312, 2253840, 2270697, 2289683, 2310591, 2333209, 2357176, 2382227, 2408648, 2437302, 2469062, 2504135, 2541873, 2581325, 2622070, 2664221, 2707526, 2750999, 2793813, 2835936, 2877482, 2918373, 2959606, 3003843, 3053300, 3107617, 3165383, 3227086, 3294588, 3367976, 3445247, 3525468, 3610133, 3700732, 3796909, 3897940, 4004338, 4117124, 4236873, 4364314, 4500401, 4645014, 4796924, 4955766, 5122656, 5298376, 5482799, 5676996, 5884002, 6106219, 6343709, 6596413, 6866433, 7156518, 7467664, 7799949, 8154694, 8534134, 8939788, 9372692, 9834570, 10327467, 10852870, 11412213, 12007309, 12639033, 13306360, 14007645]
58848A4007645P33861P63202P84994P95812P94672P80756P51576P04257O37053
58839B0753828N49370M42292L19685J87132M9507q8903k22280l44027m50303n40603
58829B0655698o14543o70564p08578p31311p41688p40758p29183p08972o82671
58820A4327430o52459o20699n89403n58346n25779m92009m60238m32769m08261
58811I587467l84181l60059l36833l14668k93253k73107k54904k38201k22155
58802F910106k06819j92670j79440j66420j53344j40367j27655j15589j04731
58793E523071r5171q6373p7770o8926n9231m8492l7688k8066j9448j0568r24Q878
58781D999292J8593K8637L8895M8578N7468O6192P5254Q5006R6138J08760J21373
$$ y = [14007645, 14741506, 15504708, 16289702, 17085514, 17880186, 18660942, 19412518, 20116775, 20753828, 21303198, 21745490, 22065175, 22252307, 22301814, 22212911, 21990631, 21646604, 21196301, 20655698, 20041155, 19370591, 18662013, 17930702, 17189014, 16448256, 15719073, 15010101, 14327430, 13674971, 13054272, 12464869, 11906523, 11380744, 10888735, 10428497, 9995728, 9587467, 9203286, 8843227, 8506394, 8191726, 7898473, 7625366, 7370462, 7132261, 6910106, 6703287, 6510617, 6331177, 6164757, 6011413, 5871046, 5743391, 5627802, 5523071, 5427900, 5341527, 5263757, 5194831, 5135600, 5087108, 5049420, 5021354, 5001906, 4991338, 4990414, 4999292, 5017885, 5046522, 5085417, 5133995, 5191463, 5257655, 5332909, 5417915, 5514053, 5622813, 5744186]
58770E744186J32545J43274J55731J69942J83844J96710K10087K25011K40549
58761G401879K55877K71803K89451L09104L31005L55681L82764M11043M40276
58752A0448883M71585N05533N41095N76839O11936O45883O78323P08790P35162
58743A5924029P52907P57697P48287P24839O85176O25438N44308M43977L27299
58734B1533957J97197N9156p9141k11786l35738m47681n43180o20146o80064p24294
58724A8148280p52021p63538p62651p53475p36926p12550o81982o48376o13669
58715A1723092n78523n44076n11868m82392m54954m28775m03518l79265l56386
58706G583335l35032l14868k95750k78101k61673k45101k28064k12610k00148
$$ y = [5744186, 5876731, 6020005, 6175736, 6345678, 6529522, 6726232, 6936319, 7161330, 7401879, 7657756, 7929559, 8219010, 8528114, 8859119, 9214800, 9597564, 10008607, 10448883, 10920468, 11426001, 11967096, 12543935, 13155871, 13801754, 14480077, 15188867, 15924029, 16676936, 17434633, 18182920, 18907759, 19592935, 20218373, 20762681, 21206658, 21533957, 21731154, 21790310, 21711169, 21499383, 21163645, 20715964, 20172784, 19552638, 18872574, 18148280, 17396259, 16632721, 15870070, 15116595, 14379669, 13667119, 12985137, 12336761, 11723092, 11144569, 10600493, 10088625, 9606233, 9151279, 8722504, 8318986, 7939721, 7583335, 7248303, 6933435, 6637685, 6359584, 6097911, 5852810, 5624746, 5412136, 5211988]
58697E211988j88592j75290j61507j50355j41176j30285j17277j06012r8471r2074
58687C850949q4551p7178p1244o5077n7154m8969m2427l7201l2840l0652l1077
58676C272579l1775l0825k9650l0419l2758l5098l7149l8780l8664l6509l4830
58665B896122l6107l9629m3021m5278m6537m6802m6917m8847n2878n6177n6268
58654B377661n4329n3110n3159n3176n2614n1704n0120m7615m5020m3122m1474
58643A832218l9599l8033l6978l5373l2628k9843k8084k6839k5312k3746k2495
58632A493288k1340k0467k0326j9945j7660j4172j2285j2591j2264r462o033m198
58620A322545l228j425J033L191N000O185N638L621K304K623K968K405K344L370
$$ y = [5211988, 5023396, 4848106, 4686599, 4536244, 4395068, 4264783, 4147506, 4041494, 3943023, 3850949, 3766398, 3689220, 3617976, 3552899, 3495745, 3446776, 3404349, 3367148, 3334308, 3303656, 3272579, 3240804, 3209979, 3180329, 3149910, 3117152, 3082054, 3044905, 3006125, 2967461, 2930952, 2896122, 2860015, 2820386, 2777365, 2732087, 2685550, 2638748, 2591831, 2542984, 2490106, 2433929, 2377661, 2323332, 2270222, 2217063, 2163887, 2111273, 2059569, 2009449, 1961834, 1916814, 1873692, 1832218, 1792619, 1754586, 1717608, 1682235, 1649607, 1619764, 1591680, 1564841, 1539529, 1515783, 1493288, 1471948, 1451481, 1431155, 1411210, 1393550, 1379378, 1367093, 1354502, 1342238, 1332776, 1326743, 1322545, 1319317, 1317892, 1318925, 1322116, 1327116, 1333301, 1338939, 1342560, 1344864, 1347487, 1350455, 1352860, 1355204, 1358574]
58606A358574L522J797M11J181K448K091R13M91J88j097k486k918l236m216m830
58591A352833m545m717n546m556o31L447N231O372R154J2347J3962J5355J8631
58578A417337K2422K4186K4924K7620L2311L6358L8552L9837M1044M2705M5970
58567A793266N1124N6423O0616O5048P1212P8302Q5309R3106J02050J10289J17254
58556B683999J25935J38561J52630J64685J75354J87043J99240K09847K18829
58547D256123K26585K30916K29439K22901K12250J94815J67577J32164R2413M9336
58537F014519L001m2783q2855j16405j45578j69736j85967j94326j97795j97712
58527D684363j93597j86735j79442j71278j60113j46564j33379j21123j08452
$$ y = [1358574, 1362096, 1363893, 1364304, 1365485, 1367933, 1370024, 1370937, 1371428, 1371616, 1370519, 1368033, 1365115, 1361879, 1357663, 1352833, 1348288, 1343571, 1338025, 1333469, 1332838, 1336285, 1341516, 1347888, 1357042, 1369389, 1383351, 1398706, 1417337, 1439759, 1463945, 1488869, 1516489, 1548800, 1585158, 1623710, 1663547, 1704591, 1747296, 1793266, 1844390, 1900813, 1961429, 2026477, 2097689, 2175991, 2261300, 2354406, 2456456, 2566745, 2683999, 2809934, 2948495, 3101125, 3265810, 3441164, 3628207, 3827447, 4037294, 4256123, 4482708, 4713624, 4943063, 5165964, 5378214, 5573029, 5740606, 5872770, 5965183, 6014519, 6017520, 5974737, 5891882, 5775477, 5629899, 5460163, 5274196, 5079870, 4882075, 4684363, 4490766, 4304031, 4124589, 3953311, 3793198, 3646634, 3513255, 3392132, 3283680]
58518C283680r5973q5751p7525o9219o0679n3407m7431m2058l8477l7735l7279
58507B638146l3753k8136k3867k1157j7755j4284j3753j6184j8692k0771k4782
58496B405012l1080l7147m1799m6061m9705n1104n0736n0930n1928n1835n0382
58485A892305m8974m7336m4061m0240l8427l8152l6506l3139l0586k9638k8432
58474A476814k6250k4371k3042k1268j9483j8792j8016j5362j2529j2908j5924
58463A268869j7543j6232j4232j2969j1539r963r693j0464j0389r347q743q234
58451A129521o379m113l628m282l563j510r1Q18K556L880K933J924M558R480J1876
58436A143980J1189J1483J4078J5844J5355J5030J6192J7195J7319J7469J6480
$$ y = [3283680, 3187707, 3101956, 3024431, 2955212, 2894533, 2841126, 2793695, 2751637, 2713160, 2675425, 2638146, 2604393, 2576257, 2552390, 2531233, 2513478, 2499194, 2485441, 2469257, 2450565, 2429794, 2405012, 2373932, 2336785, 2294986, 2248925, 2199220, 2148116, 2097380, 2046450, 1994522, 1942687, 1892305, 1843331, 1795995, 1751934, 1711694, 1673267, 1635115, 1598609, 1565470, 1534884, 1505246, 1476814, 1450564, 1426193, 1403151, 1381883, 1362400, 1343608, 1325592, 1310230, 1297701, 1284793, 1268869, 1251326, 1235094, 1220862, 1207893, 1196354, 1186391, 1176698, 1166234, 1155845, 1146498, 1137755, 1129521, 1123142, 1119029, 1115401, 1111119, 1107556, 1106046, 1105955, 1106773, 1109329, 1113209, 1116142, 1118066, 1122624, 1132104, 1143980, 1155169, 1166652, 1180730, 1196574, 1211929, 1226959, 1243151, 1260346, 1277665, 1295134, 1311614]
58425A311614J1944N477J785J631R20k365n714p589r878j3314j5638j5945j6286
58412A246642j7547j8149j7813j8117j8524j6704j3444j2220j3217j3010j0899
58401A076998r917j0658j0014p375o174p476p800n273k466j017J061M457O295
58388A020641N236L976M355M759M487N795R252J1833J1899J1657J2674J3493J3558
58375A133615J4755J7240J8402J7734J7846J8893J7254J1794O295L381R87k807
58363A275389o485q865j1324j3895j3971j1206r040r098q774o415m053k888r12
58350A168463K663N377O039O721Q392R324R417J1039J3883J4290J1461Q928Q176
58337A284173O476K844K34k81j537m302n220l109j355j742j838p31j090l107k838
$$ y = [1311614, 1323558, 1329035, 1330820, 1332451, 1333371, 1331006, 1325292, 1317703, 1307825, 1294511, 1278873, 1262928, 1246642, 1229095, 1210946, 1193133, 1175016, 1156492, 1139788, 1126344, 1114124, 1100907, 1087897, 1076998, 1067081, 1056423, 1046409, 1039034, 1032860, 1025384, 1017584, 1012311, 1009845, 1008828, 1009889, 1014346, 1020641, 1025877, 1029853, 1034208, 1038967, 1043454, 1049249, 1058501, 1070334, 1082233, 1093890, 1106564, 1120057, 1133615, 1148370, 1165610, 1184012, 1201746, 1219592, 1238485, 1255739, 1267533, 1273828, 1277209, 1278196, 1275389, 1268904, 1260039, 1248715, 1234820, 1220849, 1209643, 1200603, 1191505, 1182731, 1176316, 1172263, 1169375, 1168463, 1171126, 1176503, 1182542, 1189263, 1197655, 1206979, 1216396, 1227435, 1241318, 1255608, 1267069, 1275997, 1284173, 1290649, 1293493, 1293727, 1293446, 1291909, 1287607, 1282387, 1279278, 1277923, 1276181, 1274343, 1273612, 1272522, 1269415, 1266577]
58322A266577Q54M043M922O438R201Q971M546J082J851L413K704K160L826N027
58308A325615M099M154P015R478R470R792J1980J2946J1436J1274J4185J6026
58296A447470J4235J2415J3410J4551J3936J4614J8142K0689J9865J8781J9337
58285A627445J8523J5363J3976J5426J4361Q447L281K971L805K446K140N179P396
58272A740759O232O258J0606J4790J5281J6081K0365K3778K2853K1920K4665K7015
58260A950603K5607K5059K9126L2754L0966K7993K9327L2198L2001L0904L1911
58249B278449L1734K7487K3388K3100K2910J9910J8798K2743K5978K3869K1612
58238B539978K4396K7897K7659K8601L5297M1912M2319M1375M5411N0194M9589
$$ y = [1266577, 1267431, 1271474, 1276396, 1282834, 1292035, 1301006, 1305552, 1306634, 1308485, 1311898, 1314602, 1316762, 1320588, 1325615, 1329714, 1333868, 1340883, 1350361, 1359831, 1369623, 1381603, 1394549, 1405985, 1417259, 1431444, 1447470, 1461705, 1474120, 1487530, 1502081, 1516017, 1530631, 1548773, 1569462, 1589327, 1608108, 1627445, 1645968, 1661331, 1675307, 1690733, 1705094, 1713541, 1716822, 1719793, 1723598, 1726044, 1728184, 1733363, 1740759, 1746991, 1753249, 1763855, 1778645, 1793926, 1810007, 1830372, 1854150, 1877003, 1898923, 1923588, 1950603, 1976210, 2001269, 2030395, 2063149, 2094115, 2122108, 2151435, 2183633, 2215634, 2246538, 2278449, 2310183, 2337670, 2361058, 2384158, 2407068, 2426978, 2445776, 2468519, 2494497, 2518366, 2539978, 2564374, 2592271, 2619930, 2648531, 2683828, 2725740, 2768059, 2809434, 2854845, 2905039, 2954628]
58227B954628M7772N1121N5872N5515N3049N4543N7955N9366O2506P0817P8283
58216C601427P9458Q0310Q7514R5912R8613J00177J06943J13648J13151J10367
58206D587520J12753J16041J13599J10696J14725J20530J20639J20787J29610
58197E646900J42059J49167J55072J67954J83445J93999K05122K24768K46371
58188G314857K60618K74021K96744L22189L38800L52091L73870L99390M17284
58179A0349864M32787M58373M90471N18645N48630N92160O42923O87547P31399
58170A5452799P87828Q50888R05484R55563J014544J077008J129035J177586J239403
58161B4590138J309666J373260J438211J525024J631356J740815J857233J995058
$$ y = [2954628, 3002400, 3053521, 3109393, 3164908, 3217957, 3272500, 3330455, 3389821, 3452327, 3523144, 3601427, 3680885, 3761195, 3848709, 3944621, 4043234, 4143411, 4250354, 4364002, 4477153, 4587520, 4700273, 4816314, 4929913, 5040609, 5155334, 5275864, 5396503, 5517290, 5646900, 5788959, 5938126, 6093198, 6261152, 6444597, 6638596, 6843718, 7068486, 7314857, 7575475, 7849496, 8146240, 8468429, 8807229, 9159320, 9533190, 9932580, 10349864, 10782651, 11241024, 11731495, 12250140, 12798770, 13390930, 14033853, 14721400, 15452799, 16240627, 17091515, 17996999, 18952562, 19967106, 21044114, 22173149, 23350735, 24590138, 25899804, 27273064, 28711275, 30236299, 31867655, 33608470, 35465703, 37460761]
58153C7460761K146763K297934K463083K665007K890151L109455L332565L594345
58145E9960064L900632M239622M633435N119453N693557O337976P095294Q044012
58137A05024045R210061J0576757J2163746J4002066J6047223J8233404K0615840
58130B05873142K3352377K6572389L0383084L4820472L9286636M1850424L9679039
58123D41817563L0989095J6870857R60768j2875342k2613670k8277082l0846883
58116C96025306l1347808l0602228k9209940k7492554k5561343k3504366k1444059
58109B06863008j9439810j7468570j5536782j3725734j2102910j0664787r390556
58102A08533859q282551p325381o466810n674511m966902m359887l826498l338190
$$ y = [37460761, 39607524, 41905458, 44368541, 47033548, 49923699, 53033154, 56365719, 59960064, 63860696, 68100318, 72733753, 77853206, 83546763, 89884739, 96980033, 105024045, 114234106, 124810863, 136974609, 150976675, 167023898, 185257302, 205873142, 229225519, 255797908, 286180992, 321001464, 360288100, 402138524, 441817563, 472806658, 489677515, 490638283, 477762941, 455149271, 426872189, 396025306, 364677498, 334075270, 304865330, 277372776, 251811433, 228307067, 206863008, 187423198, 169954628, 154417846, 140692112, 128589202, 117924415, 108533859, 100251308, 92925927, 86459117, 80784606, 75817704, 71457817, 67631319, 64293129]
58094F4293129k903893k532416k190739j838530j476543j121062p54393l45445
58086E1130108R9652N57265J039562J566551K101192K610751L208210M081130
58078F6394421N132002N754928N187020L199642L84350k301191m220203n292189
58070G4238780n727760n733028n459752n051243m613544m180062l757141l371853
58062C6344397l043398k749453k461759k188362j949697j740487j546831j376941
58054A9287469j243204j132910j025926r25434q44791p79318p16530o60226o19535
58045A1339595n86341n47057n05724m73259m44757m09345l72602l47465l31648
58036G321397l14433k97370k88145k81782k68095k51009k41314k36480k26134
$$ y = [64293129, 61389236, 58856820, 56666081, 54827551, 53351008, 52229946, 51475553, 51130108, 51229760, 51787025, 52826587, 54393138, 56494330, 59105081, 62313291, 66394421, 71526423, 77281351, 82468371, 85668013, 86052363, 83751172, 79530969, 74238780, 68511020, 62777992, 57318240, 52266997, 47653453, 43473391, 39716250, 36344397, 33300999, 30551546, 28089787, 25901425, 23951728, 22211241, 20664410, 19287469, 18044265, 16911355, 15885429, 14959995, 14115204, 13335886, 12619356, 11959130, 11339595, 10753254, 10206197, 9700473, 9227214, 8782457, 8373112, 8000510, 7653045, 7321397, 7006964, 6709594, 6421449, 6139667, 5871572, 5620563, 5379249, 5142769, 4916635]
58027D916635k11656k02054j95865j84980j71636j64247j60559j51609j38502
58018C335527j29398j23811j15229j05438j01018r9358r2958q3825p9198p7050
58008B328244p0353o1665n8643n8874n4249m6863m5365m8376m6866m0839l8509
57997A757642m0446l9293l4450l2800l5172l5401l2593l1728l2553l0187k6045
57986A386974k5953k8310k6210k0362j7861j8982j7557j3666j3352j6121j5139
57975A173461j0125p918r851j0352q483r159j2149j1608p455o097q668r442o928
57962A055226n744o503m693p57m01l500l434Q41K791J99j530j84m01l710n021
57947A023179k248k10j623k843j617q41j796j480O61R35j316k110n16m72l138
$$ y = [4916635, 4704979, 4502925, 4307060, 4122080, 3950444, 3786197, 3625638, 3474029, 3335527, 3206129, 3082318, 2967089, 2861651, 2760633, 2661275, 2568317, 2484492, 2405294, 2328244, 2257891, 2196226, 2137583, 2078709, 2024460, 1977597, 1932232, 1883856, 1836990, 1796151, 1757642, 1717196, 1677903, 1643453, 1610653, 1575481, 1540080, 1507487, 1475759, 1443206, 1413019, 1386974, 1361021, 1332711, 1306501, 1286139, 1268278, 1249296, 1231739, 1218073, 1204721, 1188600, 1173461, 1163336, 1155418, 1145567, 1135215, 1126732, 1117573, 1105424, 1093816, 1086361, 1080264, 1071596, 1062154, 1055226, 1049482, 1042979, 1038286, 1037529, 1037128, 1033628, 1030194, 1031035, 1033826, 1034025, 1032495, 1032311, 1031910, 1028200, 1023179, 1020931, 1020721, 1019098, 1016255, 1014638, 1013797, 1012001, 1010521, 1011182, 1012117, 1010801, 1008691, 1008175, 1007703, 1004565]
57932A004565n014n388p910j2820j5301j3673j1757j1339r754o756o091q183q701
57919H81878o391n017n736n015k007m72j341q77J753K566N05m58R91J285l58J25
57903H61431L500M803K004l25R34K843K811K591K892J006l138n349m587n156q689
57888H57571j0976r929r384j1464j2316r378o070n054l481P40M319M739N077Q040
57874H02434J0834J0502R115R186Q835N873K084o01l555p473r663r010q779j0936
57860H08846j2628j1904j1698j4124j5984j4372j1862j1587j1697r417o423n463
57848F71687n419m108k529k114j334J028K679J835Q10J759K460N13j837j327J053
57833F65156K564L558N600P496P349O320O652P935Q487Q218P368N022J566j83
$$ y = [1004565, 999551, 994163, 986253, 973433, 958132, 944459, 932702, 921363, 911609, 904853, 898762, 890579, 881878, 875487, 870470, 864734, 859719, 857712, 857240, 855899, 855022, 856775, 859341, 859846, 859388, 860379, 861664, 861306, 861431, 864931, 869734, 871738, 871413, 872347, 875190, 878001, 880592, 883484, 884490, 881352, 876003, 871416, 866260, 857571, 846595, 836666, 827282, 815818, 803502, 794124, 788054, 783000, 779519, 780259, 784578, 789317, 794394, 802434, 813268, 823770, 832885, 842071, 850906, 856779, 858863, 858262, 854707, 847234, 837571, 828561, 819782, 808846, 796218, 784314, 772616, 758492, 742508, 728136, 716274, 704687, 692990, 683573, 677150, 671687, 666268, 662160, 659631, 657517, 656183, 657211, 659890, 661725, 662535, 664294, 666754, 667267, 665430, 664103, 665156, 667720, 671278, 676878, 684374, 691723, 698043, 704695, 712630, 721117, 729335, 736703, 741725, 743291, 743108]
57819G43108Q73J745j21l047m644n767p823r329q542o741n748n016m007m294o207
57804F74440o731m100j317j429k456r00K490M537M893N452O404O595O251O134
57790G00263N557M004K908L235L463K427J720K520K680J37l234m503m213m661
57776G12303n716n684m737m292m291l879l433l589l789l780m619o241o438m425
57762F47390k881l910n659n578m565m828o044o675p063q106q805q022o909o973
57748E61372p528p490p708r026j0113r669q687q212p188m877k843k134j226O47
57734D75318J169j025l068k005O64K136L181N765Q449Q646P527Q264J0856J2797
57720E38674J3612J4550J4886J2688Q676N580M090K744J258O57O03k99j797k456
$$ y = [743108, 743981, 745726, 745605, 742558, 737914, 732147, 724324, 714995, 706453, 699712, 693964, 688948, 684941, 680647, 674440, 667709, 663609, 662292, 660863, 658407, 657507, 659997, 664534, 669427, 674879, 681283, 687878, 694129, 700263, 705820, 709824, 712732, 715967, 719430, 721857, 723577, 726097, 728777, 728914, 725680, 721177, 716964, 712303, 706587, 700903, 696166, 691874, 687583, 683704, 680271, 676682, 672893, 669113, 664494, 658253, 651815, 647390, 644509, 640599, 634940, 629362, 624797, 619969, 613925, 607250, 600187, 592081, 583276, 575254, 568345, 561372, 553844, 546354, 538646, 529620, 519507, 509838, 501151, 492939, 485751, 480874, 478031, 475897, 474671, 475318, 476487, 475462, 472394, 470389, 471053, 473189, 476370, 482135, 490584, 499230, 506757, 515021, 525877, 538674, 552286, 566836, 581722, 594410, 603086, 608666, 612756, 615500, 616758, 617415, 618018, 617719, 615922, 613466]
57706F13466k364k881m147n133n509n500m804l621l380m460m815l075j088q37
57692E61852q78J204M554O527O769O719O457N349M464N010N563M088J600N59P39
57677F20576J72q46k70J769K999K701K286K527L031L998N798P264P079O251O665
57662F72000P983Q654R006J0529J2938J4886J6581J8656J9574J7689J5124J5745
57650H39365J9537K2687K3353K3584K5081K6726K7479K8567L1165L4138L5692
57639A137374L5889L6363L8459M2154M6215M9300N1395N3625N6247N8164N9266
57628A664451O1610O6836P4060Q1832R0348R9961J09552J18687J29266J42478
57618B639081J56063J67595J78572J91926K06965K20300K30399K37556K40275
$$ y = [613466, 611102, 608221, 604074, 598941, 593432, 587932, 583128, 579507, 576127, 571667, 566852, 563777, 562689, 561852, 560974, 562178, 566732, 573259, 580028, 586747, 593204, 598553, 603017, 608027, 613590, 617678, 619278, 619837, 620576, 620748, 619902, 619632, 621401, 624400, 627101, 629387, 631914, 634945, 638943, 644741, 652005, 659084, 665335, 672000, 679983, 688637, 697643, 708172, 721110, 735996, 752577, 771233, 790807, 808496, 823620, 839365, 858902, 881589, 904942, 928526, 953607, 980333, 1007812, 1036379, 1067544, 1101682, 1137374, 1173263, 1209626, 1248085, 1290239, 1336454, 1385754, 1437149, 1490774, 1547021, 1605185, 1664451, 1726061, 1792897, 1866957, 1948789, 2039137, 2139098, 2248650, 2367337, 2496603, 2639081, 2795144, 2962739, 3141311, 3333237, 3540202, 3760502, 3990901, 4228457, 4468732]
57609D468732K35608K22912K04046J80317J52118J20607Q5914M4420p797o8067
57599E638810j26985j75820k11432k34211k45023k45422k37986k25008k08354
57590C728569j90647j74394j59757j45310j30926j17818j05991r4175q2233p1309
57580B456009o1525n1813m2037l3159k5495j8664j2790p674j595O609J5119K1436
57568B244421K6205L1888L8581M4500M9855N6698O5134P3418Q1709R1973J03900
57557B908282J14701J23552J32552J42436J50809J55762J57751J56603J49803
57548D192251J35419J14160Q7261N5011J8765j8122n2967q5183j13918j36725
57538D195952j52274j62282j69114j73066j73382j70340j64849j57415j48673
$$ y = [4468732, 4704340, 4927252, 5131298, 5311615, 5463733, 5584340, 5670254, 5714674, 5706877, 5638810, 5511825, 5336005, 5124573, 4890362, 4645339, 4399917, 4161931, 3936923, 3728569, 3537922, 3363528, 3203771, 3058461, 2927535, 2809717, 2703726, 2609551, 2527318, 2456009, 2394484, 2342671, 2300634, 2267475, 2241980, 2223316, 2210526, 2202852, 2201257, 2207866, 2222985, 2244421, 2270626, 2302514, 2341095, 2385595, 2435450, 2492148, 2557282, 2630700, 2712409, 2804382, 2908282, 3022983, 3146535, 3279087, 3421523, 3572332, 3728094, 3885845, 4042448, 4192251, 4327670, 4441830, 4529091, 4584102, 4602867, 4584745, 4531778, 4446595, 4332677, 4195952, 4043678, 3881396, 3712282, 3539216, 3365834, 3195494, 3030645, 2873230, 2724557]
57529B724557j39835j31479j22960j13739j04379r5749q8249q2060p7091p2569
57519A696447o7804o3144n8925n4067m7569m0913l6780l5473l4738l3070l0887
57508A193077k8455k5116k1013j7400j4815j2807j1525j1468j1632j0263p653
57497A020930n809n072l635p21K252M266O003P910R352J0444J2367J5050J6846
57484A090183J7340J8209K0364K2466K3391K4142K6048K8824L1567L4171L6904
57473A373609L9838M3376M7973N3002N7270O0884O4983O9679P4095P8462Q4127
57462B047298R1303R8798J05873J12314J16844J17972J16319J13284J07488R5694
57452C123187P7571N6247L3580Q515j8770m4697o6191q3710r8461j09379j15090
$$ y = [2724557, 2584722, 2453243, 2330283, 2216544, 2112165, 2016416, 1928167, 1846107, 1769016, 1696447, 1628643, 1565499, 1506574, 1452507, 1404938, 1364025, 1327245, 1291772, 1257034, 1223964, 1193077, 1164622, 1139506, 1118493, 1101093, 1086278, 1073471, 1061946, 1050478, 1038846, 1028583, 1020930, 1015121, 1010049, 1006414, 1005693, 1007945, 1012211, 1018214, 1026124, 1035476, 1045920, 1058287, 1073337, 1090183, 1107523, 1125732, 1146096, 1168562, 1191953, 1216095, 1242143, 1270967, 1302534, 1336705, 1373609, 1413447, 1456823, 1504796, 1557798, 1615068, 1675952, 1740935, 1810614, 1884709, 1963171, 2047298, 2138601, 2237399, 2343272, 2455586, 2572430, 2690402, 2806721, 2920005, 3027493, 3123187, 3200758, 3257005, 3290585, 3299100, 3280330, 3235633, 3169442, 3085732, 2987271, 2877892, 2762802]
57441B762802j16496j15319j11937j06521j00382r4408q7994q0994p4803o9883
57431A804065o4335n6843m9134m3543l9848l6333l2310k7692k1780j4642q362
57420A409243m730k644K75M480Q614J1987J5151J8698K2892K8025L3963M0024
57408A585978M5968N2176N8250O2964O6530P1231P8439Q6534R3259R8643J03806
57397B403778J08253J10252J09085J04946R7144Q4198O5579M2270J5899j1589
57387C129815l7944o1470q1743r8795j12054j20827j25335j26551j25394j22603
57377B117099j18789j14081j08238j01466r4519q7831q1287p5009o9512o4879
57367A201488o0668n6610n2510m7648m1753l6462l4028l4233l4263l2119k8592
$$ y = [2762802, 2646306, 2530987, 2419050, 2312529, 2212147, 2117739, 2029745, 1948751, 1873948, 1804065, 1739730, 1682887, 1633753, 1590210, 1550362, 1514029, 1481719, 1454027, 1432247, 1417605, 1409243, 1404513, 1401869, 1402144, 1406624, 1415238, 1427225, 1442376, 1461074, 1483966, 1511991, 1545954, 1585978, 1631946, 1684122, 1742372, 1805336, 1871866, 1943097, 2021536, 2108070, 2201329, 2299972, 2403778, 2512031, 2622283, 2731368, 2836314, 2933458, 3017656, 3083235, 3125505, 3141404, 3129815, 3091871, 3030401, 2948658, 2849863, 2737809, 2616982, 2491647, 2365096, 2239702, 2117099, 1998310, 1884229, 1775991, 1674525, 1580006, 1492175, 1410888, 1335879, 1266367, 1201488, 1140820, 1084210, 1031700, 984052, 942299, 905837, 871809, 837576, 803313, 771194, 742602]
57356G42602k5394k2996k1051j9374j7651j5560j3714j3191j3555j2975j0908
57345E56233q983q348p848o130m085l670n083o508o366m911l717l831m419l518
57331D78816n96K393L436L053L064L793M347M924O448Q298Q832Q109P663P633
57317E50213O721N042M298M715M626L651L584N275P268Q381R054R323Q211O194
57303F36556N540O855P859O942N468N103N384N424N774O848P681P800Q303R498
57289G31035R719Q134O707P501R733J1263J1424J0934J0504J0765J2005J2908
57277H52632J1501Q419P113R473J3330J5716J6417J6846J7377J7629J7696J7601
57265A021750J7072J6798J7957J9650J9148J5965J3162J3196J4903J6172J6903
$$ y = [742602, 717208, 694212, 673161, 653787, 636136, 620576, 606862, 593671, 580116, 567141, 556233, 547250, 538902, 531054, 524924, 520839, 517169, 512086, 505578, 499212, 494301, 490584, 486753, 482334, 478816, 478220, 480613, 484049, 487102, 490166, 493959, 498306, 503230, 509678, 517976, 526808, 534917, 542580, 550213, 556934, 561976, 566274, 570989, 575615, 579266, 582850, 588125, 595393, 603774, 612828, 622151, 630362, 636556, 642096, 648951, 656810, 663752, 669220, 674323, 679707, 685131, 690905, 697753, 705434, 713234, 721537, 731035, 740754, 748888, 755595, 763096, 772829, 784092, 795516, 806450, 816954, 827719, 839724, 852632, 864133, 872552, 879665, 889138, 902468, 918184, 934601, 951447, 968824, 986453, 1004149, 1021750, 1038822, 1055620, 1073577, 1093227, 1112375, 1128340, 1141502, 1154698, 1169601, 1185773, 1202676]
57254A202676J7559J7404J6306J6036J7560J9166J9251J8773J8928J8732J7179
57243A399570J5682J5950J7325J8421J9609K1575K3316K3811K4140K5904K8984
57232A634287L2509L6204L9319M0476M0314M1769M5925N0150N2370N4096N6783
57221B124202N8508N7516N6124N7250N9464N9367N6960N4632N2368M8160M2207
57210B726758L6717L1999K6306J9382J3022Q123L901j38l666o718r233j0045q358
57197B828050n642m081l903l988l987l949l046o71K372N525R886J6122K2632K7850
57183B883170L2589L7941M2637M4841M4759M3178L9442L3517K8042K5305K4011
57172C279432K2030K0433K1583K5027K8897L3866M1858N1893O0970O8475P6197
$$ y = [1202676, 1220235, 1237639, 1253945, 1269981, 1287541, 1306707, 1325958, 1344731, 1363659, 1382391, 1399570, 1415252, 1431202, 1448527, 1466948, 1486557, 1508132, 1531448, 1555259, 1579399, 1605303, 1634287, 1666796, 1703000, 1742319, 1782795, 1823109, 1864878, 1910803, 1960953, 2013323, 2067419, 2124202, 2182710, 2240226, 2296350, 2353600, 2413064, 2472431, 2529391, 2584023, 2636391, 2684551, 2726758, 2763475, 2795474, 2821780, 2841162, 2854184, 2862307, 2866208, 2866070, 2862404, 2855686, 2846453, 2836408, 2828050, 2822408, 2818327, 2814424, 2810436, 2806449, 2802500, 2799454, 2798783, 2801155, 2806680, 2816566, 2832688, 2855320, 2883170, 2915759, 2953700, 2996337, 3041178, 3085937, 3129115, 3168557, 3202074, 3230116, 3255421, 3279432, 3301462, 3321895, 3343478, 3368505, 3397402, 3431268, 3473126, 3525019, 3585989, 3654464, 3730661]
57161C730661Q4334R0669R3572R3088Q9447Q3186P6235P0295O4442N6625M6952
57150D579506L7521K9943K5126K4372K8232L5264M3990N4844O8080Q1443R2424
57139E100745J01265J09280J15713J19010J19721J19433J18203J15577J12665
57130F131612J10528J08050J03898R8908R4161Q8610Q1231P3451O6763O0157N2735
57119G070104M6453M3209M1506L9203L7098L6536L6119L4398L3185L4333L5658
57108G487802L4074L0358K6853K3005J7384J1738Q408N975J912k580m801n525
57096G634603p338j0180j2888j6774k3208k9983l4595l8508m3501m6713m4430
57085G326485l8134l1585k4805j6501r757r413j5990k7526m4601o7901r3820j18475
$$ y = [3730661, 3814995, 3905664, 3999236, 4092324, 4181771, 4264957, 4341192, 4411487, 4475929, 4532554, 4579506, 4617027, 4646970, 4672096, 4696468, 4724700, 4759964, 4803954, 4858798, 4926878, 5008321, 5100745, 5202010, 5311290, 5427003, 5546013, 5665734, 5785167, 5903370, 6018947, 6131612, 6242140, 6350190, 6454088, 6552996, 6647157, 6735767, 6816998, 6890449, 6957212, 7017369, 7070104, 7116557, 7159766, 7201272, 7240475, 7277573, 7314109, 7350228, 7384626, 7417811, 7452144, 7487802, 7521876, 7552234, 7579087, 7602092, 7619476, 7631214, 7639622, 7645597, 7647509, 7644929, 7640128, 7634603, 7627265, 7617085, 7604197, 7587423, 7564215, 7534232, 7499637, 7461129, 7417628, 7370915, 7326485, 7288351, 7256766, 7231961, 7215460, 7205703, 7196290, 7180300, 7152774, 7108173, 7040272, 6946452, 6827977]
57073F827977j43372j71177j99027k22339k42138k62169k81994k99723l18349
57064D687689l42444l71643m03871m41283m86235n35748n87043o43939A65122
57054f18042q59631r46129j050583j172868j312466j478303j679830j915175k179619
57045a3212646k477861k815419l186889l587421m027553m521841n072623n680756
57037d4583009o359995p121216p955214q852820r827499j0893442j2038017j3242274
57029a20873486j4503044j5796789j7051554j8198853j9192687j9869429j9834826
57022b45320668j8699596j6545831j4042328j1935611j0435754r182291p742776
57015c33904855n984217l961957j643331J121369M414052Q127972J1997405J5672557
$$ y = [6827977, 6684605, 6513428, 6314401, 6092062, 5849924, 5587755, 5305761, 5006038, 4687689, 4345245, 3973602, 3569731, 3128448, 2642213, 2106465, 1519422, 875483, 165122, -618042, -1477673, -2423802, -3474385, -4647253, -5959719, -7438022, -9117852, -11033027, -13212646, -15690507, -18505926, -21692815, -25280236, -29307789, -33829630, -38902253, -44583009, -50943004, -58064220, -66019434, -74872254, -84699753, -95593195, -107631212, -120873486, -135376530, -151173319, -168224873, -186423726, -205616413, -225485842, -245320668, -264020264, -280566095, -294608423, -306544034, -316979788, -326162079, -333904855, -339889072, -343851029, -345494360, -344372991, -339958939, -331830967, -319833562, -304161005]
57007c04161005J8791113K1073113K2401087K2813479K2435121K1429669J9988188
57000a55229235J8306272J6545684J4818884J3197525J1715302J0369115R141302
56993f1135151Q026371P029055O145659N364169M678818M089038L585799L152097
56985a9064145K775402K448792K162852J907992J682889J490342J326679J184295
56977d084902J061481R59910Q75125c89222C41311O72328O22429N74853N28917
56968B739838M88182M51313M12776L72091L34435L02243K73471K47824K27646
56959E849819K12265J97573J81447J64642J46963J27609J08426R1632P5295N5809
56949G211480L3694J2145q602l0300n1433o8343q0855r1886j02096j09518j13820
$$ y = [-304161005, -285369892, -264296779, -241895692, -219082213, -196647092, -175217423, -155229235, -136922963, -120377279, -105558395, -92360870, -80645568, -70276453, -61135151, -53108780, -46079725, -39934066, -34569897, -29891079, -25802041, -22216242, -19064145, -16288743, -13839951, -11677099, -9769107, -8086218, -6595876, -5269197, -4084902, -3023421, -2063511, -1188386, -389222, 341311, 1013639, 1636068, 2210921, 2739838, 3228020, 3679333, 4092109, 4464200, 4798635, 5100878, 5374349, 5622173, 5849819, 6062084, 6259657, 6441104, 6605746, 6752709, 6880318, 6988744, 7080376, 7155671, 7211480, 7245174, 7257319, 7248717, 7218417, 7166984, 7098641, 7017786, 6925900, 6823804, 6714286, 6600466]
56938F600466j16620j18316j18469j18486j20045j22046j22596j22415j22345
56929E519128j19408j09467r2121o9074m0681j0218R703J954m1590j13326j95345
56918D739555k68365l18178l40383l41004l29788l12555k91300k68843k48550
56909B020589k30547k12506j93804j75378j56606j36353j16416r9889q6619p3929
56899E38542o1087m9407l8900k8895k1173j8278j9195k0792k2913k7608l3718
56888A96576l7029l6341l4790l4283B1441f532k1483j5703j1408q240n664k638
56876g1668J559N776Q494J0681J4606a0634A2994K4041K1837J7421J0304J686
56864H8283n468r762j2499j4992j7002A0362h485j8637j7001j4905j4023j3969
$$ y = [6600466, 6483846, 6365530, 6247061, 6128575, 6008530, 5886484, 5763888, 5641473, 5519128, 5399720, 5290253, 5198132, 5129058, 5088377, 5078159, 5087862, 5089816, 5048226, 4934900, 4739555, 4471190, 4153012, 3812629, 3471625, 3141837, 2829282, 2537982, 2269139, 2020589, 1790042, 1577536, 1383732, 1208354, 1051748, 915395, 798979, 699090, 612471, 538542, 477455, 428048, 389148, 360253, 339080, 320802, 301607, 280815, 257902, 230294, 196576, 159547, 123206, 88416, 54133, 21441, -6532, -28015, -43718, -55126, -63366, -69030, -71668, -70109, -64333, -55839, -45158, -30552, -10634, 12994, 37035, 58872, 76293, 86597, 88283, 82815, 73053, 60554, 45562, 28560, 10362, -8485, -27122, -44123, -59028, -73051, -87020]
56852h7020j2649r607o715n235m487l779l454l388k531m64K067M474O660Q168
56838a17960Q741R407J1276J3560J4760J5324J6971h210A3783K3538K5543K8095
56826I0959K9730K9798K8957K7229K3817J9080J4473J0357O004J782r19k078l039
56813B76150m025l951k869k008j138J445N618Q864R982J1001J4160J9027K3980
56800C56236K8683L3519L7737L9484L7088K9837J8579O098m156j0511j3749j5345
56788E43500j5903j5277j3148r411m653l7M084Q770J4678K0616K5323K9773L5861
56775F24176M3659N1882O0221O8516P3912P1564N8850L7417J1436j4163l4295
56764A053175m5736m9447m9193m7500m4559m0622l6745l2804k7310k0064j2833
$$ y = [-87020, -99669, -109276, -115991, -121226, -125713, -129492, -132946, -136334, -138865, -139329, -137262, -132788, -126128, -117960, -109219, -99812, -88536, -74976, -60216, -44892, -27921, -8210, 13783, 37321, 62864, 90959, 120689, 150487, 179444, 206673, 230490, 249570, 264043, 274400, 280404, 282186, 281267, 279189, 276150, 272125, 268174, 265305, 263297, 262159, 263604, 269222, 278086, 288068, 299069, 313229, 332256, 356236, 384919, 418438, 456175, 495659, 532747, 562584, 581163, 587261, 583105, 572594, 558845, 543500, 527597, 512320, 499172, 489761, 485108, 485071, 489155, 497925, 512603, 533219, 558542, 588315, 624176, 667835, 719717, 779938, 848454, 922366, 993930, 1052780, 1090197, 1101633, 1087470, 1053175, 1007439, 957992, 908799, 861299, 816740, 776118, 739373, 706569, 679259, 659195, 646362]
56753F46362o668n31O599J4278K2101L0725M0100M7997N1318M7925L7100J9894
56741I57200j85j8361l1570l9773m4341m6317m6306m4579m1075l6267l1829k8857
56729E47740k5886k0626j3597p744m246j090L527Q703J2811J5856J8322J9140
56717E52910J6431R724M44r224j7462k3402k7143k8952k8780k7159k5733k5571
56705C66083k5412k3240j9220j5496j3299j2135j1567j1740j2041j1235r341p619
56693A93738o539n433m297m037m661n136n146n213m945l282q48J71r30k495l193
56678A37754l501l743k939p59J108R53p65k209k287j369o97j272k459k154N04
56663A16165L244L367J631J078K463L618L347K849K822K227Q38R5L42j23j856
$$ y = [646362, 639694, 639163, 645762, 660040, 682141, 712866, 752966, 800963, 852281, 900206, 937306, 957200, 957015, 938654, 907084, 867311, 822970, 776653, 730347, 685768, 644693, 608426, 576597, 547740, 521854, 501228, 487631, 479887, 475641, 474551, 478078, 486781, 499592, 515448, 533770, 552910, 569341, 579065, 579509, 570285, 552823, 529421, 502278, 473326, 444546, 417387, 391654, 366083, 340671, 317431, 298211, 282715, 269416, 257281, 245714, 233974, 221933, 210698, 201357, 193738, 187199, 181766, 177469, 173432, 168771, 163635, 158489, 153276, 148331, 145049, 144201, 144372, 143442, 140947, 137754, 134253, 130510, 127571, 126812, 127920, 128873, 128108, 125899, 123612, 122243, 121546, 120274, 117815, 115661, 116165, 119409, 122776, 124407, 125485, 127948, 131566, 134913, 137762, 140584, 142811, 143649, 143744, 144086, 143963, 142107]
56648A42107k799j505N85J667K083K680K834J921R35Q58J068R05J037J771J856
56633A58003O19m76j80L36m32j636j648r81j444l226m831n371n244m933m532m110
56617A19914l552k532j365j071j900k711k514j561m22Q20J809J858J292J405K332
56602A11802K628J742J041J381J603O35q50k177m053o552p772o544m833n181p077
56587G5793q092p638p266p792q225p475n669l719k518k212j688M26L642N602M896
56572B8065K832J631K181M205P000R095Q927P080O216P540R052Q568O641N011
56558A14044M054L523L886M885M569K048m41m96P98P29q46j843j639j593k271
56543A29407k655k077r26M74K014L041L038K720L087L847M169M217M465M442L783
$$ y = [142107, 139308, 137803, 138388, 140055, 142138, 144818, 147652, 149573, 150508, 151366, 152434, 153339, 154376, 156147, 158003, 158622, 158146, 157966, 158302, 157870, 156234, 154586, 153605, 152161, 148935, 144104, 138733, 133489, 128556, 124024, 119914, 116362, 113830, 112465, 111394, 109494, 106783, 104269, 102708, 102286, 103106, 104915, 106773, 108065, 109470, 111802, 114430, 116172, 117213, 118594, 120197, 120832, 119982, 117805, 113752, 107200, 99428, 92884, 88051, 82870, 75793, 67701, 60063, 52797, 45005, 36780, 29305, 23636, 19917, 17399, 15187, 13499, 13925, 17567, 23169, 28065, 30897, 32528, 34709, 38914, 45914, 55009, 63936, 71016, 77232, 84772, 93824, 102392, 109033, 114044, 118098, 121621, 125507, 130392, 134961, 137009, 136568, 136072, 136870, 137599, 136753, 134910, 133271, 131678, 129407, 126752, 124675, 123749, 124223, 126237, 129278, 132316, 135036, 138123, 141970, 146139, 150356, 154821, 159263, 163046]
56528A63046L551M641N830N345L648K597K535K315J589J000N68m2l9J596M024
56513B02204N349N199M740M374L623K943L522N181O515P218Q329R989J0990J0931
56499B91107J1035J2191J3620J4090J3391J2285J1825J2682J4253J4771J3306
56488D34556J1225J0404J0645J0419R565R263R409Q283N309K306J070R83k2k819
56474E20596o123p958p744o992p552r267j0220r593r033j0227j2400j3570j3222
56461C96695j2248j1079r612q386q141q531q642q494q638q822q355p390o524n706
56447B76127m822m693n867p117o775n145l963l872m069m040l988l749k871j660
56433B13496p87j56O05R19M8j404k152k047j801j392k95J145K027K296K513K659
$$ y = [163046, 166597, 171238, 177068, 182413, 186061, 188658, 191193, 193508, 195097, 196097, 196665, 196623, 196584, 198180, 202204, 207553, 212752, 217492, 221866, 225489, 228432, 231954, 237135, 243650, 250868, 259197, 269186, 280176, 291107, 302142, 314333, 327953, 342043, 355434, 367719, 379544, 392226, 406479, 421250, 434556, 445781, 456185, 466830, 477249, 486814, 496077, 505486, 513769, 519078, 521384, 522454, 523437, 523415, 520596, 514473, 506515, 498771, 491779, 484227, 474960, 464740, 455147, 446114, 435887, 423487, 409917, 396695, 384447, 373368, 363756, 355370, 347229, 338698, 330056, 321562, 312924, 304102, 295747, 288357, 281833, 276127, 271305, 266612, 260745, 253628, 246853, 241708, 237745, 233873, 229804, 225764, 221776, 218027, 215156, 213496, 212709, 212553, 213158, 214077, 214125, 212721, 210569, 208522, 206721, 205329, 205034, 206179, 208206, 210502, 213015, 215674]
56417B15674K462K274K349K060J212J125K753M720N102M305M130M834N305N418
56403B63723N933O519O216N423N268N462M972M362M977O247O304N171M700N331
56389C40608N551M835M591N557O474O032M369K303O76N57K224L833L131N64j215
56374C90090r66j4K83No12j763k963l276l014l403m323m274k838j336p45p99j314
56357C58738k476l595l387j974q42p89j443k650m461n859n647m581m540n592o023
56342C04879n236m409m190l847k924j773m88P28N41j855m476m622k790j657j583
56327B66298n23J568K034k2k092k321j900k153k129p54J197K674L777M452M052
56312B74158L190L606N294O165N497N032N657N866M814M064M705N476N359N429
$$ y = [215674, 218136, 220410, 222759, 224819, 226031, 227156, 229909, 234629, 239731, 244036, 248166, 253000, 258305, 263723, 269656, 276175, 282391, 287814, 293082, 298544, 303516, 307878, 312855, 319102, 325406, 330577, 335277, 340608, 346159, 350994, 355585, 361142, 367616, 373648, 378017, 380320, 380996, 381553, 383777, 387610, 390741, 391305, 390090, 389124, 389110, 389393, 389398, 388786, 387023, 384060, 380784, 377770, 374367, 370044, 365770, 362932, 361596, 360851, 360052, 358738, 356262, 352667, 349280, 347306, 346464, 345675, 344232, 341582, 337121, 331262, 325615, 321034, 316494, 310902, 304879, 299643, 295234, 291044, 287197, 284273, 282500, 282012, 282740, 283281, 281426, 276950, 272328, 269538, 267881, 266298, 265775, 267343, 269377, 269355, 267263, 264942, 263042, 260889, 258760, 258006, 259203, 261877, 265654, 270106, 274158, 277348, 280954, 286248, 292413, 297910, 302942, 308599, 314465, 319279, 323343, 328048, 333524, 338883, 344312]
56298C44312O262O117L802J081J47N97R75J403K571L773M067M050M601N103M583
56283C93444L578L320L981M870N334M704K646L26l74N65J181O35L99J575L262
56268D29446M629O304Q275Q722O689M102L348M415N966P610R468J0835J1007J0512
56254E31328J0358J0736J1308J1720J1530J0689J0274J1178J2210J1437R276P925
56242F59969P767P203O174O514Q079P940M864J486M48J242K315L485M573M411
56228G26470L190L238N626Q320R349R539J0436J1970J3737J6260J9386K1687K2817
56215H82025K4088K5661K6025K5443K6607L0355L4135L6503L9553M4677M9467
56204A244539N1676N2986N6043O0644O5671P1937Q0107Q8383R5170J01656J09093
$$ y = [344312, 350574, 356691, 360493, 361574, 361721, 362318, 363293, 364696, 367267, 371040, 375107, 379157, 383758, 388861, 393444, 397022, 400342, 404323, 409193, 414527, 419231, 421877, 422203, 421829, 422394, 423575, 424210, 424609, 426184, 429446, 434075, 440379, 448654, 457376, 464065, 468167, 471515, 475930, 481896, 489506, 498974, 509809, 520816, 531328, 541686, 552422, 563730, 575450, 586980, 597669, 607943, 619121, 631331, 642768, 652044, 659969, 667736, 674939, 681113, 687627, 695706, 703646, 708510, 709996, 710444, 711686, 714001, 717486, 722059, 726470, 729660, 732898, 738524, 746844, 756193, 765732, 776168, 788138, 801875, 818135, 837521, 859208, 882025, 906113, 931774, 957799, 983242, 1009849, 1040204, 1074339, 1110842, 1150395, 1195072, 1244539, 1296215, 1349201, 1405244, 1465888, 1531559, 1603496, 1683603, 1771986, 1867156, 1968812, 2077905]
56193B077905J16170J21794J27698J35321J42664J47218J49416J50251J48100
56184C316537J41228J30992J19482J06297R0692P4298N8394M1162K1188J252j5087
56173D086435k8496m1650n4126o3407o9232p3277p5978p7050p7507p7979p6905
56162C370828p3706p1589p3586p7856q0571q1521q2927q4642q4787q3772q3534
56151B492337q3903q3359q2267q1820q1120p8741p5723p3482p0501o4876n8507
56140A658038n4686n2810m9654m4710m0313l7370l4894l2811l1482k9372k4939
56129A224997k0000j7562j7287j6601j5126j4294j3684j1710r068p838p823p184
56117A066820n825m840l700j309J364K904M222O456P986P111N818O982R626J0989
$$ y = [2077905, 2194075, 2315869, 2443567, 2578888, 2721552, 2868770, 3018186, 3168437, 3316537, 3457765, 3588757, 3708239, 3814536, 3905228, 3979526, 4037920, 4079082, 4100270, 4101522, 4086435, 4057939, 4016289, 3962163, 3898756, 3829524, 3756247, 3680269, 3603219, 3525712, 3447733, 3370828, 3297122, 3225533, 3151947, 3074091, 2993520, 2911999, 2829072, 2744430, 2659643, 2575871, 2492337, 2408434, 2325075, 2242808, 2160988, 2079868, 2001127, 1925404, 1851922, 1781421, 1716545, 1658038, 1603352, 1550542, 1500888, 1456178, 1415865, 1378495, 1343601, 1310790, 1279308, 1249936, 1224997, 1204997, 1187435, 1170148, 1153547, 1138421, 1124127, 1110443, 1098733, 1089665, 1081827, 1074004, 1066820, 1060995, 1056155, 1052455, 1051146, 1052510, 1055414, 1059636, 1066092, 1074078, 1081189, 1087007, 1093989, 1103615, 1114604]
56103A114604J1414J2917J4765J4906J4209J4727J5491J4656J4003J6319J9867
56092A277878K0719J9243J8958K0121K0041J8976K0063K3566K6528K8195L0894
56081A525182L5378L9840M3603M7656N1852N5531O0207O7700P6505Q4216R2114
56070B179784J03038J16233J29101J42327J58002J74136J86470J94258J98816
56061C582165J98000J88518J72827J57356J44505J32173J20147J10170R9956Q3923
56051D989740O0635L4016P446j7766l8718n2333o0858p0128q2244r5300j09433
56040D565057j26733j45270j59691j67916j71592j70545j63198j51935j41410
56031C166767j31558j18855j04034r1721q2701p3568o3909n6727n1804m5864l9289
$$ y = [1114604, 1126018, 1138935, 1153700, 1168606, 1182815, 1197542, 1213033, 1227689, 1241692, 1258011, 1277878, 1298597, 1317840, 1336798, 1356919, 1376960, 1395936, 1415999, 1439565, 1466093, 1494288, 1525182, 1560560, 1600400, 1644003, 1691659, 1743511, 1799042, 1859249, 1926949, 2003454, 2087670, 2179784, 2282822, 2399055, 2528156, 2670483, 2828485, 3002621, 3189091, 3383349, 3582165, 3780165, 3968683, 4141510, 4298866, 4443371, 4575544, 4695691, 4805861, 4905817, 4989740, 5050375, 5084391, 5091837, 5074071, 5035353, 4983020, 4922162, 4852034, 4769790, 4674490, 4565057, 4438324, 4293054, 4133363, 3965447, 3793855, 3623310, 3460112, 3308177, 3166767, 3035209, 2916354, 2812320, 2720599, 2637898, 2564330, 2500421, 2443694, 2391890, 2346026, 2306737]
56020B306737l5519l3859l0311k5286k2835k2365j9140j3154r407r083q533p066
56008B070179p237p409k947M623Q755Q750J0316J4716J7107J6699J8601K3819
55996B175972K7253K7553K9289L3459L5448L4561L5759L9774M1373L9552L9586
55985B559579M2730M4076M2787M4022M8327M9980M8359M9931N6085O0245O0108
55974C106229O1384O6252O9750P0959P5740Q4740R0878R2510R6603J04954J10365
55963D030364J10864J14195J23141J30164J32205J36952J48120J58334J63296
55954E247635J69491J80961J92082K00304K12260K30149K46065K57052K71393
55945G207392K92586L11952L24920L39365L59719L78530L92511M10923M38897
$$ y = [2306737, 2271218, 2237359, 2207048, 2181762, 2158927, 2136562, 2117422, 2104268, 2094861, 2085778, 2077245, 2070179, 2062942, 2055533, 2052586, 2057209, 2065964, 2074714, 2085030, 2099746, 2116853, 2133552, 2152153, 2175972, 2203225, 2230778, 2260067, 2293526, 2328974, 2363535, 2399294, 2439068, 2480441, 2519993, 2559579, 2602309, 2646385, 2689172, 2733194, 2781521, 2831501, 2879860, 2929791, 2985876, 3046121, 3106229, 3167613, 3233865, 3303615, 3374574, 3450314, 3535054, 3625932, 3718442, 3815045, 3919999, 4030364, 4141228, 4255423, 4378564, 4508728, 4640933, 4777885, 4926005, 5084339, 5247635, 5417126, 5598087, 5790169, 5990473, 6202733, 6432882, 6678947, 6935999, 7207392, 7499978, 7811930, 8136850, 8476215, 8835934, 9214464, 9606975, 10017898, 10456795]
55936A0456795M68603M96009N29611N73127O17088O57449P04100P60462Q13980
55927A6077224Q58031R03492R56704J007094J049629J097550J158551J220767
55919B4329042J277849J344954J433385J532571J634011J748688J883511K026658
55911C7210669K174745K346361K548612K760215K969847L200053L471003L776027
55903F0457532M118282M532552N041791N635110O322345P164109Q208907R448897
55895A10929525J0877869J2536239J4454497J6622657J9069096K1881296K5079443
55888B31450622K8574038L2288904L6021176L8818700L8662673L3441692K2747438
55881D62005243Q671565n388730j6762803k4511413k8977986l0923119l1098276
$$ y = [10456795, 10925398, 11421407, 11951018, 12524145, 13141233, 13798682, 14502782, 15263244, 16077224, 16935255, 17838747, 18795451, 19802545, 20852174, 21949724, 23108275, 24329042, 25606891, 26951845, 28385230, 29917801, 31551812, 33300500, 35184011, 37210669, 39385414, 41731775, 44280387, 47040602, 50010449, 53210502, 56681505, 60457532, 64575814, 69108366, 74150157, 79785267, 86107612, 93271721, 101480628, 110929525, 121807394, 134343633, 148798130, 165420787, 184489883, 206371179, 231450622, 260024660, 292313564, 328334740, 367153440, 405816113, 439257805, 462005243, 470676808, 465288078, 448525275, 424013862, 395035876, 364112757, 333014481]
55874C33014481l0158648k8580627k6626301k4455010k2221617k0034611j7913329
55867A63024338j5863934j3951668j2251868j0779666r512480q436583p529209
55860H4698930o736000o011717n357508m787584m289196l844733l461963l149592
55852D7060637k887274k649247k436238k258073k105466j963774j835491j725487
55844B9199587j621289j510021j399101j300294j208819j116935j032558r65499
55836A9045071r09241q53832q03364p64188p29291o90463o53071o23307n93622
55827A2424692n56342n19270m92302m70171m43666m16660l96739l79282l56112
55818H394148l30803l11075k94469k75135k56453k43725k32263k15476j97266
$$ y = [333014481, 302855833, 274275206, 247648905, 223193895, 200972278, 180937667, 163024338, 147160404, 133208736, 120956868, 110177202, 100664722, 92228139, 84698930, 77962930, 71951213, 66593705, 61806121, 57516925, 53672192, 50210229, 47060637, 44173363, 41524116, 39087878, 36829805, 34724339, 32760565, 30925074, 29199587, 27578298, 26068277, 24669176, 23368882, 22160063, 21043128, 20010570, 19045071, 18135830, 17281998, 16478634, 15714446, 14985155, 14294692, 13641621, 13018314, 12424692, 11868350, 11349080, 10856778, 10386607, 9942941, 9526281, 9129542, 8750260, 8394148, 8063345, 7752270, 7457801, 7182666, 6926213, 6682488, 6450225, 6234749, 6037483]
55809F037483j84404j74232j61561j50050j45006j42446j36866j32587j35751
55800D674580j42162j44538j45010j48899j52737j50295j44603j42379j41740
55791C362217j36602j28252j21643j14899j03358q9881q0753p4838o6487n5668
55781B389836m6227l8046k9961k6391l1736m1505m7639m9314n0474n0779m7534
55770A930230m2959m0937l9783l6179l2692l3377l5630l4665l2665l4933m0157
55759A526253m2855m2809m3824m5519m4404m1077l8934l7650l4749l1391l0018
55748A093023k8750k4792k0436j9155j8747j5169j0079p588o627l734l50J1j056
55735I36551J09J763r5l880n326n579q463j2180j2056r558j0023j3000j3327j0813
$$ y = [6037483, 5853079, 5678847, 5517286, 5367236, 5222230, 5079784, 4942918, 4810331, 4674580, 4532418, 4387880, 4242870, 4093971, 3941234, 3790939, 3646336, 3503957, 3362217, 3225615, 3097363, 2975720, 2860821, 2757463, 2667582, 2586829, 2511991, 2445504, 2389836, 2343609, 2305563, 2275602, 2249211, 2217475, 2175970, 2128331, 2079017, 2028543, 1977764, 1930230, 1887271, 1846334, 1806551, 1770372, 1737680, 1704303, 1668673, 1634008, 1601343, 1566410, 1526253, 1483398, 1440589, 1396765, 1351246, 1306842, 1265765, 1226831, 1189181, 1154432, 1123041, 1093023, 1064273, 1039481, 1019045, 999890, 981143, 965974, 955895, 948307, 941680, 937946, 937596, 937607, 936551, 936660, 938423, 938328, 934448, 929122, 923543, 915080, 902900, 890844, 881286, 871263, 858263, 844936, 834123]
55721H34123j0250j2138j1839q326n788n857n554l993m140o749q913r861j2226
55708G28489j6375j8989j8564j7234j6301j4637j2291j1001j0604r154o952o355
55696E70032p669r334j1565j5369j8660j8216j5131j3515j3995j3354j0397p385
55684D15442n553l945k776l491n205n375m121l885m897m904l360j895r63K33J040
55669C66345L89k95P49J668m76m311n826m615l657l724l122k403l979p029p853
55654C21861n691l574l077k751j951j739j647P3K692L635L025L394M905N106L526
55639C27787K243J718L91j580k340k117k671l188j280K047L321K513L053N609
55625C35506O988N957N116N866O383N772N671O346N603K997Q68lj648m528o179
$$ y = [834123, 823873, 811735, 799896, 791570, 785782, 779925, 774371, 770378, 766238, 759489, 750576, 740715, 728489, 712114, 693125, 674561, 657327, 641026, 626389, 614098, 603097, 592493, 583339, 576387, 570032, 562363, 553029, 541464, 526095, 507435, 489219, 474088, 460573, 446578, 433224, 422827, 415442, 409889, 405944, 403168, 399677, 394472, 389097, 384976, 381091, 376194, 371290, 367930, 366035, 365072, 365305, 366345, 366734, 366439, 367188, 368856, 368380, 364069, 358243, 353628, 349971, 346247, 343125, 340722, 336743, 329714, 321861, 316170, 312596, 309519, 306768, 304817, 303078, 301431, 301504, 304196, 307831, 310856, 314250, 319155, 324261, 327787, 330030, 331748, 332139, 330559, 328219, 326102, 323431, 320243, 318963, 321010, 324331, 326844, 329897, 335506, 342494, 348451, 353567, 359433, 365816, 371588, 377259, 383605, 389208, 392205, 393073, 393070, 391422, 386894, 380715]
55610C80715n644n150n836n819m130k713k797k905k060j549j978j935r87o99j452
55595C35061j574p15o14j565j751r92j208k236j490Q66J014k296n120m310k065
55580C11005j744l019m213n918q863j0960r896o691l923k335j575k175m225n866
55566B39602n610m676n016o412p359p408o916n886m673m367n147n586m724l396
55552A62426k541j860j084q07j094r40j05K90k22o88o57r88k043k978l400l750
55536A39559l693k398p22n32j390q41J328K337R70m02J16J004M07o55l97P37J421
55519A36849J895K937M060M519M648M735M205L294L768O343R015R514Q169O914
55505B10865O816P753R201J0182R627P665N482L521J282j050k685m212p104j0823
$$ y = [380715, 375071, 369921, 364085, 358266, 354136, 351423, 348626, 345721, 343661, 342112, 340134, 338199, 337212, 336513, 335061, 333487, 332772, 332158, 330593, 328842, 327850, 326642, 324406, 322916, 323782, 324796, 322500, 317380, 313070, 311005, 309261, 306242, 302029, 296111, 287248, 276288, 266392, 259701, 255778, 253443, 251868, 249693, 245468, 239602, 233992, 229316, 224300, 217888, 210529, 203121, 196205, 190319, 185646, 181279, 176132, 170546, 165822, 162426, 159885, 158025, 156941, 156134, 155040, 154100, 153995, 154285, 154063, 153375, 152718, 151730, 149687, 146709, 143309, 139559, 135866, 133468, 132746, 132214, 130824, 129983, 131311, 133648, 134618, 134216, 134332, 135336, 135743, 135088, 134691, 135428, 136849, 138744, 141681, 145741, 150260, 154908, 159643, 163848, 167142, 170910, 177253, 186268, 195782, 203951, 210865, 217681, 225434, 234635, 244817, 254444, 262109, 267591, 271112, 272394, 271344, 268659, 264447, 257343, 246520]
55491B46520j2839j2218j0812j0113r495q476p986q244p883o493n598n793n486
55478A35084l798k199j764j354r9P30K08l02M51J418J377J162J886K877L187L335
55462A42199L742L362J648N1k66l43j224j797p56R72J843K139K787L198K368Q90
55446A60813m6n76j411k223k391k379k996m094n137n962o331n992n823p040q673
55431I9739q075n013k678l237m861n003m198m274m827m173k417j156q95q29m83
55416D7620n4K01r2j170k171j812n98l94j203q51J181K349J005j034j664j414
55400C9899j133K75L049M324K006j360k007n01k00j619k139p36P14Q86P30J238
55384D3426J927J955J034q13k914l741k550p87l32q98o94Q69K679L486K722M69
$$ y = [246520, 233681, 221463, 210651, 200538, 191043, 182567, 174581, 166337, 158454, 151961, 146363, 140570, 135084, 131286, 129087, 127323, 125969, 125870, 126600, 126808, 126506, 126957, 128375, 129752, 130914, 132800, 135677, 138864, 142199, 145941, 149303, 150951, 151002, 150736, 150393, 149169, 147372, 146616, 147588, 149431, 151570, 154357, 157555, 159923, 160813, 160767, 160191, 158780, 156557, 154166, 151787, 148791, 144697, 139560, 133598, 127267, 121275, 115452, 108412, 99739, 91664, 86651, 83973, 80736, 75875, 70872, 66674, 62400, 57573, 53400, 50983, 49827, 48932, 48103, 47620, 47566, 47767, 47675, 46505, 44334, 42522, 41924, 41530, 40327, 39476, 40657, 43006, 44011, 42977, 41313, 39899, 38766, 39041, 42090, 46414, 48420, 47060, 45053, 44552, 44352, 42733, 40594, 39858, 40572, 41458, 42188, 43426, 45353, 47308, 48342, 47529, 44615, 40874, 38324, 37537, 37205, 36307, 35613, 36482, 39161, 42647, 45369, 45838]
55368D5838k105l193k461j658j936j963k29K246L420L108K418J522J30q90m94
55353D3753O90J408J852K864L936L942L039K016O41j479l200k965j050J044K579
55338E9070L427K906P83j396j953j360j180j599j765j647j681j447n64j5o95j559
55322D9325j186k57l81j278j326k86O41Q74O43j93j534k036p98O18R6j784k592
55305C8546j676o03l98o39j099k027k666j600J015L258L705K605Q84p13j514j282
55289C5796o61m41o47r50j259j245m05O92O15o04j057K1Q60K20l90M64J344M49
55271C2802j201j652j293j330r38R55K634J808l43p87O85J849K081K434K489R53
55255D1146j070j152K34K41j654l089k978k609k441j432J8J11p89l24J581K242
$$ y = [45838, 43733, 40540, 38079, 36421, 34485, 32522, 32293, 34539, 37959, 41067, 43485, 45007, 45137, 44247, 43753, 44443, 45851, 47703, 50567, 54503, 58445, 61484, 63500, 64141, 62662, 59462, 56497, 55447, 56491, 59070, 62497, 65403, 66186, 64790, 62837, 61477, 60297, 58698, 56933, 55286, 53605, 52158, 51594, 51579, 50884, 49325, 48139, 47882, 47501, 46223, 44897, 44611, 45252, 46126, 46769, 46576, 45042, 43006, 42208, 42826, 42922, 41138, 38546, 36870, 36267, 35869, 35230, 34131, 32104, 29438, 27838, 28853, 32111, 35816, 38421, 39305, 38592, 37078, 35796, 35135, 34694, 34047, 33097, 31838, 30593, 30188, 30880, 31495, 30891, 29834, 29855, 30715, 30935, 30545, 31009, 32353, 32802, 31601, 29949, 28656, 27326, 26388, 27343, 29977, 31785, 31442, 30655, 31340, 33189, 35270, 37704, 40193, 41146, 40076, 38924, 39158, 39399, 37745, 34656, 31678, 29069, 26628, 25196, 25214, 25325, 24536, 24212, 25793, 28035]
55239B8035R47L65J803K770J074j738l013k424r49J047K977L436K196R12M76j70
55223C7744j466j845m99Q69Q64P58K018L368K650K30j587j678p95N8M12Q5o17
55206D0569q97n07k13n62j117j441j775k167j928p58N26J014O89M4n00n44kM81
55188C0912L23N0M05Q26L59l97j59N87K27q98o79J097J932L48j897k509j510k10
55170B8807Q05J329Q22o22j840k113j937j631p03P38J502J147P54J140J724J935
55154C1857K153K413J804J26j308j407o38J78R89J769K081K009K100J948N66j429
55138D5211j973o14O53M93J19R25K120K177R97n69j882k229r88Q77J215l44j661
55121D4527j249k53n0j34J43j32j435k061n29J795K616J934J310J193J041R97
$$ y = [28035, 28982, 29347, 31150, 33920, 34994, 33256, 30243, 27819, 26870, 27917, 30894, 34330, 36526, 37438, 37914, 37744, 36278, 34433, 33934, 34803, 35667, 36425, 38443, 41811, 44461, 44691, 43104, 41426, 40631, 40689, 41101, 41186, 40569, 39672, 39165, 38952, 38390, 37273, 35832, 34057, 31890, 29962, 29204, 29730, 30744, 31433, 31477, 30977, 30433, 30431, 30912, 31235, 31285, 31690, 32516, 32875, 32478, 32319, 32906, 33133, 32235, 31556, 32653, 34585, 34933, 33036, 30527, 29017, 28807, 29612, 30941, 31763, 31141, 29301, 27188, 25251, 23620, 22917, 23655, 25157, 26304, 27058, 28198, 29922, 31857, 34010, 36423, 38227, 38353, 37045, 35638, 35000, 35178, 36167, 37936, 40017, 42026, 44126, 46074, 46640, 45211, 43238, 42624, 43277, 43770, 43889, 44814, 46934, 49111, 50108, 49539, 47657, 45428, 44440, 45317, 46532, 46188, 44527, 43278, 43025, 42975, 42841, 42984, 42852, 41417, 39356, 38827, 40622, 43238, 45172, 46482, 47675, 48716, 49713]
55105D9713J364J326J54j147j292q94j260j863j292j1J40j023j714j041j54r5
55089D0911l17MM80J93r08j925k009j107O1O59M08m67j748l229m252l964k289
55072B0501k6K088L690M383L918K797J700M76j104j893m35K508M364M080L154
55057E0201K972L132L086L339L919L618J915k4j303k413l462l227j344M79Q60
55042F1748N49M79N4r57r30J109L149K743N46q64o03K03P13R74R38O96Q28J234
55024G2609P07q45j333M72K475K048j16j405j266j079j078k62J070J511J069J019
55008G5596J355Q37m21q47j15L65o8m50k57l09j027j407n29J135K315K012J3k603
54990G5595l812k692p99j87o98p01J45Q10J079J642K154J413k61j018k41N63K17
$$ y = [49713, 51077, 52403, 52557, 51410, 50118, 49224, 47964, 46101, 44809, 44798, 44938, 43915, 42201, 41160, 41006, 40911, 40594, 40598, 41078, 41271, 40363, 38438, 36429, 35322, 35383, 36042, 36450, 35983, 34235, 31006, 26754, 22790, 20501, 20475, 22563, 26253, 30636, 34554, 37351, 39051, 39527, 38423, 36530, 36095, 38603, 42967, 47047, 50201, 53173, 56305, 59391, 62730, 66649, 70267, 72182, 72158, 70855, 68442, 64980, 61753, 60409, 60888, 61748, 62297, 62776, 62830, 61873, 60943, 62052, 65201, 67944, 68490, 67626, 67023, 67226, 67939, 68913, 69851, 70547, 71375, 72609, 73316, 72471, 71138, 71610, 74085, 76133, 76017, 74612, 73346, 72267, 71189, 70927, 71997, 73508, 74577, 75596, 76951, 77788, 77367, 76520, 76405, 76770, 76702, 76252, 75995, 75686, 74659, 73252, 72723, 73858, 76173, 78185, 78198, 75595, 71783, 69091, 68292, 68105, 67407, 66706, 66851, 67661, 68740, 70382, 72536, 73949, 73688, 72670, 72429, 72992, 73209]
54973G3209n23m70M21J637K851L527L126K194K080K955L400K415P19m96j001j102
54957I4942q35k97K7m6O4R59K374L285K782J017n51l61J359K550J841K40o13q01
54939A07936j369k098j834o43J95R9l98r97j693j784n98R16J104R4m97l51p01
54922I7381j608j314P68K557K043j70k174l106l008j754L07J679J315K53L65J773
54906I5307K820K381J167N47R52J743K250K518L020L784M307M380M559N335O230
54891A41300O407N848N245M984M982N203N634O024O449P700J0079J2283J2738
54878B34876J1764J1069J1124J0640Q756O248L967J386k365o853j0555j2391j2659
54865B55007j2630j3247j4086j3839j2160j0343r427q507o241l372k071k910m168
$$ y = [73209, 72686, 72216, 72637, 74274, 77125, 80652, 83778, 85972, 88052, 91007, 94407, 96822, 97541, 97045, 96044, 94942, 94107, 93810, 93837, 93791, 93855, 94814, 97188, 100473, 103255, 104272, 103721, 103360, 104719, 107269, 109110, 109350, 108737, 107936, 106567, 104469, 102635, 101992, 102187, 102286, 101888, 100891, 99198, 97414, 96816, 97732, 98836, 98930, 98433, 98082, 97381, 95773, 94459, 95227, 97784, 99827, 99657, 97483, 94377, 91369, 89615, 89922, 91601, 92916, 93169, 93534, 95307, 98127, 100508, 101675, 102222, 103174, 104917, 107167, 109685, 112705, 116489, 120796, 125176, 129735, 135070, 141300, 147707, 153555, 158800, 163784, 168766, 173969, 179603, 185627, 192076, 199776, 209855, 222138, 234876, 246640, 257709, 268833, 279473, 288229, 294477, 298444, 299830, 297465, 290612, 280057, 267666, 255007, 242377, 229130, 215044, 201205, 189045, 178702, 169275, 160768, 154527, 151155, 149084, 146174, 142006]
54852A42006m243l243j783J42K463M408N259M981L781K000O56R90K965N227O773
54837A72382P868R008J0079J0812J1151J0876R726Q020O313M315J338k258n322
54824B54308p670j0053j2213j2742j1475j0325j0662j1319j0354p797n442m598
54812A39658n026n575n142l578k005j633j992j477J68J264P15m81j178k008l728
54797A07982n061m114j359P46R96N03M91O17J13p52j227j316j561j940j765p76
54781I1577K86M73k28q77p92l21k32o95j332j963k723l363l178j825J01J510J580
54764G7998K44j666k799k349q70K43K10m42n43N83K466L886M081L683L804M193
54748I2722L354J023q03m15J187J958J934K761M596N761N482N013N419O141O421
$$ y = [142006, 137763, 134520, 132737, 132879, 135342, 139750, 145009, 149990, 153771, 155771, 156427, 157417, 160382, 165609, 172382, 180250, 189258, 199337, 210149, 221300, 232176, 241902, 249922, 256235, 260550, 261888, 259630, 254308, 246638, 236585, 224372, 211630, 200155, 189830, 179168, 167849, 157495, 149698, 144256, 139658, 134632, 129057, 123915, 120337, 118332, 116699, 114707, 113230, 113398, 114662, 115377, 114896, 113718, 111710, 107982, 102921, 98807, 97448, 98194, 99190, 99693, 100184, 100801, 100914, 100162, 98935, 97619, 96058, 94118, 92353, 91577, 91863, 92336, 92108, 91231, 90439, 90118, 89886, 89191, 87859, 85896, 83173, 79810, 76632, 74807, 74908, 76418, 77998, 78242, 76576, 73777, 71428, 70558, 70801, 71011, 70569, 70026, 70609, 73075, 76961, 81042, 84725, 88529, 92722, 96076, 97099, 96296, 95881, 97068, 99026, 100960, 103721, 108317, 114078, 119560, 124573, 129992, 136133, 142554]
54733A42554O491O577O140N057M475N575Q321J1849J5176J7126J6868J5177J3922
54720B75308J3495J2048Q150L073p77k749m026n531p105q382r256r510q894p663
54706B48181o439n574n013m659m479m282l725k583j036L42J151J900L632O408
54692B23824Q797R620R529R860J0585J0766J0449J0563J1155J1445J1369J1317
54680C49279J0508P854M458K806K949K064j324n317q122j0825j4657j7836j7883
54667C03954j5568j3846j3730j3712j2670j1095r648q521q106q398q043n729k473
54654A72415p20j233k593l646m491m916l960j772j17p0p02r79j479k964m308l635
54638A34830r85J556K407K018J680J920K497L093L312K501N69j245j388K6J226
$$ y = [142554, 149045, 155622, 161762, 166819, 171294, 176869, 185190, 197039, 212215, 229341, 246209, 261386, 275308, 288803, 300851, 309001, 312074, 311297, 308548, 304522, 298991, 291886, 283504, 274248, 264738, 255844, 248181, 241742, 236168, 231155, 226496, 222017, 217735, 214010, 211427, 210391, 210733, 211884, 213784, 217416, 223824, 232621, 242241, 251770, 261630, 272215, 282981, 293430, 303993, 315148, 326593, 337962, 349279, 359787, 367641, 372099, 374905, 377854, 379918, 378594, 373277, 365155, 354330, 339673, 321837, 303954, 288386, 274540, 260810, 247098, 234428, 223333, 213685, 205164, 197058, 188660, 180617, 174888, 172415, 171695, 170462, 167869, 164223, 159732, 154816, 150856, 149084, 148967, 148897, 148195, 147216, 145737, 142773, 138465, 134830, 133845, 135401, 137808, 139826, 141506, 143426, 145923, 149016, 152328, 154829, 155398, 154153, 152765, 152791, 154017]
54623A54017J157Q41J600K782K622J011j46N80K554M299N134N128M521L861L833
54608A93794M364M586M166L884M348M960M865M175L555L153K712K334K372K748
54594B46016K893K355J328P06J430L252M509M012K956L741O844J0191J1886J2205
54580C14324J2322J2540J2487J1986J0880Q950O659M942L737J899q95l527n372
54567C90932p320r867j1748j1824j0930j0465j0372j0002r743j0081j0024q385
54555B70171n964m620m647m712m073l262k740k300j763j191n75k11p68k144l013
54540B28188k592j938k236k838k628k254k987m171m031k642j880k489l284l393
54526A88825l254l149k632j804j510j945k545l385m976o633o862n666m567m031
$$ y = [154017, 155174, 156015, 157615, 160397, 163019, 164030, 163884, 164464, 167018, 171317, 176451, 181579, 186100, 189961, 193794, 198158, 202744, 206910, 210794, 215142, 220102, 224967, 229142, 232697, 235850, 238562, 240896, 243268, 246016, 248909, 251264, 252592, 253298, 254728, 257980, 262489, 266501, 269457, 273198, 280042, 290233, 302119, 314324, 326646, 339186, 351673, 363659, 374539, 383489, 390148, 395090, 398827, 400726, 399831, 396304, 390932, 383612, 373745, 361997, 350173, 339243, 328778, 318406, 308404, 298661, 288580, 278556, 270171, 264207, 259587, 254940, 250228, 246155, 242893, 240153, 237853, 236090, 234899, 234324, 234113, 233345, 231201, 228188, 225596, 223658, 221422, 218584, 215956, 213702, 210715, 206544, 202513, 199871, 197991, 195502, 192218, 188825, 185571, 182422, 179790, 177986, 176476, 174531, 171986, 168601, 163625, 156992, 150130, 144464, 139897, 135866]
54512A35866k910r31M69O57Q93J813J920K86j144o7K551L559J738j047k525k043
54496A39085m6K708M973N366L726J568N87J023J707J529O65K83J053K164K172
54481A68563P95o96r71P2J768L673N438O318N690M137L191L790N328O456O567
54466B20119O065N378M273K476N36o10r20j403k724m333n304n420m926l949k900
54451B06358k792m074n526n466m023l008l325l738k781j009l47j481k805k343
54437A63640k20J439J138j96n67M42J427J368P97N21N42Q16J748L054L347K011
54421A81307M44K62J196K104K896L868M136K746O21n45q59j508k011p63J683K674
54405A98251J328j64J4R47J353J912L524M988M510K388M70k93k30L09J024J100
$$ y = [135866, 132956, 132025, 132494, 133151, 134044, 135857, 137777, 138063, 136919, 136852, 139403, 142962, 144700, 143653, 141128, 139085, 139039, 141747, 146720, 152086, 155812, 157380, 157967, 158990, 160697, 162226, 162891, 163174, 164227, 166391, 168563, 169358, 168662, 167691, 167763, 169531, 173204, 178642, 184960, 190650, 194787, 197978, 201768, 207096, 213552, 220119, 226184, 231562, 235835, 238311, 238847, 238237, 237317, 235914, 233190, 228857, 223553, 218133, 213207, 209258, 206358, 203566, 199492, 193966, 188500, 184477, 181469, 178144, 174406, 171625, 170616, 170269, 168788, 165983, 163640, 163420, 164859, 165997, 165801, 165234, 165676, 167103, 168471, 169268, 169789, 170331, 171147, 172895, 175949, 179296, 181307, 181751, 182013, 183209, 185313, 188209, 192077, 196213, 198959, 199580, 199035, 198176, 196668, 194657, 193894, 195577, 198251, 199579, 199415, 199429, 200376, 201729, 203641, 207165, 212153, 216663, 219051, 219521, 219228, 218998, 219307, 220331, 221431]
54389B21431l5j671k663k855k695k121j040l36r70k426l320l304l055k721j791
54374A90428n39r2p15j305j069o18p12j025q50k89J83P57J893L070L017J413m20
54357A93127r11J18J606K522K479J478r2j135n05J619L627M330M316M849N871
54342B23299O151N259M339M585N826P008P586P811P894P488O125L968J920Q26
54328C00085N34K3j390l187m264m180l525l299m085n545o525o112m852m217m542
54313B44919m462l182k177l235n535o414m819k455j340j812l128m398m478k558
54299A94926L14J634L90j508j730m11O75Q69J081J905K805L245L504M013M606
54284B16318M761M191L009J611N18M1R9M31Q92J341J443Q76k11j233j706j780
$$ y = [221431, 221396, 219725, 217062, 214207, 211512, 209391, 208351, 208015, 207045, 204619, 201299, 197995, 194940, 192219, 190428, 189889, 189797, 189082, 187777, 186708, 186090, 185378, 184353, 183503, 183214, 183397, 184154, 186047, 189117, 192134, 193547, 193127, 192216, 192334, 193940, 196462, 198941, 200419, 200327, 199192, 198687, 200306, 203933, 208263, 212579, 217428, 223299, 229450, 234709, 239048, 243633, 249459, 256467, 264053, 271864, 279758, 287246, 293371, 297339, 299259, 300085, 300619, 300642, 299252, 296065, 291801, 287621, 284096, 280797, 276712, 271167, 264642, 258530, 253678, 249461, 244919, 240457, 237275, 235098, 231863, 226328, 219914, 215095, 212640, 211300, 209488, 206360, 201962, 197484, 194926, 195240, 196874, 197264, 195756, 194026, 193615, 194290, 195159, 196240, 198145, 200950, 204195, 207699, 211712, 216318, 221079, 225270, 228279, 229890, 230408, 230449, 230548, 230979, 231871, 233212, 234655, 235531, 235320, 234087, 232381, 230601]
54268B30601k076l023m365n458n964n967n497m542l656l736m712n190m190k629
54254A69596k112k705l030k309j196o70j169k744m936o440o016l989j979j069
54240A29232j191k083l550m721m609l615l101l062j914P18K706K136K5j130n08
54225A05333O21J053P16qq62j576j996k283k439k036q40O22J709K336K514J906
54209A04770O23k26K07J193J337N21k6M99J587K290K236J635R02M39L56L74K14
54192A18931L6J65O01J023J178R55K93o31j320j334p76k43l60j284k428k768j802
54175A10236k23Q22R88Q09O35L62J16K52N43L06m64r43p80o21r65j473j744j841
54157A06015j655q62P5P9p70r02M42J927K069J266N37l76k027l349k700m03J561
$$ y = [230601, 228525, 225502, 221137, 215679, 209715, 203748, 198251, 193709, 190053, 186317, 181605, 176415, 172225, 169596, 167484, 164779, 161749, 159440, 158244, 157574, 156405, 153661, 148725, 142285, 136269, 132280, 130301, 129232, 128041, 125958, 122408, 117687, 113078, 109463, 106362, 103300, 101386, 102104, 104810, 106946, 106971, 105841, 105333, 105954, 107007, 107723, 107715, 106853, 105277, 103281, 100998, 98559, 96523, 95683, 96305, 98014, 100350, 102864, 104770, 105393, 105167, 105374, 106567, 107904, 108425, 108399, 108898, 110485, 112775, 115011, 116646, 117548, 117987, 118343, 118717, 118931, 118967, 119132, 119733, 120756, 121934, 122889, 123182, 122551, 121231, 119897, 119121, 118878, 118518, 117234, 114806, 112038, 110236, 110013, 110835, 111823, 112632, 113267, 113629, 113745, 113997, 114540, 114846, 114382, 113439, 112659, 112038, 111073, 109600, 107856, 106015, 104360, 103498, 103573, 103652, 102882, 101980, 102422, 104349, 106418, 107684, 108221, 107845, 105818, 102469, 99769, 99366, 100927]
54140A00927K229K278K149J333j72j335j603j602j750j365O4J670K150J374K68
54125A06615m95r92j477j934k282k575k863k943k522j598o14j2K81O03Q85P89
54109H8866N17P48J359J096p63k997l710k719j594j321j099J56J979K858K231
54094H5607J094N24L00n12j918k675j776K77K009K342J214n62j562o76J539K995
54078H8220K463J225J167K034K129J251Q86J546K017J590R77L52j236l530m355
54063I6736k750q65r09j918j630k08L00o57j641j689j183m37O59J619J625Q69
54047H7921K61k3l38l37M04Q31n57l138m408l137o44J313K315K591K290K012K647
54030I0003L869M041K370R2j180j260r40p01o38q29r85m13J050K525L019K421
$$ y = [100927, 103156, 105434, 107583, 108916, 108744, 107409, 105806, 104204, 102454, 101089, 101153, 102823, 104973, 106347, 106615, 106120, 105128, 103651, 101717, 99435, 96860, 93997, 91054, 88532, 86934, 86320, 86308, 86589, 87192, 88077, 88866, 89383, 90131, 91490, 92586, 91823, 88826, 85116, 82397, 80803, 79482, 78383, 78539, 80518, 83376, 85607, 86701, 87225, 87525, 87013, 85095, 82420, 80644, 80921, 82930, 85272, 86486, 85924, 84362, 83686, 85225, 88220, 90683, 91908, 93075, 95109, 97238, 98489, 99375, 100921, 102938, 104528, 105505, 105857, 104621, 101091, 96736, 93986, 93121, 92212, 90294, 88664, 88456, 88756, 88099, 86458, 84769, 83586, 83149, 83808, 85427, 87052, 87921, 88182, 88159, 87821, 87484, 87888, 88719, 88162, 85024, 80616, 77479, 76835, 78148, 80463, 83054, 85344, 87356, 90003, 93872, 97913, 100283, 100375, 99195, 97935, 96995, 96294, 95656, 94827, 93842, 93429, 94479, 97004, 100023, 102444]
54014A02444J318M31L97J348K293J809j08j640j226M73J471Q59l20n22N73J972
53998A11572K642K654K875L656M306M118L434L046K963K451J277J21k45L43J468
53983A46681K377K343J387N28O95J623K387K670K673K231J119J73P74K978N248
53968A75887O343O597O868P169O985O297N658N515N867O394O667O336N321L851
53954B61755K372J537J781K708L292L117K834K959K911K009P54O9k11r99k381
53939B84507l509l900l859l733l645l750l973l804l213l110l923m477l677k511
53925B33423k625l559l513k538k464l592m044l026k247k917l610k638q61l07j253
53910A94229k320k632k426k032j520j025n23K40J091J368J026Q60J055P26l74
$$ y = [102444, 103762, 104193, 104590, 105938, 108231, 110040, 109932, 108292, 107066, 107539, 109010, 109869, 109549, 109027, 109600, 111572, 114214, 116868, 119743, 123399, 127705, 131823, 135257, 138303, 141266, 143717, 144994, 145115, 144870, 145213, 146681, 149058, 151401, 152788, 153316, 154011, 155634, 158021, 160691, 163364, 165595, 166714, 166887, 167661, 170639, 175887, 182230, 188827, 195695, 202864, 209849, 216146, 221804, 227319, 233186, 239580, 246247, 252583, 257904, 261755, 264127, 265664, 267445, 270153, 273445, 276562, 279396, 282355, 285266, 287275, 288029, 288098, 287887, 286888, 284507, 280998, 277098, 273239, 269506, 265861, 262111, 258138, 254334, 251121, 248011, 244088, 239611, 235934, 233423, 230798, 227239, 223726, 221188, 218724, 215132, 211088, 208062, 205815, 202898, 199288, 196650, 195789, 195482, 194229, 191909, 189277, 186851, 184819, 183299, 182274, 181751, 181991, 183082, 184450, 185476, 186336, 187391, 188117, 187743]
53895A87743r82k26Q44R53O65J204K122K058J332J818M076O221O265M410K502
53880B21005J872K328K846K843K693L109M243N654P048Q318Q882P928N643L325
53866B87737J818P14k96n82J38O86K1q05J29K796N057N321M108K862K388K855
53850C14947M158N682O356N703M563M331N565P555R084R461Q862P863O778N582
53836D06490M314L238K521K016J460P03l17j457k272k379k012j807k052k580l305
53821D02561m359n500o125o052n815n994o665p595q371q433p566o434n900n928
53807C11824n944o096p016q307q629p622o387n716n191m630m887o176p018o144
53793B22061m419l591l969m641n113n322m636k517J2J022r4k069l351l333k174
$$ y = [187743, 186761, 186535, 187379, 188332, 188997, 190201, 192323, 194381, 195713, 197531, 201607, 207828, 214093, 218503, 221005, 222877, 225205, 228051, 230894, 233587, 236696, 240939, 246593, 253641, 261959, 270841, 278769, 284412, 287737, 289555, 290269, 289973, 289391, 289529, 290215, 290236, 289431, 289560, 292356, 297413, 302734, 306842, 309704, 312092, 314947, 319105, 324787, 331143, 336846, 341409, 345740, 351305, 358860, 367944, 377405, 386267, 394130, 400908, 406490, 410804, 414042, 416563, 418579, 420039, 420742, 420425, 418968, 416696, 414317, 412305, 410498, 408446, 405866, 402561, 398202, 392702, 386577, 380525, 374710, 368716, 362051, 354456, 346085, 337652, 330086, 323652, 317752, 311824, 305880, 299784, 292768, 284461, 275832, 268210, 261823, 256107, 250916, 246286, 241399, 235223, 228205, 222061, 217642, 214051, 210082, 205441, 200328, 195006, 190370, 187853, 187865, 188887, 188793, 186724, 183373, 180040, 177866]
53778A77866n08O06L70q54j962k426k625k960l277l216k646j709p14J18R27J903
53762A58893K567K075N50n72k46R69J945K475K852K692J448k72j067l84R78K070
53746A76973K680L070L358L330K672J569R66J604K830L340L259M154O403Q127
53732B24335P875O921P296Q733R480R220R178R568R181P674O386O323O743O455
53718C35368N437M486M042L836L321K164O34o05j324k007k906l579l845m377n399
53703C35246n888n158m314m671n619n789n428n726o333n883m644m246m730m428
53689B62389l144k866m353n465m280j869m47m30j004k124l978n440m983k873r29
53674B18204k08r4L55J208J856J832J257P47P91J118J140R63J217J814J799P79
$$ y = [177866, 177358, 177964, 178334, 177480, 175518, 173092, 170467, 167507, 164230, 161014, 158368, 156659, 155945, 156063, 156990, 158893, 161460, 163535, 164085, 163513, 163267, 164236, 166181, 168656, 171508, 174200, 175648, 175376, 174309, 173925, 174903, 176973, 179653, 182723, 186081, 189411, 192083, 193652, 194618, 196222, 199052, 202392, 205651, 209805, 216208, 224335, 232210, 239131, 246427, 255160, 264640, 273860, 283038, 292606, 301787, 309461, 315847, 322170, 328913, 335368, 340805, 345291, 349333, 353169, 356490, 358654, 359288, 358683, 357359, 355352, 352446, 348867, 345022, 340645, 335246, 329358, 324200, 319886, 315215, 309596, 303807, 298379, 292653, 286320, 280437, 275793, 271547, 266817, 262389, 259245, 256379, 252026, 246561, 242281, 240412, 239965, 239535, 238531, 236407, 232429, 226989, 222006, 219133, 218204, 217996, 217902, 218257, 219465, 221321, 223153, 224410, 225157, 225948, 227066, 228206, 229169, 230386, 232200, 233999, 234778]
53658B34778l33m92L59J670K897L322K221j28k412l726m201l931k434R5K216K895
53642B32796K730K679K638K377K695M133N280M115Q07k159k658o78K358M848N682
53627B67643M880L714L360L483K963J891J628K759M043M009K804J847K057K989
53613C10070L626L586L299L078K451R21q30j334j46J541K366K170J481O42M5K74
53597C33240J069J037n38k340k787k307k404l005k690j319l78l73J18J884L247
53582C22454K082j273m343n154l666j167Q46J570J452J563K093K006P49n21k58
53567C18433J543L587M925N426M936L367J460M48O58J360K038K796L386K967J508
53552C58838M91J339L773O395Q415R841J0456R802Q310P362P664Q265P775O220
$$ y = [234778, 234445, 233953, 234312, 235982, 238879, 242201, 244422, 244294, 241882, 238156, 233955, 230024, 227590, 227685, 229901, 232796, 235526, 238205, 240843, 243220, 245915, 250048, 255328, 259443, 260250, 258091, 255433, 254755, 257113, 261961, 267643, 272523, 276237, 279597, 283080, 286043, 287934, 289562, 292321, 296364, 300373, 303177, 305024, 307081, 310070, 313696, 317282, 320581, 323659, 326110, 327031, 326201, 324867, 324721, 326262, 328628, 330798, 332279, 332921, 332966, 333240, 334309, 335346, 334808, 332468, 329681, 327374, 324970, 321965, 319275, 317956, 317578, 317205, 317323, 319207, 322454, 324536, 323263, 318920, 313766, 310100, 308933, 309779, 311349, 312801, 314364, 316457, 318463, 319212, 318691, 318433, 319976, 323563, 328488, 333914, 338850, 342217, 343677, 344125, 344783, 346143, 348181, 350977, 354363, 357330, 358838, 359329, 360668, 364441, 370836, 379251, 389092, 399548, 409350, 417660, 425022, 432686, 440951, 448726, 454946]
53538D54946N062N397O645P308O786O095O642Q494J0279J0809J0312R730R308
53525E57813Q555P419O629O646O948O771O115N585N461N301M437K710Q98K66J292
53510F32846K814L148K165J484K135K967K267L04j009q15k91o24j153l61J849
53495F47726L774L776J927l07j700k190k261j865m70J855L984M768M130K888J840
53480F67875J433J885K907L640L483K878K649K863L127L706N286P622R479J0202
53466G29035J0364J0545J0535J0287J0669J2287J4315J5513J6114J7565K0366
53455H77595K3195K4591K4837K5476K7203K8916K9241K8490K8486L0300L2971
53444A181301L4969L6252L7950M0320M2250M3006M3276M3972M4881M5307M5418
$$ y = [454946, 460008, 465405, 472050, 479358, 486144, 492239, 498881, 507375, 517654, 528463, 538775, 548505, 557813, 566368, 573787, 580416, 587062, 594010, 600781, 606896, 612481, 617942, 623243, 627680, 630390, 631288, 631554, 632846, 635660, 638808, 640973, 642457, 644592, 647559, 649826, 650130, 649121, 648306, 648015, 647391, 646238, 645877, 647726, 651500, 655276, 657203, 656896, 655196, 653006, 650745, 648880, 648410, 650265, 654249, 659017, 663147, 666035, 667875, 669308, 671193, 674100, 677740, 681223, 684101, 686750, 689613, 692740, 696446, 701732, 709354, 718833, 729035, 739399, 749944, 760479, 770766, 781435, 793722, 808037, 823550, 839664, 857229, 877595, 900790, 925381, 950218, 975694, 1002897, 1031813, 1061054, 1089544, 1118030, 1148330, 1181301, 1216270, 1252522, 1290472, 1330792, 1373042, 1416048, 1459324, 1503296, 1548177, 1593484, 1638902]
53433A638902M6112M7766M9752N1092N1187N0208M9144M9078M9923N0271M9126
53422B182561M7351M6706M7641M8877M9168M8594M7979M7649M7264M6459M5190
53411B705439M3589M1780L9869L7928L5885L3494L0539K7120K3712K0783J8419
53400C058557J6440J4755J3330J1892J0064P719M845J122l663q709j2624j5062
53388C098666j7209k0030k2847k4561k5669k7777l1270l4662l6656l7774l9342
53377B780869m1577m3469m4265m4279m4244m4464m4822m5155m5168m4146m1370
53366B297910l7106l2801k9841k8231k6964k5361k3472k1226j8237j4742j1749
53355B028180r616p309l847K34L842P091J0797J4684J7649J9858K2948K7671L2798
$$ y = [1638902, 1685014, 1732780, 1782532, 1833624, 1884811, 1935019, 1984163, 2033241, 2083164, 2133435, 2182561, 2229912, 2276618, 2324259, 2373136, 2422304, 2470898, 2518877, 2566526, 2613790, 2660249, 2705439, 2749028, 2790808, 2830677, 2868605, 2904490, 2937984, 2968523, 2995643, 3019355, 3040138, 3058557, 3074997, 3089752, 3103082, 3114974, 3125038, 3132757, 3137602, 3138724, 3135061, 3126352, 3113728, 3098666, 3081457, 3061427, 3038580, 3014019, 2988350, 2960573, 2929303, 2894641, 2857985, 2820211, 2780869, 2739292, 2695823, 2651558, 2607279, 2563035, 2518571, 2473749, 2428594, 2383426, 2339280, 2297910, 2260804, 2228003, 2198162, 2169931, 2142967, 2117606, 2094134, 2072908, 2054671, 2039929, 2028180, 2018564, 2011255, 2007408, 2007642, 2011484, 2018575, 2029372, 2044056, 2061705, 2081563, 2104511, 2132182, 2164980]
53342B164980L7018M0636M4293M7355M9015N0170N2519N6102N9378O1732O4275
53331B727473O7839P1734P5154P8523Q2352Q5856Q7954Q9082R0788R3831R7716
53320C648302J01814J05681J08396J08946J07661J06174J05493J05065J04200
53311D601732J03318J02819J01649R8223R2501Q6008P9805P3544O6626N9376N2608
53300E518209M6612M1094L5712L0268K4583J8453J1719M265l899j2458k0925k9003
53288E664630l6838m4936n3883o3794p3855q2708q9685r5282j00029j03396j04711
53277D815513j04838j05651j07589j08854j07760j05040j02876j02283j02330
53268C868292j01690r9992r7540r4656r1646q8834q6236q3411q0010p6244p2527
$$ y = [2164980, 2201998, 2242634, 2286927, 2334282, 2383297, 2433467, 2485986, 2542088, 2601466, 2663198, 2727473, 2795312, 2867046, 2942200, 3020723, 3103075, 3188931, 3276885, 3365967, 3456755, 3550586, 3648302, 3750116, 3855797, 3964193, 4073139, 4180800, 4286974, 4392467, 4497532, 4601732, 4705050, 4807869, 4909518, 5007741, 5100242, 5186250, 5266055, 5339599, 5406225, 5465601, 5518209, 5564821, 5605915, 5641627, 5671895, 5696478, 5714931, 5726650, 5730915, 5727016, 5714558, 5693633, 5664630, 5627792, 5582856, 5528973, 5465179, 5391324, 5308616, 5218931, 5123649, 5023620, 4920224, 4815513, 4710675, 4605024, 4497435, 4388581, 4280821, 4175781, 4072905, 3970622, 3868292, 3766602, 3666610, 3569070, 3474414, 3382768, 3293934, 3207698, 3124287, 3044277, 2968033, 2895506]
53257B895506o8813o4569n9494n4102m9411m6086m3805m1556l8380l3958k8689
53246B366643k3413j8947j5621j3129j0936q803o820m950k758K26L910P433R677
53233B282512J0287J0270J1283J4008J7498K0470K2878K5559K8513L0574L1208
53222B505060L1721L3872L7687M1535M4241M6221M8266M9977N0153M8460M6026
53211B983219M4148M2899M1365L8986L6041L2839K9061K4477J9957J7041J6201
53200C326234J6028J4548J1266P465M499K115j180o259j2224j7283k0473k2331
53188C302405k4184k7119l1468l6796m2316m7536n2449n6843n9791o0632o0291
53177B802980o0630o2144o3161o1938n8881n6055n4913n5043n4794n2799m9330
$$ y = [2895506, 2826693, 2762124, 2702630, 2648528, 2599117, 2553031, 2509226, 2467670, 2429290, 2395332, 2366643, 2343230, 2324283, 2308662, 2295533, 2284597, 2275794, 2268974, 2264024, 2261266, 2261492, 2265402, 2272835, 2282512, 2292799, 2303069, 2314352, 2328360, 2345858, 2366328, 2389206, 2414765, 2443278, 2473852, 2505060, 2536781, 2570653, 2608340, 2649875, 2694116, 2740337, 2788603, 2838580, 2888733, 2937193, 2983219, 3027367, 3070266, 3111631, 3150617, 3186658, 3219497, 3248558, 3273035, 3292992, 3310033, 3326234, 3342262, 3356810, 3368076, 3375541, 3380040, 3382155, 3380975, 3374716, 3362492, 3345209, 3324736, 3302405, 3278221, 3251102, 3219634, 3182838, 3140522, 3092986, 3040537, 2983694, 2923903, 2863271, 2802980, 2742350, 2680206, 2617045, 2555107, 2496226, 2440171, 2385258, 2330215, 2275421, 2222622, 2173292]
53166B173292m6507m6377m8420m9880m9145m7645m7331m7537m6185m3286m1022
53155A659957m0247l9148l6089l2143k9630k9118k9055k7820k5362k2991k2072
53144A326282k2751k3850k4201k3893k3687k3628k3232k2872k3525k4932k5338
53133A064373k3834k1782k1069k1691k2109k1469k0452k0024k0105j9620j7758
53122H34460j5133j3546j4208j6344j8103j8634j8492j8165j7388j6137j5153
53111F53157j4811j4413j3273j1932j1534j2413j3665j3894j2336r752q100q616
53099E08418j0188j0547r055p207o352o291o393o637o838o269m916l985m298n223
53085D14219n985o818p841q001o503m305k911k414j956j464j624k581l817m837
$$ y = [2173292, 2126785, 2080408, 2031988, 1982108, 1932963, 1885318, 1837987, 1790450, 1744265, 1700979, 1659957, 1619710, 1580562, 1544473, 1512330, 1482700, 1453582, 1424527, 1396707, 1371345, 1348354, 1326282, 1303531, 1279681, 1255480, 1231587, 1207900, 1184272, 1161040, 1138168, 1114643, 1089711, 1064373, 1040539, 1018757, 997688, 975997, 953888, 932419, 911967, 891943, 871838, 852218, 834460, 819327, 805781, 791573, 775229, 757126, 738492, 720000, 701835, 684447, 668310, 653157, 638346, 623933, 610660, 598728, 587194, 574781, 561116, 547222, 534886, 525134, 517034, 508418, 498230, 487683, 478628, 471421, 465069, 458778, 452385, 445748, 438910, 432641, 427725, 423740, 419442, 414219, 408234, 401416, 393575, 385574, 379071, 374766, 371855, 369441, 367485, 366021, 364397, 361816, 357999, 353162]
53071C53162n091l896j553J57j72j699k457j858r37n23m83m96l52K92J413K114
53055C37621J675P98P03J342J575R47J58j22M3K76L16K23N97K022L755M002K388
53038C58319R41J192J640O8k596l171p06K348L653L406K766J869L33j713l945
53023C64404n993o947o039m126l154l672m344m358m569n619o468o000m702l684
53009B94729l070k525k368k976l750l914l711l834m109l827l060k621k831l092
52995B49041k795k047j395j223j503j969k486l150l889m187l700k859k286j813
52981B13739r05K0k49k034m062m927m486l454k319j161m9Q47J314J122L81k80
52965A93497m20n42j353k428k562j578o55o38j089j429j798k274k192j162O4N04
$$ y = [353162, 348071, 344175, 342622, 342779, 342607, 340908, 338451, 336593, 335656, 335133, 334650, 334154, 333802, 334094, 335507, 337621, 339296, 340094, 340797, 342139, 343714, 344661, 344819, 344697, 344740, 345016, 345332, 345555, 346152, 348174, 351929, 355931, 358319, 359260, 360452, 362092, 362160, 359564, 356393, 355687, 358035, 361688, 365094, 367860, 369729, 370062, 368349, 364404, 358411, 351464, 345425, 341299, 338145, 334473, 330129, 325771, 321202, 315583, 309115, 303115, 298413, 294729, 291659, 289134, 286766, 283790, 280040, 276126, 272415, 268581, 264472, 260645, 257585, 254964, 252133, 249041, 246246, 244199, 242804, 241581, 240078, 238109, 235623, 232473, 228584, 224397, 220697, 217838, 215552, 213739, 212834, 212854, 212605, 210571, 206509, 201582, 197096, 193642, 191323, 190162, 190113, 190960, 192274, 193396, 193777, 193497, 193077, 192535, 191182, 188754, 186192, 184614, 183959, 183321, 182232, 180803, 179005, 176731, 174539, 173377, 173441, 173945]
52949A73945K21j16k81m76o92q18j116j893k861l342k995k019p66M49J252J274
52933A59766M54o49r90lJ414J549P6j161m36J372J883M38j313j904j529q48N1
52916A58170R31J128P11P41J699K772L284L628M010L626K043K76n62o79o02J37
52900A81313J905L527L478K064J037J324K479M081O178Q218Q880P578N379L992
52886B41433M170N344O439O784O394N484M030K122N31J47O39M94j060k881l306
52871B76764k229j091j102k118l111l203k334j239p77j174k035k872l236k645
52857B47598j257m23j470l783n221m714l299k269j710j454j996l242l661k072
52843B11027M61J965K124K089K267J849N71n24n35L0n1j172k362k206l16K034
$$ y = [173945, 174166, 174050, 173769, 173293, 172601, 171783, 170667, 168774, 165913, 162571, 159576, 157557, 156791, 157240, 158492, 159766, 160220, 159571, 158581, 158578, 159992, 161541, 161617, 160456, 160020, 161392, 163275, 163713, 162400, 160496, 158967, 158119, 158170, 159101, 160229, 160940, 161681, 163380, 166152, 169436, 173064, 177074, 180700, 182743, 183019, 182457, 181778, 181176, 181313, 183218, 186745, 190223, 192287, 193324, 194648, 197127, 201208, 207386, 215604, 224484, 232062, 237441, 241433, 245603, 250947, 257386, 264170, 270564, 276048, 280078, 282200, 282731, 282878, 283517, 284011, 282951, 280070, 276764, 274535, 273444, 272342, 270224, 267113, 263910, 261576, 260337, 259560, 258386, 256351, 253479, 250243, 247598, 246341, 245918, 244448, 240665, 235444, 230730, 227431, 225162, 223452, 221998, 220002, 216760, 213099, 211027, 211488, 213453, 215577, 217666, 219933, 221782, 222353, 221829, 221294, 221324, 221273, 220101, 217739, 215533, 215217, 217251]
52827B17251L078K450J374R98J221J449J556J578J266N27l18j140k083k639j845
52812B24723l1Q48k90k020k349j324l07L12J034J611J249K50j57L54R33J081J172
52795B27089J290P88o03k048k353j049J185K935L206K630K787L965M546L494K237
52780B50099K660M239M910M131L241L010K821K329K302L236M494N176M929L807
52766C01384K312J480J882K603K386J500J173J478J415R06Q36R46k80l043n382
52751C11596n846n473n966p119p299n649k924p05l96k270m971o586o618o119n816
52736B37839n328m633m685n675n996m241j286Q11J262O57o37k574m318m570l301
52721A93325k044j993k688k944k441j823j593j580j501j488j761k006j644o83
$$ y = [217251, 220329, 222779, 224153, 225151, 226372, 227821, 229377, 230955, 232221, 232748, 232430, 231290, 229207, 226568, 224723, 224692, 225540, 225250, 223230, 220881, 219557, 219250, 219562, 220596, 222207, 223456, 223706, 223549, 223903, 224836, 225917, 227089, 228379, 229167, 228564, 226516, 224163, 223114, 224299, 227234, 230440, 233070, 235857, 239822, 244368, 247862, 250099, 252759, 256998, 261908, 266039, 269280, 272290, 275111, 277440, 279742, 282978, 287472, 292648, 297577, 301384, 303696, 305176, 307058, 309661, 312047, 313547, 314720, 316198, 317613, 318519, 319355, 320301, 320021, 316978, 311596, 305750, 300277, 294311, 287192, 279893, 274244, 271320, 270615, 270219, 267949, 262978, 256392, 249774, 243655, 237839, 232511, 227878, 223193, 217518, 211522, 207281, 205995, 206806, 208068, 208725, 208088, 205514, 201196, 196626, 193325, 191281, 189288, 186600, 183656, 181215, 179392, 177799, 176219, 174718, 173230, 171469, 169463, 167819, 167136]
52707A67136J99N08L39k70j551l054l397k035n17p03k131k601j241N11J159Q02
52691A53154J26q40k096k966k884k214j581j097p68r71j813k619k649j950j045
52676A27787k97J82M51Q55J523J756P59q81j582r08k03n71j439j834j827j860
52660A21911j646q75j02J60M47J350K277K314J597P13n57k429l748l041q55O04
52644A18120K30r27j569j631j530j111j48J036K094L102L890L627J868m65j820
52629A24766j659o73M31J727L336M603M647L743L314M211N430N330L886K749L000
52614A68841L896M305M348M608M500K830k08k854l869l764l565l289k390j142
52600A72247o09j292k465l077k925k657k798l097k997k482k205k639l346l326
$$ y = [167136, 167335, 167843, 168182, 167912, 166361, 163307, 159910, 157875, 157358, 156655, 154524, 151923, 150682, 151193, 152352, 153154, 153280, 152440, 150344, 147378, 144494, 142280, 140699, 139602, 138834, 137863, 136050, 133431, 130782, 128832, 127787, 127490, 127672, 128123, 128978, 130501, 132257, 133016, 132135, 130553, 129645, 129442, 128871, 127432, 125598, 123771, 121911, 120265, 119390, 119288, 119448, 119895, 121245, 123522, 125836, 127433, 128146, 127589, 125160, 121412, 118371, 117516, 118120, 118350, 117423, 115854, 114223, 112693, 111582, 111434, 112470, 114564, 117666, 121556, 125183, 127051, 126586, 124766, 123107, 122434, 122865, 124592, 127928, 132531, 137178, 140921, 144235, 148446, 153876, 159206, 163092, 165841, 168841, 172737, 177042, 181390, 185998, 190498, 193328, 193120, 190266, 186397, 182633, 179068, 175779, 173389, 172247, 171638, 170346, 167881, 164804, 161879, 159222, 156424, 153327, 150330, 147848, 145643, 143004, 139658, 136332]
52586A36332k205q07l57j032j555o10J463K846K359Q10k25m32p89j758k532k360
52570A29148j708j499j720j523n21N76P49j51j197j370o69m6j40m62k57L39P40
52553A20289J147K229L526L416J349r07j152O91K703L268K435J157J52m29o54
52538A39220m73L30J735L105L516K747J470L74m22q31l30J232K904L473K898K188
52522A63136J926J693J041L44K78Q10J175Q22J71J27R29J708J584R34J012K306
52506A79996L884M613M419L828K945J507k44j492j587n37J148K699L449L339K952
52491B10919K649J937L09j553k186j207Jj32j460k373j734j30R89Q92P5n60n36
52474B05900J13J061J759J704J032N48P33J105J010O99R24J740K418K537K326
$$ y = [136332, 134127, 133320, 132963, 131931, 130376, 129766, 131229, 134075, 136434, 137244, 137019, 136587, 135798, 134040, 131508, 129148, 127440, 125941, 124221, 122698, 122177, 122753, 123502, 123351, 122154, 120784, 120115, 120069, 119929, 119467, 119210, 119549, 120289, 121436, 123665, 127191, 130607, 131956, 131049, 129897, 130588, 133291, 136559, 138994, 140151, 140303, 139874, 139220, 138747, 139077, 140812, 143917, 147433, 150180, 151650, 152024, 151602, 150771, 150441, 151673, 154577, 158050, 160948, 163136, 165062, 166755, 167796, 168140, 168418, 169228, 170403, 171225, 171396, 171523, 172452, 174160, 175744, 176678, 177690, 179996, 183880, 188493, 192912, 196740, 199685, 201192, 200948, 199456, 197869, 197332, 198480, 201179, 204628, 207967, 210919, 213568, 215505, 215814, 214261, 212075, 210868, 210869, 210737, 209277, 206904, 205170, 205040, 206029, 206921, 206996, 206436, 205900, 206013, 207074, 208833, 210537, 211569, 212117, 212850, 213955, 214965, 215664, 216588, 218328, 220746, 223283, 225609]
52459B25609J954J354Q82J117J764J697O03l67j88O03R02P82J124J908K004Q09
52443B42557p74j345o31L26M10l98j290j868k482l124k737n70K218L598L270K830
52427B39990L101K911J322m34o04N29J213P85J28l5J50O14J586K637K627J112
52411B57632q88j928j429J18J751K736L120L592M321M262K476j28j385m45J267
52396B75072K073K019K183K770K938K233J149J70r00k290l467l661k916k004j364
52381B74005p29K1M12K35K51J245K664L140K208O93n91j495j867j249K20J527
52365B80690J947J754J371O05o19j595j722j374j232j267j080p48n83n85p47j264
52349B73551j748j007J364L764M154K501O64J15P68J787K429K147R31k79l56P03
$$ y = [225609, 227563, 228917, 229799, 230916, 232680, 234377, 234980, 234613, 234425, 235028, 235930, 236712, 237836, 239744, 241748, 242557, 241783, 240438, 239807, 240133, 240543, 240145, 238855, 236987, 234505, 231381, 228644, 228074, 230292, 233890, 237160, 239990, 243091, 246002, 247324, 246890, 246286, 246815, 248028, 248813, 248941, 248906, 249056, 249670, 251256, 253893, 256520, 257632, 256744, 254816, 253387, 253505, 255256, 257992, 261112, 264704, 269025, 273287, 275763, 275635, 274250, 273805, 275072, 277145, 279164, 281347, 284117, 287055, 289288, 290437, 290607, 289707, 287417, 283950, 280289, 277373, 275369, 274005, 273276, 273297, 273709, 273944, 274195, 275440, 278104, 281244, 283452, 284145, 283554, 282059, 280192, 278943, 279163, 280690, 282637, 284391, 285762, 286367, 285748, 284153, 282431, 281057, 279825, 278558, 277478, 276730, 276147, 275562, 274815, 273551, 271803, 270796, 272160, 275924, 280078, 282579, 283243, 283358, 284126, 285913, 288342, 290489, 291420, 291141, 290785, 291488]
52333B91488J794K000J293K58k49N43K466M064L975K508J122O39Q11J233J640
52318C15585J515N58m81n34K35O30J52n13p18m02N73K355M144M586L521K212J531
52301C34949J183J071J949L883N339M996L507K400K107K109K371L110L545K431
52287C74950Q0j404m77K061M115M609M009K975J536q8p64M17K525L411K308P85
52271D01048M92J035J089Q10J540L460N152N688N667N782N787N409N118N133M776
52256D57986L683K829L265M558N417N394N123N240O007P492R253J0177R624Q553
52242E44601Q456R372R952R597R302R899J0602J0212R088Q748R742J0896J1025
52229F71492J0400J0009J0065J0115J0154J0559J0997J0611R569R291J0474J1934
$$ y = [291488, 293282, 295282, 296575, 296833, 296584, 297127, 299593, 303657, 307632, 310140, 311262, 311901, 312712, 313945, 315585, 317100, 317658, 317177, 316643, 316878, 317508, 317660, 317147, 316429, 316027, 316600, 318955, 323099, 327685, 331206, 333418, 334949, 336132, 337203, 339152, 343035, 348374, 353370, 356877, 359277, 361384, 363493, 365864, 368974, 372519, 374950, 375030, 373626, 373149, 375210, 379325, 383934, 387943, 390918, 392454, 392366, 391602, 392019, 394544, 397955, 400263, 401048, 401540, 402575, 403664, 404474, 406014, 409474, 414626, 420314, 425981, 431763, 437550, 442959, 448077, 453210, 457986, 461669, 464498, 467763, 472321, 477738, 483132, 488255, 493495, 499502, 506994, 516247, 526424, 536048, 544601, 553057, 562429, 572381, 581978, 591280, 601179, 611781, 621993, 631081, 639829, 649571, 660467, 671492, 681892, 691901, 701966, 712081, 722235, 732794, 743791, 754402, 763971, 773262, 783736, 795670]
52217G95670J2374J2287J2826J3523J2880J0934R568R881J0880J1230J0932J0479
52205I33464R657Q389P666Q389R756J0178R494R035R468R796Q974P513O708O743
52191A055230O518N400M356M671N921O236M725K795K265K970L255K491J750J944
52177A110527K638L117L503M118M690M995N574O921Q521R566J0182J1081J2324
52164A197757J3274J3632J3653J3504J3200J3142J3803J4811J5137J4526J3976
52153A350415J4317J4933J4588J3134J1673J1029J0783J0085Q830P537O410N197
52141A478931L971L316L365L223J988Q5j095j086j133k685n344o947n876k971
52127A467742p35o45j777k329j932j718k430l446l953m013m039l992l838m046
$$ y = [795670, 808044, 820331, 833157, 846680, 859560, 870494, 880062, 889943, 900823, 912053, 922985, 933464, 943121, 951510, 959176, 967565, 977321, 987499, 996993, 1006028, 1015496, 1025292, 1034266, 1041779, 1048487, 1055230, 1061748, 1067148, 1071504, 1076175, 1082096, 1088332, 1093057, 1095852, 1098117, 1101087, 1104342, 1106833, 1108583, 1110527, 1113165, 1116282, 1119785, 1123903, 1128593, 1133588, 1139162, 1146083, 1154604, 1164170, 1174352, 1185433, 1197757, 1211031, 1224663, 1238316, 1251820, 1265020, 1278162, 1291965, 1306776, 1321913, 1336439, 1350415, 1364732, 1379665, 1394253, 1407387, 1419060, 1430089, 1440872, 1450957, 1459787, 1467324, 1473734, 1478931, 1482902, 1486218, 1489583, 1492806, 1494794, 1494879, 1493784, 1492698, 1491565, 1488880, 1483536, 1476589, 1470713, 1467742, 1467007, 1466362, 1464585, 1462256, 1460324, 1458606, 1456176, 1452730, 1448777, 1444764, 1440725, 1436733, 1432895, 1428849]
52113A428849m821n462n384n282o241p903q643p555n464l884l600m295n028n124
52099A350163m945n556p186q656q861q158p413o583n414m700n281o229n822m167
52085A261192l135l617m471m456l681k848k562l579o072q497q848p460o686p324
52071A187956p457n791l951m045n702p177p864q049p404n665l943l546m111m338
52057A108913m014l839l877l745l842m811o040o108m715k926j627q87o36q39r93
52042A060014m86O08J765K901M301N921P487Q987J0369J1273J1667J2094J2692
52029A149593J2750J2104J1963J3269J5204J6598J7769J9422K0766K0715K0154
52018A330307K0853K2470K2962K1827K0676K0239J9324J7417J6043J6338J7037
$$ y = [1428849, 1424028, 1418566, 1413182, 1407900, 1401659, 1393756, 1385113, 1377558, 1372094, 1368210, 1364610, 1360315, 1355287, 1350163, 1345218, 1339662, 1332476, 1323820, 1314959, 1306801, 1299388, 1292805, 1287391, 1282691, 1277410, 1271181, 1265359, 1261192, 1258057, 1254440, 1249969, 1245513, 1241832, 1238984, 1236422, 1232843, 1226771, 1218274, 1209426, 1201966, 1195280, 1187956, 1180499, 1174708, 1170757, 1166712, 1161010, 1153833, 1145969, 1137920, 1130516, 1124851, 1120908, 1117362, 1113251, 1108913, 1104899, 1101060, 1097183, 1093438, 1089596, 1084785, 1078745, 1072637, 1067922, 1064996, 1063369, 1062482, 1061846, 1061007, 1060014, 1059528, 1060136, 1061901, 1064802, 1069103, 1075024, 1082511, 1091498, 1101867, 1113140, 1124807, 1136901, 1149593, 1162343, 1174447, 1186410, 1199679, 1214883, 1231481, 1249250, 1268672, 1289438, 1310153, 1330307, 1351160, 1373630, 1396592, 1418419, 1439095, 1459334, 1478658, 1496075, 1512118, 1528456, 1545493]
52007A545493J6380J4574J2936J1646R992Q192P410P945Q492P534M932J916j94
51994A657248j112j430j565j364r74j352k977m640m634l003j561j688l095m663
51980A623190n329m371k172p85k153n412p462o735m873m004l972l480k539k202
51966A567701k663l154l321l418l322k519j109L0K24m41j434k186k363k197k350
51951A537478l016l552l435l153l615m897o281p245p855q403r259j0852j3151
51938A452764j5359j6716j7483j8480j9833k0922k1602k2560k4209k5891k6719
51927A222990k6779k7030k8112k9642l0603l0200k8454k6183k4439k3788k4049
51916I23711k4733k5533k6350k6934k6937k6335k5477k4558k3365k1824k0469
$$ y = [1545493, 1561873, 1576447, 1589383, 1601029, 1611021, 1619213, 1626623, 1634568, 1643060, 1650594, 1655526, 1657442, 1657248, 1656136, 1654706, 1653141, 1651777, 1650803, 1649451, 1646474, 1641834, 1637200, 1634197, 1632636, 1630948, 1627853, 1623190, 1617861, 1613490, 1611318, 1610533, 1608380, 1602968, 1595506, 1588771, 1583898, 1579894, 1575922, 1572442, 1569903, 1567701, 1565038, 1561884, 1558563, 1555145, 1551823, 1549304, 1548195, 1548225, 1548449, 1548008, 1546574, 1544388, 1542025, 1539828, 1537478, 1534462, 1530910, 1527475, 1524322, 1520707, 1515810, 1509529, 1502284, 1494429, 1486026, 1476767, 1465915, 1452764, 1437405, 1420689, 1403206, 1384726, 1364893, 1343971, 1322369, 1299809, 1275600, 1249709, 1222990, 1196211, 1169181, 1141069, 1111427, 1080824, 1050624, 1022170, 995987, 971548, 947760, 923711, 898978, 873445, 847095, 820161, 793224, 766889, 741412, 716854, 693489, 671665, 651196]
51905F51196j9907j9918j9676j8750j7358j5603j3292j0699q772q114q220q271
51893D82616q119p977p643o794n779n375n892o960q019q615q463p706o797n836
51879C82641m518l105k634l404m132l712l061l785n536o381n658m714m580m578
51865C22843l872k900k418k285k097k137k739l361l197k249j250q83j418k504
51851B89533l067k230p37m65j947l375l080j984k226l893m734l248p01N77K8q24
51835B57627o14J57Qj358k473j990n08J96n23j576j860j499j114q50o82q90j446
51818B40605j608q36L02Q61P52N27L37m3n38p98q02o75j36J081K338K563J762
51801B45692J172J555K070J481k3r42l04J251K395K529J968J157L24k01j0P54
$$ y = [651196, 631289, 611371, 591695, 572945, 555587, 539984, 526692, 515993, 507221, 499107, 490887, 482616, 474497, 466520, 458877, 452083, 446304, 440929, 435037, 428077, 420058, 411443, 402980, 395274, 388477, 382641, 378123, 375018, 372384, 368980, 364848, 361136, 358075, 354290, 348754, 342373, 336715, 332001, 327421, 322843, 318971, 316071, 313653, 311368, 309271, 307134, 304395, 301034, 297837, 295588, 294338, 293455, 292037, 289533, 286466, 284236, 283499, 283034, 281087, 277712, 274632, 272648, 270422, 266529, 261795, 258547, 257846, 258423, 258451, 257627, 257013, 257170, 257178, 255820, 253347, 251357, 250849, 251045, 250522, 248946, 247086, 245587, 244473, 243623, 242941, 242051, 240605, 238997, 238161, 238463, 239324, 240076, 240603, 240940, 240897, 240359, 239561, 238759, 238084, 237948, 239029, 241367, 243930, 245692, 246864, 248419, 250489, 251970, 251947, 251005, 250701, 251952, 254347, 256876, 258844, 260001, 260325, 260124, 260114, 260868]
51785B60868J333J260R05Q38J091J479K126L015L463K908J885J440J695J968K031
51770B88305K179K107J044p36j763j311l51K6J62R05J965K245J422K96k52M9R59
51753B97251J959K413J946P45o56j708j996j456m79N79J876L546M851M843L839
51738C17553L130L063K604J250k9m11m44o66k61J533L693M611M389M482N380O080
51722C55957N726M552L256K546L215N550Q526J0528J0862R891Q049N885M741N810
51708D45094Q203R324P792M913K626J078p77l023m450m266l174k472k544k571
51694D55753j638P1J301J109K4n21J19J097J276O94L78Q43J378J061P8n36m59
51677D62028n60j516k541k393j200l44n26j012j039r61j423k124k171j225J57
$$ y = [260868, 262201, 263461, 264366, 265204, 266295, 267774, 269900, 272915, 276378, 279286, 281171, 282611, 284306, 286274, 288305, 290484, 292591, 293635, 292899, 291136, 289825, 289474, 289500, 289662, 290567, 292532, 294777, 296199, 296495, 296243, 296292, 297251, 299210, 301623, 303569, 304314, 303658, 301950, 299954, 298498, 298019, 298598, 300474, 304020, 308871, 313714, 317553, 320683, 323746, 326350, 327600, 327571, 327160, 326716, 326050, 325789, 327322, 331015, 335626, 340015, 344497, 349877, 355957, 361683, 366235, 369491, 372037, 375252, 380802, 389328, 399856, 410718, 420609, 428658, 434543, 439284, 445094, 453297, 462621, 470413, 475326, 477952, 479030, 478253, 475230, 470780, 466514, 463340, 460868, 458324, 455753, 454115, 454186, 455487, 456596, 456620, 456099, 456218, 457315, 458591, 459285, 459663, 460506, 461884, 462945, 463023, 462487, 462028, 461468, 459952, 457411, 455018, 453818, 453474, 452948, 451936, 450897, 449936, 448513, 446389, 444218, 442993, 443150]
51662D43150J025O47q63k294k357j251m55o86j041p41m84j154k206k464j976j675
51646D25175j712j332k84P37J010L40j024k301k357r19O66Q64j36p86k05J114
51630D18850K341L029K962K273J667J632J607P97m43j010o02J12O55R84P08o78
51614D34884k796m698o143p451q273p813o357n342n546o344o882o962o624n889
51600C47764n081m443l522k100j387k689m851n039k498K33O45r31k664l680l927
51585C05830l142j497k72l82r16m62P43J229L89j028k132k547k137j088j35N1
51569B92504m07r97j501j751j278P4J521K135J898J386P19m17j885k849k354j34
51553B86664K856M712M211K344J433K471M314N677O516O909O229M645L886N006
$$ y = [443150, 444175, 444822, 443959, 441665, 439308, 438057, 437602, 436916, 435875, 435134, 434650, 433496, 431290, 428826, 426850, 425175, 423463, 422131, 421847, 422584, 423594, 423934, 422910, 420609, 418252, 417333, 417999, 418863, 418727, 417941, 417736, 418850, 421191, 424220, 427182, 429455, 431122, 432754, 434361, 435158, 434715, 433705, 433103, 433215, 433870, 434854, 435562, 434884, 432088, 427390, 421247, 413796, 405523, 397710, 391353, 386011, 380465, 374121, 367239, 360277, 353653, 347764, 342683, 338240, 334718, 332618, 331231, 328542, 323691, 318652, 316154, 316387, 317032, 316101, 313437, 309757, 305830, 302688, 301191, 300919, 300537, 299621, 299159, 299902, 301131, 301520, 300492, 298360, 295813, 293676, 292588, 292453, 292504, 292097, 291100, 289599, 287848, 286570, 286644, 288165, 290300, 292198, 293584, 294303, 293886, 292001, 289152, 286798, 286664, 289520, 294232, 298443, 300787, 302220, 304691, 309005, 314682, 321198, 328107, 334336, 338981, 342867, 347873]
51539C47873O448O129M505L629L845L550K141R27P58N78o71k166k232n59J410
51524C76165K116J445Q30J738L874N275M572K560Q68l5m51M8J991M301N150M603
51508D15050M544N593O037M655K903K881M352N188M161K059L44k43N8M49L11j35
51492D58207k52k34j091k967m434m401l912m733o560p207n786m206m635o432o876
51477C94481m705j727m44j078j816j420m87l0p2j60k98m38O1J428K496K024O62
51460C88477K75J390K687L090K964K888K637J991J415J200R56O11Q84J924K563
51445D15952J891P66N78J224J536J207J102J866L227M488M853L677J392j08Q08
51430D44459L467N643O179N880N776N836N676N469N523N651N534N220M976M961
$$ y = [347873, 354321, 360450, 364955, 368584, 372429, 375979, 378120, 379047, 379805, 380383, 379712, 377546, 375314, 374755, 376165, 378281, 379726, 380556, 382294, 386168, 391443, 396015, 398575, 399443, 399408, 398957, 399005, 400996, 405297, 410447, 415050, 419594, 425187, 431224, 435879, 438782, 441663, 446015, 451203, 455364, 457423, 457767, 457524, 457582, 458031, 458342, 458207, 457955, 457721, 456630, 453663, 449229, 444828, 440916, 436183, 429623, 422416, 416630, 412424, 407789, 401357, 394481, 389776, 388049, 387605, 386527, 384711, 383291, 382804, 382774, 382702, 382542, 382244, 381806, 381867, 383295, 385791, 387815, 388477, 388752, 390142, 392829, 395919, 398883, 401771, 404408, 406399, 407814, 409014, 409970, 410581, 411465, 413389, 415952, 417843, 418609, 419187, 420411, 421947, 423154, 424256, 426122, 429349, 433837, 438690, 442367, 443759, 443651, 444459, 447926, 453569, 459748, 465628, 471404, 477240, 482916, 488385, 493908, 499559, 505093, 510313, 515289, 520250]
51416E20250N254N710N748M838L312K095J544J169O67M51Q21J321J346R48N11
51401E55985J18m39j299k530m130n749o784p064p121p495q041q194p581o256m690
51386D78730l725m059n352o221n515l460j344k53k61m75K14J996L610L512J743
51371D59140j0n31m68j078k334l177l156k856k864l176l629m197m775n118n115
51356D16656m782m169l672m119n827p782q502p777o823o653p006p065o522n557
51342C30400m296k850j543p38n61j037k145l528m342l968k884k407l251m516m567
51327B87767l010j303j051k191l378l831l757l194j745J15Q69j1j013o41L49J66
51311B64141j322k669l165l391l588l188k228j640j709j587q59k75l68n50k19
$$ y = [520250, 525504, 531214, 536962, 541800, 545112, 547207, 548751, 549920, 550587, 551038, 551859, 553180, 554526, 555474, 555985, 556103, 555664, 554365, 551835, 547705, 541956, 535172, 528108, 520987, 513492, 505451, 497257, 489676, 483420, 478730, 475005, 470946, 465594, 459373, 453858, 450398, 449054, 448801, 448540, 448065, 448279, 450275, 453885, 457397, 459140, 459130, 458599, 458131, 457053, 454719, 451542, 448386, 445530, 442666, 439490, 435861, 431664, 426889, 421771, 416656, 411874, 407705, 404033, 399914, 394087, 386305, 377803, 370026, 363203, 356550, 349544, 342479, 335957, 330400, 326104, 323254, 321711, 320973, 320412, 319375, 317230, 313702, 309360, 305392, 302508, 300101, 296850, 292334, 287767, 284757, 283454, 282403, 280212, 276834, 273003, 269246, 266052, 264307, 264422, 265291, 265280, 264267, 263626, 263975, 264141, 262819, 260150, 256985, 253594, 250006, 246818, 244590, 242950, 241241, 239654, 238795, 238520, 238152, 237602, 237383]
51296B37383L31P69J399K256K676K520K746L819M622M024K587J699J692J993K328
51281B72844K741L025L146L481L724K556l64l130l884l490m080n697o541o174
51267B58157o084o790o829n352l744l461l981m063l672l339k748j435q5K32l02
51252B06504o83p41j189k152k746k323j310o73q99j646k021j357p0N68j36j319
51236A87807j574o88L07O69P75J197J661J461N90j08LN56N95l34j767k889l195
51219A85066k623j529p13q65j614j560N8K039K381N99j784l025k631j050J028
51204A73777K673K911J614k44j706k684l291k964j165J401L044K752J103n00j175
51189A75546j066q17p74o96l22j19r87k937m479l959j563O01Q20j94k65J296K579
$$ y = [237383, 237714, 238483, 239882, 242138, 244814, 247334, 250080, 253899, 258521, 262545, 265132, 266831, 268523, 270516, 272844, 275585, 278610, 281756, 285237, 288961, 291517, 291153, 288023, 284139, 280649, 276569, 270872, 264331, 258157, 252073, 245283, 238454, 233102, 229358, 225897, 221916, 217853, 214181, 210842, 208094, 206659, 206574, 206806, 206504, 205821, 205080, 203891, 201739, 198993, 196670, 195360, 194687, 193788, 192142, 190121, 188764, 188694, 189262, 189126, 187807, 186233, 185545, 185852, 186521, 187296, 188493, 190154, 191615, 192205, 192097, 192100, 192656, 193251, 192917, 191150, 188261, 185066, 182443, 180914, 180201, 179336, 177722, 176162, 176220, 178259, 180640, 181239, 179455, 176430, 173799, 172749, 173777, 176450, 179361, 180975, 180731, 179025, 176341, 173050, 170086, 168921, 170322, 173366, 176118, 177221, 176721, 175546, 174480, 173663, 172889, 172193, 171871, 171752, 170765, 167828, 163349, 159390, 157827, 158428, 159248, 159054, 158789, 160085, 162664]
51172A62664J575r83k423j636j67N14J148K838M520M272K491J471J845J694j82
51157A79641k043j590Q79L061L528K678J468N43M52J483L091M089L715K227O43
51142B03865N9Q31K220L013K723J733L78j296k681k635r64R33J653J325Q93O32
51126B12682K21l44q06j146j332r78m1O79N15j20m43m21l64j09M53N92l20j580
51108B07138j979j536j211j296j216p09J7J076K564L565K871P93r78j469j248
51093B06382j061r35q64j148j642j736j398j230j249p65J95O19J50k33J85O98
51077A95968L58p03j835k776l302k879j512q4Q32J602K292J997M71p18j74J161
51061A90698J401N99L75J056J193J53q67j067j469k994m434l978j951m85n69q91
$$ y = [162664, 164239, 163256, 160833, 159197, 159030, 159544, 160692, 163530, 168050, 172322, 174813, 176284, 178129, 179823, 179641, 177598, 176008, 176887, 179948, 183476, 186154, 187622, 188165, 188617, 190100, 193191, 197280, 200995, 203222, 203865, 203924, 204755, 206975, 209988, 212711, 214444, 214822, 213526, 210845, 208210, 207246, 208179, 209832, 211157, 212050, 212682, 212903, 212559, 211753, 210607, 209275, 208297, 208256, 208935, 209450, 209330, 208887, 208466, 208102, 207993, 208446, 209038, 208718, 207138, 205159, 203623, 202412, 201116, 199900, 199191, 199208, 200284, 202848, 206413, 209284, 210077, 209099, 207630, 206382, 205321, 204386, 203522, 202374, 200732, 198996, 197598, 196368, 195119, 194354, 194549, 195168, 195318, 195085, 195270, 195968, 196326, 195623, 193788, 191012, 187710, 184831, 183319, 183235, 184067, 185669, 187961, 189958, 190429, 189711, 189537, 190698, 192099, 192698, 193073, 194129, 195322, 195475, 194608, 193541, 192072, 189078, 184644, 180666, 178715, 178230, 177661, 176770]
51045A76770P7J977L257L241K542J765Q13k81o91K93K089L346L614L640L834L355
51029B09641J404j020j781o6K543L833L349K463K343K573K200J457J581K896L940
51014B37356L159R07r47j244m99J89L51R6l59o32k50P59J697J893J267J10j214
50997B42639k157k309k060k303l041l122j847j55N89K48m37j131j728j474K31
50982B21943K280K554N76j691k244j239k40n2j09M14J592K743L119K645K034J917
50966B36242J997J609J018J283K500L299K673J512J357K200K657K126J535J743
50952B63751K216J879P90L06J595M260O547O837N022K420N37Q8J073L060N081
50937C05462N893N131L930L711M570N618O642Q317J0579J2041J1658J0198R279
$$ y = [176770, 176847, 178824, 182081, 185322, 187864, 189629, 190442, 190161, 189470, 189763, 191852, 195198, 198812, 202452, 206286, 209641, 211045, 210025, 208244, 208178, 210721, 214554, 217903, 220366, 222709, 225282, 227482, 228939, 230520, 233416, 237356, 240515, 241422, 240475, 239231, 238732, 238921, 239272, 239368, 239009, 238377, 238127, 238886, 240583, 242476, 243743, 243853, 242639, 240482, 238173, 236113, 233810, 230769, 227647, 225800, 225645, 226234, 226482, 226045, 224914, 223186, 221712, 221943, 224223, 226777, 227353, 225662, 223418, 222179, 221939, 221887, 221778, 222192, 223784, 226527, 229646, 232291, 234325, 236242, 238239, 239848, 240866, 242149, 244649, 247948, 250621, 252133, 253490, 255690, 258347, 260473, 262008, 263751, 265967, 267846, 268636, 268942, 270537, 274797, 281344, 288181, 293203, 295623, 296160, 296248, 297321, 300381, 305462, 311355, 316486, 320416, 324127, 328697, 334315, 340957, 349274, 359853, 371894, 383552, 393750, 403029]
50924D03029R519J0303J0963J1395J1708J2007J2518J3405J4522J5799J7630K0299
50912E63097K3155K5069K5819K6396K7812L0056L2400L4346L6007L7959M0840
50901I02956M4815M9237N2999N5421N6629N7255N7857N8589N9077N8658N6964
50890A510457N4207N0705M6598M2288L8599L5718L2527K8021K3180K0043J8882
50879A901225J7656J4803J1216Q730P765P501P516P916Q268P490M815K83n435
50866A999749j1114j5520j8730k2528k8520l6097m3147m8394n2131n4890n6713
50855A611965n7744n8456n8867n8337n6483n3727n0723m7739m4756m1692l8494
50844A044947l5345l2629l0292k7611k4295k1222j9163j7325j4413j0815q148
$$ y = [403029, 412548, 422851, 433814, 445209, 456917, 468924, 481442, 494847, 509369, 525168, 542798, 563097, 586252, 611321, 637140, 663536, 691348, 721404, 753804, 788150, 824157, 862116, 902956, 947771, 997008, 1050007, 1105428, 1162057, 1219312, 1277169, 1335758, 1394835, 1453493, 1510457, 1564664, 1615369, 1661967, 1704255, 1742854, 1778572, 1811099, 1839120, 1862300, 1882343, 1901225, 1918881, 1933684, 1944900, 1953630, 1961395, 1968896, 1976412, 1984328, 1992596, 2000086, 2004901, 2005184, 1999749, 1988635, 1973115, 1954385, 1931857, 1903337, 1867240, 1824093, 1775699, 1723568, 1668678, 1611965, 1554221, 1495765, 1436898, 1378561, 1322078, 1268351, 1217628, 1169889, 1125133, 1083441, 1044947, 1009602, 976973, 946681, 919070, 894775, 873553, 854390, 837065, 822652, 811837, 803689]
50833H03689o727n249l276k160k720l670l513k536j634n06J435L320L896L691
50819G84040M291N737O480O100O269Q263J0968J2282J1778J0962J1228J2399J3357
50806I04154J3680J4206J5895J8368K0197K0804K1401K3542K7289L1606L5913
50795A147055M0156M3812M6309M8544N2436N8465O4867P0104P4991Q1334Q9223
50784A817296R6980J03361J08549J13003J16612J19328J21718J24135J25861J25600
50774B972443J22701J17497J10620J02301R2456Q1284O9645N8742M9283M1122
50764C818094L3941K8082K4246K2364K1479K1042K1728K4312K8126L1350L2551
50753D107315L1125K6361J7418M786r213k2562l5607m9873o5093p8802q9356r7993
$$ y = [803689, 796962, 791713, 788437, 786277, 783557, 779887, 776374, 773838, 772204, 771698, 773133, 776453, 780349, 784040, 788331, 794068, 800548, 806648, 812917, 821180, 832148, 844430, 856208, 867170, 878398, 890797, 904154, 917834, 932040, 947935, 966303, 986500, 1007304, 1028705, 1052247, 1079536, 1111142, 1147055, 1187211, 1231023, 1277332, 1325876, 1378312, 1436777, 1501644, 1571748, 1646739, 1728073, 1817296, 1914276, 2017637, 2126186, 2239189, 2355801, 2475129, 2596847, 2720982, 2846843, 2972443, 3095144, 3212641, 3323261, 3425562, 3518018, 3599302, 3668947, 3727689, 3776972, 3818094, 3852035, 3880117, 3904363, 3926727, 3948206, 3969248, 3990976, 4015288, 4043414, 4074764, 4107315, 4138440, 4164801, 4182219, 4187005, 4177792, 4155230, 4119623, 4069750, 4004657, 3925855, 3836499, 3738506]
50741C738506j06835j15550j21436j22802j21102j18893j16502j11865j03627
50732B699894r3322q3690p5459o6802n6083m4125l3148k4158j6242q283l20O993
50720B205255J3538J9574K4698K7715K7817K5685K2980K0591J7640J2661N742
50709B423896j039n675q334j1010j5303k1118k7257l2637l6810l9923m2498m5034
50697B137258m7688n0333n2634n3752n2541m8834m4256m0662l7762l3470k6955
50686A648371k0183j5604j3217j0858o947j804L487Q502J3480J8552K3444K7849
50674A675072L1994L6676M2440M8781N4634N9726O4759P0045P4752P8049Q0207
50663B317135Q1725Q2188Q0979P8681P6428P3998O9796O3027N4707M6102L7157
$$ y = [3738506, 3631671, 3516121, 3394685, 3271883, 3150781, 3031888, 2915386, 2803521, 2699894, 2606572, 2522882, 2447423, 2380621, 2324538, 2280413, 2247265, 2223107, 2206865, 2198582, 2198262, 2205255, 2218793, 2238367, 2263065, 2290780, 2318597, 2344282, 2367262, 2387853, 2405493, 2418154, 2423896, 2422857, 2417182, 2408848, 2397838, 2382535, 2361417, 2334160, 2301523, 2264713, 2224790, 2182292, 2137258, 2089570, 2039237, 1986603, 1932851, 1880310, 1831476, 1787220, 1746558, 1708796, 1675326, 1648371, 1628188, 1612584, 1599367, 1588509, 1581562, 1579758, 1583245, 1591747, 1605227, 1623779, 1647223, 1675072, 1707066, 1743742, 1786182, 1834963, 1889597, 1949323, 2014082, 2084127, 2158879, 2236928, 2317135, 2398860, 2481048, 2562027, 2640708, 2717136, 2791134, 2860930, 2923957, 2978664, 3024766, 3061923]
50652C061923K7162J6388O233k007p968j1924j4095j4392j2788r793o301k748
50640C029690J182N480Q928J0226R895R717R859P864J590p785j6997k4527l1583
50627C013539l9287m6475n1135n2806n2339n0018m5420l9045l2612k7163k1930
50616B555309j5823r189l113K541R110J7213K6023L4716M3568N3031O2571P1245
50604B847202P8790Q5401R0762R4157R5322R4508R1877Q7443Q1447P4132O5574
50593C786615N6493M8724M3539L9404L3044K3429J3402O389K515p00m697q553
50581D039604j1158j2869j4427j5468j5006j2708q966m198J094O113J0385J4295
50569C976691J8188K1101K1431J9010J5505J2406R436N562Q32l779p880j1905
$$ y = [3061923, 3089085, 3105473, 3111706, 3109699, 3101731, 3089807, 3075712, 3061320, 3048532, 3038739, 3032438, 3029690, 3030872, 3036352, 3045280, 3055506, 3065401, 3075118, 3084977, 3092841, 3094431, 3086646, 3069649, 3045122, 3013539, 2974252, 2927777, 2876642, 2823836, 2771497, 2721479, 2676059, 2637014, 2604402, 2577239, 2555309, 2539486, 2530297, 2527184, 2529725, 2538835, 2556048, 2582071, 2616787, 2660355, 2713386, 2775957, 2847202, 2925992, 3011393, 3102155, 3196312, 3291634, 3386142, 3478019, 3565462, 3646909, 3721041, 3786615, 3843108, 3891832, 3935371, 3974775, 4007819, 4031248, 4044650, 4051039, 4053554, 4052854, 4048157, 4039604, 4028446, 4015577, 4001150, 3985682, 3970676, 3957968, 3949002, 3944804, 3945898, 3952011, 3962396, 3976691, 3994879, 4015980, 4037411, 4056421, 4071926, 4084332, 4093768, 4099330, 4100162, 4096383, 4088503, 4076598]
50557D076598j5907j9067k0698k0876j9685j6695j1916o627k284J271N431J0500
50545C960045J4596J5534J3313R947O964L746j456r512j9941l1887m4706n7484
50533C859159o8884p8122q5661r2335r8012j01723j03086j02905j02106j00646
50523B925679r7893r3757q8952q4134p9190p3492o6812n9826n3552m8319m3377
50512B136375l7710l1021k3831j6835j0601n630k091O17L651P842J3145J8838
50500B052749K3849K7204K8877L0214L2780L6566M0062M2458M4916M9163N5431
50489B464269O2553O9573P6333Q2709Q8193R2520R6107R9499J02552J04317J03735
50478C442360J00655R6318R2523R0098Q8474Q6991Q6072Q6532Q8108Q9707R1034
$$ y = [4076598, 4060691, 4041624, 4020926, 4000050, 3980365, 3963670, 3951754, 3945127, 3942843, 3944114, 3949545, 3960045, 3974641, 3990175, 4003488, 4013435, 4020399, 4024145, 4022689, 4013177, 3993236, 3961349, 3916643, 3859159, 3790275, 3712153, 3626492, 3534157, 3436145, 3334422, 3231336, 3128431, 3026325, 2925679, 2827786, 2734029, 2645077, 2560943, 2481753, 2408261, 2341449, 2281623, 2228071, 2179752, 2136375, 2098665, 2067644, 2043813, 2026978, 2016377, 2010747, 2008656, 2009273, 2012924, 2020766, 2033911, 2052749, 2076598, 2103802, 2132679, 2162893, 2195673, 2232239, 2272301, 2314759, 2359675, 2408838, 2464269, 2526822, 2596395, 2672728, 2755437, 2843630, 2936150, 3032257, 3131756, 3234308, 3338625, 3442360, 3543015, 3639333, 3731856, 3821954, 3910428, 3997419, 4083491, 4170023, 4258131, 4347838, 4438872]
50467D438872R3014R6146R9323J01051J01662J03384J08039J15022J21832J26313
50457E504658J28159J28469J28360J27924J25997J20730J10905R7168Q1550O5295
50447F619215M7540K6813L434k0467m3123o4266q3948j01427j15773j26684j33882
50436F007432j36448j33720j26557j16836j05676r2648p6808n8282l8881k1368
50426E100208p841J399P398J0883J1237O957l213j9384m0034o2398q4062j04255
50414D816895j22888j38740j49942j56365j59905j61842j61535j58517j54163
50405C452998j49813j44688j37388j28473j19653j11190j02216r3167q5689p9980
50395B300741p4206o7022n9172n2095m6290m1407l6739l1369k4987j8848j4547
$$ y = [4438872, 4531886, 4628032, 4727355, 4828406, 4930068, 5033452, 5141491, 5256513, 5378345, 5504658, 5632817, 5761286, 5889646, 6017570, 6143567, 6264297, 6375202, 6472370, 6553920, 6619215, 6666755, 6693568, 6697002, 6676535, 6633412, 6569146, 6485198, 6383771, 6267998, 6141314, 6007432, 5870984, 5737264, 5610707, 5493871, 5388195, 5295547, 5218739, 5160457, 5121576, 5100208, 5092367, 5093766, 5101164, 5112047, 5123284, 5130241, 5127028, 5107644, 5067610, 5005212, 4921150, 4816895, 4694007, 4555267, 4405325, 4248960, 4089055, 3927213, 3765678, 3607161, 3452998, 3303185, 3158497, 3021109, 2892636, 2772983, 2661793, 2559577, 2466410, 2380721, 2300741, 2226535, 2159513, 2100341, 2048246, 2001956, 1960549, 1923810, 1892441, 1867454, 1848606, 1834059]
50384A834059j1639q013l013J519M041N556P831J0878J3657J6201J9374K3055
50372A913506K6243K8806L1724L5469L9361M2816M6158M9608N2428N3883N4549
50361B374551N5836N8188O0618O2179O3166O4277O5227O5209O4528O4533O5665
50350C063977O6810O7164O7616O9324P1837P3842P5146P6488P7809P8034P6430
50339C864477P3082O8189O2015N5322M8591M1013L1468K0289Q715l157j6198l0151
50327D223655m3609n6286o9341q2744r4165j01536j05241j06746j06353j03416
50317C354218r7632q9185p8559o7102n6683m7862l9400l0334k1486j4080q197
50306B803698l683j291j648m223q533j5285k4795l5318m4699n2771o0407o6955
$$ y = [1834059, 1822420, 1814407, 1811394, 1812913, 1816954, 1822510, 1830341, 1841219, 1854876, 1871077, 1890451, 1913506, 1939749, 1968555, 2000279, 2035748, 2075109, 2117925, 2164083, 2213691, 2266119, 2320002, 2374551, 2430387, 2488575, 2549193, 2611372, 2674538, 2738815, 2804042, 2869251, 2933779, 2998312, 3063977, 3130787, 3197951, 3265567, 3334891, 3406728, 3480570, 3555716, 3632204, 3710013, 3788047, 3864477, 3937559, 4005748, 4067763, 4123085, 4171676, 4212689, 4244157, 4264446, 4273161, 4270004, 4253806, 4223655, 4180046, 4123760, 4054419, 3971675, 3877510, 3775974, 3670733, 3563987, 3457634, 3354218, 3256586, 3167401, 3088842, 3021740, 2965057, 2917195, 2877795, 2847461, 2825975, 2811895, 2803698, 2800015, 2798724, 2797076, 2792853, 2784320, 2769035, 2744240, 2708922, 2664223, 2611452, 2551045, 2484090]
50294B484090p0627p1221p0595p0369p0588p0664p0119o8296o4661n9651n4330
50283A742969m9248m4584m0984l8877l7225l4488l0759k7479k4913k1722j7364
50272A375326j3249j0650q975p108n207l900k662m23K659N321P063Q708J0940
50259A357843J3176J4434J4754J5122J6168J7519J8607J9562K0906K2644K4207
50248A554942K5142K5309K4605K3230K2224K2756K4592K6109K6072K4489K1582
50237A821052J7318J2564R238P933O686L482r73m498o540q147r694j0765j2055
50224A825601j4918j8782k1406k2327k3768k7048l0184l0696k9197k8152k8198
50213A550925k7843k6457k5277k5122k4883k3219k0609j8570j7561j6745j5707
$$ y = [2484090, 2413463, 2342242, 2271647, 2201278, 2130690, 2060026, 1989907, 1921611, 1856950, 1797299, 1742969, 1693721, 1649137, 1608153, 1569276, 1532051, 1497563, 1466804, 1439325, 1414412, 1392690, 1375326, 1362077, 1351427, 1342452, 1335344, 1330137, 1326237, 1323575, 1323152, 1325811, 1331132, 1338195, 1346903, 1357843, 1371019, 1385453, 1400207, 1415329, 1431497, 1449016, 1467623, 1487185, 1508091, 1530735, 1554942, 1580084, 1605393, 1629998, 1653228, 1675452, 1698208, 1722800, 1748909, 1774981, 1799470, 1821052, 1838370, 1850934, 1860172, 1868105, 1874791, 1878273, 1877300, 1872802, 1866262, 1858115, 1848421, 1837656, 1825601, 1810683, 1791901, 1770495, 1748168, 1724400, 1697352, 1667168, 1636472, 1607275, 1579123, 1550925, 1523082, 1496625, 1471348, 1446226, 1421343, 1398124, 1377515, 1358945, 1341384, 1324639, 1308932]
50202A308932j5184j5692j6320j5668j3591j1186r251p706o473n786n312m046
50190A182717j816O2L48n39j366j497o86J560M926P394P104M809K966K669L045
50175A211696L469M361N540N695M332K679J814J215M2j409k589l872n655p074
50161A220244o993n887n478o582q211q970q584p831p317o799n778m507l820l875
50147A129612l735k799j837j701j723o84J057K104K367L026M063L921K250R73
50133A136894J570K997L507K990K133P29j413l059k909j720j323k019k631k852
50119A132894l719n685p719q689q524p770o954o561o874p595q196q529q567p899
50105A029613o278m441l439l285l082k390j519o82K66J226J938K610L673M773
$$ y = [1308932, 1293748, 1278056, 1261736, 1246068, 1232477, 1221291, 1212040, 1204334, 1197861, 1192075, 1186763, 1182717, 1180901, 1180963, 1181311, 1180772, 1179406, 1177909, 1177223, 1178783, 1183709, 1191103, 1198207, 1203016, 1205982, 1208651, 1211696, 1215165, 1219526, 1225066, 1230761, 1235093, 1237772, 1239586, 1240801, 1240843, 1239434, 1236845, 1232973, 1227318, 1220244, 1213251, 1207364, 1201886, 1195304, 1187093, 1178123, 1169539, 1161708, 1154391, 1147592, 1141814, 1137307, 1133487, 1129612, 1125877, 1123078, 1121241, 1119540, 1117817, 1117133, 1118190, 1120294, 1122661, 1125687, 1129750, 1133671, 1135921, 1136894, 1138464, 1141461, 1144968, 1147958, 1150091, 1150820, 1149407, 1146348, 1143439, 1141719, 1140396, 1138377, 1135746, 1132894, 1129175, 1123490, 1115771, 1107082, 1098558, 1090788, 1083834, 1077273, 1070399, 1062804, 1054608, 1046079, 1037512, 1029613, 1023335, 1018894, 1015455, 1012170, 1009088, 1006698, 1005179, 1004497, 1004763, 1005989, 1007927, 1010537, 1014210, 1018983]
50091A018983M895L625J670P0m67M48K713N333O871O558M759K514J022J134K602
50076A062730M148M938N507O448O951O083M931N590P969R510Q659O838O079O288
50062A152669O176N582N339N461N044L913L147L818N766P752Q468P599O199N696
50048A232629O277O883O955P332Q789J0686J2154J3718J6331J9281K0851K1086
50036A382972K2241K5736L0213L3593L5938L8990M3502M8551N3439N8856O5645
50025A839676P3362Q0793Q7417R3631R9866J06161J12465J18483J22924J23669
50015B858447J19407J11013J00826R0636Q0781P1131O2247N5187N0400M7212M4286
50004C691573M0290L4140K5049J2758k248j9015l6717n4807p2398q7876r9592
$$ y = [1018983, 1023878, 1027503, 1029173, 1029243, 1028776, 1029224, 1031937, 1037270, 1044141, 1050699, 1055458, 1057972, 1058994, 1060128, 1062730, 1066878, 1071816, 1077323, 1083771, 1090722, 1096805, 1101736, 1107326, 1115295, 1124805, 1133464, 1140302, 1146381, 1152669, 1158845, 1164427, 1169766, 1175227, 1180271, 1184184, 1187331, 1191149, 1196915, 1204667, 1213135, 1220734, 1226933, 1232629, 1238906, 1245789, 1252744, 1260076, 1268865, 1279551, 1291705, 1305423, 1321754, 1341035, 1361886, 1382972, 1405213, 1430949, 1461162, 1494755, 1530693, 1569683, 1613185, 1661736, 1715175, 1774031, 1839676, 1913038, 1993831, 2081248, 2174879, 2274745, 2380906, 2493371, 2611854, 2734778, 2858447, 2977854, 3088867, 3189693, 3280329, 3361110, 3432241, 3494488, 3549675, 3600075, 3647287, 3691573, 3731863, 3766003, 3791052, 3803810, 3801562, 3782547, 3745830, 3691023, 3618625, 3530749, 3431157]
49993C431157j06979j10561j10820j07788j02060r5403q9527q4538p9318p3241
49983B470922o6783o0475n4264m8132m2543l7870l3971l0664k8040k5890k3527
49972B018763k0664j8011j6278j5175j4132j3557j4291j5858j6494j5312j3552
49961A845439j2981j3685j4268j3877j3022j2352j1519r883p817o432o008n427
49949A718168l532o02J997L419M042M662N575O637P679Q626R520J0708J2594J4892
49935A804385J6535J6780J6178J5913J6378J7001J7354J7779J8662J9733K0451
49924A997149K0779K1255K2384K4237K6511K8829L1000L3088L5241L7664M0893
49913B319030M5797N2813O1183O9674P8108Q7608R8988J11487J23640J34859J45412
$$ y = [3431157, 3324178, 3213617, 3102797, 2995009, 2892949, 2797546, 2708019, 2623481, 2544163, 2470922, 2404139, 2343664, 2289400, 2241268, 2198725, 2160855, 2126884, 2096220, 2068180, 2042290, 2018763, 1998099, 1980088, 1963810, 1948635, 1934503, 1920946, 1906655, 1890797, 1874303, 1858991, 1845439, 1832458, 1818773, 1804505, 1790628, 1777606, 1765254, 1753735, 1743852, 1736035, 1729603, 1723595, 1718168, 1714636, 1714034, 1716031, 1719450, 1723492, 1728154, 1733729, 1740366, 1748045, 1756671, 1766191, 1776899, 1789493, 1804385, 1820920, 1837700, 1853878, 1869791, 1886169, 1903170, 1920524, 1938303, 1956965, 1976698, 1997149, 2017928, 2039183, 2061567, 2085804, 2112315, 2141144, 2172144, 2205232, 2240473, 2278137, 2319030, 2364827, 2417640, 2478823, 2548497, 2626605, 2714213, 2813201, 2924688, 3048328, 3183187, 3328599]
49902C328599J55103J62708J66800J66598J62064J53843J43251J31809J20652
49893D691427J10586J02498R6881R2750Q7837Q0403P0287N7781M2090K1906k725
49882E451721k9897n7286q3367j07154j27587j43903j56336j65837j73069j77962
49872D229323j80237j79923j77307j72683j66436j59139j51330j43212j34842
49863B764214j26538j18646j11014j03034r4458q5719p7330o9509o2595n7181
49853A858190n3210m9555m5379m1396l8767l7064l4695l1396k8783k7947k7911
49842A442087k7326k6455k6338k6855k6914k5971k4200k1688j8741j6521j5938
$$ y = [3328599, 3483702, 3646410, 3813210, 3979808, 4141872, 4295715, 4438966, 4570775, 4691427, 4802013, 4904511, 5001392, 5094142, 5181979, 5262382, 5332669, 5390450, 5432540, 5454446, 5451721, 5421824, 5364538, 5281171, 5174017, 5046430, 4902527, 4746191, 4580354, 4407285, 4229323, 4049086, 3869163, 3691856, 3519173, 3352737, 3193598, 3042268, 2899056, 2764214, 2637676, 2519030, 2408016, 2304982, 2210524, 2124805, 2047475, 1977966, 1915371, 1858190, 1804980, 1755425, 1710046, 1668650, 1629883, 1592819, 1558124, 1526728, 1497945, 1469998, 1442087, 1414761, 1388306, 1361968, 1335113, 1308199, 1282228, 1258028, 1236340, 1217599, 1201078, 1185140]
$$ [...]
##END NTUPLES=NMR SPECTRUM
##END=
