##TITLE=coffee_type TOLI01-ROVE100E_70-30%
COFFEE_meoh_noesyp64 COFFEE_meoh {C:\Bruker\TOPSPIN} Administrator 11
##JCAMPDX= 6.0         $$ Bruker NMR JCAMP-DX V2.0
##DATA TYPE= NMR SPECTRUM
##DATA CLASS= NTUPLES
##ORIGIN= Bruker BioSpin GmbH
##OWNER= Administrator
$$ 1.72 TOPSPIN		Version 2.1
$$ 2012-05-18 15:48:20.636 -0700  Administrator@X
$$ Compression mode = diff/dup
##.OBSERVE FREQUENCY= 400.13188235
##.OBSERVE NUCLEUS= ^1H
##.ACQUISITION MODE= SIMULTANEOUS (DQD)
##.ACQUISITION SCHEME= undefined
##.AVERAGES= 64
##.DIGITISER RES= 22
##SPECTROMETER/DATA SYSTEM= spect
##.PULSE SEQUENCE= noesygpps1d.comp
##.SOLVENT NAME= COFFEE_meoh
##.SHIFT REFERENCE= INTERNAL, COFFEE_meoh, 1, 14.98061
##AUDIT TRAIL= $$ (NUMBER, WHEN, WHO, WHERE, PROCESS, VERSION, WHAT)
$$ ##TITLE= Audit trail, TOPSPIN		Version 2.1
$$ ##JCAMPDX= 5.01
$$ ##ORIGIN= Bruker BioSpin GmbH
$$ ##OWNER= Administrator
$$ $$ C:\Bruker\TOPSPIN/data/Administrator/nmr/12-COFFEE-2402/132/pdata/1/auditp.txt
$$ ##AUDIT TRAIL=  $$ (NUMBER, WHEN, WHO, WHERE, PROCESS, VERSION, WHAT)
(   1,<2012-02-24 22:59:15.719 -0500>,<Administrator>,<TOPSPIN>,<go>,<TOPSPIN 2.1>,
      <created by zg
	started at 2012-02-24 22:47:45.516 -0500,
	POWCHK enabled, PULCHK disabled,
       configuration hash MD5:
       B0 76 FB 9C 50 81 44 7D 18 B3 26 32 4E 60 AD 96
       data hash MD5: 64K
       CB DF 3F DA 37 C7 78 54 21 A2 05 52 95 6F FD BF>)
(   2,<2012-02-24 22:59:19.016 -0500>,<Administrator>,<TOPSPIN>,<proc1d>,<TOPSPIN 2.1>,
      <Start of raw data processing
       efp LB = 0.3 FT_mod = 6 PKNL = 1 PHC0 = 0 PHC1 = 0 SI = 128K 
       data hash MD5: 128K
       04 66 4C 11 D1 D7 81 3C 34 4E 5F DF 05 37 A6 6D>)
(   3,<2012-02-24 22:59:20.312 -0500>,<Administrator>,<TOPSPIN>,<proc1d>,<TOPSPIN 2.1>,
      <pk PHC0 = 23.71948 PHC1 = 0 
       data hash MD5: 128K
       74 23 46 33 3A 16 68 21 9F 0B FC 12 23 FC F6 CE>)
(   4,<2012-02-24 22:59:20.547 -0500>,<Administrator>,<TOPSPIN>,<proc1d>,<TOPSPIN 2.1>,
      <abs ABSG = 1 
       data hash MD5: 128K
       C3 99 58 A7 CD 52 BB DB C7 69 C6 FA B0 64 D7 52>)
(   5,<2012-02-24 22:59:20.625 -0500>,<Administrator>,<TOPSPIN>,<proc1d>,<TOPSPIN 2.1>,
      <abs ABSG = 2 
       data hash MD5: 128K
       A5 3F 55 7F D4 BF C2 59 02 E9 86 11 7F 3E 6C A0>)
(   6,<2012-02-24 22:59:20.672 -0500>,<Administrator>,<TOPSPIN>,<proc1d>,<TOPSPIN 2.1>,
      <abs ABSG = 3 
       data hash MD5: 128K
       DF 86 58 4F C1 B8 C0 BF 3C BB F9 00 F7 6E FE DE>)
(   7,<2012-02-24 22:59:20.812 -0500>,<Administrator>,<TOPSPIN>,<proc1d>,<TOPSPIN 2.1>,
      <abs ABSG = 4 
       data hash MD5: 128K
       DB ED 9D 5D E4 EC 55 EB 6A E2 82 41 65 85 9D BC>)
(   8,<2012-02-24 22:59:21.000 -0500>,<Administrator>,<TOPSPIN>,<proc1d>,<TOPSPIN 2.1>,
      <abs ABSG = 5 
       data hash MD5: 128K
       30 C3 DB 63 4A 92 2A 4D CA 3B 95 41 59 59 C3 CD>)
(   9,<2012-02-24 22:59:21.125 -0500>,<Administrator>,<TOPSPIN>,<audit>,<TOPSPIN 2.1>,
      <user comment:
       ICON-NMR User ID: Administrator
$$ [...]
150 150 150 150 150 150 150 150
##$TP07= 0
##$TPNAME0= <>
##$TPNAME1= <>
##$TPNAME2= <>
##$TPNAME3= <>
##$TPNAME4= <>
##$TPNAME5= <>
##$TPNAME6= <>
##$TPNAME7= <>
##$TPOAL= (0..7)
0.5 0.5 0.5 0.5 0.5 0.5 0.5 0.5
##$TPOFFS= (0..7)
0 0 0 0 0 0 0 0
##$TUNHIN= 0
##$TUNHOUT= 0
##$TUNXOUT= 0
##$USERA1= <user>
##$USERA2= <user>
##$USERA3= <user>
##$USERA4= <user>
##$USERA5= <user>
##$V9= 5
##$VALIST= <valist>
##$VCLIST= <CCCCCCCCCCCCCCC>
##$VD= 0
##$VDLIST= <DDDDDDDDDDDDDDD>
##$VPLIST= <PPPPPPPPPPPPPPP>
##$VTLIST= <TTTTTTTTTTTTTTT>
##$WBST= 1024
##$WBSW= 4
##$XGAIN= (0..3)
0 0 0 0
##$XL= 0
##$YL= 0
##$YMAX_a= 13605663
##$YMIN_a= -6219004
##$ZGOPTNS= <>
##$ZL1= 120
##$ZL2= 120
##$ZL3= 120
##$ZL4= 120
##$ABSF1= 14.98061
##$ABSF2= -5.57192
##$ABSG= 5
##$ABSL= 3
##$ALPHA= 0
##$AQORDER= 0
##$ASSFAC= 0
##$ASSFACI= 0
##$ASSFACX= 0
##$ASSWID= 0
##$AUNMP= <proc_prof1d_extract>
##$AXLEFT= 0
##$AXNAME= <>
##$AXNUC= <1H>
##$AXRIGHT= 0
##$AXTYPE= 0
##$AXUNIT= <>
##$AZFE= 0.1
##$AZFW= 0.1
##$BCFW= 0
##$BC_mod= 0
##$BYTORDP= 0
##$COROFFS= 0
##$CY= 15
##$DATMOD= 1
##$DC= 0
##$DFILT= <>
##$DTYPP= 0
##$F1P= 0
##$F2P= 0
##$FCOR= 0.5
##$FTSIZE= 131072
##$FT_mod= 6
##$GAMMA= 0
##$GB= 0
##$INTBC= 1
##$INTSCL= 1
##$ISEN= 128
##$LB= 0.3
##$LEV0= 0
##$LPBIN= 0
##$MAXI= 10000
##$MC2= 0
##$MEAN= 0
##$ME_mod= 0
##$MI= 0
##$NCOEF= 0
##$NC_proc= -3
##$NLEV= 6
##$NOISF1= 0
##$NOISF2= 0
##$NSP= 0
##$NTH_PI= 0
##$NZP= 0
##$OFFSET= 14.98061
##$PC= 1
##$PHC0= 23.71948
##$PHC1= 0
##$PH_mod= 1
##$PKNL= yes
##$PPARMOD= 0
##$PPDIAG= 0
##$PPIPTYP= 0
##$PPMPNUM= 2147483647
##$PPRESOL= 1
##$PSCAL= 4
##$PSIGN= 0
##$PYNMP= <proc.py>
##$REVERSE= no
##$SF= 400.13
##$SI= 131072
##$SIGF1= 0
##$SIGF2= 0
##$SINO= 400
##$SIOLD= 131072
##$SPECTYP= <>
##$SREGLST= <1H.CDCl3>
##$SSB= 0
##$STSI= 131072
##$STSR= 0
##$SW_p= 8223.68421052632
##$SYMM= 0
##$S_DEV= 0
##$TDeff= 65536
##$TDoff= 0
##$TI= <>
##$TILT= no
##$TM1= 0
##$TM2= 0
##$TOPLEV= 0
##$USERP1= <user>
##$USERP2= <user>
##$USERP3= <user>
##$USERP4= <user>
##$USERP5= <user>
##$WDW= 1
##$XDIM= 131072
##$YMAX_p= 477106065
##$YMIN_p= -323773116
##$CURPLOT= <Network HP LaserJet P1505>
##$CURPRIN= <$Network HP LaserJet P1505>
##$DFORMAT= <normdp>
##$LAYOUT= <+/1D_H.xwp>
##$LFORMAT= <normlp>
##$PFORMAT= <normpl>
##$SURQMSG= 1
$$ End of Bruker specific parameters
$$ ---------------------------------
##NTUPLES= NMR SPECTRUM
##VAR_NAME=  FREQUENCY,     SPECTRUM/REAL,   SPECTRUM/IMAG
##SYMBOL=    X,             R,               I
##VAR_TYPE=  INDEPENDENT,   DEPENDENT,       DEPENDENT
##VAR_FORM=  AFFN,          ASDF,            ASDF
##VAR_DIM=   131072,        131072,          131072
##UNITS=     HZ,            ARBITRARY UNITS, ARBITRARY UNITS
##FACTOR=    0.0627417313425165, 1,          1
##FIRST=     8223.62146879498, -1640,        -89029
##LAST=      0,             2039,            -90048
##MIN=       0,             -323773116,      0
##MAX=       8223.62146879498, 477106065,    0
$$ Real data points
##PAGE= N=1
##DATA TABLE= (X++(R..R)), XYDATA
$$ [...]
66870 3544038 3577133 3610420 3645717 3683262 3721779 3759885 3796916 3832606 3866634 3898856 3929825
66859 3929825 3960716 3992465 4024834 4056506 4086363 4114627 4142590 4171426 4201574 4232969 4265150
66848 4265150 4297132 4327790 4356589 4383451 4407985 4429767 4449825 4470803 4494578 4520016 4544024
66837 4544024 4564795 4583237 4601188 4619102 4635926 4650717 4663724 4675894 4687652 4698307 4706647
66826 4706647 4712121 4715367 4717625 4719804 4722058 4723827 4723973 4721309 4715668 4708386 4701170 4694277 4686269 4675704
66812 4675704 4662712 4648732 4635111 4622260 4609727 4596546 4581670 4564608 4545788 4526008 4505420
66801 4505420 4483243 4458565 4431294 4402329 4373034 4344585 4317473 4291223 4264556 4236134 4205388
66790 4205388 4172705 4138908 4104728 4070742 4037494 4005243 3973459 3940781 3905846 3868421 3829803
66779 3829803 3791961 3756014 3721369 3686317 3649523 3610868 3570972 3530317 3489233 3448502 3409354
66768 3409354 3372516 3337475 3302913 3267796 3232017 3196205 3161078 3126825 3092923 3058630 3023654
66757 3023654 2988143 2952058 2915109 2877646 2841056 2806614 2774173 2742647 2711623 2681535 2652146
66746 2652146 2622107 2590858 2560205 2532654 2508189 2483714 2456087 2424989 2392427 2360167 2328498
66735 2328498 2297195 2266565 2237096 2208694 2180917 2153904 2128544 2105475 2084091 2062761 2040092
66724 2040092 2015978 1991464 1967688 1945023 1923192 1901844 1880680 1859108 1836375 1812517 1788857
66713 1788857 1766902 1746688 1726739 1705877 1684603 1664254 1645238 1626702 1607793 1588592 1569695
66702 1569695 1551403 1533582 1515930 1498117 1479997 1462015 1445061 1429553 1414841 1399957 1384758
66691 1384758 1369790 1355020 1339443 1322432 1305090 1289597 1277080 1266537 1256047 1244638 1232551
66680 1232551 1219966 1206351 1191475 1176507 1163154 1151703 1140702 1128885 1116631 1104907 1093479
66669 1093479 1081338 1068720 1057357 1048205 1039983 1030832 1020690 1010929 1002076 993249 983968 975172 967723
66656 967723 960766 952627 942971 933202 924839 918208 912631 907070 900500 892484 883781 875790 868930 862041
66642 862041 853857 844586 835537 827566 820563 814131 807902 801277 793744 785775 778649 772985 768067 763058
66628 763058 758277 754469 751090 746164 738083 727171 715350 704592 695774 688667 682709 677685 673649
66615 673649 670265 666612 661903 656231 650292 644506 638800 633164 628007 623763 620421 617538 614509 610820
66601 610820 606308 601228 595819 589866 583127 576301 571023 568457 568036 567869 566324 563077 558931 554898 551355
66586 551355 547826 543607 538631 533467 528432 523164 517456 512072 508062 505369 502797 499430 495556 491952
66572 491952 488847 486054 483752 482454 482096 481527 479277 474934 469666 465253 462477 460542 458214 455351 452907
66557 452907 451420 450071 447653 444099 440487 437625 435319 433179 431404 430188 428851 426462 423295 420753
66543 420753 419514 418472 416148 412527 408682 404973 400806 396186 392262 389696 387479 384286 380394 377229
66529 377229 375341 373922 372351 371100 370623 370112 368050 363869 358750 354832 353508 354160 354654 353579 351840
66514 351840 351337 352191 352424 350749 348420 347428 347806 347933 346876 345016 342656 339554 336111 333581 332445 331585
66498 331585 329770 327141 324500 321926 319118 316554 315121 314661 313877 311924 309362 307188 305476 303364 300196
66483 300196 296403 293294 291975 292335 293134 293252 292693 292150 291819 291129 289544 287158 284471 282039 280374 279687
66467 279687 279541 279107 277929 276187 274202 272086 269920 267808 265708 263764 262804 263663 265615 266312 264026
66452 264026 259587 255517 253628 253951 255367 256430 255965 253983 252012 251618 252450 252541 250695 247891 246048 246058
66436 246058 247255 248182 247511 244745 240565 236326 233060 231180 230857 231963 233603 234618 234916 235500 236773
66421 236773 237620 236874 234973 233278 232235 231147 229514 227595 225590 223123 219817 215923 212176 209384 208277
66406 208277 209366 212612 217131 221235 223109 222061 219277 216741 215179 213770 212180 211743 213615 216569
66392 216569 218034 217035 214674 211877 208314 203930 199975 197549 196166 194837 193808 194116 195819 197613 198146
66377 198146 196970 194394 191160 188327 186741 186339 186288 185959 185459 185150 185032 184847 184617 184754 185513 186455 186690
66360 186690 185754 184045 182254 180620 179102 178097 178284 179606 180872 180780 179193 177315 176746 178249 181029
66345 181029 183201 183448 182323 181454 181462 181301 179843 177319 174654 172098 169347 166624 164747 163986 163479 162031
66329 162031 159283 156096 153929 153635 154704 155877 156718 158187 161201 165005 167658 168155 167447 167096 167352 166963
66313 166963 164799 161264 157852 155523 154060 153185 153563 155863 159233 161850 163040 163685 164136 163147 159852
66298 159852 155730 153167 152607 152503 151876 151432 151969 152971 153405 153027 152296 151555 150836 150174 149675 149462 149647 150184
66280 150184 150728 150974 151042 151177 151244 151051 150993 151580 152344 152083 150439 148482 147376 147141 147094 146832 146262 145244 143812
66261 143812 142404 141380 140564 139634 138611 137636 136667 135813 135573 136256 137405 138234 138323 137599 136110 134432 133748
66244 133748 134607 135788 135371 133115 130964 130868 132660 134495 134915 134078 133202 133326 134527 136025 136890 136741 135882
66227 135882 134939 134543 135203 137127 139929 142634 144158 143793 141404 137516 133387 130647 130345 132179 134782
66212 134782 136767 137422 136604 134523 131878 129811 129129 129517 129922 129856 129972 131152 133323 135468 136600 136380
66196 136380 134982 132894 130922 129947 130269 131274 131924 131574 130302 128525 126456 123964 120958 117805 115220
66181 115220 113687 113126 113140 113442 113974 114857 116319 118396 120511 121714 121655 121008 120554 120150 119140 117518 115990
66164 115990 115008 114412 114146 114529 115521 116324 116185 115248 114256 113737 113885 114919 117045 119955 122685 124171 124081
66147 124081 123119 122358 122080 121463 119708 117215 115215 114425 114674 115681 117386 119452 121215 122416 123210 123262
66131 123262 121822 119293 117815 119265 123135 127196 129912 131299 131738 131141 129549 127621 125984 124537 122840
66116 122840 120999 119812 119950 121027 121636 120515 117837 115170 114142 115336 118314 122061 125199 126579 126307
66101 126307 125699 125664 125632 124749 123471 122918 122979 122347 120519 118622 117870 118126 118389 117946 116521 114038 110971 108618
66083 108618 108420 110928 115437 120209 123101 122754 119734 116105 113555 112282 111840 112153 112974 113095 111331 108200
66067 108200 105638 104863 105282 105815 106522 108344 111557 115106 117481 117940 116851 115133 113591 112730 112889 114115
66051 114115 115855 117192 117817 118569 120609 124074 127872 130773 132265 132426 131658 130890 131323 133203 135020 134716
66035 134716 131894 128332 126145 125825 126302 126425 125851 124726 123212 121533 120183 119663 120062 121038 122290 123936
66019 123936 126301 129280 132041 133530 133320 131867 130026 128538 127972 128767 130986 134181 137659 140790 142998
66004 142998 143850 143514 142886 142868 143578 144528 145339 145831 145588 144031 141060 137300 133701 131167 130380 131421 133388
65987 133388 134808 134567 132385 128738 124838 122373 122447 124679 127922 131604 135466 138252 138225 135511 132666
65972 132666 131981 133100 134155 134388 134553 135344 136620 137924 138820 138963 138691 139186 141100 143308 144076 143298 142541
65955 142541 142955 144249 145747 147291 148821 150120 151430 153444 156300 159295 161881 164111 165741 165912 164410
65940 164410 162475 161477 161310 160990 160531 161238 164049 168382 172897 176984 181055 185490 189771 192965 194861
65925 194861 196087 197001 197163 196442 195983 197039 199029 199830 198216 195132 192324 190597 189807 189635 189629 189142 188003
65908 188003 186969 186908 187793 188924 189814 190298 190140 189194 187849 186711 185822 184662 183088 181855 181932 183249 184365
65891 184365 183696 181231 178713 177813 178456 179514 180680 182675 185614 188330 189752 190061 189921 189354 188017 186049
65875 186049 184002 182393 181671 181927 182176 180836 177838 175543 176418 180045 183346 183650 180885 177060 174414
65860 174414 173824 174223 173611 171257 168672 167830 168910 170652 172411 174621 177375 179908 181730 183143 184239
65845 184239 184348 183005 180786 178767 177607 177401 177865 178493 179087 180207 182465 185427 188025 190063 192235
65830 192235 194451 195360 194206 192160 190951 190921 191286 191646 192235 193028 193534 193435 192809 191850 190874 190322 190235 189951
65812 189951 188861 187217 185827 185343 186230 188720 191946 193754 192629 189675 187524 187293 187779 187807 187882 188776
65796 188776 189680 189030 186686 184072 182206 180483 177684 173571 169185 165864 164145 163469 162896 162176 161924 162567
65780 162567 163486 163794 163745 164544 166568 168551 169052 168074 166513 164600 161981 159252 158040 158968 160408 160154
65764 160154 157858 155007 152895 151557 150624 150126 150153 150456 150798 151163 151274 150481 148602 146452 144985 144281 143932
65747 143932 144057 145143 146951 148418 148899 148952 149492 150520 151094 150464 148896 147319 146347 145870 145647 146029 147643
65730 147643 150304 152772 154011 154371 154928 155843 156082 154920 153160 152456 153736 156496 159307 160723 160075 157809
65714 157809 155027 152411 149762 146798 144144 143056 144179 146970 150356 153552 156070 157361 157070 155734
65700 155734 154857 155787 158337 160681 160955 159014 156432 154763 154101 153430 151925 149567 146858 144535 143446
65685 143446 143932 145153 145546 144230 141527 137973 133587 128718 124946 123901 125223 126723 126990 126904 127872 129306
65669 129306 129015 125947 121464 117573 114767 112193 109245 106134 103253 100890 99547 99564 100176 99830 98045
65654 98045 96328 96449 98256 100097 101134 102112 103682 105132 105466 104953 104644 104765 104528 103510 102395 102108
65638 102108 102794 103875 104671 104715 103895 102695 102008 102286 102969 103066 102340 101658 102136 104047 106587 108566 109248 108730
65620 108730 107749 107190 107505 108315 108675 108030 107007 106896 108178 109883 110700 110394 109699 109128 108573 108003 107742 107784
65602 107784 107429 106158 104527 103662 103928 104462 104067 102320 99817 97507 95873 94707 93617 92631 92103 92163
65586 92163 92609 93420 94899 96982 98690 98760 96931 94358 92623 92342 92819 93024 92785 92784 93444 94297 94790 95202
65568 95202 96081 97063 97193 96490 96116 96694 97392 97270 96590 96007 95418 94815 95515 98895 104041 108224 109999 110433
65550 110433 110835 110824 109659 108182 107819 108252 107640 105180 102183 100378 100214 101235 103074 105345 107239 108105
65534 108105 108242 108485 109225 110328 111751 113540 115343 116660 117709 119292 121544 123428 123816 122484 119629
65519 119629 115172 109366 103655 99821 98275 97970 98053 98659 99895 101038 101355 100997 100383 99176 96607 92579
65503 92579 87947 83979 82004 83034 86782 91206 93976 94620 94581 95043 95556 95177 94108 93343 93070 92422 90955
65486 90955 89550 89219 89432 88474 85624 82270 80421 80570 81771 83401 85806 89015 91903 93376 93722 93983
65470 93983 94386 94203 92970 91110 89389 88397 88452 89308 89872 88977 86736 84663 84161 85220 86799 88126 89287
65453 89287 90627 91836 91880 90116 87476 85986 86715 88624 89955 90407 91229 93495 97075 101144 104755 106934
65437 106934 107266 106711 106871 107941 108155 105918 101974 98687 97421 97239 96358 94513 93584 95577 99972 103660
65421 103660 104108 102107 100552 100851 101783 101911 101650 102316 104277 106889 109444 111320 111900 111245 110396 110324 111043
65404 111043 112339 114581 117851 120899 122188 121775 121171 121462 122489 123688 124749 125396 125494 125521 126193 127424
65388 127424 128332 128312 127479 126025 123901 121235 118423 115640 112943 110836 109944 109937 109728 109084 109093 110380 111687
65371 111687 111203 108917 106679 105898 106029 105614 104218 102793 102319 102597 102614 101885 101064 101188 102524 104290 105316
65354 105316 104923 103469 102149 101970 102715 103282 103214 103282 104133 105046 104864 103646 102372 101305 99882 98326 98084
65337 98084 100045 103196 105696 106773 107149 108156 110843 115262 120080 123356 124308 124018 124099 125165 126975 129319
65321 129319 132019 134610 136870 139371 142672 146209 148802 150204 151376 153212 155700 158341 160684 162356
65307 162356 163350 164646 167950 174417 183902 195560 208625 222318 235581 247529 257882 266536 272918
65294 272918 276307 276717 274972 271849 267493 261798 254988 247485 239382 230501 221123 212359 205402 200442
65280 200442 196559 192686 188360 183453 177785 171511 165579 161112 158289 156320 154515 152824 151258 149457
65266 149457 147231 144944 142901 140806 138368 136010 134260 132722 130579 128038 126320 125916 125707 124338 121796
65251 121796 119010 116477 114094 111999 110641 110002 109509 108842 108175 107520 106569 105441 104923 105354 105794 104925 102502
65234 102502 99386 96397 93799 91838 90898 90752 90151 87827 83983 80437 79089 80251 82643 84940 87012
65219 87012 89431 92112 94105 94763 94486 93963 93254 92123 90873 90125 89901 89568 88677 87355 85820 84056
65203 84056 82126 80442 79582 80032 81927 84704 87193 88666 89666 91087 92461 92220 90045 87998 88447
65188 88447 91378 94507 95704 94529 91695 88126 84843 83070 83707 86665 90843 94810 97652 99354 100440
65173 100440 101200 101369 100577 98879 96750 94780 93430 92706 91940 90439 88705 88398 90430 93484 95245 94930
65157 94930 93753 92970 92529 91952 91615 92229 93489 94030 92855 90429 88250 87521 88236 89469 90421 91034 91462
65140 91462 91286 89818 87174 84484 82786 82168 82233 82856 84001 85132 85434 84585 82882 80732 78464 76591
65124 76591 75697 75847 76394 76608 76362 76137 76509 77709 79456 81065 81856 81683 81125 81064 81983 83555 84882 85138
65106 85138 84106 82238 80331 79166 79253 80675 83133 86200 89493 92456 94220 94095 92266 89646 86978
65091 86978 84520 82635 81959 82497 83079 82463 80852 79740 80324 82568 85687 88898 91583 93291 93860 93355
65075 93355 91945 90166 89119 89807 92175 95251 98220 100806 102647 103156 102355 101233 100784 101083 101507 101418
65059 101418 100439 98770 97569 98299 101102 104392 106542 107316 107119 105793 103184 100246 98290 97385 96696 96221
65043 96221 96913 98968 101254 102752 103561 104143 104555 104916 105751 107363 109548 112363 116358 121577 127107 132215
65027 132215 137213 142682 148597 154818 161563 168516 174289 177911 180349 183397 187401 191275 194578 198218
65013 198218 202882 207844 211793 214085 214788 214130 212420 210096 207500 204745 201810 198546 194634 189950 184770
64998 184770 179190 172633 164708 156469 149805 145390 142075 138507 134469 130302 126033 121810 118365 116078
64984 116078 114072 111189 107646 104803 103394 102848 102494 102559 103527 105013 105871 105314 103603 101617 100015 98918
64968 98918 98266 98128 98457 98751 98338 97087 95501 94024 92602 91095 89852 89505 90293 91783 93199 93981
64952 93981 94235 94714 96065 97982 99405 99675 99143 98477 97863 97225 96732 96516 96285 95834 95650 96238 97036 96885
64934 96885 95708 94795 95080 95868 95829 94711 93295 92005 90404 88198 86055 85007 85282 86154 86948 87871 89648
64917 89648 92389 95125 96689 96952 96797 96819 96431 94696 91882 89662 89435 90772 91981 92179 92249 93413 95296
64900 95296 96177 95156 93228 91763 90651 88871 86552 85221 85706 86836 87011 86384 86497 88007 89761 90257
64884 90257 89187 87249 85151 83402 82543 82867 83958 85021 85752 86582 88084 90373 92906 94591 94282 91736
64868 91736 88118 85039 82987 81196 79225 77962 78467 80258 81582 81381 80291 79492 79255 79119 79103 79905
64852 79905 81771 83742 84528 83923 82940 82630 83281 84841 87349 90336 92299 91847 89553 87795 88266 90146
64836 90146 91241 90480 88745 87597 87825 89099 90414 90819 90153 89156 88668 88881 89594 90772 92301 93576
64820 93576 94071 94062 94051 93731 92530 90996 90338 90476 89923 88133 86533 86342 86800 86911 87703 90748 94989 97219
64802 97219 95945 92926 90330 88244 86019 84397 84508 85611 85771 84692 84164 85300 86792 86763 85363 84427
64786 84427 85014 86385 87419 88021 88732 89580 90012 89846 89793 90835 93261 96406 99229 101133 102246 103019 103710
64769 103710 104414 105434 107142 109219 110445 109829 107866 106097 105341 104891 103691 101694 99577 97571 95305
64754 95305 92706 90403 89071 88843 89515 90930 92905 95101 97221 99116 100469 100622 99059 96024 92397
64739 92397 89069 86682 85870 87229 90606 94561 97032 96946 95170 93723 93976 95691 97629 98661 98255 96516
64723 96516 94379 93427 94632 97082 98710 98642 98217 99108 101054 102307 102037 101268 101376 102629 104568 106906
64707 106906 109351 111186 111874 111777 111533 110945 109294 106664 104094 102284 100985 99965 99814 101229 103952 106927
64691 106927 109160 110049 109337 107369 105138 103501 102451 101555 100827 100601 100792 100951 101011 101307 101859 102333 102749
64674 102749 103456 104125 103598 101303 98329 96384 95947 96128 96208 96619 98148 100582 102639 103181 102244 100739 99311
64657 99311 97881 96370 95375 95559 96526 96972 96175 94852 94220 94567 95055 94641 92909 90294 87928 87039 88005
64640 88005 89899 91286 91523 91123 90892 90972 90837 90104 89262 89460 91345 94073 95865 95849 95026 95073 96426 98126
64622 98126 99369 100405 101700 103019 103942 104760 106034 107522 108479 109113 110726 113837 116967 118151 117232 115713
64606 115713 114630 113702 112624 111878 111720 111455 110593 109894 110251 111130 111313 110848 111063 112695 115121 117490 119489
64589 119489 120762 120705 119436 118082 117480 117232 116512 115189 113606 111883 110108 108814 108555 109171 109842 109724
64573 109724 108429 106335 104680 104673 106114 107406 107363 106394 105450 104580 103425 102611 103528 106674 110900 114329 115615
64556 115615 114499 111712 108360 105151 102381 100674 100932 102961 104887 104970 103656 102888 103617 105032 106135
64541 106135 106933 107776 108454 108435 107479 105709 103558 101817 101216 101669 102330 102620 102841 103649 105276 107413 109586
64524 109586 111493 113121 114540 115570 115960 116186 117514 120516 123787 125034 123506 120681 118463 117482 117282
64509 117282 117296 117125 116474 115486 114901 115363 116627 117682 117688 116752 115852 115909 116828 117602 117521 116954 116591 116423 116167 116423
64489 116423 118382 122205 126482 129631 131204 131470 130362 127557 123417 119249 116350 114880 113831 112191
64475 112191 110022 108104 106725 105535 104688 105101 106952 108868 109610 109910 111344 113870 115915 116665 116783 116839
64459 116839 116549 115896 115496 115364 114674 113306 112328 112240 112102 111292 110809 111657 113100 113895 114329 115435 116730 116467
64441 116467 114129 111309 109948 110741 113334 116947 120408 122505 122943 122609 122583 123149 123889 124365 124491 124364 123893
64424 123893 122738 120875 119136 118607 119296 120018 119931 119520 119614 120164 120743 121512 122650 123337 122563 120882 120071 120850
64406 120850 121986 122053 121177 120460 120381 120460 120208 119789 119772 120488 121621 122383 122259 121595 121262 121806 123202 125316 128070
64387 128070 130958 132959 133404 132777 132256 132404 132575 131762 129959 128468 128700 130706 133083 134393 134506 134452 135112
64370 135112 136199 136556 135381 133112 131028 129989 129798 129897 130235 131055 132221 133467 135073 137472 140284 142614
64354 142614 144436 146673 149685 152670 154977 157049 159439 161844 163794 165408 166668 166904 166025 165416 166390
64339 166390 168323 169609 169952 170334 171019 171089 170054 168596 167495 166867 166597 166422 165453 162786 158930 155606
64323 155606 153758 152664 151237 149212 146818 144446 143020 143439 144946 145269 143328 140991 141127 144559 149694
64308 149694 154311 156752 156215 153349 150211 148375 147228 145194 142316 140125 138976 137349 134469 132166
64294 132166 132813 136263 140117 142580 143817 144641 145251 145673 146276 147087 147294 146236 144493 143212 142704 142502
64278 142502 142583 143430 144869 145936 146370 147219 149224 151436 152396 152128 151855 152111 152340 152324 152741 153903 155048
64261 155048 155538 156013 157571 160276 163193 165621 167636 169602 171804 174570 178143 182149 185532 187314 187351
64246 187351 186300 184939 183678 182653 182028 181948 182221 182374 182177 181838 181454 180637 179210 178053 178425 180291 182078
64229 182078 182536 182262 182763 184534 186901 189538 193024 197621 202456 206572 210207 214188 218381 221633 223241
64214 223241 223681 223781 224024 224956 227265 230648 233257 233229 230587 226950 223752 221530 220477 220416 220214 218425
64198 218425 214869 210721 206935 203629 201127 200162 200448 200371 199086 197917 198559 200659 202290 202208 200708 198816
64182 198816 197674 198121 199787 201021 200771 200122 200966 203760 207698 212437 218063 223750 228189 231380 234567
64167 234567 238369 242394 246635 251552 256588 260394 263014 266119 270387 274290 276387 277303 278310 279357
64153 279357 279856 280258 281284 282320 282059 280436 278781 278384 279834 283233 288012 292947 297445 302402 308655
64138 308655 314979 318977 319893 319383 319416 320574 322558 325101 327797 329967 331407 332698 334160 334954 333846
64123 333846 330644 326433 322561 319701 317615 315339 311693 306237 299951 294572 290924 288185 285168 281992
64109 281992 279797 278927 278406 277609 277425 278881 281310 283143 284242 286122 289803 294654 299655 304569 309429
64094 309429 314017 318620 324239 331086 337711 342792 347300 353754 363477 375486 387908 399580 410357
64081 410357 420860 432238 445445 460224 475039 488209 499035 507902 515555 522342 527889 531394
64069 531394 532149 529732 523853 514519 502498 489260 476123 463639 451824 440555 429697 419315
64057 419315 409976 402340 396250 390786 385446 380671 376916 373944 371467 369712 368731 367889 366890 366788 368977
64042 368977 373421 378640 383362 387519 391796 396899 403173 410414 417945 425187 432057 438746 445581 453345
64028 453345 463010 474508 486274 496653 505390 513199 520418 526799 532077 535940 537901 538096 537872 538649
64014 538649 540368 541678 541235 538157 531941 523189 513995 506331 500128 493975 487338 480864 474851 469076
64000 469076 464141 461254 460249 459366 457668 456389 457121 459887 463835 468736 474674 481113 487444 494074 502059
63985 502059 511893 523248 535548 548217 560749 573147 585976 599535 613432 627404 641903 657204
63973 657204 672568 687241 701787 717284 733335 748009 759970 769757 778634 787130 795273 803462
63961 803462 812196 821277 830235 839605 850858 864672 879883 894732 908730 922587 936646 950459
63949 950459 964025 978291 993627 1008465 1020489 1029079 1035976 1043589 1053199 1064699 1077456 1091196
63937 1091196 1106275 1123110 1141394 1160414 1180445 1203163 1229878 1259867 1291329 1323706 1358096
63926 1358096 1395734 1437221 1483130 1533967 1589146 1647168 1707461 1771320 1840628 1916437 1999062
63915 1999062 2088560 2184507 2286179 2393652 2507973 2629644 2757804 2891788 3032704 3182463
63905 3182463 3341806 3510574 3689644 3881226 4086999 4307126 4541823 4793448 5066505
63896 5066505 5365752 5694648 6055644 6451900 6888631 7372640 7910509 8507526 9168401
63887 9168401 9898279 10702148 11582869 12539754 13568573 14662246 15811531 17005717 18233118
63878 18233118 19480583 20731951 21966599 23159468 24282858 25309119 26213154 26974211
63870 26974211 27576887 28011162 28271200 28353331 28254672 27973630 27512033 26877410 26084245 25153572
63860 25153572 24110720 22981937 21791792 20562590 19314855 18067206 16835799 15634593
63852 15634593 14476232 13372167 12331972 11362957 10469903 9653952 8911730 8237031 7624344
63843 7624344 7070382 6572131 6124685 5721915 5358441 5029946 4732224 4461227 4213992
63834 4213992 3988493 3782384 3592640 3416523 3252240 3098384 2953378 2815914 2685654
63825 2685654 2562935 2447570 2338017 2231926 2127813 2026256 1929258 1838390 1753773 1674784
63815 1674784 1601136 1532802 1469340 1409883 1353787 1300948 1251513 1205580 1163086 1123698 1086784
63804 1086784 1051620 1017651 984633 952851 923235 896770 873465 852199 831942 812850 795751
63793 795751 780840 767387 754692 742779 732025 722500 713932 706112 699040 692705 686908 681345 675709
63780 675709 669550 662267 653575 643935 634019 623667 611982 598785 585240 572361 559574 545735
63768 545735 531160 517343 504769 492195 478433 463662 448613 433628 419217 406610 396731 389015
63756 389015 381823 373816 364719 355433 347667 342653 339671 336556 332092 327112 322743 318715 314354 310248
63742 310248 307556 306058 304114 300484 295417 290203 286409 285093 285720 286055 284084 280011 275654 272213 269528
63727 269528 267199 265160 263119 260568 257701 255466 254344 253743 252900 251771 250748 250033 249662 249759 250308 250774
63711 250774 250260 248311 245682 244085 244678 246788 248579 248919 247968 246155 243856 242138 242193 243289 242976 240549
63695 240549 238668 239798 242391 242937 240976 239537 240815 243877 246923 249436 251466 252774 253671 255223 257792
63680 257792 260637 263474 266969 271184 275032 277983 280850 284296 288143 292878 300008 309837 320618 331158
63666 331158 342611 356145 370492 383729 396218 409467 422775 433273 439287 441906 443164 444047
63654 444047 444278 442841 438719 432177 425073 418935 413206 406502 399020 392161 386222 380224 373870 367918
63640 367918 362430 356379 349397 342412 336103 330102 324225 319135 315193 311912 309162 307699 307768 308365 308724
63625 308724 309476 311569 315045 319683 325698 332717 339176 344166 349089 355928 364381 372399 379475 387694
63611 387694 399014 412842 427030 440254 452482 463674 473091 479926 483996 485584 484909 481965 476761
63598 476761 469557 460837 451146 440992 430789 420778 411057 401799 393321 385787 378957 372601 367052
63585 367052 362929 360255 358343 356779 356041 356777 358735 360968 363018 365558 369756 376215 384685 394657 405864
63570 405864 417871 429410 438988 446679 454731 465568 479461 494974 511341 529131 548584 568803
63558 568803 589334 611409 636636 665220 696300 729272 763753 798852 833608 867830 901466
63547 901466 933355 961547 984693 1002315 1014108 1020156 1021709 1020633 1018038 1014389 1010648 1007889 1005561
63534 1005561 1001550 994565 985382 975164 963640 949676 932848 913735 893405 873253 854624 837753
63522 837753 821518 804769 787468 770244 753719 738850 726896 718044 710780 703710 697414 693396
63510 693396 691670 690686 689453 688526 688834 690638 693872 698663 705263 714079 725777 740653 757933 776517
63496 776517 796522 819336 845929 875808 907747 940825 974552 1008660 1043079 1077543 1110943
63485 1110943 1141555 1168133 1190347 1208099 1221156 1229896 1235975 1241682 1248526 1256388 1263818 1269269 1272303
63472 1272303 1273529 1273265 1270709 1264742 1254760 1240036 1219108 1191159 1157660 1121235 1083011 1042467
63460 1042467 999853 957104 916051 877190 840691 807078 776249 747260 719982 695694 675244
63449 675244 657875 642631 629336 617153 603965 588968 574519 563488 555828 549722 545047 543116
63437 543116 543478 543675 542516 541230 540782 540312 539256 539121 541758 547070 553628 560599 568008 575904 584448
63422 584448 594345 606277 620149 635281 650750 665073 676390 683844 688305 691058 692261 691399 688666
63409 688666 684845 679996 673201 663882 652887 642054 632846 625311 618277 610788 603435 597905 595007 593636
63395 593636 591997 589383 586254 583092 579978 577178 575443 575493 577525 581226 585977 590965 595497 599506 603773
63380 603773 609562 617920 629205 643177 659384 677283 696086 715082 734493 755674 779960 807551
63368 807551 837935 870838 905983 942383 979242 1017537 1059273 1104760 1151873 1198606 1244894
63357 1244894 1290835 1334266 1371773 1401656 1424510 1441181 1451653 1456050 1455349 1450569 1442254 1431324
63345 1431324 1419628 1408838 1399014 1388673 1376058 1360092 1340437 1317120 1290243 1260093 1227503
63334 1227503 1193837 1160253 1127175 1094887 1064330 1036531 1011324 987647 965424 946251 931449
63323 931449 920112 910066 900538 892946 889057 889302 893069 899660 908335 918105 928489 940362 955319
63310 955319 974078 995960 1019818 1044870 1070707 1097375 1125780 1157190 1191759 1228128 1265109
63299 1265109 1303129 1343113 1384325 1424327 1460924 1493111 1520088 1540614 1553933 1560661 1562159 1559463
63287 1559463 1553153 1543840 1532434 1520291 1509074 1499647 1490772 1479745 1464834 1446436 1425454 1401570
63275 1401570 1374045 1343416 1311240 1278583 1245795 1213375 1181782 1150594 1119163 1088259 1059851
63264 1059851 1034904 1012369 990710 969559 949511 931302 915691 903199 893286 884469 875935 868329
63252 868329 862308 857235 852369 848512 847040 847539 847908 846899 845161 843424 840990 836935 831860 827417 824477
63237 824477 822505 820418 817446 813520 809448 806367 804312 801703 797106 791239 786214 782860 779942 776253
63223 776253 772342 769493 767943 766994 766317 766168 766473 766534 765790 764461 763380 763305 764224 765163 765105 764333 764425 766540
63205 766540 770270 774529 778746 782387 784209 783417 781279 780168 780884 782191 783187 784769 788141 793056 798439
63190 798439 803961 809978 816403 822543 827990 833082 838590 845266 853422 862625 872115 881819 892537 904767
63176 904767 917920 931258 945182 960839 978621 997741 1017273 1037019 1057242 1078072 1099397
63165 1099397 1121131 1143306 1165922 1188783 1211543 1233897 1255540 1275929 1294617 1312295 1331040
63154 1331040 1352456 1375468 1396947 1414886 1430210 1444985 1459677 1472825 1482760 1488682 1490332 1487400
63142 1487400 1479456 1466288 1448536 1427996 1406726 1385598 1364395 1343508 1324476 1308187 1293662
63131 1293662 1279777 1267555 1259457 1256738 1258616 1263752 1271356 1280896 1291946 1304581 1319161 1335627
63119 1335627 1353718 1373764 1396420 1421615 1448515 1476352 1504388 1531370 1556290 1579707 1603040
63108 1603040 1626419 1648574 1669105 1689290 1709910 1729597 1746259 1758982 1767464 1770709 1767789 1759324
63096 1759324 1746792 1730594 1709984 1684722 1655556 1623103 1587518 1549568 1510993 1473258 1436756
63085 1436756 1401767 1369496 1341319 1317246 1295868 1275882 1257228 1240506 1225632 1211543 1197550
63074 1197550 1184701 1175106 1169497 1165929 1161684 1156350 1152188 1151266 1153086 1155624 1157875 1160348 1163399 1166384
63060 1166384 1168748 1170912 1173476 1176287 1178935 1181502 1183919 1185069 1183682 1180130 1176377 1174027 1173221 1173471
63046 1173471 1174465 1175634 1176004 1175393 1175065 1176364 1179094 1181985 1184351 1186539 1189071 1192154 1195869 1200080 1204237
63031 1204237 1207906 1211367 1215029 1218519 1221230 1223720 1227590 1233787 1241761 1250624 1260438 1271929 1285417
63018 1285417 1300405 1315931 1331202 1346211 1361876 1379062 1397270 1414756 1430306 1444576 1459294
63007 1459294 1475307 1491754 1507193 1521382 1535786 1552206 1570998 1591044 1611464 1632736 1655710
62996 1655710 1680146 1704974 1729649 1754551 1780341 1807769 1837885 1871435 1908003 1946510 1986564
62985 1986564 2028522 2072248 2116724 2160933 2204348 2246674 2288231 2330580 2375438 2422580 2470075
62974 2470075 2516974 2564381 2613221 2662470 2710672 2757931 2804852 2850413 2892517 2930252 2963951
62963 2963951 2993000 3014932 3027012 3027874 3017596 2997212 2968487 2933408 2893439 2849594 2803175 2755907
62951 2755907 2709237 2663929 2620355 2578862 2540031 2504991 2475278 2451952 2435130 2424792 2421358
62940 2421358 2424640 2432781 2443694 2457412 2475659 2498901 2525293 2553089 2582659 2615132 2650089 2685927
62928 2685927 2721881 2758367 2795573 2832886 2869749 2905925 2940521 2971554 2996963 3015662 3027350
62917 3027350 3031808 3028610 3017028 2995853 2963754 2920244 2866042 2802370 2730512 2652500 2571390 2489692
62905 2489692 2407653 2324229 2239879 2157358 2079348 2006283 1937225 1871901 1810704 1753202 1698084
62894 1698084 1644874 1594770 1549328 1508858 1472318 1438264 1405606 1373926 1343410 1314373 1286898
62883 1286898 1261211 1238064 1217910 1199677 1181288 1161788 1142221 1124031 1107449 1092002 1077607
62872 1077607 1064112 1050477 1035829 1021177 1008665 998786 989578 979216 968458 959559 953319 948319
62860 948319 942942 937088 931602 926906 922881 919522 916760 913757 909294 903218 896898 891852 888354 885790
62846 885790 883801 882391 881198 879515 877102 874453 872173 870574 869793 869786 870165 870536 871042 872048 873342 874289
62830 874289 874822 875502 876389 876515 874822 871199 866438 861798 858757 858362 860239 862617 863701 862840 860511 857873
62814 857873 856341 856581 857617 857776 856819 856140 856474 856662 855409 853030 850478 847783 844700 841827 839547 836691
62798 836691 832008 826485 822351 819982 817667 814539 811755 810269 809259 807798 806631 807040 808911 811105
62784 811105 813143 815415 818005 820295 821687 822117 821891 821483 821450 822272 824269 827604 831976 836346 839604 841790
62768 841790 844068 847262 851014 854751 858733 863505 868809 873768 877862 881088 883392 884654 885153 885456 885778
62753 885778 885947 886048 886654 888236 890568 892790 894002 893930 893322 893661 896130 900767 906707 913179 919946 926801
62737 926801 933111 938405 943366 949880 959724 973211 989231 1006386 1023736 1040619 1056629 1072359
62725 1072359 1089628 1110124 1133849 1159556 1186658 1215927 1248257 1283744 1322473 1365360 1413357
62714 1413357 1466252 1523117 1583699 1648483 1717344 1789032 1862370 1937281 2013994 2091417 2166841
62703 2166841 2237198 2300284 2354810 2399785 2434193 2457003 2467187 2463889 2447109 2418295 2379834
62692 2379834 2333634 2280416 2220545 2155132 2085823 2013753 1939384 1863492 1787867 1714785 1645910
62681 1645910 1581673 1521284 1463366 1407133 1353326 1303795 1259888 1221336 1186775 1155006 1125521
62670 1125521 1098141 1072719 1049327 1028431 1010516 995438 982237 969879 958306 948519 941363 936476
62658 936476 932857 930250 929304 930324 932660 935725 939975 946254 954639 964640 976326 990393 1007076
62645 1007076 1025731 1045825 1067760 1092273 1119416 1148764 1180547 1216086 1256894 1303482 1355010
62634 1355010 1409927 1467067 1526516 1589616 1657854 1731461 1809191 1889531 1971795 2055578 2139305
62623 2139305 2219888 2294070 2359727 2415701 2460841 2493757 2513454 2519752 2512878 2492834 2459336 2412459
62611 2412459 2353434 2284774 2209426 2129635 2046646 1961450 1875439 1790199 1706983 1626727 1550279
62600 1550279 1478114 1409880 1344808 1282886 1225349 1173613 1127553 1085061 1043688 1002981 964906
62589 964906 931485 902181 874397 846671 820409 797719 778371 760054 741275 722751 705741
62578 705741 690239 675499 661541 649263 639254 631086 623679 616002 607586 598767 590450 583423 577856
62565 577856 573496 570035 567093 564221 561426 559582 559730 561737 564046 565092 564815 564474 565192 567162 570256
62550 570256 574672 580496 587065 593502 599748 606418 613658 620942 628211 636468 646768 659201 673318
62537 673318 688974 706168 724529 743704 763885 785251 807269 829491 852984 880024 912048
62526 912048 948329 986786 1025623 1064164 1102547 1140826 1178175 1213029 1244031 1270429 1291268
62515 1291268 1304985 1310634 1309009 1301576 1288680 1269971 1246349 1220005 1192262 1162635 1130546 1096913
62503 1096913 1063410 1030957 999531 968830 938701 909544 882581 858952 838212 818612 799289
62492 799289 781182 765199 750602 736110 721702 708167 695556 683231 671019 659210 647748
62481 647748 636548 626413 618446 612570 607613 602935 598960 595975 593559 591738 591764 594886 600685 607341
62467 607341 613487 619380 626232 634788 644692 654996 665080 675175 686251 699454 715303 733172
62455 733172 751772 770522 790293 812463 837590 865545 896545 931037 968670 1008449 1050097
62444 1050097 1094111 1140155 1186611 1232375 1277850 1323241 1366833 1406083 1439518 1466468 1485768
62433 1485768 1496167 1497523 1490287 1474424 1450344 1420378 1387468 1352428 1314261 1273221 1231625 1191251
62421 1191251 1151934 1113631 1077934 1045983 1016212 985982 954870 924908 898046 874843 855441
62410 855441 840257 829169 820914 813825 806871 799941 793550 788330 784390 781088 777649 773888 770099 766632
62396 766632 764111 763713 766383 771713 778272 785138 792431 800235 807932 815180 822854 831996 842024 850920
62382 850920 857358 861891 865564 867990 867607 863702 857392 850441 843632 836594 828603 819022 807344 793598
62368 793598 778729 763977 749749 735600 721443 708235 697190 688792 682948 679566 678305 677936 676772
62355 676772 674050 670604 668058 667656 669972 675139 682800 691905 701189 710142 719320 729513 740753 752294
62341 752294 763398 773842 783756 793388 803186 813779 825466 837717 849343 859267 867168 873525 879111
62328 879111 884382 889215 893161 895857 897128 897000 896023 895515 896877 900354 904955 910036 916493 925729 937744
62313 937744 951278 966026 983715 1006251 1033408 1063281 1094929 1129535 1168716 1212632 1260542
62302 1260542 1312552 1369564 1431483 1496732 1564223 1634815 1709793 1788405 1868041 1946479 2022480
62291 2022480 2094030 2157663 2210472 2251798 2281915 2300039 2305037 2297729 2280968 2257221 2227036 2189954
62279 2189954 2145866 2095258 2039224 1979820 1919534 1859722 1800171 1740868 1683514 1630313 1581584
62268 1581584 1535644 1491194 1448976 1410685 1376863 1346441 1318107 1291536 1267166 1245225 1225299
62257 1225299 1206780 1189476 1173824 1160681 1150870 1144631 1141192 1138966 1136397 1132798 1128490 1124312 1120997
62244 1120997 1118782 1117432 1116604 1116099 1115561 1114029 1110339 1104292 1097111 1090436 1085099 1081072 1078126 1076001 1074273
62229 1074273 1072715 1071712 1071728 1072392 1072804 1072943 1074222 1078308 1085555 1094709 1103994 1112550 1121162 1131468 1144186
62214 1144186 1158396 1173198 1189773 1210652 1236611 1265306 1293744 1321448 1350380 1382419 1418143
62203 1418143 1457941 1502787 1553095 1607595 1664483 1723658 1787060 1856520 1931730 2010460 2090121
62192 2090121 2168453 2243049 2311176 2370513 2419760 2458429 2486432 2503982 2511276 2508067 2494160 2470630
62180 2470630 2439715 2402843 2359546 2309304 2253872 2196586 2139687 2083761 2029678 1979398 1934214
62169 1934214 1893489 1855926 1821140 1789291 1760228 1734043 1711670 1693765 1679465 1667250 1656701
62158 1656701 1648364 1642243 1637632 1634345 1633015 1633914 1636364 1639523 1643099 1647198 1652147 1658526 1666574 1675505
62144 1675505 1684323 1693520 1704963 1719680 1736716 1754769 1773913 1794737 1816628 1838359 1860137 1883753
62132 1883753 1910493 1940078 1972000 2006786 2045140 2086545 2129675 2173807 2218811 2263793 2306852
62121 2306852 2346670 2383660 2418825 2451775 2480743 2504722 2524997 2544251 2564569 2586813 2611612
62110 2611612 2640196 2673874 2713000 2756866 2804546 2855650 2910234 2968137 3028445 3089468 3149155
62099 3149155 3205610 3257398 3303525 3343330 3376523 3403336 3424592 3441481 3455047 3465655 3473048
62088 3473048 3477148 3478771 3479166 3478774 3477043 3474022 3471753 3473252 3479939 3490666 3503447 3517504 3533309
62075 3533309 3551316 3571419 3593358 3616843 3641252 3665853 3690545 3716023 3743043 3771826 3802231
62064 3802231 3834198 3867861 3903398 3940884 3980154 4020894 4062967 4106444 4151059 4195989 4240784
62053 4240784 4286327 4334104 4384385 4435705 4486248 4535222 4582836 4629774 4677117 4726126 4777569
62042 4777569 4831500 4887710 4945740 5004332 5061972 5118670 5176393 5236975 5300340 5365644 5433362
62031 5433362 5504971 5580981 5660493 5742525 5826666 5912656 6000653 6091980 6188240 6289227 6392565
62020 6392565 6495483 6595900 6691838 6781602 6865380 6945408 7023527 7099478 7172304 7242023 7308464
62009 7308464 7369537 7422586 7467235 7505394 7538637 7567236 7591781 7613831 7633987 7650584 7661268
61998 7661268 7665117 7662477 7653641 7638726 7618320 7593126 7563206 7528390 7489104 7445863 7398212 7345407
61986 7345407 7288342 7229711 7171781 7114792 7058095 7002059 6948115 6897409 6850194 6806354 6765782
61975 6765782 6728309 6693790 6662241 6633451 6606590 6580660 6555215 6530227 6505410 6480223 6454325
61964 6454325 6427380 6398553 6367007 6332923 6297183 6260030 6221008 6180438 6139730 6099530 6058518
61953 6058518 6015046 5969309 5922932 5876886 5830976 5785117 5739795 5695067 5650157 5604673 5559671
61942 5559671 5516979 5477703 5441583 5407491 5374147 5340512 5305766 5269149 5229914 5187480 5141389
61931 5141389 5091044 5035837 4975851 4912224 4846453 4779489 4711809 4644139 4577604 4513120 4450926
61920 4450926 4390763 4332395 4276009 4222167 4171158 4122368 4074686 4027666 3981861 3937833 3895448
61909 3895448 3854445 3814961 3776923 3739607 3702548 3666412 3632186 3599957 3569253 3540087 3512690
61898 3512690 3486592 3461054 3436269 3413181 3392283 3373593 3357667 3345463 3337049 3331498 3328319 3328214
61886 3328214 3332360 3341718 3356948 3377955 3403402 3431608 3462032 3495098 3530841 3569038 3610458 3656153
61874 3656153 3705205 3755065 3804933 3857112 3913804 3974122 4035710 4097993 4161928 4227433 4293284
61863 4293284 4359571 4428497 4502359 4582119 4668443 4762931 4867559 4983612 5111999 5254377
61853 5254377 5413366 5591544 5790389 6010238 6251395 6515426 6805334 7124263 7474126
61844 7474126 7855671 8269805 8718494 9204246 9728874 10292856 10895477 11534444 12203897
61835 12203897 12891718 13578408 14238198 14840817 15353024 15741666 15979384 16050376 15952441 15695357
61825 15695357 15298346 14787453 14191717 13538887 12853166 12155114 11461423 10784435 10133186
61816 10133186 9515205 8936149 8397805 7898572 7436834 7012630 6625568 6273079 5951987
61807 5951987 5660323 5396248 5156761 4939337 4743836 4570904 4419058 4285100 4166912
61798 4166912 4064104 3976129 3901686 3840162 3791895 3756326 3731083 3713533 3702467 3697718 3698765
61787 3698765 3704285 3712727 3722928 3734137 3745243 3753956 3757335 3753729 3743987 3730300 3714285 3696763
61775 3696763 3678873 3662441 3649202 3640117 3635258 3633959 3635457 3639948 3648603 3661912 3678291 3694891
61763 3694891 3709351 3720331 3726877 3728169 3723740 3713555 3698307 3679920 3660964 3643023 3626421 3611964
61751 3611964 3601655 3596705 3596181 3599189 3607468 3624151 3650573 3685898 3729280 3780667 3839874 3906766
61739 3906766 3982265 4067554 4162351 4265680 4378210 4502002 4637883 4784906 4942627 5112039
61729 5112039 5293940 5488453 5696934 5922479 6167461 6432159 6716981 7024662 7359066
61720 7359066 7723135 8119572 8552853 9029053 9553796 10131224 10764860 11458933 12218945
61711 12218945 13050927 13959382 14945494 16007450 17141683 18341540 19593146 20872376
61703 20872376 22144984 23367289 24485839 25439487 26167239 26619503 26767229 26606068 26155585
61694 26155585 25453911 24549410 23493067 22334181 21118020 19883150 18659244 17467447
61686 17467447 16322712 15235734 14213611 13260112 12376047 11559686 10807613 10115982 9481222
61677 9481222 8899786 8367935 7882034 7438570 7033721 6663577 6325079 6016014 5733807
61668 5733807 5475176 5237514 5019739 4820991 4639010 4470527 4312930 4164981 4026240
61659 4026240 3896205 3773681 3656790 3544072 3435755 3333152 3236607 3145051 3057971 2976570
61649 2976570 2901904 2832829 2767023 2703565 2643444 2587850 2536929 2489906 2445532 2402533 2360413
61638 2360413 2319726 2281105 2244371 2209050 2175138 2142578 2110585 2078429 2046439 2015203 1984271
61627 1984271 1952763 1921010 1890278 1860878 1831779 1802385 1773529 1746210 1720156 1694265 1667940
61616 1667940 1641553 1616065 1592592 1571987 1554312 1538767 1524393 1510836 1498423 1487650 1478637
61605 1478637 1470929 1463712 1456247 1448133 1439377 1430535 1422811 1417463 1414712 1413438 1412246 1410754 1409767 1410521
61591 1410521 1413835 1419615 1426858 1434411 1441828 1449101 1455647 1460393 1463140 1464877 1466129 1465856 1462955 1458249
61577 1458249 1453803 1450544 1447623 1444027 1439812 1435653 1432131 1429735 1428769 1428878 1429241 1429578 1430459 1432280 1434344
61562 1434344 1435245 1433868 1429807 1423310 1415288 1407084 1399513 1391941 1382732 1370958 1357543 1344432 1332777
61549 1332777 1322284 1312309 1302868 1294258 1286447 1279594 1274605 1271946 1270043 1266216 1259647 1252298 1246308 1241521
61535 1241521 1236498 1231116 1226852 1224736 1224184 1224016 1223820 1223992 1224900 1226346 1227871 1229547 1232356 1237443 1244832
61520 1244832 1253454 1262623 1273055 1286025 1301905 1319837 1338422 1356560 1374284 1393242 1415635 1442080
61508 1442080 1471076 1501212 1533097 1568134 1606014 1644821 1683466 1722633 1762946 1803385 1842215
61497 1842215 1878797 1913755 1947792 1981110 2013913 2046614 2079085 2109992 2137587 2161410 2182766
61486 2182766 2203161 2222602 2239945 2254573 2266879 2277073 2284333 2287461 2285913 2280163 2271644 2262338
61474 2262338 2253582 2245083 2235813 2226011 2217414 2211503 2208615 2209015 2213497 2222373 2235106 2251710 2273274
61461 2273274 2300223 2331335 2365626 2404185 2448913 2500428 2558570 2624054 2698012 2780509 2871100
61450 2871100 2970551 3080555 3202087 3335437 3481598 3642135 3817711 4008062 4213320 4433938
61440 4433938 4669206 4917077 5175502 5442529 5714526 5984928 6244733 6483564 6690953
61431 6690953 6858432 6981186 7057342 7086267 7068923 7009543 6915080 6792290 6646276 6482019
61421 6482019 6305965 6125328 5946346 5773242 5607986 5450919 5302479 5164475 5039099
61412 5039099 4927183 4828619 4744106 4674840 4620463 4578998 4549237 4531640 4526439 4532343 4547893
61401 4547893 4572742 4606782 4649126 4698720 4754964 4816897 4882697 4950712 5020179 5090303 5159606
61390 5159606 5226988 5292745 5357863 5422887 5487834 5552358 5615577 5676708 5736323 5795886 5855463
61379 5855463 5913034 5966770 6016715 6063304 6105545 6142097 6173279 6200544 6224427 6244203 6259053
61368 6259053 6268379 6271313 6267166 6256228 6239231 6216366 6187964 6155890 6122901 6090306 6057132 6021939
61356 6021939 5984950 5948286 5914741 5886335 5863436 5844904 5829300 5815963 5804755 5795110 5785988 5776801
61344 5776801 5767733 5758813 5749013 5736767 5721512 5704465 5687555 5671683 5656614 5642837 5632726 5629051
61332 5629051 5632946 5644625 5665972 5700821 5752077 5819747 5902625 6001047 6117097 6252841 6409361
61321 6409361 6587076 6785897 7004870 7242288 7496125 7764126 8043385 8329786 8617317
61312 8617317 8897709 9161337 9398945 9602472 9764646 9879188 9942473 9954805 9919635 9841724
61302 9841724 9725994 9577063 9398886 9194877 8968693 8724665 8467506 8202088 7933534
61293 7933534 7666567 7404328 7148515 6900982 6664388 6440956 6231534 6036375 5855769
61284 5855769 5689040 5533946 5388288 5251893 5126361 5013290 4913369 4826575 4752385 4690019
61274 4690019 4639018 4599402 4571088 4553804 4547663 4552741 4567606 4589445 4616482 4649180 4688088 4731607
61262 4731607 4777102 4823271 4869949 4916214 4960358 5001524 5040054 5076186 5109450 5139270 5165264
61251 5165264 5187051 5204601 5218734 5230595 5240792 5249364 5256012 5259850 5259723 5255417 5247565 5235544 5216672
61238 5216672 5188831 5152849 5110822 5063251 5009790 4951933 4892485 4832543 4771346 4709267 4648662
61227 4648662 4591164 4536231 4483296 4433632 4388907 4349178 4313551 4281960 4255232 4233730 4216614
61216 4216614 4202159 4188578 4175015 4161892 4149960 4139237 4129398 4120681 4113361 4106704 4099780 4093107
61204 4093107 4088240 4085964 4086393 4090607 4100272 4115492 4134989 4158765 4188505 4224548 4264575 4306685
61192 4306685 4352172 4403868 4463158 4530123 4605383 4689900 4783401 4884209 4989962 5097211 5200881
61181 5200881 5295474 5376559 5440111 5481050 5493987 5475564 5425412 5345245 5238163 5108770 4962813
61170 4962813 4806208 4644398 4482066 4322654 4168246 4020325 3880362 3749260 3626833
61161 3626833 3512455 3405839 3306657 3214107 3127735 3048323 2977128 2914468 2859642 2811808 2770170
61150 2770170 2733769 2701990 2675106 2653477 2636351 2622252 2610541 2602041 2598023 2598937 2604008 2611852
61138 2611852 2621754 2634404 2650757 2670010 2689725 2708457 2727133 2746903 2766800 2784836 2800432
61127 2800432 2813921 2824189 2828860 2827038 2820154 2809639 2795316 2776752 2754791 2730559 2703720 2672846
61115 2672846 2637313 2598088 2556736 2514126 2470064 2423957 2375784 2326392 2276741 2227074 2177164
61104 2177164 2127177 2077796 2029531 1982365 1936187 1891204 1847858 1806557 1767408 1730177 1694889
61093 1694889 1662627 1635024 1612342 1592732 1574193 1556758 1541731 1529270 1517948 1506419 1494207
61082 1494207 1480927 1466128 1450157 1433919 1417505 1400386 1383333 1368677 1357838 1349711 1342453 1335918
61070 1335918 1331308 1329295 1329675 1332396 1337706 1345368 1354614 1364883 1376008 1387817 1400102 1412889 1426236
61057 1426236 1439916 1453622 1467228 1480501 1492982 1504658 1516328 1528664 1541169 1552670 1562655
61046 1562655 1571541 1579931 1588311 1597200 1606667 1615502 1621587 1623397 1620851 1614731 1605862 1595030 1583087
61033 1583087 1570697 1558191 1545841 1533976 1522574 1511037 1498758 1485822 1472911 1460485 1448264
61022 1448264 1435548 1421854 1407160 1391786 1376317 1361550 1348108 1335913 1324335 1313139 1302964
61011 1302964 1294638 1288317 1283599 1280064 1277139 1273913 1269989 1266385 1264527 1264213 1263521 1261149 1258005 1256044
60997 1256044 1256286 1258507 1262110 1266510 1271175 1276059 1281765 1288762 1296663 1304771 1313051 1322195 1333002 1345986
60983 1345986 1361109 1377540 1394188 1410928 1428747 1448198 1468386 1488208 1507914 1528566 1550401
60972 1550401 1572812 1595753 1620115 1646681 1675557 1706819 1741018 1778736 1820009 1864344 1911156
60961 1911156 1960151 2011304 2064325 2118317 2172515 2227312 2283739 2341897 2401053 2461476 2524824
60950 2524824 2592021 2662182 2734700 2811069 2893436 2982679 3079347 3185006 3300474 3423769 3552427
60939 3552427 3687719 3834449 3996522 4174494 4367300 4574236 4794965 5029343 5277648
60930 5277648 5539879 5815206 6103753 6408552 6734020 7083187 7458516 7864457 8306181
60921 8306181 8785959 9303833 9861920 10465559 11121319 11838284 12631604 13520810 14524739
60912 14524739 15662641 16959290 18441936 20132181 22050432 24230662 26719874 29560645
60904 29560645 32791660 36468429 40632405 45180665 49738197 53718784 56607974 58249456
60896 58249456 58881503 58925050 58764506 58694357 58943212 59597766 60448315 60973494 60582283 58945431
60886 58945431 56138215 52512973 48470673 44325419 40290689 36501494 33022576 29862031
60878 29862031 27003294 24430087 22127230 20074779 18252405 16644506 15234553 13998212
60870 13998212 12907321 11938178 11072602 10294660 9591350 8954740 8379410 7858585 7385152
60861 7385152 6954491 6563231 6206584 5879616 5579703 5304855 5050644 4811672 4585388
60852 4585388 4371961 4170884 3980229 3799068 3628422 3469565 3322768 3187622 3063260
60843 3063260 2948416 2842233 2744617 2655069 2572034 2494297 2422002 2355321 2293323 2235373 2182323
60832 2182323 2134854 2091832 2051836 2015041 1981798 1950517 1919026 1887194 1856305 1826529 1796932
60821 1796932 1767298 1737954 1708291 1677447 1646025 1615133 1584105 1551251 1516694 1482358 1449136
60810 1449136 1416112 1382954 1351170 1322471 1297252 1275112 1255568 1237909 1221504 1206589 1193906
60799 1193906 1183642 1175688 1170613 1169021 1170104 1172215 1174885 1178982 1185006 1192666 1202066 1213710 1227117
60786 1227117 1240932 1254819 1269971 1287323 1306286 1325452 1343503 1359351 1372644 1384389 1396015
60775 1396015 1407517 1417494 1425027 1430327 1433456 1433842 1431567 1427923 1424097 1420090 1415438 1410232 1405047 1400289
60761 1400289 1395677 1389814 1380583 1366919 1350203 1333067 1316913 1301319 1285384 1268454 1249924 1229918
60749 1229918 1210314 1193661 1180770 1170458 1161751 1154971 1150354 1146971 1143739 1140609 1138206 1136947 1136796
60736 1136796 1137389 1138347 1139989 1143463 1149506 1157522 1166669 1177161 1189417 1202754 1216525 1231717 1249422
60723 1249422 1268267 1285773 1302168 1320282 1341200 1362486 1381553 1398566 1414930 1430964 1446413
60712 1446413 1461515 1476037 1488666 1498763 1507627 1516735 1525729 1533352 1539295 1543932 1547120 1548537 1548619
60699 1548619 1548074 1546906 1544679 1541227 1536569 1530844 1524853 1519778 1515772 1511612 1506248 1499883 1493179 1486554
60685 1486554 1480661 1476268 1472890 1468701 1462450 1454336 1444522 1432476 1418710 1405483 1394301 1383987 1372719
60672 1372719 1360843 1350078 1340863 1332258 1324029 1317212 1312706 1310439 1309831 1310188 1310862 1311675 1312881 1314275
60658 1314275 1315008 1314744 1314044 1312957 1310407 1306025 1301462 1298628 1297432 1296556 1295676 1295388 1295406 1294363 1291448 1287129
60642 1287129 1282234 1277071 1271325 1264191 1254827 1243183 1230058 1216041 1200984 1184872 1168279 1151434
60630 1151434 1133824 1115447 1097487 1080995 1065811 1051493 1038264 1026232 1014905 1004380 995666
60619 995666 988765 981840 973662 965483 958956 953685 948752 945230 944671 945937 946211 944950 944505 946731 951100
60604 951100 956351 962002 967812 973519 979623 987044 995697 1004657 1013735 1023494 1033767 1043824 1054152
60591 1054152 1066325 1080695 1095789 1110483 1125220 1140471 1155497 1169475 1182653 1195577 1208116
60580 1208116 1219939 1231090 1241563 1251278 1261072 1272702 1287063 1303151 1319489 1335986 1353635 1372880
60568 1372880 1392950 1412518 1430463 1446085 1459013 1469068 1476369 1481542 1485282 1487290 1486176 1481089
60556 1481089 1472929 1463066 1451459 1437355 1421587 1406653 1394131 1383214 1372292 1361009 1350316 1341317
60544 1341317 1334620 1330266 1327944 1327650 1330146 1336047 1344349 1352594 1358810 1362781 1365307 1366914 1367434 1366285
60530 1366285 1362998 1357960 1352665 1348677 1346382 1345270 1345280 1347113 1351365 1358098 1367139 1377938 1389202 1399574
60516 1399574 1408749 1417146 1424642 1430614 1435216 1439434 1443709 1447542 1450684 1453601 1456374 1458197 1458586 1458157
60502 1458157 1457521 1456115 1452935 1448040 1442636 1437831 1433642 1429135 1423394 1416558 1409989 1405238 1402829 1402138
60488 1402138 1402287 1402957 1404656 1408486 1415329 1424957 1436488 1449998 1466936 1488379 1513775 1542286 1574568
60475 1574568 1612166 1655914 1706042 1763112 1827420 1898022 1973714 2054233 2138680 2223103 2301541
60464 2301541 2369476 2424850 2466207 2492184 2503164 2501558 2490084 2471509 2450125 2431213 2418040
60453 2418040 2410865 2409367 2414114 2424929 2439797 2456669 2474922 2493985 2512023 2527279 2539777 2550986
60441 2550986 2562930 2578184 2599064 2625788 2656881 2692406 2735353 2788718 2852731 2926238 3009340
60430 3009340 3103244 3208877 3327135 3459047 3603796 3757701 3917164 4082033 4254634 4436681
60420 4436681 4629323 4835679 5061272 5312237 5594602 5914457 6276344 6681387 7128468
60411 7128468 7615936 8138229 8679078 9209852 9696119 10105547 10410648 10588644 10623622 10510812
60401 10510812 10258895 9888491 9428041 8908440 8357852 7798729 7247834 6717404 6215548
60392 6215548 5746494 5311994 4913106 4550594 4223915 3930482 3666293 3427396 3211158
60383 3211158 3016567 2843358 2690521 2555461 2434660 2325227 2225756 2135741 2054433 1980602
60373 1980602 1913308 1852360 1797665 1748357 1702944 1660085 1618900 1578836 1539913 1503029 1469369
60362 1469369 1439280 1412097 1386901 1362886 1339132 1315062 1291394 1269921 1251951 1237514 1226228
60351 1226228 1217977 1212199 1207287 1201570 1194659 1187456 1181138 1176375 1172931 1169696 1165661 1161234 1158004 1156817
60337 1156817 1156837 1156941 1157249 1158612 1161331 1165170 1169924 1175028 1179203 1181668 1183471 1186488 1191078 1195693 1198866
60322 1198866 1200755 1202456 1204377 1205639 1204796 1201124 1195475 1189688 1184746 1179709 1172975 1164418 1155636 1148116
60308 1148116 1141926 1136450 1131722 1128442 1126929 1126630 1126669 1126558 1126292 1126166 1126856 1129323 1133883 1139204 1142967 1144180
60292 1144180 1144484 1146589 1151645 1158669 1166121 1173138 1179428 1185070 1190700 1197018 1203791 1210017 1215357 1220742
60278 1220742 1227275 1235173 1243999 1253200 1262079 1269945 1276723 1282883 1288564 1293376 1297429 1301863 1307994 1316380
60264 1316380 1326948 1339343 1352812 1366251 1378662 1389210 1396973 1401454 1403272 1403425 1401903 1398106 1392532
60251 1392532 1386470 1379724 1370430 1358083 1345180 1334598 1326540 1319448 1312933 1308089 1305430 1304045 1302904
60238 1302904 1301904 1301443 1301546 1301512 1300285 1297515 1294334 1292398 1291977 1291893 1291502 1291500 1292340 1293369 1294472 1297092 1302329
60221 1302329 1309146 1315869 1322518 1330220 1339190 1348926 1359762 1372526 1387002 1402214 1417882 1434143
60209 1434143 1450082 1464174 1476295 1488056 1501142 1516372 1534196 1554751 1577215 1600356 1624054
60198 1624054 1649611 1678405 1710799 1746261 1783933 1823503 1866188 1914320 1969029 2028900 2091915
60187 2091915 2158202 2229747 2308085 2393677 2487020 2588528 2697337 2811804 2931433 3057106
60177 3057106 3189282 3327152 3469468 3614881 3761407 3906749 4049170 4186794 4316265
60168 4316265 4433940 4538730 4632185 4715167 4785860 4841651 4881670 4906832 4918651 4918810 4908904
60157 4908904 4889911 4862952 4831136 4799440 4771706 4748503 4728745 4712588 4701910 4698947 4705784 4724704
60145 4724704 4757600 4804885 4865780 4939792 5027150 5127697 5240059 5362257 5492635 5629509
60135 5629509 5770045 5910162 6046030 6175354 6296525 6406625 6501182 6576427 6631239 6666433
60125 6666433 6682759 6680304 6659388 6621117 6567143 6499530 6420881 6334350 6243721 6153580 6068672
60114 6068672 5992530 5927281 5875157 5839193 5821569 5822252 5840367 5876024 5929388 5998754 6081173 6174450
60102 6174450 6276778 6384636 6492853 6596829 6693286 6779143 6851788 6910747 6957149 6990932
60092 6990932 7010357 7014991 7007448 6991153 6967950 6939202 6908003 6878872 6855948 6842550 6841667 6855599
60080 6855599 6885472 6932205 6997723 7084394 7193632 7325992 7482597 7665633 7877164 8117854
60070 8117854 8387055 8683959 9008540 9361208 9741375 10146415 10572107 11013732 11466347
60061 11466347 11924289 12381004 12829208 13260820 13667188 14040190 14373044 14659692 14894209
60052 14894209 15071947 15190757 15249793 15247464 15182171 15055152 14871171 14636203 14355968 14037198
60042 14037198 13688838 13321045 12943789 12566712 12198902 11847689 11518138 11214283 10940225
60033 10940225 10699695 10495350 10328879 10200968 10110732 10056160 10035741 10048893 10094134 10167345
60023 10167345 10262189 10371675 10489189 10608839 10725235 10832395 10923064 10990307 11030092 11041406
60013 11041406 11023989 10977508 10903192 10804276 10683698 10542679 10382562 10206600 10018515 9820523
60003 9820523 9614477 9404124 9194275 8987931 8785782 8588686 8399425 8221713 8058482
59994 8058482 7911466 7781807 7670610 7579188 7508919 7460650 7434172 7428560 7443136 7478076 7533967
59983 7533967 7610400 7704720 7812393 7929039 8051823 8178309 8304323 8423860 8531093 8621734
59973 8621734 8692694 8741531 8766436 8765883 8738311 8683131 8602124 8498844 8376590 8238065 8086958
59962 8086958 7928301 7766786 7605917 7449103 7300097 7161752 7035541 6922903 6825861 6745847
59952 6745847 6683302 6639027 6614507 6610196 6624974 6658160 6710627 6782992 6874323 6983880 7112578
59941 7112578 7261057 7427258 7607309 7797652 7994691 8193162 8386614 8569181 8735828
59932 8735828 8881727 9002943 9097305 9163483 9199846 9205388 9181030 9128726 9050090 8947367 8824969
59921 8824969 8688472 8542578 8391518 8240532 8094909 7957788 7830710 7716126 7617433 7536634
59911 7536634 7473958 7430147 7407219 7406327 7426369 7465510 7522810 7597714 7689111 7795651 7915941
59900 7915941 8047419 8185736 8326112 8465088 8600590 8730857 8853902 8967771 9070837
59891 9070837 9161949 9240651 9307460 9364087 9413400 9458644 9502391 9546630 9594332 9650425 9720459
59880 9720459 9808604 9917667 10050791 10212103 10405488 10633338 10896688 11196013 11531567 11902919
59870 11902919 12307885 12741599 13196710 13664349 14134112 14592752 15023947 15410652 15737830
59861 15737830 15992799 16164312 16243310 16225468 16112847 15913265 15638346 15301423 14915993 14495465
59851 14495465 14053839 13605303 13162039 12732699 12323533 11940205 11587512 11268099 10983076
59842 10983076 10733975 10523019 10351373 10218290 10122298 10062560 10038858 10050801 10097123 10175174
59832 10175174 10280945 10409728 10556435 10714922 10877611 11036368 11183180 11309295 11404585
59823 11404585 11459245 11466350 11422320 11325754 11177246 10980149 10740048 10463181 10156140 9826868
59813 9826868 9484480 9137404 8792110 8453467 8125364 7810763 7511905 7230720 6968649
59804 6968649 6726282 6503757 6301276 6118555 5954264 5807002 5676529 5562931 5464822 5379493
59794 5379493 5304610 5238443 5178562 5121915 5066630 5012670 4960504 4910359 4862887 4819140 4779377
59783 4779377 4743173 4711119 4684766 4663912 4645300 4625293 4602795 4578201 4550388 4516619 4475328
59772 4475328 4427516 4375185 4319667 4262045 4204153 4148270 4096159 4048959 4007624 3972790 3944316
59761 3944316 3921724 3905322 3896319 3895473 3902160 3915492 3936138 3966237 4007400 4059398 4120809 4190063
59749 4190063 4265340 4344273 4424683 4505700 4587833 4671944 4758100 4844866 4929345 5008126 5078456
59738 5078456 5138460 5186743 5222829 5248159 5265788 5278744 5289364 5300270 5314654 5334883 5361797
59727 5361797 5396047 5439301 5493601 5560773 5643291 5744511 5866737 6009941 6173522 6358652
59717 6358652 6567926 6803718 7068110 7363352 7690633 8048744 8434881 8845348 9272919
59708 9272919 9703183 10114604 10482013 10779963 10985929 11085607 11077976 10975046 10796522 10564606
59698 10564606 10301052 10024414 9747693 9479477 9227448 8999106 8798820 8626569 8481040
59689 8481040 8362802 8273475 8213167 8180259 8173324 8192315 8238003 8310642 8409031 8531019 8675423
59678 8675423 8843127 9035551 9252549 9493126 9757951 10049555 10369895 10719337 11098516
59669 11098516 11509771 11956022 12439275 12960801 13521806 14123362 14766383 15451892 16180377
59660 16180377 16950532 17759234 18602339 19474001 20365084 21263689 22157818 23036845 23891166
59651 23891166 24713098 25499476 26252396 26977068 27680289 28370990 29059474 29753906 30458042
59642 30458042 31172715 31897467 32628701 33357041 34067975 34744770 35370179 35926965 36399417
59633 36399417 36775577 37048459 37216465 37283912 37260830 37161196 37001168 36798680 36573070 36343453
59623 36343453 36127173 35939916 35796275 35709192 35689241 35745137 35884545 36113977 36438430 36861622
59613 36861622 37385775 38010377 38731365 39541450 40429819 41380125 42368798 43365374 44333604
59604 44333604 45231847 46014201 46634007 47048520 47222978 47134506 46776243 46159374 45310804
59595 45310804 44267959 43073824 41773176 40409343 39021667 37644013 36303493 35019038
59587 35019038 33801295 32654348 31576844 30560482 29587921 28634137 27672196 26680562 25648386
59578 25648386 24576879 23477003 22365482 21261222 20182404 19143610 18153914 17217739
59570 17217739 16337581 15515407 14751851 14045591 13394241 12795086 12244757 11739367 11275666
59561 11275666 10851271 10463392 10108456 9783670 9487942 9220498 8979389 8761953 8565621
59552 8565621 8387310 8222980 8069138 7924390 7788641 7661009 7539076 7419591 7299271
59543 7299271 7175600 7047734 6916349 6782210 6645516 6507056 6368951 6233381 6101278
59534 6101278 5973163 5850463 5734873 5626971 5526660 5434722 5352751 5281453 5219932 5166943
59524 5166943 5122380 5087285 5062558 5047767 5041308 5041802 5048936 5062500 5081240 5103733 5130163 5161831
59512 5161831 5198770 5239183 5281568 5326082 5373357 5423372 5476180 5532513 5593026 5658315 5730398
59501 5730398 5812597 5906812 6012107 6127009 6251863 6387868 6535434 6695347 6870285 7063111
59491 7063111 7274213 7502282 7747166 8010092 8291389 8589797 8904018 9233302 9576139
59482 9576139 9929530 10289669 10652324 11012442 11364529 11703867 12027032 12331533 12615519
59473 12615519 12877334 13114316 13322294 13497355 13638227 13746544 13825423 13878811 13911777 13930033
59463 13930033 13938761 13942602 13946843 13958003 13983108 14028488 14098590 14195139 14317360 14463005 14628203
59452 14628203 14805566 14983318 15147521 15285219 15385310 15437709 15433335 15365108 15228424 15021231
59442 15021231 14744740 14404065 14007680 13566475 13093309 12601974 12104976 11612190 11131830
59433 11131830 10671423 10236719 9830509 9453915 9108385 8795317 8514432 8263974 8042341
59424 8042341 7848524 7681452 7540236 7424766 7334932 7269425 7226421 7205325 7206891 7231782 7279733
59413 7279733 7349758 7440463 7550789 7681311 7834177 8010668 8209277 8426903 8660807 8908145
59403 8908145 9164541 9424663 9683346 9934422 10169129 10377670 10552187 10686743 10775187 10811439
59393 10811439 10792170 10717547 10589503 10411238 10188617 9929954 9643558 9336443 9015283 8686620
59383 8686620 8355538 8025665 7701089 7386919 7087338 6804230 6538096 6288995 6056160
59374 6056160 5838200 5634691 5446793 5275826 5122017 4984911 4863781 4757048 4662249 4577274
59364 4577274 4501232 4434085 4376359 4329260 4293786 4269150 4252942 4243325 4240385 4245127 4257847 4277666
59352 4277666 4302986 4332588 4367231 4409805 4462193 4521460 4580478 4633078 4678106 4718795 4759929
59341 4759929 4806123 4860965 4926153 5001817 5088410 5187508 5299806 5422637 5550372 5677818
59331 5677818 5803892 5932813 6071660 6225944 6397386 6586118 6794071 7024773 7280536
59322 7280536 7562010 7870814 8210481 8583948 8991840 9434431 9913802 10432678 10992141
59313 10992141 11591736 12230551 12906088 13611904 14337531 15070706 15798907 16509366 17189637
59304 17189637 17829586 18423025 18967370 19462094 19907493 20304370 20654056 20958165 21218084
59295 21218084 21434657 21608137 21737846 21821544 21855402 21835000 21756327 21616152 21412726 21147270
59285 21147270 20824585 20451551 20035222 19582456 19100043 18593793 18067934 17526459 16974460
59276 16974460 16416963 15857361 15299001 14748028 14212554 13698765 13209545 12746907 12313398
59267 12313398 11910394 11537362 11194349 10883497 10606371 10361095 10144043 9953588 9790240
59258 9790240 9653292 9539240 9443956 9365027 9301113 9249794 9207063 9168854 9132430 9095972 9057288
59247 9057288 9013552 8962458 8903086 8835570 8760499 8679015 8592617 8502160 8407684 8310035 8212025
59236 8212025 8116881 8025993 7939236 7857073 7781058 7712704 7653343 7604983 7569820 7548826 7542189
59225 7542189 7551119 7577550 7621708 7681594 7755565 7844180 7948983 8070746 8209537 8365226 8536944
59214 8536944 8722801 8920692 9128720 9344483 9564913 9787034 10007646 10221768 10422690
59205 10422690 10604304 10762374 10893082 10991964 11055660 11083853 11078098 11039009 10965430 10856022
59195 10856022 10711119 10533669 10329270 10105129 9868326 9624831 9379658 9136958 8899615
59186 8899615 8669533 8448724 8239532 8043708 7862085 7695349 7544210 7408634 7288149
59177 7288149 7183505 7096997 7030461 6983794 6956072 6947312 6958452 6990442 7044314 7121728 7224713
59166 7224713 7354918 7513325 7700480 7916986 8164230 8444393 8758864 9106601 9484656
59157 9484656 9889803 10318217 10763414 11215678 11663352 12093119 12489054 12833816 13112465
59148 13112465 13314732 13433682 13464121 13403473 13253024 13017462 12704511 12326008 11897896 11437336
59138 11437336 10959569 10477315 10001270 9539715 9098355 8681505 8292820 7934235 7605383
59129 7605383 7304992 7032132 6785616 6563569 6364616 6188328 6033438 5896975 5776479
59120 5776479 5671945 5584116 5511861 5452854 5405972 5371250 5347977 5334642 5330494 5335509 5348793
59109 5348793 5368596 5394272 5427034 5468305 5518011 5574663 5636475 5702303 5772052 5846176 5924361
59098 5924361 6004747 6084815 6162710 6237353 6307641 6372113 6429047 6476394 6511952 6534203 6542863
59087 6542863 6538425 6521682 6493924 6456852 6411734 6359216 6300493 6238041 6174521 6111608 6050596
59076 6050596 5993514 5942644 5899102 5862751 5833554 5812485 5801023 5800015 5809190 5827964 5856917 5898094
59064 5898094 5953170 6021543 6101006 6190143 6289173 6398749 6519413 6652328 6798968 6959408
59054 6959408 7132123 7316021 7511499 7718920 7937257 8164988 8401146 8644575 8893008
59045 8893008 9143691 9394109 9641595 9883117 10115834 10336600 10540389 10720521 10871154
59036 10871154 10988199 11067157 11101805 11086357 11017688 10894532 10716388 10485220 10207230 9891146
59026 9891146 9545352 9177906 8797920 8414322 8033062 7657053 7288894 6932445 6591752
59017 6591752 6269672 5967605 5685602 5422563 5177067 4948178 4735228 4537230 4353039
59008 4353039 4181820 4022998 3876030 3740349 3614975 3498157 3388317 3285545 3191134 3105333
58998 3105333 3026495 2952681 2882935 2816860 2754408 2696541 2644532 2597981 2554849 2513801 2474911
58987 2474911 2437756 2401095 2365271 2332602 2304113 2278011 2252832 2229883 2210803 2194866 2180847
58976 2180847 2169611 2162490 2158698 2156882 2157925 2163515 2172776 2182696 2191423 2199293 2207478 2217547 2231259
58963 2231259 2248569 2266656 2282910 2297821 2312788 2326410 2335792 2340760 2343862 2346574 2348357 2349384
58951 2349384 2351377 2355253 2360159 2365234 2370558 2376208 2382231 2389577 2399292 2410742 2422139 2432483 2441362
58938 2441362 2447455 2449400 2447784 2444111 2438062 2428062 2414425 2399768 2386215 2374209 2363821 2355032
58926 2355032 2346879 2338795 2332807 2331924 2336217 2342985 2351039 2362023 2376910 2393942 2411161 2428626 2447083
58913 2447083 2466634 2487964 2512776 2541590 2572758 2604866 2638518 2674567 2712234 2750449 2789758
58902 2789758 2831405 2875401 2920664 2966403 3012516 3059345 3107717 3158436 3211245 3265269 3320982
58891 3320982 3380577 3445692 3515858 3589965 3668281 3752048 3841727 3936598 4035822 4139309 4247734
58880 4247734 4362135 4483480 4612617 4750582 4898379 5056074 5222705 5397778 5582227
58871 5582227 5777317 5983484 6201245 6432234 6678097 6939343 7216731 7512696 7829650
58862 7829650 8167901 8527437 8910872 9322153 9762941 10233109 10734607 11271681 11846702
58853 11846702 12458626 13106390 13791143 14513734 15272162 16062764 16881598 17722432 18574181
58844 18574181 19421552 20247227 21032497 21757003 22399545 22939530 23358175 23640130 23775404
58835 23775404 23760044 23595717 23290044 22857103 22315549 21685029 20984462 20232602 19447739
58826 19447739 18645956 17840851 17044974 16269622 15522485 14806901 14124119 13475431 12862135
58817 12862135 12284974 11744059 11238218 10764538 10320077 9903954 9516122 9154381 8814909
58808 8814909 8495979 8198727 7923522 7667774 7428368 7204314 6995866 6802723 6624373
58799 6624373 6460905 6312230 6177224 6054222 5941584 5837898 5743020 5658827 5587244 5527445
58789 5527445 5476817 5434663 5402694 5381698 5370335 5367899 5375622 5394094 5421889 5458132 5504219 5561433
58777 5561433 5628862 5705393 5791985 5890213 6000057 6120938 6253704 6399839 6559495 6731643
58767 6731643 6915452 7110733 7318133 7539767 7778342 8034758 8307989 8598299 8909089
58758 8909089 9244232 9605003 9991039 10403285 10844633 11318405 11827290 12373012 12956137
58749 12956137 13576738 14235439 14932597 15666122 16431254 17222139 18031008 18844896 19645528
58740 19645528 20413812 21132463 21782955 22342636 22787978 23100528 23268935 23287559 23156182
58731 23156182 22881010 22474044 21951004 21330076 20631138 19874103 19077405 18257825 17430354
58722 17430354 16607183 15797628 15009747 14251059 13527023 12839977 12190434 11578525 11003683
58713 11003683 10464300 9958662 9485267 9041802 8625208 8233425 7865722 7520766 7196031
58704 7196031 6889859 6602376 6333348 6080718 5842428 5618343 5409260 5215204 5035426
58695 5035426 4868689 4712807 4565467 4426478 4297916 4181390 4076547 3982357 3897738 3820387
58685 3820387 3747520 3678859 3616760 3562341 3513781 3469341 3429266 3393278 3359041 3325142 3292971
58674 3292971 3263372 3233801 3201326 3166353 3130843 3094786 3057169 3018788 2981131 2943615 2904519
58663 2904519 2863763 2822427 2780479 2737143 2692476 2646444 2597629 2545175 2491068 2438141 2386594
58652 2386594 2334676 2281983 2229888 2179341 2130322 2082905 2037025 1991926 1947608 1905983 1868750
58641 1868750 1834953 1802420 1770664 1740449 1711548 1683042 1655083 1628320 1602302 1576422 1551686
58630 1551686 1529587 1509980 1492008 1476256 1463804 1453862 1444611 1436051 1429876 1426718 1425434 1425019 1425506
58617 1425506 1427106 1429810 1433619 1437952 1441326 1442803 1443087 1443173 1442906 1442064 1441581 1442180 1443006 1443232 1443903 1446427
58601 1446427 1450385 1454530 1458703 1462828 1465288 1464510 1461319 1457670 1453928 1449362 1444439 1440620 1438666 1439037
58587 1439037 1442916 1450751 1460737 1470993 1482446 1497348 1515750 1535829 1557122 1580987 1608083 1637611
58575 1637611 1669155 1703494 1741539 1783642 1829573 1878136 1927656 1978062 2031551 2090044 2153318
58564 2153318 2220973 2294475 2375435 2463538 2558288 2661221 2774089 2896399 3027281 3168498
58554 3168498 3322987 3491530 3673442 3869410 4080767 4306568 4543790 4789577 5040765
58545 5040765 5291872 5535991 5766895 5978023 6160392 6304276 6402732 6451889 6449489 6396125
58535 6396125 6297141 6160544 5993432 5802249 5594889 5379439 5161389 4944336 4732193 4528094
58525 4528094 4332533 4145655 3970388 3810272 3665207 3532339 3410198 3298977 3197977
58516 3197977 3106258 3024867 2954905 2894048 2838333 2786653 2740174 2698343 2659322 2623704 2593724
58505 2593724 2568895 2546128 2524036 2503578 2484678 2465826 2446777 2427803 2406391 2378599 2343864
58494 2343864 2304829 2262499 2215618 2165060 2114674 2066987 2021703 1978954 1940182 1905089 1871495
58483 1871495 1839055 1809561 1782810 1755958 1727922 1700748 1675493 1650388 1624379 1599066 1575613
58472 1575613 1552893 1530129 1508424 1488245 1468217 1447757 1428264 1410544 1393610 1377004 1361639
58461 1361639 1347399 1332589 1316799 1301739 1288418 1276011 1264233 1254066 1245350 1236323 1226316 1216391
58449 1216391 1206901 1197234 1188309 1182202 1178720 1175416 1171583 1168994 1168228 1167964 1168844 1174191 1185152 1198225
58435 1198225 1209343 1217878 1225397 1233231 1242516 1254059 1266904 1279275 1291594 1305998 1322511 1338638
58423 1338638 1353107 1366662 1378590 1386216 1389045 1389903 1390547 1389272 1384117 1375347 1363511 1348225 1330331
58410 1330331 1312264 1294965 1277197 1258930 1242279 1227927 1213707 1197997 1181671 1165685 1149867
58399 1149867 1135116 1123611 1115581 1108859 1102540 1097975 1095413 1093224 1091418 1092245 1096044 1100097 1102940 1106191
58385 1106191 1110727 1114685 1116849 1118604 1121064 1123630 1126792 1132868 1142474 1153469 1164521 1176380 1188875
58372 1188875 1200569 1212321 1226826 1243326 1257128 1265840 1271710 1276417 1278401 1277385 1276641 1278252 1280429
58359 1280429 1281934 1284779 1289989 1294931 1297432 1298576 1299167 1297880 1295346 1295438 1299668 1304744 1308650 1314483 1324935
58344 1324935 1337486 1348770 1359512 1371399 1382960 1392429 1401089 1409905 1416265 1417830 1416492 1414987 1412709
58331 1412709 1408296 1403185 1399060 1394749 1388867 1382657 1377104 1370264 1360418 1348922 1337225 1324407 1310391
58318 1310391 1298057 1289302 1282440 1276201 1272593 1273042 1275599 1278868 1284691 1294018 1304221 1313530 1323914
58305 1323914 1336581 1349107 1360231 1372829 1388683 1405072 1420072 1436232 1455082 1473227 1488261
58294 1488261 1503573 1522527 1542843 1561648 1581228 1604361 1628364 1649326 1668203 1687324 1704784
58283 1704784 1717820 1728084 1738181 1746489 1750544 1752230 1754732 1757875 1761065 1766836 1776699 1787679 1797922
58270 1797922 1811314 1831266 1854406 1875992 1897145 1920967 1945909 1969080 1992031 2017220 2042759
58259 2042759 2066547 2091487 2120559 2150922 2178962 2206867 2238084 2270719 2301837 2333602 2368501
58248 2368501 2403142 2433682 2462639 2493187 2521725 2544072 2564394 2589614 2618927 2647007 2673681
58237 2673681 2702220 2731820 2760232 2790406 2826354 2865768 2904528 2944691 2990077 3038214 3085109
58226 3085109 3133627 3188229 3245765 3300968 3356984 3420663 3491158 3563166 3637871 3720444 3809799
58215 3809799 3901101 3995494 4097298 4204412 4311546 4420096 4534842 4653811 4771360 4888178
58205 4888178 5008245 5129426 5247410 5365297 5488832 5616173 5743256 5874883 6018952
58196 6018952 6174209 6335755 6507955 6698875 6906430 7123661 7353571 7604827 7876923
58187 7876923 8164167 8470214 8803422 9161719 9537949 9936698 10369434 10836243 11329037
58178 11329037 11849467 12406086 12996773 13612337 14255197 14936288 15656148 16408270 17198650
58169 17198650 18041777 18938981 19880917 20869424 21916066 23021684 24179851 25398271 26692990
58160 26692990 28063353 29497797 31003288 32603452 34309055 36117255 38037913 40090790
58152 40090790 42277720 44589275 47039559 49662938 52478304 55492808 58740496 62278607
58144 62278607 66146769 70374286 75030582 80223617 86049264 92596745 100008422 108476555
58136 108476555 118176937 129269518 141961909 156484521 172994762 191618484 212633861
58129 212633861 236532626 263881864 295187083 330658559 369418680 408343122 441886425
58122 441886425 463961543 470887859 463004328 443746314 417405968 387544605 356657937
58115 356657937 326375845 297605740 270696856 245733349 222749367 201743840 182662371
58108 182662371 165458577 150116034 136567375 124648835 114169701 104975469 96918530
58101 96918530 89832187 83581521 78099708 73337957 69218430 65670006 62668386 60199173
58093 60199173 58215477 56674014 55582316 54968046 54834402 55194253 56109466 57623654 59682460
58084 59682460 62215408 65283164 68978934 73052124 76685555 78806735 78719329 76459205
58076 76459205 72601065 67820548 62638294 57416946 52411449 47765789 43521684 39677529
58068 39677529 36230785 33165312 30437897 28003297 25837061 23920646 22222466 20709081
58060 20709081 19360328 18158519 17075183 16083425 15173608 14343313 13580413 12868862 12203099
58051 12203099 11583568 11004407 10457699 9944117 9467487 9023567 8605097 8213177 7852695
58042 7852695 7520289 7206592 6906250 6616246 6329357 6040294 5755170 5484832 5231655
58033 5231655 4991979 4767481 4563306 4377452 4202502 4036473 3882519 3739459 3602075
58024 3602075 3469904 3346801 3232383 3121993 3014363 2911646 2812970 2715633 2621534 2534866
58014 2534866 2454601 2376575 2301441 2232898 2169678 2107294 2046486 1991796 1942777 1894744 1847466
58003 1847466 1804777 1766011 1726198 1684994 1647324 1614650 1583344 1552307 1524379 1499132 1471734
57992 1471734 1440610 1409576 1381069 1353518 1326463 1301892 1279349 1255891 1231970 1211387 1194473
57981 1194473 1177522 1159918 1145524 1135709 1127250 1118786 1113207 1111689 1110988 1108789 1106614 1105542 1103942
57968 1103942 1101152 1098560 1095487 1088954 1079185 1070643 1065975 1063539 1062193 1063456 1067155 1069990 1070665 1072027
57954 1072027 1075997 1080651 1084430 1088965 1095368 1101481 1105082 1106444 1105971 1102870 1098087 1094973 1094873 1095093 1093065
57939 1093065 1089600 1086375 1083285 1080011 1077460 1075892 1073920 1070535 1065840 1059111 1048823 1035285 1020576
57926 1020576 1005288 988166 969278 950457 932268 913925 896574 883030 873476 865004 856232 848905
57914 848905 844079 840312 836744 834529 834187 834829 836880 842025 849391 855393 858646 861630 866235 871072 874565
57899 874565 877360 880154 882176 883237 884346 885139 883658 879659 875004 869850 861885 850474 838108 826621
57885 826621 815476 805003 797444 793146 789444 785221 783028 784818 789139 794619 802484 813093 823424
57872 823424 830840 836420 841779 845398 844957 840873 834674 826156 814846 802206 789613 776060 760478
57859 760478 744615 730892 718964 707014 695225 685434 678244 672717 668208 664633 661526 658360 655327
57846 655327 652878 651343 651688 655339 662322 670661 678242 684136 687981 690051 692289 697033 703956 710347
57832 710347 715015 719467 724604 729092 732236 735707 740745 746000 749777 752183 753485 752610 749012 744013
57818 744013 738712 732510 725169 718118 712145 705926 698485 691014 684682 678925 673561 670199 669556 669685 669107
57803 669107 669511 672913 678100 682514 686123 690851 697333 704594 711929 719058 725340 730727 736540 743658
57789 743658 751003 757263 762815 768383 773159 775949 776874 776385 773985 769559 764551 760130 755548 749940 744235
57774 744235 739537 735135 729921 724398 719516 714973 710347 706289 702736 697649 689697 680628 672814 666030
57760 666030 659015 652470 647616 643036 636104 626877 617696 609351 600462 590547 580971 572573 564588 556390
57746 556390 548531 541762 536400 532770 530914 529954 528924 528006 527910 528537 529473 531085 533817 537043 539908 542592
57730 542592 545396 547531 548419 549309 551757 555167 557707 559213 561326 565059 569910 575108 580204 584738 588792
57715 588792 593482 599451 605317 608985 609881 608491 604681 598480 591767 586873 583642 579987 575254 570863
57701 570863 567522 564018 559331 554147 549538 545693 542612 540787 540459 541110 542188 543579 545201 546952 549093
57686 549093 551830 554555 556520 558200 560863 564635 568075 570006 570957 572530 575954 581321 587699 593958
57672 593958 599882 606282 613768 622060 631050 641576 654178 667872 681388 694968 709622 725215
57660 725215 740790 756355 772711 789687 806107 821632 837144 853245 869788 887172 906622
57649 906622 928719 952755 977977 1004393 1032057 1060671 1090452 1122444 1157377 1194925 1234475
57638 1234475 1275861 1318899 1363115 1408683 1456999 1509496 1566083 1625402 1686601 1750447 1818713
57627 1818713 1892961 1974193 2063490 2162366 2272077 2392830 2524273 2666902 2822480 2992938
57617 2992938 3179226 3381223 3598043 3827988 4068537 4316488 4567577 4815904 5054430
57608 5054430 5276210 5474779 5644002 5779260 5878764 5941311 5961403 5928553 5834256 5680108
57598 5680108 5478413 5245625 4996230 4741419 4490156 4249399 4023525 3814300 3621651
57589 3621651 3444878 3283772 3138688 3009564 2895312 2794446 2705802 2628359 2561088 2503545
57579 2503545 2455899 2417642 2386867 2361724 2342311 2330415 2327512 2333306 2345870 2363028 2384217 2411232
57567 2411232 2446482 2490420 2541707 2599988 2666926 2743841 2830017 2924482 3027997 3141882 3266209
57556 3266209 3400786 3546606 3704134 3870647 4041137 4211340 4377820 4535087 4674682
57547 4674682 4787812 4867802 4910203 4912425 4874371 4798782 4690422 4555165 4399516 4229834
57537 4229834 4051390 3868235 3683673 3500475 3321100 3148276 2984780 2831871 2688504
57528 2688504 2552996 2425024 2305343 2194405 2092389 1999755 1916299 1840106 1768856 1702004
57518 1702004 1640449 1584452 1533251 1486422 1444079 1405708 1370161 1336891 1306056 1277484 1250815
57507 1250815 1226625 1205970 1188644 1173177 1158777 1146084 1135717 1127228 1119872 1113373 1107652 1102737
57495 1102737 1099273 1098168 1099425 1102214 1106352 1112872 1122752 1135750 1150697 1166287 1181647 1196935 1213528
57482 1213528 1232871 1255184 1279962 1307356 1337839 1370752 1404782 1440181 1479019 1522631 1570127
57471 1570127 1620118 1672775 1729286 1790352 1856405 1928654 2008735 2097446 2194549 2299676 2412749
57460 2412749 2533531 2661109 2793721 2928706 3062656 3191613 3310919 3414929 3497722 3554793
57450 3554793 3584054 3585089 3557959 3503416 3424341 3326365 3216388 3100007 2980188 2858320 2736241
57439 2736241 2616777 2502418 2394251 2292624 2198189 2111601 2032677 1960773 1895883 1838549
57429 1838549 1788698 1745390 1707904 1676348 1650867 1630849 1615409 1604320 1597993 1596666 1600000 1607429
57417 1607429 1618536 1632876 1649809 1669129 1691952 1720246 1754925 1794755 1837968 1884728 1937126
57406 1937126 1996722 2063144 2135235 2212493 2294973 2382927 2477188 2578729 2686697 2797681 2907936
57395 2907936 3015478 3118504 3212282 3289362 3343232 3370729 3370901 3343210 3288010 3208029 3108082
57384 3108082 2993059 2866601 2731715 2592007 2451713 2314497 2182544 2056836 1937838
57375 1937838 1825650 1720057 1621090 1529297 1444889 1367028 1294683 1227847 1167032 1111910 1061515
57364 1061515 1015526 974002 936001 899992 865784 834567 806751 781355 757788 736446 716936
57353 716936 697617 677962 659618 643932 629984 616352 603191 590992 578844 565843 553031
57342 553031 541933 532080 521940 511642 502765 495892 490203 485158 480715 476116 470321 463748 458006
57329 458006 453756 450201 446685 443444 440716 438375 436512 435195 433713 431284 428446 426445 425182 423158
57315 423158 419656 415732 412543 409833 406673 403016 399955 398709 399513 401220 402097 401276 399220 396592 393393
57300 393393 389703 386481 384709 384207 384162 384344 385027 386227 387837 390069 392968 396100 399423 403711 409181
57285 409181 414542 418573 421864 425878 431050 437166 444788 454606 465842 476977 487821 499303 511341
57272 511341 522578 532501 542484 554327 568595 584503 600576 615571 629587 644146 660386 677462
57260 677462 693624 708505 723228 738557 754131 769542 785106 801405 818829 837628 857785
57249 857785 878794 900030 921345 943111 965962 990365 1015704 1039815 1060637 1078714 1096860
57238 1096860 1116876 1137932 1158628 1179015 1199697 1220678 1242334 1266033 1292485 1320864 1350680
57227 1350680 1382954 1418263 1455411 1493646 1534395 1579038 1626673 1676116 1728418 1785165 1845715
57216 1845715 1908306 1972361 2037256 2100280 2158518 2211643 2260242 2302504 2335307 2357603 2370198
57205 2370198 2373392 2367773 2356259 2342016 2324985 2303589 2279276 2255999 2235509 2216529 2198514 2182829
57193 2182829 2170003 2159065 2150169 2144910 2143351 2143543 2144608 2147780 2153805 2161898 2171997 2185588 2203342
57180 2203342 2223984 2246324 2270742 2298161 2329141 2364093 2402682 2443047 2483365 2523992 2566329
57169 2566329 2610249 2654924 2701494 2752078 2806331 2861857 2918112 2977050 3039667 3104598 3170610
57158 3170610 3237943 3306799 3376994 3449432 3525349 3603525 3680716 3755683 3830781 3908997 3991290
57147 3991290 4077244 4166433 4258675 4354346 4454425 4558774 4664788 4769508 4872539 4975307
57137 4975307 5078468 5182188 5287886 5397124 5509468 5623628 5739419 5856014 5969702
57128 5969702 6076614 6176670 6271903 6362289 6446702 6526739 6605662 6684283 6761460 6837697 6914502
57117 6914502 6991124 7065832 7139438 7213581 7286755 7356464 7424206 7493480 7563553 7630251 7692410
57106 7692410 7752561 7811498 7867297 7919682 7970275 8018166 8059852 8093734 8120400 8139060 8148456
57095 8148456 8150808 8149907 8145965 8137315 8125978 8115666 8105209 8090366 8071817 8055164 8043407 8035691
57083 8035691 8032909 8037621 8048529 8061629 8076616 8095750 8117385 8137750 8157667 8179078 8195708 8195868
57071 8195868 8174036 8130839 8062534 7960659 7822040 7648733 7437581 7180225 6873826 6520661
57061 6520661 6116228 5649026 5113028 4508644 3830166 3064221 2201608 1238072 162549
57051 -1041832 -2384492 -3869920 -5514805 -7347314 -9388543 -11651483 -14159351 -16946505
57043 -16946505 -20040374 -23463890 -27259092 -31487237 -36203752 -41457213 -47315282 -53863692
57035 -53863692 -61175161 -69307911 -78337324 -88355705 -99439169 -111650611 -125061531
57028 -125061531 -139701603 -155483717 -172263072 -189965917 -208484060 -227314098 -245438714
57021 -245438714 -261817984 -276058212 -288473634 -299463973 -308956923 -316473471 -321525092
57014 -321525092 -323773116 -322903805 -318577780 -310582208 -298976793 -284098002 -266509873 -246966161
57006 -246966161 -226320870 -205378914 -184795363 -165073449 -146584914 -129559328 -114086790
56999 -114086790 -100162914 -87729675 -76684940 -66898017 -58246226 -50629837 -43950055
56992 -43950055 -38095305 -32958640 -28450613 -24487690 -20987053 -17882730 -15131548 -12694856
56984 -12694856 -10527926 -8592855 -6865680 -5322272 -3930728 -2665629 -1517521 -480778
56975 456763 1305804 2069029 2750234 3360392 3908588 4396535 4827853 5213279 5560636 5868449
56965 5868449 6135142 6366304 6567845 6740523 6886610 7013819 7127049 7223411 7300155 7360343
56955 7360343 7406497 7436304 7449269 7450173 7441215 7417970 7377863 7325653 7265734 7195861 7113399 7021032
56943 7021032 6921168 6810885 6687743 6555199 6417561 6274846 6126458 5973667 5813807 5638535
56933 5638535 5444102 5239142 5037777 4849912 4682426 4542675 4431737 4335438 4227834 4084165
56923 4084165 3890526 3646924 3366229 3067401 2765123 2466164 2175264 1899125 1642221
56914 1642221 1404025 1184061 985435 810106 655141 517403 397860 297611 213651 142328
56904 142328 83271 36249 -2076 -34509 -59920 -76992 -87847 -94270 -94067 -85363 -71617 -58629
56892 -58629 -49334 -44753 -46657 -55214 -66665 -77058 -86017 -93968 -98924 -99684 -99170 -100540 -102334 -101054
56878 -101054 -96184 -89099 -79515 -66827 -52835 -39340 -24789 -6746 13917 34392 53442 70211
56866 70211 81274 82668 74112 58643 39229 17962 -3097 -23090 -43273 -64723 -86389 -106943
56854 -106943 -126575 -145260 -161486 -174607 -186169 -196950 -205255 -210201 -214063 -219082 -224460 -228725 -232290
56841 -232290 -235338 -236143 -234154 -231859 -230693 -227957 -220778 -210400 -199374 -187182 -171972 -154045 -134239
56828 -134239 -111240 -83967 -54250 -23744 9235 45943 82578 113742 138732 160427 179557 194302
56816 194302 204430 211823 217612 222217 227287 234182 241448 247110 252481 260468 271150 282531 294877
56803 294877 310876 331970 357596 387534 422060 460064 499283 537497 571225 594827 604109 600094
56791 600094 586831 566905 541827 514937 490090 468228 448453 431609 419719 412932 410355 413030
56779 413030 422955 440131 463738 495074 535936 585412 642083 707870 784477 865673 937462 987075
56767 987075 1009283 1004917 978115 936032 886893 835793 784006 732734 684900 642821 606950 577722
56755 577722 556144 541915 533434 530359 534084 545287 563288 588247 621674 663938 712794 764188
56743 764188 812268 848666 864926 857502 829683 788570 741340 693613 648674 607222 568926 534300
56731 534300 504249 478745 457593 441643 431491 425928 423671 425565 432815 444242 457947 474562
56719 474562 495605 519002 539321 552294 556447 550830 534604 509238 478283 444603 409986 377046
56707 377046 348358 323597 300430 278516 259863 244985 231670 218135 204922 193235 183787 177511
56695 177511 174798 173704 171378 167510 163981 161265 158060 154479 152391 151968 151001 148353 145226 142284 138437
56680 138437 133443 128883 125375 121409 116130 110917 107130 104508 102706 102069 101838 99896 95512 90426 86352
56665 86352 83407 81674 81936 83711 84723 83572 81288 79439 78380 77973 78098 77755 75614 72194 69745
56650 69745 69456 70507 72015 73807 75124 75003 74341 75174 77454 79024 79125 79266 80150 80538 79879 79121 78167
56633 78167 75576 71870 70039 71334 73378 73905 73590 73661 73599 73105 73734 76529 80219 83604 87436 92067
56617 92067 95494 95992 94905 94854 96726 100054 104598 109767 114073 116819 118968 121155 122671 123653 126028
56602 126028 130570 134933 136466 135328 133248 131032 129073 128475 129687 131294 131807 131377 130585 129180 127285
56587 127285 125958 125219 123506 120536 118585 119145 120400 119947 118045 116157 114140 111108 107482 104060 100509
56572 100509 96685 93810 92382 90708 87747 85792 87879 93753 100593 106388 110465 112216 111974 112093 114520
56557 114520 117975 119751 119600 119661 121246 123851 126727 129319 130602 130002 128796 128993 131096 134166 137327
56542 137327 139861 140753 139765 138306 137871 138345 138960 139781 140919 141557 141455 142214 145341 149998 154315 157856
56526 157856 161144 163925 165739 167257 169122 170410 170115 169442 170707 174494 179477 184495 189280 193734 197904
56511 197904 202310 207282 212628 218579 225809 233798 240869 246938 254381 264793 276869 289060 302114
56498 302114 316893 331818 345114 357907 372315 387776 402028 414635 426849 438893 450114
56487 450114 461169 473345 485883 496287 503097 506678 507934 508070 508738 510350 510910 508327 503005 496263
56473 496263 487477 475192 460127 444553 429327 413897 398668 384965 372986 361820 351095 340833
56461 340833 330488 320069 311332 305660 301481 295870 288104 279780 272430 266883 263708 261941 258608 252032
56447 252032 244604 239737 237216 234270 229980 225574 221342 216634 212420 210479 210291 209788 209027 210016 212884
56432 212884 215237 215578 214698 213510 212123 211198 211731 213300 214742 216448 219740 224209 228030 230590 232529
56417 232529 233757 234037 234970 238522 243888 248500 251669 254530 257122 258804 260923 265517 271631 276538 280359
56402 280359 285609 292227 297266 300062 303415 308605 313418 316714 321044 328484 337075 343728 348217 352178
56388 352178 356192 359760 362589 364499 365312 365615 366168 366365 365254 364173 365757 369872 373146 373320 371672
56373 371672 370472 370496 371715 373873 375547 374965 372420 369638 366522 361410 354880 350043 348098 346730 344071
56358 344071 341189 339371 337890 335990 334308 332809 329897 325174 320568 317315 314309 310897 308586 308185
56344 308185 307713 305241 301909 300271 301181 303631 306047 306742 304938 302310 301669 303374 305140 305908 307189
56329 307189 309794 312099 312824 312822 312761 311726 309589 308145 308290 308490 307509 306302 305859 305695 305805 307491 310840
56312 310840 313909 315818 317955 320874 322989 323924 325951 330222 334627 337438 339985 343478 346268 346916 347262
56297 347262 349680 353672 357694 361974 366965 371372 374380 377535 381893 385597 386890 387176 388440 389992
56283 389992 390709 392087 395746 399877 401520 400753 399430 397429 393639 389519 388166 390329 394093 398032 402280
56268 402280 407236 413440 422017 433201 445194 456220 466625 477461 488527 499587 511703 525264
56256 525264 538424 549741 560743 573649 588187 602893 617831 633569 649171 663693 678114
56245 678114 693201 707059 717457 725221 732711 740245 746533 751294 754972 757274 758554 761177 766845
56232 766845 773859 779615 784335 789708 795477 800597 806480 815729 828258 841630 854723 868441 883484
56219 883484 900082 919408 942743 969538 998295 1028788 1061555 1096147 1131946 1169775 1210780
56208 1210780 1254721 1301151 1350977 1404903 1462010 1522085 1587790 1661949 1744032 1831796 1925152
56197 1925152 2025966 2135274 2253173 2380297 2517041 2662293 2814858 2974716 3140987
56188 3140987 3310460 3480197 3649545 3817262 3978861 4129517 4267359 4390998 4496155
56179 4496155 4578228 4636393 4671958 4684734 4674808 4646101 4604055 4550878 4486595 4413424 4335131
56168 4335131 4252976 4166145 4075685 3984479 3893740 3802627 3710785 3618399 3524456 3427690 3328474
56157 3328474 3227528 3124267 3018979 2914578 2813159 2712763 2610938 2509384 2411366 2316639
56147 2316639 2223201 2132281 2047078 1967815 1892547 1821717 1757350 1698606 1642629 1589260 1540563
56136 1540563 1496291 1454180 1414378 1379276 1349023 1321082 1294114 1268707 1244643 1221091 1199109
56125 1199109 1180577 1165255 1152079 1142008 1135908 1131080 1124204 1116608 1112259 1111549 1111602 1111784 1114144 1118967
56111 1118967 1124536 1131004 1140183 1151900 1164649 1179089 1196598 1215350 1232488 1249336 1269623 1293227
56099 1293227 1316507 1338162 1359792 1381249 1400505 1417790 1435024 1451701 1466224 1480527 1498140
56088 1498140 1518381 1537804 1556564 1577614 1600328 1621204 1640735 1663324 1690279 1719138 1750348
56077 1750348 1788509 1836277 1892758 1958405 2035649 2124391 2222941 2333951 2463042 2610763 2771953
56066 2771953 2943520 3125949 3315914 3504342 3683968 3852990 4009914 4151461 4277899
56057 4277899 4394302 4503491 4602086 4684898 4748161 4787492 4798861 4784005 4750223 4703375 4645366
56046 4645366 4578289 4504521 4421553 4322917 4205909 4073303 3927436 3769452 3605264 3444867
56036 3444867 3293631 3150427 3015616 2893961 2787872 2694750 2613060 2544399 2487554 2437200
56026 2437200 2390581 2349169 2312273 2276150 2241242 2212835 2192129 2173698 2153978 2135153 2118632
56015 2118632 2102367 2087120 2077703 2075086 2074495 2073902 2076900 2084766 2093526 2101716 2113189 2129286 2146053
56002 2146053 2162090 2181208 2204498 2227940 2250661 2276998 2307584 2337333 2365411 2397811 2436468
55991 2436468 2475383 2511447 2549440 2591945 2634138 2673402 2714493 2760197 2806433 2851665 2901465
55980 2901465 2958447 3017431 3076033 3140141 3213224 3290237 3367943 3451104 3542155 3635011 3725714
55969 3725714 3819250 3919296 4021397 4122968 4229687 4345061 4463997 4583607 4709841 4846482
55959 4846482 4988484 5133297 5287507 5454951 5629879 5809426 6000837 6208500 6426286
55950 6426286 6651011 6890786 7151548 7428502 7719651 8033802 8375565 8736724 9112729
55941 9112729 9513283 9945899 10403995 10882605 11390406 11933982 12505682 13099796 13725082
55932 13725082 14388507 15083368 15807266 16574543 17395990 18263469 19169679 20125108 21139942
55923 21139942 22208610 23328978 24516426 25780879 27111185 28501852 29973648 31547613
55915 31547613 33221896 34995526 36889335 38919151 41075082 43354525 45789123 48411765
55907 48411765 51227474 54249015 57530393 61130979 65080829 69421609 74248938 79674697
55899 79674697 85788078 92702802 100602769 109689799 120132438 132123387 145932242 161835652
55891 161835652 180065053 200905922 224760399 251998572 282834908 317394983 355450206
55884 355450206 395325242 432819890 461850036 477106065 476698480 462556097 438638714
55877 438638714 408916119 376498050 343637888 311830433 281871482 254083165 228596233
55870 228596233 205454685 184603198 165935025 149357597 134758400 121945045 110682893
55863 110682893 100769323 92030353 84285311 77373587 71196714 65690370 60773709 56361184
55855 56361184 52398694 48847015 45646338 42731847 40068281 37637497 35407480 33343392
55847 33343392 31434291 29679769 28062143 26556885 25156775 23860393 22649177 21500686
55839 21500686 20413824 19398339 18449943 17557151 16721404 15948182 15227304 14542660 13892948
55830 13892948 13283876 12709034 12157686 11632969 11143423 10684017 10243553 9823494 9431896
55821 9431896 9065596 8715497 8382956 8074154 7784201 7503156 7232410 6979595 6742510
55812 6742510 6513279 6293480 6090226 5901563 5719853 5545295 5382437 5227399 5071883
55803 5071883 4915881 4763608 4610946 4449718 4280916 4111660 3942869 3771893 3603397
55794 3603397 3445467 3298273 3158004 3028305 2916039 2819168 2730577 2650893 2585892 2533864
55784 2533864 2486692 2440961 2397322 2351723 2298464 2239879 2182513 2125957 2065741 2004735 1950633
55773 1950633 1903787 1858065 1812534 1772045 1737240 1703758 1670664 1640507 1611833 1580423 1546937
55762 1546937 1514984 1483086 1446977 1408255 1372097 1338106 1302220 1265836 1233709 1204127 1170727
55751 1170727 1133553 1099062 1069420 1040671 1011568 985486 963094 941416 920854 905448 895521
55740 895521 887319 880388 878246 881246 885508 889181 893378 896915 896671 893206 889819 886256 879501 870158
55726 870158 861604 853426 842324 829001 817432 807627 795978 782660 772044 765594 760627 756004 752642
55713 752642 748534 739843 727281 715389 705398 694739 683303 673842 666130 656983 646289 637026 629227
55700 629227 619918 609040 599464 591106 580961 568847 557210 545595 531595 516875 505601 496895
55688 496895 485609 470719 455995 442075 425192 404856 385636 369650 353981 337382 323101
55677 323101 312895 304125 295034 287486 282485 278194 274219 272801 274002 274549 273073 271759 271525 270397
55663 270397 267914 266233 265641 263872 261029 260175 261862 263035 262503 262322 262741 261214 257809 256182 257550
55648 257550 258927 258955 260033 262943 264892 265053 266771 271805 277301 280815 283533 286241 286987 285260 283850
55633 283850 284014 283321 280738 279351 281392 284919 288025 291991 297539 302335 305268 309206 316411 324795 331679
55618 331679 337740 344413 350722 355554 359818 363541 363998 359606 352966 347398 342964 338071 332380 326144
55604 326144 319371 313499 311125 312314 313965 314193 314276 315067 315267 314834 316148 319659 322206 321883 320869 321117
55588 321117 321044 319049 316617 315090 312902 308932 305239 303392 301132 295846 288566 281602 274968 267943 261325
55573 261325 255191 247245 236593 226484 220074 215815 210220 202902 195586 188228 179633 170457 162456 155762
55559 155762 149417 143384 137816 131821 125077 119235 115720 113761 112400 112424 114256 115943 115627 114304 113882
55544 113882 114055 113222 111068 108376 105667 103615 103203 104065 104511 104407 105696 108668 110463 109114 106333 104125
55528 104125 101409 96663 91467 88542 88186 89238 91638 95399 98752 100052 100152 100686 101588 102483 104722
55513 104722 109566 115842 121605 126609 131322 135432 139512 146029 156152 167406 176973 185483 194878 204463
55499 204463 212076 217604 222156 224882 223705 218642 211773 204529 197126 189717 181813 171525 157832 142902
55485 142902 130034 120071 111783 104776 99688 96220 93240 90423 87995 85495 82517 80054 79388 80291
55471 80291 81719 83489 85789 87828 88407 87205 84582 81212 78683 78862 81475 83910 84574 84690 85601 86495
55455 86495 86386 86222 86992 87651 86899 85241 83398 80646 76725 73375 71658 69629 65015 58501 52116 46219
55439 46219 40475 35809 32667 29178 23911 18791 16298 15316 12945 9061 5811 3706 1603 -204 -285
55424 -285 843 1007 -319 -1588 -1867 -1557 -750 738 1915 1376 -628 -2776 -4775 -7022 -8939 -9651 -9512 -9075
55406 -9075 -7603 -4829 -2891 -3880 -6344 -6999 -5220 -3179 -2230 -1973 -2454 -4325 -6776 -7945 -7521 -6826
55390 -6826 -6490 -6149 -6119 -7120 -8544 -9127 -8972 -8881 -8415 -7015 -6334 -8604 -12846 -15529 -15030 -12876 -10611
55373 -10611 -8253 -6279 -6321 -8830 -11995 -13868 -14095 -13088 -11076 -8478 -5978 -3925 -2597 -2655 -4131 -5503
55357 -5503 -5267 -3881 -2645 -1429 654 2999 3972 3362 2601 2946 4973 9082 14680 19623 22429 24170
55341 24170 26256 27602 26517 24294 23837 25311 26125 24935 22719 20119 16835 13776 12738 13480 13751
55326 13751 12677 11439 10327 7875 3676 -473 -3004 -3986 -3707 -2313 -1272 -2598 -5683 -7374 -6201
55311 -6201 -4262 -3793 -4089 -3230 -1118 680 980 -136 -1498 -1401 870 3697 4488 2538 -742 -4256 -8097
55294 -8097 -12024 -14986 -16527 -16971 -16045 -13272 -9843 -8059 -8447 -9369 -9832 -10589 -11956 -12749 -12343 -11827 -12115
55277 -12115 -12581 -12525 -12480 -13086 -14032 -14869 -15634 -15995 -15091 -12994 -11221 -11069 -12287 -13757 -14708 -15121 -15759 -17597
55259 -17597 -20279 -21703 -20377 -17582 -15628 -14811 -14087 -13958 -15983 -19584 -22044 -22004 -20619 -18976 -16843 -14447
55243 -14447 -13017 -12831 -12819 -12520 -12350 -11681 -9281 -6153 -5186 -7063 -9195 -9770 -10155 -11902 -14042 -15108 -15517
55226 -15517 -15894 -14984 -11501 -6793 -3650 -3221 -4483 -5921 -6578 -6309 -5842 -5813 -5394 -3239 -124 1270 -83
55208 -2124 -2797 -2569 -2700 -2969 -2791 -2889 -4087 -5586 -6048 -5347 -3920 -1574 1556 3889 3792 1500 -1519
55190 -4411 -6995 -8854 -9592 -9513 -9113 -8332 -7046 -5797 -5368 -6057 -7607 -9314 -10127 -9448 -7816 -5854 -2915
55172 1695 6416 8400 7187 5381 5114 5758 5833 5190 4209 2644 466 -1441 -2418 -2595 -1766 717 4219
55155 4219 6683 7204 7150 7994 9636 11576 13803 15601 15481 13422 11245 9710 7383 3754 1176 1835
55139 1835 4698 7483 9966 13189 16791 19288 20142 19702 17977 15115 12241 10351 9148 8064 7229
55124 7229 6323 4092 554 -1928 -1624 -91 35 -1366 -2492 -2557 -1970 -552 2038 4670 5644 4962 3944 3014
55106 3014 1548 -547 -2773 -5162 -7911 -10223 -11019 -10485 -9610 -8697 -7614 -6841 -6797 -6749 -5807 -4382 -3193
55089 -3193 -1542 1697 5906 9143 10394 9883 7698 3928 -77 -2374 -2470 -1377 212 2452 5079 7033
55073 7033 7522 6593 4738 2803 1939 2689 4314 5753 6762 7401 7286 6444 6127 7478 10034 12738 15706
55056 15706 19629 24184 28568 32989 37984 42695 45506 46229 46120 45873 44997 43111 40520 37573 34582
55041 34582 32206 30769 29464 27436 25341 24525 24934 25243 24845 24322 24086 24019 24554 26612 30143 33837 36631
55024 36631 38600 40211 41614 42823 43809 44240 43852 43135 43016 43831 45169 46583 47974 49416 51108 53183
55008 53183 55150 56009 55399 54145 53128 52300 51310 50239 49004 46997 44291 42320 42218 43130 43331 42424
54992 42424 41366 40849 40724 40590 40063 39002 38175 38852 40820 41798 40121 37210 36021 37657 40716 43298
54976 43298 44384 43781 42105 40572 39942 40063 40968 43292 46791 49792 51345 52592 54682 56817 58025
54961 58025 59268 61630 63718 63381 61192 59805 60464 62439 65170 68391 70692 70693 69614 70044 72080 73213
54945 73213 72248 70809 70535 71204 72221 73566 74476 73494 70846 68857 69011 70270 71221 72092 73462 74538
54929 74538 74059 72023 69542 67759 67426 68527 69795 69522 67368 64521 62008 59961 58566 58201 58266 57443
54913 57443 55750 54977 56396 59269 62276 65176 68251 71254 73913 76731 80356 84491 87926 89404 88571
54898 88571 86741 86537 89728 95359 100980 105630 110444 116327 122466 127568 131418 134772 138622 143871 150746
54883 150746 158296 165414 172533 181382 192927 206406 220314 233194 243549 250297 253609 254233 251998
54870 251998 246140 237004 226028 213981 200736 186935 174352 164108 155830 148826 142792 137055 130635
54857 130635 123635 117382 112739 109408 107134 106265 106676 107328 107351 106668 105523 104559 105198 108402 113059 117313
54841 117313 121533 128015 137398 147563 156818 166127 177027 189077 200681 211050 220047 227183 231920
54828 231920 234153 233599 229545 221858 211341 198799 184884 171161 159705 150898 143054 134924 127197
54815 127197 120777 115130 109292 103231 97340 91885 87719 86094 86802 87854 87878 87453 87363 87260 87155 88332
54799 88332 91213 93775 93776 91335 87806 83441 77904 72067 67404 64261 62208 61330 61630 61953 61165 59956
54783 59956 59941 61342 62856 63317 62309 59693 55839 51907 48741 45955 43112 41043 40687 41379 41751 41817
54767 41817 42681 44575 46626 48275 49565 50354 50617 51253 53198 55892 57920 58990 59905 60760 60756 59991 59980
54750 59980 61950 65644 70014 74046 76730 77578 77811 79983 85513 93094 100137 105406 109654 114043 118702
54735 118702 123008 126787 130743 135636 141483 147874 154806 162705 171860 182460 194994 209767 225927
54722 225927 241855 256692 270602 283287 293257 299054 300408 297854 292206 284842 277408 270456 263112
54709 263112 254733 246084 238293 231573 225567 220028 214422 207972 201040 195517 192830 192259 192213 192368 193537
54694 193537 196204 200300 205858 212781 220382 227992 235658 243702 252387 262629 275880 292148 309062
54681 309062 324085 336875 348388 358649 366717 371950 373753 370865 362690 350893 338087 325232
54669 325232 311767 297733 284004 270645 256922 242926 229600 217095 204812 193256 183994 177208
54657 177208 170834 163029 154432 147252 142962 141339 140943 139967 137346 133656 130593 129367 129946 131697 133882
54642 133882 135533 135831 135091 134743 135967 138586 141321 142737 142093 139922 137727 136545 135971 135159 134480 135193
54626 135193 137634 140611 142716 143478 143252 142826 143151 144578 146275 147234 147933 150110 154650 160441 165559 168886
54610 168886 170508 171404 173038 176383 180918 185234 188947 193258 199171 205879 211545 215251 217507 219239
54596 219239 221018 223218 226158 229724 233205 235917 237953 239961 242137 243877 244764 245555 247643 251752 257779
54581 257779 265701 275674 287137 298840 310137 321440 333041 344484 355558 366686 377435 385634
54569 385634 389169 387995 383388 375968 365727 353387 340212 326652 312536 298669 286953 278564
54557 278564 272801 267907 262416 255799 248704 242660 238858 237040 236006 235027 234145 233320 232040 229755 226197
54542 226197 221536 216814 213672 212671 212097 209453 204199 198235 193739 191319 190161 189058 187132 184301
54528 184301 181325 178972 177088 174802 171439 166889 161469 155990 151498 148245 145215 141305 136614 132001
54514 132001 127961 124700 122661 121928 121552 120443 118538 116174 112977 108679 104519 102336 102353 103214 104064 105354
54498 105354 107588 110567 113850 116785 118218 117494 115698 114541 114050 112801 110424 108165 106712 105368 104061
54483 104061 104469 107866 113099 117884 121382 124472 128093 132372 137033 141782 146215 149868 152469 154238
54469 154238 156144 159654 165676 173753 182640 191355 199112 204847 207899 208906 208850 207393 203460 197461 191460
54454 191460 186813 182987 179134 175484 172391 169193 165003 160018 155139 150764 146568 142282 138306 135610
54440 135610 134903 135584 135934 135016 133997 134558 136435 137791 137746 136976 135887 133988 131492 129799 129599 129942 130000
54423 130000 130430 132059 134451 136808 139295 142443 145975 149186 151770 153635 154774 156040 158999 163942
54409 163942 168926 171868 172956 173879 175358 176706 177541 178590 180592 183204 185235 185634 184278 182087 180288
54394 180288 179495 179655 180670 182383 184016 184589 184131 183563 183111 181879 179433 176718 174675 172908 170528 167567
54378 167567 164735 162466 160861 159858 158735 156293 152443 148962 147744 148864 151050 153322 155170 155835
54364 155835 154715 152377 150259 149502 150542 153274 156821 159620 160634 160226 159306 158363 158090 159971 164783
54349 164783 170898 175623 178191 180252 183413 187601 192022 196414 200705 204418 207223 209723 213076 217978
54335 217978 224187 230730 236493 240955 244584 248291 252387 256280 259195 260924 261712 261640 260397 257776 254343
54320 254343 251292 249253 247407 244246 239228 233142 226815 220276 213551 207425 202596 198510 193944 188682
54306 188682 183927 180823 179052 177150 174098 170405 167582 166567 166933 167719 168614 169817 171141 172050 172466
54291 172466 172684 172562 171800 171060 171616 173575 175583 176927 178697 182047 186291 189889 192600 195522 199344
54276 199344 203634 207663 211083 213799 215733 216633 215837 212756 207988 203308 199879 197047 193530 189081 184178
54261 184178 178908 173292 168101 164031 160329 155581 149749 144161 139496 135185 131084 128334 127754 128259 127766
54246 127766 125248 121330 117225 113655 110705 108163 105879 103858 102071 100347 98564 96806 95162 93524
54232 93524 91849 90402 89408 88650 87810 87011 86622 86648 86795 86970 87150 86786 84996 81666 77903 75083 73684
54215 73684 73284 73456 74265 75885 78103 80480 82877 85414 87818 89183 88776 86858 84375 82059 80286
54200 80286 79576 80437 82615 85104 87142 88756 90323 92115 94325 96852 98925 99656 99204 98735 98918 99086
54184 99086 98272 96444 94446 93272 93587 95278 97164 97903 97477 96985 96848 96376 95530 95650 97409 99218 98994
54167 98994 96735 93995 91486 88796 86185 84983 85854 87860 89701 91041 92133 92858 92690 91431 89584
54152 89584 87997 87105 86652 86350 86574 87771 89203 89310 87827 86534 87074 88815 89916 89937 90114 91191 92176
54135 92176 91551 88949 85381 82146 79688 77375 74524 71621 69982 69998 70477 70261 69610 69267 68985 68182 67497
54118 67497 68347 70889 73544 74811 74844 74966 76037 77353 76986 73490 67612 61998 58789 57921 58043 58369
54102 58369 59047 60407 62628 65526 68009 68494 66833 65100 65404 67454 69289 69732 68907 67050 64453 62290
54086 62290 61896 63154 64792 66274 68127 70514 72778 74515 75825 76406 75657 73838 72019 70670 69484
54071 69484 68603 68730 69752 70587 70690 70497 70111 68939 67144 66040 66265 66806 66727 66686 67673 69209 70073 70162
54053 70162 70310 70538 69762 67437 64585 62701 62084 61639 60316 58510 57731 58824 60811 61889 61358 60134
54037 60134 59535 60168 61864 64011 65820 66822 67273 67742 68388 69024 69609 70042 69758 68381 66659 65873 66297
54020 66297 67096 67782 68810 70495 72285 73512 74186 74635 74889 74775 74222 73275 72202 71602 71952 73131 74789
54003 74789 76910 79321 81089 81488 81378 82427 84878 87301 88715 89711 91135 92872 94470 95923 97281
53988 97281 98506 100262 103649 108410 112521 114556 115564 117484 120551 123633 126594 130709 136586 143038
53974 143038 148597 153372 158736 165549 173286 180794 187355 192804 197101 200457 203902 208894 215858 223479
53960 223479 229980 234755 238291 241082 243434 245904 248824 251485 252766 252553 251687 250660 249493 248853 249839
53945 249839 252235 254112 253815 251561 248596 245648 242692 239424 235412 230479 225420 221645 219643 218406
53931 218406 216777 214663 212524 210451 208368 206548 205356 204823 204769 204864 204421 202893 200809 199395 198946 198466
53915 198466 197207 195601 194133 192413 190119 187908 186375 184854 182310 178939 175914 173879 172576 171759
53901 171759 171613 172229 173266 174190 174576 174327 173782 173369 172993 172136 170758 169695 169925 171753 174674 177646 179679
53884 179679 180822 182489 185921 190485 194527 197769 201500 206405 211897 217959 225707 235211 244498 251982
53870 251982 258351 264676 270165 273652 276079 279333 283177 285373 284617 281617 277503 273100 269878 269693 272851
53855 272851 277660 282486 287233 292401 297774 302748 307301 312054 317762 324932 333511 342805 352047 360957
53841 360957 369315 376337 381344 384913 388386 392098 394992 396194 396168 395865 395475 394546 392900 390921 389139
53826 389139 387804 386648 384826 381245 375222 366955 357409 347695 338248 328484 317713 306651 297505 291864
53812 291864 288768 285552 280527 274161 267697 261439 254880 247972 241530 236193 231390 225897 219583 214079
53798 214079 211049 210061 209006 206666 203742 201064 198035 193798 188873 184283 179628 173633 166581 160766
53784 160766 158078 158100 158990 159352 158741 157199 155215 153774 153514 153682 152547 149264 145159 142775 143479 146101
53768 146101 147996 147316 144256 140479 137753 136825 137039 137036 136251 135622 136297 137977 139351 140044 141043 143005 145358
53751 145358 147510 149831 152671 155385 157188 158272 159206 159979 160585 161889 164829 169121 173635 177764 181661
53736 181661 185661 190373 196803 205260 214458 222805 230342 238233 246439 253241 257455 260105 263395 268532
53722 268532 274761 280079 282827 283219 283530 286309 292161 299436 305875 310136 312075 312367 312139 312368 313191 313786
53706 313786 313006 310285 306236 302332 299562 297328 294251 290112 286121 283015 280033 276449 272967 270506
53692 270506 268455 265469 261476 257586 254311 251035 247085 242373 237256 232670 229986 229523 229481 227524 223222
53677 223222 217921 212708 208075 205205 205484 208138 210040 208900 205548 202249 199765 197140 193799 190729
53663 190729 189563 191036 194408 198172 201275 203679 205861 208167 210802 213892 217102 219773 221952 224741
53649 224741 228891 233725 238153 241965 245039 246297 245099 243171 243238 245822 249072 251735 254397 257510 260156
53634 260156 261555 262207 262678 262642 262001 261668 262318 263426 264458 265999 268731 272260 275836 279442 283247 286856
53618 286856 290046 293474 297588 301525 304166 305733 307212 308642 309129 308480 307759 308074 309515 311376 312891
53603 312891 313606 313353 312036 309657 306894 305398 306477 309179 310648 309174 306125 304007 303274 302266 300063
53588 300063 298043 298214 300746 303773 305378 305399 305272 306382 308800 311675 314406 316885 318787 319351 318078
53573 318078 315204 311407 307643 305326 305768 308847 312690 315238 315929 315712 315942 317588 320971 325515 329902
53558 329902 332902 334268 334881 336189 339241 343763 348171 351052 352723 354889 358877 364756 371959 379818
53544 379818 387532 394759 402531 412422 424246 435523 443944 449686 454815 461218 469618 479564 489470 497436
53530 497436 503009 507771 513403 519721 525359 529856 534234 539828 547225 556020 565007 573054 580279 587684
53516 587684 595089 600428 602175 601755 602243 605091 609304 613373 616533 618354 618847 619336 621860 626875 632427
53501 632427 636152 637472 637559 638006 640055 644282 650159 656182 661031 664579 667549 670493 673343 675706 677320
53486 677320 678445 679872 682237 685195 687760 689629 691699 694959 699347 704135 708954 713845 718600 722865
53472 722865 726899 731548 737233 743534 750024 757077 765419 775228 786049 797428 809297 821985 836228
53459 836228 852768 871325 890132 907330 922941 938871 956938 977649 1001002 1027292 1056449
53448 1056449 1087373 1118854 1150691 1183251 1216550 1250635 1286371 1324736 1365455 1407276 1449459
53437 1449459 1492217 1535971 1581173 1628653 1678919 1730990 1782961 1833994 1884882 1936465 1988426
53426 1988426 2039945 2090644 2140490 2189527 2238060 2286535 2335020 2383351 2431755 2480470 2528811
53415 2528811 2575688 2621229 2666678 2712304 2756554 2797890 2836393 2872897 2907600 2940389 2971692
53404 2971692 3001849 3030060 3054884 3075769 3093642 3110085 3125961 3140490 3151718 3158423 3161283 3161333
53392 3161333 3157794 3149093 3135899 3120930 3105028 3085594 3060310 3030601 2999511 2967596 2933162 2895781
53380 2895781 2857194 2818751 2779954 2739860 2698417 2655916 2612323 2567748 2522867 2478488 2435076
53369 2435076 2392782 2351459 2310825 2271093 2233395 2199199 2169446 2144274 2122869 2103324 2083706
53358 2083706 2064156 2047200 2035096 2027566 2022977 2020798 2021619 2025520 2031966 2040967 2053001 2068119 2086423
53345 2086423 2109066 2137215 2170111 2205568 2242493 2281674 2324100 2369819 2418549 2470040 2523516
53334 2523516 2578046 2633861 2692465 2755205 2822512 2894471 2970893 3050660 3132259 3215388 3301185
53323 3301185 3390588 3483323 3578539 3675374 3772760 3869951 3967625 4067378 4169733 4273545 4377540
53312 4377540 4481210 4583883 4684284 4781619 4875940 4966680 5051963 5130174 5201320 5265990 5323968
53301 5323968 5374805 5419043 5457853 5491879 5521082 5545071 5562772 5572417 5572804 5564337 5548275 5525429
53289 5525429 5496122 5460659 5418820 5369368 5310991 5243523 5167574 5083478 4991644 4893699 4792196
53278 4792196 4689049 4584988 4480527 4376605 4274052 4173117 4073776 3976007 3879557 3783946
53268 3783946 3689018 3595205 3503073 3412857 3324639 3238724 3155666 3076023 3000185 2928276 2860179
53257 2860179 2795798 2735418 2679672 2628992 2583089 2541054 2502028 2465757 2432464 2402212 2374566
53246 2374566 2349046 2325833 2305868 2290156 2278928 2271338 2265919 2261579 2258471 2257890 2261158 2268583 2279378
53233 2279378 2292226 2305779 2319214 2333008 2348975 2368760 2392193 2417644 2444100 2472200 2502978
53222 2502978 2536255 2570944 2606638 2644164 2684361 2726760 2769794 2812288 2854475 2897412 2941518
53211 2941518 2985877 3028963 3069705 3107658 3142432 3173360 3199812 3221729 3239909 3255782 3270675
53200 3270675 3285041 3298402 3309873 3318423 3322786 3321923 3315972 3306151 3293231 3276653 3255742 3231143
53188 3231143 3204173 3174968 3142303 3105310 3064529 3021023 2975041 2925913 2873075 2817106 2759918
53177 2759918 2703688 2649280 2595909 2542671 2489981 2438951 2389780 2341613 2293807 2246484 2199832
53166 2199832 2153701 2108039 2062992 2018337 1973482 1928398 1884102 1841935 1802535 1765506 1729857
53155 1729857 1694830 1660651 1628352 1598579 1570938 1544811 1520204 1497076 1474462 1451395 1428453
53144 1428453 1407108 1387537 1368235 1347964 1327004 1306124 1285396 1264443 1243026 1220997 1198479
53133 1198479 1176476 1156362 1138158 1120050 1100252 1078839 1057204 1036302 1016022 995792 975049
53122 975049 953262 930076 905570 880328 855340 831732 810205 790618 772279 754464 736437
53111 736437 717567 698180 679879 663937 649539 634705 618936 603800 590742 579519 569112
53100 569112 559022 549084 539048 528921 518932 508748 497575 485504 473796 463361 453966 445475
53088 445475 438739 434342 431268 427671 422424 415361 406947 398482 391783 387623 384972 382464 379959 377946
53074 377946 376250 374303 372066 369643 366572 362494 358140 354600 351948 349472 346996 345077 344137 344240 345404
53059 345404 347240 348504 347854 345045 340782 335776 330699 326687 324816 324969 325925 326588 326674 326385 326146 326611
53043 326611 328385 331666 336287 341763 347033 350899 353343 355710 358796 361442 362087 361229 361047 362668 365010
53028 365010 366467 366625 365925 364445 361670 357229 351519 345557 340157 335266 330515 326362 323819 322660 320890
53013 320890 316838 311017 304926 298828 292119 285325 280002 276465 273091 268417 262883 257948 254213 251027
52999 251027 247544 243753 240499 238530 237404 235664 232376 228043 223715 219829 216516 214238 213140 212490
52985 212490 211830 211993 213673 215593 215726 213975 211867 209876 207025 203276 200043 197660 194482 189692 185227
52970 185227 183409 183910 184659 184725 184673 184800 184724 184554 184994 186175 187375 188068 188429 188824 189462 190465 191648 192248
52952 192248 191425 189002 185306 180674 175708 171685 169769 169814 170607 171297 171932 172674 173283 173659 174290 175774 178063
52935 178063 180282 181150 179827 176829 173991 172800 172674 171535 168373 164637 162628 163021 164593 166017 167146
52920 167146 168461 170064 171625 172892 173693 173752 173161 173035 174914 179054 183652 186403 186717 185979 185747 186309
52904 186309 187170 188213 189734 191553 192892 193423 194102 196444 200984 206751 212412 217666 223172 229299 235525
52889 235525 241268 246801 252834 259426 265857 271576 276727 281543 285622 288200 289119 289226 289705 290981 292362
52874 292362 292752 291634 289210 285786 281478 276639 272064 268374 265468 262932 260666 258632 256311 253074
52860 253074 249074 245189 242007 239386 237060 235101 233558 232116 230513 228997 228034 227701 227619 227405 227017 226737
52844 226737 226880 227445 228017 228078 227382 226057 224551 223597 223886 225346 226966 227838 228304 229519 231901 234554 236321
52827 236321 236900 236694 236111 235310 234323 233168 232131 232020 233625 236649 239592 241098 241157 240677 240337 240279 240650
52810 240650 241755 243656 245935 247923 248990 248862 247954 247252 247521 248695 250264 251868 253077 252989 250992 247978
52794 247978 245810 245046 244062 241247 237611 236087 238230 242495 246076 247689 248161 249010 251133 254394 257701
52779 257701 259696 260154 260671 263291 268340 274209 279244 283179 286597 289889 293207 296750 300408 303509 305502
52764 305502 306716 308008 309888 312343 315063 317301 317779 315590 311329 306917 304070 303079 302842 301772 298895
52749 298895 294546 290051 286409 283331 279858 275755 271741 268253 264452 258861 251012 242301 235033 230454
52735 230454 227741 225106 221749 218398 216058 214915 214554 214488 214084 212649 210189 207513 205042 202115 198214
52720 198214 194326 192089 191739 191817 190859 188721 186283 184446 183386 182288 180081 176859 174093 172718 171754
52705 171754 169821 167422 166174 166147 165813 164801 164687 166233 167511 166082 161941 157020 152733 149357 147105
52690 147105 146137 145595 144102 141451 138761 136718 134720 132193 129724 128141 127127 125670 123532 121313 118987
52675 118987 115463 110204 104689 101380 101305 103307 105620 107336 108192 107896 106426 104540 103230 102869 103274 104217
52659 104217 105285 105740 105310 104825 105248 106261 106738 106500 106534 107359 108212 108267 107846 107840 108515 109346 109686 109271 108415
52640 108415 107898 108359 109689 111347 113128 115097 116839 117573 117177 116427 116003 115889 115919 116242 117051 118463 120953
52623 120953 125170 131007 137487 143834 150077 156261 161762 165865 168466 169820 170145 169832 169577 169830 170448
52608 170448 171016 171089 170163 168104 165749 164186 163211 161413 158121 154286 151013 148211 145353 142556 140100
52593 140100 137709 135140 132693 130381 127471 123816 120705 119236 118663 117711 116862 117634 119943 121869 122158
52578 122158 121472 120888 120544 120293 120471 121288 122246 122829 123212 123824 124736 125763 126530 126090 123382 118807 114765
52561 114765 113580 114965 116323 115766 114132 113657 115131 117181 118348 119039 120621 122991 124078 122204 118263
52546 118263 114994 114384 116244 119005 121301 122756 123745 124736 125920 127503 130086 134198 139249 143495 145443
52531 145443 145107 143783 143002 143832 146480 149978 152684 153703 153623 153594 154241 155817 158581 162136 165000 165990
52515 165990 165772 166081 167553 169373 171026 173152 176323 179968 183115 185547 187592 189161 189660 188822 187309
52500 187309 186389 187029 189245 192282 195346 197867 199216 198968 197912 198066 200807 205248 209318 212125 214263
52485 214263 215985 216409 215010 212814 211386 211244 211875 212707 213223 212592 210253 207064 205009 205223 206750 207863
52469 207863 208416 210064 213875 218528 221617 222342 221862 221202 220130 218535 217564 218371 220543 222817 224628 225873
52453 225873 225877 224237 222440 222854 225732 228708 229905 230289 232013 235366 238486 239697 239194 238580 239283 241282
52437 241282 242993 242678 240366 238092 237831 239525 241539 242620 242688 242080 241004 239935 239686 240489 241456 241525 240787
52420 240787 240305 240678 241403 241871 242387 243689 245762 247825 249332 250410 251368 252520 254489 257730 261419 263715
52404 263715 263717 262524 261808 262118 263209 265052 267397 269150 269693 270431 273397 278313 282591 284543 285123 285954
52388 285954 287098 287808 288398 289984 292766 295692 297834 299420 301335 303938 306475 307671 307049 305524 304368
52373 304368 303737 302794 301054 298724 295883 292518 289637 288875 290145 290918 289053 285523 283010 282396 282128 280827
52357 280827 278979 277815 277749 278464 279539 280451 280661 280283 280138 280708 281563 282268 283361 285710 289114 292124 293302
52340 293302 292342 290077 287767 286381 286164 286662 287304 288060 289489 292131 295868 299870 303096 304957 305629 305772
52324 305772 305959 306418 307323 309062 311972 315868 320030 323594 325849 326434 325705 324856 325120 326701 328900 331351
52308 331351 334358 337720 340138 340781 340901 342664 346434 350337 352744 354145 356101 359257 363040 366561 369107
52293 369107 370301 370634 371504 374020 377978 382456 386940 391192 394544 396341 396959 397520 398589 399886 401140
52278 401140 402427 403702 404922 406723 410010 414542 418810 421835 424351 427668 431951 436367 440406 444153
52264 444153 447341 449157 449441 449528 451206 454892 459362 463345 466864 470686 475099 480038 486092 494225 504257
52249 504257 514676 524453 534101 544273 554319 563393 572299 582835 595532 609185 622549 635294
52237 635294 647382 658830 670420 683486 698469 714499 730825 747753 765666 783968 801727
52226 801727 818871 836073 853816 872023 890345 908458 926261 943912 961304 977592 991903
52215 991903 1004631 1017219 1030408 1043428 1055400 1066663 1078092 1089723 1100881 1111313 1121376
52204 1121376 1131230 1140531 1148925 1156378 1162961 1168719 1173856 1178818 1184018 1189416 1194380 1198067 1200088 1200705
52190 1200705 1200310 1199064 1197404 1196390 1196830 1198300 1199929 1202031 1205886 1211655 1217573 1221837 1224546 1227206
52176 1227206 1230917 1235743 1241382 1247661 1254518 1262075 1270792 1281290 1293893 1308270 1323353 1337850 1351285
52163 1351285 1364433 1378323 1393002 1407939 1423343 1440011 1457810 1475269 1490954 1504431 1515732
52152 1515732 1524969 1532760 1540079 1547197 1553588 1559129 1564363 1569304 1573157 1575640 1577301 1578027 1576731 1573259
52138 1573259 1569111 1565261 1560849 1555371 1550486 1547696 1545455 1540859 1533541 1525735 1518904 1512668 1507033 1503193
52124 1503193 1501438 1500130 1497696 1494296 1490835 1487622 1484749 1482585 1481029 1479164 1476417 1473324 1470579 1468187
52110 1468187 1466134 1465060 1465356 1466116 1465734 1463273 1458946 1453721 1448853 1445178 1442290 1438847 1434119 1428778 1423721
52095 1423721 1418673 1412558 1404854 1396000 1386783 1378012 1370429 1364197 1358433 1351920 1344460 1337100 1330767 1325079
52081 1325079 1318851 1311688 1304563 1298524 1293110 1286630 1278154 1268628 1259651 1251699 1244249 1237168 1230906 1225360
52067 1225360 1219668 1213547 1207982 1203986 1201258 1198651 1195463 1191638 1187141 1181962 1176634 1171944 1168045 1164441
52053 1164441 1160978 1158179 1156223 1154199 1151065 1147212 1144379 1143910 1145632 1148663 1152690 1157850 1163803 1169747
52039 1169747 1175333 1180857 1186545 1192474 1199459 1209068 1222090 1237600 1254244 1271969 1291646 1313336
52027 1313336 1335851 1358108 1380115 1402413 1425092 1447659 1469641 1491114 1512695 1534860 1557225
52016 1557225 1578855 1599504 1619999 1640856 1661060 1679043 1694572 1708821 1722664 1735773 1747429
52005 1747429 1757375 1765691 1772580 1778499 1783869 1788437 1791509 1792951 1793328 1792906 1791258 1788164 1784179 1779920
51991 1779920 1775416 1770595 1765800 1761245 1756498 1751104 1745339 1739750 1734381 1729169 1724731 1721806 1719884 1717249
51977 1717249 1712696 1706622 1700139 1693827 1687963 1683459 1681541 1682363 1684692 1687316 1690087 1693006 1694896 1694042
51963 1694042 1690094 1684437 1678620 1673315 1669077 1666856 1666947 1668114 1668752 1668516 1668038 1667548 1666680 1665319 1663473 1660319
51947 1660319 1654449 1645374 1634130 1622238 1610571 1599197 1587500 1574259 1558253 1539045 1516844 1491780
51935 1491780 1464120 1435094 1406405 1378529 1350185 1319857 1287225 1253004 1218257 1184276 1152249
51924 1152249 1122250 1092987 1063115 1032500 1001809 971344 940876 910365 880251 851073 823136
51913 823136 796526 771254 747361 724865 703523 682864 662751 643709 626220 609916 594043
51902 594043 578466 563433 548617 533491 518615 505277 493525 481889 469681 458374 449671 443153
51890 443153 436963 430259 423833 418641 414746 411651 408859 406044 403145 400231 396997 392732 387162 380948
51876 380948 374974 369603 364941 361065 357392 352633 346295 339636 334276 330454 327605 325797 325139 324319 321628
51861 321628 317538 314477 313514 312804 310105 305535 300758 296496 292163 287465 283049 279554 276966 275141 274268
51846 274268 274531 275544 276331 275769 273236 269087 264540 260943 259052 258839 259611 260177 259292 256402 252016 247327
51830 247327 243516 241257 240430 240050 238868 236431 233433 230915 229313 228494 228300 228567 228805 228373 227034 225090
51814 225090 223120 221884 222219 224436 227735 230686 232428 233070 233063 232811 233055 234751 237935 241220 243174 243909
51798 243909 244581 245545 245991 245520 245156 246233 248863 252058 254916 257047 258100 257698 256006 253935 252423 251572
51782 251572 250662 249100 247349 246726 248088 250908 253982 256871 259981 263324 266188 268465 271306 275546 280119
51767 280119 283063 283827 283593 283563 283946 284625 285636 286709 287269 287355 287781 288986 290368 291180 291448 291469 291013 289776
51749 289776 288289 287562 287798 287940 286694 283843 280562 278512 278584 280380 282860 285177 286715 286816 285285 283192
51733 283192 282355 283688 286505 289671 292865 296453 300656 305335 310266 315326 320558 326136 331877 336875
51719 336875 340215 342166 343971 346386 349235 352642 357545 364225 371202 376595 380079 382647 384985 387134
51705 387134 389426 392633 397219 403285 411033 420259 429407 436390 440931 445189 451351 459055 465803 469566
51691 469566 470342 469433 467972 466477 465236 464495 464246 464272 464648 465837 468008 470518 472519 473951 475454 477450
51675 477450 479844 482588 485718 488788 490992 492141 492733 492810 491705 489472 487647 487590 488619 488787 487260 485054
51659 485054 483514 482846 482123 480239 476922 473195 470589 469502 468843 467725 466812 467087 467967 467942 466860 466191
51643 466191 466831 467741 467146 464231 459444 454080 449970 448670 450216 453099 455798 457874 459366 460050 459900
51628 459900 459669 460149 461114 461748 462087 463395 466861 472230 477955 482675 486369 489950 493800 497049 498440
51613 498440 497561 494859 490707 485051 477893 469647 460966 452587 445153 438681 432198 424572 415821 407028
51599 407028 398899 391052 383028 375391 369220 364784 361169 357191 352509 347915 344563 342783 341653 339887
51585 339887 337081 333858 331028 329017 327863 327115 325765 322984 319149 315554 312968 310996 309057 307228
51571 307228 305695 303990 301443 298231 295456 294285 295105 297176 298838 298509 296066 293165 291873 292935 295439
51556 295439 297893 299377 299955 300331 301098 302087 302489 301676 299807 297698 296379 296854 299817 305064 311228 316435
51540 316435 319539 320844 321818 324023 327996 333076 338346 343686 349721 356860 364754 372605 379615 385118
51526 385118 388724 390571 391283 391597 392052 392681 392649 390607 386327 381880 380234 382287 385853 387922 387296 384849
51510 384849 382101 380289 380296 382470 386324 390774 394875 398372 401774 405946 411301 417356 423295 428936 434709
51495 434709 440857 447201 453457 458939 462107 461762 458950 456435 455673 455486 454455 453201 453046 453570 453162 451415
51479 451415 449365 447677 446119 444702 443819 443138 441781 439793 438091 436621 434013 429684 425063 421897 420226
51464 420226 418832 416945 414689 412456 410601 409477 409066 408864 408474 408049 407839 407729 407578 407558 407879 408572 409726
51447 409726 411264 412213 411107 407722 403743 401078 400222 400845 402931 406222 409322 410869 411457 413071 416592
51432 416592 420980 425000 428535 431910 434989 437548 439807 442063 444401 447152 451065 456551 463161 470104
51418 470104 476888 483288 489318 495563 502967 511813 521303 530395 538622 545878 552085 557611 563468 570423
51404 570423 577967 584526 588571 589598 588585 587626 588385 590595 592664 593895 594983 595994 595407 592386 588719
51389 588719 586772 586243 584791 581480 577520 573555 568400 561271 553458 546611 540683 534815 529173 524442
51375 524442 520112 514772 507972 500708 494071 488439 484110 481707 481375 482063 482224 481314 480302 480462 481655
51360 481655 482217 480863 478340 476509 476000 475747 474926 474202 474329 474369 472267 466997 459588 452239 446727 443191
51344 443191 439947 434865 427353 418622 409850 400955 391714 383126 376543 371920 367935 363520 358390 352433
51330 352433 345697 338986 333492 329635 326769 323923 320400 316052 311601 308160 305571 301791 295086 286465
51316 286465 278665 272985 268595 264863 262513 261918 261818 260666 258229 255156 252026 249578 248831 249863 251095
51301 251095 250736 248482 245097 240998 236313 231928 229231 228613 228941 228804 227938 227336 228116 230294 232722 234488
51285 234488 236192 239091 242968 245889 246706 246924 249059 253629 258755 262651 265510 268763 273164 277983 281912
51270 281912 284488 286565 289202 292145 293909 293479 291341 288479 285128 281188 277204 273815 270400 265404
51256 265404 258292 250456 243828 239004 235033 230641 225474 220312 216293 213837 212430 211533 211319 211983 212585
51241 212585 211404 207723 202602 197554 192926 188122 183064 178729 176150 175401 175807 176841 178377 180140 181330
51226 181330 181111 179481 177501 176601 177540 179838 182189 183640 184480 185777 187964 190237 191689 192674 194434
51211 194434 197374 200275 201400 200053 197020 193846 191740 190750 189830 187946 185151 182339 180084 178243 176590
51196 176590 175208 174129 173276 172900 173381 174362 174798 174206 173116 171907 170050 167232 164510 163431 164384 166526
51180 166526 168935 170974 171945 171524 170531 170340 171311 172460 172766 172208 171460 171139 171396 171604 170610 168055 165442
51163 165442 164830 166180 167066 165704 163294 162322 163359 164909 166200 168443 172665 177551 180629 181159 180779
51148 180779 181379 183286 185713 188034 189997 191303 191745 191622 191482 191644 192440 194630 198753 204021 208499 210748
51132 210748 210948 210358 210188 211093 213056 215272 216536 216283 215217 214659 215359 216968 218350 218345 216628 214053 211846
51115 211846 210300 208627 206206 203450 201135 199475 198394 198238 199392 201210 202071 200856 198136 195649 194680
51100 194680 194991 195287 194574 192910 190951 189160 187780 187137 187430 188379 189706 191793 195094 198901 201570 202341
51084 202341 202163 202336 203004 203446 203220 202345 200798 198349 194797 190116 184807 180199 177744 177619 178545 179326
51068 179326 179964 180888 181877 182437 182688 183182 184211 185735 187534 188878 188695 186678 183793 181235 179425 178477
51052 178477 178748 180125 181609 182572 183778 186114 188917 190696 191019 190489 189298 187146 184485 182547 182038
51037 182038 182676 183873 184926 184890 183536 182350 183321 186592 190391 193245 195106 196337 197107 198119 200494
51022 200494 204182 207503 208967 208738 207952 207523 208108 210198 213474 216823 219651 222575 226266 230340 234005
51007 234005 237022 239275 240067 238888 236628 235194 235885 238606 242423 246324 249513 251513 252203 251735 250541
50992 250541 249335 248810 249128 249907 250664 250952 250222 248110 245081 242231 240235 238783 237196 235207 233031 231087
50976 231087 229774 229192 229109 229570 231276 234625 238505 240958 241247 240444 239810 239459 238999 238602 238783 239686 241097
50959 241097 242733 244178 245075 245722 246941 249023 251470 254109 257628 262435 267660 272122 275815 279718 284442
50944 284442 289649 294568 298528 301322 303641 306909 312073 318630 325249 331183 336688 342370 348699 356129
50930 356129 365087 375541 386701 397293 406476 414747 423838 435166 448407 462138 475846 490473
50918 490473 506830 524470 542698 561840 582658 605164 628954 654409 682556 713721 747110
50907 747110 781896 818222 857035 899381 945894 996512 1050474 1106774 1164784 1224373 1285490
50896 1285490 1347773 1410570 1473312 1535899 1598603 1661374 1723209 1782341 1837007 1885950 1928605
50885 1928605 1965409 1997741 2026847 2052689 2074333 2091441 2104803 2115542 2124642 2133291 2142531 2152113
50873 2152113 2160609 2167162 2172405 2177009 2180075 2179651 2174249 2163234 2146261 2123176 2094172 2059329 2018159
50860 2018159 1970090 1915315 1854931 1790536 1723840 1656107 1587800 1519351 1452418 1389446 1331494
50849 1331494 1277386 1225589 1176038 1129437 1085925 1045638 1009737 979357 953778 930918 909505
50838 909505 889634 871456 854723 839811 827797 818977 812248 806626 802606 801260 802359 804156 805114
50825 805114 805381 806341 808888 812506 816127 819496 823227 827800 833292 839996 848355 858002 867833 877521 888116
50810 888116 900547 914423 929040 944757 962448 982292 1004112 1028363 1055587 1085229 1116044
50799 1116044 1147613 1180640 1215996 1254298 1296121 1341804 1391282 1444902 1504034 1570062 1643252
50788 1643252 1723601 1812105 1909773 2015601 2127110 2242991 2363931 2490685 2622625 2758502
50778 2758502 2897392 3038372 3180151 3321390 3460428 3594333 3719251 3832259 3932347
50769 3932347 4019422 4093334 4154252 4203106 4241114 4269533 4290215 4305744 4318621 4330952 4344962
50758 4344962 4362760 4384918 4409984 4435870 4461037 4483866 4501692 4511233 4509572 4494286 4463383 4415997
50746 4415997 4352755 4274813 4182671 4076365 3956564 3825118 3684944 3539863 3394151 3251449
50736 3251449 3113922 2982664 2858698 2743260 2637245 2540877 2454130 2377391 2311439 2256572
50726 2256572 2211866 2175881 2148326 2130322 2122350 2122488 2127633 2136003 2147255 2160433 2173486 2185304
50714 2185304 2196761 2208720 2219959 2228128 2232139 2232569 2230078 2224485 2215463 2203341 2188818 2172096 2152462
50701 2152462 2128807 2100702 2068925 2034747 1998904 1961606 1923221 1884284 1845011 1805690 1767573
50690 1767573 1732466 1701296 1674008 1650950 1633170 1620937 1613209 1609218 1609423 1614143 1622452 1633683
50678 1633683 1649062 1670437 1697941 1730297 1767098 1809386 1858175 1913737 1976284 2045874 2121377
50667 2121377 2200946 2284096 2372075 2465264 2561141 2655883 2747470 2836102 2921819 3002898 3076857
50656 3076857 3142182 3198427 3245113 3281255 3305963 3319081 3321296 3314208 3300519 3283541 3265811 3248131
50644 3248131 3230226 3212331 3195897 3182924 3174976 3172718 3175726 3182465 3190625 3197722 3201425 3199647 3190760
50631 3190760 3173760 3147983 3112870 3068403 3015636 2956380 2892569 2826305 2760143 2696419 2636215
50620 2636215 2579642 2527102 2479639 2438226 2403701 2377379 2360511 2352811 2352678 2359425 2374376 2399159
50608 2399159 2433921 2478057 2531789 2595829 2669837 2752109 2840509 2932902 3026912 3120063 3210192
50597 3210192 3295397 3373950 3444802 3507995 3564126 3613598 3656502 3692831 3722431 3745249 3761884
50586 3761884 3773269 3779562 3780190 3775469 3767144 3756737 3744457 3730790 3718052 3708912 3704054 3702682 3704787
50573 3704787 3711295 3722287 3736726 3753941 3773854 3795679 3817863 3839475 3860076 3877975 3890415
50562 3890415 3896345 3897509 3895768 3890656 3880842 3866938 3851248 3835307 3819296 3803957 3791724 3785343
50550 3785343 3785931 3792628 3803683 3817624 3833733 3851607 3870148 3887069 3899689 3906311 3906633 3900781 3888106
50537 3888106 3866945 3835380 3792192 3737259 3671330 3595581 3511327 3419892 3322636 3221285 3118151
50526 3118151 3015528 2914505 2814816 2716414 2620983 2531210 2448570 2372510 2301897 2236577 2177152
50515 2177152 2123866 2076318 2034134 1997475 1966863 1942519 1923764 1909069 1897089 1887909 1883077 1884177
50503 1884177 1891397 1903587 1919477 1938680 1961634 1988785 2019891 2054210 2091387 2131977 2176951
50492 2176951 2227033 2282900 2345639 2416182 2494125 2577795 2665848 2758228 2855148 2955518 3057038
50481 3057038 3157760 3257054 3354916 3450614 3542270 3627945 3707245 3781848 3854296 3926363 3998785
50470 3998785 4072316 4148322 4227976 4311299 4397444 4485709 4576033 4668813 4764857 4865527 4972358
50459 4972358 5086059 5205778 5329342 5454151 5577908 5698634 5814282 5922491 6020813 6107072
50449 6107072 6179434 6236234 6275820 6296500 6296581 6274864 6231487 6168195 6087421 5991185 5881360 5761011
50437 5761011 5634838 5508005 5384845 5268712 5162358 5067779 4986070 4918104 4865291 4829032
50427 4829032 4809348 4804395 4811249 4826479 4845724 4863551 4874629 4874926 4861208 4829650 4776124 4698547
50415 4698547 4598475 4479869 4346677 4202179 4049991 3894197 3737988 3582982 3430330
50406 3430330 3281720 3138821 3002501 2873374 2752445 2640278 2536093 2438894 2349248 2268614
50396 2268614 2196900 2132130 2072957 2020194 1975033 1936853 1903854 1875055 1850437 1829622 1811871
50385 1811871 1797434 1787601 1782935 1782378 1784562 1789383 1797729 1810179 1826513 1846228 1868953 1894493 1922895
50372 1922895 1954503 1989744 2028799 2071481 2117084 2164219 2211248 2257528 2304192 2353300 2406155
50361 2406155 2462602 2521592 2581755 2641462 2699334 2755296 2810623 2866322 2921787 2975652 3027850
50350 3027850 3080197 3134968 3193391 3255413 3320229 3386827 3454517 3523162 3592402 3660644 3725517
50339 3725517 3785659 3841420 3893318 3940356 3980430 4011881 4033925 4045945 4047184 4037087 4015149
50328 4015149 3980420 3931793 3868962 3792798 3705055 3608373 3506373 3402682 3299554 3198088
50318 3198088 3099891 3007547 2923104 2847175 2780247 2723980 2680083 2648401 2627136 2614627 2609680
50307 2609680 2610332 2613722 2617675 2621195 2622749 2619140 2607157 2585728 2555450 2516570 2468893 2413620 2353692
50294 2353692 2291645 2228051 2162744 2096651 2031424 1967853 1905704 1844858 1785634 1728209 1672844
50283 1672844 1620780 1573775 1532275 1494882 1460112 1427884 1398828 1372981 1350035 1330239 1313984
50272 1313984 1300727 1289341 1279681 1272970 1270344 1271436 1274666 1278581 1282880 1288501 1296884 1308786 1323632
50259 1323632 1340096 1357379 1375740 1395835 1417749 1440858 1464542 1488916 1514658 1541959 1569818
50248 1569818 1596818 1622689 1648711 1676420 1706343 1737996 1770315 1801677 1830261 1855202 1876926
50237 1876926 1895690 1910379 1919748 1924393 1926260 1926232 1923425 1917063 1907938 1897474 1886168 1873519 1858844
50224 1858844 1841654 1821792 1799726 1776268 1751572 1724808 1695405 1664402 1634006 1605801 1579495
50213 1579495 1553388 1526018 1497670 1470391 1446217 1425219 1405497 1385114 1363605 1341669 1320128
50202 1320128 1299673 1281110 1265128 1251647 1239733 1228403 1217574 1208196 1201263 1196682 1193385 1190680
50190 1190680 1188924 1188477 1188730 1188999 1189822 1192212 1195949 1199945 1204254 1210154 1217884 1225719 1232016 1236956 1241504
50175 1241504 1245873 1250016 1254418 1259102 1262732 1264097 1263889 1263578 1263002 1260557 1255597 1249137 1242089 1234220 1225159
50160 1225159 1215181 1204519 1193006 1181018 1170025 1161582 1156178 1153238 1151630 1149992 1147433 1144397 1142178
50147 1142178 1141212 1140494 1139081 1137330 1135979 1134878 1133651 1133118 1134811 1138972 1143994 1148126 1150938 1152796 1153700
50132 1153700 1153404 1152309 1151334 1150733 1149629 1146955 1142500 1136671 1129635 1121205 1111542 1101481 1092009 1083628
50118 1083628 1076177 1068937 1060880 1051367 1040821 1030354 1020567 1011122 1001632 992299 983334 974492 965976
50105 965976 959223 955608 954420 953275 950861 948273 947016 946472 944413 939865 934657 931728 932247 934642 936240
50090 936240 935625 933459 931370 930300 929841 928779 926224 922546 919459 918773 920683 923441 925086 925338 925463
50075 925463 926537 928513 930956 933935 937768 942302 946881 950960 954647 958802 964620 972694 982243 991447
50061 991447 998912 1004742 1010070 1015686 1021434 1026836 1031949 1037344 1043280 1049225 1054451 1059017 1063768 1069248
50047 1069248 1074981 1080087 1084228 1087536 1089961 1091434 1092668 1095038 1099279 1104745 1110271 1115541 1121287 1128389
50033 1128389 1137125 1147357 1159207 1173453 1190913 1211249 1232536 1252569 1270809 1288868 1308980
50022 1308980 1332250 1358290 1386023 1414611 1443985 1474907 1508355 1544654 1583290 1623658 1665808
50011 1665808 1710437 1758499 1810924 1868211 1929987 1995308 2063807 2136324 2214109 2297699 2386826
50000 2386826 2480968 2579320 2680456 2782599 2884109 2983019 3076165 3159725 3231215 3290752 3340227
49989 3340227 3381794 3417533 3449737 3480327 3509744 3536985 3560890 3580732 3595041 3600383 3592285 3567701
49977 3567701 3526244 3469138 3397836 3314229 3221548 3123801 3023886 2922831 2821246 2721037 2625107
49966 2625107 2535529 2452535 2375343 2303556 2237465 2177136 2121516 2068783 2017825 1969392 1925527
49955 1925527 1887666 1855317 1826568 1799664 1774048 1750332 1729678 1713025 1700369 1690632 1682401 1674938
49943 1674938 1668395 1663170 1659264 1656132 1652985 1649290 1645262 1641740 1639243 1637124 1634044 1629330 1623525 1617541
49929 1617541 1611700 1605843 1599905 1593883 1587401 1579858 1571186 1562245 1554289 1548012 1543084 1538578 1533912 1529480
49915 1529480 1526378 1525488 1526880 1530006 1534356 1539986 1547557 1557816 1570750 1585264 1600072 1615135 1631988
49902 1631988 1652509 1677579 1706970 1739944 1775583 1813051 1852287 1894327 1940396 1990606 2044077
49891 2044077 2100495 2161261 2228957 2305861 2392864 2489670 2596027 2712698 2840542 2978228
49881 2978228 3121456 3265294 3406914 3545088 3677533 3800472 3911392 4010957 4101657 4185690
49871 4185690 4264847 4340986 4414955 4485338 4549267 4604082 4647277 4675469 4684856 4672727 4637780
49860 4637780 4579587 4499165 4399863 4286016 4160379 4024177 3879751 3731428 3582861 3434917
49850 3434917 3287348 3141536 3000162 2864668 2734403 2608396 2487150 2372577 2266693
49841 2266693 2170360 2082872 2002658 1928441 1859423 1794487 1732230 1672451 1616949 1567949 1525824
49830 1525824 1488800 1454420 1420782 1387020 1353674 1322302 1293754 1266871 1239741 1212144 1185803
49819 1185803 1162144 1140909 1121279 1103361 1087831 1074677 1062996 1051740 1040235 1028287 1016401
49808 1016401 1005855 998043 993354 990680 988144 984577 980448 977259 975915 975933 976455 977564 979993 983848
49794 983848 988365 993059 998322 1004639 1011780 1019204 1026785 1034734 1043089 1051716 1060666 1070213 1080666 1092333
49780 1092333 1105644 1121130 1139185 1159749 1182202 1205870 1230970 1258787 1290429 1325654 1363679
49769 1363679 1405069 1451864 1505525 1565663 1631307 1702688 1780963 1866714 1959551 2058820 2163578
49758 2163578 2271689 2379602 2483383 2579687 2665940 2740430 2802787 2854287 2897416 2934950 2969121
49747 2969121 3001156 3031409 3059725 3085272 3105765 3117399 3116286 3099988 3067261 3016829 2947615
49736 2947615 2860528 2759271 2648924 2534136 2418723 2305882 2197751 2095032 1997793 1906566
49726 1906566 1822134 1744584 1673359 1608170 1549125 1495890 1447419 1402827 1362072 1325536 1293300
49715 1293300 1265020 1240051 1217404 1195924 1174827 1153999 1133788 1114912 1098434 1085165 1074798
49704 1074798 1066185 1058694 1052627 1047902 1043280 1037766 1032136 1027887 1024952 1021609 1016737 1011126 1006259 1002698
49690 1002698 1000085 998001 996296 994995 994297 994374 994991 995633 996145 996778 997613 998604 1000283 1003542 1008385 1013542
49674 1013542 1017808 1021011 1023241 1024084 1023467 1022641 1023228 1025573 1028748 1031869 1034526 1036265 1036683 1036138 1035523 1035250
49658 1035250 1035144 1035378 1036607 1038832 1040896 1041722 1041753 1042658 1045559 1049748 1053274 1054773 1054587 1053893 1053094 1051727
49642 1051727 1049923 1048849 1049102 1049624 1049163 1048151 1048046 1049298 1051141 1052981 1054592 1055065 1053201 1049317 1045347
49627 1045347 1042623 1040683 1038739 1037035 1035938 1034830 1033126 1031724 1032236 1034878 1037932 1039256 1037819 1034069
49613 1034069 1029414 1025213 1021769 1018343 1014357 1010257 1006913 1004610 1003100 1002328 1002604 1004221 1007229 1011277
49599 1011277 1015216 1017252 1016147 1012441 1008329 1006234 1007243 1010269 1012591 1011948 1008572 1004796 1002450 1001305
49585 1001305 1000378 999777 1000285 1001734 1002927 1003039 1002230 1000959 999523 998346 998058 999082 1001388 1004434 1007069
49570 1007069 1008017 1007215 1006435 1007727 1011286 1015456 1018717 1020969 1023101 1026084 1030444 1035849 1041183 1045791 1050493
49555 1050493 1056575 1063930 1071384 1078874 1087977 1099772 1113401 1127344 1141069 1154619 1167593 1179686
49543 1179686 1191650 1204521 1218241 1232034 1245924 1260936 1277852 1296546 1316438 1336908 1357430
49532 1357430 1378148 1400280 1425040 1452079 1479861 1507667 1536199 1565938 1596003 1625412 1654711
49521 1654711 1685447 1718454 1753485 1790151 1828260 1867194 1905949 1944267 1983361 2025173 2071071
49510 2071071 2121177 2174489 2229443 2284688 2339857 2395687 2453357 2513623 2576378 2640837 2706233
49499 2706233 2772613 2840908 2911926 2985319 3059878 3134864 3210521 3287147 3364146 3440480 3515740
49488 3515740 3590230 3664044 3736499 3806525 3873265 3936087 3994263 4046896 4093259 4133069 4166364
49477 4166364 4193188 4213575 4227780 4236218 4239029 4236099 4227929 4216041 4201811 4185113 4165145 4142702
49465 4142702 4120541 4100862 4083346 4066439 4049855 4034747 4022042 4011925 4004838 4001673 4002690 4007207
49453 4007207 4014769 4025841 4040843 4059197 4079882 4102561 4127622 4155247 4184649 4214169 4242227
49442 4242227 4268534 4294247 4320420 4346298 4369758 4389373 4405210 4417360 4424631 4425370 4419031 4406218
49430 4406218 4387401 4362186 4329718 4289476 4241763 4187649 4128198 4063677 3993762 3918581 3839174
49419 3839174 3756902 3673029 3588981 3506253 3425552 3346556 3268852 3192473 3117116 3041830 2966448
49408 2966448 2892859 2823702 2759789 2699607 2641418 2585097 2531778 2482330 2436572 2393750 2353592
49397 2353592 2316793 2284210 2255482 2228809 2202461 2176183 2150823 2127039 2105034 2085263 2068538
49386 2068538 2055194 2044622 2035759 2027881 2020934 2015333 2011351 2008597 2006263 2004052 2002504 2002118 2002580 2003353
49372 2003353 2004618 2007118 2011291 2017133 2024722 2034322 2045981 2059324 2073606 2087847 2101489 2115412
49360 2115412 2131666 2151407 2173641 2196843 2221229 2248052 2276816 2304678 2329104 2350070 2369188
49349 2369188 2387668 2405878 2424211 2443436 2464201 2486469 2509429 2531989 2553795 2575779 2599242
49338 2599242 2624443 2650658 2677467 2705013 2732871 2759856 2785591 2811279 2837950 2864591 2889039
49327 2889039 2910530 2930440 2950591 2971538 2992644 3013113 3032669 3051502 3069738 3086862 3101984
49316 3101984 3115194 3128509 3144658 3164452 3185733 3205501 3223043 3240524 3260467 3283191 3307052
49305 3307052 3330718 3354408 3378845 3404037 3429775 3456757 3486149 3517970 3550683 3582695 3613825
49294 3613825 3645222 3678487 3715095 3755893 3800386 3846866 3893933 3941872 3992035 4045010 4100093
49283 4100093 4156733 4215702 4278204 4344136 4412087 4481179 4552315 4627219 4706659 4790036 4876358
49272 4876358 4964971 5055610 5148540 5244678 5344800 5448449 5554295 5661721 5771169 5882695
49262 5882695 5995237 6107918 6220996 6334575 6447319 6557692 6665783 6772557 6877761
49253 6877761 6979924 7078017 7171484 7258849 7338183 7409266 7473455 7530772 7578765 7615210 7640529
49242 7640529 7656448 7663510 7661345 7650500 7632527 7608630 7579434 7545797 7508801 7469149 7427465 7384960
49230 7384960 7342914 7301787 7261606 7223060 7187430 7155798 7129051 7108189 7093488 7083746 7077552 7075183
49218 7075183 7078010 7086152 7098139 7113146 7132075 7155813 7183680 7214368 7247285 7281926 7316811 7350198
49206 7350198 7381283 7409643 7434064 7453169 7466862 7475750 7479049 7474438 7460452 7437817 7407819 7370357
49194 7370357 7324534 7270269 7208124 7138019 7059655 6974381 6885428 6795561 6705191 6613272 6519422
49183 6519422 6424477 6329544 6235354 6142424 6051076 5961280 5873110 5787415 5705382 5627294 5552315
49172 5552315 5479650 5409166 5340564 5272873 5205785 5141091 5081541 5027981 4978512 4930882 4884940
49161 4884940 4841990 4802462 4765526 4730973 4700036 4673719 4651298 4631506 4614547 4601736 4593336
49150 4593336 4587987 4584359 4582202 4581506 4581833 4583008 4585433 4588987 4592684 4596329 4601625 4610357 4622169 4635385
49136 4635385 4649437 4664911 4681502 4697692 4712808 4727854 4743889 4760919 4779067 4799449 4822756
49125 4822756 4847719 4872096 4894747 4916056 4936740 4957125 4977321 4997312 5016870 5035889 5054717
49114 5054717 5073738 5092736 5110977 5127869 5143374 5157998 5172639 5188151 5204714 5221637 5237833
49103 5237833 5252474 5265449 5277669 5290720 5305501 5321137 5336023 5350057 5364923 5381870 5400309
49092 5400309 5419343 5439713 5462950 5489019 5516061 5542621 5569156 5596951 5626230 5655965 5685451
49081 5685451 5715593 5748268 5784336 5822461 5860114 5895571 5928697 5960223 5990986 6021797 6053146
49070 6053146 6084669 6115403 6144668 6172268 6198002 6221918 6244977 6268235 6291015 6311165 6327749
49059 6327749 6342276 6356383 6369505 6380056 6387849 6393788 6397751 6398565 6396168 6392338 6388872 6386018 6383162
49046 6383162 6380253 6378011 6376978 6376729 6376127 6374503 6372554 6371617 6372050 6373092 6374481 6377131 6381604 6387007 6392349
49031 6392349 6398052 6404891 6412350 6419501 6426866 6435735 6445919 6455757 6464249 6471649 6477983 6482746 6486320 6490026
49017 6490026 6494185 6497573 6499359 6500275 6501146 6501490 6500288 6496946 6490681 6480261 6465520 6448248 6430323 6411717
49003 6411717 6391513 6370205 6349437 6329613 6309125 6286197 6260514 6232770 6203568 6173313 6142594
48992 6142594 6112022 6081692 6050989 6018873 5984418 5947415 5908673 5869587 5831178 5793553 5756430
48981 5756430 5720127 5685745 5654061 5624304 5594474 5563237 5531399 5501338 5475117 5453209 5434593
48970 5434593 5417685 5401392 5385742 5371548 5359334 5348895 5340053 5333285 5328976 5326488 5324661 5322996
48958 5322996 5321649 5320716 5320479 5322227 5327572 5336504 5346907 5356393 5364088 5370546 5376711 5383421 5391296 5400536
48944 5400536 5410863 5421728 5432359 5441946 5450451 5459196 5469686 5481759 5493610 5503814 5512467 5520098
48932 5520098 5526470 5531088 5534273 5537093 5540547 5545092 5550474 5555809 5560285 5563910 5566894 5568308 5566473 5561123
48918 5561123 5554153 5547461 5540908 5533262 5524445 5515701 5507878 5500498 5492455 5482931 5471840 5460020 5448836
48905 5448836 5438875 5429153 5418250 5406290 5395080 5386145 5379131 5372478 5365325 5358300 5352485 5348151 5345043
48892 5345043 5343626 5345028 5349220 5354140 5357815 5361066 5366862 5377065 5391116 5408029 5428063 5451620 5477819
48879 5477819 5505377 5534126 5564569 5596551 5629507 5663669 5700141 5739889 5783263 5830172 5880085
48868 5880085 5932162 5985927 6041477 6098662 6156781 6215735 6276643 6340429 6406552 6474127 6543456
48857 6543456 6615097 6688100 6760979 6834258 6910117 6989143 7069149 7148098 7226803 7307596 7391290
$$ [...]
##END NTUPLES=NMR SPECTRUM
##END=
