##TITLE=coffee_type TOLI01-ROVE100E_80-20%
COFFEE_meoh_noesyp64 COFFEE_meoh {C:\Bruker\TOPSPIN} Administrator 3
##JCAMPDX= 6.0         $$ Bruker NMR JCAMP-DX V2.0
##DATA TYPE= NMR SPECTRUM
##DATA CLASS= NTUPLES
##ORIGIN= Bruker BioSpin GmbH
##OWNER= Administrator
$$ 1.72 TOPSPIN		Version 2.1
$$ 2012-05-18 15:43:32.729 -0700  Administrator@X
$$ Compression mode = diff/dup
##.OBSERVE FREQUENCY= 400.13188235
##.OBSERVE NUCLEUS= ^1H
##.ACQUISITION MODE= SIMULTANEOUS (DQD)
##.ACQUISITION SCHEME= undefined
##.AVERAGES= 64
##.DIGITISER RES= 22
##SPECTROMETER/DATA SYSTEM= spect
##.PULSE SEQUENCE= noesygpps1d.comp
##.SOLVENT NAME= COFFEE_meoh
##.SHIFT REFERENCE= INTERNAL, COFFEE_meoh, 1, 14.98061
##AUDIT TRAIL= $$ (NUMBER, WHEN, WHO, WHERE, PROCESS, VERSION, WHAT)
$$ ##TITLE= Audit trail, TOPSPIN		Version 2.1
$$ ##JCAMPDX= 5.01
$$ ##ORIGIN= Bruker BioSpin GmbH
$$ ##OWNER= Administrator
$$ $$ C:\Bruker\TOPSPIN/data/Administrator/nmr/12-COFFEE-2302/42/pdata/1/auditp.txt
$$ ##AUDIT TRAIL=  $$ (NUMBER, WHEN, WHO, WHERE, PROCESS, VERSION, WHAT)
(   1,<2012-02-23 20:02:22.422 -0500>,<Administrator>,<TOPSPIN>,<go>,<TOPSPIN 2.1>,
      <created by zg
	started at 2012-02-23 19:50:52.141 -0500,
	POWCHK enabled, PULCHK disabled,
       configuration hash MD5:
       B0 76 FB 9C 50 81 44 7D 18 B3 26 32 4E 60 AD 96
       data hash MD5: 64K
       81 2B F6 32 27 EB 8B 46 C2 08 53 98 5A 77 27 D1>)
(   2,<2012-02-23 20:02:25.453 -0500>,<Administrator>,<TOPSPIN>,<proc1d>,<TOPSPIN 2.1>,
      <Start of raw data processing
       efp LB = 0.3 FT_mod = 6 PKNL = 1 PHC0 = 0 PHC1 = 0 SI = 128K 
       data hash MD5: 128K
       9C 4A 5E 41 A2 A6 7B 4B D3 1A 2E 0B 09 E7 AB 94>)
(   3,<2012-02-23 20:02:26.859 -0500>,<Administrator>,<TOPSPIN>,<proc1d>,<TOPSPIN 2.1>,
      <pk PHC0 = 21.62659 PHC1 = 0 
       data hash MD5: 128K
       AE 7F CA 54 05 E1 58 97 AA 84 AB 4B 3B CC B2 24>)
(   4,<2012-02-23 20:02:27.266 -0500>,<Administrator>,<TOPSPIN>,<proc1d>,<TOPSPIN 2.1>,
      <abs ABSG = 1 
       data hash MD5: 128K
       7E AE F9 8C E1 63 1D D1 B2 BF 02 B0 2C DF 47 04>)
(   5,<2012-02-23 20:02:27.437 -0500>,<Administrator>,<TOPSPIN>,<proc1d>,<TOPSPIN 2.1>,
      <abs ABSG = 2 
       data hash MD5: 128K
       F4 0A 76 F7 D6 A7 89 8D F6 85 61 8B B0 4D EF 37>)
(   6,<2012-02-23 20:02:27.594 -0500>,<Administrator>,<TOPSPIN>,<proc1d>,<TOPSPIN 2.1>,
      <abs ABSG = 3 
       data hash MD5: 128K
       53 16 CB 56 10 5C 56 5C BA 6E 74 60 D2 D3 52 3C>)
(   7,<2012-02-23 20:02:27.937 -0500>,<Administrator>,<TOPSPIN>,<proc1d>,<TOPSPIN 2.1>,
      <abs ABSG = 4 
       data hash MD5: 128K
       2F F2 C5 18 30 20 09 1B 46 50 DA 68 7C E3 81 9A>)
(   8,<2012-02-23 20:02:28.094 -0500>,<Administrator>,<TOPSPIN>,<proc1d>,<TOPSPIN 2.1>,
      <abs ABSG = 5 
       data hash MD5: 128K
       F4 53 D8 9D EC 8D 74 D5 F4 62 F6 83 F6 1B 12 85>)
(   9,<2012-02-23 20:02:28.297 -0500>,<Administrator>,<TOPSPIN>,<audit>,<TOPSPIN 2.1>,
      <user comment:
       ICON-NMR User ID: Administrator
$$ [...]
150 150 150 150 150 150 150 150
##$TP07= 0
##$TPNAME0= <>
##$TPNAME1= <>
##$TPNAME2= <>
##$TPNAME3= <>
##$TPNAME4= <>
##$TPNAME5= <>
##$TPNAME6= <>
##$TPNAME7= <>
##$TPOAL= (0..7)
0.5 0.5 0.5 0.5 0.5 0.5 0.5 0.5
##$TPOFFS= (0..7)
0 0 0 0 0 0 0 0
##$TUNHIN= 0
##$TUNHOUT= 0
##$TUNXOUT= 0
##$USERA1= <user>
##$USERA2= <user>
##$USERA3= <user>
##$USERA4= <user>
##$USERA5= <user>
##$V9= 5
##$VALIST= <valist>
##$VCLIST= <CCCCCCCCCCCCCCC>
##$VD= 0
##$VDLIST= <DDDDDDDDDDDDDDD>
##$VPLIST= <PPPPPPPPPPPPPPP>
##$VTLIST= <TTTTTTTTTTTTTTT>
##$WBST= 1024
##$WBSW= 4
##$XGAIN= (0..3)
0 0 0 0
##$XL= 0
##$YL= 0
##$YMAX_a= 14996568
##$YMIN_a= -6844424
##$ZGOPTNS= <>
##$ZL1= 120
##$ZL2= 120
##$ZL3= 120
##$ZL4= 120
##$ABSF1= 14.98061
##$ABSF2= -5.57192
##$ABSG= 5
##$ABSL= 3
##$ALPHA= 0
##$AQORDER= 0
##$ASSFAC= 0
##$ASSFACI= 0
##$ASSFACX= 0
##$ASSWID= 0
##$AUNMP= <proc_prof1d_extract>
##$AXLEFT= 0
##$AXNAME= <>
##$AXNUC= <1H>
##$AXRIGHT= 0
##$AXTYPE= 0
##$AXUNIT= <>
##$AZFE= 0.1
##$AZFW= 0.1
##$BCFW= 0
##$BC_mod= 0
##$BYTORDP= 0
##$COROFFS= 0
##$CY= 15
##$DATMOD= 1
##$DC= 0
##$DFILT= <>
##$DTYPP= 0
##$F1P= 0
##$F2P= 0
##$FCOR= 0.5
##$FTSIZE= 131072
##$FT_mod= 6
##$GAMMA= 0
##$GB= 0
##$INTBC= 1
##$INTSCL= 1
##$ISEN= 128
##$LB= 0.3
##$LEV0= 0
##$LPBIN= 0
##$MAXI= 10000
##$MC2= 0
##$MEAN= 0
##$ME_mod= 0
##$MI= 0
##$NCOEF= 0
##$NC_proc= -3
##$NLEV= 6
##$NOISF1= 0
##$NOISF2= 0
##$NSP= 0
##$NTH_PI= 0
##$NZP= 0
##$OFFSET= 14.98061
##$PC= 1
##$PHC0= 21.62659
##$PHC1= 0
##$PH_mod= 1
##$PKNL= yes
##$PPARMOD= 0
##$PPDIAG= 0
##$PPIPTYP= 0
##$PPMPNUM= 2147483647
##$PPRESOL= 1
##$PSCAL= 4
##$PSIGN= 0
##$PYNMP= <proc.py>
##$REVERSE= no
##$SF= 400.13
##$SI= 131072
##$SIGF1= 0
##$SIGF2= 0
##$SINO= 400
##$SIOLD= 131072
##$SPECTYP= <>
##$SREGLST= <1H.CDCl3>
##$SSB= 0
##$STSI= 131072
##$STSR= 0
##$SW_p= 8223.68421052632
##$SYMM= 0
##$S_DEV= 0
##$TDeff= 65536
##$TDoff= 0
##$TI= <>
##$TILT= no
##$TM1= 0
##$TM2= 0
##$TOPLEV= 0
##$USERP1= <user>
##$USERP2= <user>
##$USERP3= <user>
##$USERP4= <user>
##$USERP5= <user>
##$WDW= 1
##$XDIM= 131072
##$YMAX_p= 526886908
##$YMIN_p= -243509627
##$CURPLOT= <Network HP LaserJet P1505>
##$CURPRIN= <$Network HP LaserJet P1505>
##$DFORMAT= <normdp>
##$LAYOUT= <+/1D_H.xwp>
##$LFORMAT= <normlp>
##$PFORMAT= <normpl>
##$SURQMSG= 1
$$ End of Bruker specific parameters
$$ ---------------------------------
##NTUPLES= NMR SPECTRUM
##VAR_NAME=  FREQUENCY,     SPECTRUM/REAL,   SPECTRUM/IMAG
##SYMBOL=    X,             R,               I
##VAR_TYPE=  INDEPENDENT,   DEPENDENT,       DEPENDENT
##VAR_FORM=  AFFN,          ASDF,            ASDF
##VAR_DIM=   131072,        131072,          131072
##UNITS=     HZ,            ARBITRARY UNITS, ARBITRARY UNITS
##FACTOR=    0.0627417313425165, 1,          1
##FIRST=     8223.62146879498, 9291,         -97215
##LAST=      0,             13004,           -95956
##MIN=       0,             -243509627,      0
##MAX=       8223.62146879498, 526886908,    0
$$ Real data points
##PAGE= N=1
##DATA TABLE= (X++(R..R)), XYDATA
$$ [...]
$$ plain form
62949 3083717 3026056 2971740 2922510 2879624 2843113 2812090 2786350 2767023 2755150 2750501 2752578 2761773
62937 2761773 2778235 2800249 2825345 2852886 2884157 2919853 2958926 3000175 3043439 3088502 3133936
62926 3133936 3177996 3219998 3260154 3298580 3334954 3368551 3398122 3422303 3440527 3452740 3457712
62915 3457712 3452527 3434644 3403904 3361640 3308503 3244381 3170230 3088604 3002075 2912065 2819608
62904 2819608 2726213 2633106 2540154 2446730 2353951 2265283 2184173 2111212 2044113 1980435 1919685
62893 1919685 1862713 1809974 1761187 1716127 1674685 1636163 1599444 1564119 1530800 1500060 1471621
62882 1471621 1444836 1419423 1395374 1372512 1350483 1328961 1307706 1286651 1265914 1245492 1225134
62871 1225134 1204964 1185977 1169173 1154295 1140187 1126355 1113331 1101500 1090711 1081237 1073876 1068480
$$ packed form
62949C083717n7661n4316m9230m2886l6511l1023k5740j9327j1873m649K077R195
62937B761773J6462K2014K5096K7541L1271L5696L9073M1249M3264M5063M5434
62926C133936M4060M2002M0156L8426L6374L3597K9571K4181J8224J2213M972
62915C457712n185j7883l0740m2264n3137o4122p4151q1626q6529r0010r2457
62904B819608r3395r3107r2952r3424r2779q8668q1110p2961o7099o3678o0750
62893A919685n6972n2739m8787m5060m1442l8522l6719l5325l3319l0740k8439
62882A471621k6785k5413k4049k2862k2029k1522k1255k1055k0737k0422k0358
62871A225134k0170j8987j6804j4878j4108j3832j3024j1831j0789r474p361n396
$$ plain form
62859 1068480 1063481 1057675 1051663 1046691 1042820 1039106 1035022 1030748 1026514 1022557 1019316 1016852 1014356 1011038
62845 1011038 1007177 1003480 999723 994980 989041 982818 977336 973013 969805 967346 965010 962404 959746 957268
62831 957268 954587 951380 948291 946177 944662 942506 939381 936075 932692 928033 921527 914761 910028 907874
62817 907874 907064 906636 906775 907510 907725 906341 904048 902868 903871 906055 907845 909046 910514 912232 912750 910802
62801 910802 906703 901764 896995 892931 890108 888903 889032 889731 890326 890324 889289 887167 884480 881769 879017 876044
62785 876044 873179 871126 870438 871491 874387 878233 881105 881812 881451 882167 884382 886419 887110 887592 889827 894081
62769 894081 898787 902649 906161 910855 917299 924053 928777 930470 930348 930301 930972 931909 933096 935080 937474
62754 937474 938693 937985 936927 937919 941569 946443 951100 955288 958994 961386 961606 960265 959346 960478 963796
$$ packed form
62859A068480m999n806o012m972l871l714m084m274m234l957l241k464k496l318
62845A011038l861l697l757m743n939o223n482m323l208k459k336k606k658k478
62831I57268k681l207l089k114j515k156l125l306l383m659o506o766m733k154
62817I07874q10m28J39P35K15j384k293j180J003K184J790J201J468J718N18j948
62801I10802m099m939m769m064k823j205J29O99N95kj035k122k687k711k752k973
62785H76044k865k053o88J053K896L846K872P07l61P16K215K037O91M82K235M254
62769H94081M706L862L512M694O444O754M724J693j22m7O71R37J187J984K394
62754I37474J219p08j058R92L650M874M657M188L706K392K20j341r19J132L318
$$ plain form
62739 963796 968697 975182 983921 995195 1008443 1022962 1038520 1055053 1072254 1089865 1108063 1127255
62727 1127255 1147777 1170144 1195118 1222884 1252419 1282427 1312966 1345690 1382570 1424872 1473108
62716 1473108 1527030 1585375 1646463 1709743 1776433 1848262 1925842 2008536 2095352 2185203 2276363
62705 2276363 2366414 2453066 2534866 2611001 2680710 2742923 2796008 2837453 2864148 2873734 2866074 2843132
62693 2843132 2807245 2759730 2701185 2632518 2555213 2471138 2382813 2293497 2205868 2120437 2036117
62682 2036117 1952603 1871439 1794472 1722220 1654351 1590964 1532560 1479192 1430370 1385558 1344205
62671 1344205 1305755 1270226 1238368 1210641 1186440 1164936 1146080 1129935 1115665 1102350 1090552
62660 1090552 1081805 1076523 1073428 1071079 1068892 1066585 1063905 1061449 1060848 1063511 1069741 1079303 1091987 1107158
$$ packed form
62739I63796M901O485Q739J1274J3248J4519J5558J6533J7201J7611J8198J9192
62727A127255K0522K2367K4974K7766K9535L0008L0539L2724L6880M2302M8236
62716A473108N3922N8345O1088O3280O6690P1829P7580Q2694Q6816Q9851R1160
62705B276363R0051Q6652Q1800P6135O9709O2213N3085M1445K6695R586p660k2942
62693B843132l5887m7515n8545o8667p7305q4075q8325q9316q7629q5431q4320
62682B036117q3514q1164p6967p2252o7869o3387n8404n3368m8822m4812m1353
62671A344205l8450l5529l1858k7727k4201k1504j8856j6145j4270j3315j1798
62660A090552q747n282l095k349k187k307k680k456o01K663O230R562J2684J5171
$$ plain form
62646 1107158 1123694 1141245 1161120 1185181 1214069 1246953 1282733 1321021 1362201 1406961 1455692
62635 1455692 1508199 1564274 1624639 1690719 1763110 1840721 1921997 2006660 2095638 2189370 2286526
62624 2286526 2384213 2478997 2567940 2649211 2721808 2784401 2834468 2868974 2886044 2885755 2869275 2837584
62612 2837584 2791382 2731912 2661215 2581229 2493088 2397867 2297912 2196608 2096517 1998404 1902571
62601 1902571 1810442 1723819 1642940 1566518 1493824 1425604 1362434 1303323 1246957 1193784 1145687
62590 1145687 1103563 1066099 1031189 997894 966538 937300 909468 882317 856335 833015 813209
62579 813209 795969 779426 762784 746976 733168 721115 709558 698016 687366 678317 670016 660999
62567 660999 651362 642987 637209 633042 628497 623187 618568 615671 613627 610845 606907 602896 600369 600342 602657
$$ packed form
62646A107158J6536J7551J9875K4061K8888L2884L5780L8288M1180M4760M8731
62635A455692N2507N6075O0365O6080P2391P7611Q1276Q4663Q8978R3732R7156
62624B286526R7687R4784Q8943Q1271P2597O2593N0067L4506J7070k89j6480l1691
62612B837584m6202n9470p0697p9986q8141r5221r9955j01304j00091r8113r5833
62601A902571r2129q6623q0879p6422p2694o8220o3170n9111n6366n3173m8097
62590A145687m2124l7464l4910l3295l1356k9238k7832k7151k5982k3320j9806
62579H13209j7240j6543j6642j5808j3808j2053j1557j1542j0650r049q301r017
62567F60999r637q375n778m167m545n310m619k897k044k782l938m011k527k7K315
$$ plain form
62552 602657 605942 608726 611012 614121 618677 623659 628183 633292 640790 650757 661495 671793 682067
62539 682067 693113 704864 716969 730085 746077 766903 793099 823138 854620 886444 919412
62528 919412 954408 990869 1027963 1066403 1107647 1151573 1196367 1240658 1284209 1326285 1364862
62517 1364862 1398191 1426018 1448550 1465165 1474933 1477579 1473014 1460436 1438957 1409167 1373576 1335343
62505 1335343 1296631 1257975 1219057 1179999 1141704 1104906 1069521 1035477 1003567 974578 948018
62494 948018 922680 898178 874924 852990 832351 813964 798895 786212 773391 759339 745534
62483 745534 733676 723692 714757 706630 699003 690962 682424 674953 669830 666303 663039 660416 659811 661251
62469 661251 663416 665804 669502 675678 684234 694052 703934 713447 723473 735645 750665 767501 784851
$$ packed form
62552F02657L285K784K286L109M556M982M524N109P498R967J0738J0298J0274
62539F82067J1046J1751J2105J3116J5992K0826K6196L0039L1482L1824L2968
62528I19412L4996L6461L7094L8440M1244M3926M4794M4291M3551M2076L8577
62517A364862L3329K7827K2532J6615R768K646m565j2578k1479k9790l5591l8233
62505A335343l8712l8656l8918l9058l8295l6798l5385l4044l1910k8989k6560
62494I48018k5338k4502k3254k1934k0639j8387j5069j2683j2821j4052j3805
62483G45534j1858r984q935q127p627q041q538p471n123l527l264k623o05J440
62469F61251K165K388L698O176Q556R818R882R513J0026J2172J5020J6836J7350
$$ plain form
62456 784851 802903 822941 845691 870876 897998 926743 956994 989348 1025357 1066323 1111921
62445 1111921 1160615 1211241 1263597 1317686 1372911 1427775 1480070 1527974 1571393 1611365 1647386
62434 1647386 1676241 1694532 1701661 1699212 1688171 1668342 1640133 1605281 1565644 1522458 1476918 1430432
62422 1430432 1384050 1338377 1294030 1251474 1210725 1172024 1136430 1104617 1075457 1047165 1019811
62411 1019811 995349 975119 958630 944932 933765 924878 917484 911047 905749 901712 898551 896087 894656
62398 894656 894368 894802 895687 897073 898694 900196 902210 906069 911982 918641 925137 932118 940243 948573 955530
62383 955530 960668 964555 967553 969638 970816 970617 967630 960746 950755 939698 928503 916115 901161
62370 901161 883834 865747 848345 831822 815606 799625 784813 772190 761765 752886 745574 740675
$$ packed form
62456G84851J8052K0038K2750K5185K7122K8745L0251L2354L6009M0966M5598
62445A111921M8694N0626N2356N4089N5225N4864N2295M7904M3419L9972L6021
62434A647386K8855J8291P129k449j1041j9829k8209l4852l9637m3186m5540m6486
62422A430432m6382m5673m4347m2556m0749l8701l5594l1813k9160k8292k7354
62411A019811k4462k0230j6489j3698j1167q887p394o437n298m037l161k464j431
62398H94656k88M34Q85J386J621J502K014L859N913O659O496O981Q125Q330O957
62383I55530N138L887K998K085J178j99k987o884r991j1057j1195j2388j4954
62370I01161j7327j8087j7402j6523j6216j5981j4812j2623j0425q879p312m899
$$ plain form
62358 740675 738360 737259 735792 734058 733683 735890 740194 745054 749447 753730 759095 766263 774871 784240
62344 784240 794365 805489 816851 826869 835020 842731 851749 862207 872998 883413 893392 902371
62332 902371 909178 913412 916137 918717 921451 923793 925446 926571 927103 926627 925368 924873 927081 932553 940096
62317 940096 948467 958113 970655 986810 1005627 1026125 1048986 1075921 1107613 1143016 1180773 1220737
62305 1220737 1263887 1311245 1363342 1420413 1482554 1549587 1621104 1696666 1775585 1856461 1937422
62294 1937422 2017076 2094753 2169346 2238316 2298462 2347458 2384138 2407862 2418792 2418748 2410385 2394811
62282 2394811 2370918 2337571 2295540 2246561 2191628 2131457 2068005 2004136 1941877 1881952 1824658
62271 1824658 1770073 1717667 1667086 1619417 1576445 1538375 1503435 1470095 1438577 1409578 1382561
$$ packed form
62358G40675k315j101j467j734l75K207M304M860M393M283N365P168Q608R369
62344G84240J0125J1124J1362J0018Q151P711R018J0458J0791J0415R979Q979
62332I02371O807M234K725K580K734K342J653J125N32m76j259m95K208N472P543
62317I40096Q371R646J2542J6155J8817K0498K2861K6935L1692L5403L7757L9964
62305A220737M3150M7358N2097N7071O2141O7033P1517P5562P8919Q0876Q0961
62294A937422P9654P7677P4593O8970O0146M8996L6680K3724J0930m4q363j5574
62282B394811k3893l3347m2031m8979n4933o0171o3452o3869o2259n9925n7294
62271A824658n4585n2406n0581m7669m2972l8070l4940l3340l1518k8999k7017
$$ plain form
62260 1382561 1356316 1330767 1307433 1288092 1273298 1262023 1252514 1243598 1235134 1227237 1219669 1212616
62248 1212616 1207418 1205231 1205007 1204030 1200735 1195883 1190707 1185193 1178773 1171510 1163716 1155348 1146790 1139439
62234 1139439 1134399 1130995 1127508 1123154 1118658 1115214 1113546 1113669 1114920 1116595 1119084 1123856 1131596 1140863
62220 1140863 1149523 1157255 1165819 1177031 1191205 1207338 1223987 1240167 1256294 1274317 1296234 1322393
62208 1322393 1351759 1383597 1418169 1455941 1497030 1541563 1589771 1641530 1696513 1755013 1817994
62197 1817994 1886099 1959062 2036161 2116483 2198455 2279706 2357799 2430667 2496209 2552156 2596815
62186 2596815 2629485 2649800 2657260 2651951 2635247 2609045 2574570 2532566 2484322 2431574 2375445 2316437
62174 2316437 2255793 2195920 2138737 2084236 2031610 1981525 1936231 1897276 1864014 1834852 1809171
$$ packed form
62260A382561k6245k5549k3334j9341j4794j1275r509q916q464p897p568p053
62248A212616n198k187k24r77l295m852n176n514o420p263p794q368q558p351
62234A139439n040l404l487m354m496l444j668J23J251J675K489M772P740R267
62220A140863Q660P732Q564J1212J4174J6133J6649J6180J6127J8023K1917K6159
62208A322393K9366L1838L4572L7772M1089M4533M8208N1759N4983N8500O2981
62197A817994O8105P2963P7099Q0322Q1972Q1251P8093P2868O5542N5947M4659
62186B596815L2670K0315P460n309j6704k6202l4475m2004m8244n2748n6129n9008
62174B316437o0644n9873n7183n4501n2626n0085m5294l8955l3262k9162k5681
$$ plain form
62163 1809171 1787249 1768864 1753071 1739437 1728593 1721115 1716386 1713044 1710272 1708252 1707536 1708377 1710663
62150 1710663 1714108 1718322 1722837 1727404 1732528 1739558 1749692 1762645 1776719 1790798 1805912 1824123
62138 1824123 1845903 1869482 1893039 1916707 1941970 1969759 1999866 2031868 2065898 2102513 2142262
62127 2142262 2185194 2230356 2275908 2320285 2363280 2405571 2447138 2486582 2522127 2552988 2579664
62116 2579664 2603335 2625316 2646949 2669483 2693761 2720118 2748896 2781088 2818169 2861089 2909691
62105 2909691 2963277 3021324 3083090 3146723 3209570 3269551 3325771 3377690 3424486 3465540 3500927
62094 3500927 3530795 3554760 3572683 3585815 3596270 3605164 3611851 3615349 3616082 3615749 3615707 3616182 3617226 3619843
62080 3619843 3625375 3633927 3644248 3655522 3668604 3684971 3704978 3727795 3752544 3778652 3805448 3832551
$$ packed form
62163A809171k1922j8385j5793j3634j0844p478m729l342k772k020p16Q41K286
62150A710663L445M214M515M567N124P030J0134J2953J4074J4079J5114J8211
62138A824123K1780K3579K3557K3668K5263K7789L0107L2002L4030L6615L9749
62127B142262M2932M5162M5552M4377M2995M2291M1567L9444L5545L0861K6676
62116B579664K3671K1981K1633K2534K4278K6357K8778L2192L7081M2920M8602
62105B909691N3586N8047O1766O3633O2847N9981N6220N1919M6796M1054L5387
62094C500927K9868K3965J7923J3132J0455Q894O687L498P33l33m2M75J044K617
62080C619843N532Q552J0321J1274J3082J6367K0007K2817K4749K6108K6796K7103
$$ plain form
62068 3832551 3860604 3890631 3922588 3955570 3989494 4025369 4063529 4102833 4142286 4182502 4224827
62057 4224827 4269732 4316645 4364621 4412628 4460163 4508198 4558466 4611000 4663531 4714450 4765121
62046 4765121 4817764 4872151 4926485 4980976 5038137 5099302 5162958 5227122 5291506 5356486 5421701
62035 5421701 5487111 5554235 5624805 5698779 5775023 5853505 5935534 6021949 6112270 6205799 6302643
62024 6302643 6403334 6508069 6616491 6727505 6838888 6947707 7051809 7150824 7245395 7335621
62014 7335621 7420846 7500966 7577168 7650788 7721519 7787183 7845323 7894890 7936643 7972490 8004470
62003 8004470 8033757 8060115 8082397 8099679 8111718 8118319 8118712 8111856 8097124 8074624 8045282 8010729
61991 8010729 7972515 7931073 7885871 7836827 7784856 7730686 7674023 7614740 7554211 7494376 7435956
$$ packed form
62068C832551K8053L0027L1957L2982L3924L5875L8160L9304L9453M0216M2325
62057D224827M4905M6913M7976M8007M7535M8035N0268N2534N2531N0919N0671
62046D765121N2643N4387N4334N4491N7161O1165O3656O4164O4384O4980O5215
62035E421701O5410O7124P0570P3974P6244P8482Q2029Q6415R0321R3529R6844
62024F302643J00691J04735J08422J11014J11383J08819J04102R9015R4571R0226
62014G335621Q5225Q0120P6202P3620P0731O5664N8140M9567M1753L5847L1980
62003H004470K9287K6358K2282J7282J2039O601L93o856j4732k2500k9342l4553
61991H010729l8214m1442m5202m9044n1971n4170n6663n9283o0529n9835n8420
$$ plain form
61980 7435956 7378768 7323570 7272156 7225483 7182857 7143434 7107443 7075336 7046545 7019778 6994084
61969 6994084 6969148 6945009 6921878 6899668 6877175 6852312 6823921 6793056 6761777 6730784 6698875
61958 6698875 6664588 6627578 6588176 6546337 6501716 6454578 6405955 6356717 6306863 6256075 6204712
61947 6204712 6153743 6103766 6054626 6006192 5958939 5913307 5868952 5825158 5781788 5739188 5697257
61936 5697257 5655207 5612283 5568217 5522760 5475048 5423600 5366854 5304005 5235765 5164273 5091835
61925 5091835 5019696 4948235 4877949 4809546 4743173 4678377 4615104 4554162 4496435 4441998 4390210
61914 4390210 4340283 4291600 4243929 4197664 4153553 4111916 4072176 4033185 3993899 3953991 3914264
61903 3914264 3876350 3841330 3808592 3776668 3745320 3715995 3689839 3666013 3642728 3619574 3598048
$$ packed form
61980G435956n7188n5198n1414m6673m2626l9423l5991l2107k8791k6767k5694
61969F994084k4936k4139k3131k2210k2493k4863k8391l0865l1279l0993l1909
61958F698875l4287l7010l9402m1839m4621m7138m8623m9238m9854n0788n1363
61947F204712n0969m9977m9140m8434m7253m5632m4355m3794m3370m2600m1931
61936E697257m2050m2924m4066m5457m7712n1448n6746o2849o8240p1492p2438
61925E091835p2139p1461p0286o8403o6373o4796o3273o0942n7727n4437n1788
61914D390210m9927m8683m7671m6265m4111m1637l9740l8991l9286l9908l9727
61903C914264l7914l5020l2738l1924l1348k9325k6156k3826k3285k3154k1526
$$ plain form
61892 3598048 3579849 3565332 3553911 3545528 3541232 3542130 3547994 3557357 3569263 3584573 3604998 3630959
61880 3630959 3661124 3694267 3730957 3772804 3820313 3871961 3925465 3979739 4035635 4094873 4158345
61869 4158345 4225533 4295579 4368493 4444874 4524712 4607273 4692472 4781793 4877400 4980630 5091874
61858 5091874 5211975 5343338 5489330 5652544 5833962 6034141 6254975 6499617 6770494
61849 6770494 7068295 7393498 7748177 8135471 8557960 9017743 9517729 10061228 10649903
61840 10649903 11283034 11958551 12672853 13418439 14182299 14946547 15688663 16379656 16983524
61831 16983524 17461614 17780012 17915188 17856580 17607798 17186541 16621369 15945860 15193415
61822 15193415 14394750 13576982 12762761 11969599 11210138 10493082 9824021 9205776 8638568
$$ packed form
61892C598048j8199j4517j1421q383m296Q98N864R363J1906J5310K0425K5961
61880C630959L0165L3143L6690M1847M7509N1648N3504N4274N5896N9238O3472
61869D158345O7188P0046P2914P6381P9838Q2561Q5199Q9321R5607J03230J11244
61858E091874J20101J31363J45992J63214J81418K00179K20834K44642K70877
61849F770494K97801L25203L54679L87294M22489M59783M99986N43499N88675
61840A0649903O33131O75517P14302P45586P63860P64248P42116O90993O03868
61831A6983524M78090L18398J35176n8608k48782m21257n65172o75509p52445
61822A5193415p98665q17768q14221p93162p59461p17056o69061o18245n67208
$$ plain form
61813 8638568 8120507 7648546 7219317 6829295 6474804 6152686 5860994 5598355 5362575
61804 5362575 5150649 4960217 4789996 4638394 4502905 4381719 4274978 4183345 4105961 4040876
61794 4040876 3986852 3943468 3909851 3884667 3867219 3857162 3853111 3852893 3855344 3860416 3866990 3871986 3872607
61781 3872607 3868626 3861557 3852243 3840284 3825496 3808942 3792414 3777496 3765202 3756124 3750606 3748799
61769 3748799 3750583 3755659 3763959 3775774 3790934 3807828 3823703 3836115 3843824 3846499 3844347 3838264 3829597
61756 3829597 3819346 3807994 3796366 3785931 3777958 3773217 3773158 3780487 3797439 3823866 3858184 3900104
61744 3900104 3951273 4013093 4085112 4166251 4256831 4358480 4472362 4598313 4735707 4884490
61734 4884490 5045121 5218005 5403524 5602542 5816406 6046228 6292476 6555650 6837321
$$ packed form
61813H638568n18061m71961m29229l90022l54491l22118k91692k62639k35780
61804E362575k11926j90432j70221j51602j35489j21186j06741r1633p7384o5085
61794D040876n4024m3384l3617k5184j7448j0057m051k18K451N072O574M996O21
61781C872607l981p069r314j1959j4788j6554j6528j4918j2294r078n518j807
61769C748799J784N076Q300J1815J5160J6894J5875J2412P709K675k152o083q667
61756C829597j0251j1352j1628j0435p973m741n9P329J6952K6427L4318M1920
61744C900104N1169O1820P2019Q1139R0580J01649J13882J25951J37394J48783
61734D884490J60631J72884J85519J99018K13864K29822K46248K63174K81671
$$ plain form
61725 6837321 7140174 7467079 7820557 8203255 8618477 9070019 9562039 10099533 10688466
61716 10688466 11334763 12043342 12818756 13666472 14592506 15601409 16694988 17872583 19130889
61707 19130889 20461864 21850166 23271906 24694061 26073135 27354097 28472426 29360606
61699 29360606 29957813 30220161 30128590 29691672 28942500 27931690 26719618 25369198 23939327
61690 23939327 22480078 21031135 19622927 18277976 17011316 15831072 14740010 13737191
61682 13737191 12819007 11980224 11215317 10519049 9885860 9309355 8783097 8301772 7861272
61673 7861272 7457927 7088098 6748386 6435929 6148526 5884508 5642053 5418377 5210022
61664 5210022 5014333 4830337 4658027 4497311 4347972 4209641 4080792 3958308 3839320
$$ packed form
61725F837321L02853L26905L53478L82698M15222M51542M92020N37494N88933
61716A0688466O46297P08579P75414Q47716R26034J008903J093579J177595J258306
61707A9130889J330975J388302J421740J422155J379074J280962J118329Q88180
61699B9360606N97207K62348r1571m36918p49172j010810j212072j350420j429871
61690B3939327j459249j448943j408208j344951j266660j180244j091062j002819
61682A3737191r18184q38783p64907o96268o33189n76505n26258m81325m40500
61673G861272m03345l69829l39712l12457k87403k64018k42455k23676k08355
61664E210022j95689j83996j72310j60716j49339j38331j28849j22484j18988
$$ plain form
61655 3839320 3723453 3612404 3507436 3408288 3314421 3225966 3142972 3064874 2991472 2923612 2862038
61644 2862038 2805967 2753482 2703001 2653940 2606414 2560942 2518154 2478064 2439660 2401650 2363548
61633 2363548 2325746 2288733 2252720 2217808 2183991 2150886 2117826 2084341 2050493 2016843 1984231
61622 1984231 1953289 1923831 1894830 1865382 1835665 1806746 1779515 1754077 1730139 1707685 1687139
61611 1687139 1669007 1653430 1640030 1628066 1616735 1605490 1594392 1584303 1576365 1570828 1566521 1561919
61599 1561919 1556711 1551862 1548233 1545713 1543820 1542482 1541947 1542462 1544341 1547845 1552645 1557854 1562951 1568184
61585 1568184 1573653 1578504 1581709 1583319 1584415 1585925 1587891 1589616 1590045 1588228 1584016 1578375 1572774 1568303
61571 1568303 1565350 1563670 1562431 1560724 1558521 1556850 1556475 1556748 1556228 1554132 1550571 1545712 1539390 1531488 1522045
$$ packed form
61655C839320j15867j11049j04968r9148r3867q8455q2994p8098p3402o7860o1574
61644B862038n6071n2485n0481m9061m7526m5472m2788m0090l8404l8010l8102
61633B363548l7802l7013l6013l4912l3817l3105l3060l3485l3848l3650l2612
61622A984231l0942k9458k9001k9448k9717k8919k7231k5438k3938k2454k0546
61611A687139j8132j5577j3400j1964j1331j1245j1098j0089p938n537m307m602
61599A561919n208m849l629k520j893j338n35N15J879L504M800N209N097N233
61585A568184N469M851L205J610J096J510J966J725M29j817m212n641n601m471
61571A568303k953j680j239j707k203j671l75K73n20k096l561m859o322p902r443
$$ plain form
61556 1522045 1511044 1498621 1485388 1472031 1458706 1445372 1432632 1421574 1412698 1405443 1398825 1392194
61544 1392194 1385502 1379290 1374289 1370581 1367346 1363871 1360550 1358236 1356847 1355381 1353263 1350916 1348950 1347519
61530 1347519 1346632 1346513 1347425 1349448 1352384 1355529 1358011 1360155 1364191 1372457 1384776 1398648 1412256 1426231
61516 1426231 1442162 1460553 1481051 1503768 1529327 1557842 1588561 1620451 1652875 1685948 1720480
61505 1720480 1757314 1796577 1837780 1880478 1924227 1968061 2010867 2052336 2092699 2131545 2168118
61494 2168118 2202897 2237488 2272337 2305857 2336602 2365014 2392015 2417147 2439402 2458794 2475632
61483 2475632 2489135 2498473 2504480 2508547 2510240 2507905 2501515 2493025 2483915 2474372 2465166 2458120 2453761 2450373
61469 2450373 2446741 2444473 2446217 2452697 2462995 2476919 2495422 2518995 2547206 2579981 2618206 2662839
$$ packed form
61556A522045j1001j2423j3233j3357j3325j3334j2740j1058q876p255o618o631
61544A392194o692o212n001l708l235l475l321k314j389j466k118k347j966j431
61530A347519q87j19R12K023K936L145K482K144M036Q266J2319J3872J3608J3975
61516A426231J5931J8391K0498K2717K5559K8515L0719L1890L2424L3073L4532
61505A720480L6834L9263M1203M2698M3749M3834M2806M1469M0363L8846L6573
61494B168118L4779L4591L4849L3520L0745K8412K7001K5132K2255J9392J6838
61483B475632J3503R338O007M067J693k335o390q490r110r543r206p046m359l388
61469B450373l632k268J744O480J0298J3924J8503K3573K8211L2775L8225M4633
$$ plain form
61457 2662839 2714302 2773012 2839818 2915544 3000560 3095001 3199102 3313201 3437702 3573270
61447 3573270 3721017 3882463 4059158 4252021 4461132 4686555 4929209 5189952 5467281
61438 5467281 5756683 6052832 6351538 6648317 6935381 7201402 7434700 7626309 7770464
61429 7770464 7863736 7904781 7894711 7837197 7738115 7604649 7443933 7262188 7065428 6860759
61419 6860759 6655908 6456913 6266737 6086639 5918461 5765056 5628696 5509732 5406995
61410 5406995 5319390 5247002 5190630 5150227 5124023 5109467 5105010 5110670 5127065 5154379 5192196 5239505
61398 5239505 5294553 5355257 5420206 5488945 5561029 5635255 5710165 5784880 5859050 5932334 6004346
61387 6004346 6074820 6143449 6209945 6274665 6338753 6403064 6467223 6530297 6592159 6653336 6713435
$$ packed form
61457B662839N1463N8710O6806P5726Q5016R4441J04101J14099J24501J35568
61447C573270J47747J61446J76695J92863K09111K25423K42654K60743K77329
61438E467281K89402K96149K98706K96779K87064K66021K33298J91609J44155
61429G770464R3272M1045j0070n7514r9082j33466j60716j81745j96760k04669
61419F860759k04851j98995j90176j80098j68178j53405j36360j18964j02737
61410E406995q7605p2388n6372m0403k6204j4556m457N660J6395K7314L7817M7309
61398E239505N5048O0704O4949O8739P2084P4226P4910P4715P4170P3284P2012
61387F004346P0474O8629O6496O4720O4088O4311O4159O3074O1862O1177O0099
$$ plain form
61376 6713435 6770269 6820906 6863500 6898277 6926991 6951307 6971268 6985331 6992039 6991327 6983956 6970113
61364 6970113 6949310 6921544 6887814 6849542 6808107 6765054 6722016 6680049 6639397 6600238 6563425
61353 6563425 6530338 6502161 6479319 6461378 6447474 6437025 6429931 6425954 6424151 6423231 6422130 6419717 6414385
61340 6414385 6404886 6391701 6376899 6362536 6349681 6338973 6331452 6328847 6333726 6349272 6377967 6420370
61328 6420370 6476232 6547041 6636371 6747167 6879770 7033284 7207800 7404138 7622163 7860715
61318 7860715 8118900 8396138 8690683 8998766 9315104 9633314 9945534 10242211 10512730
61309 10512730 10746522 10934355 11069723 11149593 11173883 11144387 11064316 10938165 10771107 10568260
61299 10568260 10334738 10076064 9797905 9505445 9203399 8896490 8589407 8286452 7991604
$$ packed form
61376F713435N6834N0637M2594L4777K8714K4316J9961J4063O708p12p371j3843
61364F970113k0803k7766l3730l8272m1435m3053m3038m1967m0652l9159l6813
61353F563425l3087k8177k2842j7941j3904j0449p094l977j803r20j101k413n332
61340F414385r499j3185j4802j4363j2855j0708p521k605M879J5546K8695M2403
61328F420370N5862P0809Q9330J10796J32603J53514J74516J96338K18025K38552
61318G860715K58185K77238K94545L08083L16338L18210L12220K96677K70519
61309A0512730K33792J87833J35368P9870K4290k9496q0071j26151j67058k02847
61299A0568260k33522k58674k78159k92460l02046l06909l07083l02955k94848
$$ plain form
61290 7991604 7708642 7440522 7188555 6952530 6731558 6524618 6330801 6149729 5981624
61281 5981624 5826613 5684458 5555545 5441468 5343598 5261512 5193838 5140205 5100894 5074895
61271 5074895 5060136 5055861 5062907 5080902 5107047 5138984 5177225 5222898 5274114 5326740 5378570 5430609
61259 5430609 5483938 5537078 5587288 5633161 5674857 5712737 5746965 5778039 5806547 5832264 5854199
61248 5854199 5871656 5884716 5893587 5898147 5898417 5894884 5887685 5875591 5856473 5828937 5793150 5749989
61236 5749989 5700044 5643950 5583194 5519647 5454192 5386536 5316700 5246252 5177616 5112472 5051150
61225 5051150 4993304 4938761 4887872 4841515 4800759 4766179 4737347 4713136 4692558 4675206 4661062
61214 4661062 4649990 4641312 4633742 4625998 4617697 4609356 4601234 4592586 4582652 4572138 4562898 4556194 4552125
$$ packed form
61290G991604k82962k68120k51967k36025k20972k06940j93817j81072j68105
61281E981624j55011j42155j28913j14077r7870q2086o7674n3633l9311k5999
61271E074895j4759m275P046J7995K6145L1937L8241M5673N1216N2626N1830N2039
61259E430609N3329N3140N0210M5873M1696L7880L4228L1074K8508K5717K1935
61248E854199J7457J3060Q871M560K70l533p199j2094j9118k7536l5787m3161
61236E749989m9945n6094o0756o3547o5455o7656o9836p0448o8636o5144o1322
61225E051150n7846n4543n0889m6357m0756l4580k8832k4211k0578j7352j4144
61214D661062j1072q678p570p744q301q341q122q648r934j0514r240o704m069
$$ plain form
61201 4552125 4551033 4554485 4564126 4580054 4601000 4625854 4654446 4687312 4725591 4771105 4825725 4890482
61189 4890482 4965788 5052395 5151144 5261411 5380458 5504647 5630643 5754900 5872556 5977515
61179 5977515 6063309 6123484 6151779 6143218 6095700 6010721 5892878 5748719 5585143 5407877 5221483
61168 5221483 5031071 4843084 4663093 4492960 4331381 4177367 4032166 3897682 3774563
61159 3774563 3662631 3562004 3472546 3392790 3320701 3255424 3197423 3146951 3103187 3064935 3031438
61148 3031438 3002349 2977571 2957368 2942161 2931876 2925829 2923499 2925141 2931266 2941613 2954960 2970012
61136 2970012 2986369 3004492 3024776 3046723 3068903 3089476 3106666 3119045 3125789 3126734 3122110 3112331
61124 3112331 3098139 3080584 3060370 3037219 3010154 2978319 2941404 2899819 2854991 2808996 2762871
$$ packed form
61201D552125j092L452R641J5928K0946K4854K8592L2866L8279M5514N4620O4757
61189D890482P5306Q6607R8749J10267J19047J24189J25996J24257J17656J04959
61179E977515Q5794O0175K8295q561m7518q4979j17843j44159j63576j77266j86394
61168E221483j90412j87987j79991j70133j61579j54014j45201j34484j23119
61159C774563j11932j00627q9458p9756p2089o5277n8001n0472m3764l8252l3497
61148C031438k9089k4778k0203j5207j0285o047k330J642O125J0347J3347J5052
61136B970012J6357J8123K0284K1947K2180K0573J7190J2379O744R45m624r779
61124C112331j4192j7555k0214k3151k7065l1835l6915m1585m4828m5995m6125
$$ plain form
61113 2762871 2715491 2665150 2612174 2558741 2505946 2452552 2397353 2341512 2287505 2236609 2188469
61102 2188469 2142352 2097561 2053100 2008333 1964066 1922082 1883529 1848374 1816244 1787015 1760618
61091 1760618 1736991 1716140 1697690 1680551 1663680 1646991 1630785 1614568 1597212 1578219 1558003
61080 1558003 1537001 1515418 1493955 1474027 1457035 1443928 1435364 1431517 1431537 1433907 1437581 1442386 1448412
61067 1448412 1455661 1464280 1474442 1485890 1498271 1511908 1527429 1544467 1561591 1577824 1593476 1609088
61055 1609088 1624330 1638580 1652082 1665765 1680032 1694164 1706902 1717472 1726228 1734425 1743200 1752438
61043 1752438 1760662 1766108 1767925 1766529 1762922 1757580 1749962 1739345 1726186 1712149 1698499 1684934 1670431
61030 1670431 1654666 1638097 1621279 1604880 1589713 1575599 1560579 1542640 1522281 1502115 1483681
$$ packed form
61113B762871m7380n0341n2976n3433n2795n3394n5199n5841n4007n0896m8140
61102B188469m6117m4791m4461m4767m4267m1984l8553l5155l2130k9229k6397
61091A760618k3627k0851j8450j7139j6871j6689j6206j6217j7356j8993k0216
61080A558003k1002k1583k1463j9928j6992j3107q564l847K0K370L674M805O026
61067A448412P249Q619J0162J1448J2381J3637J5521J7038J7124J6233J5652J5612
61055A609088J5242J4250J3502J3683J4267J4132J2738J0570Q756Q197Q775R238
61043A752438Q224N446J817j396l607n342p618j0617j3159j4037j3650j3565j4503
61030A670431j5765j6569j6818j6399j5167j4114j5020j7939k0359k0166j8434
$$ plain form
61019 1483681 1465860 1446988 1427466 1409411 1394375 1382254 1372108 1363221 1355279 1348106 1341681 1336460
61007 1336460 1333309 1332727 1334115 1336300 1338743 1341525 1344111 1345334 1345239 1345746 1348305 1351892 1354730 1357173 1361189
60992 1361189 1367540 1375330 1384004 1393710 1403547 1411725 1418151 1425019 1433929 1444025 1453939 1464050 1475578
60979 1475578 1488646 1502615 1517497 1533843 1551789 1571170 1592121 1614791 1639010 1664883 1693138
60968 1693138 1724273 1757975 1793895 1832202 1872726 1914349 1956058 1997932 2040414 2083334 2126516
60957 2126516 2170686 2216850 2265126 2314878 2365671 2417584 2471254 2528307 2591121 2661275 2738452
60946 2738452 2821476 2910043 3004992 3107394 3218063 3337638 3466700 3606195 3758043 3924656
60936 3924656 4107234 4305013 4516716 4742376 4983338 5240987 5515941 5808114 6117278
$$ packed form
61019A483681j7821j8872j9522j8055j5036j2121j0146q887p942p173o425n221
61007A336460l151n82J388K185K443K782K586J223r5N07K559L587K838K443M016
60992A361189O351P790Q674R706R837Q178O426O868Q910J0096R914J0111J1528
60979A475578J3068J3969J4882J6346J7946J9381K0951K2670K4219K5873K8255
60968A693138L1135L3702L5920L8307M0524M1623M1709M1874M2482M2920M3182
60957B126516M4170M6164M8276M9752N0793N1913N3670N7053O2814P0154P7177
60946B738452Q3024Q8567R4949J02402J10669J19575J29062J39495J51848J66613
60936C924656J82578J97779K11703K25660K40962K57649K74954K92173L09164
$$ plain form
60927 6117278 6443890 6789584 7156676 7547626 7965703 8415678 8902431 9428738 9995607
60918 9995607 10604987 11261760 11974686 12758174 13632962 14622090 15745216 17018606 18460421
60909 18460421 20093152 21941539 24032932 26400575 29081367 32109262 35515408 39324350
60901 39324350 43508450 47896178 52115448 55676592 58188117 59553054 59990049 59882763
60893 59882763 59604261 59431237 59519816 59857394 60200644 60109786 59133963 57041948 53923997
60884 53923997 50102806 45954327 41778640 37768631 34032631 30621525 27549425 24811645
60876 24811645 22395054 20278368 18431638 16821867 15418984 14195783 13125486 12182655
60868 12182655 11345707 10597067 9922142 9309441 8750320 8237128 7762557 7321693 6913333
$$ packed form
60927F117278L26612L45694L67092L90950M18077M49975M86753N26307N66869
60918I995607O09380O56773P12926P83488Q74788R89128J123126J273390J441815
60909A8460421J632731J848387K091393K367643K680792L027895L406146L808942
60901C9324350M184100M387728M219270L561144K511525J364937M36995j07286
60893E9882763k78502j73024Q8579L37578L43250r0858r75823k092015l117951
60884E3923997l821191m148479m175687m010009l736000l411106l072100k737780
60876B4811645k416591k116686j846730j609771j402883j223201j070297r42831
60868A2182655q36948p48640o74925o12701n59121n13192m74571m40864m08360
$$ plain form
60859 6913333 6537792 6193978 5879153 5590153 5323517 5075196 4841449 4619951 4409673
60850 4409673 4210282 4021863 3844384 3676993 3518661 3369664 3231373 3104183 2986813
60841 2986813 2878111 2778326 2687923 2606081 2531138 2461727 2396986 2336452 2280347 2229215 2182842
60830 2182842 2140176 2100477 2063600 2028887 1994820 1960326 1925530 1890862 1856244 1821402 1786089
60819 1786089 1749780 1712159 1674032 1636657 1600133 1563737 1527821 1493540 1460424 1426423 1391354
60808 1391354 1358368 1330485 1307175 1286029 1266587 1250581 1238923 1230252 1222538 1215142 1209265 1206923
60796 1206923 1209185 1214951 1221854 1228675 1236219 1245675 1257212 1270651 1286203 1303667 1322016 1340752
60784 1340752 1360670 1382299 1404540 1425941 1446391 1466403 1485563 1502984 1518578 1532638 1544789
$$ packed form
60859F913333l75541l43814l14825k89000k66636k48321k33747k21498k10278
60850D409673j99391j88419j77479j67391j58332j48997j38291j27190j17370
60841B986813j08702r9785r0403q1842p4943o9411o4741o0534n6105n1132m6373
60830B182842m2666l9699l6877l4713l4067l4494l4796l4668l4618l4842l5313
60819A786089l6309l7621l8127l7375l6524l6396l5916l4281l3116l4001l5069
60808A391354l2986k7883k3310k1146j9442j6006j1658q671p714p396n877k342
60796A206923K262N766O903O821P544R456J1537J3439J5552J7464J8349J8736
60784A340752J9918K1629K2241K1401K0450K0012J9160J7421J5594J4060J2151
$$ plain form
60773 1544789 1554588 1562615 1569611 1574946 1577220 1576174 1572907 1568484 1563451 1558397 1553701 1548631 1541705 1532010
60759 1532010 1519572 1504673 1487708 1469443 1450463 1430492 1409131 1387158 1366118 1346646 1328119
60748 1328119 1310050 1292994 1277828 1264897 1254121 1245422 1238676 1233621 1230056 1227973 1227375 1228099 1229958
60735 1229958 1233140 1238371 1246187 1255788 1265221 1273564 1282478 1294434 1309635 1326129 1342931 1361187 1381675
60722 1381675 1403081 1423949 1444698 1466181 1487476 1506896 1524380 1541186 1557800 1573729 1588930
60711 1588930 1603821 1618117 1631143 1643196 1655232 1667251 1678260 1687725 1695776 1702016 1705588 1706701
60699 1706701 1706942 1707689 1709014 1710140 1709969 1707223 1701283 1693223 1685052 1677675 1670526 1663258 1656502 1650421 1643730
60684 1643730 1635105 1624948 1614758 1605022 1594535 1581975 1567641 1553283 1540274 1528375 1516516 1504399
$$ packed form
60773A544789R799Q027O996N335K274j046l267m423n033n054m696n070o926r695
60759A532010j2438j4899j6965j8265j8980j9971k1361k1973k1040j9472j8527
60748A328119j8069j7056j5166j2931j0776q699o746n055l565k083n98P24J859
60735A229958L182N231P816R601R433Q343Q914J1956J5201J6494J6802J8256K0488
60722A381675K1406K0868K0749K1483K1295J9420J7484J6806J6614J5929J5201
60711A588930J4891J4296J3026J2053J2036J2019J1009R465Q051O240L572J113
60699A706701K41P47J325J126j71k746n940q060q171p377p149p268o756o081o691
60684A643730q625j0157j0190r736j0487j2560j4334j4358j3009j1899j1859j2117
$$ plain form
60672 1504399 1492623 1481452 1470604 1460609 1453189 1449346 1447849 1446565 1444729 1442964 1441677 1440579 1439364
60659 1439364 1437797 1435404 1432103 1428801 1426369 1424401 1422145 1420268 1420235 1421882 1422983 1421572 1417818 1413466
60645 1413466 1410165 1408222 1406068 1401172 1392529 1382053 1372361 1363474 1353087 1339900 1324927 1309413 1293342
60632 1293342 1276648 1260147 1244179 1227670 1209660 1190836 1172568 1155279 1138781 1123449 1110047
60621 1110047 1098854 1089752 1082629 1076937 1071499 1065597 1059832 1055142 1051539 1048626 1046776 1046714 1048212 1050348
60607 1050348 1053032 1057149 1063029 1069728 1076314 1083088 1090859 1099471 1107868 1115695 1124142 1134692 1147233
60594 1147233 1159946 1171289 1181681 1192847 1205729 1219580 1233149 1246209 1259515 1273531 1287683
60583 1287683 1301035 1313515 1326135 1339870 1354595 1369499 1384279 1399324 1414727 1430025 1445359
$$ packed form
60672A504399j1776j1171j0848r995p420l843j497j284j836j765j287j098j215
60659A439364j567k393l301l302k432j968k256j877l3J647J101j411l754m352
60645A413466l301j943k154m896q643j0476r692q887j0387j3187j4973j5514j6071
60632A293342j6694j6501j5968j6509j8010j8824j8268j7289j6498j5332j3402
60621A110047j1193r102p123n692n438n902n765m690l603k913j850o2J498K136
60607A050348K684M117N880O699O586O774P771Q612Q397P827Q447J0550J2541
60594A147233J2713J1343J0392J1166J2882J3851J3569J3060J3306J4016J4152
60583A287683J3352J2480J2620J3735J4725J4904J4780J5045J5403J5298J5334
$$ plain form
60572 1445359 1462083 1481376 1502636 1523974 1544058 1562761 1580162 1595705 1608383 1617277 1622007 1623092
60560 1623092 1621651 1618284 1612541 1603939 1592956 1580243 1565473 1548214 1529681 1512211 1496727 1481939
60548 1481939 1466632 1451775 1439680 1431613 1426840 1423751 1421479 1420499 1421772 1425372 1430334 1436114 1443449
60535 1443449 1452864 1462693 1469843 1472747 1472737 1472406 1473410 1475852 1478754 1480806 1481510 1481937 1483791 1487642 1492811
60520 1492811 1498870 1506043 1513939 1521229 1527212 1532652 1538290 1543548 1547522 1550436 1553101 1555551 1557190 1557900
60506 1557900 1558020 1557353 1555011 1550316 1543420 1535088 1526312 1518004 1510698 1504438 1498948 1493701 1487902 1480947
60492 1480947 1473167 1465743 1459753 1455674 1453787 1454399 1457461 1462672 1470263 1480986 1495024 1511655 1530545
60479 1530545 1552618 1578967 1609496 1643492 1681200 1723996 1773098 1828737 1890536 1958123 2031238
$$ packed form
60572A445359J6724J9293K1260K1338K0084J8703J7401J5543J2678Q894M730J085
60560A623092j441l367n743q602j0983j2713j4770j7259j8533j7470j5484j4788
60548A481939j5307j4857j2095q067m773l089k272r80J273L600M962N780P335
60535A443449R415R829P150K904j0l31J004K442K902K052P04M27J854L851N169
60520A492811O059P173P896P290N983N440N638N258L974K914K665K450J639P10
60506A557900J20o67k342m695o896q332q776q308p306o260n490n247n799o955
60492A480947p780p424n990m079j887O12L062N211P591J0723J4038J6631J8890
60479A530545K2073K6349L0529L3996L7708M2796M9102N5639O1799O7587P3115
$$ plain form
60468 2031238 2109394 2191159 2273353 2351227 2419997 2476455 2519062 2546901 2559195 2556097 2539754
60457 2539754 2514364 2484998 2456182 2431364 2413269 2403888 2403637 2411064 2424173 2441850 2463348 2486916
60445 2486916 2510209 2532153 2553334 2574345 2595103 2616327 2640502 2670343 2707010 2750572 2801479
60434 2801479 2860580 2928320 3005072 3092057 3191018 3302965 3427896 3565562 3715629 3877045
60424 3877045 4048097 4227617 4416055 4615379 4828172 5056957 5304383 5574241 5872116
60415 5872116 6204282 6575277 6986368 7435915 7919513 8427704 8942569 9436916 9877814
60406 9877814 10232429 10472968 10579367 10540688 10356681 10039263 9611812 9104906 8550132 7975299
60396 7975299 7402525 6848157 6323282 5834781 5386501 4979744 4613309 4284345 3989800
$$ packed form
60468B031238P8156Q1765Q2194P7874O8770N6458M2607K7839J2294l098j6343
60457B539754k5390k9366k8816k4818j8095r381k51P427J3109J7677K1498K3568
60445B486916K3293K1944K1181K1011K0758K1224K4175K9841L6667M3562N0907
60434B801479N9101O7740P6752Q6985R8961J11947J24931J37666J50067J61416
60424C877045J71052J79520J88438J99324K12793K28785K47426K69858K97875
60415E872116L32166L70995M11091M49547M83598N08191N14865M94347M40898
60406I877814L54615K40539J06399l8679j84007l17418m27451n06906n54774n74833
60396G975299n72774n54368n24875m88501m48280m06757l66435l28964k94545
$$ plain form
60387 3989800 3726961 3492887 3284349 3098610 2933498 2786506 2654717 2536049 2429719
60378 2429719 2334927 2249852 2172514 2101846 2037265 1977806 1922383 1870263 1820647 1772550 1725847
60367 1725847 1681765 1641413 1604406 1569848 1537994 1509731 1484781 1461756 1439941 1419896 1402192
60356 1402192 1386620 1372913 1361262 1351601 1342957 1333943 1323729 1312476 1301233 1291322 1283386 1276977
60344 1276977 1271381 1266529 1262603 1259144 1255579 1252594 1251819 1253682 1256484 1258387 1259758 1262728 1268657 1276789
60330 1276789 1285439 1293649 1301305 1308195 1313825 1318114 1321536 1324119 1324877 1322921 1318949 1314836 1311660 1308793
60316 1308793 1305102 1300354 1294965 1289000 1282184 1274776 1267760 1262016 1257478 1253265 1248638 1243931 1240478 1239426
60302 1239426 1240658 1243089 1245873 1248915 1252307 1255878 1259327 1262318 1264518 1266117 1268264 1272106 1277312 1282361
$$ packed form
60387C989800k62839k34074k08538j85739j65112j46992j31789j18668j06330
60378B429719r4792q5075p7338p0668o4581n9459n5423n2120m9616m8097m6703
60367A725847m4082m0352l7007l4558l1854k8263k4950k3025k1815k0045j7704
60356A402192j5572j3707j1651r661q644r014j0214j1253j1243r911p936o409
60344A276977n596m852l926l459l565k985p75J863K802J903J371K970N929Q132
60330A276789Q650Q210P656O890N630M289L422K583P58j956l972m113l176k867
60316A308793l691m748n389n965o816p408p016n744m538m213m627m707l453j052
60302A239426J232K431K784L042L392L571L449K991K200J599K147L842N206N049
$$ plain form
60288 1282361 1286448 1290175 1294261 1298779 1304114 1311351 1320805 1331214 1341362 1351489 1361995 1371764 1379303
60275 1379303 1385023 1390753 1397187 1403258 1408109 1412306 1416725 1421453 1426324 1431745 1438354 1446189 1454437 1461809
60261 1461809 1467359 1471443 1475549 1480446 1484686 1485885 1483478 1479099 1474101 1467964 1459807 1450475 1441964 1435221
60247 1435221 1429574 1424325 1419962 1417333 1416187 1415168 1413150 1410099 1406574 1402968 1399633 1397310 1396760 1398068
60233 1398068 1400900 1405272 1411162 1417366 1421921 1424298 1426318 1430134 1435934 1442405 1448745 1455100 1461431 1467348
60219 1467348 1473212 1480344 1489602 1500428 1511746 1523388 1536124 1550424 1565677 1580890 1596012 1612172
60207 1612172 1630314 1649909 1669558 1688752 1708399 1729711 1753331 1779612 1808819 1840829 1875617
60196 1875617 1914351 1958757 2008740 2061904 2116557 2174176 2237618 2307711 2383135 2463183 2549017
$$ packed form
60288A282361M087L727M086M518N335P237R454J0409J0148J0127J0506R769P539
60275A379303N720N730O434O071M851M197M419M728M871N421O609P835Q248P372
60261A461809N550M084M106M897M240J199k407m379m998o137q157r332q511o743
60247A435221n647n249m363k629j146j019k018l051l525l606l335k323n50J308
60233A398068K832M372N890O204M555K377K020L816N800O471O340O355O331N917
60219A467348N864P132R258J0826J1318J1642J2736J4300J5253J5213J5122J6160
60207A612172J8142J9595J9649J9194J9647K1312K3620K6281K9207L2010L4788
60196A875617L8734M4406M9983N3164N4653N7619O3442P0093P5424Q0048Q5834
$$ plain form
60185 2549017 2642147 2743011 2851320 2966839 3089564 3219711 3357503 3502398 3652895 3807679
60175 3807679 3966390 4128272 4290679 4450232 4605154 4755018 4898242 5031295 5150701
60166 5150701 5254698 5342763 5414681 5470431 5510025 5533163 5540040 5532725 5514725 5488861 5456511
60155 5456511 5419236 5380038 5342429 5309136 5282333 5264400 5257714 5263976 5284068 5318179 5366085 5427826
60143 5427826 5504245 5596119 5702754 5822164 5952688 6093519 6243478 6400052 6559666 6717921
60133 6717921 6869573 7009669 7135297 7245337 7338270 7411386 7462554 7491416 7498258 7483083 7446677
60122 7446677 7391326 7319453 7232884 7134805 7031161 6928195 6829149 6735211 6649294 6576731 6521929
60111 6521929 6486044 6468529 6469433 6489256 6527780 6584224 6657865 6747337 6849595 6960425 7075807
$$ packed form
60185B549017R3130J00864J08309J15519J22725J30147J37792J44895J50497J54784
60175C807679J58711J61882J62407J59553J54922J49864J43224J33053J19406
60166E150701J03997Q8065P1918N5750L9594K3138O877p315j8000k5864l2350
60155E456511l7275l9198l7609l3293k6803j7933o686O262K0092L4111M7906O1741
60143E427826P6419R1874J06635J19410J30524J40831J49959J56574J59614J58255
60133F717921J51652J40096J25628J10040R2933P3116N1168K8862O842j5175l6406
60122G446677n5351p1873q6569r8079j03644j02966r9046r3938q5917p2563n4802
60111F521929l5885j7515R04J9823L8524N6444P3641Q9472J02258J10830J15382
$$ plain form
60100 7075807 7192042 7304915 7409945 7503827 7584909 7652059 7703932 7739939 7761078 7768909 7764236
60089 7764236 7748028 7723569 7696338 7671226 7650771 7636636 7631826 7640515 7666298 7711589 7778311 7868119
60077 7868119 7982074 8121049 8286516 8480254 8703370 8956415 9240445 9557017 9906834
60068 9906834 10288964 10701452 11141946 11607385 12093631 12595680 13107707 13622623 14131989
60059 14131989 14626662 15097394 15535046 15931105 16278615 16572259 16807142 16977667 17078186
60050 17078186 17105244 17059400 16944723 16766188 16527678 16233007 15888789 15505435 15095058 14669219
60040 14669219 14238780 13814264 13404814 13017404 12658142 12333475 12048638 11805495 11603558
60031 11603558 11442867 11324327 11247463 11209781 11208551 11241532 11305389 11394781 11503433 11624788
$$ packed form
60100G075807J16235J12873J05030R3882Q1082O7150N1873L6007K1139P831m673
60089G764236j6208k4459k7231k5112k0455j4135m810Q689K5783M5291O6722Q9808
60077G868119J13955J38975J65467J93738K23116K53045K84030L16572L49817
60068I906834L82130M12488M40494M65439M86246N02049N12027N14916N09366
60059A4131989M94673M70732M37652L96059L47510K93644K34883J70525J00519
60050A7078186K7058m5844j14677j78535k38510k94671l44218l83354m10377m25839
60040A4669219m30439m24516m09450l87410l59262l24667k84837k43143k01937
60031A1603558j60691j18540p6864l7682j230L2981O3857Q9392J08652J21355
$$ plain form
60021 11624788 11751312 11874794 11988208 12086284 12164007 12216138 12238956 12231125 12192192 12121736 12020872
60010 12020872 11892951 11741396 11567895 11373991 11163289 10940672 10710194 10475176 10239555
60001 10239555 10007414 9781486 9563608 9356437 9163378 8986658 8826715 8683718 8558830
59992 8558830 8453753 8369757 8307412 8266840 8248066 8251334 8276971 8324751 8393557 8481709 8587132
59981 8587132 8707033 8838020 8976658 9118961 9258833 9388107 9499274 9587958 9652475 9691896
59971 9691896 9705429 9692767 9653697 9587563 9494099 9374777 9232961 9073322 8901674 8724410
59961 8724410 8546721 8371654 8201744 8040974 7893855 7762950 7648713 7551717 7473701 7416235
59951 7416235 7379519 7362987 7366312 7389574 7433274 7498509 7586574 7698057 7832653 7989577 8167239
$$ packed form
60021A1624788J26524J23482J13414R8076P7723N2131K2818p831l8933p0456j00864
60010A2020872j27921j51555j73501j93904k10702k22617k30478k35018k35621
60001A0239555k32141k25928k17878k07171j93059j76720j59943j42997j24888
59992H558830j05077q3996o2345m0572j8774L268K5637M7780O8806Q8152J05423
59981H587132J19901J30987J38638J42303J39872J29274J11167Q8684O4517L9421
59971I691896J3533j2662l9070o6134r3464j19322j41816j59639j71648j77264
59961H724410j77689j75067j69910j60770j47119j30905j14237r6996p8016n7466
59951G416235l6716j6532L325K3262M3700O5235Q8065J11483J34596J56924J77662
$$ plain form
59940 8167239 8362344 8570069 8785488 9004348 9222335 9434072 9633063 9812330 9965500
59931 9965500 10088258 10179119 10238251 10265301 10258969 10218803 10146707 10046167 9920637 9773427 9609148
59920 9609148 9434599 9257720 9085363 8921800 8769236 8629667 8506184 8402455 8321244 8263632
59910 8263632 8229518 8218640 8231145 8267303 8326606 8407174 8506256 8621327 8750357 8891084 9040630
59899 9040630 9196085 9354826 9513835 9669188 9816891 9954088 10079200 10191349 10290220 10376251
59889 10376251 10450556 10514880 10571954 10625496 10679372 10736976 10801738 10877836 10969985 11082898 11221343
59878 11221343 11390130 11593213 11832958 12110737 12427817 12785020 13181709 13615549 14082646
59869 14082646 14576975 15089706 15609716 16124442 16619530 17077958 17480845 17809952 18049896
$$ packed form
59940H167239J95105K07725K15419K18860K17987K11737J98991J79267J53170
59931I965500J22758R0861N9132K7050o332m0166p2096j00540j25530j47210j64279
59920I609148j74549j76879j72357j63563j52564j39569j23483j03729q1211n7612
59910H263632l4114j0878J2505L6158N9303Q0568R9082J15071J29030J40727J49546
59899I040630J55455J58741J59009J55353J47703J37197J25112J12149R8871Q6031
59889A0376251P4305O4324N7074N3542N3876N7604O4762P6098R2149J12913J38445
59878A1221343J68787K03083K39745K77779L17080L57203L96689M33840M67097
59869A4082646M94329N12731N20010N14726M95088M58428M02887L29107K39944
$$ plain form
59860 18049896 18189196 18221085 18144493 17964336 17690647 17337043 16919114 16453142 15955635 15443209
59850 15443209 14931441 14432738 13955610 13506429 13091155 12714631 12379225 12085800 11835851
59841 11835851 11631361 11472664 11357925 11285008 11252475 11258289 11298904 11370731 11471760 11600610
59831 11600610 11754064 11925948 12107974 12290865 12464744 12619192 12743616 12828008 12863857 12844833
59821 12844833 12767063 12629217 12432746 12182054 11884259 11548503 11184938 10803332 10411921
59812 10411921 10017528 9626694 9245907 8880272 8532624 8204686 7898607 7616519 7359010
59803 7359010 7125182 6914138 6725505 6558479 6411343 6282232 6169543 6071244 5984427 5906003
59793 5906003 5833480 5764933 5698789 5634057 5570581 5508874 5449904 5394943 5345159 5301150 5263070
$$ packed form
59860A8049896J39300L1889p6592j80157k73689l53604m17929m65972m97507n12426
59850A5443209n11768m98703m77128m49181m15274l76524l35406k93425k49949
59841A1835851k04490j58697j14739p2917l2533N814M0615P1827J01029J28850
59831A1600610J53454J71884J82026J82891J73879J54448J24424Q4392L5849j9024
59821A2844833p7770j37846j96471k50692k97795l35756l63565l81606l91411
59812A0411921l94393l90834l80787l65635l47648l27938l06079k82088k57509
59803G359010k33828k11044j88633j67026j47136j29111j12689r8299q6817p8424
59793E906003p2523o8547o6144o4732o3476o1707n8970n4961m9784m4009l8080
$$ plain form
59782 5263070 5231033 5204897 5183427 5163998 5143310 5118466 5087596 5049722 5004124 4950108 4888013
59771 4888013 4820416 4751423 4684173 4619658 4558300 4501543 4450896 4406428 4367741 4335884 4312803
59760 4312803 4299261 4294904 4300201 4316517 4343988 4381109 4427064 4482946 4549922 4627414 4713738 4807031
59748 4807031 4904523 5002267 5097292 5189620 5280980 5371863 5460614 5544678 5621479 5688482 5743843
59737 5743843 5787470 5820889 5846094 5865056 5880227 5894838 5912596 5937278 5972167 6019207 6078922
59726 6078922 6151843 6239909 6346005 6472481 6620892 6792908 6990532 7215382 7468736 7752406
59716 7752406 8068590 8418272 8800400 9212747 9652213 10112637 10581948 11041620 11468396
59707 11468396 11836315 12119131 12294954 12352301 12293557 12133294 11893398 11598456 11272435 10936056
$$ packed form
59782E263070l2037k6136k1470j9429k0688k4844l0870l7874m5598n4016o2095
59771D888013o7597o8993o7250o4515o1358n6757n0647m4468l8687l1857k3081
59760D312803j3542m357N297J6316K7471L7121M5955N5882O6976P7492Q6324R3293
59748D807031R7492R7744R5025R2328R1360R0883Q8751Q4064P6801O7003N5361
59737E743843M3627L3419K5205J8962J5171J4611J7758K4682L4889M7040N9715
59726F078922P2921Q8066J06096J26476J48411J72016J97624K24850K53354K83670
59716G752406L16184L49682L82128M12347M39466M60424M69311M59672M26776
59707A1468396L67919K82816J75823N7347n8744j60263k39896k94942l26021l36379
$$ plain form
59697 10936056 10605378 10292358 10006148 9753210 9536679 9357022 9213963 9107370 9036427
59688 9036427 8999041 8992678 9015363 9065686 9142641 9245947 9375950 9532690 9715575 9924321
59678 9924321 10159612 10422335 10712761 11031099 11378360 11756217 12166609 12611958 13095062
59669 13095062 13618025 14181920 14788122 15439107 16136987 16881979 17673189 18509837 19390034
59660 19390034 20308866 21259211 22233831 23224525 24219317 25203083 26162443 27089368 27980219
59651 27980219 28833729 29651576 30439637 31206920 31963520 32720097 33487392 34273313 35079391
59642 35079391 35900602 36728331 37552151 38358460 39128925 39842018 40476848 41016128 41446830
59633 41446830 41760101 41952381 42027426 41997064 41879341 41695353 41466998 41216264 40964788 40732943
$$ packed form
59697A0936056l30678l13020k86210k52938k16531j79657j43059j06593p0943
59688I036427l7386o363K2685N0323P6955J03306J30003J56740J82885K08746
59678I924321K35291K62723K90426L18338L47261L77857M10392M45349M83104
59669A3095062N22963N63895O06202O50985O97880P44992P91210Q36648Q80197
59660A9390034R18832R50345R74620R90694R94792R83766R59360R26925Q90851
59651B7980219Q53510Q17847P88061P67283P56600P56577P67295P85921Q06078
59642C5079391Q21211Q27729Q23820Q06309P70465P13093O34830N39280M30702
59633D1446830L13271J92280P5045l0362j17723j83988k28355k50734k51476k31845
$$ plain form
59623 40732943 40539139 40399878 40329937 40341964 40445850 40648837 40956414 41373151 41902520 42545720
59613 42545720 43300461 44160496 45115471 46150211 47243660 48368468 49491033 50570869
59605 50570869 51560055 52405315 53053380 53456878 53578674 53395831 52903934 52118952 51074007
59596 51074007 49813305 48387351 46849608 45252092 43640500 42052158 40516779 39056410
59588 39056410 37683270 36398540 35194068 34054720 32959081 31880371 30790690 29668108
59580 29668108 28502488 27296663 26063162 24819566 23585240 22379435 21219045 20116088
59572 20116088 19077169 18105426 17202183 16366541 15595260 14884825 14233054 13637383 13092656
59563 13092656 12592725 12133986 11715312 11334473 10986795 10667976 10376366 10111486 9871611
$$ packed form
59623D0732943j93804j39261o9941J2027J03886K02987L07577M16737N29369O43200
59613D2545720P54741Q60035R54975J034740J093449J124808J122565J079836
59605E0570869R89186Q45260O48065M03498J21796j82843m91897p84982j044945
59596E1074007j260702j425954j537743j597516j611592j588342j535379j460369
59588C9056410j373140j284730j204472j139348j095639j078710j089681j122582
59580B9668108j165620j205825j233501j243596j234326j205805j160390j102957
59572B0116088j038919r71743r03243q35642p71281p10435o51771n95671n44727
59563A3092656m99931m58739m18674l80839l47678l18819k91610k64880k39875
$$ plain form
59554 9871611 9653736 9454788 9271972 9102574 8944044 8793663 8648031 8503870 8359491
59545 8359491 8214369 8067186 7915807 7759622 7600344 7439833 7278593 7117249 6957969
59536 6957969 6803224 6654321 6512290 6379012 6256106 6143565 6040760 5948117 5866612 5796365
59526 5796365 5737038 5689065 5653127 5628688 5614181 5608445 5611069 5621689 5639903 5665589 5698293 5736534
59514 5736534 5778609 5823922 5872690 5924603 5978777 6035002 6094185 6157436 6225450 6298968 6379416
59503 6379416 6468893 6569614 6683129 6809816 6949367 7102006 7268915 7451282 7649515 7863856
59493 7863856 8095379 8345881 8616936 8909186 9222226 9554991 9906500 10276006 10661866
59484 10661866 11060573 11467822 11880164 12294255 12704554 13103723 13485940 13848292 14188397
$$ packed form
59554I871611k17875j98948j82816j69398j58530j50381j45632j44161j44379
59545H359491j45122j47183j51379j56185j59278j60511j61240j61344j59280
59536F957969j54745j48903j42031j33278j22906j12541j02805r2643q1505p0247
59526E796365n9327m7973l5938k4439j4507n736K624J0620J8214K5686L2704L8241
59514E736534M2075M5313M8768N1913N4174N6225N9183O3251O8014P3518Q0448
59503F379416Q9477J00721J13515J26687J39551J52639J66909J82367J98233K14341
59493G863856K31523K50502K71055K92250L13040L32765L51509L69506L85860
59484A0661866L98707M07249M12342M14091M10299L99169L82217L62352L40105
$$ plain form
59475 14188397 14502779 14788917 15046883 15276805 15475889 15640285 15769490 15867329 15939339 15991253
59465 15991253 16029692 16061898 16094097 16131460 16179889 16246122 16335228 16448656 16584824 16740260
59455 16740260 16909426 17083945 17252467 17401272 17515700 17582391 17590804 17532695 17401121 17191512
59445 17191512 16903879 16542981 16116295 15632868 15104138 14544256 13968369 13390534 12822874
59436 12822874 12275362 11755399 11267857 10815853 10401364 10025180 9686968 9385759 9120118
59427 9120118 8888017 8687208 8516047 8373619 8259008 8170826 8107511 8067694 8050302 8054755
59417 8054755 8081197 8130220 8202366 8298001 8417426 8560628 8727085 8916203 9127672 9360743
59407 9360743 9613147 9881250 10161243 10449550 10741643 11030617 11307131 11560844 11782110
$$ packed form
59475A4188397L14382K86138K57966K29922J99084J64396J29205R7839P2010N1914
59465A5991253L8439L2206L2199L7363M8429O6233Q9106J13428J36168J55436
59455A6740260J69166J74519J68522J48805J14428O6691Q413n8109j31574k09609
59445A7191512k87633l60898m26686m83427n28730n59882n75887n77835n67660
59436A2822874n47512n19963m87542m52004m14489l76184l38212l01209k65641
59427I120118k32101k00809j71161j42428j14611q8182o3315l9817j7392M453
59417H054755K6442M9023P2146R5635J19425J43202J66457J89118K11469K33071
59407I360743K52404K68103K79993K88307K92093K88974K76514K53713K21266
$$ plain form
59398 11782110 11962521 12094233 12169749 12183408 12133172 12020281 11847439 11618614 11340740 11023906
59388 11023906 10678631 10313600 9936434 9554996 9176309 8805043 8444557 8098813 7771676
59379 7771676 7464644 7176776 6907002 6655460 6422870 6209842 6016711 5842924 5686586
59370 5686586 5545627 5419223 5307134 5208096 5120336 5043528 4978657 4925767 4883282 4849807 4825236
59359 4825236 4809723 4802829 4804174 4813729 4830894 4854381 4883619 4919351 4962397 5012762 5070302 5134831
59347 5134831 5204472 5274908 5341755 5403916 5464347 5528034 5599526 5681532 5774877 5879936 5998388
59336 5998388 6132928 6284421 6449688 6623107 6800868 6983810 7176618 7385014 7613647
59327 7613647 7865824 8144168 8450968 8788172 9157795 9562686 10006301 10491219 11018297
$$ packed form
59398A1782110J80411J31712P5516J3659n0236j12891j72842k28825k77874l16834
59388A1023906l45275l65031l77166l81438l78687l71266l60486l45744l27137
59379G771676l07032k87868k69774k51542k32590k13028j93131j73787j56338
59370E686586j40959j26404j12089r9038q7760p6808o4871n2890m2485l3475k4571
59359D825236j5513o894J345R555J7165K3487K9238L5732M3046N0365N7540O4529
59347E134831O9641P0436O6847O2161O0431O3687P1492Q2006R3345J05059J18452
59336E998388J34540J51493J65267J73419J77761J82942J92808K08396K28633
59327G613647K52177K78344L06800L37204L69623M04891M43615M84918N27078
$$ plain form
59318 11018297 11587825 12200957 12858943 13560901 14302824 15078324 15879063 16694224 17510553
59309 17510553 18313683 19089609 19825733 20512059 21142181 21712790 22222202 22669980 23057775
59300 23057775 23389275 23668484 23898173 24079746 24213418 24297837 24330092 24306507 24223142 24075834
59290 24075834 23861379 23580104 23237191 22840967 22400009 21921915 21413732 20882156 20332932
59281 20332932 19770479 19198160 18618674 18034441 17448320 16864251 16287010 15721161 15170545
59272 15170545 14639050 14131584 13653491 13208447 12797177 12418719 12072669 11759582 11479556
59263 11479556 11231712 11015200 10829305 10671857 10538859 10426836 10334596 10261351 10203872 10157138
59253 10157138 10117377 10082875 10051852 10021048 9986639 9945314 9894385 9832214 9758977 9675956 9583894
$$ packed form
59318A1018297N69528O13132O57986P01958P41923P75500Q00739Q15161Q16329
59309A7510553Q03130P75926P36124O86326O30122N70609N09412M47778L87795
59300B3057775L31500K79209K29689J81573J33672Q4419L2255k3585q3365j47308
59290B4075834k14455k81275l42913l96224m40958m78094n08183n31576n49224
59281B0332932n62453n72319n79486n84233n86121n84069n77241n65849n50616
59272A5170545n31495n07466m78093m45044m11270l78458l46050l13087k80026
59263A1479556k47844k16512j85895j57448j32998j12023r2240p3245n7479m6734
59253A0157138l9761l4502l1023l0804l4409m1325n0929o2171p3237q3021r2062
$$ plain form
59242 9583894 9483221 9376065 9266456 9157727 9050766 8945612 8843764 8747931 8660247 8581725
59232 8581725 8513182 8455989 8412035 8383247 8370778 8374495 8393766 8428976 8481717 8553329 8643978
59221 8643978 8753439 8881857 9029107 9194105 9375449 9572234 9783592 10007851 10242761
59212 10242761 10486073 10734966 10984851 11229333 11461621 11675860 11867204 12030900 12161660
59203 12161660 12254512 12306905 12320017 12297407 12241947 12154087 12032952 11878643 11693349 11480852
59193 11480852 11245664 10992985 10729329 10462418 10199337 9944292 9698762 9464175 9243649
59184 9243649 9040451 8855783 8689365 8541645 8414010 8307094 8220435 8153948 8108525 8085076
59174 8085076 8084274 8107546 8157013 8234075 8339089 8472756 8636663 8832138 9059853 9321118
$$ packed form
59242I583894j00673j07156j09609j08729j06961j05154j01848r5833q7684p8522
59232H581725o8543n7193m3954k8788j2469L717J9271L5210N2741P1612R0649
59221H643978J09461J28418J47250J64998J81344J96785K11358K24259K34910
59212A0242761K43312K48893K49885K44482K32288K14239J91344J63696J30760
59203A2161660R2852N2393J3112k2610n5460q7860j21135j54309j85294k12497
59193A1480852k35188k52679k63656k66911k63081k55045k45530k34587k20526
59184I243649k03198j84668j66418j47720j27635j06916q6659o6487m5423k3449
59174H085076q02K3272M9467P7062J05014J33667J63907J95475K27715K61265
$$ plain form
59164 9321118 9618225 9952624 10323531 10728798 11165880 11630816 12116872 12614770 13113220
59155 13113220 13598255 14052929 14459198 14800480 15062609 15233763 15305230 15272564 15135697 14898546
59145 14898546 14569390 14161275 13690653 13174649 12629094 12068283 11505590 10953607 10423325
59136 10423325 9922770 9456363 9025846 8631861 8274536 7952995 7665111 7407927 7178050
59127 7178050 6972159 6788009 6624794 6481762 6356866 6247870 6154304 6076713 6013966 5963083
59117 5963083 5922180 5891859 5873013 5864893 5866300 5877061 5896949 5924373 5957693 5997071 6043695 6097768
59105 6097768 6158404 6224860 6296694 6373278 6454291 6540121 6630463 6722932 6814209 6902039 6984697
59094 6984697 7058990 7120776 7168024 7202011 7224683 7235608 7232141 7212126 7176036 7126958 7069026
$$ packed form
59164I321118K97107L34399L70907M05267M37082M64936M86056M97898M98450
59155A3113220M85035M54674M06269L41282K62129J71154P1467l2666j36867k37151
59145A4898546l29156m08115m70622n16004n45555n60811n62693n51983n30282
59136A0423325n00555m66407m30517l93985l57325l21541k87884k57184k29877
59127G178050k05891j84150j63215j43032j24896j08996r3566p7591o2747n0883
59117E963083m0903l0321j8846q120J407J0761J9888K7424L3320L9378M6624N4073
59105F097768O0636O6456P1834P6584Q1013Q5830R0342R2469R1277Q7830Q2658
59094F984697P4293O1786M7248L3987K2672J0925l467k0015l6090m9078n7932
$$ plain form
59083 7069026 7005669 6938850 6869627 6799223 6729519 6662762 6601073 6546153 6499193 6460936 6431806
59072 6431806 6412073 6402256 6403655 6417981 6445835 6485920 6536694 6598700 6674217 6764609 6869214
59061 6869214 6987145 7118792 7264793 7424794 7598404 7786601 7990898 8211441 8447022
59052 8447022 8696765 8960629 9237922 9525970 9820802 10119035 10418885 10719145 11017092
59043 11017092 11307622 11584579 11842289 12074986 12275220 12434220 12544152 12599185 12594466 12525721
59033 12525721 12390887 12191602 11932711 11621082 11265161 10874552 10459041 10028024 9590423
59024 9590423 9153845 8723598 8303722 7899118 7514990 7153726 6814192 6495066 6197248
59015 6197248 5921766 5667175 5430968 5212467 5012179 4828780 4658692 4498821 4348538
$$ packed form
59083G069026o3357o6819o9223p0404o9704o6757o1689n4920m6960l8257k9130
59072F431806j9733r817J399J4326K7854M0085N0774O2006P5517R0392J04605
59061F869214J17931J31647J46001J60001J73610J88197K04297K20543K35581
59052H447022K49743K63864K77293K88048K94832K98233K99850L00260K97947
59043A1017092K90530K76957K57710K32697K00234J59000J09932N5033m719o8745
59033A2525721j34834j99285k58891l11629l55921l90609m15511m31017m37601
59024I590423m36578m30247m19876m04604l84128l61264l39534l19126k97818
59015F197248k75482k54591k36207k18501k00288j83399j70088j59871j50283
$$ plain form
59006 4348538 4208871 4080537 3962679 3852932 3748999 3650443 3558227 3472410 3391649 3315568
58996 3315568 3245711 3182707 3124144 3067246 3012511 2962518 2917865 2876410 2836184 2796900 2758796
58985 2758796 2722148 2688157 2658396 2632892 2610191 2589604 2572042 2558476 2548969 2543392 2541556 2542283
58973 2542283 2543841 2545872 2549782 2556840 2567055 2580208 2596559 2615842 2636717 2658085 2680151 2703495
58961 2703495 2727647 2750996 2771605 2788029 2800138 2809401 2817603 2825104 2831033 2835113 2838218 2841067 2843751
58948 2843751 2847024 2852717 2862025 2874260 2888038 2902720 2917873 2932146 2943842 2952211 2957357 2959385
58936 2959385 2958558 2955897 2952581 2948888 2944613 2940399 2937557 2936438 2936175 2936662 2939773 2947478 2959119 2971683
58922 2971683 2982921 2993323 3004860 3018879 3035815 3055980 3079465 3105700 3134230 3165737 3201101
$$ packed form
59006D348538j39667j28334j17858j09747j03933r8556r2216q5817q0761p6081
58996C315568o9857o3004n8563n6898n4735m9993m4653m1455m0226l9284l8104
58985B758796l6648l3991k9761k5504k2701k0587j7562j3566r507n577j836P27
58973B542283J558K031L910P058J0215J3153J6351J9283K0875K1368K2066K3344
58961B703495K4152K3349K0609J6424J2109R263Q202P501N929M080L105K849K684
58948B843751L273N693R308J2235J3778J4682J5153J4273J1696Q369N146K028
58936B959385q27k661l316l693m275m214k842j119k63M87L111P705J1641J2564
58922B971683J1238J0402J1537J4019J6936K0165K3485K6235K8530L1507L5364
$$ plain form
58911 3201101 3239481 3278535 3316884 3355324 3395291 3437279 3481359 3528150 3578385 3632139 3689172
58900 3689172 3749397 3812332 3876793 3941937 4008198 4076591 4147618 4221390 4298252 4378689 4463163
58889 4463163 4552488 4647717 4749221 4856712 4970695 5092775 5223734 5362444 5507840 5660994
58879 5660994 5823876 5996822 6178800 6369805 6571568 6785941 7013742 7255102 7510010
58870 7510010 7778753 8062688 8364340 8685970 9028626 9393570 9783895 10203285 10653573
58861 10653573 11134996 11648656 12197218 12783173 13407987 14073156 14780493 15530539 16321707
58852 16321707 17151666 18018730 18920920 19853561 20807762 21770600 22726285 23657136 24543494
58843 24543494 25363052 26091255 26703461 27177466 27495076 27643540 27617441 27419582 27059707
$$ packed form
58911C201101L8380L9054L8349L8440L9967M1988M4080M6791N0235N3754N7033
58900C689172O0225O2935O4461O5144O6261O8393P1027P3772P6862Q0437Q4474
58889D463163Q9325R5229J01504J07491J13983J22080J30959J38710J45396J53154
58879E660994J62882J72946J81978J91005K01763K14373K27801K41360K54908
58870G510010K68743K83935L01652L21630L42656L64944L90325M19390M50288
58861A0653573M81423N13660N48562N85955O24814O65169P07337P50046P91168
58852A6321707Q29959Q67064R02190R32641R54201R62838R55685R30851Q86358
58843B4543494Q19558P28203O12206M74005L17610J48464k6099j97859l59875
$$ plain form
58834 27059707 26552618 25917335 25176252 24353000 23470355 22549727 21611063 20671751 19745821
58825 19745821 18844641 17977455 17150412 16366266 15626371 14932347 14284835 13681833 13119882
58816 13119882 12596146 12107985 11651604 11223297 10821594 10446289 10095634 9766457 9456942
58807 9456942 9167429 8898278 8648503 8416607 8201222 8000861 7814565 7642857 7486580
58798 7486580 7344700 7214701 7095184 6986538 6889055 6802115 6725612 6660486 6607249 6565223
58788 6565223 6533679 6512676 6502557 6503792 6517417 6544307 6583856 6634604 6696272 6769828 6855506
58777 6855506 6952363 7060050 7179528 7311609 7456251 7613720 7785023 7970645 8170229 8384167
58767 8384167 8614225 8861973 9127724 9411759 9715613 10041429 10390809 10764933 11165326
$$ packed form
58834B7059707n07089o35283p41083q23252q82645r20628r38664r39312r25930
58825A9745821r01180q67186q27043p84146p39895o94024o47512o03002n61951
58816A3119882n23736m88161m56381m28307m01703l75305l50655l29177l09515
58807I456942k89513k69151k49775k31896k15385k00361j86296j71708j56277
58798G486580j41880j29999j19517j08646r7483q6940p6503o5126n3237m2026
58788F565223l1544k1003j0119J235J3625K6890L9549N0748O1668P3556Q5678
58777F855506R6857J07687J19478J32081J44642J57469J71303J85622J99584K13938
58767H384167K30058K47748K65751K84035L03854L25816L49380L74124M00393
$$ plain form
58758 11165326 11594147 12054196 12548607 13079966 13649908 14260120 14913075 15610481 16351334
58749 16351334 17132660 17951624 18805118 19687236 20588396 21496361 22395913 23267272 24086812
58740 24086812 24830173 25473887 25994895 26371718 26587984 26634446 26508121 26212035 25756868
58731 25756868 25160927 24446683 23637323 22755954 21825511 20867471 19900802 18942028 18004796
58722 18004796 17098665 16229340 15400611 14615346 13874903 13179315 12528372 11921271 11355195
58713 11355195 10825942 10330121 9865165 9427455 9012855 8619715 8249146 7901642 7575399
58704 7575399 7268536 6980547 6710480 6455965 6215586 5990405 5781692 5588678 5409762
58695 5409762 5244107 5090586 4946905 4811543 4685343 4569607 4463692 4365843 4275183 4191464
$$ packed form
58758A1165326M28821M60049M94411N31359N69942O10212O52955O97406P40853
58749A6351334P81326Q18964Q53494Q82118R01160R07965Q99552Q71359Q19540
58740B4086812P43361O43714N21008L76823K16266M6462j26325k96086m55167
58731B5756868n95941p14244q09360q81369r30443r58040r66669r58774r37232
58722A8004796r06131q69325q28729p85265p40443o95588o50943o07101n66076
58713A1355195n29253m95821m64956m37710m14600l93140l70569l47504l26243
58704G575399l06863k87989k70067k54515k40379k25181k08713j93014j78916
58695E409762j65655j53521j43681j35362j26200j15736j05915r7849r0660q3719
$$ plain form
58685 4191464 4113965 4042167 3976514 3917094 3862380 3810625 3761832 3717181 3677111 3640696 3606039
58674 3606039 3570586 3532328 3491688 3451074 3411611 3371500 3328503 3282650 3235373 3187411 3139006
58663 3139006 3090841 3043083 2994346 2943049 2889208 2833843 2777593 2720987 2664949 2609686 2553959
58652 2553959 2496823 2439291 2383250 2329550 2278240 2229545 2183355 2138877 2096127 2056754 2021917
58641 2021917 1990267 1959526 1929234 1900462 1873668 1848524 1825254 1804388 1785367 1766749 1747730
58630 1747730 1728590 1710040 1693050 1678732 1667394 1658112 1649996 1643233 1638258 1634869 1632871 1632355 1632235
58617 1632235 1629844 1623648 1615549 1609008 1605466 1603885 1602948 1602101 1600979 1599468 1598252 1598106 1598944 1600564 1603756
58602 1603756 1609342 1616458 1623025 1627720 1630428 1631073 1629155 1624476 1617530 1609283 1601208 1595200 1592776 1594418
$$ packed form
58685D191464p7499p1798o5653n9420n4714n1755m8793m4651m0070l6415l4657
58674C606039l5453l8258m0640m0614l9463m0111m2997m5853m7277m7962m8405
58663C139006m8165m7758m8737n1297n3841n5365n6250n6606n6038n5263n5727
58652B553959n7136n7532n6041n3700n1310m8695m6190m4478m2750l9373l4837
58641B021917l1650l0741l0292k8772k6794k5144k3270k0866j9021j8618j9019
58630A747730j9140j8550j6990j4318j1338r282q116o763m975l389j998n16j20
58617A632235k391o196q099o541l542j581r37q47j122j511j216j46Q38J620L192
58602A603756N586P116O567M695K708O45j918m679o946q247q075o008k424J642
$$ plain form
58588 1594418 1599900 1608680 1619844 1632672 1647797 1666822 1690230 1716730 1745246 1776282 1810427 1846840
58576 1846840 1884559 1924421 1968338 2017210 2070556 2127617 2188024 2252074 2321176 2397339 2481377
58565 2481377 2572243 2668685 2770904 2880301 2998705 3128242 3270546 3425321 3591000 3767631
58555 3767631 3957867 4164350 4387401 4625880 4878577 5143571 5417588 5696910 5977415
58546 5977415 6252677 6513519 6750513 6955495 7120067 7235130 7293897 7294158 7236796 7124492
58536 7124492 6963618 6765014 6540064 6296889 6041704 5781718 5524192 5273986 5034273
58527 5034273 4808273 4598008 4402693 4220917 4053417 3901508 3764100 3639011 3526366
58518 3526366 3427969 3343644 3270614 3206270 3149444 3099118 3053870 3012614 2974434 2938102 2903064
$$ packed form
58588A594418N482Q780J1164J2828J5125J9025K3408K6500K8516L1036L4145L6413
58576A846840L7719L9862M3917M8872N3346N7061O0407O4050O9102P6163Q4038
58565B481377R0866R6442J02219J09397J18404J29537J42304J54775J65679J76631
58555C767631J90236K06483K23051K38479K52697K64994K74017K79322K80505
58546E977415K75262K60842K36994K04982J64572J15063N8767K61n7362j12304
58536G124492j60874j98604k24950k43175k55185k59986k57526k50206k39713
58527E034273k26000k10265j95315j81776j67500j51909j37408j25089j12645
58518C526366r8397q4325p3030o4344n6826n0326m5248m1256l8180l6332l5038
$$ plain form
58507 2903064 2870163 2839940 2811042 2781763 2752042 2722366 2691827 2659035 2623785 2586051 2544690
58496 2544690 2499320 2452279 2406348 2361437 2315729 2269234 2224017 2181659 2142543 2106577 2072502
58485 2072502 2037625 2000684 1964023 1930528 1899514 1868216 1836247 1805509 1776433 1747533 1718572
58474 1718572 1691217 1666295 1642826 1619914 1597566 1575735 1554520 1534983 1517801 1501644 1484895
58463 1484895 1468244 1453344 1439748 1425727 1411427 1398470 1386844 1374952 1362572 1351101 1341000
58452 1341000 1331518 1322902 1316381 1311869 1307859 1303568 1299303 1295161 1291425 1289628 1290933 1294096 1297348 1301441
58438 1301441 1308317 1317600 1327260 1336957 1347777 1359368 1370601 1382573 1397532 1415095 1432797 1450144
58426 1450144 1468516 1487064 1502407 1512923 1519892 1523924 1523756 1519446 1513292 1506252 1496303 1481751 1463805
$$ packed form
58507B903064l2901l0223k8898k9279k9721k9676l0539l2792l5250l7734m1361
58496B544690m5370m7041m5931m4911m5708m6495m5217m2358l9116l5966l4075
58485B072502l4877l6941l6661l3495l1014l1298l1969l0738k9076k8900k8961
58474A718572k7355k4922k3469k2912k2348k1831k1215j9537j7182j6157j6749
58463A484895j6651j4900j3596j4021j4300j2957j1626j1892j2380j1471j0101
58452A341000r482q616o521m512m010m291m265m142l736j797J305L163L252M093
58438A301441O876R283R660R697J0820J1591J1233J1972J4959J7563J7702J7347
58426A450144J8372J8548J5343J0516O969M032j68m310o154p040r949j4552j7946
$$ plain form
58413 1463805 1444805 1426000 1407911 1390848 1374276 1357422 1340824 1325620 1311572 1297898 1285475
58402 1285475 1275586 1266920 1256854 1245686 1236599 1231366 1229062 1228917 1231085 1234403 1236795 1238440 1241408 1245752
58388 1245752 1249265 1251533 1254735 1259699 1264648 1268835 1273952 1280800 1287844 1294465 1302441 1312697 1323493
58375 1323493 1333421 1343556 1354993 1366668 1377168 1386645 1395664 1404085 1412003 1419820 1426673 1430827 1432229
58362 1432229 1432626 1432775 1431819 1429662 1427415 1425072 1421155 1415045 1407466 1398836 1389738 1382644 1380020 1380807 1381996
58347 1381996 1383492 1387812 1395132 1402739 1409698 1417732 1426746 1433747 1437484 1440042 1442464 1442618 1439027 1433226
58333 1433226 1426798 1419472 1411491 1404425 1398351 1391625 1384542 1379465 1376114 1370785 1361946 1352835 1346806 1343898
58319 1343898 1343807 1348311 1358302 1371656 1386177 1401778 1418128 1433438 1447324 1461718 1477325 1492344
$$ packed form
58413A463805j9000j8805j8089j7063j6572j6854j6598j5204j4048j3674j2423
58402A285475r889q666j0066j1168r087n233k304j45K168L318K392J645K968M344
58388A245752L513K268L202M964M949M187N117O848P044O621P976J0256J0796
58375A323493R928J0135J1437J1675J0500R477R019Q421P918P817O853M154J402
58362A432229L97J49r56k157k247k343l917o110p579q630r098p094k624P87J189
58347A381996J496M320P320P607O959Q034R014P001L737K558K422J54l591n801
58333A433226o428p326p981p066o074o726p083n077l351n329q839r111o029k908
58319A343898r1M504R991J3354J4521J5601J6350J5310J3886J4394J5607J5019
$$ plain form
58307 1492344 1505964 1519622 1533420 1545136 1554457 1564380 1576632 1589524 1602069 1616162 1632533 1648497
58295 1648497 1662168 1675308 1689706 1704221 1717633 1731066 1745405 1759511 1772792 1786185 1799083
58284 1799083 1808936 1815286 1820306 1824226 1824826 1822865 1822899 1826652 1830826 1833782 1838925 1848502 1859460 1869097
58270 1869097 1879925 1895108 1913498 1932882 1953840 1976708 1998866 2018864 2039393 2062773 2087334
58259 2087334 2111460 2136951 2165072 2193642 2221489 2251408 2285183 2320180 2354448 2390387 2429433
58248 2429433 2467854 2502088 2533703 2564834 2593496 2618143 2642299 2669562 2697998 2724447 2750580
58237 2750580 2779836 2811942 2845236 2880949 2920609 2962520 3005106 3050471 3100697 3154088 3208606
58226 3208606 3265132 3323949 3382499 3440232 3500906 3566445 3633740 3701379 3773838 3854595 3940827
$$ packed form
58307A492344J3620J3658J3798J1716R321R923J2252J2892J2545J4093J6371J5964
58295A648497J3671J3140J4398J4515J3412J3433J4339J4106J3281J3393J2898
58284A799083R853O350N020L920O00j961L4L753M174K956N143R577J0958R637
58270A869097J0828J5183J8390J9384K0958K2868K2158J9998K0529K3380K4561
58259B087334K4126K5491K8121K8570K7847K9919L3775L4997L4268L5939L9046
58248B429433L8421L4234L1615L1131K8662K4647K4156K7263K8436K6449K6133
58237B750580K9256L2106L3294L5713L9660M1911M2586M5365N0226N3391N4518
58226C208606N6526N8817N8550N7733O0674O5539O7295O7639P2459Q0757Q6232
$$ plain form
58215 3940827 4029532 4122907 4222637 4324947 4426739 4530674 4638713 4746965 4852868 4961043
58205 4961043 5075703 5193565 5310993 5431730 5560444 5694915 5832211 5976641 6133867
58196 6133867 6302749 6480457 6669836 6874133 7090568 7317156 7559765 7824334 8108186
58187 8108186 8407344 8726059 9070447 9438999 9828143 10240642 10679455 11140189 11619259
58178 11619259 12123144 12660492 13232523 13840769 14495696 15206209 15968391 16776332 17636341
58169 17636341 18558348 19541402 20580814 21682023 22854029 24096882 25409551 26802321
58161 26802321 28286807 29861314 31520922 33274552 35137953 37119238 39227138 41483302
58153 41483302 43908151 46503071 49263938 52202925 55340680 58691244 62276921 66146334
$$ packed form
58215C940827Q8705R3375R9730J02310J01792J03935J08039J08252J05903J08175
58205D961043J14660J17862J17428J20737J28714J34471J37296J44430J57226
58196F133867J68882J77708J89379K04297K16435K26588K42609K64569K83852
58187H108186K99158L18715L44388L68552L89144M12499M38813M60734M79070
58178A1619259N03885N37348N72031O08246O54927P10513P62182Q07941Q60009
58169A7636341R22007R83054J039412J101209J172006J242853J312669J392770
58161B6802321J484486J574507J659608J753630J863401J981285K107900K256164
58153D1483302K424849K594920K760867K938987L137755L350564L585677L869413
$$ plain form
58145 66146334 70355841 74947177 79969277 85511158 91691970 98640090 106513556 115519719
58137 115519719 125873632 137748621 151298233 166698517 184127305 203748894 225808155
58130 225808155 250742006 279142163 311601620 348513778 389591768 432914018 474111655
58123 474111655 506919701 525461273 526886908 512397886 486070448 452700047 416227634
58116 416227634 379279461 343403266 309473029 278017206 249388870 223778443 201178418
58109 201178418 181414954 164231756 149344227 136455316 125279070 115569865 107121243
58102 107121243 99744726 93268716 87555786 82505593 78040762 74100204 70644324 67654758
58094 67654758 65123114 63041008 61400908 60204787 59469308 59219398 59476859 60254047 61542937
$$ packed form
58145F6146334M209507M591336N022100N541881O180812O948120P873466R006163
58137A15519719J0353913J1874989J3549612J5400284J7428788J9621589K2059261
58130B25808155K4933851K8400157L2459457L6912158M1077990M3322250M1197637
58123D74111655L2808046J8541572J425635j4489022k6327438l3370401l6472413
58116D16227634l6948173l5876195l3930237l1455823k8628336k5610427k2600025
58109B01178418j9763464j7183198j4887529j2888911j1176246r709205q448622
58102A07121243p376517o476010n712930n050193m464831l940558l455880k989566
58094F7654758k531644k082106j640100j196121p35479k49910K57461P77188J288890
$$ plain form
58085 61542937 63294127 65430322 67930626 70885608 74345758 77998176 81021151 82403048
58077 82403048 81523117 78470262 73857332 68405149 62681389 57066898 51792807 46966211
58069 46966211 42614804 38741448 35335957 32357444 29744981 27449997 25439024 23672385
58061 23672385 22106348 20713946 19480354 18378547 17370600 16433008 15561553 14750972
58053 14750972 13987898 13264832 12583890 11943861 11337295 10761943 10222143 9717519 9241875
58044 9241875 8793862 8377444 7991294 7628150 7284584 6961171 6653462 6353557 6061149
58035 6061149 5783654 5525246 5284468 5061630 4858799 4672443 4495145 4324837 4164427
58026 4164427 4013238 3867293 3727170 3596662 3474104 3353735 3235362 3124176 3021217
$$ packed form
58085F1542937J751190K136195K500304K954982L460150L652418L022975J381897
58077H2403048q79931l052855m612930n452183n723760n614491n274091m826596
58069D6966211m351407l873356l405491k978513k612463k294984k010973j766639
58061B3672385j566037j392402j233592j101807j007947r37592q71455q10581
58053A4750972p63074p23066o80942o40029o06566n75352n39800n04624m75644
58044I241875m48013m16418l86150l63144l43566l23413l07709k99905k92408
58035F061149k77495k58408k40778k22838k02831j86356j77298j70308j60410
58026D164427j51189j45945j40123j30508j22558j20369j18373j11186j02959
$$ plain form
58017 3021217 2922482 2827418 2739747 2659580 2582833 2508902 2440901 2377778 2314242 2249495 2188444
58006 2188444 2133163 2080377 2028488 1979943 1935382 1892291 1850823 1814385 1783096 1753023 1723183
57995 1723183 1696939 1674916 1652743 1627754 1602181 1577804 1552933 1526916 1502680 1482502 1465252
57984 1465252 1449557 1435832 1423959 1412603 1401776 1392557 1383906 1373596 1362527 1354090 1349043 1345026
57972 1345026 1341140 1338566 1336557 1332459 1326258 1320764 1316764 1312230 1306779 1302594 1300312 1298130 1295638 1294584
57958 1294584 1295426 1296971 1299577 1304567 1310250 1312926 1312373 1312077 1313457 1314067 1312102 1308466 1303705 1297172 1290048
57943 1290048 1285035 1282044 1278076 1272263 1267092 1263835 1260844 1257373 1255038 1254175 1252600 1249436 1246635 1245440
57929 1245440 1244735 1244066 1244729 1246361 1245693 1240281 1230916 1219364 1206556 1193833 1182947 1173738 1164444 1155044
$$ packed form
58017C021217r8735r5064q7671q0167p6747p3931o8001o3123o3536o4747o1051
58006B188444n5281n2786n1889m8545m4561m3091m1468l6438l1289l0073k9840
57995A723183k6244k2023k2173k4989k5573k4377k4871k6017k4236k0178j7250
57984A465252j5695j3725j1873j1356j0827r219q651j0310j1069q437n047m017
57972A345026l886k574k009m098o201n494m000m534n451m185k282k182k492j054
57958A294584Q42J545K606M990N683K676n53k96J380O10j965l636m761o533p124
57943A290048n013k991l968n813n171l257k991l471k335q63j575l164k801j195
57929A245440p05o69O63J632o68n412r365j1552j2808j2723j0886r209r294r400
$$ plain form
57915 1155044 1147653 1143157 1140313 1138467 1138103 1138487 1138116 1137821 1139870 1143579 1145477 1144437 1142760 1141356 1137983
57900 1137983 1131685 1125103 1120521 1116881 1112497 1107733 1103336 1098916 1094496 1090829 1086941 1080225 1070304 1060034
57886 1060034 1051549 1044185 1037389 1032459 1029975 1028539 1027563 1028357 1030958 1032976 1033262 1033751 1035839 1037855 1038151
57871 1038151 1037853 1038240 1037760 1033951 1026323 1015355 1000662 982343 962524 943685 926655 911417 898102
57858 898102 885971 873371 860177 848675 840813 836189 833584 832483 832158 831507 831031 832893 837825 844054
57844 844054 850185 856744 863778 869724 874230 879584 887380 895974 903082 908842 914507 920133 925513 931517
57830 931517 938470 944741 948823 951440 954052 956725 958776 959839 958918 954339 946299 937673 930613 924050
57816 924050 916172 907445 899261 891372 882818 874025 865970 858530 851624 846702 845162 846245 848282 851070
$$ packed form
57915A155044p391m496k844j846l64L84l71k95K049L709J898j040j677j404l373
57900A137983o298o582m582l640m384m764m397m420m420l667l888o716r921j0270
57886A060034q485p364o796m930k484j436r76P94K601K018K86M89K088K016K96
57871A038151k98L87m80l809p628j0968j4693j8319j9819j8839j7030j5238j3315
57858H98102j2131j2600j3194j1502p862m624k605j101l25o51m76J862M932O229
57844H44054O131O559P034N946M506N354P796Q594P108N760N665N626N380O004
57830I31517O953O271M082K617K612K673K051J063r21m579q040q626p060o563
57816I24050p878q727q184p889q554q793q055p440o906m922j540J083K037K788
$$ plain form
57802 851070 855464 861641 869253 878132 887331 894751 899434 903098 907726 912812 916684 919389 922256 925491
57788 925491 928172 930023 931296 931334 928945 924058 917707 910862 904451 899885 897962 897410 895678 891191 884120
57773 884120 875489 866550 858694 853027 849813 848385 847149 843915 837455 829010 820950 813522 804259 791191
57759 791191 775266 759007 744188 731540 721137 712010 702612 692593 683132 674983 667578 660519 654222
57746 654222 648433 642000 635015 629168 624953 620637 615237 610336 607360 605257 602801 601103 601530 602895
57732 602895 603345 603710 606420 612059 619468 628465 639931 653584 667999 682642 697851 712914 726028
57719 726028 736226 743807 749015 751782 752651 752560 751768 750004 747266 743461 737911 730451 722230 714082 704973
57704 704973 693813 682134 673024 667539 663926 660331 656653 653621 651573 650527 650451 651156 652552 654898
$$ packed form
57802H51070M394O177P612Q879R199P420M683L664M628N086L872K705K867L235
57788I25491K681J851J273L8k389m887o351o845o411m566j923n52j732m487p071
57773H84120q631q939p856n667l214j428j236l234o460q445q060p428r263j3068
57759G91191j5925j6259j4819j2648j0403r127r398j0019r461q149p405p059o297
57746F54222n789o433o985n847m215m316n400m901k976k103k456j698M27J365
57732F02895M50L65K710N639P409Q997J1466J3653J4415J4643J5209J5063J3114
57719G26028J0198P581N208K767Q69r1p92j764k738l805n550p460q221q148r109
57704G04973j1160j1679r110n485l613l595l678l032k048j046p6P05J396K346
$$ plain form
57690 654898 658165 661645 664897 668476 672842 677312 681196 685223 690551 696979 703417 709541 715681 721602
57676 721602 726937 732356 738894 746444 754286 762653 772153 782011 790632 798014 806069 816405 829130 843866
57662 843866 860364 877729 894430 909757 924442 939509 955367 972287 990854 1011415 1033675
57651 1033675 1057168 1081809 1107876 1135879 1166492 1200289 1237496 1277966 1320936 1364787 1408068
57640 1408068 1451404 1497483 1548301 1603204 1660757 1721690 1788553 1862834 1943936 2031052 2124689
57629 2124689 2226047 2335844 2454308 2581915 2719976 2870643 3036015 3216868 3412607
57620 3412607 3622758 3847757 4087597 4340314 4602451 4870202 5139074 5402856 5653846
57611 5653846 5883823 6084444 6247910 6368992 6446723 6483905 6485565 6457778 6405378 6327898 6217977
$$ packed form
57690F54898L267L480L252L579M366M470L884M027N328O428O438O124O140N921
57676G21602N335N419O538P550P842Q367R500R858Q621P382Q055J0336J2725J4736
57662H43866J6498J7365J6701J5327J4685J5067J5858J6920J8567K0561K2260
57651A033675K3493K4641K6067K8003L0613L3797L7207M0470M2970M3851M3281
57640A408068M3336M6079N0818N4903N7553O0933O6863P4281Q1102Q7116R3637
57629B124689J01358J09797J18464J27607J38061J50667J65372J80853J95739
57620C412607K10151K24999K39840K52717K62137K67751K68872K63782K50990
57611E653846K29977K00621J63466J21082P7731L7182J660k7787n2400p7480j09921
$$ plain form
57600 6217977 6066269 5869427 5633627 5371557 5097455 4824124 4561527 4316057 4090898
57591 4090898 3887214 3704887 3542858 3399908 3275180 3167435 3074387 2993865 2925212 2868435
57581 2868435 2822348 2784915 2755308 2734223 2721973 2717579 2720110 2729895 2747848 2774294 2808891 2851271
57569 2851271 2901634 2960965 3030601 3111145 3201993 3302402 3412764 3534463 3668943 3817275
57559 3817275 3979756 4154935 4339508 4530059 4724245 4919173 5109081 5285785 5441025
57550 5441025 5567298 5657122 5703612 5702690 5654305 5561816 5431038 5269295 5083708 4879841 4662543
57539 4662543 4437759 4212318 3991942 3780294 3579602 3390915 3213977 3048266 2894371
57530 2894371 2753235 2624177 2505099 2394717 2293080 2199558 2112043 2029150 1952004 1882679
$$ packed form
57600F217977j51708j96842k35800k62070k74102k73331k62597k45470k25159
57591D090898k03684j82327j62029j42950j24728j07745r3048q0522o8653n6777
57581B868435m6087l7433k9607k1085j2250m394K531R785J7953K6446L4597M2380
57569B851271N0363N9331O9636Q0544R0848J00409J10362J21699J34480J48332
57559C817275J62481J75179J84573J90551J94186J94928J89908J76704J55240
57550E441025J26273Q9824M6490r22m8385r2489j30778j61743j85587k03867k17298
57539D662543k24784k25441k20376k11648k00692j88687j76938j65711j53895
57530B894371j41136j29058j19078j10382j01637r3522q7515q2893p7146o9325
$$ plain form
57520 1882679 1821394 1766112 1714487 1665513 1619495 1577045 1538283 1502884 1470651 1441580 1415122
57509 1415122 1389921 1364993 1340833 1318836 1299959 1284517 1272637 1263983 1257455 1252244 1248917 1248520
57497 1248520 1250945 1255294 1261513 1270387 1282085 1296086 1312455 1331793 1353822 1377525 1402933 1431354
57485 1431354 1463345 1497705 1532988 1568903 1605737 1643695 1683412 1725972 1771621 1819536 1869687
57474 1869687 1924024 1984896 2053032 2127949 2209551 2298274 2394164 2497012 2607279 2725993 2853623
57463 2853623 2989556 3132504 3280674 3431324 3580537 3723588 3855223 3969510 4059828 4119790
57453 4119790 4144955 4134127 4089109 4013255 3910560 3786073 3646250 3497834 3346237 3195214
57443 3195214 3047634 2905833 2771361 2645281 2528778 2422855 2327353 2241086 2163314 2094465
$$ packed form
57520A882679o1285n5282n1625m8974m6018m2450l8762l5399l2233k9071k6458
57509A415122k5201k4928k4160k1997j8877j5442j1880q654o528n211l327l97
57497A248520K425M349O219Q874J1698J4001J6369J9338K2029K3703K5408K8421
57485A431354L1991L4360L5283L5915L6834L7958L9717M2560M5649M7915N0151
57474A869687N4337O0872O8136P4917Q1602Q8723R5890J02848J10267J18714J27630
57463B853623J35933J42948J48170J50650J49213J43051J31635J14287R0318N9962
57453D119790K5165j0828m5018p5854j02695j24487j39823j48416j51597j51023
57443C195214j47580j41801j34472j26080j16503j05923r5502q6267p7772o8849
$$ plain form
57433 2094465 2034990 1983934 1939320 1899958 1866406 1839711 1819237 1802342 1786859 1773612 1765536
57422 1765536 1764163 1768041 1774973 1784588 1797821 1814968 1835790 1861043 1892359 1930504 1974966 2025474
57410 2025474 2082959 2148617 2222732 2304860 2394893 2493646 2602229 2720511 2846231 2976357
57400 2976357 3109393 3245081 3381082 3511043 3626972 3722518 3792806 3832600 3837126 3804831
57390 3804831 3737879 3640199 3516714 3374073 3219706 3059093 2894970 2729470 2565757 2407246
57380 2407246 2256455 2115055 1983963 1863010 1751418 1648782 1554756 1468081 1387402 1312928
57370 1312928 1245651 1184727 1127459 1072363 1020503 973009 929016 887166 847644 811242 777563
57359 777563 745654 715828 689446 667054 647608 629353 610942 592065 573690 557395 543992
$$ packed form
57433B094465n9475n1056m4614l9362l3552k6695k0474j6895j5483j3247q076
57422A765536j373L878O932R615J3233J7147K0822K5253L1316L8145M4462N0508
57410B025474N7485O5658P4115Q2128R0033R8753J08583J18282J25720J30126
57400B976357J33036J35688J36001J29961J15929R5546P0288L9794M526l2295
57390C804831o6952r7680j23485j42641j54367j60613j64123j65500j63713j58511
57380B407246j50791j41400j31092j20953j11592j02636r4026q6675q0679p4474
57370A312928o7277o0924n7268n5096n1860m7494m3993m1850l9522l6402l3679
57359G77563l1909k9826k6382k2392j9446j8255j8411j8877j8375j6295j3403
$$ plain form
57348 543992 532900 522889 513035 503014 493263 484920 478721 473814 468585 462802 457744 453927 450074
57335 450074 445025 439357 434081 428817 422531 415517 409465 405732 404210 403641 402496 399934 396315 392478
57321 392478 388328 382772 375262 366636 358047 349796 341592 333170 324311 315161 306804 300457 295636 290421
57307 290421 284157 278481 274662 271421 266910 261705 257966 256247 255009 253130 251109 249561 248020 245871
57293 245871 243484 241865 241648 242707 244281 245463 246020 246746 248573 251568 255363 260170 266474 273776 280727
57278 280727 286791 292989 300477 309012 317388 325089 332824 341475 351044 360954 371123 382246 394883
57265 394883 408735 423140 437918 453232 468853 484307 499714 515741 532627 549965 567671
57254 567671 586348 606303 626861 647201 667418 688318 710477 733904 758308 783516 809964
$$ packed form
57348E43992j1092j0011r854j0021r751q343o199m907n229n783n058l817l853
57335D50074n049n668n276n264o286p014o052l733j522n69j145k562l619l837
57321C92478m150n556p510q626q589q251q204q422q859r150q357o347m821n215
57307B90421o264n676l819l241m511n205l739j719j238j879k021j548j541k149
57293B45871k387j619k17J059J574J182N57P26J827K995L795M807O304P302O951
57278B80727O064O198P488Q535Q376P701P735Q651R569R910J0169J1123J2637
57265C94883J3852J4405J4778J5314J5621J5454J5407J6027J6886J7338J7706
57254E67671J8677J9955K0558K0340K0217K0900K2159K3427K4404K5208K6448
$$ plain form
57243 809964 838767 870616 904414 937828 969564 1000401 1031650 1063457 1095112 1126056 1155752
57232 1155752 1183395 1208835 1233412 1258991 1286559 1316408 1349093 1385064 1423640 1463427 1503840
57221 1503840 1545507 1589344 1635968 1685730 1738328 1792295 1845693 1897402 1947138 1994234 2037175
57210 2037175 2074331 2104352 2125860 2137837 2140819 2137027 2128813 2117365 2103134 2086750 2068950 2050125
57198 2050125 2030631 2011283 1993035 1976460 1962129 1951230 1945005 1943396 1944917 1948251 1953594 1962076
57186 1962076 1974229 1989543 2007486 2028412 2053291 2082727 2116321 2152760 2190462 2228465 2266977
57175 2266977 2307108 2349957 2395881 2444508 2495302 2548299 2604600 2665936 2733336 2806209 2883114
57164 2883114 2963309 3046836 3133098 3220296 3306858 3392843 3479380 3567132 3655802 3744683 3833147
$$ packed form
57243H09964K8803L1849L3798L3414L1736L0837L1249L1807L1655L0944K9696
57232A155752K7643K5440K4577K5579K7568K9849L2685L5971L8576L9787M0413
57221A503840M1667M3837M6624M9762N2598N3967N3398N1709M9736M7096M2941
57210B037175L7156L0021K1508J1977K982l792q214j1448j4231j6384j7800j8825
57198B050125j9494j9348j8248j6575j4331j0899o225j609J521L334N343Q482
57186A962076J2153J5314J7943K0926K4879K9436L3594L6439L7702L8003L8512
57175B266977M0131M2849M5924M8627N0794N2997N6301O1336O7400P2873P6905
57164B883114Q0195Q3527Q6262Q7198Q6562Q5985Q6537Q7752Q8670Q8881Q8464
$$ plain form
57153 3833147 3920928 4008487 4096867 4186803 4278356 4371711 4467657 4566559 4667319 4768098 4867773
57142 4867773 4966212 5063713 5161027 5259532 5360329 5463221 5567147 5671285 5775080 5877871
57132 5877871 5979702 6082302 6187906 6296856 6407203 6516682 6624025 6728067 6826726 6917861
57122 6917861 7000970 7077471 7149175 7216517 7278438 7334165 7384885 7433008 7479724 7524055 7564620
57111 7564620 7601446 7635585 7667874 7698840 7729031 7758559 7786874 7813712 7839715 7865658 7891867
57100 7891867 7918905 7947714 7978374 8009890 8041903 8075166 8109306 8141719 8170053 8194216 8214347
57089 8214347 8228593 8235213 8235820 8234284 8233176 8233077 8234180 8236162 8237172 8235120 8229260 8218473 8198885 8165610
57075 8165610 8116363 8051405 7971003 7875394 7766375 7646202 7515125 7371744 7214505 7040472
$$ packed form
57153C833147Q7781Q7559Q8380Q9936R1553R3355R5946R8902J00760J00779R9675
57142D867773R8439R7501R7314R8505J00797J02892J03926J04138J03795J02791
57132E877871J01831J02600J05604J08950J10347J09479J07343J04042R8659R1135
57122F917861Q3109P6501P1704O7342O1921N5727N0720M8123M6716M4331M0565
57111G564620L6826L4139L2289L0966L0191K9528K8315K6838K6003K5943K6209
57100G891867K7038K8809L0660L1516L2013L3263L4140L2413K8334K4163K0131
57089H214347J4246O620O07j536j108r9J103J982J010k052n860j0787j9588l3275
57075H165610m9247o4958q0402r5609j09019j20173j31077j43381j57239j74033
$$ plain form
57065 7040472 6843894 6618594 6360205 6063248 5717934 5313789 4845364 4310601 3704752
57056 3704752 3019708 2247708 1380597 405661 -693233 -1930260 -3316957 -4866136 -6592199
57047 -6592199 -8508393 -10627942 -12966868 -15541694 -18366655 -21458891 -24845076 -28557920
57039 -28557920 -32628888 -37090996 -41986253 -47363371 -53271053 -59760977 -66892739 -74724831
57031 -74724831 -83300046 -92639750 -102735865 -113536817 -124960501 -136926281 -149295222
57024 -149295222 -161663875 -173230013 -183070610 -190802404 -197053311 -203178631 -210346337 -218743594
57016 -218743594 -227509812 -235296547 -240892795 -243509627 -242741065 -238436479 -230653299 -219698429
57008 -219698429 -206164015 -190863956 -174668846 -158334983 -142421849 -127300641 -113193461
$$ packed form
57065G040472j96578k25300k58389k96957l45314m04145m68425n34763o05849
57056C704752o85044p72000q67111D05661f93233j237027j386697j549179j726063
57047f592199j916194k119549k338926k574826k824961l092236l386185l712844
57039b8557920m070968m462108m895257n377118n907682o489924p131762p832092
57031g4724831q575215r339704j0096115j0800952j1423684j1965780j2368941
57024a49295222j2368653j1566138r840597p731794o250907o125320p167706q397257
57016b18743594q766218p786735n596248k616832P68562M304586P783180J0954870
57008b19698429J3534414J5300059J6195110J6333863J5913134J5121208J4107180
$$ plain form
57001 -113193461 -100207053 -88366183 -77647441 -67999273 -59349505 -51616402 -44722830
56994 -44722830 -38598264 -33169992 -28361165 -24098914 -20318641 -16960760 -13970405 -11302040
56986 -11302040 -8919088 -6787786 -4875568 -3155509 -1607384 -213586 1042065 2171637
56978 2171637 3184049 4089898 4902044 5631549 6287034 6878392 7417397 7913878 8373934
56969 8373934 8801601 9198908 9564360 9894592 10187592 10441789 10653279 10818297 10938798
56960 10938798 11022196 11075400 11101977 11104689 11086766 11050011 10994710 10921816 10832345 10724842 10597084
56949 10597084 10450984 10292804 10127872 9957723 9782321 9601227 9411115 9204819 8974270
56940 8974270 8713028 8416624 8084313 7722217 7342739 6959631 6584628 6228073 5899439
$$ packed form
57001a13193461J2986408J1840870J0718742R648168Q649768P733103O893572
56994d4722830O124566N428272M808827M262251L780273L357881K990355K668365
56986a1302040K382952K131302J912218J720059J548125b13586A042065J129572
56978B171637J012412R05849Q12146P29505O55485N91358N39005M96481M60056
56969H373934M27667L97307L65452L30232K93000K54197K11490J65018J20501
56960A0938798Q3398N3204K6577K712j7923l6755n5301p2894q9471j07503j27758
56949A0597084j46100j58180j64932j70149j75402j81094j90112k06296k30549
56940H974270k61242k96404l32311l62096l79478l83108l75003l56555l28634
$$ plain form
56931 5899439 5606111 5353673 5147614 4991705 4882715 4807423 4744636 4668892 4554738 4384067
56921 4384067 4153971 3877250 3573905 3261773 2952997 2654601 2369780 2100124 1848200
56912 1848200 1617268 1408509 1220453 1051686 902345 772489 661036 566896 489221 425921
56902 425921 373973 331857 299807 277124 261590 252374 250928 257319 267389 275084 276299 269686 255728
56889 255728 236703 215986 195581 175070 153930 133704 116760 104090 95503 90837 89776 91354
56877 91354 94893 100912 110314 123298 139461 158124 178177 198694 219891 241939 262312 276021
56865 276021 279640 273969 262099 246471 228745 210738 193640 177255 161337 146857 134825 124924
56853 124924 116568 110324 106827 105065 103255 100924 98841 97378 96374 96263 97899 101245 105424 110278
$$ packed form
56931E899439k93328k52438k06059j55909j08990p5292o2787p5744j14154j70671
56921D384067k30096k76721l03345l12132l08776k98396k84821k69656k51924
56912A848200k30932k08759j88056j68767j49341j29856j11453r4140p7675o3300
56902D25921n1948m2116l2050k2683j5534r216j446O391J0070P695J215o613j3958
56889B55728j9025k0717k0405k0511k1140k0226j6944j2670q587m666j061J578
56877I1354L539O019R402J2984J6163J8663K0053K0517K1197K2048K0373J3709
56865B76021L619n671j1870j5628j7726j8007j7098j6385j5918j4480j2032r901
56853A24924q356o244l497j762j810k331k083j463j004j11J636L346M179M854
$$ plain form
56839 110278 116889 126191 137681 149823 161463 172685 184475 197695 212596 229390 248789 271274
56827 271274 296022 321385 346328 370457 392667 410951 423876 431355 433820 431798 426655 420516
56815 420516 414731 409368 404666 401799 401521 403169 405935 410189 416637 425127 435417 448476 465814 487850
56801 487850 513902 543564 577081 614179 652873 689388 719156 738444 745707 741710 728812 710510
56789 710510 690867 672789 656571 641198 627298 617555 614034 616708 625221 640415 662955 691921
56777 691921 726350 767146 815976 873135 938047 1010666 1089364 1166690 1229363 1264654 1267425 1241452
56765 1241452 1195158 1136760 1072365 1006578 943270 885434 834796 792065 757484 730996 712315
56754 712315 701395 698566 703685 715564 733257 757850 791926 836814 890601 948305 1002757 1045494
$$ packed form
56839A10278O611R302J1490J2142J1640J1222J1790J3220J4901J6794J9399K2485
56827B71274K4748K5363K4943K4129K2210J8284J2925P479K465k022n143o139
56815D20516n785n363m702k867k78J648K766M254O448Q490J0290J3059J7338K2036
56801D87850K6052K9662L3517L7098L8694L6515K9768J9288P263l997j2898j8302
56789G10510j9643j8078j6218j5373j3900r743l521K674Q513J5194K2540K8966
56777F91921L4429M0796M8830N7159O4912P2619P8698P7326O2673L5291K771k5973
56765A241452m6294n8398o4395o5787o3308n7836n0638m2731l4581k6488j8681
56754G12315j0920k829N119J1879J7693K4593L4076M4888N3787N7704N4452M2737
$$ plain form
56742 1045494 1068813 1068720 1046249 1006177 955008 899386 844370 792112 742853 697361 657398 623733
56730 623733 595391 571606 553043 540088 531310 525022 521644 523273 531415 546079 566326 590343
56718 590343 614973 635971 649012 650759 640102 618958 591076 559420 525298 490170 456748 427250
56706 427250 401519 378048 356169 336359 319155 304804 293269 283627 274221 264463 255844 250025
56694 250025 246517 243265 238943 233600 227730 221958 217258 214264 212603 211703 211658 212264 211991 209388 205137
56679 205137 201311 198771 196661 194223 191621 188870 185432 181318 177547 175034 173733 172996 171975 169518
56665 169518 164686 157827 150580 144444 139663 135557 131399 126821 121822 116630 111409 106109 100741 95624
56651 95624 91101 87140 83382 79402 74868 69778 64543 59374 53808 47660 42373 40045 40755 42161 42367
$$ packed form
56742A045494K3319r3k2471m0072n1169n5622n5016n2258m9259m5492l9963l3665
56730F23733k8342k3785j8563j2955q778o288l378J629Q142J4664K0247K4017
56718E90343K4630K0998J3041J747j0657k1144k7882l1656l4122l5128l3422k9498
56706D27250k5731k3471k1879j9810j7204j4351j1535r642r406r758q619n819
56694B50025l508l252m322n343n870n772m700k994j661r00m5O06k73k603m251
56679B05137l826k540k110k438k602k751l438m114l771k513j301p37j021k457
56665A69518m832o859p247o136m781m106m158m578m999n192n221n300n368n117
56651I5624m523l961l758l980m534n090n235n169n566o148n287k328P10J406K06
$$ plain form
56636 42367 41772 41208 39891 36844 33303 31804 33309 36661 40451 43966 46703 48487 50064 52408 55571
56621 55571 59287 64199 71122 79362 87232 94195 101181 108849 116923 125271 134166 143259 151538 158689
56607 158689 165347 171655 176672 179632 181002 181953 183485 186233 190267 194820 198816 201878 204388 206707
56593 206707 208915 211051 212844 213490 212522 210623 208816 207325 206154 205925 206645 206206 202140 194983 188073
56578 188073 183682 180969 178218 175277 172798 170499 167441 163296 158444 153404 148772 145070 142089 138992
56564 138992 135624 133047 132322 133423 135835 139521 144566 150383 156010 161092 166153 171954 178732 185905
56550 185905 192545 198392 204317 211440 219891 228806 237295 244956 251685 257588 262910 267714 272035 276629
56536 276629 282675 289858 295731 298263 298404 298787 300567 303090 306006 309581 313051 314907 315197 315594 316709
$$ packed form
56636D2367n95n64j317l047l541j499J505L352L790L515K737J784J577K344L163
56621E5571L716M912O923Q240P870O963O986P668Q074Q348Q895R093Q279P151
56607A58689O658O308N017K960J370R51J532K748M034M553L996L062K510K319
56593B06707K208K136J793O46r68j899j807j491j171k29P20m39m066p157o910
56578A88073m391k713k751k941k479k299l058m145m852n040m632l702k981l097
56564A38992l368k577p25J101K412L686N045N817N627N082N061N801O778P173
56550A85905O640N847N925P123Q451Q915Q489P661O729N903N322M804M321M594
56536B76629O046P183N873K532J41L83J780K523K916L575L470J856K90L97J115
$$ plain form
56521 316709 317304 316888 317095 319299 322517 325114 327284 330417 334840 339547 343639 346933 349615 352150 355212
56506 355212 359116 363759 369475 377139 386857 397474 408159 419644 433068 448195 463740 478937
56494 478937 493839 508327 521790 533901 545071 555858 566152 575209 582670 589380 596593 604050
56482 604050 609628 611706 611164 609838 607580 602432 593650 582970 572566 563121 554147 544802 533943 520701
56468 520701 505614 490209 475252 460535 446427 433975 423120 412485 401605 391747 383767 376741
56456 376741 369636 362838 356958 351504 345784 339894 333857 327199 320453 315556 313365 312077 309570 306098
56442 306098 303066 300310 296480 291357 286000 281076 276670 273390 272051 272424 273572 275216 277572 280051
56428 280051 281431 281312 280470 279881 280218 282028 285393 289482 293183 296113 298546 300711 302746 304971 307651
$$ packed form
56521C16709N95m16K07K204L218K597K170L133M423M707M092L294K682K535L062
56506C55212L904M643N716P664R718J0617J0685J1485J3424J5127J5545J5197
56494D78937J4902J4488J3463J2111J1170J0787J0294R057P461O710P213P457
56482F04050N578K078n42j326k258n148q782j0680j0404r445q974r345j0859j3242
56468E20701j5087j5405j4957j4717j4108j2452j0855j0635j0880r858p980p026
56456C76741p105o798n880n454n720n890o037o658o746m897k191j288k507l472
56442C06098l032k756l830n123n357m924m406l280j339L73J148J644K356K479
56428B80051J380j19q42n89L37J810L365M089L701K930K433K165K035K225K680
$$ plain form
56413 307651 310760 314197 317612 319951 320383 320116 321848 326465 331641 334920 337031 340623 346685 353899 360929
56398 360929 367674 374353 380715 386286 390636 393609 395773 398020 400209 401212 401066 401888 405435 410838 416027
56383 416027 420233 423515 424945 423517 420478 418665 419379 421388 423037 423916 424368 424726 425235 425841 425910 424935
56367 424935 423300 421685 420040 417876 415048 411588 407473 403313 400276 398360 395876 391824 387576 384691
56353 384691 382292 378546 373793 369899 367071 363596 358709 353646 349631 346484 343547 340676 338190 336760
56339 336760 337005 338239 338413 336610 334651 334599 335756 336168 336042 337153 339519 341374 342241 343302 344751 345602
56323 345602 346347 348996 353829 358671 362180 365322 368818 371650 373389 375598 379339 383173 385207 385621 385850
56308 385850 386718 388634 392161 396910 401019 403176 404341 406494 410397 415294 419840 422719 423552 423877 425989
$$ packed form
56413C07651L109L437L415K339M32k67J732M617N176L279K111L592O062P214P030
56398C60929O745O679O362N571M350K973K164K247K189J003j46Q22L547N403N189
56383D16027M206L282J430j428l039j813P14K009J649Q79M52L58N09O06O9r75
56367D24935j635j615j645k164k828l460m115m160l037j916k484m052m248k885
56353C84691k399l746m753l894k828l475m887n063m015l147k937k871k486j430
56339C36760K45J234J74j803j959n2J157M12j26J111K366J855Q67J061J449Q51
56323C45602P45K649M833M842L509L142L496K832J739K209L741L834K034M14K29
56308C85850Q68J916L527M749M109K157J165K153L903M897M546K879Q33L25K112
$$ plain form
56293 425989 430081 433803 435396 435818 436775 438193 439113 439933 442190 446570 452282 458009 462687 465910 468395
56278 468395 471576 476138 481393 486479 491463 496815 502635 508863 515451 521811 526894 530440 533617 538023
56264 538023 544564 553404 564186 576148 588761 602307 617045 632005 645727 657972 669505 680511
56252 680511 690927 702041 715600 731012 745549 757905 769463 781198 791594 798954 803963 808396
56240 808396 812655 816070 818533 820476 822167 824106 827171 831371 835493 838989 843188 849633 858269 868305
56226 868305 879804 893284 908591 925333 943749 964359 987390 1013140 1042026 1073658 1106975
56215 1106975 1141853 1179460 1220358 1263598 1308447 1355680 1406340 1460699 1519400 1584031 1655158
56204 1655158 1731178 1810666 1894919 1986693 2087256 2196041 2312482 2436878 2570029 2713106
$$ packed form
56293D25989M092L722J593M22R57J418R20Q20K257M380N712N727M678L223K485
56278D68395L181M562N255N086M984N352N820O228O588O360N083L546L177M406
56264E38023O541Q840J0782J1962J2613J3546J4738J4960J3722J2245J1533J1006
56252F80511J0416J1114J3559J5412J4537J2356J1558J1735J0396P360N009M433
56240H08396M259L415K463J943J691J939L065M200M122L496M199O445Q636J0036
56226H68305J1499J3480J5307J6742J8416K0610K3031K5750K8886L1632L3317
56215A106975L4878L7607M0898M3240M4849M7233N0660N4359N8701O4631P1127
56204A655158P6020P9488Q4253R1774J00563J08785J16441J24396J33151J43077
$$ plain form
56194 2713106 2867340 3032831 3208155 3391740 3582731 3779782 3980002 4180052 4377321
56185 4377321 4569062 4751241 4919320 5069520 5198662 5303749 5382722 5434932 5460245 5458677
56175 5458677 5431648 5382650 5315898 5235044 5143487 5044586 4940738 4833242 4723533 4613322
56165 4613322 4503174 4392468 4281200 4170151 4058822 3945298 3828952 3711298 3593302
56156 3593302 3474122 3353639 3233732 3115412 2997073 2877631 2759318 2645168 2535601
56147 2535601 2429910 2329346 2235943 2149342 2067351 1989071 1915395 1847067 1784172 1726858 1674757
56136 1674757 1626208 1579629 1535116 1493608 1455527 1421231 1391252 1364650 1338821 1312680 1288466
56125 1288466 1268574 1252287 1237647 1224655 1214179 1205337 1196788 1189435 1185066 1183391 1183056 1184606 1189502
$$ packed form
56194B713106J54234J65491J75324J83585J90991J97051K00220K00050J97269
56185D377321J91741J82179J68079J50200J29142J05087P8973N2210K5313j568
56175E458677k7029m8998o6752q0854r1557r8901j03848j07496j09709j10211
56165D613322j10148j10706j11268j11049j11329j13524j16346j17654j17996
56156C593302j19180j20483j19907j18320j18339j19442j18313j14150j09567
56147B535601j05691j00564r3403q6601q1991p8280p3676o8328o2895n7314n2101
56136A674757m8549m6579m4513m1508l8081l4296k9979k6602k5829k6141k4214
56125A288466j9892j6287j4640j2992j0476q842q549p353m369j675l35J550M896
$$ plain form
56112 1189502 1196906 1204351 1211250 1218968 1227635 1235616 1242354 1249425 1258379 1269238 1281112 1292815 1303172
56099 1303172 1312204 1321471 1331832 1341761 1349510 1355800 1362480 1369752 1376961 1385052 1395622 1408294 1421506
56086 1421506 1435372 1451477 1470375 1491727 1516533 1546959 1584422 1629812 1684903 1751263 1828378
56075 1828378 1914918 2011041 2117214 2232068 2354324 2486118 2631261 2790293 2959733 3135610
56065 3135610 3314737 3492608 3663162 3821529 3965455 4094406 4209316 4312782 4407007 4491217
56055 4491217 4562318 4617187 4652785 4665829 4655449 4625530 4581917 4527861 4464047 4391158 4308996
56044 4308996 4214267 4102996 3975101 3834112 3683655 3527523 3372054 3224295 3087782 2963029
56034 2963029 2851203 2753505 2667661 2589372 2517472 2454019 2399381 2351099 2307680 2269552 2235887
$$ packed form
56112A189502P404P445O899P718Q667P981O738P071Q954J0859J1874J1703J0357
56099A303172R032R267J0361R929P749O290O680P272P209Q091J0570J2672J3212
56086A421506J3866J6105J8898K1352K4806L0426L7463M5390N5091O6360P7115
56075A828378Q6540R6123J06173J14854J22256J31794J45143J59032J69440J75877
56065C135610J79127J77871J70554J58367J43926J28951J14910J03466R4225Q4210
56055D491217P1101N4869L5598J3044j0380k9919m3613n4056o3814p2889q2162
56044D308996r4729j11271j27895j40989j50457j56132j55469j47759j36513j24753
56034B963029j11826r7698q5844p8289p1900o3453n4638m8282m3419l8128l3665
$$ plain form
56023 2235887 2204409 2175013 2149978 2129869 2112582 2097091 2084733 2076129 2070063 2066148 2065629 2068953
56011 2068953 2075345 2085011 2098727 2115054 2131094 2146320 2162703 2181104 2200623 2221311 2244129 2268387
55999 2268387 2292700 2318288 2347576 2379700 2411342 2442110 2475041 2511532 2549886 2589321 2631434
55988 2631434 2676914 2724364 2772921 2822785 2872988 2922083 2971101 3022575 3077136 3134519 3196737
55977 3196737 3265881 3339656 3413825 3488432 3566803 3649224 3732963 3818022 3907321 4001379 4098239
55966 4098239 4198464 4304758 4417061 4533646 4656398 4788831 4929596 5074584 5224939
55957 5224939 5385873 5557923 5736965 5922937 6120526 6330753 6550004 6778421 7021203
55948 7021203 7280517 7554155 7843260 8153009 8484331 8833289 9199840 9588534 9999568
$$ packed form
56023B235887l1478k9396k5035k0109j7287j5491j2358q604o066l915n19L324
56011B068953O392R666J3716J6327J6040J5226J6383J8401J9519K0688K2818K4258
55999B268387K4313K5588K9288L2124L1642L0768L2931L6491L8354L9435M2113
55988B631434M5480M7450M8557M9864N0203M9095M9018N1474N4561N7383O2218
55977C196737O9144P3775P4169P4607P8371Q2421Q3739Q5059Q9299R4058R6860
55966D098239J00225J06294J12303J16585J22752J32433J40765J44988J50355
55957E224939J60934J72050J79042J85972J97589K10227K19251K28417K42782
55948G021203K59314K73638K89105L09749L31322L48958L66551L88694M11034
$$ plain form
55939 9999568 10428728 10877928 11356316 11869259 12416047 12999951 13629509 14307295 15028399
55930 15028399 15792959 16609146 17480802 18403832 19378330 20412542 21511313 22672969 23901657
55921 23901657 25209852 26603961 28080184 29639270 31292695 33050775 34919401 36912587
55913 36912587 39051890 41347644 43796805 46404933 49193994 52185043 55394607 58855245
55905 58855245 62618424 66730198 71228796 76178013 81683452 87873055 94892752 102928589
55897 102928589 112194261 122878784 135140390 149167072 165206497 183530188 204426251
55890 204426251 228239286 255332399 285963423 320240070 358070563 398658409 439487054
55883 439487054 475772646 501556361 512200139 506485508 486740653 457217203 422222265
$$ packed form
55939I999568M29160M49200M78388N12943N46788N83904O29558O77786P21104
55930A5028399P64560Q16187Q71656R23030R74498J034212J098771J161656J228688
55921B3901657J308195J394109J476223J559086J653425J758080J868626J993186
55913C6912587K139303K295754K449161K608128K789061K991049L209564L460638
55905E8855245L763179M111774M498598M949217N505439O189603P019697Q035837
55897A02928589R265672J0684523J2261606J4026682J6039425J8323691K0896063
55890B04426251K3813035K7093113L0631024L4276647L7830493M0587846M0828645
55883D39487054L6285592K5783715J0643778n714631j9744855k9523450l4994938
$$ plain form
55876 422222265 385117103 348174815 312798869 279804064 249662673 222631428 198756202
55869 198756202 177879302 159724331 143985606 130353537 118520481 108213054 99210621
55862 99210621 91319329 84351152 78144625 72583927 67579393 63045699 58912172 55135031
55854 55135031 51681947 48516380 45607546 42939923 40498916 38258091 36190069 34277017
55846 34277017 32500141 30831654 29248726 27745534 26322265 24972613 23691138 22482130
55838 22482130 21350503 20291719 19299010 18371928 17509084 16700108 15933219 15204214 14511375
55829 14511375 13849112 13213936 12609660 12039525 11499516 10985640 10500832 10047959 9622524
55820 9622524 9218935 8837731 8479969 8140467 7813539 7500398 7204566 6924689 6657635
$$ packed form
55876D22222265l7105162l6942288l5375946l2994805l0141391k7031245k3875226
55869A98756202k0876900j8154971j5738725j3632069j1833056j0307427r002433
55862I9210621p891292o968177o206527n560698n004534m533694m133527l777141
55854E5135031l453084l165567k908834k667623k441007k240825k068022j913052
55846C4277017j776876j668487j582928j503192j423269j349652j281475j209008
55838B2482130j131627j058784r92709r27082q62844q08976p66889p29005o92839
55829A4511375o62263o35176o04276n70135n40009n13876m84808m52873m25435
55820I622524m03589l81204l57762l39502l26928l13141k95832k79877k67054
$$ plain form
55811 6657635 6403878 6164085 5934807 5712849 5499517 5295715 5097467 4901150 4708490
55802 4708490 4521575 4337768 4154558 3974864 3802590 3637480 3479308 3332412 3200585
55793 3200585 3081399 2970853 2869864 2781190 2703640 2634400 2573638 2521936 2476515 2434732 2397868
55782 2397868 2366562 2335651 2298546 2254279 2206072 2155988 2105350 2057301 2013969 1973183 1932038
55771 1932038 1891406 1853161 1815743 1776562 1736283 1696789 1657389 1616916 1577054 1539682 1503306
55760 1503306 1465858 1428587 1393463 1359415 1324999 1292203 1263528 1237611 1211804 1186737 1164223
55749 1164223 1142915 1120522 1098571 1080634 1067154 1055959 1046616 1040388 1036928 1034528 1032802 1032041 1030995
55736 1030995 1028089 1023705 1018819 1012808 1004898 995871 986007 973639 958276 942729 929314 916593 902727
$$ packed form
55811F657635k53757k39793k29278k21958k13332k03802j98248j96317j92660
55802D708490j86915j83807j83210j79694j72274j65110j58172j46896j31827
55793C200585j19186j10546j00989q8674p7550o9240o0762n1702m5421m1783l6864
55782B397868l1306l0911l7105m4267m8207n0084n0638m8049m3332m0786m1145
55771A932038m0632l8245l7418l9181m0279l9494l9400m0473l9862l7372l6376
55760A503306l7448l7271l5124l4048l4416l2796k8675k5917k5807k5067k2514
55749A164223k1308k2393k1951j7937j3480j1195r343o228l460k400j726p61j046
55736A030995k906m384m886o011p910r027r864j2368j5363j5547j3415j2721j3866
$$ plain form
55723 902727 889186 877716 866532 853396 839868 828434 817945 806267 795130 787517 781881 773856
55711 773856 762575 750703 739058 725711 709943 693033 675487 657222 639879 625289 612248
55700 612248 598485 585092 575204 568855 562999 556327 550288 545616 541610 538879 539242 542684 547462 553030
55686 553030 559617 565161 566146 561647 553548 542982 529799 515292 501744 488982 474746 458969 444492
55673 444492 433017 423456 414909 408259 403942 400782 397899 395365 392404 387364 380162 372613 365767 358964
55659 358964 351805 344856 338113 330968 324053 318930 315540 312111 308031 304742 303345 303236 303588 304424 305923
55644 305923 308301 312413 318733 325799 331525 335931 340596 345557 348995 350063 349836 349276 348366 347595 348265
55629 348265 350907 355018 360422 367111 373921 379495 384581 391245 399591 407356 412919 416556 418569 418438
$$ packed form
55723I02727j3541j1470j1184j3136j3528j1434j0489j1678j1137p613n636q025
55711G73856j1281j1872j1645j3347j5768j6910j7546j8265j7343j4590j3041
55700F12248j3763j3393r888o349n856o672o039m672m006k731L63L442M778N568
55686E53030O587N544R85m499q099j0566j3183j4507j3548j2762j4236j5777j4477
55673D44492j1475r561q547o650m317l160k883k534k961n040p202p549o846o803
55659C58964p159o949o743p145o915n123l390l429m080l289j397j09L52Q36J499
55644C05923K378M112O320P066N726M406M665M961L438J068k27n60r10p71O70
55629C48265K642M111N404O689O810N574N086O664Q346P765N563L637K013j31
$$ plain form
55615 418438 416458 414075 411915 409155 405361 401330 397779 394880 393340 394029 396146 397473 397014 395942 395654
55600 395654 396448 398306 401349 405199 409287 413884 419368 424596 427716 428628 428904 429321 429238 428234 426392 422979
55584 422979 416917 408750 400174 391600 382228 372427 363613 355457 345800 333861 321163 308716 295862
55571 295862 282864 271940 264185 257631 250072 242094 235481 229945 223322 214499 204848 196964 192553 191119
55557 191119 190427 188727 186342 184278 181958 177956 172612 167813 164140 160431 156547 154204 154164 154667 153891
55542 153891 152201 150765 149507 147809 145959 144515 143177 141486 139808 138602 137399 135442 132719 129647
55528 129647 126302 122651 119173 116735 115986 116829 118138 118415 117446 116736 117417 118515 118598 118188 118541 118768 116813
55511 116813 113262 111393 112803 115443 116992 117818 119181 120544 120497 119144 118024 118391 120592 124216 127974
$$ packed form
55615D18438j980k383k160k760l794m031l551k899j540O89K117J327m59j072k88
55600C95654P94J858L043L850M088M597N484N228L120R12K76M17q3j004j842l413
55584D22979o062q167q576q574r372r801q814q156r657j1939j2698j2447j2854
55571B95862j2998j0924p755o554p559p978o613n536o623q823r651p884m411j434
55557A91119o92j700k385k064k320m002n344m799l673l709l884k343m0N03p76
55542A53891j690j436j258j698j850j444j338j691j678j206j203j957k723l072
55528A29647l345l651l478k438p49Q43J309K77r69p10O81J098Q3m10L53K27j955
55511A16813l551j869J410K640J549Q26J363J363m7j353j120L67K201L624L758
$$ plain form
55496 127974 130200 130255 128789 126388 123018 119158 116052 114257 113006 111579 110138 108878 107652 106851 107288
55481 107288 108702 109811 110328 111382 113384 115117 115797 116426 118093 120327 122295 124495 128126 133584 140267
55466 140267 146942 151866 153846 153892 154593 157146 160188 162128 163189 164309 165355 165457 164109 161144 156584
55451 156584 151082 145467 139466 132213 124259 117447 112301 107345 101639 96034 91133 86235 81545 79162
55437 79162 79979 81372 80091 76256 72601 70828 70591 71135 72063 72917 73565 74643 76534 78519 79904 81022
55421 81022 82019 81747 79175 74911 69958 64073 56917 49872 44894 42151 40389 39016 38196 37397 35722
55406 35722 33557 32272 32129 31834 30396 28338 26775 25952 25009 23032 20421 19001 19943 21661 21216 18147
55390 18147 15259 14813 15768 16136 16228 17501 19470 20081 18640 16358 14387 13055 12644 13119 13362 12504 11888
$$ packed form
55496A27974K226N5j466k401l370l860l106j795j251j427j441j260j226q01M37
55481A07288J414J109N17J054K002J733O80O29J667K234J968K200L631N458O683
55466A40267O675M924J980M6P01K553L042J940J061J120J046J02j348k965m560
55451A56584n502n615o001p253p954o812n146m956n706n605m901m898m690k383
55437G9162Q17J393j281l835l655j773k37N44R28Q54O48J078J891J985J385J118
55421H1022R97k72k572m264m953n885p156p045m978k743j762j373q20p99j675
55406C5722k165j285j43k95j438k058j563q23r43j977k611j420R42J718m45l069
55390A8147k888m46R55L68R2J273J969O11j441k282j971j332m11M75K43q58o16
$$ plain form
55373 11888 13900 18678 23667 26707 28144 29569 31773 34457 36890 38398 38836 38720 38363 37211 34934
55358 34934 32795 32698 34845 37444 38795 38675 37645 36214 35013 34815 35730 36905 37364 36864 36024 36053 38156
55341 38156 42474 47495 50955 51405 48829 44247 39317 35865 34843 35711 37270 38939 40721 42306 42942
55326 42942 42153 40113 37377 34583 32223 30386 28968 28169 28221 28529 27935 26263 24718 24277 24634 25360 26965
55309 26965 29814 32867 34675 35009 34611 34036 33750 34520 36425 38131 38448 38049 38283 38782 37880 35265 32696
55292 32696 31893 32852 34509 36057 37311 38451 39578 40198 39441 37263 34861 33228 31903 30067 28142
55277 28142 27111 26821 26332 25702 26040 27758 29862 31021 30443 27897 23934 20015 17477 16371 15990 16171
55261 16171 17138 18547 19840 21246 23272 25528 27275 28793 30772 32564 32609 30732 28498 27061 26007
$$ packed form
55373A1888K012M778M989L040J437J425K204K684K433J508M38j16l57j152k277
55358C4934k139r7K147K599J351j20j030j431j201j98R15J175M59n00q40K9K103
55341C8156M318N021L460M50k576m582m930l452j022Q68J559J669J782J585O36
55326D2942p89k040k736k794k360j837j418p99N2L08n94j672j545m41L57P26J605
55309B6965K849L053J808L34l98n75k86P70J905J706L17l99K34M99r02k615k569
55292C2696q03R59J657J548J254J140J127O20p57k178k402j633j325j836j925
55277B8142j031k90m89o30L38J718K104J159n78k546l963l919k538j106l81J81
55261A6171R67J409J293J406K026K256J747J518J979J792M5j877k234j437j054
$$ plain form
55246 26007 24674 23269 22241 21716 22014 23657 26347 28805 30102 30362 29997 29170 28278 27861 27583 26356
55230 26356 24082 22341 22624 24560 26537 27547 27833 28077 28515 28664 27747 25618 23252 22005 22367 23803
55214 23803 25494 26647 26483 24974 23507 23731 25485 26866 26619 25494 24840 24900 25151 25480 26147 26956 27320
55197 27320 27045 26574 26467 26960 27997 29482 31345 33259 34300 33286 29876 25203 21117 18967 19255 21868
55181 21868 25932 29787 31959 32247 31377 29862 27835 25788 24597 24717 25926 27873 30412 33487 37144
55166 37144 41387 45444 47625 46832 43994 41151 39281 38003 37145 37354 38962 41396 44098 47053 49976
55151 49976 51851 51951 50747 49262 47924 46440 44493 42244 40352 39568 40071 41167 42010 42497 43076 43849
55135 43849 44508 45085 46078 47698 49546 51149 52233 52363 50976 48161 45092 43229 43057 43789 44347 44604
$$ packed form
55246B6007j333j405j028n25K98J643K690K458J297K60l65q27q92m17k78j227
55230B6356k274j741K83J936J977J010K86K44M38J49r17k129k366j247L62J436
55214B3803J691J153j64j509j467K24J754J381k47j125o54O0K51L29O67Q09L64
55197B7320k75m71j07M93J037J485J863J914J041j014l410m673m086k150K88K613
55181B1868M064L855K172K88q70j515k027k047j191J20J209J947K539L075L657
55166C7144M243M057K181p93k838k843j870j278q58K09J608K434K702K955K923
55151D9976J875J00j204j485j338j484j947k249j892p84N03J096Q43M87N79P73
55135D3849O59N77R93J620J848J603J084J30j387k815l069j863j72P32N58K57
$$ plain form
55119 44604 45402 47081 48471 48209 46980 47232 50196 54255 56928 57452 56527 54685 52261 50237 49548 49815
55103 49815 49971 49867 50142 50861 51502 51954 52311 51989 50431 48437 47370 47103 46224 44256 42172 40574 38931
55086 38931 36990 35512 34948 34544 33419 31641 29736 27943 26480 25902 26704 28901 32021 35110 37073
55071 37073 37745 38301 39768 41555 42486 42726 43279 43974 43761 42931 43224 45432 48509 51463 54446 57484 59790
55054 59790 61160 62641 64945 67333 68781 69133 68444 66407 63182 59725 56599 53534 50772 49601 50672
55039 50672 52884 54808 56215 57306 57527 56370 54654 53916 54797 56678 58498 59580 60242 61845 65387
55024 65387 69724 72289 72098 70969 71125 72656 74116 74600 74295 73858 74138 75870 78907 82301 85538 88807
55008 88807 91697 92988 92547 92154 93369 95507 96679 95765 92453 86659 79421 73381 70675 70761 71572 72254
$$ packed form
55119D4604P98J679J390k62j229K52K964M059K673N24r25j842k424k024o89K67
55103D9815J56j04K75P19O41M52L57l22j558j994j067k67q79j968k084j598j643
55086C8931j941j478n64m04j125j778j905j793j463n78Q02K197L120L089J963
55071C7073O72N56J467J787R31K40N53O95k13q30K93K208L077K954K983L038K306
55054E9790J370J481K304K388J448L52o89k037l225l457l126l065k762j171J071
55039E0672K212J924J407J091K21j157j716p38Q81J881J820J082O62J603L542
55024F5387M337K565j91j129J56J531J460M84l05m37K80J732L037L394L237L269
55008H8807K890J291m41l93J215K138J172r14l312n794p238o040k706Q6Q11O82
$$ plain form
54992 72254 73347 74891 76021 76444 76836 77600 78268 78359 78054 77840 78076 78821 79650 79852 79360 79183 80390 83056
54974 83056 86627 90564 93931 95147 93436 90198 87874 87520 88366 89450 90623 91970 93252 94249 95063
54959 95063 95831 96497 96875 96825 96561 96989 99209 103272 107885 111833 115139 118297 120996 122415 122280 120804
54943 120804 117979 113917 109646 106643 105382 104974 104226 102636 100477 98432 97064 96222 95127 93403 91812
54928 91812 91488 92513 93600 93147 90569 86858 83910 82904 83256 83575 83427 83420 83730 83830 83925 85242 88140
54911 88140 91173 93023 94402 96937 100957 105493 109810 113816 117412 120459 123083 125289 126861 128376
54897 128376 131446 136779 142747 147229 150421 154396 160208 166911 173475 180238 188145 197622 208621 220930
54883 220930 234027 247186 259967 272186 283354 292585 299207 303222 305199 305795 304964 301370 293174
$$ packed form
54992G2254J093J544J130M23L92P64O68R1l05k14K36P45Q29K02m92j77J207K666
54974H3056L571L937L367J216j711l238k324l54Q46J084J173J347J282R97Q14
54959I5063P68O66L78n0k64M28K220M063M613L948L306L158K699J419j35j476
54943A20804k825m062m271l003j261m08p48j590k159k045j368q42j095j724j591
54928I1812l24J025J087m53k578l711k948j006L52L19j48pL10J00R5J317K898
54911H8140L033J850J379K535M020M536M317M006L596L047K624K206J572J515
54897A28376L070N333N968M482L192L975N812O703O564O763P907R477J0999J2309
54883B20930J3097J3159J2781J2219J1168R231O622M015J977N96q31l594q196
$$ plain form
54870 293174 279931 263440 246405 230719 217159 205721 195547 185433 175288 166529 160308 156183
54858 156183 153277 151715 151635 151720 150316 147577 145123 143909 143878 145428 149510 156023 163407 170287 176643 183223
54842 183223 190571 198754 207361 215831 224377 234184 245840 257932 268140 275333 279544 280393 277092 270047
54828 270047 261063 251611 241829 231371 220230 208649 197086 186336 176853 168006 158981 150281 143265
54815 143265 138212 133963 129587 125391 122180 120520 120702 122361 123997 123993 122232 119770 117021 113610 110080
54800 110080 108055 108061 108448 107335 104754 102173 100650 100069 99628 98579 96908 95408 94581 93636 91501 88716
54784 88716 87026 86865 86650 85129 83076 81864 81566 81499 81653 82325 82953 82590 81291 79910 78624 76720 74048
54767 74048 71838 71543 73284 75902 78419 80914 83835 86970 89781 92555 96212 100637 104197 105756 106391
$$ packed form
54870B93174j3243j6491j7035j5686j3560j1438j0174j0114j0145q759o221m125
54858A56183k906j562q0Q5j404k739k454j214l1J550M082O513P384O880O356O580
54842A83223P348Q183Q607Q470Q546R807J1656J2092J0208P193M211Q49l301p045
54828B70047q984r452r782j0458j1141j1581j1563j0750r483q847r025q700p016
54815A43265n053m249m376m196l211j660J82J659J636mj761k462k749l411l530
54800A10080k025OL87j113k581k581j523n81m41j049j671j500q27r45k135k785
54784H8716j690j61k15j521k053j212k98o7J54O72O28l63j299j381j286j904k672
54767G4048k210k95J741K618K517K495K921L135K811K774L657M425L560J559O35
$$ plain form
54752 106391 108033 110878 113369 114527 115053 116058 117942 120810 124904 130131 135868 141568 147046 152148
54738 152148 156910 162090 168661 176644 185238 194186 204028 214825 225706 236166 246978 259301 273420
54725 273420 288538 303196 315887 326126 334960 343367 349999 351816 347459 338778 328443 317412 305808
54712 305808 295010 287028 282017 277872 272592 266131 259626 253613 247701 241716 236414 232666 230310 228552
54698 228552 227563 228867 233575 240947 249464 258715 269166 280598 292155 303819 316486 330343 344461
54685 344461 358329 372669 388200 404461 420145 433562 442470 444700 439859 429882 417356 403746
54673 403746 389350 374099 357992 341491 325762 311771 298995 286061 272880 260922 250898
54662 250898 241420 230790 219159 208175 199364 193524 190655 189549 188243 185928 183835 183516 184902 186813
$$ packed form
54752A06391J642K845K491J158N26J005J884K868M094N227N737N700N478N102
54738A52148M762N180O571P983Q594Q948R842J0797J0881J0460J0812J2323J4119
54725B73420J5118J4658J2691J0239Q834Q407O632J817m357q681j0335j1031j1604
54712C05808j0798p982n011m145n280o461o505o013n912n985n302l748k356j758
54698B28552r89J304M708P372Q517R251J0451J1432J1557J1664J2667J3857J4118
54685C44461J3868J4340J5531J6261J5684J3417Q908K230m841r977j2526j3610
54673D03746j4396j5251j6107j6501j5729j3991j2776j2934j3181j1958j0024
54662B50898r478j0630j1631j0984q811n840k869j106j306k315k093l19J386J911
$$ plain form
54648 186813 188524 189794 190000 188529 185831 183209 181647 181367 182048 182755 182194 180035 177799 177586 179930 183393
54632 183393 185997 186586 185253 183270 182396 183462 185521 186889 186960 186620 187017 188381 189959 190761 190439 189694
54616 189694 189776 191375 194062 196764 198630 199631 200813 203825 209491 216834 224104 230657 236937 242803 247295
54601 247295 250484 254253 260249 267826 274804 279681 282488 284164 285878 288425 291623 294640 297340 300748
54587 300748 305764 312059 318714 325277 331798 338610 346530 356448 368087 380007 391385 402888 415030
54574 415030 426625 435727 441266 442894 440216 433381 423761 412792 400555 386487 370983 355200 339725
54561 339725 324550 310136 297428 286882 278207 270910 264576 259004 254590 251996 250822 249424 246976
54548 246976 244936 245294 248007 251246 253736 255559 256984 257815 257825 256789 254160 249637 243950 238357 233517
$$ packed form
54648A86813J711J270K06j471k698k622j562k80O81P07n61k159k236k13K344L463
54632A83393K604N89j333j983q74J066K059J368P1l40L97J364J578Q02l22p45
54616A89694Q2J599K687K702J866J001J182L012N666P343P270O553O280N866M492
54601B47295L189L769N996P577O978M877K807J676J714K547L198L017K700L408
54587C00748N016O295O655O563O521O812P920R918J1639J1920J1378J1503J2142
54574D15030J1595R102N539J628k678o835r620j0969j2237j4068j5504j5783j5475
54561C39725j5175j4414j2708j0546q675p297o334n572m414k594j174j398k448
54548B46976k040L58K713L239K490J823J425Q31J0j036k629m523n687n593m840
$$ plain form
54533 233517 229530 226493 224111 221177 216540 210398 203850 197666 192316 188499 186412 184949 182790 179908
54519 179908 176940 173774 170109 166654 164149 161657 157689 152760 148982 147183 146279 145490 145171 145219 144720 143736
54503 143736 143556 144506 145369 145712 146820 149144 150651 149327 146027 143236 142029 141795 142154 143351 145013 146044
54487 146044 145941 145308 145092 145946 148070 150886 153137 154078 154545 156239 160031 165438 171543 177925 184810 192610
54471 192610 201084 208806 214059 216757 218852 222281 226957 231412 234725 236869 237574 236149 232568 227751
54457 227751 222447 216528 209730 202406 195165 188270 181860 176384 172231 169097 166229 163335 160886 159420
54443 159420 158923 159051 159570 160182 160095 158371 154913 150872 147837 146658 146932 147386 146890 145556 144991 146922 151334
54426 151334 156373 160239 162617 164032 164700 164730 164914 166236 168685 171282 173257 174684 176108 178188 181482
$$ packed form
54533B33517l987l037k382k934m637o142o548o184n350l817k087j463k159k882
54519A79908k968l166l665l455k505k492l968m929l778j799r04p89l19M8m99r84
54503A43736j80R50Q63L43J108K324J507j324l300k791j207k34L59J197J662J031
54487A46044j03o33k16Q54K124K816K251R41M67J694L792N407O105O382O885P800
54471A92610Q474P722N253K698K095L429M676M455L313K144P05j425l581m817
54457B27751n304n919o798p324p241o895o410n476m153l134k868k894k449j466
54443A59420m97J28N19O12q7j724l458m041l035j179K74M54m96j334n65J931M412
54426A51334N039L866K378J415O68L0J84J322K449K597J975J427J424K080L294
$$ plain form
54411 181482 185921 190553 194404 197473 200341 203102 205480 207706 210204 212450 213203 212163 210471 209227
54397 209227 208302 206909 204572 201192 197006 193045 190944 191549 193953 196306 197404 197328 197041 197612 199308 201133
54381 201133 201680 200634 198899 197061 194528 190640 185951 181689 178435 175995 174195 173034 172249 171425 170576
54366 170576 170108 170208 170678 171382 172470 174042 175817 177260 178078 178755 180502 184185 189088 193221 195357 196392
54350 196392 198154 201161 204320 206730 208877 211705 215302 219149 223120 227480 232155 236926 242363 249564
54336 249564 258522 267506 274754 280166 284674 288548 291420 293557 295770 297886 298575 297038 293830 289723
54322 289723 284960 280148 276438 273796 270247 264178 256477 249152 242730 236619 231229 227651 225443 222813
54308 222813 219309 216414 214939 213667 211550 209577 209039 209111 207738 204347 200246 196661 193717 191370 190107
$$ packed form
54411A81482M439M632L851L069K868K761K378K226K498K246P53j040j692j244
54397B09227r25j393k337l380m186l961k101O05K404K353J098p6k87N71J696J825
54381B01133N47j046j735j838k533l888m689m262l254k440j800j161p85q24q49
54366A70576m68J00M70P04J088J572J775J443Q18O77J747L683M903M133K136J035
54350A96392J762L007L159K410K147K828L597L847L971M360M675M771N437P201
54336B49564Q958Q984P248N412M508L874K872K137K213K116O89j537l208m107
54322B89723m763m812l710k642l549o069p701p325o422o111n390l578k208k630
54308B22813l504k895j475j272k117j973n38P2j373l391m101l585k944k347j263
$$ plain form
54293 190107 190271 191443 193012 194926 197395 200146 202510 204379 206624 210126 214502 218422 221320 224195
54279 224195 228206 233001 237190 240138 242466 244872 247427 250071 252827 255098 255530 253215 248750 243697
54265 243697 239201 235281 231113 225754 218753 210394 201416 192701 185198 179564 175306 170706 164414 157050
54251 157050 150614 146449 144380 143471 142642 140696 136935 132131 128004 125456 123963 122788 121855 121172 120269
54236 120269 118624 116035 112463 108321 105016 104065 105228 106462 106263 105091 104012 103064 101905 101175 101943
54221 101943 104159 106550 107900 107844 106702 105167 103922 103006 101804 100066 98555 98148 98678 99232 99389 99601
54205 99601 100514 102320 104645 106732 107953 108395 108830 109951 111882 114410 117146 119276 119858 118854 117476
54190 117476 117129 118304 120682 123715 126772 129242 130991 132344 133259 133054 131411 129245 127947 127894 128101 127300
$$ packed form
54293A90107J64J172J569J914K469K751K364J869K245L502M376L920K898K875
54279B24195M011M795M189K948K328K406K555K644K756K271M32k315m465n053
54265B43697m496l920m168n359p001q359q978q715p503n634m258m600o292p364
54251A57050o436m165k069r09q29j946l761m804m127k548j493j175r33o83r03
54236A20269j645k589l572m142l305r51J163J234j99j172j079r48j159p30P68
54221A01943K216K391J350n6j142j535j245r16j202j738j511m07N30N54J57K12
54205I9601R13J806K325K087J221M42M35J121J931K528K736K130N82j004j378
54190A17476l47J175K378L033L057K470J749J353R15k05j643k166j298n3K07q01
$$ plain form
54174 127300 125252 123119 122485 123707 125369 125850 125215 124921 125854 127597 129485 131200 132138 131506 129609 127901
54158 127901 127206 126870 126275 126019 126786 128055 128962 129540 130097 130115 128927 126917 124995 123276 121314 119299 118070
54141 118070 118017 118711 119476 119855 119828 119908 120570 121284 120926 119526 118609 119124 120094 120199 119599 119050 118200 116226 113468
54122 113468 110935 108674 106061 103370 101710 101537 102411 103871 105352 105642 103946 101384 100033 100397 101117
54107 101117 101209 101167 101648 102324 102576 102409 102300 102670 103558 104239 103514 101176 98767 97878 98204 98534 99046 100817
54089 100817 103316 104529 103983 103642 104980 106720 106518 103718 99581 95924 94345 95705 99384 103714 107808
54074 107808 112087 116532 119644 120113 118458 116023 113259 110163 107610 106768 107548 108725 109390 109269 107935
54059 107935 104944 100903 97464 95913 96149 97036 97370 96716 95912 96499 99047 102074 103366 102352 100565 99638
$$ packed form
54174A27300k048k133o34J222J662M81o35k94R33J743J888J715R38o32j897j708
54158A27901o95l36n95k56P67J269R07N78N57J8j188k010j922j719j962k015j229
54141A18070n3O94P65L79k7Q0O62P14l58j400r17N15R70J05o00n49q50j974k758
54122A13468k533k261k613k691j660j73Q74J460J481K90j696k562j351L64P20
54107A01117R2m2M81O76K52j67j09L70Q88O81p25k338k409q89L26L30N12J771
54089A00817K499J213n46l41J338J740k02k800m137l657j579J360L679M330M094
54074A07808M279M445L112M69j655k435k764l096k553q42P80J177O65j21j334
54059A07935k991m041l439j551K36Q87L34o54q04N87K548L027J292j014j787r27
$$ plain form
54043 99638 99477 98787 96962 94890 93818 93738 93348 91770 89995 89944 92085 94689 95856 95630 95432 95869 96063
54026 96063 95172 93737 93142 94150 96276 98304 99258 99120 98893 99863 102540 106214 109400 110697 109510 106552
54010 106552 103727 102937 104440 106627 107877 108391 109519 111458 112711 112242 111273 112003 115123 119522 123995
53995 123995 128044 131094 132396 132222 132146 133450 135957 138800 141593 144307 146942 149929 153972 158671 162204
53980 162204 163407 163497 164611 167245 170356 173454 177151 181803 187051 192814 199488 206948 214425 221696 229435
53965 229435 238077 247208 256248 264987 273191 280509 286955 292709 297310 299945 300832 301428 302873 304883 306444
53950 306444 306950 306459 305544 305093 305556 306178 305660 303742 301422 299450 297471 294898 291829 288828 286416 284874
53934 284874 283732 281533 277176 271525 266535 262696 258808 254523 251290 250010 249467 248278 246975 246668 246905
$$ packed form
54043I9638j61o90j825k072j072q0l90j578j775n1K141K604J167k26j98M37J94
54026I6063q91j435n95J008K126K028R54j38k27R70K677L674L186J297j187k958
54010A06552k825p90J503K187J250N14J128J939J253m69r69P30L120M399M473
53995A23995M049L050J302j74p6J304K507K843K793K714K635K987M043M699L533
53980A62204J203R0J114K634L111L098L697M652N248N763O674P460P477P271P739
53965B29435Q642R131R040Q739Q204P318O446N754M601K635Q87N96J445K010J561
53950C06444N06m91r15m51M63O22n18j918k320j972j979k573l069l001k412j542
53934B84874j142k199m357n651m990l839l888m285l233j280n43j189j303l07K37
$$ plain form
53919 246905 246518 245716 245579 245995 245760 244550 243295 242709 242756 243399 244477 244816 242967 239193 235603 233857 233667
53902 233667 233810 233588 232817 231350 229364 227582 226566 226059 225374 224184 222739 221711 221959 223944 226987 229438
53886 229438 230107 229513 229543 231840 236483 242113 247344 252054 257168 263151 269281 274847 280622 288204 297879
53871 297879 307961 316565 323369 329146 334110 337562 339116 339492 339719 339840 338927 336431 333194 330984 331126
53856 331126 333736 337971 342716 347110 350892 354429 358167 362061 365833 369856 375370 383523 394351 406735
53842 406735 419136 430399 440230 449053 457114 463752 467991 469934 470942 472171 473373 473443 471645 468030
53828 468030 463162 457958 453383 449688 446016 441062 434049 425071 414898 404660 395229 386619 378302 370119
53814 370119 362236 354263 345487 336404 328803 323453 318798 313066 306767 301577 297430 292501 286033 279417
$$ packed form
53919B46905l87q02j37M16k35j210j255n86M7O43J078L39j849l774l590j746j90
53902B33667J43k22p71j467j986j782j016n07o85j190j445j028K48J985L043K451
53886B29438O69n94L0K297M643N630N231M710N114N983O130N566N775P582R675
53871B97879J0082Q604O804N777M964L452J554L76K27J21r13k496l237k210J42
53856C31126K610M235M745M394L782L537L738L894L772M023N514Q153J0828J2384
53842D06735J2401J1263R831Q823Q061O638M239J943J008J229J202P0j798l615
53828D68030m868n204m575l695l672m954p013q978j0173j0238r431q610q317q183
53814C70119p883p973q776r083p601n350m655n732o299n190m147m929o468o616
$$ plain form
53800 279417 274023 269482 264903 260566 257357 255070 252333 248117 242837 237937 234587 232546 230211 226044
53786 226044 220071 213753 208522 204827 202458 201061 200178 199406 198765 198426 197952 196403 193484 190074 187348
53771 187348 185820 185485 186221 187548 188503 188383 187426 186365 185541 184794 183900 182727 181278 180026 179891 181282
53755 181282 183349 184858 185759 187165 189566 191823 192545 192062 192205 194133 197149 199993 202557 205497 208569
53740 208569 210576 211398 212989 217450 224587 232250 238843 244661 250883 258237 266766 275940 284603 291615
53726 291615 297053 302228 308079 314080 319178 323186 326616 329636 332028 333881 335617 337310 338506 338773
53712 338773 338083 336903 336207 337003 339207 341264 341536 339880 337341 334626 331805 329168 327168 325426 322964
53697 322964 319715 316672 314030 310532 305539 300687 298184 298081 298371 297420 295110 291912 288218 284609 281609
$$ packed form
53800B79417n394m541m579m337l209k287k737m216n280m900l350k041k335m167
53786B26044n973o318n231l695k369j397q83p72o41l39m74j549k919l410k726
53771A87348j528l35P36J327R55j20r57j061q24p47q94j173j449j252j35J391
53755A81282K067J509R01J406K401K257P22m83J43J928L016K844K564K940L072
53740B08569K007Q22J591M461P137P663O593N818O222P354Q529R174Q663P012
53726B91615N438N175N851O001N098M008L430L020K392J853J736J693J196K67
53712C38773o90j180o96P96K204K057K72j656k539k715k821k637k000j742k462
53697C22964l249l043k642l498m993m852k503j03K90r51k310l198l694l609l000
$$ plain form
53682 281609 278936 275920 272719 270029 267571 264165 259734 255894 253885 252992 251840 250140 248126 245254
53668 245254 240859 235633 231152 228076 225796 223679 221642 219696 217977 217296 218648 221974 226040 229564
53654 229564 231871 232750 232742 233525 236867 242691 248940 253629 256496 258604 261212 265212 270799 277174 283154
53639 283154 288358 293255 298017 302180 305687 309310 313572 317939 321517 323969 325435 326314 327414 329487
53625 329487 332183 334347 335755 337552 340507 343956 347240 350924 355363 359146 360558 360055 359697 360305 360650
53610 360650 359517 357225 354818 352952 352028 352418 353862 355219 355414 354399 352953 351809 351198 350976 350912 350843
53594 350843 350566 349672 347958 346076 345167 345463 345831 345313 344516 344673 345840 347030 347751 348230 348237 346953 344333
53577 344333 341548 339656 338680 338327 338695 339708 340609 340852 341023 342209 344668 347725 350795 353947 357382 360880
$$ packed form
53682B81609k673l016l201k690k458l406m431l840k009q93j152j700k014k872
53668B45254m395n226m481l076k280k117k037j946j719o81J352L326M066L524
53654B29564K307Q79qP83L342N824O249M689K867K108K608M000N587O375N980
53639B83154N204M897M762M163L507L623M262M367L578K452J466Q79J100K073
53625C29487K696K164J408J797K955L449L284L684M439L783J412n03l58O08L45
53610C60650j133k292k407j866r24L90J444J357J95j015j446j144o11k22o4o9
53594C50843k77q94j714j882r09K96L68n18p97J57J167J190P21M79Pj284k620
53577C44333k785j892r76l53L68J013R01K43J71J186K459L057L070L152L435L498
$$ plain form
53561 360880 364034 366897 370009 373617 377071 379564 381565 384826 390386 397105 402998 407729 412745 419023
53547 419023 425820 431996 437537 443074 448707 454177 459708 465748 472124 478396 485045 493359 503692 514547
53533 514547 524050 532016 539783 548159 556426 563768 570823 578846 587685 595692 601815 606843 612108 617802
53519 617802 623268 628248 632948 637240 640749 643711 647023 651397 656952 663470 670329 676254 679939 681297
53505 681297 681741 683054 686053 690109 693618 695285 695544 696570 700239 706184 712444 717801 722727 728061 733644
53490 733644 738397 741139 741324 739747 738563 739693 742989 746685 749760 752839 756480 759805 761799 763151
53476 763151 765666 770104 775533 780784 785732 790944 796705 802895 809587 817335 826598 837031 847719 858278
53462 858278 869429 882148 896572 912206 928947 947205 966978 987455 1007713 1027496 1047425
$$ packed form
53561C60880L154K863L112L608L454K493K001L261N560O719N893M731N016O278
53547D19023O797O176N541N537N633N470N531O040O376O272O649Q314J0333J0855
53533E14547R503P966P767Q376Q267P342P055Q023Q839Q007O123N028N265N694
53519F17802N466M980M700M292L509K962L312M374N555O518O859N925L685J358
53505F81297M44J313K999M056L509J667K59J026L669N945O260N357M926N334N583
53490G33644M753K742J85j577j184J130L296L696L075L079L641L325J994J352
53476G63151K515M438N429N251M948N212N761O190O692P748R263J0433J0688J0559
53462H58278J1151J2719J4424J5634J6741J8258J9773K0477K0258J9783J9929
$$ plain form
53451 1047425 1068913 1093657 1122300 1153411 1184623 1215154 1246696 1281479 1319975 1360738 1401905
53440 1401905 1442489 1482797 1524190 1568195 1615409 1665215 1716548 1768676 1821397 1874857 1929082
53429 1929082 1983305 2036138 2087128 2137812 2190081 2243663 2296557 2348044 2399672 2452643 2505783
53418 2505783 2557241 2607035 2656642 2706909 2757590 2808278 2858362 2906411 2950952 2991959 3030685
53407 3030685 3068103 3104255 3138848 3171524 3201674 3228876 3253502 3276118 3296433 3313664 3327785
53396 3327785 3339504 3348957 3355248 3357321 3354603 3346926 3334730 3319312 3301900 3282287 3259263 3232501
53384 3232501 3203067 3171783 3138140 3101343 3061622 3019864 2976675 2932495 2888148 2844452 2801429
53373 2801429 2758325 2714347 2669207 2623386 2578120 2534744 2493721 2454599 2417154 2382006 2349722
$$ packed form
53451A047425K1488K4744K8643L1111L1212L0531L1542L4783L8496M0763M1167
53440A401905M0584M0308M1393M4005M7214M9806N1333N2128N2721N3460N4225
53429A929082N4223N2833N0990N0684N2269N3582N2894N1487N1628N2971N3140
53418B505783N1458M9794M9607N0267N0681N0688N0084M8049M4541M1007L8726
53407C030685L7418L6152L4593L2676L0150K7202K4626K2616K0315J7231J4121
53396C327785J1719R453O291K073k718p677j2196j5418j7412j9613k3024k6762
53384C232501k9434l1284l3643l6797l9721m1758m3189m4180m4347m3696m3023
53373B801429m3104m3978m5140m5821m5266m3376m1023l9122l7445l5148l2284
$$ plain form
53362 2349722 2319873 2291595 2264686 2239620 2216881 2196986 2180859 2169253 2161766 2157131 2154617 2154590
53350 2154590 2157706 2164279 2174628 2189149 2207620 2229044 2252882 2280016 2311800 2348393 2388654 2431468
53338 2431468 2476430 2523334 2571933 2622577 2676352 2734050 2795397 2859736 2927068 2997904 3072476
53327 3072476 3150682 3232568 3318138 3406806 3497711 3590693 3686270 3784565 3884863 3986466 4089280
53316 4089280 4193224 4297715 4402378 4507690 4614097 4720647 4825254 4926382 5023958 5118524
53306 5118524 5210089 5297937 5381037 5458251 5528504 5591255 5646752 5695512 5737583 5772543 5800119
53295 5800119 5820330 5832901 5836993 5832059 5818828 5798873 5772997 5740397 5699707 5650556 5593737 5530000
53283 5530000 5459140 5380407 5293595 5199787 5101205 5000264 4898443 4795933 4692524 4588686
$$ packed form
53362B349722k9849k8278k6909k5066k2739j9895j6127j1606p487m635k514k7
53350B154590L116O573J0349J4521J8471K1424K3838K7134L1784L6593M0261M2814
53338B431468M4962M6904M8599N0644N3775N7698O1347O4339O7332P0836P4572
53327C072476P8206Q1886Q5570Q8668R0905R2982R5577R8295J00298J01603J02814
53316D089280J03944J04491J04663J05312J06407J06550J04607J01128R7576R4566
53306E118524R1565Q7848Q3100P7214P0253O2751N5497M8760M2071L4960K7576
53295E800119K0211J2571M092m934j3231j9955k5876l2600m0690m9151n6819o3737
53283E530000p0860p8733q6812r3808r8582j00941j01821j02510j03409j03838
$$ plain form
53273 4588686 4485575 4384160 4284624 4186509 4089022 3991449 3893957 3798128 3705974 3618046 3532932
53262 3532932 3449069 3366696 3287613 3213259 3143528 3077419 3014364 2954676 2898871 2846951 2798587
53251 2798587 2753942 2713808 2678476 2646788 2616858 2587757 2560059 2534867 2513045 2495470 2483001
53240 2483001 2475465 2471181 2468185 2465849 2464977 2466682 2471647 2480006 2491171 2503861 2517127 2531490 2548473
53227 2548473 2568691 2591020 2614135 2638582 2666555 2699501 2736453 2775149 2814401 2854756 2896970
53216 2896970 2940658 2984802 3028781 3072194 3114308 3154686 3194233 3234415 3275155 3314342 3349784
53205 3349784 3381023 3408922 3434279 3457342 3478031 3495858 3509958 3519793 3525706 3528425 3528282 3525102
53193 3525102 3518352 3507058 3490218 3468000 3442150 3414386 3384539 3350999 3312891 3271087 3227000
$$ packed form
53273D588686j03111j01415r9536r8115r7487r7573r7492r5829r2154q7928q5114
53262C532932q3863q2373p9083p4354o9731o6109o3055n9688n5805n1920m8364
53251B798587m4645m0134l5332l1688k9930k9101k7698k5192k1822j7575j2469
53240B483001p536m284k996k336q72J705M965Q359J1165J2690J3266J4363J6983
53227B548473K0218K2329K3115K4447K7973L2946L6952L8696L9252M0355M2214
53216B896970M3688M4144M3979M3413M2114M0378L9547M0182M0740L9187L5442
53205C349784L1239K7899K5357K3063K0689J7827J4100R835N913K719j43l180
53193C525102o750j1294j6840k2218k5850k7764k9847l3540l8108m1804m4087
$$ plain form
53182 3227000 3181155 3133327 3083530 3032209 2979595 2925463 2869891 2813925 2758902 2705051 2651368
53171 2651368 2597266 2543842 2492779 2444370 2397480 2351401 2306630 2263683 2222142 2181358 2141216
53160 2141216 2101672 2062338 2023117 1984572 1947010 1909953 1873280 1838317 1806955 1779989 1756794
53149 1756794 1735935 1715417 1693179 1668595 1643258 1619238 1596743 1574293 1550830 1526561 1501948
53138 1501948 1477024 1451846 1426591 1401006 1374612 1347660 1321066 1295174 1269379 1243275 1217396
53127 1217396 1192355 1167859 1143121 1117949 1092890 1068404 1044236 1019773 994967 970644 947574
53116 947574 925312 902588 879044 855887 834397 814465 795257 776551 758433 740272 721262
53105 721262 701877 683626 667261 652176 637683 623887 611070 599020 587382 576083 565153
$$ packed form
53182C227000m5845m7828m9797n1321n2614n4132n5572n5966n5023n3851n3683
53171B651368n4102n3424n1063m8409m6890m6079m4771m2947m1541m0784m0142
53160B141216l9544l9334l9221l8545l7562l7057l6673l4963l1362k6966k3195
53149A756794k0859k0518k2238k4584k5337k4020k2495k2450k3463k4269k4613
53138A501948k4924k5178k5255k5585k6394k6952k6594k5892k5795k6104k5879
53127A217396k5041k4496k4738k5172k5059k4486k4168k4463k4806k4323k3070
53116I47574k2262k2724k3544k3157k1490j9932j9208j8706j8118j8161j9010
53105G21262j9385j8251j6365j5085j4493j3796j2817j2050j1638j1299j0930
$$ plain form
53094 565153 554486 543803 532597 520561 508608 498823 492227 486983 480210 471462 463002 456551 451448
53081 451448 446441 441602 437419 433394 428719 423517 418322 413165 408223 404529 402772 401918 400344 398020
53067 398020 396216 395134 393258 389493 384826 381195 379336 378469 377754 377379 378062 379839 381689 382456 382161 382275
53051 382275 384494 389175 394970 399976 403250 405217 406774 408335 409935 411897 414709 418159 421317 423575
53037 423575 425017 425435 423941 420329 415914 411992 408198 403634 398809 394740 390622 384554 376706 369536
53023 369536 364208 358976 352335 345753 341432 338766 335179 329794 324235 319960 316610 313136 309110 304557
53009 304557 299728 295426 292554 290861 288937 285841 282164 279089 276937 275016 272548 269413 266106 263125
52995 263125 260417 257523 254333 251328 248806 246269 243101 239566 236573 234665 233793 233882 234886 236299 237201
$$ packed form
53094E65153j0667j0683j1206j2036j1953r785o596n244o773q748q460o451n103
53081D51448n007m839m183m025m675n202n195n157m942l694j757q54j574k324
53067C98020j804j082j876l765m667l631j859q67p15l75O83J777J850P67k95J14
53051C82275K219M681N795N006L274J967J557J561J600J962K812L450L158K258
53037D23575J442M18j494l612m415l922l794m564m825m069m118o068p848p170
53023C69536n328n232o641o582m321k666l587n385n559m275l350l474m026m553
53009C04557m829m302k872j693j924l096l677l075k152j921k468l135l307k981
52995B63125k708k894l190l005k522k537l168l535k993j908q72Q9J004J413R02
$$ plain form
52980 237201 236869 234979 231457 226781 222310 219426 218183 217460 216602 216096 216319 216487 215618 214025 213014 213193
52964 213193 213834 214006 213627 213055 212166 210561 208568 207253 207085 207078 205811 203060 199928 197558 196366 196493 198072
52947 198072 200652 202974 203950 203615 202827 202331 202406 202983 203656 203934 203864 204098 204960 205855 206103 205971 206283 207312
52929 207312 208651 209818 210404 209962 208651 207805 208810 211319 213443 213993 213672 213600 213586 212753 211561 212054 215614
52912 215614 220911 224758 225239 223682 223131 225070 228314 231239 234170 238766 245585 253341 260489 266613 272098
52897 272098 277359 282882 289281 296681 304289 311018 316313 320196 322970 325281 328047 331604 334942 336383
52883 336383 335173 332068 328293 324362 320198 315938 311994 308307 304126 298935 293369 288803 286022 284595
52869 284595 283552 282336 280936 279405 277629 275607 273825 273208 274461 277198 279825 280650 279193 276325 273282
$$ packed form
52980B37201l32j890l522m676m471k884j243p23q58n06K23J68q69j593j011J79
52964B13193O41J72l79n72q89j605j993j315j68pj267k751l132k370j192J27J579
52947A98072K580K322R76l35p88m96P5N77O73K78p0K34Q62Q95K48j32L12J029
52929B07312J339J167N86m42j311q46J005K509K124N50l21p2j4q33j192M93L560
52912B15614N297L847M81j557n51J939L244K925K931M596O819P756P148O124N485
52897B72098N261N523O399P400P608O729N295L883K774K311K766L557L338J441
52883C36383j210l105l775l931m164m260l944l687m181n191n566m566k781j427
52869B84595j043j216j400j531j776k022j782o17J253K737K627Q25j457k868l043
$$ plain form
52854 273282 270923 269735 269809 270523 270858 270387 269583 268924 268266 267534 267339 268108 268950 268250 265471 261782 258985
52837 258985 258345 260309 264458 269325 272901 274024 273335 272614 273118 274689 276500 278375 280884 284030 286474
52822 286474 286979 286348 286796 289047 291256 291559 290699 290904 292860 295306 297391 299746 302825 305657 307118 307544
52806 307544 308062 308842 309022 308220 307215 306874 307094 307261 307410 308263 309985 311487 311491 310098 308675 308343 309295 311615
52788 311615 315675 321120 326426 330408 333537 336808 339937 341966 343298 345762 350493 356950 364078 371260
52774 371260 377931 383595 388720 394375 400202 403878 403548 400040 395753 392036 388590 384876 380876 376662
52760 376662 372203 367757 363778 360383 357318 354338 351087 346862 341119 334153 326756 319351 312011 305142
52746 305142 299366 294692 290509 286571 283270 280772 278571 276312 274354 272930 271227 268105 263546 258673
$$ packed form
52854B73282k359j188P4P14L35m71q04o59o58p32j95P69Q42p00k779l689k797
52837B58985o40J964M149M867L576J123o89p21N04J571J811J875K509L146K444
52822B86474N05o31M48K251K209L03q60K05J956K446K085K355L079K832J461M26
52806C07544N18P80J80q02j005l41K20J67J49Q53J722J502Mj393j423l32R52K320
52788C11615M060N445N306L982L129L271L129K029J332K464M731O457P128P182
52774C71260O671N664N125N655N827L676l30l508m287l717l446l714m000m214
52760C76662m459m446l979l395l065k980l251m225n743o966p397p405p340o869
52746C05142n776m674m183l938l301k498k201k259j958j424j703l122m559m873
$$ plain form
52732 258673 254314 250348 246680 243967 242639 241754 239883 237086 234999 234590 234734 233619 230862 227452 224261
52717 224261 221643 220137 220264 221450 222268 222134 221834 221989 221893 220502 217835 214677 211491 208386 205733 203983
52701 203983 203022 202215 200973 198892 195820 192286 189476 188108 187614 187015 186129 185167 183617 180609 176290 171802
52685 171802 167927 164745 162586 162060 162738 162934 161575 159529 158379 158449 158714 158153 156547 154345 152418 151601
52669 151601 151877 152238 151818 150768 149502 147728 145075 142251 140447 139657 138642 136700 134583 133447 133773
52654 133773 135598 138749 142258 144455 144588 143863 144015 145087 145444 143936 141305 139369 139284 140659 142004 142040
52638 142040 140865 139706 139430 139766 140565 143063 148602 156182 162740 166494 168898 172460 177542 182475 186212
52623 186212 189313 192279 194461 195354 195933 197507 199641 200437 198978 196487 194619 193466 192074 190225 188538
$$ packed form
52732B58673m359l966l668k713j328q85j871k797k087m09J44j115k757l410l191
52717B24261k618j506J27J186Q18j34l00J55r6j391k667l158l186l105k653j750
52701B03983r61q07j242k081l072l534k810j368m94n99q86r62j550l008m319m488
52685A71802l875l182k159n26O78J96j359k046j150P0K65n61j606k202j927q17
52669A51601K76L61m20j050j266j774k653k824j804p90j015j942k117j136L26
52654A33773J825L151L509K197J33p25J52J072L57j508k631j936q5J375J345L6
52638A42040j175j159k76L36P99K498N539P580O558L754K404L562N082M933L737
52623A86212L101K966K182Q93N79J574K134P96j459k491j868j153j392j849j687
$$ plain form
52608 188538 186981 184686 181662 179337 178507 177795 175464 172020 169438 168029 165900 161777 156711 152300 148746
52593 148746 145687 143556 142670 141913 140075 138026 137865 139884 141910 142026 140659 139429 138939 138473 137232 135198
52577 135198 133121 132034 132500 134026 135511 136348 136717 136801 136408 135618 135117 135414 136226 137053 137938 139158 140531
52560 140531 141614 142338 143003 143735 144415 144945 145177 144753 143498 141963 141077 141102 141313 140874 139699 138338 137339
52543 137339 137057 137808 139681 142206 144651 146843 149244 151874 153578 153094 150777 148605 148252 149677 151765
52528 151765 153696 155265 156509 157701 159412 161941 164794 167241 169161 170855 172344 173520 174730 176544
52514 176544 179053 182073 185883 190855 196370 200960 203810 205439 206754 208081 209344 210591 212050 214106
52500 214106 217248 221473 225798 229089 231403 233699 236237 238287 239488 240249 240435 239137 236542 234744 235498
$$ packed form
52608A88538j557k295l024k325q30p12k331l444k582j409k129m123n066m411l554
52593A48746l059k131q86p57j838k049j61K019K026J16j367j230m90m66j241k034
52577A35198k077j087M66J526J485Q37L69Q4l93p90n01K97Q12Q27Q85J220J373
52560A40531J083P24O65P32O80N30K32m24j255j535q86K5K11m39j175j361r99
52543A37339k82P51J873K525K445K192K401K630J704m84k317k172l53J425K088
52528A51765J931J569J244J192J711K529K853K447J920J694J489J176J210J814
52514A76544K509L020L810M972N515M590K850J629J315J327J263J247J459K056
52500B14106L142M225M325L291K314K296K538K050J201P61J86j298k595j798P54
$$ plain form
52485 235498 238059 240416 241883 243211 244790 246304 247876 250170 253253 256502 259536 262143 263361 262084
52471 262084 258908 256190 255734 257310 259783 262589 265459 267665 268522 268201 267395 266553 265967 266130 267299 268900
52455 268900 269867 269388 267146 263425 259414 256737 255875 255469 254055 252186 251887 254069 257559 260788 263347
52440 263347 265446 266870 267365 267430 267830 268678 269762 271493 274476 278116 280640 280883 279487 278091 277962 279639
52424 279639 283020 287059 289963 290569 289431 287903 286449 284507 281793 278870 276428 274930 275069 277584 282095
52409 282095 286911 290673 293701 297086 300938 304274 306454 307815 308832 309340 308899 307595 306236 305914 307357
52394 307357 310355 313719 316198 317737 319608 323015 327734 332488 336502 340155 343901 347140 348793 348839 348563
52379 348563 349058 349989 350148 348802 346136 342709 338954 335008 330662 325688 320536 316287 313370 310823 307619
$$ packed form
52485B35498K561K357J467J328J579J514J572K294L083L249L034K607J218j277
52471B62084l176k718m56J576K473K806K870K206Q57l21q06q42n86J63J169J601
52455B68900R67m79k242l721m011k677q62m06j414j869k99K182L490L229K559
52440B63347K099J424M95O5M00Q48J084J731K983L640K524K43j396j396j29J677
52424B79639L381M039K904O06j138j528j454j942k714k923k442j498J39K515M511
52409B82095M816L762L028L385L852L336K180J361J017N08m41j304j359l22J443
52394C07357K998L364K479J539J871L407M719M754M014L653L746L239J653M6k76
52379C48563M95R31J59j346k666l427l755l946m346m974n152m249k917k547l204
$$ [...]
##END NTUPLES=NMR SPECTRUM
##END=
