##TITLE=coffee_type TOLI01-ROVE100E_85-15%
COFFEE_meoh_noesyp64 COFFEE_meoh {C:\Bruker\TOPSPIN} Administrator 3
##JCAMPDX= 6.0         $$ Bruker NMR JCAMP-DX V2.0
##DATA TYPE= NMR SPECTRUM
##DATA CLASS= NTUPLES
##ORIGIN= Bruker BioSpin GmbH
##OWNER= Administrator
$$ 1.72 TOPSPIN		Version 2.1
$$ 2012-05-18 15:39:39.057 -0700  Administrator@X
$$ Compression mode = diff/dup
##.OBSERVE FREQUENCY= 400.13188235
##.OBSERVE NUCLEUS= ^1H
##.ACQUISITION MODE= SIMULTANEOUS (DQD)
##.ACQUISITION SCHEME= undefined
##.AVERAGES= 64
##.DIGITISER RES= 22
##SPECTROMETER/DATA SYSTEM= spect
##.PULSE SEQUENCE= noesygpps1d.comp
##.SOLVENT NAME= COFFEE_meoh
##.SHIFT REFERENCE= INTERNAL, COFFEE_meoh, 1, 14.98061
##AUDIT TRAIL= $$ (NUMBER, WHEN, WHO, WHERE, PROCESS, VERSION, WHAT)
$$ ##TITLE= Audit trail, TOPSPIN		Version 2.1
$$ ##JCAMPDX= 5.01
$$ ##ORIGIN= Bruker BioSpin GmbH
$$ ##OWNER= Administrator
$$ $$ C:\Bruker\TOPSPIN/data/Administrator/nmr/12-COFFEE-2002/32/pdata/1/auditp.txt
$$ ##AUDIT TRAIL=  $$ (NUMBER, WHEN, WHO, WHERE, PROCESS, VERSION, WHAT)
(   1,<2012-02-20 21:17:33.984 -0500>,<Administrator>,<TOPSPIN>,<go>,<TOPSPIN 2.1>,
      <created by zg
	started at 2012-02-20 21:06:03.625 -0500,
	POWCHK enabled, PULCHK disabled,
       configuration hash MD5:
       B0 76 FB 9C 50 81 44 7D 18 B3 26 32 4E 60 AD 96
       data hash MD5: 64K
       20 EE C3 07 74 CC B9 C5 51 C1 D4 3F 70 69 2A 06>)
(   2,<2012-02-20 21:17:36.906 -0500>,<Administrator>,<TOPSPIN>,<proc1d>,<TOPSPIN 2.1>,
      <Start of raw data processing
       efp LB = 0.3 FT_mod = 6 PKNL = 1 PHC0 = 0 PHC1 = 0 SI = 128K 
       data hash MD5: 128K
       7E 30 03 94 F8 79 7E 12 F3 F3 F0 09 19 82 60 E7>)
(   3,<2012-02-20 21:17:38.125 -0500>,<Administrator>,<TOPSPIN>,<proc1d>,<TOPSPIN 2.1>,
      <pk PHC0 = 20.7312 PHC1 = 0 
       data hash MD5: 128K
       D8 C8 1A E2 77 D7 A9 13 1F 5B DF C1 78 CF 9A D8>)
(   4,<2012-02-20 21:17:38.719 -0500>,<Administrator>,<TOPSPIN>,<proc1d>,<TOPSPIN 2.1>,
      <abs ABSG = 1 
       data hash MD5: 128K
       72 4A F9 FF D7 DD F1 5B AE C6 0C A3 25 48 83 D3>)
(   5,<2012-02-20 21:17:38.813 -0500>,<Administrator>,<TOPSPIN>,<proc1d>,<TOPSPIN 2.1>,
      <abs ABSG = 2 
       data hash MD5: 128K
       4B 80 58 B5 E0 DB 9A 29 FF 06 F5 32 B6 4D AA B2>)
(   6,<2012-02-20 21:17:38.859 -0500>,<Administrator>,<TOPSPIN>,<proc1d>,<TOPSPIN 2.1>,
      <abs ABSG = 3 
       data hash MD5: 128K
       23 51 CF 61 8D A8 B2 51 A0 16 29 0A C5 F8 0F E1>)
(   7,<2012-02-20 21:17:38.938 -0500>,<Administrator>,<TOPSPIN>,<proc1d>,<TOPSPIN 2.1>,
      <abs ABSG = 4 
       data hash MD5: 128K
       F6 D7 F9 09 98 CD 30 E8 BD 21 A6 09 9F F8 F4 A7>)
(   8,<2012-02-20 21:17:38.984 -0500>,<Administrator>,<TOPSPIN>,<proc1d>,<TOPSPIN 2.1>,
      <abs ABSG = 5 
       data hash MD5: 128K
       87 F8 3E E3 DF 01 CA 45 89 A5 2A F4 F1 35 E2 1C>)
(   9,<2012-02-20 21:17:39.109 -0500>,<Administrator>,<TOPSPIN>,<audit>,<TOPSPIN 2.1>,
      <user comment:
       ICON-NMR User ID: Administrator
$$ [...]
150 150 150 150 150 150 150 150
##$TP07= 0
##$TPNAME0= <>
##$TPNAME1= <>
##$TPNAME2= <>
##$TPNAME3= <>
##$TPNAME4= <>
##$TPNAME5= <>
##$TPNAME6= <>
##$TPNAME7= <>
##$TPOAL= (0..7)
0.5 0.5 0.5 0.5 0.5 0.5 0.5 0.5
##$TPOFFS= (0..7)
0 0 0 0 0 0 0 0
##$TUNHIN= 0
##$TUNHOUT= 0
##$TUNXOUT= 0
##$USERA1= <user>
##$USERA2= <user>
##$USERA3= <user>
##$USERA4= <user>
##$USERA5= <user>
##$V9= 5
##$VALIST= <valist>
##$VCLIST= <CCCCCCCCCCCCCCC>
##$VD= 0
##$VDLIST= <DDDDDDDDDDDDDDD>
##$VPLIST= <PPPPPPPPPPPPPPP>
##$VTLIST= <TTTTTTTTTTTTTTT>
##$WBST= 1024
##$WBSW= 4
##$XGAIN= (0..3)
0 0 0 0
##$XL= 0
##$YL= 0
##$YMAX_a= 13930505
##$YMIN_a= -6419833
##$ZGOPTNS= <>
##$ZL1= 120
##$ZL2= 120
##$ZL3= 120
##$ZL4= 120
##$ABSF1= 14.98061
##$ABSF2= -5.57192
##$ABSG= 5
##$ABSL= 3
##$ALPHA= 0
##$AQORDER= 0
##$ASSFAC= 0
##$ASSFACI= 0
##$ASSFACX= 0
##$ASSWID= 0
##$AUNMP= <proc_prof1d_extract>
##$AXLEFT= 0
##$AXNAME= <>
##$AXNUC= <1H>
##$AXRIGHT= 0
##$AXTYPE= 0
##$AXUNIT= <>
##$AZFE= 0.1
##$AZFW= 0.1
##$BCFW= 0
##$BC_mod= 0
##$BYTORDP= 0
##$COROFFS= 0
##$CY= 15
##$DATMOD= 1
##$DC= 0
##$DFILT= <>
##$DTYPP= 0
##$F1P= 0
##$F2P= 0
##$FCOR= 0.5
##$FTSIZE= 131072
##$FT_mod= 6
##$GAMMA= 0
##$GB= 0
##$INTBC= 1
##$INTSCL= 1
##$ISEN= 128
##$LB= 0.3
##$LEV0= 0
##$LPBIN= 0
##$MAXI= 10000
##$MC2= 0
##$MEAN= 0
##$ME_mod= 0
##$MI= 0
##$NCOEF= 0
##$NC_proc= -3
##$NLEV= 6
##$NOISF1= 0
##$NOISF2= 0
##$NSP= 0
##$NTH_PI= 0
##$NZP= 0
##$OFFSET= 14.98061
##$PC= 1
##$PHC0= 20.7312
##$PHC1= 0
##$PH_mod= 1
##$PKNL= yes
##$PPARMOD= 0
##$PPDIAG= 0
##$PPIPTYP= 0
##$PPMPNUM= 2147483647
##$PPRESOL= 1
##$PSCAL= 4
##$PSIGN= 0
##$PYNMP= <proc.py>
##$REVERSE= no
##$SF= 400.13
##$SI= 131072
##$SIGF1= 0
##$SIGF2= 0
##$SINO= 400
##$SIOLD= 131072
##$SPECTYP= <>
##$SREGLST= <1H.CDCl3>
##$SSB= 0
##$STSI= 131072
##$STSR= 0
##$SW_p= 8223.68421052632
##$SYMM= 0
##$S_DEV= 0
##$TDeff= 65536
##$TDoff= 0
##$TI= <>
##$TILT= no
##$TM1= 0
##$TM2= 0
##$TOPLEV= 0
##$USERP1= <user>
##$USERP2= <user>
##$USERP3= <user>
##$USERP4= <user>
##$USERP5= <user>
##$WDW= 1
##$XDIM= 131072
##$YMAX_p= 510919020
##$YMIN_p= -321536753
##$CURPLOT= <Network HP LaserJet P1505>
##$CURPRIN= <$Network HP LaserJet P1505>
##$DFORMAT= <normdp>
##$LAYOUT= <+/1D_H.xwp>
##$LFORMAT= <normlp>
##$PFORMAT= <normpl>
##$SURQMSG= 1
$$ End of Bruker specific parameters
$$ ---------------------------------
##NTUPLES= NMR SPECTRUM
##VAR_NAME=  FREQUENCY,     SPECTRUM/REAL,   SPECTRUM/IMAG
##SYMBOL=    X,             R,               I
##VAR_TYPE=  INDEPENDENT,   DEPENDENT,       DEPENDENT
##VAR_FORM=  AFFN,          ASDF,            ASDF
##VAR_DIM=   131072,        131072,          131072
##UNITS=     HZ,            ARBITRARY UNITS, ARBITRARY UNITS
##FACTOR=    0.0627417313425165, 1,          1
##FIRST=     8223.62146879498, -1028,        -87357
##LAST=      0,             2355,            -88494
##MIN=       0,             -321536753,      0
##MAX=       8223.62146879498, 510919020,    0
$$ Real data points
##PAGE= N=1
##DATA TABLE= (X++(R..R)), XYDATA
$$ [...]
63961 973652 984612 994567 1004721 1016106 1028790 1042563 1057450 1073303 1089679 1106423 1123726 1141266
63949 1141266 1157911 1172772 1186110 1198740 1210846 1221786 1230921 1238463 1245852 1255436 1269174 1287082
63937 1287082 1307198 1327570 1348196 1370841 1397331 1428327 1463306 1501075 1540475 1581269 1624621
63926 1624621 1672456 1726197 1786083 1851529 1922022 1997853 2080064 2169481 2265784 2367903 2475425
63915 2475425 2589171 2710356 2839878 2978585 3127356 3286372 3455220 3634473 3826396
63906 3826396 4033110 4254888 4491679 4745801 5021517 5322069 5648880 6004075 6392214
63897 6392214 6818849 7288717 7806313 8377130 9007093 9701378 10464674 11301666 12215568
63888 12215568 13205789 14267651 15394142 16577231 17807729 19074887 20366126 21666041
63880 21666041 22954901 24208354 25398881 26497906 27477740 28313752 28986583 29483161 29795829
63871 29795829 29920482 29854962 29598328 29151394 28518800 27711596 26748395 25654011 24456511
63862 24456511 23184330 21864258 20520205 19172691 17839161 16535057 15275002 14073037
63854 14073037 12941343 11888233 10917191 10027902 9218186 8485058 7824545 7231375 6699450
63845 6699450 6222727 5795696 5413078 5069350 4758917 4477202 4221502 3990244 3781068
63836 3781068 3590018 3412984 3247574 3092952 2948148 2811326 2680856 2556218 2437434
63827 2437434 2324080 2215421 2111227 2011848 1917512 1827971 1742956 1662581 1586996 1515775 1447987
63816 1447987 1383129 1321832 1265295 1213920 1166746 1122356 1080052 1039899 1002043 966540 933701
63805 933701 903907 876931 851914 828114 805330 783612 763116 744343 727866 713488 700191
63794 700191 687301 675184 664412 654781 645749 637405 630313 624680 620357 617405 615881 615020 613412 610199
63780 610199 605691 600646 595273 588966 580705 569857 556947 543490 530545 517607 503536 488417
63768 488417 473718 460668 449349 439327 430087 420512 409164 395939 382629 371014 361021 351593
63756 351593 342702 335283 329447 323995 317900 311333 304998 299199 293968 289566 286346 284314 283052 281965
63742 281965 280560 278618 276050 272560 267828 262337 257638 255103 254544 254554 254055 252906 251224 249028 246715
63727 246715 245067 244366 244006 243348 242551 242243 242626 243127 242721 240656 237209 233699 231287 229819 228450 227227
63711 227227 227088 228133 228935 228101 225745 222905 220279 218142 216753 216073 215731 215979 217932 221873 225904 227650
63695 227650 227095 226482 227368 228991 229850 229776 229722 230272 231169 232087 233244 235175 238069 241464 244750 248110 252563
63678 252563 258628 265243 270788 275133 279921 286686 295388 305046 315053 325319 335660 345772 355748
63665 355748 366152 377362 388920 399637 408556 415939 422977 430159 436303 439836 440779 440520 439609 436890
63651 436890 431295 423563 415393 407592 399943 392568 386324 381697 377892 373322 366766 358060 347999 337826
63637 337826 328719 321454 316133 311974 307656 302442 296961 292549 289957 289185 290240 293067 296777 300144
63623 300144 303209 307238 312585 317876 322213 326971 334103 343544 353758 364191 375486 387636 399654
63610 399654 411130 422509 433571 443145 450693 456790 461572 464104 463870 461572 457732 451865 443883 434971
63596 434971 425957 416080 404754 393462 384219 376852 369556 361828 355094 350464 347494 345512 344738 345544
63582 345544 347565 349953 351873 352743 352965 354393 358889 366175 374209 381847 389845 399044 409241 420572
63568 420572 434223 450482 467476 483489 499470 517373 536814 555543 573223 592659 616673
63557 616673 645287 676634 709324 743072 778051 814554 852608 891128 928050 961979 993081
63546 993081 1021621 1046259 1064724 1075919 1080607 1080425 1077087 1072277 1067144 1061680 1055350 1048437 1041947
63533 1041947 1035944 1028837 1018888 1005844 990501 973165 953372 930988 906896 882502 859009 837189
63521 837189 817277 798822 781035 763629 747123 732102 718499 705915 694468 684859 677652 672921
63509 672921 670600 670668 672799 676300 680835 686988 695626 706787 719626 733542 749043 767350 789344
63496 789344 814954 843335 873473 904725 937082 971078 1007439 1046508 1087500 1128123 1165333
63485 1165333 1197064 1223264 1244976 1262570 1275438 1283435 1287978 1291275 1294766 1298610 1302316 1305358 1307332
63472 1307332 1307992 1307121 1304013 1297066 1284341 1264775 1238578 1206369 1168412 1125193 1078583 1031698
63460 1031698 987163 945616 906025 867214 828855 791426 755899 723496 695034 670146 647664
63449 647664 627056 608864 593228 578712 563662 548559 535901 527477 522555 518985 515325 511558
63437 511558 508514 507172 507956 510192 512668 515108 518512 523563 529418 534858 540042 546202 554000 563198
63423 563198 573700 585749 599033 612669 626346 640464 654709 667364 676743 682719 686200 687524
63411 687524 686108 681577 674635 666660 658589 650240 640813 630205 619700 610949 604413 599374 595393 592740
63397 592740 591146 589280 586299 583086 580939 579757 578759 578433 580033 583102 585290 585429 585351 587626 592599
63382 592599 598959 606336 615670 627353 640776 655888 673625 694179 716235 738825 762912 790124
63370 790124 820713 853856 889235 926970 966376 1006321 1046872 1089273 1134146 1180950 1229498
63359 1229498 1280408 1333157 1384845 1432011 1472884 1506838 1532602 1548645 1555148 1554153 1547669 1536837
63347 1536837 1523139 1509093 1496822 1486415 1476106 1463664 1447396 1426504 1401093 1371671 1338432
63336 1338432 1301366 1261167 1219553 1178381 1138751 1100974 1064850 1029884 996048 964770 938431
63325 938431 918235 903082 891162 882072 876466 874187 874058 875600 879757 887383 897844 909750 922528
63312 922528 936607 952463 970289 990534 1013931 1040679 1070061 1101266 1134329 1169903 1208241
63301 1208241 1248753 1290448 1332402 1373739 1413568 1451157 1485892 1516828 1542630 1562259 1575539
63290 1575539 1582725 1583876 1579265 1570342 1559511 1548526 1537355 1524893 1510575 1495027 1479227 1462988
63278 1462988 1444317 1420512 1390392 1355450 1318480 1281153 1243446 1205207 1167199 1130135 1093644
63267 1093644 1057255 1022016 990148 962905 939361 917463 895909 874973 855953 839957 826999
63256 826999 816115 806356 797432 789229 781208 772911 764941 758683 754890 752921 751516 749883 747964 746102
63242 746102 744673 743716 742780 741453 740044 739248 738935 737852 734877 730177 724866 720008 716353 714386 713878
63227 713878 713675 712728 711226 710060 709379 708606 707877 708359 710638 713683 716120 717929 720024 722539 724539 725444
63211 725444 725898 726943 728869 731086 732760 733325 732774 731679 730745 730259 730312 731486 734781 740510 747710 755009
63195 755009 761771 768040 773799 778971 784059 790091 797687 806492 815738 825108 834872 845368 856608 868341
63181 868341 880416 893084 907004 922914 941075 960878 981088 1000824 1020566 1041924 1066081
63170 1066081 1092563 1119925 1147437 1175495 1204428 1233772 1263004 1292203 1321350 1349617 1376134
63159 1376134 1401163 1425831 1450921 1476443 1502010 1526862 1549751 1569733 1587137 1602962 1617229
63148 1617229 1628582 1635592 1637850 1635727 1629769 1620420 1607655 1590746 1569185 1543999 1517319 1490384
63136 1490384 1462981 1435310 1409359 1387367 1369561 1354497 1341393 1331052 1324502 1321726 1322176 1325913
63124 1325913 1333694 1346104 1363051 1384066 1408687 1436195 1465158 1493934 1522071 1550802 1581467
63113 1581467 1613625 1645441 1675875 1705593 1735566 1765700 1795251 1823642 1850120 1873358 1892247
63102 1892247 1906655 1916593 1921140 1919233 1911311 1899014 1882951 1861621 1833108 1797372 1756434 1712565
63090 1712565 1666874 1619753 1572237 1526248 1483236 1443030 1404688 1368273 1334993 1305528 1279231
63079 1279231 1255377 1234322 1216624 1201745 1188603 1177060 1167948 1161786 1158253 1156825 1157074 1158309 1159631
63066 1159631 1160608 1161462 1162643 1164605 1167828 1172392 1177453 1181761 1184886 1187629 1191169 1196037 1201812 1207536
63052 1207536 1212484 1216777 1220996 1224995 1227707 1228604 1228817 1230066 1232825 1236227 1239329 1241627 1242812 1243206 1244219
63037 1244219 1247125 1251300 1254778 1256689 1258013 1259805 1261888 1263757 1265569 1267640 1269943 1272789 1277095 1283177
63023 1283177 1290045 1296712 1303608 1311917 1321937 1332887 1343997 1355154 1366776 1379621 1394486 1411611
63011 1411611 1430479 1450406 1470980 1491877 1512963 1534858 1558607 1584371 1611249 1638869 1668192
63000 1668192 1700000 1733600 1768083 1803942 1842055 1881716 1921252 1960328 2000188 2041695 2084724
62989 2084724 2129610 2177521 2228754 2282049 2336365 2392160 2449872 2508089 2564479 2618080 2669645
62978 2669645 2720011 2769275 2817719 2866640 2917661 2971389 3026868 3082286 3136209 3188191 3238140
62967 3238140 3285151 3327331 3362800 3390385 3409217 3418274 3416886 3405213 3383653 3352144 3310905 3261787
62955 3261787 3208025 3152352 3095830 3038720 2982020 2927796 2878308 2835018 2798152 2766954 2740559
62944 2740559 2718889 2702710 2692931 2690220 2695234 2708532 2729763 2757246 2788887 2823488 2860911 2901194
62932 2901194 2943803 2987539 3030812 3072328 3112023 3151175 3190973 3230974 3269488 3305312 3338086
62921 3338086 3366708 3388432 3400431 3401826 3393433 3375777 3348165 3309616 3259921 3199592 3129395 3050309
62909 3050309 2963608 2870794 2773689 2674684 2576421 2480858 2388777 2300261 2215303 2133812 2055646
62898 2055646 1981335 1912506 1850750 1795846 1745660 1698169 1653134 1611360 1572889 1536807 1502738
62887 1502738 1471467 1443560 1418112 1393661 1370007 1348244 1328917 1310936 1292648 1273523 1254342
62876 1254342 1235920 1218107 1200109 1181652 1163603 1147221 1132844 1119663 1107029 1095469 1085955
62865 1085955 1078531 1072231 1065978 1058891 1050244 1040367 1031336 1025228 1021340 1016576 1009251 1001120 994722 990098
62851 990098 985618 981023 977762 976542 976297 975857 975358 975506 976301 976934 976413 974143 970389 966207 962540 959532
62835 959532 957159 955998 956526 958063 959424 960439 961696 962894 962694 960455 957001 953362 949693 945782 941647
62820 941647 937265 932570 928118 924848 922729 920573 917795 915548 915351 917150 919392 920527 919896 917671 914636
62805 914636 911776 909489 907298 904580 901371 898333 896154 895011 894254 892708 889919 887014 885594 885707 885777
62790 885777 884617 882632 880864 879981 880535 883071 887235 891738 895917 900545 906401 912883 918830 923992 928798
62775 928798 933317 937281 940690 943705 946448 949473 953704 959258 965077 970484 976172 982664 988721 992698
62761 992698 994946 997380 1000873 1004519 1007567 1010736 1015084 1020363 1025066 1027921 1029269 1031011 1034783 1039970
62747 1039970 1044191 1046189 1047350 1049642 1053071 1056470 1059993 1065102 1072297 1080473 1088714 1097330 1106842 1117206
62733 1117206 1128503 1141344 1156056 1172312 1190074 1210157 1233336 1259416 1287603 1317407 1348911
62722 1348911 1382579 1419104 1459237 1503576 1552562 1606319 1664295 1725555 1790003 1858789 1932877
62711 1932877 2011686 2094000 2179555 2268428 2359155 2448790 2534837 2615828 2690003 2755000 2809277
62700 2809277 2852496 2883763 2900550 2900203 2881888 2846735 2796985 2735559 2665388 2588233 2504667 2415840
62688 2415840 2324505 2233467 2143504 2053846 1964592 1877931 1796766 1722426 1653798 1588712 1526342
62677 1526342 1468119 1416049 1370339 1329242 1291017 1255203 1222054 1191888 1165355 1143370 1126063
62666 1126063 1112337 1100859 1090833 1081445 1071538 1060725 1050363 1042504 1038024 1036262 1036219 1037549 1040533
62653 1040533 1045590 1052856 1062036 1072747 1085020 1099226 1115547 1134024 1155142 1179728 1208095 1239948
62641 1239948 1275305 1314737 1358328 1405255 1455113 1508991 1568503 1634138 1705201 1780903 1860688
62630 1860688 1943733 2029012 2116023 2204899 2295566 2386889 2476486 2561230 2638098 2704817 2759566
62619 2759566 2800220 2824555 2831603 2822246 2797848 2758657 2704304 2635777 2556245 2469622 2378621 2284292
62607 2284292 2187111 2088078 1988704 1890353 1794134 1701468 1614046 1532710 1456824 1385484 1319042
62596 1319042 1258647 1204447 1155180 1109549 1067007 1026955 988314 950564 914637 882157 854095
62585 854095 830354 809987 791460 773215 754566 735974 718513 703430 691772 683299 675686 666039
62573 666039 653761 640949 629557 619364 609420 600234 593166 588311 584188 579327 573387 567015 561404
62560 561404 557794 556686 557548 559421 561494 563063 563901 565133 568731 575332 583317 590812 597819 605618 614960
62545 614960 625959 638835 653396 668337 682492 696567 712452 731054 751974 774996 800481
62534 800481 828224 857208 886806 917275 948915 981706 1016072 1053211 1094191 1139049 1186752
62523 1186752 1235540 1283424 1328979 1371644 1410868 1445218 1472893 1492831 1504753 1508481 1503994 1491819
62511 1491819 1472670 1447011 1415604 1379925 1341197 1299639 1255716 1211497 1169399 1129946 1092082
62500 1092082 1055354 1020313 987098 955381 925741 899361 876032 854012 832295 811566 792494
62489 792494 774610 757451 741380 726560 712464 699165 687806 678898 671321 663862 656658 650289
62477 650289 644706 640072 637434 637245 638174 638687 638995 640169 642239 644850 649133 656906 667889 679413 689436
62462 689436 698686 709282 722193 736787 752276 768811 787194 807940 830960 856222 884493 916847
62450 916847 953318 992606 1033529 1076235 1121543 1169628 1219954 1272051 1325495 1379223 1431434
62439 1431434 1480175 1523709 1560688 1590498 1613137 1628262 1634651 1631154 1617826 1595623 1565515 1528692
62427 1528692 1487154 1442938 1396791 1348609 1299284 1251096 1205983 1164218 1125167 1088609 1054870
62416 1054870 1024187 996467 971320 948063 926075 905517 887394 872559 860889 851580 843909 837417
62404 837417 831774 826883 822980 820316 818934 818965 820800 824493 829187 833617 837250 840626 844645 849907 856752
62389 856752 865338 875336 885800 895765 904936 913559 921717 928978 934708 938470 940072 939467 936655 931619
62375 931619 924283 914556 902317 887400 870035 851530 833945 818270 803230 786813 769021 752049
62363 752049 737658 725686 715640 708201 703823 701020 697832 694540 693244 694930 698612 703307 708945
62350 708945 714958 719922 723683 728304 735617 744919 754340 763603 774065 786570 800510 814685 828035
62337 828035 839836 850125 859652 868551 875676 880352 884152 889359 895798 900758 902264 901012 898783 896529
62323 896529 894746 894302 895627 897899 900203 903048 907806 915148 925115 938431 956415 979291 1005565
62310 1005565 1033575 1063161 1095368 1130989 1169972 1212103 1257742 1307743 1362841 1423205 1488491
62299 1488491 1558243 1632209 1710198 1791612 1875107 1958683 2039996 2116616 2186219 2246796 2296751
62288 2296751 2334855 2360368 2373423 2375088 2366634 2348701 2321436 2285430 2241961 2192090 2136033 2074004
62276 2074004 2007442 1938842 1870464 1803698 1739592 1679223 1623233 1571377 1522972 1477672 1435604
62265 1435604 1396785 1360613 1326018 1292330 1260003 1230180 1203390 1179088 1156798 1137132 1120945
62254 1120945 1107968 1097219 1088535 1082548 1079048 1076564 1073924 1071192 1068624 1065883 1063008 1061081 1060870 1061476
62240 1061476 1061338 1059972 1057756 1054595 1050067 1044672 1039744 1036081 1033553 1031991 1031574 1032322 1034146 1037393 1042424
62225 1042424 1048560 1054410 1059509 1064824 1071427 1079583 1089419 1101369 1115230 1129570 1143097 1156343 1171235
62212 1171235 1189223 1210403 1234202 1260099 1287600 1316286 1346476 1379603 1417400 1460532 1508145
62201 1508145 1558954 1612682 1670211 1732397 1799179 1870000 1944512 2022188 2101389 2179445 2253766
62190 2253766 2322454 2383903 2436432 2478576 2509337 2527894 2533449 2525721 2505424 2474041 2433245 2384580
62178 2384580 2329416 2268992 2204641 2138052 2071184 2005763 1942988 1883603 1828000 1776254 1728508
62167 1728508 1685477 1648247 1617276 1591764 1570232 1551568 1535360 1521451 1509621 1499804 1492329 1487584
62155 1487584 1485349 1484637 1484410 1484402 1485123 1487177 1490868 1496371 1503640 1511859 1519507 1525590 1530703 1536538 1544520
62140 1544520 1555135 1568203 1583239 1599750 1617701 1637666 1660161 1685096 1712406 1742822 1777208
62129 1777208 1815187 1855236 1896229 1938168 1981127 2024173 2065765 2104881 2141564 2176654 2211048
62118 2211048 2244764 2276583 2304973 2329548 2351551 2373177 2396777 2424212 2456001 2491193 2528892
62107 2528892 2569846 2615590 2666155 2719843 2775286 2832134 2889161 2943394 2992261 3035333 3072572
62096 3072572 3102152 3122036 3133289 3139794 3144305 3146193 3143463 3135613 3123781 3109116 3092108 3073238
62084 3073238 3053636 3035086 3019571 3008513 3002166 2999764 3000268 3002901 3007188 3012948 3020303 3029485 3040708
62071 3040708 3054395 3071097 3090628 3111605 3132678 3154194 3177875 3204827 3234661 3266702 3301017
62060 3301017 3337738 3376214 3415728 3456619 3499874 3545646 3592820 3640136 3687338 3735152 3784325
62049 3784325 3834711 3885179 3934527 3982578 4030270 4078726 4128649 4180716 4235819 4294231 4354842
62038 4354842 4416024 4477321 4539803 4604758 4672691 4743733 4818199 4896146 4976847 5059534 5144607
62027 5144607 5233337 5326018 5420923 5515470 5608156 5698995 5788508 5877166 5965964 6056600 6150230
62016 6150230 6246097 6341810 6434860 6523574 6607037 6685105 6758825 6830140 6900543 6970203 7038721
62005 7038721 7106373 7174043 7242031 7309400 7374353 7434706 7488063 7532441 7567335 7593850 7613206
61994 7613206 7625252 7628879 7623784 7611148 7592292 7567179 7534765 7494647 7447839 7395951 7340281 7282120
61982 7282120 7223458 7166482 7112085 7059334 7006908 6954949 6905217 6859536 6818508 6781742 6748742
61971 6748742 6719067 6691892 6666095 6641183 6617942 6597864 6581788 6569060 6557909 6546542 6534007
61960 6534007 6520267 6505661 6490411 6474585 6458416 6442410 6426933 6411715 6395967 6379190 6361866
61949 6361866 6345119 6329485 6314026 6296877 6276731 6253783 6229342 6204771 6180799 6157265 6133082
61938 6133082 6106691 6077172 6044922 6010628 5973525 5931366 5882504 5827456 5767802 5704017 5635242
61927 5635242 5561163 5483326 5404355 5326401 5250516 5176836 5104733 5033217 4961925 4891938 4825225
61916 4825225 4763045 4705021 4649842 4596784 4546353 4499384 4455611 4413429 4371338 4329510 4289560
61905 4289560 4252691 4218460 4185626 4153786 4123600 4095533 4069044 4043368 4018594 3995466 3974326
61894 3974326 3954912 3937235 3921939 3909289 3898370 3888121 3879028 3872945 3871007 3872593 3876736 3883781
61882 3883781 3894861 3910339 3929780 3953088 3980488 4011339 4044233 4078756 4116063 4157013 4200551
61871 4200551 4244931 4290120 4338039 4390585 4448200 4510226 4575742 4643879 4714109 4786835 4863581
61860 4863581 4946615 5038616 5142460 5260489 5393642 5541815 5705473 5886660 6088069 6311477
61850 6311477 6557595 6827326 7122646 7446048 7799371 8183546 8599565 9049563 9536634
61841 9536634 10063476 10631365 11240405 11890101 12578542 13300247 14044143 14792490 15520184
61832 15520184 16194548 16777287 17229556 17518532 17622809 17535213 17263072 16826050 16252076
61823 16252076 15572863 14820605 14025843 13215488 12411054 11628150 10877506 10166479 9500120
61814 9500120 8881745 8313119 7794223 7323115 6896550 6511035 6163224 5849552 5566273
61805 5566273 5310188 5078951 4870385 4682170 4512726 4361967 4230307 4116922 4019494 3935604
61795 3935604 3863759 3803120 3752995 3712987 3683036 3662688 3650334 3643494 3639840 3637982 3637449 3638080 3639262
61782 3639262 3639664 3637725 3632380 3623230 3610363 3594529 3577410 3561039 3546623 3534316 3524299 3517489
61770 3517489 3514885 3516710 3522658 3532516 3545814 3561008 3575697 3587807 3596416 3601451 3602903 3600382 3593404
61757 3593404 3582298 3568847 3555629 3544429 3535566 3528836 3524547 3523342 3525837 3533250 3547901 3572146
61745 3572146 3606903 3651801 3706359 3770214 3842685 3923459 4013807 4116018 4231282 4359046 4498620
61734 4498620 4650339 4814730 4991647 5181021 5383729 5601034 5833847 6083270 6351360
61725 6351360 6640633 6953299 7291646 7658645 8057325 8489985 8959024 9468410 10023429
61716 10023429 10628964 11288793 12006514 12786236 13632073 14547788 15537374 16605108 17753696
61707 17753696 18981558 20281124 21638163 23030304 24424061 25772383 27015789 28087947
61699 28087947 28923592 29466417 29676581 29537810 29061450 28283970 27258272 26043883 24700230
61690 24700230 23282621 21838871 20407010 19015427 17684548 16428035 15253599 14164650
61682 14164650 13162059 12244296 11406756 10642776 9946262 9312981 8739278 8220415 7750609
61673 7750609 7323982 6935012 6578833 6252032 5952948 5680517 5432638 5205911 4996792
61664 4996792 4802660 4621903 4453424 4296229 4149218 4011129 3880581 3756301 3637491
61655 3637491 3524179 3417075 3316850 3223376 3135714 3052748 2973718 2898357 2826817 2759545 2696994
61644 2696994 2639381 2586715 2538750 2494549 2452387 2410739 2369626 2330467 2294305 2260461 2227287
61633 2227287 2193989 2161207 2129789 2099574 2069849 2040738 2013368 1988299 1964316 1939577 1913812
61622 1913812 1888488 1864623 1841435 1817728 1793745 1770584 1748316 1725903 1702984 1680688 1660424
61611 1660424 1642641 1626937 1612536 1598391 1583709 1568957 1555811 1545479 1537405 1529914 1521768 1512822
61599 1512822 1503779 1495879 1490405 1487784 1487175 1487328 1487702 1488554 1490293 1493236 1497666 1503533 1510153 1516706 1523093
61584 1523093 1529880 1537302 1544618 1550690 1555067 1558338 1561259 1563584 1564169 1562650 1560671 1560555 1562567 1564402
61570 1564402 1563952 1561848 1560431 1560817 1562110 1563309 1564654 1566612 1568420 1568361 1565154 1558671 1549614 1538887 1527036
61555 1527036 1513912 1499029 1482461 1465099 1447773 1430522 1413228 1396681 1382331 1370926 1362002
61544 1362002 1354789 1348869 1343628 1337817 1330459 1321890 1313236 1305108 1297659 1291667 1288357 1287755 1288304 1288827 1290038
61529 1290038 1293197 1297943 1302630 1306601 1310996 1317372 1326449 1338161 1351773 1365726 1378619 1390955 1405047
61516 1405047 1422574 1442971 1464758 1487439 1511228 1535775 1560515 1586091 1614249 1646148 1681464
61505 1681464 1719164 1758479 1799060 1840773 1883464 1926598 1969272 2010956 2051882 2092091 2130575
61494 2130575 2166315 2200016 2233583 2267585 2300161 2328954 2353365 2374503 2393596 2411071 2426593
61483 2426593 2439268 2448047 2452559 2453488 2451815 2447940 2441850 2433809 2424365 2413842 2402413 2390679 2379841
61470 2379841 2371195 2365612 2363443 2364696 2369224 2376938 2387911 2402489 2421542 2446385 2477953 2516015
61458 2516015 2559795 2609550 2666753 2732340 2805619 2885824 2974154 3073126 3184088 3306513 3439779
61447 3439779 3584481 3741645 3911879 4096132 4296358 4514235 4749420 4999883 5263754
61438 5263754 5539971 5826930 6120904 6415612 6702584 6971892 7213363 7417838 7577685
61429 7577685 7686993 7742525 7744883 7698037 7607215 7477663 7315677 7129771 6929469 6722643
61419 6722643 6514453 6308698 6109302 5920169 5744129 5582565 5435986 5304707 5189146
61410 5189146 5089758 5006785 4940115 4889509 4854905 4836206 4832549 4841911 4861668 4889676 4924975 4967810
61398 4967810 5019224 5080291 5150961 5229070 5310649 5391874 5471241 5549732 5628603 5707250 5783670
61387 5783670 5856830 5927743 5997864 6067132 6134254 6198549 6260684 6321637 6381542 6439575 6494309
61376 6494309 6544088 6587707 6625176 6657514 6685587 6709397 6728551 6742822 6751921 6755166 6751884 6742065
61364 6742065 6726339 6705486 6680097 6650425 6616315 6577628 6535104 6490710 6446952 6406026 6369603
61353 6369603 6338736 6313413 6292415 6274197 6257914 6243494 6231131 6221103 6213617 6208153 6203114 6196697
61341 6196697 6187976 6176741 6162787 6146380 6129291 6114217 6102832 6095307 6092249 6096231 6110585 6137262
61329 6137262 6176830 6230313 6299996 6388194 6495989 6623538 6771091 6939239 7128481 7339050
61319 7339050 7571033 7824083 8096768 8386392 8689341 9001128 9315801 9625625 9921732
61310 9921732 10194911 10435632 10634107 10781775 10873511 10908362 10888369 10817303 10700293 10543153
61300 10543153 10350829 10126809 9874694 9599860 9308831 9007397 8700178 8391571 8086038
61291 8086038 7787495 7499255 7224372 6964966 6721245 6492409 6278624 6080909 5898966
61282 5898966 5730764 5575048 5432879 5305775 5193667 5096045 5013780 4947816 4896613 4856990
61272 4856990 4827670 4810247 4806197 4814450 4832553 4858904 4892863 4933692 4980472 5032457 5088599 5147060
61260 5147060 5205934 5264093 5320751 5374786 5425335 5472549 5516716 5556865 5591397 5620124 5644537
61249 5644537 5665724 5683028 5695334 5702754 5706100 5705264 5699140 5686969 5668794 5644489 5613231 5574475
61237 5574475 5528957 5478248 5423556 5365375 5304035 5240011 5173659 5105287 5035817 4967135 4901285
61226 4901285 4839229 4780682 4725291 4673731 4627438 4587361 4553317 4524531 4500402 4480512 4464209
61215 4464209 4450633 4439075 4428879 4418963 4407963 4395183 4381166 4367050 4353575 4341037 4329995
61204 4329995 4321522 4316610 4315578 4318220 4324447 4334685 4349648 4369671 4394363 4423158 4456376 4495514
61192 4495514 4542370 4598241 4664110 4740896 4828629 4925663 5029690 5139635 5255523 5376049
61182 5376049 5497024 5612611 5717148 5805016 5869727 5904726 5905410 5869841 5798075 5692164 5557004
61171 5557004 5399800 5227731 5046385 4860432 4674512 4492462 4316284 4147024 3986494
61162 3986494 3837138 3700084 3574237 3457761 3350045 3251872 3164164 3087073 3020119 2962597
61152 2962597 2913586 2871770 2835624 2803987 2776478 2753290 2734549 2719982 2709220 2702130 2698679 2698710
61140 2698710 2702336 2710447 2724172 2743362 2765903 2789075 2811655 2834210 2857194 2879180 2897454 2910223
61128 2910223 2917765 2921358 2921619 2918313 2911394 2901519 2889360 2874834 2857243 2835912 2810495 2780965 2747636
61115 2747636 2711075 2671823 2630296 2587041 2542736 2497654 2451399 2403554 2354329 2304202 2253303
61104 2253303 2201809 2150725 2101370 2054015 2007848 1962480 1918578 1876649 1836209 1797053 1760555
61093 1760555 1728505 1700880 1675841 1651933 1629214 1608091 1588162 1568762 1549730 1530841 1511083
61082 1511083 1489469 1466389 1443431 1421828 1401736 1383045 1366232 1352019 1340611 1331748 1325377 1321870
61070 1321870 1321470 1323746 1327802 1333000 1339327 1347091 1356462 1367438 1380022 1394142 1409403 1425155 1440885
61057 1440885 1456400 1471632 1486502 1501073 1515710 1531037 1547724 1566083 1585568 1604838 1622769
61046 1622769 1639396 1655418 1670711 1683868 1693358 1698632 1699911 1697550 1692139 1684689 1676006 1666079 1654676
61033 1654676 1642313 1630046 1618406 1607163 1596029 1584942 1573620 1561565 1548746 1535788 1523224
61022 1523224 1510991 1498912 1487144 1475711 1463960 1451065 1437092 1423192 1410578 1399458 1389096
61011 1389096 1378899 1369245 1361066 1354624 1349097 1343672 1338711 1335399 1334342 1334971 1336257 1337460 1338252 1338784
60997 1338784 1339881 1342523 1346662 1350974 1354271 1356905 1360315 1365359 1371662 1378628 1386512 1396151 1407808 1420674
60983 1420674 1433695 1446740 1460730 1476626 1494514 1513787 1533878 1554611 1576173 1599120 1624223
60972 1624223 1651813 1681415 1712395 1744803 1779123 1815455 1853601 1893814 1936673 1982207 2029882
60961 2029882 2079484 2131266 2185113 2240499 2297515 2357047 2419566 2484584 2551742 2621633 2695123
60950 2695123 2772649 2854657 2941864 3034734 3133751 3240723 3358410 3487919 3627756 3776787
60940 3776787 3936870 4110979 4299764 4501873 4716905 4945933 5189628 5448430 5724925
60931 5724925 6023949 6349781 6705005 7092603 7517201 7983208 8493120 9048527 9651848
60922 9651848 10307198 11021620 11806412 12675700 13643205 14722123 15928074 17279274 18793822
60913 18793822 20492188 22405903 24580088 27063861 29901249 33128365 36750373 40673328
60905 40673328 44631048 48202802 50966245 52697905 53468141 53568036 53354490 53137373 53133419
60896 53133419 53422536 53881958 54173280 53859956 52612602 50359692 47284188 43699787 39916800
60887 39916800 36170861 32611886 29319633 26325215 23631867 21229552 19101263 17225647
60879 17225647 15580104 14142684 12891104 11801815 10851500 10018978 9285495 8634713 8053207
60870 8053207 7529979 7055109 6620210 6220364 5853693 5518205 5210506 4927991 4669886
60861 4669886 4434493 4217116 4012472 3817932 3632825 3456066 3286622 3125463 2974782
60852 2974782 2835353 2706107 2585890 2474049 2369769 2272650 2183844 2104864 2035010 1971310
60842 1971310 1911247 1854467 1801867 1754191 1711554 1673120 1637265 1603150 1571973 1545347 1522632
60831 1522632 1501526 1481322 1463767 1450244 1439843 1430994 1423362 1416973 1410744 1403229 1394116 1383949
60819 1383949 1373032 1361473 1349603 1337271 1323110 1305468 1283977 1259792 1234744 1210709 1189030
60808 1189030 1169673 1151233 1132477 1113620 1095727 1079525 1065486 1054397 1046766 1041856 1038269 1035507
60796 1035507 1034291 1035422 1038984 1044608 1051918 1060611 1070658 1082442 1096356 1112267 1129728 1148594
60784 1148594 1169015 1190979 1214289 1238888 1264710 1291116 1316894 1340976 1362987 1383013 1400881
60773 1400881 1415699 1426310 1432562 1436064 1439170 1443002 1446777 1449112 1449353 1447583 1444126 1439540 1434390 1428532
60759 1428532 1421162 1412013 1401783 1390866 1378508 1364028 1348078 1331664 1314591 1296012 1276112 1256162
60747 1256162 1237225 1219848 1204548 1191292 1178817 1165883 1153012 1141613 1131638 1121839 1112406 1105285
60735 1105285 1101326 1098996 1096931 1096034 1097712 1101537 1106351 1112603 1121653 1133225 1145393 1157098 1169152
60722 1169152 1182584 1197406 1213420 1231055 1250659 1271662 1293095 1314616 1336619 1359521 1383240
60711 1383240 1407139 1430385 1452467 1473424 1493472 1512571 1530522 1547284 1562836 1576931 1589251
60700 1589251 1599617 1607734 1613125 1615776 1616600 1616700 1616367 1615322 1613614 1611561 1609077 1605905 1602420 1599194
60686 1599194 1595735 1590741 1583962 1576767 1570259 1563662 1555359 1544793 1532552 1519152 1504780 1489972 1475460
60673 1475460 1461177 1446174 1429842 1412779 1396419 1382138 1370604 1361382 1353115 1344740 1336769 1330861
60661 1330861 1327905 1327014 1326701 1326423 1326471 1326768 1326581 1325445 1323799 1322480 1321893 1321861 1322065 1322366 1322719 1322970 1322978 1322915 1323220
60642 1323220 1323960 1324320 1323170 1320248 1316453 1312715 1308890 1304047 1297572 1289537 1280201 1269606 1257625 1243952
60628 1243952 1228146 1210197 1191051 1171984 1153320 1134324 1114610 1095066 1076942 1060476 1044942
60617 1044942 1029805 1015276 1001957 990471 981313 974415 968878 963754 959341 957154 958279 962072 966834
60604 966834 971514 976411 982334 989498 997311 1005001 1012296 1019484 1026888 1034404 1041755 1049163 1057379 1066799
60590 1066799 1076802 1086359 1095211 1104004 1113303 1122927 1132453 1141853 1151132 1159721 1166976 1173321 1180216 1188671
60576 1188671 1198274 1208072 1218048 1229263 1242824 1259256 1278587 1300235 1322737 1344458 1365094 1386041
60564 1386041 1408826 1433407 1458306 1481891 1502986 1520635 1534281 1544437 1552386 1558628 1561938 1560601
60552 1560601 1554610 1546036 1536993 1527664 1516816 1504041 1490733 1478653 1468141 1458235 1448173 1438200
60540 1438200 1429098 1421518 1415609 1410692 1405317 1398306 1389803 1380677 1371045 1360351 1349058 1339039 1331639
60527 1331639 1326353 1322331 1320242 1321279 1324833 1328710 1331859 1335572 1341448 1349071 1356425 1362128 1366585 1371086
60513 1371086 1376228 1381325 1385310 1388145 1391145 1395749 1402194 1409655 1417339 1424896 1432014 1438408 1444264 1449948
60499 1449948 1455038 1458319 1459149 1458397 1457526 1457021 1456211 1454496 1452235 1450277 1448996 1448233 1448221 1450098 1455178 1463966
60483 1463966 1476366 1492646 1513402 1538495 1566976 1598528 1634110 1674576 1719591 1768830 1823422
60472 1823422 1884740 1952096 2022845 2094389 2164361 2228750 2281769 2318841 2339088 2344446 2337343 2319988
60460 2319988 2295011 2265610 2235147 2206917 2183725 2166962 2156382 2151341 2152041 2159183 2172705 2191414
60448 2191414 2213784 2238779 2265860 2294334 2322960 2350753 2378626 2409663 2446959 2491394 2542426
60437 2542426 2600632 2668071 2746156 2834837 2934538 3047405 3175575 3319133 3476659 3646905
60427 3646905 3829032 4022147 4225848 4440877 4668481 4909893 5167391 5445344 5749163
60418 5749163 6083421 6451275 6854154 7289545 7747888 8211328 8654718 9047856 9359335
60409 9359335 9562196 9638629 9581259 9392732 9086280 8685435 8219431 7716088 7197757 6681796
60399 6681796 6181840 5707568 5264660 4856055 4482817 4144073 3837790 3562534 3317605
60390 3317605 3101061 2908779 2736366 2581226 2442152 2317786 2206411 2106637 2017349 1937209
60380 1937209 1864944 1799927 1741911 1690248 1643749 1601090 1561060 1522707 1485717 1450512 1417708
60369 1417708 1387535 1359888 1334615 1311459 1289910 1269449 1249938 1231732 1215402 1201309 1189273
60358 1189273 1178763 1169507 1161618 1154876 1148353 1141327 1134278 1128233 1123376 1119139 1115593 1113725 1114114 1116139
60344 1116139 1118795 1121519 1123878 1125303 1125760 1126172 1127605 1130317 1133875 1137742 1141425 1144562 1147320 1150431
60330 1150431 1154562 1159942 1166665 1174653 1183083 1190549 1196348 1201082 1205452 1209019 1210782 1210610 1209362 1207719
60316 1207719 1205492 1202061 1197095 1190905 1184350 1178390 1173575 1170154 1168544 1169065 1170925 1172238 1171784 1170408
60302 1170408 1169972 1171094 1172700 1173743 1174596 1176407 1179606 1183592 1187738 1192246 1197672 1203944 1210384 1216814
60288 1216814 1223999 1232422 1241107 1248578 1254827 1261419 1269526 1278823 1288434 1297822 1306236 1312525 1316544 1319900
60274 1319900 1324181 1328999 1332959 1336029 1339523 1343912 1348170 1351592 1354877 1358746 1362656 1365890 1369210 1374279
60260 1374279 1381532 1389417 1395755 1399357 1400454 1400182 1399723 1399237 1397328 1392059 1382987 1372010 1361894 1354148
60246 1354148 1348556 1344320 1340872 1337667 1334135 1330364 1327273 1325601 1325042 1324798 1324561 1324527 1324907 1326139 1329087
60231 1329087 1333958 1339102 1341998 1341764 1340073 1339375 1340903 1344465 1349206 1354131 1358751 1363821 1370927 1380800
60217 1380800 1392521 1404742 1417049 1429698 1442820 1456604 1471611 1488035 1505093 1521986 1539051
60206 1539051 1557067 1575759 1594147 1612454 1632697 1656952 1685535 1717132 1750408 1785401 1823564
60195 1823564 1866373 1913700 1963897 2015813 2070297 2129202 2193488 2263233 2339095 2422468 2513984
60184 2513984 2612858 2718084 2829503 2947440 3072124 3203878 3343010 3488925 3639874 3794103
60174 3794103 3950684 4108604 4265628 4418859 4566094 4705863 4836358 4955142 5060006
60165 5060006 5149541 5222872 5279486 5319547 5343973 5354020 5351060 5336808 5313379 5283013 5248120
60154 5248120 5211684 5177072 5147058 5123221 5106520 5098126 5099448 5111669 5135731 5172712 5223884 5290340
60142 5290340 5372613 5470413 5582537 5707283 5843094 5988307 6139988 6293731 6445434 6592801
60132 6592801 6734008 6865200 6980830 7076814 7152098 7206600 7239083 7248205 7234631 7200607 7147972
60121 7147972 7078012 6993129 6897326 6794956 6689999 6586614 6489188 6401376 6325799 6264800 6220593
60110 6220593 6194372 6186048 6195217 6221780 6265422 6325221 6400047 6488572 6588426 6695845 6806411
60099 6806411 6915691 7019294 7113349 7195496 7264793 7320496 7361731 7388505 7401920 7403018 7392689
60088 7392689 7373537 7350690 7329550 7313439 7304362 7305172 7319467 7349843 7397815 7465567 7556421 7673152
60076 7673152 7816721 7987009 8184185 8409072 8662799 8946499 9261061 9606832 9983511
60067 9983511 10390061 10824382 11283157 11762200 12256612 12760242 13265344 13763370 14246088
60058 14246088 14705683 15134293 15524237 15868730 16161892 16398184 16572505 16680967 16721337
60049 16721337 16692826 16595914 16432382 16205334 15919549 15582437 15204495 14798020 14374889 13945468
60039 13945468 13519241 13105616 12713535 12350310 12020870 11728107 11473866 11259688 11086783
60030 11086783 10955843 10867197 10820656 10814314 10843623 10902552 10985802 11088878 11205769 11327779
60020 11327779 11445425 11550733 11637283 11699396 11732799 11735734 11708460 11652051 11568444 11460849 11332741
60009 11332741 11186392 11023041 10844032 10650956 10445338 10229460 10007177 9782702 9558704
60000 9558704 9336707 9119208 8910188 8713435 8531454 8366115 8219315 8092732 7987744
59991 7987744 7905750 7847822 7813982 7803491 7815716 7849970 7904762 7978310 8069654 8178123 8301548
59980 8301548 8436058 8577629 8722511 8865799 9000806 9120711 9220377 9296435 9346537 9369103
59970 9369103 9363262 9328774 9266323 9177786 9065533 8931662 8778838 8611719 8436390 8258200
59960 8258200 8081028 7908512 7744585 7592543 7454798 7333942 7232806 7152940 7094115 7055819
59950 7055819 7038246 7041522 7065309 7109896 7176451 7265357 7375351 7505145 7654903 7825041 8014172
59939 8014172 8218882 8434457 8654898 8873208 9083057 9279998 9460298 9619283 9751905
59930 9751905 9854597 9925670 9964255 9969769 9942310 9882910 9793611 9677743 9539723 9384136 9215425
59919 9215425 9038799 8860482 8686285 8520701 8368136 8233900 8122338 8034348 7968237 7923095
59909 7923095 7900202 7901105 7925686 7972685 8041078 8130095 8238314 8363437 8502841 8653878 8813313
59898 8813313 8976689 9138716 9294832 9442511 9580881 9709262 9826647 9932411 10026669 10109781
59888 10109781 10182541 10247461 10308954 10371331 10437087 10508004 10587646 10681870 10796896 10937384 11106309
59877 11106309 11306024 11539108 11808106 12114466 12458000 12837742 13252835 13701440 14178484
59868 14178484 14675281 15181309 15684964 16171939 16624317 17022740 17349480 17589555 17730948
59859 17730948 17766069 17693492 17517939 17249124 16900757 16488958 16029639 15537356 15026991 14514777
59849 14514777 14015419 13538428 13088792 12670881 12289922 11949982 11652808 11399359 11190870
59840 11190870 11027511 10907325 10827634 10786892 10784448 10818998 10887829 10987205 11113031 11261290
59830 11261290 11427748 11606605 11789260 11964906 12122450 12251513 12342079 12384758 12372422 12301504
59820 12301504 12171583 11984287 11743052 11453627 11124228 10764689 10384857 9993303 9597538
59811 9597538 9205239 8824227 8460418 8116305 7792247 7488878 7207533 6949070 6713640
59802 6713640 6501449 6312447 6145248 5997502 5867427 5753986 5655655 5570326 5496456 5432829
59792 5432829 5376806 5324240 5271897 5219081 5166618 5115488 5066957 5022566 4982811 4946693 4913403
59781 4913403 4883586 4858031 4835886 4814926 4792615 4765997 4731851 4688762 4638707 4585208 4530054
59770 4530054 4472995 4414251 4355683 4299372 4246564 4198519 4157122 4123827 4098844 4082183 4074885
59759 4074885 4078354 4092709 4116475 4147727 4184982 4227124 4273274 4323161 4377478 4437628 4505073
59748 4505073 4580696 4664301 4754298 4847788 4941206 5031196 5115273 5192037 5260978 5322010 5375031
59737 5375031 5420001 5457465 5488826 5515827 5540013 5563194 5588346 5619175 5658222 5705894 5762001
59726 5762001 5827977 5906945 6001787 6113979 6244324 6393950 6564149 6755907 6970364 7209544
59716 7209544 7476143 7772566 8100540 8461459 8856158 9283223 9736714 10205026 10671169
59707 10671169 11113254 11504758 11816659 12023374 12110473 12078921 11942968 11724282 11446719 11133177
59697 11133177 10803676 10474426 10158122 9864485 9600017 9368027 9170240 9008509 8884362
59688 8884362 8797300 8744880 8724800 8735888 8776931 8845861 8941067 9062819 9212528 9390844 9597005
59677 9597005 9829782 10088632 10374264 10688558 11033863 11412155 11824903 12273598 12759767
59668 12759767 13284318 13847569 14450381 15094928 15784002 16519899 17304052 18136878 19016972
59659 19016972 19940229 20899878 21886972 22890660 23898661 24898444 25878407 26828331 27740047
59650 27740047 28609315 29437761 30232605 31003930 31761747 32514932 33271597 34038748 34820104
59641 34820104 35613515 36410514 37198354 37961980 38683987 39344361 39922813 40402818 40773597
59632 40773597 41029252 41168315 41195643 41123895 40971708 40760178 40511017 40246467 39988591 39757475
59622 39757475 39570069 39440339 39379729 39397582 39502082 39701102 40001658 40408332 40922700 41544319
59612 41544319 42271531 43100563 44023519 45026659 46089564 47184949 48278666 49329474
59604 49329474 50288997 51103567 51719289 52088951 52177706 51966017 51451066 50647679 49587649
59595 49587649 48315888 46884123 45344706 43746506 42132923 40541026 39000867 37534541
59587 37534541 36155224 34866739 33663863 32532914 31452585 30396031 29335428 28248260
59579 28248260 27122486 25958034 24764723 23558805 22359741 21187165 20057859 18983751
59571 18983751 17971870 17025594 16145719 15331025 14579120 13887503 13253806 12675137 12147790
59562 12147790 11667890 11231860 10835975 10476013 10148051 9849348 9577802 9330797 9105468
59553 9105468 8900077 8714081 8546217 8393218 8250991 8116414 7987128 7860152 7732028
59544 7732028 7600511 7465151 7325976 7182627 7035310 6885669 6735878 6587454 6441621
59535 6441621 6300090 6164454 6035260 5912856 5798915 5695828 5604511 5523950 5453155 5392493
59525 5392493 5342769 5304094 5276233 5259162 5252588 5255620 5267395 5287275 5313970 5345388 5380132 5418451
59513 5418451 5461076 5507875 5558287 5612143 5669239 5729054 5792046 5860313 5935635 6017532 6104784
59502 6104784 6198389 6301464 6416352 6543430 6682731 6835152 7001777 7183465 7381488 7597277
59492 7597277 7831054 8081873 8349622 8636001 8942937 9270814 9618604 9984627 10366359
59483 10366359 10760069 11161301 11565446 11967760 12363531 12748609 13119248 13471492 13801541
59474 13801541 14106772 14385182 14633567 14847539 15024280 15164691 15272479 15352107 15408218 15445931
59464 15445931 15470532 15487201 15501673 15520506 15550057 15595610 15661760 15752438 15869293 16010167 16169580
59453 16169580 16339851 16510840 16669459 16801059 16891925 16930464 16907027 16813991 16646387 16402130
59443 16402130 16082184 15691371 15238863 14736966 14199116 13638986 13070438 12506645 11958544
59434 11958544 11434341 10940175 10480318 10056624 9668915 9316932 9001869 8725446 8487477
59425 8487477 8284776 8112804 7968354 7850652 7760255 7697542 7662251 7653509 7669635 7708547 7769311
59414 7769311 7852926 7960624 8091662 8243984 8417000 8612292 8831079 9071928 9331255 9604888
59404 9604888 9888378 10176674 10464291 10745248 11012312 11256807 11469510 11641182 11762403
59395 11762403 11824673 11822919 11756582 11627967 11440636 11199939 10913607 10590424 10238897 9867909
59385 9867909 9487211 9105459 8728123 8358509 8000293 7657750 7333916 7029834 6745381
59376 6745381 6479860 6232374 6003065 5793690 5605553 5437009 5284394 5145414 5020276
59367 5020276 4909528 4812401 4727706 4654859 4593206 4541368 4498220 4463974 4439575 4425270 4420180
59356 4420180 4422972 4432719 4449328 4473337 4505186 4544829 4592162 4647199 4708875 4773781 4837054 4895160
59344 4895160 4947836 4997790 5049140 5106041 5171775 5248619 5338516 5443439 5564333 5699595 5845207
59333 5845207 5996881 6152430 6312902 6482158 6665156 6865804 7086232 7328049 7593711
59324 7593711 7886064 8207177 8558629 8942755 9362724 9821315 10320318 10861068 11444790
59315 11444790 12072171 12742844 13454910 14204104 14983181 15782285 16589604 17391385 18172389
59306 18172389 18918039 19616968 20261676 20847487 21371836 21834282 22236320 22580996 22872680
59297 22872680 23115958 23313191 23463116 23562511 23608499 23598232 23527363 23391159 23187510 22917612
59287 22917612 22583985 22189816 21740793 21245690 20713881 20152800 19567961 18963914 18344399
59278 18344399 17712759 17073267 16431436 15792635 15161538 14543553 13945605 13374236 12833458
59269 12833458 12325119 11850470 11410398 11004920 10633761 10297217 9995495 9727402 9490624
59260 9490624 9283282 9104406 8952863 8826467 8722512 8638919 8574738 8529531 8502170 8490354
59250 8490354 8491685 8505075 8530243 8565445 8606421 8648164 8687268 8721933 8750327 8770075 8779383 8777707
59238 8777707 8764906 8740374 8703615 8655483 8598229 8534268 8465538 8394518 8325349 8262898 8210464
59227 8210464 8169192 8139921 8124476 8124326 8139101 8168027 8212545 8275918 8360070 8464163 8586650
59216 8586650 8727280 8886083 9061228 9249060 9446143 9650551 9861096 10075483 10289024
59207 10289024 10494984 10686412 10857837 11005178 11124459 11211364 11262230 11275203 11250834 11192489
59197 11192489 11106197 10998989 10876645 10743144 10601907 10456384 10308930 10159925 10008660
59188 10008660 9854777 9698774 9541899 9385987 9232707 9082512 8935025 8791083 8653882
59179 8653882 8527417 8414109 8314452 8228669 8158106 8105215 8072770 8063167 8078114 8118760 8186120
59168 8186120 8281357 8405856 8561146 8748580 8968822 9221947 9508453 9829723 10186646 10577645
59158 10577645 10998524 11443724 11906429 12377013 12842225 13286382 13693058 14045885 14329121
59149 14329121 14528840 14634186 14638073 14537786 14335508 14038163 13656623 13204983 12699650 12157577
59139 12157577 11594476 11024433 10460220 9912617 9389258 8894906 8432733 8004646 7610930
59130 7610930 7251157 6925496 6633772 6373253 6139141 5927875 5738612 5571004 5423142
59121 5423142 5292628 5178235 5079328 4994685 4923083 4864182 4817698 4782255 4756043 4738083 4728128
59110 4728128 4725997 4731799 4746051 4768638 4798180 4833315 4874091 4921358 4975389 5035880 5102709 5175759
59098 5175759 5254525 5338777 5429173 5526209 5628778 5734569 5841713 5949349 6056692 6162185
59088 6162185 6263529 6358230 6444223 6520091 6584419 6635124 6670240 6689476 6694102 6685161 6662958
59077 6662958 6628760 6585753 6537573 6486759 6435188 6384904 6337779 6295438 6260181 6234650 6219715
59066 6219715 6214108 6217398 6232050 6261218 6305837 6365503 6440938 6533374 6642294 6766144 6905260
59055 6905260 7062000 7237668 7430737 7638414 7858778 8091434 8337311 8597852 8873237
59046 8873237 9161331 9459258 9765504 10079072 10396870 10713375 11022485 11317711 11590424
59037 11590424 11830016 12026765 12173359 12263229 12289288 12245904 12131615 11949301 11704617 11405226
59027 11405226 11060670 10681435 10277389 9857038 9427803 8996532 8569682 8153014 7750921
59018 7750921 7366011 6999578 6652434 6325237 6018349 5731802 5465172 5217270 4986352
59009 4986352 4771148 4571376 4386813 4216341 4058383 3911720 3775332 3648059 3529162
59000 3529162 3418641 3316229 3220709 3131039 3047386 2970094 2898419 2831470 2769534 2712944 2660285
58989 2660285 2609359 2559534 2511526 2465420 2420913 2379245 2342547 2310885 2281930 2254089 2228173
58978 2228173 2205510 2186390 2171143 2160746 2155141 2152511 2151491 2152790 2157464 2164920 2173965 2184647 2197560
58965 2197560 2212231 2227692 2243878 2260997 2278071 2293563 2307062 2318965 2328865 2335808 2340112 2343503
58953 2343503 2347144 2350721 2353781 2356901 2361018 2366431 2373069 2381136 2390888 2402114 2414356 2427323 2440602
58940 2440602 2453062 2463173 2470146 2474411 2476735 2477055 2474605 2469162 2461652 2453382 2445178 2437682 2432005 2429231
58926 2429231 2429359 2431395 2434617 2439243 2445848 2454693 2465829 2479300 2495000 2512700 2532340 2553822 2576471
58913 2576471 2599365 2622595 2647613 2675801 2707002 2740052 2774608 2811867 2853324 2899054 2947375
58902 2947375 2996111 3044219 3092316 3141860 3193926 3248608 3305295 3363473 3423480 3486563 3553907
58891 3553907 3625587 3700857 3779569 3862809 3951966 4047755 4150507 4260678 4378411 4503094
58881 4503094 4634153 4772142 4918508 5074569 5241093 5418427 5606526 5805425 6016443
58872 6016443 6242287 6485057 6744602 7019783 7310900 7619819 7948333 8297896 8670756
58863 8670756 9069705 9496446 9951604 10436715 10955002 11509687 12102563 12734516 13406255
58854 13406255 14117882 14868669 15657801 16484437 17346496 18239885 19158740 20094719 21035056
58845 21035056 21962224 22856273 23696715 24461710 25127250 25669335 26067444 26306079 26375001
58836 26375001 26270710 25998304 25570671 25005298 24322120 23543463 22693501 21795726 20870624
58827 20870624 19935658 19006342 18096047 17214786 16369112 15563516 14801460 14084921 13413805
58818 13413805 12786745 12202379 11659298 11155076 10686401 10250511 9845706 9469991 9119952
58809 9119952 8791782 8483116 8193419 7923015 7672256 7441133 7228743 7033175 6852392
58800 6852392 6685113 6530580 6388002 6256875 6137504 6030513 5935999 5853457 5782073 5720709
58790 5720709 5668355 5625322 5593309 5573526 5565521 5568662 5583632 5611062 5649561 5697034 5753625 5821612
58778 5821612 5902386 5995180 6098923 6213837 6340940 6481281 6635852 6805023 6987990 7184118
58768 7184118 7394854 7622953 7869828 8135238 8419547 8724378 9050703 9398283 9767705
58759 9767705 10161177 10580619 11026959 11502476 12011901 12559516 13146320 13771399 14434853
58750 14434853 15137809 15880425 16661395 17478522 18327846 19202029 20090291 20979313 21853059
58741 21853059 22692182 23474862 24178269 24778902 25252919 25578785 25741197 25733097 25554939 25213389
58731 25213389 24720816 24094872 23357113 22530844 21639053 20703426 19744472 18781310 17829954
58722 17829954 16901681 16003992 15143243 14325362 13553960 12829285 12149940 11514782 10922657
58713 10922657 10371417 9858165 9379775 8932585 8512574 8116918 7744801 7395849 7068304
58704 7068304 6759522 6467833 6193146 5935958 5696249 5472903 5263760 5066731 4881381
58695 4881381 4709090 4551308 4407967 4277536 4157850 4046743 3942838 3846146 3757216 3675577
58685 3675577 3599957 3530107 3467111 3411526 3362380 3318348 3278430 3241007 3204001 3166974 3131534
58674 3131534 3098420 3065616 3030809 2994391 2958367 2923289 2888128 2852461 2816784 2780869 2743607
58663 2743607 2704720 2665161 2625390 2584303 2540315 2493026 2443617 2393960 2345289 2297497 2249817
58652 2249817 2202177 2155330 2109686 2064987 2021507 1980527 1942819 1907492 1873044 1838857 1805040
58641 1805040 1771748 1739524 1709448 1681899 1655675 1629193 1602167 1575495 1550122 1526589 1504965
58630 1504965 1484566 1464552 1445434 1428989 1415915 1404593 1393163 1381952 1372866 1367217 1365158 1366386
58618 1366386 1370156 1375154 1380445 1386090 1392014 1397004 1399744 1400261 1399515 1398172 1396526 1394864 1393177 1391269
58604 1391269 1389773 1389991 1392023 1394296 1395754 1397138 1399053 1400311 1399620 1397543 1395198 1392341 1388626 1385648
58590 1385648 1385737 1389329 1395289 1403243 1413849 1427283 1443073 1461011 1480981 1502674 1526806 1555497
58578 1555497 1589653 1626987 1664663 1703088 1744940 1791302 1841185 1894428 1952440 2015976 2084429
58567 2084429 2157570 2235943 2319460 2407693 2501838 2604356 2716252 2836668 2965739 3105977
58557 3105977 3259918 3427845 3608682 3801995 4008314 4228294 4462100 4708986 4967108
58548 4967108 5233951 5506337 5779169 6044737 6294377 6520276 6714549 6867686 6970286
58539 6970286 7016691 7005845 6939380 6821092 6658218 6460831 6238890 6000632 5753339 5503412
58529 5503412 5255090 5010776 4773367 4546986 4334892 4137875 3955233 3786353 3631077
58520 3631077 3489731 3363255 3252257 3155520 3070277 2994211 2926476 2866703 2813955 2766826 2723828
58509 2723828 2683581 2645192 2608352 2572704 2537768 2504030 2473099 2445751 2420650 2395942 2370823
58498 2370823 2344244 2313561 2276644 2234359 2188970 2141084 2090484 2038994 1989650 1943384 1899215
58487 1899215 1857470 1819913 1786591 1755480 1725764 1698806 1675228 1653720 1633605 1616003 1601207
58476 1601207 1587193 1572214 1557040 1543145 1530157 1516487 1501357 1485041 1467935 1450179 1431513
58465 1431513 1411162 1388768 1365595 1343729 1324014 1305852 1288698 1272265 1255497 1237309 1218470
58454 1218470 1200972 1185333 1170347 1155554 1142014 1130387 1120295 1111973 1106473 1103584 1101402 1098683
58442 1098683 1096083 1094613 1094417 1095349 1097125 1098792 1099806 1101671 1106596 1114492 1123245 1131732 1140153 1147681
58428 1147681 1152875 1156746 1162266 1169995 1177169 1182156 1186780 1192938 1199828 1206106 1212040 1217631 1221152 1221627
58414 1221627 1220865 1221072 1222179 1223089 1223646 1223684 1221959 1217840 1212388 1206161 1197633 1185487 1170941 1156166 1141875
58399 1141875 1127980 1115005 1103175 1091569 1079751 1068963 1060351 1053420 1047533 1043304 1041050 1039493
58387 1039493 1037594 1036186 1036166 1036558 1036078 1035394 1036214 1039143 1043812 1049989 1057354 1065245 1073690 1083439 1094205
58372 1094205 1104485 1113978 1124106 1134974 1143979 1149067 1151397 1153050 1154027 1153565 1152639 1152875 1154286 1156189
58358 1156189 1159232 1164385 1170848 1176979 1182745 1189584 1198335 1208561 1219373 1229950 1239956 1250127 1261448
58345 1261448 1273238 1283482 1291566 1298847 1305702 1310059 1310078 1306385 1300435 1292530 1282767 1271981 1260298
58332 1260298 1246590 1230830 1215135 1201050 1187556 1173093 1157520 1140796 1122125 1102281 1084696
58321 1084696 1072399 1065796 1065099 1072385 1088740 1111260 1135387 1158842 1181368 1202463 1221761 1240264
58309 1240264 1258961 1277255 1294371 1310872 1327225 1342597 1356694 1371023 1386566 1401952 1415677
58298 1415677 1428399 1441415 1454734 1468155 1482143 1496080 1507994 1517776 1528296 1541446 1555439
58287 1555439 1567730 1577988 1586444 1592486 1597249 1604435 1615763 1628426 1639678 1650839 1663722 1676435
58275 1676435 1686536 1695660 1707043 1720637 1734536 1749189 1766308 1785220 1803976 1822654 1842321
58264 1842321 1862335 1881886 1902498 1925792 1950499 1974653 1998715 2023567 2047791 2070404 2093853
58253 2093853 2120555 2148681 2175210 2200955 2228516 2257295 2284779 2311010 2337627 2364092 2389034
58242 2389034 2413812 2440691 2468847 2496040 2522909 2551843 2583143 2615880 2650881 2689151 2729208
58231 2729208 2769695 2812651 2860420 2911483 2963365 3017379 3076204 3138918 3202880 3268422 3337138
58220 3337138 3407542 3477067 3546680 3619296 3695540 3775048 3859364 3949131 4041134 4132877 4227404
58209 4227404 4328807 4435931 4545627 4659030 4778982 4904205 5032042 5164302 5304535
58200 5304535 5452260 5605772 5767777 5942124 6127947 6323271 6531116 6755196 6992722
58191 6992722 7238533 7493351 7760923 8040243 8328167 8626634 8939776 9267082 9607116
58182 9607116 9964420 10344643 10746658 11168021 11614153 12092925 12604417 13145993 13723313
58173 13723313 14345512 15013090 15721673 16474329 17278881 18136853 19047304 20018704 21065048
58164 21065048 22193206 23405439 24709398 26111957 27607685 29188420 30861257 32643211
58156 32643211 34542704 36561316 38708307 40996675 43431170 46020164 48795841 51804145
58148 51804145 55080166 58653282 62569233 66883381 71638768 76877057 82666115 89091656
58140 89091656 96231906 104173410 113044346 122996893 134162963 146660247 160625548 176206035
58132 176206035 193568337 213026305 235181669 260861166 290864951 325697105 365170290
58125 365170290 407623467 449119702 483727736 505473933 510919020 500460782 477541324
58118 477541324 446709844 412024964 376409937 341670120 308760446 278120736 249961020
58111 249961020 224391927 201434375 181026236 163051510 147345575 133692074 121859092
58104 121859092 111644544 102873396 95372472 88979229 83563792 79016607 75226764 72096014
58096 72096014 69561467 67587123 66157134 65303045 65111215 65665663 66991089 69052986
58088 69052986 71733328 74706759 77352322 78908074 78820354 76987053 73704688 69438636
58080 69438636 64636847 59655384 54740366 50035120 45615852 41530487 37808674 34455816
58072 34455816 31458889 28797739 26445127 24365743 22526431 20903425 19474289 18210323
58064 18210323 17083075 16071272 15155938 14316465 13537421 12812325 12135329 11495797 10885975
58055 10885975 10307172 9763229 9253641 8776967 8334223 7924047 7540215 7178210 6839006
58046 6839006 6522968 6225569 5942372 5672509 5414194 5163016 4918346 4685792 4469502
58037 4469502 4267101 4075277 3894861 3726965 3569347 3420309 3281530 3153758 3034019
58028 3034019 2919973 2812650 2712334 2616363 2523589 2436421 2355851 2279078 2204534 2134501 2070119
58017 2070119 2008609 1948214 1891090 1838324 1786787 1734255 1683298 1636749 1593337 1551064 1511089
58006 1511089 1474894 1441059 1408050 1377074 1349399 1323959 1300052 1279007 1260623 1241464 1219418
57995 1219418 1196683 1175632 1155069 1133287 1111469 1091155 1071408 1051326 1032412 1015688 999308
57984 999308 981923 965689 953154 943625 935235 928156 923186 919529 916430 914735 914575 913987 912066 910936
57970 910936 912265 914457 915697 917050 919806 922302 922425 921216 921008 921726 921736 920736 919183 916468 912297
57955 912297 908536 907121 907194 906522 904723 903132 902414 902078 901393 899385 895084 889040 883314 878941 874959 870888
57939 870888 868162 867864 869117 871101 874531 879642 884961 889925 896637 907140 920800 936012 952212
57926 952212 968039 979743 984187 982153 976459 968148 956793 943327 930177 919131 910653 904364 898778
57913 898778 891851 883406 875923 871390 868620 865143 860258 854557 847908 840084 832401 826592 822512 818570
57899 818570 813980 809267 804961 800885 796352 790498 783154 775720 769933 765425 759953 752523 744484 736971
57885 736971 729354 721126 713138 705770 698112 690406 685186 684184 685896 687969 690241 693684 697946 701857
57871 701857 704912 706497 705074 699920 692492 684418 675342 664159 650986 636493 620899 605170 591585
57858 591585 581274 572648 563864 555364 548345 542543 537500 534402 534438 536695 539802 544356 551607 560915
57844 560915 570682 580716 591568 602533 612338 620846 628242 633773 637353 641218 647595 655564 662322
57831 662322 666729 669581 671389 672126 672349 672352 670853 666611 660631 654721 648720 641321 632760 624309 615869
57816 615869 606611 597438 590160 584531 578682 572489 568023 566508 567150 569197 572840 577616 582006 585469
57802 585469 589340 595028 602408 610132 616467 620051 621242 622662 626874 633473 639731 643853 646170 647334
57788 647334 647154 645494 642883 639913 637037 634830 633333 631254 627020 620536 612973 605275 597969 591786
57774 591786 586895 581876 575058 566689 558382 550707 542862 534573 526668 519636 512888 505524 496858 486603
57760 486603 475678 466303 459745 454249 446708 436175 424333 412882 402076 391658 381479 371125
57748 371125 360363 350077 341566 335044 330007 326676 325575 325945 326130 325518 324824 324746 325701 328494 333666
57733 333666 340476 347994 356770 367750 380093 391956 402991 413834 423462 429672 432542 435068 439634
57720 439634 445795 452060 457904 463216 467494 470405 471695 470183 464569 455877 447326 441009 436170 431366
57706 431366 426549 422177 418008 413886 410226 406710 401995 395937 390783 388789 389746 392086 395347 400059
57692 400059 405943 411827 417131 422177 427153 431741 435837 439954 444857 451169 459179 468522 478060 486433
57678 486433 492917 497926 502768 508675 515810 523391 530940 538895 547586 556352 564424 572071 579980 588180
57664 588180 596645 606315 618121 631399 644736 658100 672677 688801 705684 723181 742128 762782
57652 762782 784518 807364 832224 859114 886680 914089 942175 972294 1005128 1040963 1079879
57641 1079879 1121410 1165262 1212491 1264486 1320607 1378650 1438123 1501122 1569205 1641388 1716501
57630 1716501 1795888 1882188 1976608 2078881 2189021 2307793 2436131 2575352 2727357 2893585
57620 2893585 3074261 3269513 3480433 3707971 3951242 4207632 4473839 4745726 5017681
57611 5017681 5283094 5535073 5766010 5967351 6131494 6254245 6334639 6372050 6363617 6304272
57601 6304272 6189306 6018051 5796551 5537169 5255239 4965347 4679226 4404970 4147001
57592 4147001 3907272 3687224 3488451 3311531 3155230 3017509 2896646 2790927 2698254 2617166
57582 2617166 2547811 2490975 2446277 2412016 2386637 2369554 2360499 2358702 2363185 2373703 2391023 2415990
57570 2415990 2448487 2487812 2534251 2589381 2654190 2727675 2808398 2897052 2996142 3107321 3230423
57559 3230423 3365140 3512031 3671183 3841072 4019429 4204192 4392757 4580782 4762209
57550 4762209 4929889 5075831 5191672 5269749 5304024 5290906 5230572 5127651 4989311 4822160
57540 4822160 4631673 4424181 4207384 3987976 3770067 3556773 3351993 3159200 2979139
57531 2979139 2809924 2649309 2496565 2352871 2220553 2101408 1995097 1899337 1811611 1730109
57521 1730109 1653403 1580753 1513143 1452548 1399365 1351713 1307840 1267883 1232361 1200366 1170523
57510 1170523 1142662 1117139 1093377 1070538 1049091 1030319 1014543 1000973 989078 979026 970923
57499 970923 964649 960458 958976 960430 964309 969729 975998 983232 992712 1006020 1023413 1043529 1065019
57486 1065019 1087842 1112536 1138970 1166488 1194859 1224646 1257016 1293309 1334176 1379075 1427410
57475 1427410 1480026 1538293 1601650 1667850 1736243 1809042 1888347 1973776 2064543 2162249 2269417
57464 2269417 2386036 2509562 2637995 2771179 2909163 3050820 3194037 3335700 3470966
57455 3470966 3593470 3696672 3774907 3823737 3840335 3823707 3774437 3694920 3590256 3467654
57445 3467654 3333438 3190905 3042077 2890862 2742990 2602851 2471531 2348113 2232070
57436 2232070 2124306 2026508 1939606 1862691 1793734 1731636 1676966 1630404 1591406 1558947 1532540
57425 1532540 1511683 1495389 1483282 1476106 1473955 1475111 1478142 1484294 1496075 1514152 1537349 1565112
57413 1565112 1597980 1635849 1677780 1723794 1775300 1833612 1899500 1974122 2058504 2151670 2251034
57402 2251034 2355365 2465972 2584241 2709152 2837724 2966415 3090997 3206096 3306148
57393 3306148 3386603 3443632 3473284 3471842 3437116 3369355 3271461 3148696 3007711 2855047 2696053
57382 2696053 2534603 2373338 2214328 2060022 1913361 1776427 1649271 1530826 1420735
57373 1420735 1319503 1227130 1142724 1065516 995216 931155 872106 817362 767193 721798 680511
57362 680511 642380 606851 573482 541761 511705 484012 458924 435333 411699 387692 364415
57351 364415 343097 323986 306430 289611 273047 256712 240933 226137 212473 199613 187046
57340 187046 174660 162901 152244 142751 134352 127141 120948 114962 108451 101665 95304 89388 83553
57327 83553 78213 74116 70770 66752 61940 57969 55825 54462 52648 50789 49802 49369 48593 47345 45601
57312 45601 42406 37021 30566 25083 21317 18561 16092 13534 10297 6062 1546 -2292 -5476 -8418
57298 -8418 -10724 -11828 -12349 -13556 -15754 -18297 -20701 -22548 -22882 -21057 -17843 -14535 -11476 -8654 -6844
57283 -6844 -6525 -6301 -4348 -1195 737 239 -1774 -4247 -6996 -9679 -11530 -12403 -12740 -12488 -11496 -10647 -10776
57266 -10776 -10638 -8067 -3290 1130 4057 7333 12804 19772 26384 31751 35630 37659 38337 39719 43858
57251 43858 51047 60069 69332 77494 84168 90631 98796 109103 120433 132190 144963 158900 173229
57238 173229 188089 205010 224507 244762 263946 282586 302410 323997 346952 371430 398037
57227 398037 426737 457020 488820 522501 558391 596906 638345 681784 724998 766463 806923
57216 806923 848082 890026 930626 967126 997741 1021992 1040100 1052030 1057043 1054453 1044635 1028656
57204 1028656 1007086 980129 948956 915779 882369 849437 817576 787558 759212 731168 702505
57193 702505 674030 647580 624756 606476 592855 583173 576714 573673 574379 577869 582596 588630 597700
57180 597700 610777 626906 644625 663106 681792 700699 721592 747127 778049 812690 849766
57169 849766 890166 935387 985936 1041901 1103150 1167983 1233453 1298221 1363386 1429251 1493190
57158 1493190 1552332 1606769 1658238 1707011 1752168 1794069 1834595 1875351 1917307 1961885 2011036
57147 2011036 2066392 2129181 2200438 2280306 2367569 2460610 2558209 2658870 2760396 2861101 2960525
57136 2960525 3058097 3152166 3241520 3327023 3410631 3493358 3574892 3654237 3729776 3799672 3863312
57125 3863312 3921792 3976278 4026782 4073195 4116463 4158029 4199041 4240529 4282907 4324682 4363225
57114 4363225 4397609 4429000 4457582 4481439 4499969 4516181 4533582 4552550 4571917 4592457 4616218
57103 4616218 4643506 4673050 4704584 4739010 4776394 4815807 4856764 4898924 4940648 4979810 5016228
57092 5016228 5052074 5090011 5131859 5178461 5229288 5282038 5333220 5378745 5413619 5432161 5429566
57081 5429566 5402731 5349537 5268945 5162384 5033127 4883035 4711405 4517702 4303205 4068706
57071 4068706 3812968 3535274 3237389 2921040 2585410 2229226 1853350 1459142 1046008
57062 1046008 612543 157753 -321684 -833990 -1389961 -1999889 -2674735 -3427930 -4273180
57053 -4273180 -5222431 -6288578 -7487998 -8837677 -10352493 -12048933 -13949734 -16081782
57045 -16081782 -18471733 -21147137 -24139650 -27483848 -31215826 -35377637 -40021375 -45205334
57037 -45205334 -50989224 -57438795 -64634439 -72670583 -81643095 -91628794 -102661921 -114725918
57029 -114725918 -127786278 -141847953 -156958516 -173093418 -189972135 -206950436 -223113842
57022 -223113842 -237586658 -249941884 -260485974 -270169933 -280060693 -290647434 -301448847
57015 -301448847 -311178921 -318295818 -321536753 -320195693 -314163831 -303838419 -289949382 -273341813
57007 -273341813 -254801291 -234994659 -214503963 -193870584 -173599032 -154129803 -135809887
57000 -135809887 -118877644 -103466697 -89623943 -77329199 -66509249 -57051447 -48821668
56993 -48821668 -41680408 -35490540 -30120884 -25451568 -21378547 -17813006 -14679057 -11914201
56985 -11914201 -9469781 -7307577 -5395376 -3705485 -2214326 -900249 258092 1280371
56977 1280371 2182954 2979969 3684577 4307834 4857624 5340460 5763848 6135998 6464017
56968 6464017 6753422 7008721 7233942 7433635 7613986 7781663 7940398 8089180 8224170
56959 8224170 8341551 8438576 8513874 8568270 8604463 8624730 8629234 8616842 8586567 8537620 8469462
56948 8469462 8383265 8282684 8171277 8048239 7907006 7738977 7539734 7312824 7068219 6817510
56938 6817510 6570740 6336733 6123885 5938793 5784378 5659549 5558403 5467586 5366316 5233449
56928 5233449 5056941 4836683 4579900 4296784 4000141 3704539 3421840 3157343 2910932
56919 2910932 2680907 2465885 2264587 2075920 1899682 1736596 1587540 1452840 1331942
56910 1331942 1223729 1127345 1042467 968462 903975 848109 801195 763285 732710 707654 688444
56899 688444 676373 670778 669472 671829 678770 689084 698091 700991 695885 683054 663596 640002 615904
56886 615904 593480 572432 552716 536524 525781 519099 513368 507675 503850 503688 507469 515025 526511
56873 526511 541752 559957 580300 602003 623658 643073 657743 665124 662934 650186 628094 599498
56861 599498 567348 533896 500851 469580 441081 415993 394473 375906 359261 344197 331515
56850 331515 322104 315709 311194 307787 305690 305521 307539 311297 315836 320188 323901 327232 330930 335745
56836 335745 341703 347734 352498 356002 359807 365142 371503 377946 385118 394757 407494 422382 438306
56823 438306 454403 469106 480426 487737 492094 494406 494518 492541 489798 487721 486874 487653 490793 496466
56809 496466 503934 513014 524995 541178 561364 584664 611030 640959 674308 710494 749460 791358
56797 791358 835192 878219 916454 945539 961998 964825 956007 939162 917828 895042 873625 855844
56785 855844 842853 834850 831648 832954 838602 848906 864468 885530 912005 944216 982943 1028786
56773 1028786 1082270 1144152 1213462 1284048 1344553 1383809 1396615 1384313 1351485 1303811 1248043
56762 1248043 1191223 1138443 1091679 1050841 1015339 984813 959471 940186 927804 922199 922481 928205
56750 928205 940044 959323 987347 1024972 1071718 1124393 1176486 1219432 1245318 1249515 1231795 1195636
56738 1195636 1146670 1091289 1035441 983244 936169 893893 855985 822406 792734 766198 743017
56727 743017 724888 713387 708467 709102 714897 726324 743655 766232 792302 818743 841082 854689
56715 854689 856572 846264 825428 796934 763946 729129 694247 660308 627958 597866 571014 548397
56703 548397 529938 513893 498223 482727 469029 458199 449332 440992 433140 426712 421861 417713 413749
56690 413749 410487 408525 407409 405845 403009 399498 396860 396095 396735 397537 397684 396946 395130 392242 389093
56675 389093 386853 385892 385725 386023 386685 386914 385395 381897 377767 374364 371809 369624 367623 365556 362797
56660 362797 359112 355118 351464 348250 345695 344413 344344 344307 343455 342469 342431 343150 343515 343018 342081 341239 340676 340208
56642 340208 339210 337038 334062 331685 330777 330680 330239 329038 326987 323622 318750 313152 307769 302678 297615
56627 297615 292784 288410 284270 280561 278330 277889 277637 275867 273233 272012 273250 275975 278984 281962 284820
56612 284820 287262 289302 291369 293695 296319 299499 303303 307004 309794 311926 314232 316727 318736 320143
56598 320143 321282 321654 320200 317187 314630 314266 315933 318385 320904 323481 326026 328159 329746 331285 333542
56583 333542 336601 339240 339792 338032 335793 335155 336479 338688 340824 342384 342709 341327 338824 336381 334409
56568 334409 332465 330292 327957 325140 321512 317892 315792 315531 315865 315865 316032 317041 318363 318954 318653 318154
56552 318154 317995 318242 318962 320385 322553 325015 326989 327938 328256 329251 332015 336185 340136 342501 343354 343936
56536 343936 345377 347597 349364 349637 348841 348391 348896 349703 350506 352397 356396 361747 366800 371007 374759 377740
56520 377740 379024 378854 378923 380557 383685 387832 392852 398190 402668 405840 408898 413439 419780 426959 433914
56505 433914 440231 446245 452985 461622 472431 484459 496612 508904 522226 537059 552827 568539
56493 568539 583707 598507 613239 627987 642720 657213 670602 681584 689760 696397 702814 708102
56481 708102 709733 706703 700775 694009 686571 677974 669026 660816 652617 642666 630721 618222 606029
56468 606029 593575 580323 566611 552772 538787 525201 513264 503602 495500 487816 479987 472115
56456 472115 464832 459062 455087 451826 447838 442946 438041 433508 429051 424920 421909 419956 418006 415585
56442 415585 413278 411329 409095 406469 404624 404477 405249 405366 404180 402171 399999 397975 396116 394334 392786
56427 392786 392040 392455 393480 394197 394409 394478 394360 393868 393794 395434 398738 402086 404238 405529 406904 408950 412181
56410 412181 417034 422998 428775 433776 438480 443061 447001 450577 455255 461655 468282 473304 476543 478849
56396 478849 480681 482493 485401 489927 494750 498191 500545 503524 507586 511202 512885 512827 512356 512669 514228
56381 514228 516531 518116 517484 514476 510546 507539 506395 506876 507950 508206 506426 502386 497247 492880 490363
56366 490363 489060 487347 484338 480603 477169 474425 472396 471347 471165 470567 468016 463475 458334 453668 449526
56351 449526 445954 443527 442452 442019 441387 440292 438801 437198 436203 436345 436786 435781 432764 429095 426435
56336 426435 425303 425559 427003 428758 429249 427888 426017 425264 425645 426212 426840 428189 430348 432588 434289 435221
56320 435221 435141 434114 433238 434077 437071 441057 444628 447554 450562 453974 457028 458783 459551 460937 464229
56305 464229 469128 474426 479359 483579 486376 487208 486997 487685 490199 493832 497747 501822 505537 507403 506570
56290 506570 504231 502459 502145 502895 504359 506620 509461 512174 514407 516767 520381 525836 532490 538957 544650
56275 544650 550690 558813 569369 580868 591411 600029 606799 612571 618641 625903 634121 642575 651238
56262 651238 660462 669792 678338 686341 695076 704957 715135 725389 736963 750677 765322 778920 790838
56249 790838 801857 812872 824293 836220 848425 860421 871885 882658 892295 900259 906628 911923
56237 911923 916321 919964 923876 929257 935786 942143 948515 956908 968248 980698 991853 1001469 1011096
56224 1011096 1022276 1036176 1053897 1075759 1100758 1127602 1155817 1185354 1216166 1248913 1285143
56213 1285143 1325759 1370034 1417000 1467033 1521092 1579095 1640136 1704027 1771881 1845404 1926178
56202 1926178 2015357 2113563 2221037 2337756 2463151 2596282 2737170 2887472 3048667 3220002
56192 3220002 3399593 3586906 3782010 3982560 4184041 4383369 4579760 4771235 4952798
56183 4952798 5119282 5267763 5395710 5499008 5573890 5619459 5636875 5627618 5594119 5540347 5469911
56172 5469911 5384685 5286814 5180391 5069192 4954011 4834288 4711398 4588375 4467066 4347220
56162 4347220 4227736 4107295 3984500 3858965 3731846 3604265 3476039 3346920 3217989
56153 3217989 3090580 2964889 2840819 2719092 2600504 2485421 2375138 2272111 2177390 2089352
56143 2089352 2006438 1929471 1859599 1795692 1735802 1679665 1627649 1578813 1532411 1490012 1453582
56132 1453582 1422323 1393659 1366536 1341556 1318771 1297599 1278202 1260964 1245369 1231275 1220159
56121 1220159 1212978 1207883 1202310 1196327 1191646 1188521 1186173 1185233 1186973 1190904 1195831 1202458 1212127 1223667
56107 1223667 1234587 1245008 1257315 1272031 1287158 1301751 1317176 1334209 1351541 1367916 1383535
56096 1383535 1398702 1413027 1426456 1439403 1451567 1462236 1471871 1481865 1492894 1505087 1519289 1536213
56084 1536213 1554710 1573181 1592790 1617487 1651043 1695850 1754131 1827738 1916338 2017607 2129530
56073 2129530 2251371 2382847 2524021 2675555 2837280 3006545 3179015 3350178 3514904
56064 3514904 3667340 3803851 3925352 4034907 4134130 4223501 4303815 4373961 4428667 4462001
56054 4462001 4472555 4462749 4434683 4390231 4333761 4270062 4199415 4118202 4024216 3918020 3799694
56043 3799694 3668746 3527939 3383606 3241278 3103804 2973776 2854299 2746702 2650441 2565682
56033 2565682 2493101 2431185 2376986 2329868 2291326 2260740 2234532 2209992 2186975 2165509 2144758
56022 2144758 2124805 2106600 2089778 2073148 2057287 2043981 2033454 2024953 2019293 2017517 2017759 2017218 2016721
56009 2016721 2019595 2026706 2036593 2049605 2067130 2087187 2105945 2123767 2144728 2169783 2195466 2219863
55997 2219863 2244824 2271521 2299005 2328124 2361651 2399244 2437217 2474617 2514677 2559124 2606141
55986 2606141 2655256 2708821 2766885 2825772 2883722 2943009 3004608 3065915 3125838 3187166 3251608
55975 3251608 3317348 3383761 3453766 3529146 3608132 3689733 3775814 3866783 3960211 4056166 4159185
55964 4159185 4272473 4394521 4523571 4660812 4807050 4960808 5121839 5292185 5472352
55955 5472352 5661130 5860198 6073369 6299966 6534676 6775297 7024576 7283321 7548447
55946 7548447 7819460 8099939 8391122 8691512 9004578 9338683 9696962 10075368 10473209
55937 10473209 10896982 11351022 11833637 12346154 12896441 13489087 14120908 14790426 15502976
55928 15502976 16262518 17068386 17925037 18845398 19839392 20908326 22054417 23284863 24601886
55919 24601886 26000843 27484272 29066344 30757776 32558540 34471029 36506987 38676038
55911 38676038 40983682 43449574 46113279 49014480 52183851 55661208 59503525 63764958
55903 63764958 68488910 73730919 79568535 86078202 93328634 101413029 110463828 120623744
55895 120623744 132035096 144875398 159371099 175771147 194374625 215621472 240083085
55888 240083085 268287870 300558498 336904937 376625082 417448684 454952599 483354365
55881 483354365 497719552 496105808 480061256 453373941 420305461 384440199 348331041
55874 348331041 313572703 281028349 251104900 223969367 199639674 178013797 158918437
55867 158918437 142157270 127516803 114761606 103658346 93999761 85595508 78259166
55860 78259166 71822824 66152720 61137309 56672221 52668565 49062502 45803170 42840346
55852 42840346 40132559 37654153 35382021 33284545 31333187 29515017 27823870 26248045
55844 26248045 24775940 23404643 22132541 20950118 19846446 18817862 17862146 16970729
55836 16970729 16134302 15349875 14615017 13921270 13260562 12632749 12040470 11482073 10955504
55827 10955504 10462881 10004259 9572029 9157934 8761071 8383461 8022999 7676794 7346469
55818 7346469 7033928 6736259 6450557 6179446 5926086 5687903 5460988 5246569 5047036
55809 5047036 4859132 4677192 4500489 4332014 4172450 4020231 3874986 3736265 3601264
55800 3601264 3468124 3339165 3217020 3100400 2987652 2881448 2785482 2699052 2619233 2546062
55790 2546062 2481237 2423570 2369673 2317407 2265283 2210602 2151972 2092005 2034312 1979556 1927259
55779 1927259 1879113 1837037 1799880 1765314 1733392 1705313 1680407 1657064 1635018 1614290 1593697
55768 1593697 1572611 1552098 1532177 1510409 1485396 1458962 1432495 1404106 1372207 1338885 1306528
55757 1306528 1273912 1239104 1203726 1170786 1140352 1110833 1082509 1056383 1031460 1006732 984189
55746 984189 966398 952473 939646 927460 917372 909611 903576 900073 899976 901686 902785 903184 904031 904680
55732 904680 903523 900797 897975 895248 891823 887599 882412 874984 864821 853776 843566 833352 821922
55719 821922 810410 800349 791018 781490 773341 768121 763717 756601 746508 735717 724794 712379 698408
55706 698408 684365 670711 656835 643101 630465 618747 607685 598775 593384 589851 585246 579474
55694 579474 575053 573527 574746 579004 586946 597562 608810 620034 631374 641223 646742 646766 641977 632689
55680 632689 618857 602070 584996 568758 552832 537270 522937 509760 496805 483962 471721
55669 471721 459702 447380 435795 426454 418842 411126 402948 395409 388656 381745 374751 368780 363878
55656 363878 358984 354069 350315 347953 345725 342772 339625 337220 336188 336800 338350 339081 338235 337620 339531
55641 339531 343651 347659 350213 351546 351767 350733 349291 348650 348703 348678 349097 351250 355144 359831 365327 372133
55625 372133 379306 385253 390341 396513 404240 411904 418322 423859 428752 432161 433426 432824 430875 428067
55611 428067 425096 422069 417825 411627 405109 400796 399069 398462 398610 400702 404968 409841 413978 417347 420054
55596 420054 421753 422564 423091 423337 422937 422317 422097 421527 419347 416061 413473 411837 409461 405401 400647 396046
55580 396046 390836 383972 375534 366169 356253 346122 336256 326877 318051 309985 302417 294146 284382 274143
55566 274143 265068 257350 250141 243333 237234 231143 224227 217370 212133 208112 203479 198024 193331 189892
55552 189892 186380 182274 178943 177355 176525 175059 172760 170171 167925 166919 167646 169002 169252 168388 168058
55537 168058 169039 170421 171418 172196 172703 172492 172037 172400 173260 173098 171642 170161 168986 166880 163582 160865
55521 160865 160148 160929 162494 165278 169423 173617 176527 178067 178521 178031 177746 179654 184070 188839 192243
55506 192243 195283 199890 206329 213670 221490 229591 237009 242697 246468 248269 247404 243585 237896 231657
55492 231657 225101 218136 211583 206527 202958 200022 197107 194003 190546 186802 183223 180150 177687 176196
55478 176196 176039 176621 176771 176391 176528 177408 177809 177088 176423 177071 178603 179965 181192 182901 184899 186492 187600
55461 187600 188577 189465 190236 191189 192344 193023 192715 191732 190355 188101 184633 180705 177324 174497 171592 168403
55445 168403 165014 161052 155940 149693 142895 136077 129635 124039 119591 116034 112632 108642 103816 98773
55431 98773 94671 92086 90469 89293 89125 90487 92184 92290 90717 89112 87978 85722 81288 76210 72927
55416 72927 72034 72169 71844 70545 68591 66631 65046 63672 62510 62324 63545 64844 64232 61588 58693 56712
55400 56712 55408 54963 56386 59231 60909 59689 57005 55486 55810 56677 56922 56465 55885 55849 56293 55782 52879
55383 52879 48610 46143 47247 50444 53257 54724 54891 53786 52286 52330 54635 57442 58892 59302 59664 59539
55367 59539 58338 57338 58206 60439 62262 63284 64224 64800 64221 63438 64469 67322 69539 69258 67193 65261
55351 65261 64627 65437 67226 69158 70607 71749 73058 74523 75978 77654 79452 80288 79309 77254 75414
55336 75414 73811 71782 69776 68857 68691 67847 66171 65057 65038 64801 63278 61380 60796 62000 64098 65887
55320 65887 66482 65619 63959 62624 62048 61699 61080 60292 59240 57018 52874 47597 43303 41622 42254 43466
55304 43466 43902 43595 43086 42166 40282 37980 36791 37407 38964 40602 42668 45594 48522 50127 50252 49791
55288 49791 49411 49298 49662 50459 50908 50198 48589 47074 46198 45794 45509 44922 43562 41630 40390 41044 43452
55271 43452 46462 49112 50903 51477 50946 50188 50075 50612 51326 51956 52196 51445 49586 47445 45817 44786 44586
55254 44586 45932 48408 49740 48300 45561 44412 45552 47228 48114 48677 49743 51372 53250 54809 54900
55239 54900 52798 49647 47656 47748 49196 51428 54614 58270 60879 61506 60654 59116 57111 54934 53264
55224 53264 52314 51650 51292 51984 53895 55940 56943 56785 56017 55023 53893 52574 50952 49388 49103 51108
55208 51108 54683 57836 59416 59832 59655 58742 57152 55757 55194 55006 54515 53901 53815 54312 54659 53966 51941
55191 51941 49448 48314 49915 53746 57971 61356 64024 66370 68177 69113 69279 68900 67987 66590 64852
55176 64852 62795 60665 59409 59960 61845 63290 62967 61094 58769 56946 56118 56211 56554 56572 56557 57057 57622
55159 57622 57098 55285 53447 53044 54708 58297 62812 66206 66641 64469 61998 60924 60914 60992 61062 61400 61754
55142 61754 61864 62220 63532 65874 68804 71761 74063 75147 75109 74392 72858 70145 67096 65512 65897 66554
55126 66554 65721 63626 61660 60488 59944 59936 60389 60815 60888 61034 61625 62066 61477 59860 57896 56095 54858 54789
55108 54789 56010 57618 58657 59169 59423 58681 56015 52185 49342 48689 49401 50134 50598 51175 51834 52208 52395
55091 52395 53037 54548 56564 58201 58712 57969 56462 54972 54171 54316 55115 55939 56358 56489 56730 57239 57881
55074 57881 58546 59239 59972 60845 62100 63813 65683 67486 69391 71305 72289 71408 69056 66573 64709 63444
55058 63444 63183 64791 67957 70793 71881 71981 72840 74864 76742 77040 75530 73221 71601 71619 72943 74363
55042 74363 75075 75228 75125 74537 73204 71538 70415 70609 72517 75786 78974 80422 79981 79231 79577 80778
55026 80778 81952 83175 85196 88028 90792 92797 94101 95094 96037 96902 97360 97153 96714 96944 98044 99171
55010 99171 99639 99932 101012 103226 106364 110111 113786 116344 117447 117914 118238 117375 114169 109552 106020 104995
54994 104995 105760 106802 107081 105945 103200 99796 97501 97210 97994 98135 96757 94333 92227 91848 93593 96223
54978 96223 97794 97563 96651 96581 97563 98559 98751 98514 98986 100829 103460 105590 106536 106787 107086 107338 106895 105636
54960 105636 104115 102735 101472 100472 100231 100908 102074 103462 105385 107946 110299 111383 111361 111717 113722
54945 113722 117056 120098 121512 121336 120482 119416 117697 114972 111991 110079 109675 109965 110085 110162 110755 111727
54929 111727 112361 112505 112880 113995 115226 115478 114544 113271 112335 111410 109821 107715 106102 105831 106782 108084
54913 108084 108933 109207 109493 110537 112548 114949 116831 117595 117295 116691 116942 118720 121389 123655 125390 128154
54897 128154 133104 139042 143684 146632 149686 154069 158769 162392 165568 170461 178391 188802 200137 211020
54883 211020 220920 230429 240737 252250 264020 275011 285289 295013 302727 306112 304628 300162 294523
54870 294523 287344 277391 265075 252392 240516 228683 215939 203108 192265 184504 178868 173420
54858 173420 166940 159634 152771 147892 145945 146731 149185 152283 155540 158661 161221 163113 165124 168569
54844 168569 174229 181746 189997 198053 205943 214560 224520 235150 245025 253604 261706 270146 278607 286148
54830 286148 291880 294535 292448 285241 274962 264345 254228 243753 232524 221057 209420 197265
54818 197265 185471 176044 169682 164700 159053 152424 145771 140012 135827 133641 132944 132423 131434 130475 129662
54803 129662 127937 124750 121540 120303 121222 122672 123047 121786 119249 116584 115209 115443 115980 115450 114020
54788 114020 112762 112088 111750 111706 111893 111629 110408 108956 108340 108242 107280 104949 102218 100159 98966 98385 98167
54771 98167 97963 97515 97101 97214 97890 98971 100783 103722 107257 110270 112441 114423 116466 117753 117491 116124
54755 116124 115114 115763 118339 121988 125364 127520 128212 127560 126031 124910 125751 128644 131824 133985 136219
54740 136219 140439 146558 152779 158395 164522 171873 179556 186735 194049 202481 211833 221289 230750 240845
54726 240845 252087 264646 278371 292455 305585 316988 326800 334819 339571 339532 335081 328463 321761
54713 321761 315425 308736 301098 292686 284173 276065 268311 260594 253007 246259 241067 237514 235190 233787
54699 233787 233329 233886 235352 237675 241245 246790 254596 263815 272831 280601 287574 295227 304873 316987
54685 316987 331245 346730 362280 377132 391277 404911 417559 428032 435169 438278 437017 431322
54673 431322 421587 408624 393308 376383 358560 340459 322461 304823 288035 272811 259638 248427
54661 248427 238669 229937 222221 215698 210118 204715 199096 194026 190638 188799 186905 183682 179638 176396
54647 176396 174975 175147 175978 176571 176582 176367 176391 176392 175787 175094 176081 179797 185096 189778 192629 193714 193351 191789
54629 191789 189566 187391 185804 185369 186618 189215 191893 194018 196397 199597 202291 202737 201429 200783 202337
54614 202337 205539 209119 212310 214816 216979 220073 225138 231371 236869 241043 245012 249535 254017 257881
54600 257881 261490 265202 268826 272536 277025 282119 286505 289576 292280 295279 297554 298091 297966 299324 302778
54585 302778 307052 310947 314579 318817 324364 331413 339549 347952 356185 364678 374135 384696 395910 407068
54571 407068 417104 424648 428882 430172 429341 426477 420915 412227 400739 387170 372200 356462 340679
54558 340679 325783 312871 302717 295080 288800 282874 277332 272867 269848 267978 266789 266149 266161 266655
54544 266655 267011 266743 266239 266441 267519 268425 268336 268040 268877 270428 270394 267141 261500 255515 250069 244458 238014
54527 238014 231333 225642 221259 217123 212103 206512 201725 198243 194986 190955 186688 183221 180332 176979
54513 176979 173003 169141 165630 162177 159220 157687 157286 156427 154246 151483 148982 146688 144705 143997 145050
54498 145050 146784 147753 147696 147100 145994 144140 141917 140112 139070 138679 138927 139989 142015 145117 149101 152950
54482 152950 155246 155663 155535 156439 158648 161458 164487 167975 172023 176197 180018 183637 187919 193659 200557
54467 200557 207276 212846 217614 222336 227053 231647 236747 242638 247714 249648 248032 244332 239437 233150
54453 233150 226145 220079 215094 209444 202611 196649 192948 189713 184581 178221 173197 170299 168224 166314
54439 166314 165418 166069 167462 168455 168454 167390 165859 165113 165917 167538 168550 168262 166726 164148 161278 159604
54423 159604 159832 160620 160056 158057 156220 155775 156771 158854 161626 164529 167500 171340 176373 181265 184510
54408 184510 186634 189445 193349 196921 199071 200195 201041 201752 202281 202622 202473 201645 200873 201224 202625 203979
54392 203979 204686 204993 204864 203805 202004 200435 199416 198063 195650 192666 190080 188234 186920 186048 185803
54377 185803 186280 187070 187187 185850 183639 182208 182154 181851 179348 175021 171243 169817 170765 173279 176550 179720
54361 179720 182177 184099 185923 187434 188143 188251 188282 188283 188521 190358 194839 200655 205193 207656 209683 212820
54345 212820 217005 221625 226299 230269 232732 234492 237666 242996 248837 253653 258192 264184 271945 280277
54331 280277 287850 293822 297861 300469 302608 304309 304288 301607 297019 291990 287118 282300 277688 273441 268825
54316 268825 262617 254598 246127 238945 233478 228550 223024 217658 214530 214184 214343 212533 209144 206339 204511
54301 204511 201895 197753 193856 192092 192315 193347 194598 195773 196403 196659 197398 198443 198111 195640 192971
54286 192971 192837 195924 201014 206989 213391 219668 225306 230411 235241 239522 243054 246354 249742 252387
54272 252387 253300 252806 252051 251492 250801 249753 248175 245441 241087 235744 230498 225586 220568 215479 210889
54257 210889 206942 203153 198986 193994 187834 180983 175033 171270 169081 166636 162994 158759 154972 152263
54243 152263 150890 150555 150142 148527 145752 142765 140035 137192 134070 131355 129987 130287 131647 132704 132204
54228 132204 130282 128573 128356 128948 128708 127228 125516 124249 123125 122060 121833 123057 125318 127731 129679
54213 129679 130742 130638 129679 128762 128558 129136 130484 132646 134962 136023 135108 133329 132682 134109 136943 140015
54197 140015 142669 144744 146312 147719 149433 151301 152292 151600 149983 149156 149539 149464 147402 144329 142605 142825
54181 142825 143329 143012 142859 143771 144501 143431 141447 141078 142959 144910 144841 143072 141244 140235 139911 139920 139745
54164 139745 138556 136019 133071 131176 130902 131696 132856 134106 135239 135892 135951 135829 135952 136109 135679 134538
54148 134538 133468 133404 134332 135264 135381 135002 135143 136230 137521 137990 137568 137245 137797 138774 139078 138408 137537 137065
54130 137065 136567 135359 133498 131363 128911 126275 124576 124796 125912 125573 122943 119543 116774 114086 110619
54115 110619 107444 106587 108331 110729 111672 110522 107938 105148 103281 102528 101899 100523 99003 98669 99608 100479
54099 100479 100505 100665 102425 105817 109328 111358 111430 110195 108680 107712 107932 109933 113730 118006 120547 120015
54083 120015 117015 113200 109852 107699 107256 108330 109633 109921 109382 109031 108982 108460 107507 107383 108727 110377
54067 110377 110741 109751 108713 108617 109213 109604 109142 107732 105689 103566 102002 101406 101615 101840 101345 100233 99349
54050 99349 99187 99247 98747 97657 96681 96427 96900 97530 97514 96609 95886 96939 99778 102240 102470 101272 100817 101609
54032 101609 102359 102631 103628 105775 107324 106559 104184 102209 101304 100667 99972 99929 100839 101872 102177 101845 101371
54015 101371 100948 100797 101533 103508 106084 108331 110267 112674 115592 117798 118325 117926 118259 119855 121668 122641
53999 122641 122875 122948 122920 122685 122848 124445 127755 131905 135734 138746 141162 143219 144589 144674 143703 143270 145186
53982 145186 149708 155420 160912 165785 169898 172765 174363 175674 177623 180273 183856 189629 198378 208790
53968 208790 218890 228786 240255 253553 266296 276114 283141 289223 295809 303347 311816 320752 329047
53955 329047 335487 339491 341250 341449 340897 339879 337818 334113 329331 324817 321077 317458 313556 309857 306595
53940 306595 303125 299116 295355 292376 289129 284137 277538 270883 265245 260564 256723 254130 252940 252483
53926 252483 251834 250492 248335 245460 242326 239704 238147 237582 237485 237248 236401 234764 232632 230691 229623 229718
53910 229718 230833 232615 234799 237292 239951 242281 243661 244087 244479 245844 248033 249630 249281 247023 244166
53895 244166 242027 241105 241286 242270 243538 244508 245238 246569 248902 251200 252236 252672 254691 259175 264442 268412
53879 268412 271040 273743 277427 282177 288123 295234 302627 309313 315339 321119 326122 329684 332806 337348
53865 337348 343182 347781 349194 348076 346217 344438 342815 341723 341563 342212 343670 346590 351295 356892 362264
53850 362264 367466 373328 380092 387228 394345 401541 409006 416809 424897 432878 440001 445687 449776 452141
53836 452141 452673 452021 451592 452165 452827 451926 448785 444156 439364 435307 431716 427066 419886 410663 401720 394566
53820 394566 388109 380246 370505 360181 350458 341572 333476 326141 319214 312361 305942 300565 295949 291031
53806 291031 285208 278786 272195 265590 259325 254046 249963 246477 242758 238400 233521 228645 224523 221626
53792 221626 219712 218064 216104 213564 210438 207126 204337 202312 200472 198361 196444 195239 194113 192104
53778 192104 189776 188942 190227 192038 192515 191588 190382 189431 188457 187464 186927 186793 186193 184562 182555 181378
53762 181378 181454 182142 182663 182762 182431 181576 180409 179719 180049 180754 180711 179975 179941 181577 184327 187184 190101 193628
53744 193628 197758 201951 205916 209601 212754 215332 218159 222378 228222 234924 241713 248274 254384 259936
53730 259936 265391 271534 278596 286099 293575 300863 307690 313610 318512 322699 326317 329122 330970 332165
53716 332165 333314 335106 337965 341397 343925 344422 343457 342602 342463 342236 341246 339927 338942 338254 337548 336796 335799
53699 335799 333832 330558 326937 324427 323413 322938 321895 320010 317707 315497 313547 311528 308717 304523
53685 304523 299093 293472 289073 286873 286903 288361 290116 291072 290254 287081 281805 275408 268765 262141 255718
53670 255718 250098 245768 242487 239927 238648 239567 242472 245834 248167 248877 247804 244958 241108 237900 236812
53655 236812 238225 241584 245867 249746 252148 253139 253759 254677 255684 256840 259159 263376 268699 273750 278422
53640 278422 283804 290365 297099 302670 306770 310163 313914 318873 325373 332924 340290 346305 350831 354863
53626 354863 359515 364932 370382 375299 379761 383736 386458 387274 386769 386257 386212 385979 385081 383935 383025 382228
53610 382228 381265 380126 378715 376851 375036 374374 375120 376011 375636 373808 371139 368152 365539 364246 364217 363804
53594 363804 361688 358765 356808 355824 354332 351942 349916 348995 348433 347651 347247 347499 347267 345524 343102 341738
53578 341738 341831 342194 341736 340714 340411 342082 345974 350935 355207 357927 359584 360986 362492 364475 367545
53563 367545 371601 375411 378061 380269 383317 387187 390891 394368 398809 404914 411864 418393 424125 429501
53549 429501 434917 440317 445368 449879 454202 459043 464528 469873 474714 480401 488860 500038 511505 521003
53535 521003 528554 535680 543385 551502 559328 566186 571824 576818 582274 588750 595944 603775 612884 623280
53521 623280 633110 639913 643083 644377 646130 649484 654123 658870 662579 665141 667687 671319 675681 679303
53507 679303 681185 681446 680640 679318 678309 678544 680212 682614 685100 687639 690418 693487 697023 701374 706508
53492 706508 711914 717214 722463 727748 733098 738923 745787 753361 760249 765409 769280 773011 777003 780848
53478 780848 784396 788264 793184 799235 805789 812123 818180 824668 832268 840825 849633 858352 867189 876455
53464 876455 886673 898939 914056 931103 947988 963866 980014 997789 1016900 1036564 1057234
53453 1057234 1079899 1104419 1129845 1155946 1183184 1211578 1240922 1271951 1305968 1343238 1382772
53442 1382772 1423607 1465247 1507090 1548915 1592095 1638703 1688778 1739680 1789011 1837258 1886829
53431 1886829 1939371 1994760 2051865 2109230 2165506 2220187 2273805 2326864 2379019 2429943 2480488
53420 2480488 2532059 2585010 2638433 2691457 2744024 2796304 2847963 2898105 2945497 2989068 3028883
53409 3028883 3066744 3104972 3144156 3182529 3217939 3249941 3279404 3306539 3330248 3349556 3364818
53398 3364818 3376976 3386033 3390982 3391159 3387038 3379529 3368943 3354912 3337008 3315204 3289902 3261719
53386 3261719 3231085 3198038 3162625 3125325 3086517 3045583 3001510 2954708 2907215 2860382 2813387
53375 2813387 2765160 2716876 2670911 2627685 2585397 2543001 2501520 2461716 2422305 2382037 2342551
53364 2342551 2307530 2279107 2256072 2235385 2214653 2193435 2173267 2156604 2144984 2137970 2134098 2132690
53352 2132690 2134174 2138937 2146771 2157615 2172141 2191084 2214311 2240928 2270196 2302196 2337653 2377189
53340 2377189 2420624 2467048 2515588 2566125 2619217 2675572 2735712 2799877 2867947 2939535 3014350
53329 3014350 3092365 3173461 3257177 3343059 3431040 3521231 3613684 3708751 3807268 3909550 4014239
53318 4014239 4119037 4222905 4326915 4432425 4538905 4644109 4746073 4844304 4939254 5031432
53308 5031432 5121133 5208163 5291253 5368224 5437389 5498660 5552859 5600256 5640547 5674009 5701584
53297 5701584 5723307 5737496 5742238 5737301 5723949 5703260 5675325 5639806 5596440 5545091 5486182 5421118
53285 5421118 5351320 5276483 5194608 5104418 5007356 4906649 4804781 4702377 4599250 4495722
53275 4495722 4392663 4290699 4189887 4090233 3992146 3896017 3801446 3707636 3614910 3525185 3440080
53264 3440080 3358874 3279422 3201109 3125845 3055773 2991010 2930175 2872190 2816653 2763195 2711696
53253 2711696 2663040 2618685 2579243 2544034 2512085 2483085 2457306 2435087 2416518 2401239 2388457
53242 2388457 2377569 2368973 2363930 2363303 2366466 2371708 2377840 2385309 2395645 2409790 2427229 2446929 2468727
53229 2468727 2493260 2520604 2549799 2580047 2611891 2646640 2684853 2725726 2767930 2810748 2854425
53218 2854425 2899642 2946702 2995173 3044195 3092797 3139783 3183859 3224580 3262984 3300433 3336749
53207 3336749 3370211 3399443 3424458 3445690 3463075 3476636 3486982 3494498 3498714 3499268 3496833 3492231
53195 3492231 3485103 3474226 3458739 3438396 3413213 3383804 3351587 3317539 3281015 3240742 3196762
53184 3196762 3150357 3102235 3051909 2998977 2944025 2888113 2832158 2776885 2722497 2668351 2613864
53173 2613864 2559804 2507706 2457805 2408656 2359270 2310671 2264687 2221877 2181236 2141318 2101121
53162 2101121 2060437 2020098 1981637 1946160 1913573 1882957 1853335 1824069 1795260 1768057 1743875
53151 1743875 1722790 1703299 1684057 1665160 1647084 1629177 1610234 1590215 1570317 1551411 1533217
53140 1533217 1515080 1496674 1477796 1458223 1438110 1417937 1397729 1376734 1354314 1330824 1307182
53129 1307182 1283864 1260708 1237587 1214675 1191890 1168391 1143032 1115398 1086299 1057188 1029099
53118 1029099 1002101 975695 949660 924504 901192 880395 861939 844811 827666 809460 789921
53107 789921 769678 749911 731589 714873 699286 684433 670371 657235 644739 632260 619278
53096 619278 605668 591763 578386 566507 556390 547072 537105 526018 514854 505063 497069 490118
53084 490118 483410 476968 471201 465889 460099 453271 445989 439342 433805 429117 424991 421250 417336 412476
53070 412476 406639 400797 395981 392548 390512 389783 389718 389210 387876 386559 385921 385189 383205 380236 377742 376540
53054 376540 376140 375842 375530 375345 375323 375486 375747 375883 376176 377674 380891 384594 387120 388726 391340 395855 401130
53037 401130 405947 410423 414801 418295 420212 421164 422044 422569 421913 420074 417572 414404 410395 406022 401729
53022 401729 396919 390863 384250 378504 373723 368615 362524 356239 350616 345701 341503 338315 335633 331953
53008 331953 326556 320646 315696 311391 306267 299993 293881 289187 285889 283247 280729 278148 275537 273230
52994 273230 271538 270063 267850 264501 260729 257379 254434 251542 249138 248232 249039 250435 250956 249814 246938
52979 246938 242676 237970 234304 232877 233736 235822 237648 237951 236315 233636 231425 230118 228425 225030 220483
52964 220483 216577 214180 212742 211857 212013 213391 215067 216123 216662 216931 216294 214233 211911 211355 212930 214638
52948 214638 214388 212313 210364 210080 211231 212423 212624 212055 211782 212510 213789 214537 214317 213842 214134 215404 217052
52931 217052 218542 219863 221034 221598 221066 219731 218541 218042 217778 216978 215579 214323 214044 215141 217507 220555
52915 220555 223384 225274 226071 226002 225323 224449 224064 224561 225577 226609 227950 230278 233438 236520 239313 242811
52899 242811 247831 253830 259580 264464 268543 271961 275052 278820 284505 292438 301601 310396 317783 323868
52885 323868 329464 334925 339425 341731 341770 340845 340134 339578 338629 337450 336705 336505 336192 334968 332355 328321
52869 328321 323482 318877 315021 311348 307037 302165 297635 294300 292596 292484 292987 292183 288838 284091 280594
52854 280594 279714 280313 280582 280200 280055 280492 280669 279692 277748 276017 275646 276940 279348 281963 284020 285182
52838 285182 285649 286005 286665 287379 287583 287317 287395 288504 290513 292930 295537 298092 299855 300136 299234 298280 298070
52821 298070 298377 298403 297604 296163 294860 294345 294331 293801 292235 290299 289034 288857 289671 291264 292895 293205 291700
52804 291700 290100 291014 295117 300422 304447 306282 306513 306168 306184 307163 308945 310632 311330 310833 309745 309252
52788 309252 310436 313190 316030 317746 319008 321484 325472 329534 332561 335092 338296 342608 347720 352926
52774 352926 357163 359806 361839 365079 369696 373752 375944 377473 380024 383157 385362 386808 389051 392131
52760 392131 393802 392184 387943 383234 379314 375719 371252 365403 359004 353490 349274 345240 340390 335531
52746 335531 332288 330676 328809 325195 320234 315099 310123 304879 299099 292904 286670 281163 277219 274708
52732 274708 272245 268559 263843 259316 255757 253052 250866 249128 247798 246576 244966 242492 239055 235244
52718 235244 232100 230268 229456 228834 227727 225852 223308 220602 218261 216031 212903 208513 204149 201630 201235
52703 201235 201445 200836 199628 199148 200157 201957 202849 201417 197698 193270 189911 188083 186977 185842 184662
52688 184662 183433 181568 178585 174901 171295 167879 164166 160008 155881 152220 149043 146255 143865 141783
52674 141783 139787 137826 136052 134494 132996 131532 130269 129403 129362 131031 134989 140288 144741 146919 147314
52659 147314 147223 147218 147351 147894 148718 148452 145796 141803 139534 140935 144904 148790 150846 150728 148791 146039 144091
52642 144091 143916 144688 144813 143947 143115 142889 142552 141413 140102 139981 141731 145001 149063 153240 156969 160108
52626 160108 163201 167017 171651 176410 180790 185324 191034 198077 205300 211396 216135 220068 223247 224952
52612 224952 224742 223080 220634 217627 214374 211708 210059 208609 206318 203432 200882 198339 194279 188287
52598 188287 182030 177209 173529 169518 164630 159657 155604 152978 151722 151008 149564 147098 144946 144413 144925
52583 144925 144963 144327 143936 143539 141583 138011 135445 136267 139537 142211 142719 142009 141402 140968 140226 139302 138831
52566 138831 139292 140828 143286 146107 148413 149371 148506 145923 142607 140250 140133 142101 144950 147593 149379
52551 149379 149719 148490 146891 146782 148682 151244 153206 154921 157157 159260 159838 158953 158271 158804 159594 159200
52535 159200 157634 156112 155416 155304 155389 155856 157147 159387 162296 165344 167822 169124 169319 169386 170520 172997
52519 172997 175880 177966 179033 180047 182070 185000 187569 188679 188679 189019 190594 192750 194264 195033 196297
52504 196297 199180 203577 208609 213576 218047 221578 224060 226136 228616 231414 233691 235106 236364 238262
52490 238262 240616 242441 242953 242290 241507 241901 243844 246109 246838 245554 243830 243531 244802 246305 247128 247664
52474 247664 248538 249482 249841 249867 250797 253420 256916 259609 260918 262069 264476 267713 269808 269662 268576 268933
52458 268933 271632 275085 276574 274512 269830 265450 264042 265793 268479 269858 269578 268508 266952 264477
52444 264477 261275 258675 257930 259010 260767 261944 261979 261290 260899 261448 262574 263573 264447 265597 266605 266404
52428 266404 265065 264424 266032 269051 271239 271816 272299 274306 277455 280040 281202 281665 282411 283385 283889 283899
52412 283899 284373 285983 287947 288676 287772 286956 288609 293405 299630 304790 307620 308611 309003 309589 310347 310929
52396 310929 311402 312413 314500 317306 319820 321565 323154 325286 327477 328460 327888 327009 327353 329199 331683
52381 331683 333961 335735 336947 337709 338519 339978 342119 344403 346449 348348 350217 351920 353438 355124 357295
52366 357295 359830 362296 364196 365071 364759 363699 362476 361036 358952 356637 355393 355629 355719 353627 349338
52351 349338 344814 341721 340112 339286 338869 338691 338459 338172 338385 339487 341059 342468 343851 345859 348415 350352
52335 350352 350676 349888 349616 350858 352921 354425 355134 356310 359054 362721 365416 365964 364964 363850 363376 363379
52319 363379 363755 365164 368498 373821 380060 385709 389760 392095 393370 394601 396460 398726 400761 402784
52305 402784 406108 411478 417568 422019 423904 424433 425208 426782 429049 431982 435335 438417 440869 443245 446308
52290 446308 450169 454460 458902 463360 467904 472993 478820 484218 487356 488101 488615 490700 493705 496104 497979
52275 497979 500450 503543 506490 509618 514094 519878 525626 530685 535538 540149 543590 545828 548357 552422
52261 552422 557799 563826 570371 577108 583092 587916 592496 598043 604996 613334 622797 632234 639925 645626
52247 645626 651614 660796 674153 690351 706998 721895 734265 745822 759749 777531 797260 815923
52235 815923 832745 849383 867444 887048 907621 928996 951417 974940 999003 1022577 1045096
52224 1045096 1067281 1090461 1114855 1139260 1162765 1185795 1208936 1231739 1253504 1274426 1295001
52213 1295001 1315007 1334056 1352620 1371399 1389985 1406996 1421306 1432529 1440857 1447176 1452744 1457888
52201 1457888 1461545 1463007 1463464 1464711 1466786 1468080 1467497 1465387 1462680 1460288 1459148 1459629 1460892 1461876 1462787
52186 1462787 1464519 1466788 1468179 1468168 1467893 1468620 1470609 1473815 1478617 1485229 1493155 1501833 1511430 1522626 1535918
52171 1535918 1551181 1567495 1583518 1598555 1613166 1628188 1643421 1657899 1671147 1683380 1694861
52160 1694861 1705979 1717539 1729696 1740873 1749176 1754914 1760235 1766174 1771643 1775678 1778893 1781774 1783068
52147 1783068 1781221 1776456 1770280 1763595 1756412 1748816 1741069 1732906 1723557 1712471 1699813 1686644 1674906
52134 1674906 1666349 1660784 1656040 1650414 1644544 1640067 1637045 1633891 1629628 1625100 1621813 1620349 1620158 1620300
52120 1620300 1620182 1619886 1619936 1620534 1621101 1620788 1619281 1616807 1613540 1609527 1605225 1601660 1599748 1599446 1599674 1599248
52104 1599248 1597977 1596654 1595677 1594053 1590486 1585436 1581159 1579211 1578531 1576566 1571869 1565063 1557710 1550956
52090 1550956 1545139 1539974 1534908 1529548 1523843 1517822 1511376 1504502 1497469 1490373 1482652 1473443 1462501 1450653
52076 1450653 1439388 1429960 1422668 1416810 1411324 1405472 1398937 1391644 1383884 1376279 1369074 1361653 1353480 1345356
52062 1345356 1338736 1333721 1328751 1322717 1316406 1311279 1307700 1305134 1303269 1301979 1300782 1299421 1298728 1299937
52048 1299937 1303127 1307061 1310581 1313614 1316978 1321745 1328599 1337271 1346823 1357055 1369235 1384569 1402238
52035 1402238 1420046 1437172 1455234 1476225 1500198 1525556 1551063 1576842 1603621 1631597 1660181
52024 1660181 1688614 1716642 1744580 1772699 1800747 1828170 1854623 1879968 1903931 1926101 1946203
52013 1946203 1964060 1979378 1992007 2002438 2011657 2020204 2027576 2032718 2035026 2034838 2033108 2030703 2027976
52000 2027976 2024878 2021193 2016475 2010032 2001518 1991689 1982053 1973564 1966096 1959306 1953294 1948008 1942777 1937261
51986 1937261 1932286 1928816 1926499 1924265 1922143 1921231 1921824 1922809 1923309 1923723 1924527 1925104 1924771 1924228 1924898 1927179
51970 1927179 1930288 1933494 1936498 1938749 1939564 1939203 1938871 1939239 1939738 1939722 1939447 1939170 1937997 1934702 1929385 1923184
51954 1923184 1916248 1907183 1895021 1880906 1867000 1854099 1841064 1826426 1809874 1792143 1773989 1755480
51942 1755480 1735989 1714779 1691705 1667232 1641628 1614483 1585444 1555071 1524365 1493541 1461945
51931 1461945 1429171 1395595 1361669 1327468 1293136 1259121 1225524 1191699 1156964 1121364 1085545
51920 1085545 1050338 1016674 985223 955488 925877 895354 864706 835472 807955 781121 754372
51909 754372 728559 705019 684169 665300 647385 629875 613023 597618 584243 572686 562162
51898 562162 552012 541977 531909 521578 510920 500287 490369 481784 474602 468272 462220 456553 451806
51885 451806 447885 443833 438941 433605 428593 424076 420150 417802 418081 420104 421011 418503 412932 406475 400856
51870 400856 396338 392301 387921 382512 376030 369415 363836 359462 355524 351745 348999 347971 347705 346411
51856 346411 343664 340923 339566 339149 338122 335680 332322 329043 326723 325931 326398 326735 325462 322413 318529
51841 318529 314570 310991 308825 309135 311095 312068 310458 307410 304791 302651 300024 297256 295687 295270 294285
51826 294285 291682 288329 285543 283552 281953 280592 279310 277641 275490 273519 272106 270431 267331 262828
51812 262828 258132 254375 251946 250946 251480 253240 255294 256662 257023 256743 256517 257146 259299 262922 266821
51797 266821 269367 269980 269758 270358 272500 275833 279864 284288 288525 291866 294374 296875 299621 301618 301792
51782 301792 300295 298040 295499 292738 290212 288629 288035 287811 287610 287809 288981 291342 294575 297761 299787
51767 299787 300472 301220 303870 308855 314976 320761 325385 328429 329793 330115 330488 331320 332008 332042 331849 332059 332448
51750 332448 332238 331356 330813 331622 333547 335198 335487 334742 334056 333693 332800 330820 328366 326263 324541 323102
51734 323102 322546 323212 324052 323906 323691 325689 330339 335132 337300 336602 334949 334394 336233 340950 347731 354448
51718 354448 359230 362143 364703 367767 370503 371593 371096 370833 372780 377070 381921 385754 388896 392597 396894
51703 396894 400727 404112 408742 415811 424291 432150 438448 443454 447573 451317 455917 462724 471863 482173
51689 482173 492464 502297 511626 520322 528154 534800 539791 542762 543793 543429 542523 542139 543071 544990 546419
51674 546419 546220 545010 544601 546059 548835 551859 554914 558538 562847 567050 570287 572649 574865 577026 578240
51659 578240 577837 576383 574944 573791 572597 571542 571239 571662 572110 572357 572840 573501 573423 571979 569455 566266
51643 566266 562564 558974 556497 554964 552676 548538 543731 540328 539015 538997 539342 539402 538649 537263 536324 536419
51627 536419 536667 536187 535780 536817 539119 541515 543989 547495 551794 555390 557813 560200 563142 565610 566731
51612 566731 567187 567940 568756 568889 568239 566917 564513 560681 555749 549973 542945 534550 525843 518040 511239
51597 511239 505012 499569 495178 490798 484609 476042 466359 457118 448818 441164 433812 426428 418649 410600
51583 410600 403378 398554 396894 397384 397640 395619 391153 385665 380518 376151 372803 371074 371002 371240 370174
51568 370174 367735 365282 363723 362568 360938 358765 356632 355010 353944 353197 352381 351166 349488 347368 344675
51553 344675 341392 337981 334920 331930 328441 324978 323279 324552 328206 332657 336770 339969 341781 342368
51539 342368 343145 345695 349982 354496 358281 361812 365700 369576 372938 376267 380425 385406 390543 395694
51525 395694 401265 407170 412730 417870 423559 430483 437723 443407 446533 447775 448586 449849 451368 452293 451827
51510 451827 449663 445977 441224 436061 431309 427659 425323 424152 424195 425801 428967 432976 437189 442044 448599
51495 448599 456907 465398 472325 477511 482225 487580 493552 499452 504691 508922 512036 514290 516071 517301
51481 517301 517611 517272 517257 517843 517977 516887 515634 515769 516803 516685 514948 513784 515283 518962 522953 526349
51465 526349 529108 530660 530318 528719 527328 526380 524451 520310 514360 508166 503283 500455 499080 497451 494284
51450 494284 490075 486292 483451 480901 478288 476059 474417 472926 471462 470501 470078 469367 467676 465112 462030
51435 462030 458667 455490 452984 450973 449208 448784 451476 457185 463442 468260 472169 476427 480644 483604
51421 483604 485471 487597 490678 494516 499177 504932 511259 517283 523261 530479 539525 549645 559922 570198
51407 570198 580663 591321 602126 613057 623830 633976 643396 652513 661708 670709 678495 683877 686567
51394 686567 687700 688707 689602 689211 687389 685950 686707 689435 692535 694864 696056 696036 695399 695512 696906 698103
51378 698103 697211 694093 689598 683333 674028 661969 649320 637829 627627 618482 610761 604665 599643
51365 599643 594995 590183 584471 577358 569580 562634 557073 552145 547124 542018 537065 532717 530059 529818
51351 529818 530921 531488 531414 532385 535159 538631 542056 546126 550782 553834 553294 549901 545881 542157 538079
51336 538079 533034 526955 519804 511718 503219 494435 484778 474210 463960 454958 446418 437147 427450 418385
51322 418385 409818 400692 390862 381231 372268 363817 356285 350572 346565 342856 338216 332556 326315 319973
51308 319973 314327 310263 307733 305551 302560 298566 294049 289494 285187 281182 277320 273611 270571 268803
51294 268803 268301 268534 269068 269651 269892 269454 268513 267562 266840 266368 266294 266615 266826 266528 266171 266459 267164 267488 267616
51275 267616 268940 272374 277114 281529 284816 287465 290456 294322 298744 302910 306454 310100 315112 322053
51261 322053 330282 338503 345504 350591 353761 355482 355934 354766 352009 348855 346631 345093 342623 338219
51247 338219 332411 326036 319167 311826 304764 298566 292537 285585 278033 271538 267046 263787 260692 257976
51233 257976 256448 255532 253031 247314 239307 231850 227197 225402 224933 224428 223800 223896 225207 226884 227324 225911
51217 225911 223747 222257 221541 220861 220266 220463 221107 220658 218542 216228 215325 215603 215880 216016 216783 218321 219970
51200 219970 221415 222875 224321 225445 226256 226772 226323 224227 221059 218220 216363 215308 215373 217267 220327
51185 220327 222218 221156 217614 213391 209960 208236 208718 210844 212889 213533 213204 213275 214441 216532 219135
51170 219135 221456 222068 220064 216420 213252 211571 210547 209096 207342 206138 205760 205655 205181 204201 203095
51155 203095 202564 203330 205631 208878 211978 214160 215539 216778 218386 220515 223320 226950 230873 233680 234190
51140 234190 232765 231092 230726 232188 235194 238909 241873 242597 240849 237951 235414 233719 232742 232640 233603
51125 233603 235238 237047 239238 242206 245417 247777 249189 250673 252647 254010 253597 251812 250047 249010
51111 249010 248409 247980 247756 247436 246402 244588 242563 240474 237683 233830 229581 225864 223101 221718 222469
51096 222469 225161 227637 227454 224429 220357 216370 212144 207878 205249 205287 206630 207176 206609 205988 205677 205278
51080 205278 205287 207044 210804 215180 218926 222056 224807 226643 227144 227069 227623 229036 230450 230948 230177 228362
51064 228362 226238 224765 224221 223617 221461 217267 212139 207905 205832 206038 207691 209589 210740 210780 210133 209722
51048 209722 210223 211396 212311 212392 212064 212221 213312 215239 217806 220880 224163 227173 229400 230412 230229 229866
51032 229866 230938 234075 238036 241114 243111 245161 247856 250512 252290 253099 253212 252841 252285 251824 251272 250321
51016 250321 249362 249193 249851 250596 251112 251659 251866 250662 248010 245616 245130 246512 248896 252089 256192 260417
51000 260417 263401 264450 263862 262394 260999 260516 260997 261932 263570 267111 272680 278105 280918 280904 279537 277741
50984 277741 275697 274207 274195 274901 274379 272212 270158 269704 270444 271374 272282 273100 273284 272955 273559 276199 280074
50967 280074 283687 286892 290447 294036 296136 295924 294302 292912 292982 295080 298918 302879 304670 303431 301101
50952 301101 301044 305007 311549 317571 321287 323561 326487 331081 336604 341756 345888 349143 352183 356098 361851
50937 361851 369197 376509 382331 387022 392480 400495 411653 425318 439836 453036 463681 472828 482996
50924 482996 495564 509630 523895 538912 556522 577392 600138 623074 646016 669969 695715
50913 695715 723365 753045 785321 820790 859679 901930 947419 995911 1047019 1100454 1156313
50902 1156313 1215058 1277234 1343104 1412422 1484487 1558561 1634194 1711022 1788220 1864428 1938359
50891 1938359 2009368 2077259 2141642 2201606 2256014 2304038 2345380 2380027 2407946 2429315 2445137
50880 2445137 2457179 2466830 2474268 2479294 2482724 2486064 2489700 2492387 2492977 2491703 2488998 2483813 2474142 2458732
50866 2458732 2437285 2409433 2374876 2334446 2289567 2240201 2184585 2121636 2052750 1980530 1906576
50855 1906576 1831268 1754990 1678694 1603738 1531921 1465049 1403542 1345940 1290911 1239414 1193691
50844 1193691 1154226 1118994 1085961 1055164 1027838 1004563 984950 968293 953698 940182 927535
50833 927535 916754 908812 903221 898582 894377 891481 890858 892427 895353 898815 902272 905438 908468 912022
50819 912022 916861 923429 931814 941962 953744 966804 980395 993528 1005691 1017661 1031327 1048338
50807 1048338 1069054 1092939 1119529 1148438 1178878 1210094 1242385 1276921 1314478 1355141 1399488
50796 1399488 1449056 1504899 1566438 1632695 1704392 1783718 1871888 1967756 2069277 2175959 2289412
50785 2289412 2411679 2543434 2683876 2831928 2986929 3148120 3314060 3483086 3653967
50776 3653967 3825197 3993757 4155652 4308037 4449874 4579888 4694903 4791422 4868433 4927699
50766 4927699 4971629 5002095 5021272 5032172 5037647 5039587 5039578 5039718 5042164 5048076 5057279 5068499 5079652
50753 5079652 5088223 5091604 5086762 5069694 5036168 4983771 4912946 4825506 4722433 4603601 4469274
50742 4469274 4321229 4162508 3996740 3827636 3658405 3491211 3327540 3169439 3020076
50733 3020076 2882640 2758704 2648010 2549804 2463844 2389932 2327195 2274635 2232127 2199892 2176897
50722 2176897 2160875 2150454 2146266 2148970 2156835 2166468 2175601 2183923 2191244 2196247 2197553 2194955 2189014
50709 2189014 2180184 2168876 2155639 2140576 2123084 2102802 2080441 2057118 2033212 2008428 1982638
50698 1982638 1955953 1928075 1898318 1866722 1835008 1806125 1782469 1764275 1749822 1737427 1727054
50687 1727054 1719753 1716144 1716273 1720564 1729649 1743058 1759251 1777441 1798656 1824660 1856559 1894682
50675 1894682 1938751 1987743 2040708 2098440 2163270 2236485 2316906 2402879 2494528 2592784 2697033
50664 2697033 2804971 2914161 3022574 3128289 3230049 3327591 3420033 3504406 3577272 3637539
50654 3637539 3686135 3723116 3746877 3756451 3753009 3738679 3715311 3685001 3650620 3615108 3580939 3550471
50642 3550471 3525741 3507384 3494561 3486218 3481594 3479370 3477492 3474139 3467861 3456445 3436911 3407158
50630 3407158 3366573 3314764 3251316 3177628 3097522 3014645 2930165 2844189 2758495 2676421 2600579
50619 2600579 2532006 2471210 2418703 2374558 2338548 2310922 2292308 2282857 2282132 2289883 2306416 2332320
50607 2332320 2368185 2414279 2470009 2533864 2604250 2679939 2759373 2840151 2919809 2996638 3069295
50596 3069295 3136572 3198309 3255623 3309067 3357361 3399310 3436256 3470813 3503490 3532425 3556517
50585 3556517 3576883 3594694 3609526 3620963 3630442 3640204 3651364 3664209 3679527 3698161 3719675 3742803
50573 3742803 3767230 3793957 3823938 3857222 3893333 3931405 3969564 4005016 4035411 4059946 4078894
50562 4078894 4092444 4100263 4101934 4097508 4087726 4073888 4057534 4040181 4023458 4009235 3999184 3994007
50550 3994007 3993382 3996965 4005232 4018847 4037140 4057526 4076663 4092119 4102916 4108787 4109228 4103087 4088651
50537 4088651 4064007 4027594 3978619 3916870 3842249 3754969 3656479 3549823 3438486 3324856 3210001
50526 3210001 3094795 2980767 2869700 2762803 2660609 2563644 2472855 2389247 2313110 2243900
50516 2243900 2181094 2125076 2076681 2035675 2000217 1968411 1940187 1917027 1899943 1888382 1881230
50505 1881230 1878078 1879092 1884362 1894063 1908830 1929079 1954037 1982232 2013103 2047504 2086428 2129917
50493 2129917 2177607 2229786 2287216 2350152 2418154 2490821 2568206 2650520 2737966 2830787 2928815
50482 2928815 3030727 3134314 3237873 3340814 3442492 3541099 3634678 3723144 3808482 3892828
50472 3892828 3977026 4061204 4145975 4232421 4321289 4412725 4506749 4603674 4704138 4808943 4918691
50461 4918691 5033397 5152635 5276179 5404117 5535991 5670061 5803784 5934697 6060493
50452 6060493 6178632 6286608 6382391 6463833 6527699 6570299 6589586 6585964 6560625 6513866 6445791
50441 6445791 6358029 6253708 6136001 6007899 5873479 5738000 5605971 5480015 5362553 5257822
50431 5257822 5170809 5104146 5057119 5027702 5014397 5015594 5028296 5048462 5072005 5094534 5110562
50420 5110562 5114157 5100539 5066538 5009755 4928490 4822941 4695791 4551101 4392917 4225071
50410 4225071 4051539 3876197 3702237 3532146 3368078 3211853 3064587 2926544 2797484
50401 2797484 2677251 2566256 2465413 2375345 2295514 2224327 2160198 2102413 2051062 2006511 1969036
50390 1969036 1938592 1914615 1896107 1882038 1871597 1864298 1860192 1859943 1864180 1872703 1884766 1900152
50378 1900152 1919432 1942976 1970318 2000693 2033683 2069052 2106613 2146612 2189646 2235676 2283722
50367 2283722 2333168 2384842 2439945 2498119 2557350 2615708 2672614 2728472 2783682 2838211 2891852
50356 2891852 2944787 2997771 3051317 3104715 3156762 3207890 3260646 3317024 3376125 3435690 3495440
50345 3495440 3557406 3622968 3691020 3759253 3825897 3889828 3950294 4007200 4060569 4108919 4149135
50334 4149135 4178745 4197461 4205655 4202326 4185913 4156332 4114599 4060545 3992561 3910099 3815344 3711853
50322 3711853 3602473 3489261 3374738 3262170 3154729 3054935 2964658 2884899 2815488 2755729
50312 2755729 2705735 2666738 2639737 2624158 2618207 2619993 2627498 2637599 2646289 2650392 2648444 2639520 2622075
50299 2622075 2594836 2558173 2513400 2461002 2400831 2334065 2263644 2192314 2121334 2051543 1984362
50288 1984362 1920711 1859859 1800675 1743612 1690325 1641568 1596596 1554646 1515915 1480885 1449657
50277 1449657 1422287 1398961 1379320 1362211 1346644 1332725 1321302 1313122 1308672 1308248 1311476 1316960
50265 1316960 1323120 1329578 1337373 1347766 1361128 1377014 1394813 1414038 1434300 1455479 1477956 1502310
50253 1502310 1528596 1556144 1584237 1612841 1642475 1673536 1706051 1739973 1775126 1810619 1844754
50242 1844754 1876022 1904237 1930366 1955280 1978777 1999730 2016921 2029720 2038199 2042769 2043768 2041466
50230 2041466 2036350 2028992 2019462 2007229 1992056 1974625 1955778 1935350 1912533 1887311 1860659 1832998
50218 1832998 1803387 1770991 1736793 1702936 1670585 1639425 1609193 1580600 1554127 1528624 1502084
50207 1502084 1473765 1445078 1418333 1394983 1374979 1357270 1340645 1324328 1308184 1292592 1278271
50196 1278271 1266156 1257065 1251022 1247100 1244398 1243189 1244518 1248549 1253953 1259292 1264347 1269452 1274205 1277981
50182 1277981 1281576 1286987 1294989 1303844 1311183 1316540 1321150 1325590 1328667 1328751 1325473 1319856 1313314 1306805
50168 1306805 1300562 1294165 1286976 1278710 1269640 1260378 1251571 1243589 1236112 1228228 1219510 1210954 1204188 1199584
50154 1199584 1195883 1191931 1188048 1185181 1183443 1182414 1182408 1184365 1188462 1193689 1198888 1203509 1207311 1210147 1212311
50139 1212311 1214397 1216443 1217678 1217406 1215615 1212552 1208400 1203617 1198699 1193034 1184864 1173409 1160491 1148975
50125 1148975 1139727 1131034 1120948 1109284 1097167 1085507 1074300 1062959 1051035 1038901 1027700 1018158
50113 1018158 1009550 1000427 990338 980184 970880 962433 954510 947147 940567 934909 930457 927547 926000
50100 926000 925164 924648 924310 923409 920839 916601 912073 908120 903828 897874 890318 882186 874110 866496 860255
50085 860255 856070 853280 850688 848040 845626 842988 839656 836843 836534 838715 841328 843362 846046 850047
50071 850047 853395 853860 852158 851053 851892 853810 856020 859146 863945 870112 876959 884399 892703 901873 911688
50056 911688 921881 931916 941018 948834 955792 962532 969243 975797 982189 988499 994637 1000434 1005818 1010630
50042 1010630 1014480 1017277 1019881 1023634 1028934 1034545 1038708 1040838 1041867 1043181 1045763 1050319 1057476 1067295
50028 1067295 1078860 1090889 1102731 1114577 1126871 1139949 1154178 1170050 1187891 1207534 1228205
50017 1228205 1248699 1268048 1286323 1304591 1323839 1344250 1365800 1388965 1414030 1440099 1465779
50006 1465779 1490861 1516374 1542868 1569623 1595952 1622404 1650095 1679412 1709972 1741392 1773600
49995 1773600 1806666 1840652 1875345 1910093 1944621 1980233 2019262 2062666 2108908 2155983 2203875
49984 2203875 2254043 2307181 2362819 2421011 2482983 2549672 2620545 2694249 2769553 2844912 2917627
49973 2917627 2984265 3042122 3090043 3127941 3155865 3173946 3183292 3186646 3187475 3188010 3188275 3187136 3183782
49960 3183782 3177794 3168214 3153258 3130763 3098427 3054010 2996399 2926993 2849498 2767815 2684100 2598846
49948 2598846 2512533 2427030 2345438 2270448 2202710 2141022 2084343 2033161 1988312 1948847 1912020
49937 1912020 1875589 1839481 1804931 1772569 1741739 1711249 1680413 1649532 1619599 1591395 1564823
49926 1564823 1539288 1514574 1490806 1467657 1444348 1420803 1398166 1377561 1358667 1340018 1320579
49915 1320579 1300616 1281196 1263318 1247513 1233794 1221741 1210758 1200570 1191576 1184732 1180868 1179902
49903 1179902 1180695 1181981 1183465 1185779 1189315 1193425 1197026 1199784 1202495 1206330 1211843 1218596 1225623 1232293
49889 1232293 1238882 1246269 1255099 1265298 1276406 1288224 1301146 1315908 1333009 1352282 1373180 1395707
49877 1395707 1421040 1450844 1485756 1524653 1565703 1608298 1653924 1704935 1762368 1825189 1892097
49866 1892097 1963909 2043460 2133002 2232438 2340435 2456206 2579099 2706904 2835762 2961730
49856 2961730 3081719 3193307 3294993 3386895 3470170 3545594 3613690 3676207 3735821 3793618 3848021
49845 3848021 3896790 3938531 3971071 3989920 3990616 3972277 3937056 3886124 3818082 3731871 3629726
49834 3629726 3516323 3395888 3270965 3143251 3014416 2885946 2758766 2633434 2510882
49825 2510882 2392909 2281547 2177561 2079906 1987213 1899461 1817502 1741463 1670860 1606186 1548802
49814 1548802 1498613 1453230 1410474 1370684 1335321 1304001 1274483 1245396 1217549 1192171 1169055
49803 1169055 1146995 1125222 1103707 1082577 1061890 1041824 1022636 1004578 988076 973766 962000
49792 962000 952405 944164 936594 929347 922337 915872 910612 906971 904555 902572 900757 899445 898658 897632
49778 897632 895614 892864 890440 889167 889284 891021 894792 900400 906550 911884 916434 921370 927216 933082
49764 933082 938238 943713 951379 961618 972951 984261 996491 1011461 1029639 1049932 1071400 1094335
49752 1094335 1119647 1147925 1179394 1214273 1252789 1295045 1341067 1390878 1444578 1502663 1566191
49741 1566191 1636173 1712692 1795052 1882674 1975043 2070391 2165066 2254839 2336613 2408668 2469977
49730 2469977 2520092 2559415 2588974 2610211 2625531 2638473 2651992 2666308 2679152 2688107 2691699 2687990
49718 2687990 2673368 2643823 2597182 2533784 2455695 2366024 2268568 2167083 2064567 1963388 1865768
49707 1865768 1773579 1687843 1608954 1537266 1472961 1415536 1364130 1318383 1278301 1243107 1211031
49696 1211031 1180840 1153136 1129392 1109837 1093024 1077671 1064209 1053836 1046325 1039714 1032403 1024789
49684 1024789 1018215 1012914 1007989 1003193 999475 997408 996135 994544 992668 991119 989895 988724 987980 987969 987728
49669 987728 986064 983888 983943 987546 992831 997032 999361 1000565 1000673 998826 995118 991072 987937 985512 983047
49654 983047 980441 978019 975745 973312 970767 968618 967413 967454 968743 971024 973908 977110 980508 984039 987685
49639 987685 991419 994881 997319 998321 998551 999202 1000793 1003007 1005639 1008755 1011754 1013358 1013135 1012262 1012037
49624 1012037 1012453 1013006 1014015 1015814 1017218 1016332 1012850 1008203 1003426 998436 993748 991138 991553 993520 994820
49609 994820 994963 994867 994807 993954 991683 988267 984409 981048 979381 979980 981740 982648 981757 979751 977604 975611
49593 975611 973931 973127 973592 974948 976425 977483 977904 977762 977553 977878 978665 979036 978078 975525 971726 967525
49577 967525 964162 962590 962559 962946 963196 963801 965054 966131 966032 964927 963902 963591 963610 963193 961982 960408 959539
49560 959539 960336 962788 966095 969803 974280 979727 985406 990428 994860 999471 1004772 1010929 1018260 1027048
49546 1027048 1037024 1047587 1058374 1069182 1079798 1090588 1102817 1117395 1133497 1149398 1164643
49535 1164643 1180362 1197422 1215493 1234352 1254947 1278180 1303255 1328299 1352539 1377182 1403971
49524 1403971 1433306 1464024 1494842 1525778 1557977 1592241 1628127 1664749 1701991 1740463 1780586
49513 1780586 1822469 1866446 1912861 1961249 2010752 2061746 2116164 2175566 2239357 2305462 2372323
49502 2372323 2439839 2508801 2580029 2653735 2729213 2805333 2881705 2959178 3038855 3120943 3204792
49491 3204792 3289556 3374421 3458771 3542661 3626545 3709829 3790258 3865591 3935452 4000403 4059603
49480 4059603 4110817 4152908 4186991 4214584 4235721 4249515 4255616 4254295 4245890 4231259 4212240 4190581
49468 4190581 4166541 4139478 4109742 4079172 4049810 4023006 3999826 3981107 3966426 3953882 3941931
49457 3941931 3931353 3924704 3923850 3928544 3937440 3949882 3966380 3987686 4013800 4043821 4076402 4110290
49445 4110290 4144602 4178948 4213428 4248420 4284148 4320304 4356107 4390726 4423520 4453785 4480360
49434 4480360 4501603 4515741 4521229 4517030 4502868 4479228 4446811 4405838 4356012 4297233 4230062 4155281
49422 4155281 4073174 3983723 3887575 3786521 3682788 3578096 3473593 3370476 3270090 3173216
49412 3173216 3079596 2988485 2899560 2813188 2730051 2650849 2576198 2506295 2440598 2378259 2319025
49401 2319025 2263342 2211281 2161833 2113741 2066895 2022479 1981823 1945491 1913361 1885001 1859803
49390 1859803 1837142 1816670 1798239 1781557 1766215 1752136 1739600 1728684 1719058 1710466 1702985 1696580
49378 1696580 1690850 1685545 1680890 1677029 1673621 1670576 1668768 1669188 1671563 1674662 1678086 1682866 1690002 1699074
49364 1699074 1708855 1718786 1729296 1740962 1754104 1769179 1787008 1808293 1833047 1860447 1888884 1916066
49352 1916066 1939587 1958175 1972691 1985654 1999404 2014708 2031214 2048881 2068292 2089533 2111590
49341 2111590 2133472 2155479 2178703 2203605 2229842 2257254 2286008 2315638 2345009 2373724 2402765
49330 2402765 2433007 2463756 2493529 2521837 2549321 2576390 2602710 2628040 2652695 2676915 2700469
49319 2700469 2723228 2745623 2768153 2790752 2812921 2834299 2855043 2875957 2898256 2922720 2948768
49308 2948768 2974773 2999550 3023285 3046925 3071171 3096311 3122480 3149636 3177688 3207046 3238596
49297 3238596 3272592 3308096 3344205 3381343 3420492 3461562 3503698 3547084 3593005 3641759 3691855
49286 3691855 3742119 3793606 3848396 3907226 3969355 4034131 4101455 4170940 4242171 4316063 4394739
49275 4394739 4479363 4568905 4661636 4757180 4856382 4959754 5067023 5177977 5292712 5410704
49265 5410704 5530480 5650914 5772577 5897111 6025156 6155389 6285911 6416083 6546435
49256 6546435 6676984 6806563 6933967 7058852 7180762 7297864 7407557 7508143 7599065 7679710
49246 7679710 7749036 7806543 7852577 7887191 7909478 7918733 7915732 7902210 7879495 7848271 7809422 7764377
49234 7764377 7714597 7661209 7605161 7547459 7489277 7432178 7378218 7329416 7286840 7250211 7218496
49223 7218496 7191113 7168768 7152966 7144446 7142338 7145301 7153360 7167899 7189741 7217951 7250744 7286723
49211 7286723 7324901 7364353 7404658 7446101 7488718 7531443 7572609 7610803 7644705 7672726 7693459
49200 7693459 7705985 7709106 7701148 7681495 7651580 7613098 7565640 7507335 7437489 7357201 7267734 7169987
49188 7169987 7065798 6958056 6848765 6738130 6626068 6513442 6401133 6289048 6177024
49179 6177024 6065992 5957414 5852139 5750488 5652756 5558838 5467799 5378560 5290793 5204824
49169 5204824 5121231 5040963 4965141 4893989 4826394 4761118 4697969 4637426 4579829 4525644 4475705
49158 4475705 4430176 4387784 4347224 4309044 4275059 4245938 4220506 4197616 4177718 4162024 4150652
49147 4150652 4142213 4135116 4128903 4124162 4121290 4119697 4118591 4118272 4119909 4124034 4130146 4138054 4148549 4162090
49133 4162090 4177743 4194373 4212159 4231868 4253359 4276158 4301073 4329583 4361445 4394326 4426248
49122 4426248 4457302 4488500 4520070 4551737 4583941 4617896 4654558 4693934 4735063 4776423 4816871
49111 4816871 4856566 4896571 4937170 4977063 5014692 5050028 5084410 5118843 5153059 5186248 5218121
49100 5218121 5249032 5279425 5309639 5340179 5371657 5404181 5437021 5469378 5501476 5534407 5568745
49089 5568745 5603829 5638761 5673678 5709529 5746885 5785511 5824962 5865094 5906064 5948138 5991368
49078 5991368 6035080 6077949 6119008 6158393 6196750 6234303 6271041 6307393 6343839 6379963 6414680
49067 6414680 6447464 6478687 6508897 6538423 6567596 6596464 6624186 6649519 6672089 6692559 6711563
49056 6711563 6729266 6746017 6762366 6778017 6791633 6802175 6809903 6815764 6820569 6825089 6830163 6836063
49044 6836063 6842230 6848110 6853801 6859575 6865325 6870874 6876292 6881557 6886501 6891507 6897660 6905778 6915796 6927380
49030 6927380 6940391 6954389 6968498 6982313 6996209 7010314 7024066 7037396 7051216 7065753 7079458
49019 7079458 7090931 7101133 7112085 7123736 7133876 7141216 7146950 7152789 7158753 7163696 7167042 7169108 7170114
49006 7170114 7169603 7166875 7161720 7154596 7145957 7135403 7121914 7105283 7086731 7067453 7047010 7024048
48994 7024048 6998204 6970253 6940591 6908855 6875124 6840277 6804713 6767803 6729137 6689455 6649783
48983 6649783 6610442 6571462 6533213 6495860 6458741 6420951 6382212 6342725 6302870 6263653 6226839
48972 6226839 6193674 6163744 6135877 6109929 6086816 6066800 6048602 6030547 6012175 5994563 5979410
48961 5979410 5967880 5960006 5954972 5951948 5950573 5950666 5951967 5954478 5958676 5964837 5972489 5981074 5990782 6001906
48947 6001906 6013535 6024047 6033245 6043012 6054962 6067986 6079031 6086170 6090191 6093223 6096632 6100367 6103486
48934 6103486 6104573 6102180 6095793 6086610 6076792 6067628 6058557 6048073 6035352 6020901 6005945 5991459 5977495
48921 5977495 5963085 5946859 5928056 5906950 5884204 5860060 5834541 5808272 5782417 5757553 5733037
48910 5733037 5707866 5681954 5656144 5631037 5606178 5580611 5554042 5527257 5501418 5477124 5454255
48899 5454255 5432656 5412835 5395909 5382860 5373839 5368188 5365214 5364956 5367995 5374438 5383425 5393970 5405907
48886 5405907 5419321 5433335 5446684 5459968 5476206 5498119 5525345 5555327 5586530 5619613 5655628
48875 5655628 5694453 5735422 5778441 5823898 5872119 5923378 5977776 6034557 6092287 6150354 6209833
48864 6209833 6272162 6337357 6404156 6471630 6540031 6610285 6683309 6759600 6838782 6919611 7000973
48853 7000973 7082935 7166391 7251807 7338944 7427678 7518375 7611320 7706436 7803897 7904354 8008037
48842 8008037 8113997 8220819 8327949 8435908 8545237 8655758 8767086 8879469 8993626
48833 8993626 9109735 9226907 9343852 9459796 9574444 9687131 9796432 9900734 9999082 10091537
48823 10091537 10178955 10262276 10341481 10415079 10481053 10538569 10588437 10631659 10667917 10695775 10714146
48812 10714146 10723280 10724481 10718948 10706632 10686199 10656591 10618532 10573723 10522527 10463614 10396382 10322436
48800 10322436 10243771 10160718 10073073 9982062 9889149 9793578 9693536 9589778 9485565 9382284
48790 9382284 9277599 9169480 9060063 8953383 8850525 8749245 8647786 8546837 8447740 8350910
48780 8350910 8256550 8165385 8077947 7994220 7914519 7839578 7769174 7701862 7636992 7576055 7520844
48769 7520844 7470894 7424093 7379626 7339010 7303916 7274115 7248376 7226774 7211075 7202772 7201358 7204804
48757 7204804 7211427 7221052 7234628 7253208 7277330 7306934 7341521 7380501 7423582 7470762 7521861 7576221
48745 7576221 7633059 7691918 7752528 7814488 7877559 7942196 8009204 8078616 8149232 8219610 8289331
48734 8289331 8359071 8429539 8500662 8571717 8641989 8711154 8779122 8845755 8910927 8974933 9038696
48723 9038696 9103328 9169296 9235994 9302122 9366447 9428413 9488327 9547088 9605581 9664027 9721742
48712 9721742 9777530 9830431 9880195 9927028 9970689 10009827 10042519 10067683 10085718 10097360 10102036
48701 10102036 10097967 10084042 10061022 10030369 9992189 9945032 9887916 9822031 9750091 9674251 9595050
48690 9595050 9512162 9425442 9334924 9240477 9142360 9042185 8942515 8845021 8749256 8653634 8557377
48679 8557377 8461251 8366738 8275201 8187819 8105615 8029131 7958299 7892899 7832941 7778323 7728318
48668 7728318 7681904 7638928 7600800 7569578 7546017 7528602 7514900 7503849 7496193 7492614 7492266 7493818
48656 7493818 7497294 7503816 7513747 7526302 7541109 7558814 7579514 7601645 7623567 7645675 7669874 7697184
48644 7697184 7726988 7758544 7792115 7828141 7866160 7905257 7945233 7986768 8030648 8077278 8126913
48633 8126913 8179998 8237166 8298967 8365665 8437308 8514070 8596462 8685035 8779893 8880789 8987820
48622 8987820 9101697 9222947 9350890 9483679 9619494 9757556 9897876 10040097 10182943
48613 10182943 10324914 10465269 10603734 10739088 10868483 10988619 11097411 11194052 11277584 11346092
48603 11346092 11397534 11431027 11446971 11446229 11429467 11397045 11349206 11286298 11208954 11118087 11014785
48592 11014785 10900426 10776746 10645272 10506481 10360116 10206839 10049149 9890024 9730841
48583 9730841 9571291 9411203 9251536 9093276 8936197 8779292 8622198 8465763 8311412
48574 8311412 8160208 8012331 7867323 7725131 7586936 7454270 7327065 7203381 7081657
48565 7081657 6962495 6847385 6736458 6628703 6523893 6422601 6324408 6227889 6132944 6041437
48555 6041437 5954533 5870803 5788305 5707326 5629481 5554867 5481953 5410008 5339823 5271965 5206020
48544 5206020 5142046 5081144 5023809 4968917 4915273 4863292 4814223 4768461 4725511 4685099 4647359
48533 4647359 4612279 4579825 4550475 4524961 4503444 4485277 4469433 4455021 4441845 4430777 4423094
48522 4423094 4419011 4417450 4417714 4420674 4427486 4437675 4449484 4461862 4475224 4490441 4508036 4528324
48510 4528324 4551361 4576546 4602924 4630115 4658442 4688154 4719144 4751453 4785277 4820197 4854816
48499 4854816 4887428 4916920 4943188 4967017 4989324 5010017 5027942 5042635 5055778 5069884 5085632
48488 5085632 5101453 5115757 5128434 5140065 5150926 5161372 5172117 5183288 5193946 5203323 5211982 5221127
48476 5221127 5231203 5241796 5252462 5263078 5273766 5284893 5296771 5309000 5320763 5332072 5343890
48465 5343890 5356435 5368453 5379140 5389873 5402551 5416735 5430109 5441864 5454152 5469848 5490033
48454 5490033 5514169 5541656 5572450 5606918 5645852 5690112 5739587 5792888 5848732 5907441 5970467
48443 5970467 6038600 6111216 6187299 6266690 6350099 6438161 6530693 6626713 6724957 6824334 6924176
48432 6924176 7024319 7125046 7226621 7328531 7429124 7526096 7617299 7701115 7776514 7843254
48422 7843254 7901902 7952954 7995565 8027555 8047162 8054806 8052849 8043654 8028171 8006482 7979257 7948170
48410 7948170 7914927 7880382 7844772 7808332 7771170 7732799 7692379 7649313 7603104 7552828 7497687
48399 7497687 7438246 7376172 7312177 7244997 7173095 7096726 7017405 6935812 6851327 6763564 6673356
48388 6673356 6582120 6491144 6401699 6315025 6231765 6151959 6075942 6004656 5938751 5877947 5821741
48377 5821741 5770296 5724168 5683552 5648270 5618111 5592511 5570155 5549671 5530837 5514472 5501006
48366 5501006 5489759 5480039 5472428 5468280 5468019 5470594 5474833 5480726 5488952 5499528 5511704 5525116 5540241
48353 5540241 5557271 5575062 5591840 5606923 5621376 5636930 5654429 5673271 5692145 5710219 5727679
48342 5727679 5745230 5763286 5781807 5800479 5818537 5834681 5847976 5858917 5868673 5877159 5882894 5885297
48330 5885297 5886027 5887218 5889214 5891003 5891936 5891752 5889643 5884875 5878098 5870582 5862368 5852724 5842354 5833300
48316 5833300 5826122 5818828 5809418 5798266 5787183 5777348 5769155 5763059 5759301 5757266 5756100 5755605 5756027 5757489
48302 5757489 5760198 5764574 5770548 5777376 5784702 5793086 5802948 5813949 5826152 5840602 5857500 5874790 5890089
48289 5890089 5903514 5917169 5932228 5947996 5963466 5978133 5991333 6002482 6012263 6021991 6031382 6038465
48277 6038465 6042270 6044013 6044672 6042753 6035949 6024261 6010135 5995730 5981128 5965139 5946943 5926801
48265 5926801 5905819 5885189 5865224 5844959 5822895 5798330 5771936 5745232 5719503 5694970 5670740
48254 5670740 5645672 5619429 5592748 5566799 5542477 5520126 5499556 5480333 5462388 5446271 5432456
48243 5432456 5420611 5410258 5402111 5397978 5399101 5405159 5415104 5428292 5444491 5463426 5484839 5508561
48231 5508561 5534299 5561806 5591445 5623855 5658715 5694510 5729807 5763751 5794800 5820246 5838314
48220 5838314 5849908 5856770 5858237 5851262 5833560 5805292 5767504 5720446 5664106 5599208 5526784 5447500
48208 5447500 5362158 5272247 5179294 5084124 4987433 4890631 4795328 4702184 4610966 4521600 4434502
48197 4434502 4349935 4267730 4187891 4111055 4038082 3969352 3904553 3842968 3783892 3726904 3671943
48186 3671943 3619255 3569330 3522643 3479120 3437854 3397838 3359095 3322628 3289016 3257612 3227525
48175 3227525 3198806 3172014 3147067 3123414 3101135 3080902 3062746 3045788 3029500 3014526 3001805
48164 3001805 2991415 2982686 2975005 2968070 2961686 2955584 2949132 2941248 2931338 2920538 2911194 2904454 2899042
48151 2899042 2893038 2886057 2878826 2871440 2863427 2855114 2847467 2840531 2833349 2825518 2817436 2808822 2798604 2787016
48137 2787016 2776344 2768317 2761742 2753951 2743954 2732872 2721864 2711070 2700532 2690831 2682402 2675019 2668149
48124 2668149 2661346 2654401 2647854 2643196 2641722 2643088 2645763 2648858 2652699 2657632 2663346 2669739 2677351 2686389
48110 2686389 2696095 2705791 2715923 2727330 2739929 2752785 2765161 2776847 2787663 2797395 2806352 2815633
48098 2815633 2826550 2839684 2854228 2868265 2880118 2889569 2897427 2903992 2908800 2912219 2916296 2922903 2931481
48085 2931481 2939675 2946177 2952036 2959056 2967759 2977255 2986365 2994252 3000518 3005439 3009960 3014803 3019510 3023023
48071 3023023 3025481 3028871 3035263 3044622 3055016 3064806 3073818 3082304 3090050 3097266 3105296 3115046 3125222
48058 3125222 3133524 3139549 3145106 3151624 3158789 3166067 3173965 3182810 3191658 3199524 3206714 3213836 3220567 3226617
48044 3226617 3232960 3240538 3248406 3254741 3259301 3263293 3267278 3270989 3275098 3281189 3289683 3299548 3310617 3324459
48030 3324459 3342139 3362678 3384866 3409511 3438772 3474112 3515767 3563483 3617029 3676928 3745504
48019 3745504 3825686 3916530 4009510 4090355 4145445 4167665 4158362 4125650 4080407 4031805 3985056
48008 3985056 3942384 3904902 3872955 3845841 3822678 3803390 3787958 3775219 3763684 3753315 3745331
47997 3745331 3740114 3736293 3731951 3725942 3718052 3708719 3698640 3687853 3675231 3659579 3641028 3620550
47985 3620550 3598426 3574372 3548931 3523301 3497630 3470973 3443261 3415899 3389678 3363385 3335397
47974 3335397 3305647 3275047 3243859 3211729 3178778 3145620 3112601 3079812 3047567 3016113 2985085
47963 2985085 2953865 2922208 2890057 2857123 2823279 2789046 2755034 2720994 2685882 2648756 2609518
47952 2609518 2569182 2529543 2491870 2455534 2418619 2380300 2341774 2304344 2267753 2231405 2196150
47941 2196150 2163347 2132774 2102954 2073243 2044135 2015785 1987915 1961205 1937105 1915803 1895834
47930 1895834 1876280 1858061 1842271 1828353 1814786 1800759 1786476 1772602 1760094 1749743 1741057
47919 1741057 1732316 1722649 1713407 1706491 1701881 1697929 1693839 1690599 1689305 1689597 1690246 1690697 1691456 1693130 1695447
47904 1695447 1697335 1697871 1696968 1695045 1692319 1688830 1684964 1681200 1677309 1672561 1666883 1660909 1654522 1646349
47890 1646349 1635542 1623230 1611282 1600292 1589704 1579162 1568325 1555847 1540368 1522864 1506563
47879 1506563 1493910 1484607 1477023 1470332 1464408 1458590 1451809 1443687 1434890 1426698 1420702 1418181 1418734 1419804
47865 1419804 1418655 1415023 1411183 1409404 1410077 1412290 1415196 1418185 1420499 1421689 1422416 1424160 1427961 1433698
47851 1433698 1440498 1447390 1453494 1458173 1461482 1464343 1467767 1471812 1475499 1477818 1478582 1478194 1476868 1474397
47837 1474397 1470612 1465727 1460089 1453796 1446722 1438739 1429655 1419016 1406383 1392109 1377561 1364136 1351965
47824 1351965 1339901 1326957 1313476 1300625 1289019 1278287 1267944 1258321 1250467 1245381 1243408 1244084
47812 1244084 1246311 1248836 1250837 1252254 1253643 1255763 1259161 1263979 1270007 1276885 1284126 1291069 1297255 1303062
47798 1303062 1309623 1317719 1326991 1336545 1345893 1354837 1363118 1371074 1380153 1391433 1403674 1414246 1422249
47785 1422249 1429330 1436887 1443929 1448651 1450820 1451373 1450755 1449240 1448136 1448843 1450836 1452105 1451503 1449278 1445363
47770 1445363 1438943 1430250 1421332 1414118 1408572 1403302 1397204 1389928 1381586 1372816 1364629 1357677 1351970 1347534
47756 1347534 1344596 1342876 1341378 1339382 1336984 1334314 1331116 1327627 1324943 1323622 1322566 1320207 1316464 1312770
47742 1312770 1310588 1310606 1312789 1316242 1319312 1320908 1321762 1323578 1326968 1331020 1334888 1338882 1343757 1349625 1356046
47727 1356046 1362745 1369809 1377413 1385705 1394906 1405362 1417418 1431201 1446565 1463421 1482021 1502550
47715 1502550 1524335 1546019 1566817 1587145 1607717 1628656 1649989 1672308 1695940 1719799 1742148
47704 1742148 1762453 1781540 1799740 1815979 1829245 1840220 1850589 1860929 1869992 1876218 1879431 1880635
47692 1880635 1880296 1877428 1870797 1860609 1848346 1835051 1820637 1805080 1789232 1773842 1758534 1742544
47680 1742544 1725871 1708905 1691587 1673939 1656826 1641014 1625844 1610193 1594523 1580571 1568947
47669 1568947 1558527 1548513 1539546 1532196 1525679 1519008 1512359 1506403 1501237 1496996 1494792 1495778 1499510 1504208
47655 1504208 1508610 1512974 1518485 1526194 1536293 1547879 1559624 1571108 1583239 1597000 1612225 1628001
47643 1628001 1643679 1658841 1672812 1684981 1695339 1704015 1710641 1714915 1717469 1719278 1720417 1720079 1717615
47630 1717615 1712759 1705125 1694611 1682358 1670253 1659114 1648088 1636021 1622734 1608739 1594493 1580391
47618 1580391 1566880 1554123 1541949 1530503 1520539 1512799 1507404 1503975 1501884 1500260 1498432 1496762 1496546
47605 1496546 1498675 1502771 1508007 1514351 1522538 1533169 1546335 1561713 1578517 1595505 1611704 1627260
47593 1627260 1643352 1661275 1681646 1704055 1726985 1748370 1766834 1782587 1796822 1810329 1822989
47582 1822989 1834479 1844889 1854451 1862972 1869845 1874606 1877413 1878997 1880060 1880637 1880246 1878822 1877172 1876052
47568 1876052 1874926 1872218 1866990 1859902 1852294 1844642 1836380 1826932 1816436 1805315 1793571 1780753 1766536
47555 1766536 1751124 1735022 1718474 1701094 1682111 1661145 1638857 1616703 1595691 1575308 1553913
47544 1553913 1530436 1505525 1480828 1457286 1434561 1412061 1389976 1368918 1348848 1328854 1308058
47533 1308058 1286534 1265200 1244903 1225640 1206582 1186760 1165789 1144048 1122400 1101870 1083282
47522 1083282 1066751 1051455 1036306 1021065 1006557 993682 982614 973190 965635 960256 956515 952993
47510 952993 948489 943076 938097 935261 935466 938099 941494 944413 947072 950503 955255 961211 968348 976796
47496 976796 986061 995120 1003678 1012531 1022152 1031564 1039405 1045620 1051198 1056509 1060840 1063574 1064806 1064549
47482 1064549 1062104 1056873 1049382 1040941 1032507 1024164 1015522 1006198 996002 984963 973299 961279 949147
47469 949147 937075 924909 911996 897754 882630 867999 854769 842528 830539 819005 808475
47458 808475 798293 786966 774520 763413 756147 752421 749467 745009 739154 733397 728654 724586 720335
47445 720335 715603 711145 708281 707597 708090 708029 706681 704657 702635 700601 698728 698033 699333 702118 705345
47430 705345 708855 712958 716956 719407 719971 719841 719972 719995 719389 718692 718733 719412 720081 720560 720919 720736 719460 717262
47412 717262 714792 712397 710322 709308 709969 711628 712735 712558 711822 711715 713018 716146 721075 726979 732651
47397 732651 737516 741747 745569 749245 753656 759806 767482 775390 782881 790495 798482 806074 812866 819758
47383 819758 827575 835652 842856 849255 855736 862597 869584 876776 884230 891247 897244 903165 910748 920369
47369 920369 930734 940721 950485 960682 971718 984037 998188 1014122 1031055 1048251 1065451 1082676
47357 1082676 1100350 1119472 1140642 1162829 1184112 1203789 1222743 1241619 1259996 1277806 1296189
47346 1296189 1316067 1336768 1356797 1375006 1390268 1401244 1407912 1412615 1418046 1424299 1429097 1430811
47334 1430811 1430050 1428132 1425173 1420281 1412932 1403489 1392570 1380335 1366490 1350911 1334144 1317074 1300125
47321 1300125 1283141 1266193 1250016 1235324 1222004 1209273 1196371 1183109 1170217 1159241 1151272
47310 1151272 1145545 1140148 1134530 1130129 1127875 1126422 1124112 1121597 1120729 1121588 1122646 1123764 1126877 1133155
47296 1133155 1141180 1148869 1156022 1164091 1174267 1186377 1198913 1209630 1216937 1221248 1224325 1227037 1228778
47283 1228778 1229318 1229720 1230413 1229588 1224922 1216179 1204862 1191878 1176998 1160447 1143609 1127809 1113205
47270 1113205 1098988 1083995 1067227 1048642 1029672 1012331 997510 984386 971368 957260 941906
47259 941906 926464 912805 901789 892175 882043 871282 861639 854188 847887 841193 834154 828025 823414
47246 823414 819855 817053 815537 815742 816999 817916 817631 816399 815041 814179 814143 815226 817442 820002 821683 822000
47230 822000 821650 821438 821283 820759 820108 819926 820101 819922 819216 818595 818472 818521 818218 817263 815424 812715 809875 807927
47212 807927 807086 806875 807487 809914 814306 819250 823558 827912 833703 840867 847987 854215 860010 866043 872394
47197 872394 879030 886375 895041 905212 916229 926682 935523 943611 953461 966461 980806 993364 1003207
47184 1003207 1011875 1020274 1027192 1031630 1034966 1039456 1045478 1051506 1056291 1059824 1062383 1063860 1064198 1063660
47170 1063660 1062441 1060605 1058424 1056186 1053534 1049641 1044371 1038884 1034706 1032356 1031037 1029539 1027314 1024797
47156 1024797 1022899 1022286 1023146 1025394 1028698 1032351 1035711 1039080 1043620 1049881 1056849 1063215 1069266 1076718
47142 1076718 1086655 1098560 1111589 1125736 1141073 1156630 1171109 1184572 1198444 1213624 1229329
47131 1229329 1244210 1257976 1271203 1283740 1294223 1301537 1306175 1309608 1312561 1314461 1314443 1312222 1307908
47118 1307908 1301730 1294339 1286789 1279690 1272746 1265594 1258685 1252718 1247595 1242735 1238269 1235063 1233587 1233563
47104 1233563 1234874 1237907 1242663 1248379 1254635 1262218 1272172 1284403 1297909 1312176 1327628 1344749 1363457
47091 1363457 1383475 1404682 1426744 1448741 1469639 1489281 1508672 1529062 1550606 1571943 1591144
47080 1591144 1607014 1619482 1629028 1636163 1641414 1645356 1648384 1650497 1651204 1649424 1643874 1634308 1622480
47067 1622480 1611048 1601179 1591886 1582047 1572180 1563382 1555183 1545755 1534274 1522124 1511440 1503091 1496349
47054 1496349 1490102 1484018 1478723 1474968 1472598 1470498 1467801 1464764 1462098 1459825 1457555 1455690 1455352 1456881
47040 1456881 1459244 1461291 1462944 1464773 1467115 1470193 1474438 1479787 1484840 1487502 1486595 1482442 1475948 1467627
47026 1467627 1457602 1446079 1433402 1419676 1404567 1387672 1369297 1350753 1333442 1317518 1301911
47015 1301911 1285950 1270463 1256645 1244198 1231544 1217945 1204557 1192901 1182919 1173272 1163410 1154645
47003 1154645 1148875 1146525 1145953 1144910 1142511 1139890 1138978 1140697 1144268 1148137 1151371 1154189 1157436 1161808
46989 1161808 1167434 1173803 1180027 1185394 1189942 1194433 1199666 1205825 1212480 1219095 1225458 1231715 1238097 1244409
46975 1244409 1249714 1252895 1254071 1255209 1258592 1264426 1270631 1275517 1280057 1286674 1296034 1306117 1314668 1321689
46961 1321689 1328888 1337424 1347092 1357414 1368401 1380003 1391694 1403142 1414730 1426766 1438572 1449230
46949 1449230 1459124 1469796 1481974 1494531 1506105 1517127 1529325 1543364 1558086 1572279 1586273
46938 1586273 1601047 1616397 1630904 1643604 1655017 1666399 1678432 1690723 1702157 1711592 1718564 1723567
46926 1723567 1727506 1730936 1733935 1736565 1738928 1740678 1740982 1739325 1736164 1732521 1729122 1726126 1723442 1721006
46912 1721006 1718860 1717192 1716212 1715760 1715212 1714259 1713737 1715154 1719118 1724558 1729907 1734832 1740312 1747113 1754852
46897 1754852 1762863 1771377 1781154 1792169 1803451 1814278 1824881 1835669 1846382 1856446 1865632 1873795
46885 1873795 1880441 1885368 1889615 1894903 1901905 1909601 1916536 1922183 1926773 1930294 1932143 1931716 1929065 1925062
46871 1925062 1920971 1917685 1915220 1913078 1911103 1909686 1909096 1908959 1908669 1908118 1907745 1907992 1908984 1910708 1913287 1916900
46855 1916900 1921392 1926198 1930964 1936278 1943341 1952567 1962900 1972966 1982570 1992407 2002560 2012211 2020923
46842 2020923 2029386 2038488 2048375 2058794 2069832 2081754 2094488 2107641 2120650 2132659 2142728 2150593
46830 2150593 2156770 2161617 2164789 2165914 2165017 2161766 2155237 2145488 2134812 2126069 2119871 2114510 2108557 2102405
46816 2102405 2097143 2093259 2091083 2091422 2094921 2101273 2109697 2119719 2131051 2143313 2156560 2171463 2188047
46803 2188047 2204727 2219727 2233395 2247951 2264734 2282774 2300487 2317569 2334211 2349437 2361863
46792 2361863 2371973 2382059 2393474 2405237 2416014 2426250 2437142 2448562 2459564 2470470 2482623
46781 2482623 2496007 2508911 2520593 2532717 2547144 2563545 2580316 2596832 2613411 2629784 2645213
46770 2645213 2659783 2674090 2687732 2699538 2709418 2718614 2727749 2735878 2742026 2746572 2750442 2753889 2756880
46757 2756880 2759865 2763192 2766270 2768261 2769392 2770749 2772878 2775397 2778083 2781759 2787731 2796552 2807524 2819437
46743 2819437 2831860 2845658 2862045 2881137 2901786 2922811 2943943 2965506 2987823 3011275 3036236
46732 3036236 3062264 3087813 3111474 3133370 3154566 3175265 3194350 3210808 3224825 3237060 3247389
46721 3247389 3254906 3258896 3259397 3256885 3251924 3245208 3237554 3229519 3221044 3211734 3201584 3191270 3181534 3172327
46707 3172327 3162677 3151614 3139323 3127315 3117214 3109174 3101737 3093592 3085218 3077960 3071609 3064048 3054112
46694 3054112 3043661 3035467 3029587 3023469 3015672 3007793 3002173 2999272 2998310 2999155 3002092 3006466 3011212 3016556
46680 3016556 3023930 3034060 3046217 3059422 3073511 3088832 3105747 3124588 3145198 3166366 3186562
46669 3186562 3205643 3225036 3245854 3267690 3289742 3312177 3335367 3358392 3379520 3398122 3415101
46658 3415101 3431282 3446291 3459418 3470822 3481219 3490729 3498779 3505083 3510238 3515210 3520694 3527179 3535201
46645 3535201 3545017 3556039 3567013 3576910 3585554 3593443 3601264 3609666 3619078 3629277 3639071 3646665 3650600
46632 3650600 3650591 3647638 3643204 3637906 3630759 3619911 3604234 3584055 3560341 3533609 3503855 3471129 3435726
46619 3435726 3397979 3358279 3317154 3274976 3231754 3187566 3142923 3098244 3053237 3007532 2961858
46608 2961858 2917801 2876149 2836213 2797130 2759210 2723430 2690038 2658347 2627722 2598161 2569905
46597 2569905 2543018 2517464 2493236 2470183 2447976 2426500 2406191 2387840 2371986 2358533 2346919
46586 2346919 2336642 2327765 2321087 2317835 2318986 2324612 2333837 2345489 2358717 2372772 2386471 2398621
46574 2398621 2409285 2420070 2432510 2446342 2459830 2471488 2480893 2488109 2493297 2497027 2500075 2502517
46562 2502517 2503707 2503523 2502922 2502669 2502232 2500747 2498749 2498116 2500461 2506235 2515106 2526331 2538824 2551903
46548 2551903 2566316 2583746 2604860 2628474 2653025 2678171 2704270 2730859 2756595 2780521 2802467
46537 2802467 2822181 2838867 2851837 2860856 2865515 2865078 2859633 2850760 2840071 2827333 2811110 2791211
46525 2791211 2769328 2746895 2723531 2698538 2673019 2649141 2627569 2606885 2585646 2563886 2542244
46514 2542244 2520722 2498952 2477041 2455366 2433989 2412855 2392268 2372592 2353653 2334891 2315951
46503 2315951 2296926 2278367 2261249 2246327 2233059 2219761 2205490 2191253 2178625 2167738 2157622
46492 2157622 2148044 2139729 2132825 2126484 2120233 2114583 2110041 2106644 2104852 2105567 2108478 2111524 2113127 2114186
46478 2114186 2116751 2121440 2127377 2134180 2142509 2152620 2163758 2175412 2188219 2203072 2219948 2238002
46466 2238002 2256352 2274532 2292743 2311912 2333100 2356458 2381052 2405749 2429954 2453494 2476479
46455 2476479 2499545 2523712 2549625 2577293 2606855 2639077 2674561 2712718 2751985 2791065 2829636
$$ [...]
##END NTUPLES=NMR SPECTRUM
##END=
