##TITLE=coffee_type TOLI01-ROVE100E_90-10%
COFFEE_meoh_noesyp64 COFFEE_meoh {C:\Bruker\TOPSPIN} Administrator 12
##JCAMPDX= 6.0         $$ Bruker NMR JCAMP-DX V2.0
##DATA TYPE= NMR SPECTRUM
##DATA CLASS= NTUPLES
##ORIGIN= Bruker BioSpin GmbH
##OWNER= Administrator
$$ 1.72 TOPSPIN		Version 2.1
$$ 2012-05-18 15:48:31.776 -0700  Administrator@X
$$ Compression mode = diff/dup
##.OBSERVE FREQUENCY= 400.13188235
##.OBSERVE NUCLEUS= ^1H
##.ACQUISITION MODE= SIMULTANEOUS (DQD)
##.ACQUISITION SCHEME= undefined
##.AVERAGES= 64
##.DIGITISER RES= 22
##SPECTROMETER/DATA SYSTEM= spect
##.PULSE SEQUENCE= noesygpps1d.comp
##.SOLVENT NAME= COFFEE_meoh
##.SHIFT REFERENCE= INTERNAL, COFFEE_meoh, 1, 14.98061
##AUDIT TRAIL= $$ (NUMBER, WHEN, WHO, WHERE, PROCESS, VERSION, WHAT)
$$ ##TITLE= Audit trail, TOPSPIN		Version 2.1
$$ ##JCAMPDX= 5.01
$$ ##ORIGIN= Bruker BioSpin GmbH
$$ ##OWNER= Administrator
$$ $$ C:\Bruker\TOPSPIN/data/Administrator/nmr/12-COFFEE-2402/142/pdata/1/auditp.txt
$$ ##AUDIT TRAIL=  $$ (NUMBER, WHEN, WHO, WHERE, PROCESS, VERSION, WHAT)
(   1,<2012-02-24 23:22:28.078 -0500>,<Administrator>,<TOPSPIN>,<go>,<TOPSPIN 2.1>,
      <created by zg
	started at 2012-02-24 23:10:57.797 -0500,
	POWCHK enabled, PULCHK disabled,
       configuration hash MD5:
       B0 76 FB 9C 50 81 44 7D 18 B3 26 32 4E 60 AD 96
       data hash MD5: 64K
       2A D8 1D 8A 83 41 35 0C C0 26 1F 18 EE 74 B3 B4>)
(   2,<2012-02-24 23:22:30.797 -0500>,<Administrator>,<TOPSPIN>,<proc1d>,<TOPSPIN 2.1>,
      <Start of raw data processing
       efp LB = 0.3 FT_mod = 6 PKNL = 1 PHC0 = 0 PHC1 = 0 SI = 128K 
       data hash MD5: 128K
       83 F6 D9 7C BB E3 6B DF 64 1D A5 C5 E8 0E 75 2F>)
(   3,<2012-02-24 23:22:32.078 -0500>,<Administrator>,<TOPSPIN>,<proc1d>,<TOPSPIN 2.1>,
      <pk PHC0 = 23.73047 PHC1 = 0 
       data hash MD5: 128K
       DA F3 B4 CF 95 9D 67 0A 3E 7A 5F 06 BD BB DD FF>)
(   4,<2012-02-24 23:22:32.312 -0500>,<Administrator>,<TOPSPIN>,<proc1d>,<TOPSPIN 2.1>,
      <abs ABSG = 1 
       data hash MD5: 128K
       D4 BF C9 E9 20 08 11 75 8E CD 42 CC 71 D6 A6 90>)
(   5,<2012-02-24 23:22:32.391 -0500>,<Administrator>,<TOPSPIN>,<proc1d>,<TOPSPIN 2.1>,
      <abs ABSG = 2 
       data hash MD5: 128K
       7C EE CA 0D 53 75 65 E3 99 85 9A A2 59 6D 55 60>)
(   6,<2012-02-24 23:22:32.453 -0500>,<Administrator>,<TOPSPIN>,<proc1d>,<TOPSPIN 2.1>,
      <abs ABSG = 3 
       data hash MD5: 128K
       68 BD 0C C7 8C E7 D3 65 E9 6C DB 8C 48 8C B5 EA>)
(   7,<2012-02-24 23:22:32.687 -0500>,<Administrator>,<TOPSPIN>,<proc1d>,<TOPSPIN 2.1>,
      <abs ABSG = 4 
       data hash MD5: 128K
       75 8E 1F 01 E1 08 4C C4 C0 72 3B 18 4E 2D F3 99>)
(   8,<2012-02-24 23:22:32.750 -0500>,<Administrator>,<TOPSPIN>,<proc1d>,<TOPSPIN 2.1>,
      <abs ABSG = 5 
       data hash MD5: 128K
       3C 22 AF 60 E9 91 FF 6E A1 5B F5 31 A3 4B 0F 36>)
(   9,<2012-02-24 23:22:32.875 -0500>,<Administrator>,<TOPSPIN>,<audit>,<TOPSPIN 2.1>,
      <user comment:
       ICON-NMR User ID: Administrator
$$ [...]
150 150 150 150 150 150 150 150
##$TP07= 0
##$TPNAME0= <>
##$TPNAME1= <>
##$TPNAME2= <>
##$TPNAME3= <>
##$TPNAME4= <>
##$TPNAME5= <>
##$TPNAME6= <>
##$TPNAME7= <>
##$TPOAL= (0..7)
0.5 0.5 0.5 0.5 0.5 0.5 0.5 0.5
##$TPOFFS= (0..7)
0 0 0 0 0 0 0 0
##$TUNHIN= 0
##$TUNHOUT= 0
##$TUNXOUT= 0
##$USERA1= <user>
##$USERA2= <user>
##$USERA3= <user>
##$USERA4= <user>
##$USERA5= <user>
##$V9= 5
##$VALIST= <valist>
##$VCLIST= <CCCCCCCCCCCCCCC>
##$VD= 0
##$VDLIST= <DDDDDDDDDDDDDDD>
##$VPLIST= <PPPPPPPPPPPPPPP>
##$VTLIST= <TTTTTTTTTTTTTTT>
##$WBST= 1024
##$WBSW= 4
##$XGAIN= (0..3)
0 0 0 0
##$XL= 0
##$YL= 0
##$YMAX_a= 14144708
##$YMIN_a= -6473002
##$ZGOPTNS= <>
##$ZL1= 120
##$ZL2= 120
##$ZL3= 120
##$ZL4= 120
##$ABSF1= 14.98061
##$ABSF2= -5.57192
##$ABSG= 5
##$ABSL= 3
##$ALPHA= 0
##$AQORDER= 0
##$ASSFAC= 0
##$ASSFACI= 0
##$ASSFACX= 0
##$ASSWID= 0
##$AUNMP= <proc_prof1d_extract>
##$AXLEFT= 0
##$AXNAME= <>
##$AXNUC= <1H>
##$AXRIGHT= 0
##$AXTYPE= 0
##$AXUNIT= <>
##$AZFE= 0.1
##$AZFW= 0.1
##$BCFW= 0
##$BC_mod= 0
##$BYTORDP= 0
##$COROFFS= 0
##$CY= 15
##$DATMOD= 1
##$DC= 0
##$DFILT= <>
##$DTYPP= 0
##$F1P= 0
##$F2P= 0
##$FCOR= 0.5
##$FTSIZE= 131072
##$FT_mod= 6
##$GAMMA= 0
##$GB= 0
##$INTBC= 1
##$INTSCL= 1
##$ISEN= 128
##$LB= 0.3
##$LEV0= 0
##$LPBIN= 0
##$MAXI= 10000
##$MC2= 0
##$MEAN= 0
##$ME_mod= 0
##$MI= 0
##$NCOEF= 0
##$NC_proc= -3
##$NLEV= 6
##$NOISF1= 0
##$NOISF2= 0
##$NSP= 0
##$NTH_PI= 0
##$NZP= 0
##$OFFSET= 14.98061
##$PC= 1
##$PHC0= 23.73047
##$PHC1= 0
##$PH_mod= 1
##$PKNL= yes
##$PPARMOD= 0
##$PPDIAG= 0
##$PPIPTYP= 0
##$PPMPNUM= 2147483647
##$PPRESOL= 1
##$PSCAL= 4
##$PSIGN= 0
##$PYNMP= <proc.py>
##$REVERSE= no
##$SF= 400.13
##$SI= 131072
##$SIGF1= 0
##$SIGF2= 0
##$SINO= 400
##$SIOLD= 131072
##$SPECTYP= <>
##$SREGLST= <1H.CDCl3>
##$SSB= 0
##$STSI= 131072
##$STSR= 0
##$SW_p= 8223.68421052632
##$SYMM= 0
##$S_DEV= 0
##$TDeff= 65536
##$TDoff= 0
##$TI= <>
##$TILT= no
##$TM1= 0
##$TM2= 0
##$TOPLEV= 0
##$USERP1= <user>
##$USERP2= <user>
##$USERP3= <user>
##$USERP4= <user>
##$USERP5= <user>
##$WDW= 1
##$XDIM= 131072
##$YMAX_p= 518035029
##$YMIN_p= -336511487
##$CURPLOT= <Network HP LaserJet P1505>
##$CURPRIN= <$Network HP LaserJet P1505>
##$DFORMAT= <normdp>
##$LAYOUT= <+/1D_H.xwp>
##$LFORMAT= <normlp>
##$PFORMAT= <normpl>
##$SURQMSG= 1
$$ End of Bruker specific parameters
$$ ---------------------------------
##NTUPLES= NMR SPECTRUM
##VAR_NAME=  FREQUENCY,     SPECTRUM/REAL,   SPECTRUM/IMAG
##SYMBOL=    X,             R,               I
##VAR_TYPE=  INDEPENDENT,   DEPENDENT,       DEPENDENT
##VAR_FORM=  AFFN,          ASDF,            ASDF
##VAR_DIM=   131072,        131072,          131072
##UNITS=     HZ,            ARBITRARY UNITS, ARBITRARY UNITS
##FACTOR=    0.0627417313425165, 1,          1
##FIRST=     8223.62146879498, 3266,         -93986
##LAST=      0,             7184,            -94542
##MIN=       0,             -336511487,      0
##MAX=       8223.62146879498, 518035029,    0
$$ Real data points
##PAGE= N=1
##DATA TABLE= (X++(R..R)), XYDATA
$$ [...]
60654A373688k966k458k102j024J66l93k898n173n448m262k921j612n8J134J066
60639A344739J26k02Q18K148K176N71j551l318n269q226j1602j4023j5445j7260
60625A273682j9867k1650k1242j9575j8607j8856j9410j9491j8761j6809j3737
60614A065677j0882r554r139p735m685j439K44J36m57j3J893M102N059M692M416
60599A042315M936N196M440L984N418P899R075Q292P192P215Q148R196R946J0064
60585A143316R348Q355P954Q129Q265Q398Q966R434Q770P508P695J0183J3374
60572A259695J5432J6593J8292K0790K2784K3160K2395K2062K3106K4720K5163
60561A494192K3744K1395J8991J6008J1743O996L241O17j853m453o699q828j1535
$$ y = [1373688, 1370722, 1368264, 1366162, 1365138, 1365304, 1364911, 1362013, 1356840, 1351392, 1347130, 1344209, 1342597, 1342539, 1343673, 1344739, 1344865, 1344663, 1345481, 1347629, 1349805, 1350376, 1348825, 1345507, 1340238, 1332012, 1320410, 1306387, 1290942, 1273682, 1253815, 1232165, 1210923, 1191348, 1172741, 1153885, 1134475, 1114984, 1096223, 1079414, 1065677, 1054795, 1045241, 1036102, 1028367, 1023682, 1022243, 1022487, 1022623, 1022166, 1022153, 1024046, 1028148, 1033207, 1037899, 1042315, 1047251, 1052447, 1056887, 1060871, 1066289, 1074188, 1083263, 1091555, 1098747, 1105962, 1114110, 1123306, 1133252, 1143316, 1152664, 1161019, 1168973, 1177102, 1185367, 1193765, 1202731, 1212165, 1220935, 1228443, 1236138, 1246321, 1259695, 1275127, 1291720, 1310012, 1330802, 1353586, 1376746, 1399141, 1421203, 1444309, 1469029, 1494192, 1517936, 1539331, 1558322, 1574330, 1586073, 1593069, 1596310, 1596927, 1595074, 1590621, 1583922, 1575094, 1563559]
60548A563559j4150j4876j3371j1563j1144j1672j1768j0941r392p266n109m116
60536A438191m855o422p628q449r455j0467j0684r816q257o274l806j020J357
60523A352415K552K559K412L316N271O919P182O536N970N306L839K275K375M390
60509A413317O379O755O192O137O508O109M745L635L717M296L729J350j433k283
60495A469153n82J418Q91k261n309n820l880j092J443L543N477P871J1406J5938
60481A498196K0339K3753K6631L0106L4760M0323M6166N1784N7200O2857O8459
60470A960574P1959P0684O3896N3341M0981K7148J1741l742j6585k4979k9133
60459B225885l0391k9852k7715k3491j6889q605q0P529J3818J8661K1953K3938
$$ y = [1563559, 1549409, 1534533, 1521162, 1509599, 1498455, 1486783, 1475015, 1464074, 1454682, 1447416, 1442307, 1438191, 1433336, 1426914, 1419286, 1410837, 1401382, 1390915, 1380231, 1370415, 1362158, 1355884, 1352078, 1351058, 1352415, 1354967, 1357526, 1359938, 1363254, 1368525, 1375444, 1382626, 1389162, 1395132, 1400438, 1404277, 1406552, 1408927, 1413317, 1419696, 1426451, 1432643, 1438780, 1445288, 1451397, 1456142, 1459777, 1463494, 1467790, 1471519, 1472869, 1471436, 1469153, 1468571, 1469989, 1470880, 1468619, 1463310, 1457490, 1453610, 1452518, 1453961, 1457504, 1462981, 1470852, 1482258, 1498196, 1518535, 1542288, 1568919, 1599025, 1633785, 1674108, 1720274, 1772058, 1829258, 1892115, 1960574, 2032533, 2103217, 2167113, 2220454, 2261435, 2288583, 2300324, 2296582, 2279997, 2255018, 2225885, 2195494, 2165642, 2137927, 2114436, 2097547, 2088942, 2088862, 2096391, 2110209, 2128870, 2150823, 2174761]
60447B174761K5223K6199K6878K7461K8569L0753L4248L9185M5467N2569O0146
60436B571459O8752P9056R0411J01450J12330J25137J41334J59722J77668J93702
60426C821021K08345K23102K39353K57783K78206L00189L23957L50145L78205
60417F380306M05271M26311M34541M22215L82959L14887K21414J09254j3390j36825
60407H946943k50553l45805m17619m64346m86724m88219m74750m52075m23476
60398E143376l90622l55766l21759k90378k61862k35900k12146j90083j69487
60389B715373j50962j35094j21255j08059r5077q3292p3893o7106o2146n7807
60379A760682n3280m8793m5254m2969m1068l8539l5285l1760k8278k5304k3697
$$ y = [2174761, 2199984, 2226183, 2253061, 2280522, 2309091, 2339844, 2374092, 2413277, 2458744, 2511313, 2571459, 2640211, 2719267, 2809678, 2911128, 3023458, 3148595, 3289929, 3449651, 3627319, 3821021, 4029366, 4252468, 4491821, 4749604, 5027810, 5327999, 5651956, 6002101, 6380306, 6785577, 7211888, 7646429, 8068644, 8451603, 8766490, 8987904, 9097158, 9083768, 8946943, 8696390, 8350585, 7932966, 7468620, 6981896, 6493677, 6018927, 5566852, 5143376, 4752754, 4396988, 4075229, 3784851, 3522989, 3287089, 3074943, 2884860, 2715373, 2564411, 2429317, 2308062, 2200003, 2104926, 2021634, 1947741, 1880635, 1818489, 1760682, 1707402, 1658609, 1613355, 1570386, 1529318, 1490779, 1455494, 1423734, 1395456, 1370152, 1346455]
60368A346455k3787k4496k4125k1857j8119j4090j1283j0654j1313j0988q810
60357A166933o693o626p546o685l554m91P98J176J976K857K918K508K605L094
60343A153270L023K148J209Q36J072J899L468N553P308P919P368O468O200O902
60329A214643Q039Q782Q750Q107P083N747M290L158K635K444K001R54n97k255
60315A273781l653m722n711o648o853n421k447N20J774J131p4n57k20L59R26J608
60299A243793K246K312J595P21O98J996M036N693O375O585P111P806P802P048
60285A305817O771P759R013R172Q587Q630R324R312Q246P359P257O839N345L819
60271A413250L413L664L732M111N574P498Q782R594J0634J1498J1390J0614R682
$$ y = [1346455, 1322668, 1298172, 1274047, 1252190, 1234071, 1219981, 1208698, 1198044, 1186731, 1175743, 1166933, 1160240, 1153614, 1146068, 1139383, 1135829, 1135338, 1136136, 1137312, 1139288, 1142145, 1145063, 1147571, 1150176, 1153270, 1156293, 1158441, 1159650, 1160486, 1161558, 1163457, 1166925, 1172478, 1179786, 1187705, 1195073, 1201541, 1207741, 1214643, 1222682, 1231464, 1240214, 1248321, 1255404, 1261151, 1265441, 1268599, 1271234, 1273678, 1275679, 1276633, 1276036, 1273781, 1270128, 1265406, 1259695, 1253047, 1246194, 1240773, 1238326, 1238846, 1240620, 1241751, 1241677, 1241120, 1240900, 1241259, 1242185, 1243793, 1246039, 1248351, 1249946, 1250667, 1251365, 1253361, 1257397, 1263090, 1269465, 1276050, 1283161, 1290967, 1298769, 1305817, 1312588, 1320347, 1329360, 1338532, 1347119, 1355749, 1365073, 1374385, 1382631, 1389990, 1397247, 1404086, 1409431, 1413250, 1416663, 1420327, 1424059, 1428170, 1433744, 1441242, 1450024, 1459618, 1470252, 1481750, 1493140, 1503754, 1513436]
60258A513436P771M013l62l406n309p562r733r936q529q307j0219j1689j0514
60245A439654q071p009p621q227p770o431m710l213k635k828k771k027j189l53
60231A374799J281L502M475L321J772J870L318M618N510O642P806Q302Q454R201
60217A444871J0549J1726J2318J2280J1527J0585J0783J2589J4560J5299J5519
60206A582606J6779J8981K0802K1964K3327K5175K7087K9266L2396L6237L9882
60195A874502M3261M7012N0900N3916N6078N8673O2544O7374P2953P9729Q7716
60184B554658R5944J03729J11527J19944J28515J36200J42717J48770J54899J60483
60174C857386J64130J65082J63912J61496J57552J50904J41086J28847J15028
$$ y = [1513436, 1521207, 1525220, 1524858, 1521452, 1516143, 1508581, 1498848, 1488912, 1480383, 1472076, 1461857, 1450168, 1439654, 1431583, 1424574, 1416953, 1408726, 1400956, 1394525, 1389815, 1386602, 1383967, 1381139, 1378368, 1376341, 1375152, 1374799, 1376080, 1379582, 1384057, 1387378, 1389150, 1391020, 1394338, 1398956, 1404466, 1411108, 1418914, 1427216, 1435670, 1444871, 1455420, 1467146, 1479464, 1491744, 1503271, 1513856, 1524639, 1537228, 1551788, 1567087, 1582606, 1599385, 1618366, 1639168, 1661132, 1684459, 1709634, 1736721, 1765987, 1798383, 1834620, 1874502, 1917763, 1964775, 2015675, 2069591, 2125669, 2184342, 2246886, 2314260, 2387213, 2466942, 2554658, 2650602, 2754331, 2865858, 2985802, 3114317, 3250517, 3393234, 3542004, 3696903, 3857386, 4021516, 4186598, 4350510, 4512006, 4669558, 4820462, 4961548, 5090395, 5205423]
60165E205423R9967Q4191O8422N2499L5553J7961J846j1150k1352k9440l4765
60154E469155l6630l5993l4301l1368k5760j6660m299J0473K5881L9630N1316
60143E411444O3467P8479R5323J11017J24435J36535J47361J55285J59285J59906
60133F642537J57581J51560J41015J26042J07446Q6589O5087M3521K0871l374
60123G538875k7283m8309o6379q2938r7346j06803j10152j09288j06033r9765
60113F684579q9117p4293n6628l7365j7751R83J8742L6534N4523P1134Q4810R5521
60101F771672J03825J09434J11536J09658J03634R3525Q0122O4725M8091L0580
60091G626802J3619l36j0035j6617k1688k5057k5077k0457j1083K312J8583L6767
$$ y = [5205423, 5305390, 5389581, 5458003, 5510502, 5546055, 5564016, 5565862, 5554712, 5533360, 5503920, 5469155, 5432525, 5396532, 5362231, 5330863, 5305103, 5288443, 5284144, 5294617, 5320498, 5360128, 5411444, 5474911, 5553390, 5648713, 5759730, 5884165, 6020700, 6168061, 6323346, 6482631, 6642537, 6800118, 6951678, 7092693, 7218735, 7326181, 7412770, 7477857, 7521378, 7542249, 7538875, 7511592, 7463283, 7396904, 7313966, 7216620, 7109817, 6999665, 6890377, 6784344, 6684579, 6595462, 6521169, 6464541, 6427176, 6409425, 6410408, 6429150, 6465684, 6520207, 6591341, 6676151, 6771672, 6875497, 6984931, 7096467, 7206125, 7309759, 7403284, 7483406, 7548131, 7596222, 7626802, 7640421, 7640085, 7630050, 7613433, 7591745, 7566688, 7541611, 7521154, 7510071, 7512383, 7530966, 7567733]
60079G567733N6764P9020J03413J29107J55758J84013K14352K46138K78279L10293
60069I324870L42348L74564M06503M36916M64160M87265N06231N20516N27824
60060A3391197N25654N13717M93458M65361M28438L82587L29707K71709K08953
60051A7010781J41431P0368k303p5140j46930k15843k79459l35288l81092m15369
60041A5371156m37750m48386m47266m35031m14009l86939l54666l16781k74512
60032A1855816k30990j88117j45183j01571n8910j9351J6561M8676P5263R4112
60022A1346306J04870J08683J06047R6463P9862N7326L0539J453k7848n5768q1537
60011A1766396j04590j24416j41558j57780j74163j89650k02419k12083k19511
$$ y = [7567733, 7624497, 7703517, 7806930, 7936037, 8091795, 8275808, 8490160, 8736298, 9014577, 9324870, 9667218, 10041782, 10448285, 10885201, 11349361, 11836626, 12342857, 12863373, 13391197, 13916851, 14430568, 14924026, 15389387, 15817825, 16200412, 16530119, 16801828, 17010781, 17152212, 17222580, 17220277, 17145137, 16998207, 16782364, 16502905, 16167617, 15786525, 15371156, 14933406, 14485020, 14037754, 13602723, 13188714, 12801775, 12447109, 12130328, 11855816, 11624826, 11436709, 11291526, 11189955, 11131045, 11111694, 11128255, 11176931, 11252194, 11346306, 11451176, 11559859, 11665906, 11762369, 11842231, 11899557, 11930096, 11931549, 11903701, 11847933, 11766396, 11661806, 11537390, 11395832, 11238052, 11063889, 10874239, 10671820, 10459737, 10240226]
60002A0240226k24946k27469k26152k20885k12200k00883j87535j72019j53717
59993H414420j32776j10527q8041o5042m1013j6797N961K6735M6547O6596Q6984
59982H193047J06681J23971J37153J45371J48827J47850J41958J30311J12953
59973I388122R1254O7054M1458J4303j4975m5749p5734j02700j26240j46864j63799
59962H926130j75214j80685j81732j79286j72357j60233j44541j27669j10171
59953G494242r1148p0486m9244k8276p621J3058L4316N6715P9728J01560J21265
59942G654109J40419J61132J82763K02070K16583K26111K30706K28876K18952
59933I461721K01321J78243J51748J22424R0213N5761K0711j3312m5826p7243
$$ y = [10240226, 10015280, 9787811, 9561659, 9340774, 9128574, 8927691, 8740156, 8568137, 8414420, 8281644, 8171117, 8083076, 8018034, 7977021, 7960224, 7966185, 7992920, 8039467, 8106063, 8193047, 8299728, 8423699, 8560852, 8706223, 8855050, 9002900, 9144858, 9275169, 9388122, 9479376, 9546430, 9587888, 9602191, 9587216, 9541467, 9465733, 9363033, 9236793, 9089929, 8926130, 8750916, 8570231, 8388499, 8209213, 8036856, 7876623, 7732082, 7604413, 7494242, 7403094, 7332608, 7283364, 7255088, 7247467, 7260525, 7294841, 7351556, 7431284, 7532844, 7654109, 7794528, 7955660, 8138423, 8340493, 8557076, 8783187, 9013893, 9242769, 9461721, 9663042, 9841285, 9993033, 10115457, 10205670, 10261431, 10282142, 10268830, 10223004, 10145761]
59923A0145761j07413j34777j57197j73360j82992j86267j83572j75651j63281
59914H681251j46802j26461j03200p8513n3466k8261k965K1800M5281O7458Q8882
59903H365004J09371J27315J40951J50356J57339J62903J65642J63621J57152
59894I699654J48379J38329J26074J11376R6503Q4275P5168O7651O0970N6464
59884A0664843N6185O1238P1709Q7475J08398J33907J62977J94946K30218K69420
59874A2041316L11615L54026L94223M31851M67148M98218N21196N32993N32292
59865A6084878N17565M85824M34483L63643K75932J75051O5441m7478j57797k59943
59855A7937599l49005m21226m74910n10386n28810n31562n20999n00559m73135
$$ y = [10145761, 10038348, 9903571, 9746374, 9573014, 9390022, 9203755, 9020183, 8844532, 8681251, 8534449, 8407988, 8304788, 8226275, 8172809, 8144548, 8141583, 8163383, 8208664, 8276122, 8365004, 8474375, 8601690, 8742641, 8892997, 9050336, 9213239, 9378881, 9542502, 9699654, 9848033, 9986362, 10112436, 10223812, 10320315, 10404590, 10479758, 10547409, 10608379, 10664843, 10721028, 10782266, 10853975, 10941450, 11049848, 11183755, 11346732, 11541678, 11771896, 12041316, 12352931, 12706957, 13101180, 13533031, 14000179, 14498397, 15019593, 15552586, 16084878, 16602443, 17088267, 17522750, 17886393, 18162325, 18337376, 18402817, 18355339, 18197542, 17937599, 17588594, 17167368, 16692458, 16182072, 15653262, 15121700, 14600701, 14100142, 13627007]
59846A3627007m39978m01664l59345l14513k68325k21936j76641j32891q9985
59837A1221729m7566o688L1552O7539J02005J33805J60143J78929J89820J92906
59827A2224174J87345J71601J44518J06101N7756J969n8495j21094j83124k41297
59817A2289454k92235l33558l64483l85604l98102m02901m00512l91764l78177
59808H942118l61049l40588l16897k91514k66749k43475k20842j98252j76343
59799F526409j55718j36215j18065j02380q9779p9575p1098o4561n9967n6356
59789E592695n3108n0679m9096m6940m3091l8308l3774k9140k3621j8209j5124
59778E191605j5394j8427k3592l0796l9543m8674n7108o3961o8169o9012o7054
$$ y = [13627007, 13187029, 12785365, 12426020, 12111507, 11843182, 11621246, 11444605, 11311714, 11221729, 11174163, 11167475, 11199027, 11266566, 11368571, 11502376, 11662519, 11841448, 12031268, 12224174, 12411519, 12583120, 12727638, 12833739, 12891495, 12893464, 12834969, 12713875, 12530751, 12289454, 11997219, 11663661, 11299178, 10913574, 10515472, 10112571, 9712059, 9320295, 8942118, 8581069, 8240481, 7923584, 7632070, 7365321, 7121846, 6901004, 6702752, 6526409, 6370691, 6234476, 6116411, 6014031, 5924252, 5844677, 5773579, 5709018, 5649051, 5592695, 5539587, 5488908, 5439812, 5392872, 5349781, 5311473, 5277699, 5248559, 5224938, 5206729, 5191605, 5176211, 5157784, 5134192, 5103396, 5063853, 5015179, 4958071, 4894110, 4825941, 4756929, 4689875]
59767D689875o3745n9977n5546m9801m2316l3222k3433j4134n565L254J3002K2821
59755D381213L1189L7612M2814M7787N3253N9694O7200P5438Q3804R1106R5270
59744E066380R4639Q9922Q3758P7820P1388O3211N3468M3258L3612K5872K1515
59733E724843K0447K0836K1850K5205L2655M3234N4575O5933P8344R2791J09736
59722F290449J29663J52480J77102K02908K30720K61106K92856L24593L56635
59713H418512L89474M21469M49775M72059M84921M81546M53826L97180L12408
59704A2281170K04666Q3483l7371j44145k28862k89852l27601l42904l38817l20840
59694A0538927k93850k60649k23900j86880j51269j16284q1180m6943j4705J5677
$$ y = [4689875, 4626130, 4566153, 4510607, 4460806, 4418490, 4385268, 4361835, 4347701, 4342136, 4345390, 4358392, 4381213, 4412402, 4450014, 4492828, 4540615, 4593868, 4653562, 4720762, 4796200, 4880004, 4971110, 5066380, 5161019, 5250941, 5334699, 5412519, 5483907, 5547118, 5600586, 5643844, 5677456, 5703328, 5724843, 5745290, 5766126, 5787976, 5813181, 5845836, 5889070, 5943645, 6009578, 6087922, 6180713, 6290449, 6420112, 6572592, 6749694, 6952602, 7183322, 7444428, 7737284, 8061877, 8418512, 8807986, 9229455, 9679230, 10151289, 10636210, 11117756, 11571582, 11968762, 12281170, 12485836, 12569319, 12531948, 12387803, 12158941, 11869089, 11541488, 11198584, 10859767, 10538927, 10245077, 9984428, 9760528, 9573648, 9422379, 9306095, 9224915, 9177972, 9163267, 9178944]
59684I178944M4464P1177R5975J20409J45802J72079J99039K27170K56323K85166
59674A0796548L13349L42854L75766M11559M48148M84990N23729N65970O11524
59665A4874437O58894P06751P54791Q03428Q52489R00158R43385R79355J006227
59656B2479915J022617J027258J019539J000032R70469R33640Q93344Q54045Q20376
59647C1021235P96668P85724P87023P96655Q09864Q23165Q33165Q34605Q21570
59638C8309674P90482P40484O71235N82482M76242L57852K34195J11863k851j03907
59628D2167751j86458k47497k85482l00164k92773k65272k19279j56450p9542
59619D0134834Q182J04636K08823L19250M33770N50836O69231P86065Q96204R93843
$$ y = [9178944, 9223408, 9294585, 9390560, 9510969, 9656771, 9828850, 10027889, 10255059, 10511382, 10796548, 11109897, 11452751, 11828517, 12240076, 12688224, 13173214, 13696943, 14262913, 14874437, 15533331, 16240082, 16994873, 17798301, 18650790, 19550948, 20494333, 21473688, 22479915, 23502532, 24529790, 25549329, 26549361, 27519830, 28453470, 29346814, 30200859, 31021235, 31817903, 32603627, 33390650, 34187305, 34997169, 35820334, 36653499, 37488104, 38309674, 39100156, 39840640, 40511875, 41094357, 41570599, 41928451, 42162646, 42274509, 42271658, 42167751, 41981293, 41733796, 41448314, 41148150, 40855377, 40590105, 40370826, 40214376, 40134834, 40143016, 40247652, 40456475, 40775725, 41209495, 41760331, 42429562, 43215627, 44111831, 45105674]
59609D5105674J073440J129095J154380J142915J088087R82754Q21811O06302
59601E3104458L44451M9075k64308n77304q70147j126134j334804j491137j593703
59592D6240447j644676j649990j617847j557106j477044j387008j295279j209166
59584C4402331j136726j086828j065801j073836j104571j147296j189720j220962
59576B5376591j234255j227520j201691j159222j103881j040224r72222r02731
59568A6534845q34164p68446p06099o46710n90605n38894m91755m48256m08157
59559A1101759l72190l39868l08927k78076k48920k23920k03521j86405j71548
59550H768384j58819j48288j40187j35094j33277j34116j36651j40177j44065
$$ y = [45105674, 46179114, 47308209, 48462589, 49605504, 50693591, 51676345, 52498156, 53104458, 53448909, 53497984, 53233676, 52656372, 51786225, 50660091, 49325287, 47834150, 46240447, 44595771, 42945781, 41327934, 39770828, 38293784, 36906776, 35611497, 34402331, 33265605, 32178777, 31112976, 30039140, 28934569, 27787273, 26597553, 25376591, 24142336, 22914816, 21713125, 20553903, 19450022, 18409798, 17437576, 16534845, 15700681, 14932235, 14226136, 13579426, 12988821, 12449927, 11958172, 11509916, 11101759, 10729569, 10389701, 10080774, 9802698, 9553778, 9329858, 9126337, 8939932, 8768384, 8609565, 8461277, 8321090, 8185996, 8052719, 7918603, 7781952, 7641775, 7497710]
59541G497710j47683j50786j53300j54599j53834j51031j46734j40600j31719
59532F167424j20578j09143r8562q8276p7762o7451n7363m6658l5524k5653j7656
59521E422798r651R6J0616J9800K7281L4023M0095M4790M8392N2096N6249O0020
59509E806605O2836O5140O7818P1606P6931Q3689R1374R9799J09263J19844J31258
59498F786163J43753J58147J74441J91384K08076K25175K43655K63360K83577
59489H677731L04219L25349L46107L65107L81580L95313M05805M12304M14438
59480A2027953M12285M05714L94003L76241L52430L24458K95259K66159K35554
59471A5090056K01446J64765J28796R5782O6095M0563K1332R797N643Q560J8940
$$ y = [7497710, 7350027, 7199241, 7045941, 6891342, 6737508, 6586477, 6439743, 6299143, 6167424, 6046846, 5937703, 5839141, 5750865, 5673103, 5605652, 5548289, 5501631, 5466107, 5440454, 5422798, 5413147, 5413243, 5423859, 5443659, 5470940, 5504963, 5545058, 5589848, 5638240, 5690336, 5746585, 5806605, 5869441, 5934581, 6002399, 6074005, 6150936, 6234625, 6325999, 6425798, 6535061, 6654905, 6786163, 6929916, 7088063, 7262504, 7453888, 7661964, 7887139, 8130794, 8394154, 8677731, 8981950, 9307299, 9653406, 10018513, 10400093, 10795406, 11201211, 11613515, 12027953, 12440238, 12845952, 13239955, 13616196, 13968626, 14293084, 14588343, 14854502, 15090056, 15291502, 15456267, 15585063, 15680845, 15746940, 15787503, 15808835, 15818632, 15824275, 15832835, 15851775]
59460A5851775L6027N7409Q1346J07699J35329J60297J78027J85740J81541J62908
59450A7138098J28119P8352J6949n2662j27551k05013k82890l58922m28987m87646
59440A5417847n31705n61841n79467n83940n74584n53826n25933m93561m57458
59431A0555532m18736l79331l40571l02919k66789k32417j99600j68583j40229
59422H106357j14126q7954o0317l2891p812J5870M0808O7311R3139J17038J40048
59411H277471J63401J87041K10444K32990K53359K70281K83994K95333L03058
59402A0477372L03664K94335K74837K46068K08078J60328J03296L9387k7436r3045
59392A1986884j54799k11827k63425l07677l42347l66716l81807l89121l89868
$$ y = [15851775, 15887802, 15945211, 16026557, 16134256, 16269585, 16429882, 16607909, 16793649, 16975190, 17138098, 17266217, 17344569, 17361518, 17308856, 17181305, 16976292, 16693402, 16334480, 15905493, 15417847, 14886142, 14324301, 13744834, 13160894, 12586310, 12032484, 11506551, 11012990, 10555532, 10136796, 9757465, 9416894, 9113975, 8847186, 8614769, 8415169, 8246586, 8106357, 7992231, 7904277, 7843960, 7811069, 7803257, 7819127, 7859935, 7927246, 8020385, 8137423, 8277471, 8440872, 8627913, 8838357, 9071347, 9324706, 9594987, 9878981, 10174314, 10477372, 10781036, 11075371, 11350208, 11596276, 11804354, 11964682, 12067978, 12107365, 12079929, 11986884, 11832085, 11620258, 11356833, 11049156, 10706809, 10340093, 9958286, 9569165, 9179297]
59383I179297l85028l75325l61312l43980l24879l05068k84557k63297k42145
59374F293706k22132k03487j85909j69248j53300j37691j22541j08483r5522q2848
59364D812545p0297n8822m8860l9386k9455j9530j0479k361N021J1648J8082K5329
59352D593435L3236M0602M7456N5105O2849O7183O6145O2201N8945N7206N6772
59341E201135N9542O7535P9346R1936J04924J19653J34776J46461J53222J57584
59331F316114J62865J70968J83316K00837K22336K45452K69975K98046L30562
59322H400471L65700M01713M39041M78754N20757N64413O09247O54178O97370
59313A3131644P37400P73106Q01706Q18699Q20617Q07068P79697P40458O91469
$$ y = [9179297, 8794269, 8418944, 8057632, 7713652, 7388773, 7083705, 6799148, 6535851, 6293706, 6071574, 5868087, 5682178, 5512930, 5359630, 5221939, 5099398, 4990915, 4895393, 4812545, 4742248, 4683426, 4634566, 4595180, 4565725, 4546195, 4535716, 4533355, 4538376, 4550024, 4568106, 4593435, 4626671, 4667273, 4714729, 4769834, 4832683, 4899866, 4966011, 5028212, 5087157, 5144363, 5201135, 5260677, 5328212, 5407558, 5499494, 5604418, 5724071, 5858847, 6005308, 6158530, 6316114, 6478979, 6649947, 6833263, 7034100, 7256436, 7501888, 7771863, 8069909, 8400471, 8766171, 9167884, 9606925, 10085679, 10606436, 11170849, 11780096, 12434274, 13131644, 13869044, 14642150, 15443856, 16262555, 17083172, 17890240, 18669937, 19410395, 20101864]
59304B0101864O35326N74690N11979M49666L90067L34502K82921K34181J86232
59295B3701428J36819Q4954L1134k4745q4752j50649k20897k91307l58155m19235
59285B2404595m72850n17919n54975n85361o09617o27994o41890o52770o59986
59276A7081233o61490o56509o45701o29266o07092n80491n51524n20593m86806
59267A1741761m50750m14625l79507l44788l10597k78464k48888k20410j91912
59258H901820j64157j38359j14843r3493p3924n4807l4775j4524L708J9040L2676
59247H268362M5294N5678O2582O6229O7245O5631O1409N4797M5412L2804J8219
59236H843662M028r003k2053l5319m6648n3989n7448n7995n5639m9922m0955k9166
$$ y = [20101864, 20737190, 21311880, 21823859, 22273525, 22663592, 22998094, 23281015, 23515196, 23701428, 23838247, 23923201, 23954335, 23929590, 23844838, 23694189, 23473292, 23181985, 22823830, 22404595, 21931745, 21413826, 20858851, 20273490, 19663873, 19035879, 18393989, 17741219, 17081233, 16419743, 15763234, 15117533, 14488267, 13881175, 13300684, 12749160, 12228567, 11741761, 11291011, 10876386, 10496879, 10152091, 9841494, 9563030, 9314142, 9093732, 8901820, 8737663, 8599304, 8484461, 8390968, 8317044, 8262237, 8227462, 8212938, 8216646, 8235686, 8268362, 8313656, 8369334, 8431916, 8498145, 8565390, 8631021, 8692430, 8747227, 8792639, 8825443, 8843662, 8847690, 8838687, 8816634, 8781315, 8734667, 8680678, 8623230, 8565235, 8509596, 8459674, 8418719, 8389553]
59224H389553j5085O7J5050L0352M7860O8223Q9861J10973J30898J48988J64068
59213I180808J76063J86466J95947K02688K04173J99649J89821J75037J54735
59204A0865387J28083R4881N6639J7131j9201m9755p4039r1966j03537j10074
59194A0713549j13760j15322j13905j09832j05668j03722j03939j05106j06703
59185I735592j08673j10723j12681j14558j15569j14327j10434j04629r6966q6362
59175H660670p2543n6827m0123k1498L76K5594N3516Q3732J15749J48931J83443
59164I081020K20163K59053K98707L37876L76180M12703M44928M69587M83613
59155A2383830M84243M69651M39708L94817L34079K56521J64401O3292m1521j46781
$$ y = [8389553, 8374468, 8374535, 8389585, 8419937, 8467797, 8536020, 8625881, 8736854, 8867752, 9016740, 9180808, 9356871, 9543337, 9739284, 9941972, 10146145, 10345794, 10535615, 10710652, 10865387, 10993470, 11088351, 11144990, 11162121, 11142920, 11093165, 11019126, 10927160, 10823623, 10713549, 10599789, 10484467, 10370562, 10260730, 10155062, 10051340, 9947401, 9842295, 9735592, 9626919, 9516196, 9403515, 9288957, 9173388, 9059061, 8948627, 8843998, 8747032, 8660670, 8588127, 8531300, 8491177, 8469679, 8470055, 8495649, 8549165, 8632897, 8748646, 8897577, 9081020, 9301183, 9560236, 9858943, 10196819, 10572999, 10985702, 11430630, 11900217, 12383830, 12868073, 13337724, 13777432, 14172249, 14506328, 14762849, 14927250, 14990542, 14949021, 14802240]
59145A4802240k48889l42415m22429m86765n34858n66021n80313n79885n68106
59136A0472559n48026n22126m92258m59146m23224l86493l52087l21328k92764
59127F675107k64847k38055k13679j92011j72659j55288j39322j24067j09714
59118E065465r6980q5507p4149o2977n3059m4057l4303k3712j4182o363J476J0211
59106D581863J8103K3781K8781L5331M3342N1266N8306O4442O9853P5580Q3142
59095E133790R2227J00377J06127J10703J15494J19858J22643J23802J23043J19012
59085F267076J11482J02414R3031Q1795O7146N0436L4105J8652L487j0742k2777
59074F796105l2430l9931m4764m6702m6655m5012m0748l3546k4981j6039n434
$$ y = [14802240, 14553351, 14210936, 13788507, 13301742, 12766884, 12200863, 11620550, 11040665, 10472559, 9924533, 9402407, 8910149, 8451003, 8027779, 7641286, 7289199, 6967871, 6675107, 6410260, 6172205, 5958526, 5766515, 5593856, 5438568, 5299246, 5175179, 5065465, 4968485, 4882978, 4808829, 4745852, 4692793, 4648736, 4614433, 4590721, 4576539, 4570176, 4571652, 4581863, 4599966, 4623747, 4652528, 4687859, 4731201, 4782467, 4840773, 4905215, 4975068, 5050648, 5133790, 5226017, 5326394, 5432521, 5543224, 5658718, 5778576, 5901219, 6025021, 6148064, 6267076, 6378558, 6480972, 6574003, 6655798, 6722944, 6773380, 6807485, 6826137, 6829624, 6818882, 6796105, 6763675, 6723744, 6678980, 6632278, 6585623, 6540611, 6499863, 6466317, 6441336, 6425297, 6419863]
59063F419863P793K2278L6885N2978P1632R0703J07585J23104J39719J57386J74268
59052G404194J90355K07109K24470K41177K57404K74115K90311L03828L14468
59043I707431L23522L30336L32024L26534L13585K92619K62263K22059J72813
59034A2283186J15324N0782j7681q5972j51562k13285k69035l15977l53137l81753
59024A0660890m02774m15865m21108m19843m13435m02652l88549l72580l55534
59015G068550l37368l18232k98757k79522k61101k44307k29461k15737k02066
59006D681999j88187j74295j60565j47741j37035j28457j20476j12194j04447
58997C408602r7688r0731q3064p6401p2083o8752o4703o0595n7517n4288m9579
$$ y = [6419863, 6427656, 6449934, 6486819, 6539797, 6611429, 6702132, 6809717, 6932821, 7072540, 7229926, 7404194, 7594549, 7801658, 8026128, 8267305, 8524709, 8798824, 9089135, 9392963, 9707431, 10030953, 10361289, 10693313, 11019847, 11333432, 11626051, 11888314, 12110373, 12283186, 12398510, 12449292, 12431611, 12345639, 12194077, 11980792, 11711757, 11395780, 11042643, 10660890, 10258116, 9842251, 9421143, 9001300, 8587865, 8185213, 7796664, 7424084, 7068550, 6731182, 6412950, 6114193, 5834671, 5573570, 5329263, 5099802, 4884065, 4681999, 4493812, 4319517, 4158952, 4011211, 3874176, 3745719, 3625243, 3513049, 3408602, 3310914, 3220183, 3137119, 3060718, 2988635, 2919883, 2855180, 2794585, 2737068, 2682780, 2633201]
58986B633201m4945m2554m1223l8134l3486k9848k7683k5027k1417j8331j5678
58975B294875j1525n912j538L02J511L936O982R647J2389J5663J8543K0185K1093
58962B386151K1973K2575K2201K0293J6457J1371P431O605P653P496N441L782
58950B539429M005M798M609L985M331O000Q571J1529J3884J4397J2947J0605Q126
58937B647216N328K157r38l707n998p090o406m660k891q93J754L884M184M029
58923B635969O132J0404J3788J4593J4426J5142J6538J7977J9822K2036K3417
58912B810244K3684K4533K7234L0701L3266L5045L7258M0241M3385M6180M8454
58901C200225N0209N1851N3825N5797N7106N8255O0699O4798O9218P2893P6333
$$ y = [2633201, 2588256, 2545702, 2504479, 2466345, 2432859, 2403011, 2375328, 2350301, 2328884, 2310553, 2294875, 2283350, 2277438, 2275900, 2276202, 2277713, 2281649, 2288631, 2298278, 2310667, 2326330, 2344873, 2365058, 2386151, 2408124, 2430699, 2452900, 2473193, 2489650, 2501021, 2508452, 2515057, 2522710, 2530206, 2535647, 2539429, 2543434, 2548232, 2552841, 2556826, 2561157, 2567157, 2575728, 2587257, 2601141, 2615538, 2628485, 2639090, 2647216, 2652544, 2654701, 2653763, 2650056, 2644058, 2636968, 2630562, 2625902, 2623011, 2622118, 2623872, 2627756, 2631940, 2635969, 2642101, 2652505, 2666293, 2680886, 2695312, 2710454, 2726992, 2744969, 2764791, 2786827, 2810244, 2833928, 2858461, 2885695, 2916396, 2949662, 2984707, 3021965, 3062206, 3105591, 3151771, 3200225, 3250434, 3302285, 3356110, 3411907, 3469013, 3527268, 3587967, 3652765, 3721983, 3794876, 3871209]
58890C871209Q0521Q5618R1183R6801J02122J07246J13170J20793J29440J37635
58880D935738J45312J53887J63954J74432J84396J94397K05403K17620K30813
58871F605952K44795K59373K74622K91334L10187L30727L52194L75098M00663
58862I444945M29012M59510M92569N29264N69106O09998O50671O91663P33768
58853A4610506P76981Q20884Q64375R04837R39108R65159R81158R83247R66444
58844B2812699R27819Q66774P82363O72994N39372L85485K16292L7098j44158
58835B7096738l17112m73550o10346p26662q20388q89098r33064r55455r60292
58826B0410771r51193r31060r01628q63847q19464p71521p22850o75072o29365
$$ y = [3871209, 3951730, 4037348, 4128531, 4225332, 4327454, 4434700, 4547870, 4668663, 4798103, 4935738, 5081050, 5234937, 5398891, 5573323, 5757719, 5952116, 6157519, 6375139, 6605952, 6850747, 7110120, 7384742, 7676076, 7986263, 8316990, 8669184, 9044282, 9444945, 9873957, 10333467, 10826036, 11355300, 11924406, 12534404, 13185075, 13876738, 14610506, 15387487, 16208371, 17072746, 17977583, 18916691, 19881850, 20863008, 21846255, 22812699, 23740518, 24607292, 25389655, 26062649, 26602021, 26987506, 27203798, 27240896, 27096738, 26779626, 26306076, 25695730, 24969068, 24148680, 23259582, 22326518, 21371063, 20410771, 19459578, 18528518, 17626890, 16763043, 15943579, 15172058, 14449208, 13774136, 13144771]
58817A3144771n86892n47747n10780m75303m42061m11915l84558l59177l35465
58808I090873l13392k92672k72931k53843k35203k17427k01529j87596j73953
58799F942327j59379j45304j33695j23309j10848r5904q1898p1329o2765n3600
58789E904296m3401l2930k2051j0413J295J2426K3591L5495M7685N9560P1442
58778F046995Q3584R5338J06423J17748J29842J41744J52832J64644J79198J96156
58768G414504K13101K28529K43358K59553K78065K98317L19263L40724L63581
58759I958995L88712M16227M46221M79492N16595N56692N98492O41795O86884
58750A4690105P32739P77335Q19323Q57953Q91397R16686R31032R31676R14682
$$ y = [13144771, 12557879, 12010132, 11499352, 11024049, 10581988, 10170073, 9785515, 9426338, 9090873, 8777481, 8484809, 8211878, 7958035, 7722832, 7505405, 7303876, 7116280, 6942327, 6782948, 6637644, 6503949, 6380640, 6269792, 6173888, 6091990, 6020661, 5957896, 5904296, 5860895, 5827965, 5805914, 5795501, 5796796, 5809222, 5832813, 5868308, 5915993, 5975553, 6046995, 6130579, 6225917, 6332340, 6450088, 6579930, 6721674, 6874506, 7039150, 7218348, 7414504, 7627605, 7856134, 8099492, 8359045, 8637110, 8935427, 9254690, 9595414, 9958995, 10347707, 10763934, 11210155, 11689647, 12206242, 12762934, 13361426, 14003221, 14690105, 15422844, 16200179, 17019502, 17877455, 18768852, 19685538, 20616570, 21548246, 22462928]
58741B2462928Q75762Q12389P23858O09912M71475L12829J41148l6254k12644
58732B6161403l80620n32902o64858p74527q60381r21444r59546r78681r81498
58723A9106946r68715r42306r06622q65597q21175p75039p29221o84192o38964
58714A1775115n94242n53033n16986m84500m53778m25418m00453l78026l56668
58705G612011l36180l16704k97616k78750k61201k45600k30826k15669k00376
58696E229089j85741j72014j59576j49067j39948j30464j19904j09514j00512
58687C962349r2750q5757p9378p2911o5636n8663n4175n2085m9696m5388m0436
58676C265474l6495l3786l2558l3582l5947l7019l6031l5281l6360l7794l8036
$$ y = [22462928, 23338690, 24151079, 24874937, 25484849, 25956324, 26269153, 26410301, 26374047, 26161403, 25780783, 25247881, 24583023, 23808496, 22948115, 22026671, 21067125, 20088444, 19106946, 18138231, 17195925, 16289303, 15423706, 14602531, 13827492, 13098271, 12414079, 11775115, 11180873, 10627840, 10110854, 9626354, 9172576, 8747158, 8346705, 7968679, 7612011, 7275831, 6959127, 6661511, 6382761, 6121560, 5875960, 5645134, 5429465, 5229089, 5043348, 4871334, 4711758, 4562691, 4422743, 4292279, 4172375, 4062861, 3962349, 3869599, 3783842, 3704464, 3631553, 3565917, 3507254, 3453079, 3400994, 3351298, 3305910, 3265474, 3228979, 3195193, 3162635, 3129053, 3093106, 3056087, 3020056, 2984775, 2948415, 2910621, 2872585]
58665B872585l8021l8807l9260l8440l8037l9891m2893m4875m5914m7363m8895
58654B410189m9102m8130m7373m7109m6305m4423m1953l9613l8058l7687l7827
58643A932609l6994l4772l2434l1006k9990k8618k7042k5523k3909k2556k2221
58632A617544k2466k1884k0438j9668j9854j9177j6542j3193j0498q288o299n053
58620A434184m208k301O86K775L138L371M362M418K147j097l359m499m915m112
58606A430590k154m56M22J679L517M011K384Q71J257J920O18j875l172k605j076
58591A435931Q46K823M235N324P390J0624J3578J5783J8635K2614K6151K8538
58579A592472L1255L4871L7603L8588L9784M2633M5817M8327N1673N6800O1776
$$ y = [2872585, 2834564, 2795757, 2756497, 2718057, 2680020, 2640129, 2597236, 2552361, 2506447, 2459084, 2410189, 2361087, 2312957, 2265584, 2218475, 2172170, 2127747, 2085794, 2046181, 2008123, 1970436, 1932609, 1895615, 1860843, 1828409, 1797403, 1767413, 1738795, 1711753, 1686230, 1662321, 1639765, 1617544, 1595078, 1573194, 1552756, 1533088, 1513234, 1494057, 1477515, 1464322, 1453824, 1445536, 1439237, 1434184, 1429976, 1427675, 1428361, 1431136, 1434274, 1437645, 1442007, 1446425, 1448572, 1447475, 1444116, 1439617, 1434702, 1430590, 1428436, 1427980, 1428402, 1430081, 1433598, 1437609, 1439993, 1440864, 1442121, 1444041, 1444659, 1442784, 1439612, 1437007, 1435931, 1436777, 1439600, 1443835, 1449159, 1456549, 1467173, 1480751, 1496534, 1515169, 1537783, 1563934, 1592472, 1623727, 1658598, 1696201, 1734789, 1774573, 1817206, 1863023, 1911350, 1963023, 2019823, 2081599]
58568B081599O5074O8402P3721Q0213Q6696R4153J03245J12209J20085J29184
58558C014581J41487J55389J68982J83429J99858K16053K29949K43471K58728
58549D811927K72995K81773K84662K83691K77548K62027K35240J98316J52165
58540G060344R7596L8079k1377p7883j30307j76181k12164k37174k52558k59931
58530E828444k60843k57293k50239k39054k24333k09147j95350j81217j65324
58521C845644j49816j36614j23514j08051r2580q1113p3297o6018n8995n4059
58511B901587n0471m5945m1361l9660m0508m0395l7860l4744l2470l0750k9741
58500B477682l0229l1795l3539l5916l9352m2416m4001m5606m8350m9950m8144
$$ y = [2081599, 2146673, 2215075, 2288796, 2369009, 2455705, 2549858, 2653103, 2765312, 2885397, 3014581, 3156068, 3311457, 3480439, 3663868, 3863726, 4079779, 4309728, 4553199, 4811927, 5084922, 5366695, 5651357, 5935048, 6212596, 6474623, 6709863, 6908179, 7060344, 7157940, 7196019, 7174642, 7096759, 6966452, 6790271, 6578107, 6340933, 6088375, 5828444, 5567601, 5310308, 5060069, 4821015, 4596682, 4387535, 4192185, 4010968, 3845644, 3695828, 3559214, 3435700, 3327649, 3235069, 3153956, 3080659, 3014641, 2955646, 2901587, 2851116, 2805171, 2763810, 2724150, 2683642, 2643247, 2605387, 2570643, 2538173, 2507423, 2477682, 2447453, 2415658, 2382119, 2346203, 2306851, 2264435, 2220434, 2174828, 2126478, 2076528, 2028384]
58489B028384m4957m3419m2134l7788l1353k6880k5137k3347k0546j8392j7139
58478A697292j5314j3376j3462j5506j7383j8588k0167k1604k1583k1151k2244
58467A496914k3855k3493k1696k0988k1250k0286j8314j7525j7850j7409j6491
58456A277757j6760j7202j5429j2464j1459j2045j0779p173m368l625k883j324
58444A162246q47k144l373l435l025k030M80L488M813M758N473O916P095O039
58430A186454N764O582P117P596R303J1299J1551J0718J0874J1287R813P541P354
58417A303253Q605Q043N489L597K435m56m735p251p563q383j0342j1339j1337
58404A270016j2696j5240j6028j4567j3435j3283j2161j0222r909j0822r585n712
$$ y = [2028384, 1983427, 1940008, 1897874, 1860086, 1828733, 1801853, 1776716, 1753369, 1732823, 1714431, 1697292, 1681978, 1668602, 1655140, 1639634, 1622251, 1603663, 1583496, 1561892, 1540309, 1519158, 1496914, 1473059, 1449566, 1427870, 1406882, 1385632, 1365346, 1347032, 1329507, 1311657, 1294248, 1277757, 1260997, 1243795, 1228366, 1215902, 1204443, 1192398, 1181619, 1174446, 1170078, 1166453, 1163570, 1162246, 1161399, 1159255, 1155882, 1152447, 1149422, 1147392, 1147872, 1151360, 1156173, 1160931, 1166404, 1173320, 1180415, 1186454, 1192218, 1198800, 1205917, 1213513, 1222816, 1234115, 1245666, 1256384, 1267258, 1278545, 1288358, 1295899, 1303253, 1311858, 1319901, 1325390, 1328987, 1331422, 1330966, 1326231, 1318980, 1311417, 1303034, 1292692, 1281353, 1270016, 1257320, 1242080, 1226052, 1211485, 1198050, 1184767, 1172606, 1162384, 1152475, 1141653, 1132068, 1126356]
58392A126356k740k454k751k175j862j938n87K142L846L946M259M965M306K717
58378A138030K817M883O672P922J0398J3454J4329J3054J2179J1655R171N575
58366A250139M435N867O294M795M086M661L879J736J855N424R396J1725J3264
58353A327556J3775J1540P856O471P656Q065O915O784P831P289N319N314P411
58340A429782P865N832M728N756O251N419N586O751O167M355N047Q187R702R266
58326A520694J1265J6558K0305J9580J6184J0500K3j3691k4157k8531l0533l2525
58314A485672l1727k6718k0811j6176j1036n114j322J17K699O838Q773Q137R349
58301A408681J3394J5674J4391J3584J5466J7105J7203J8542K1149K0814J7117
$$ y = [1126356, 1123616, 1121162, 1118411, 1116236, 1114374, 1112436, 1111849, 1113991, 1117837, 1121783, 1126042, 1131007, 1135313, 1138030, 1140847, 1145730, 1152402, 1160324, 1170722, 1184176, 1198505, 1211559, 1223738, 1235393, 1244564, 1250139, 1254574, 1260441, 1266735, 1271530, 1275616, 1280277, 1284156, 1285892, 1287747, 1293171, 1302567, 1314292, 1327556, 1341331, 1352871, 1360727, 1367198, 1374854, 1382919, 1389834, 1396618, 1404449, 1411738, 1417057, 1422371, 1429782, 1437647, 1443479, 1448207, 1453963, 1460214, 1465633, 1471219, 1477970, 1484137, 1488492, 1493539, 1501726, 1511428, 1520694, 1531959, 1548517, 1568822, 1588402, 1604586, 1615086, 1615109, 1601418, 1577261, 1548730, 1518197, 1485672, 1453945, 1427227, 1406416, 1390240, 1379204, 1374090, 1372768, 1372885, 1375584, 1382422, 1391195, 1399332, 1408681, 1422075, 1437749, 1452140, 1465724, 1481190, 1498295, 1515498, 1534040, 1555189, 1576003, 1593120]
58290A593120J5290J7334J8995J8059J7603J8398J6509J1408Q010P660N778J421
58278A749585J83M025P371O998O805R006R999Q959J0851J6528J9552J7689J7594
58265A885145K2877K7438K6521K4687K6650K9360K9535L0096L2982L4252L2319
58254B201862L2202L5834L7253L3337K9977L1368L2760L0291K8393L0536L2098
58243B555911K9531K7430K9520L1749L1178L2374L8062M2863M3149M3593M7328
58232B952688M9671M8450M9824N6535O1245N9280N7059N9974O3148O2482O3369
58221C583725O9612P5043P5147P5669Q0740Q4386Q3124Q4737R4461J04490J07515
58210D518649J08633J13576J17695J17229J18658J25763J30366J27389J25726
$$ y = [1593120, 1608410, 1625744, 1644739, 1662798, 1680401, 1698799, 1715308, 1726716, 1734726, 1742386, 1748164, 1749585, 1749768, 1753793, 1761164, 1768162, 1774967, 1783973, 1793972, 1802931, 1813782, 1830310, 1849862, 1867551, 1885145, 1908022, 1935460, 1961981, 1986668, 2013318, 2042678, 2072213, 2102309, 2135291, 2169543, 2201862, 2234064, 2269898, 2307151, 2340488, 2370465, 2401833, 2434593, 2464884, 2493277, 2523813, 2555911, 2585442, 2612872, 2642392, 2674141, 2705319, 2737693, 2775755, 2818618, 2861767, 2905360, 2952688, 3002359, 3050809, 3100633, 3157168, 3218413, 3277693, 3334752, 3394726, 3457874, 3520356, 3583725, 3653337, 3728380, 3803527, 3879196, 3959936, 4044322, 4127446, 4212183, 4306644, 4411134, 4518649, 4627282, 4740858, 4858553, 4975782, 5094440, 5220203, 5350569, 5477958, 5603684]
58201E603684J32591J40799J43680J48095J59718J70160J72729J76128J88023
58192G035607K00130K04893K11692K30073K52039K67940K84859L11583L40248
58183I339064L61302L81794M10006M36905M52420M65539M88591N16500N41398
58174A3393519N72081O18015O69774P16563P66808Q29641Q93473R46122R98368
58165B0404364J063264J130322J185540J238265J301674J366220J420260J477239
58157C0587148J553589J640557J727490J830201J964039K112772K258268K415875
58149D6089939K604656K810535L018705L253540L543929L880758M255256M705809
58141G4163127N276404N966226O775617P757785Q957534J0340363J1850174J3484672
$$ y = [5603684, 5736275, 5877074, 6020754, 6168849, 6328567, 6498727, 6671456, 6847584, 7035607, 7235737, 7440630, 7652322, 7882395, 8134434, 8402374, 8687233, 8998816, 9339064, 9700366, 10082160, 10492166, 10929071, 11381491, 11847030, 12335621, 12852121, 13393519, 13965600, 14583615, 15253389, 15969952, 16736760, 17566401, 18459874, 19405996, 20404364, 21467628, 22597950, 23783490, 25021755, 26323429, 27689649, 29109909, 30587148, 32140737, 33781294, 35508784, 37338985, 39303024, 41415796, 43674064, 46089939, 48694595, 51505130, 54523835, 57777375, 61321304, 65202062, 69457318, 74163127, 79439531, 85405757, 92181374, 99939159, 108896693, 119237056, 131087230, 144571902]
58133A44571902J5241230J7074703J9035386K1377728K4370913K8025609L2086413
58126C01783884L6054497L8821713L8389816L2696571K1366000O611364p949771
58119D67774074j9506194k7178636l1450065l3117547l2876401l1380063k9201682
58112B63063486k6698262k4051845k1413220j8915669j6608455j4485822j2566730
58105A28323483j0884360r426572q146831p015342o016405n118928m292283l536932
58097G3885830k867065k272359j714392j147500n34717J36514Q41714J521654
58089F7849679K068212K283697J919164Q69433o45218k172865l350855m100169
58081F4721078m516056m676439m615432m395751m101148l772772l415928l053810
$$ y = [144571902, 159813132, 176887835, 195923221, 217300949, 241671862, 269697471, 301783884, 337838381, 376660094, 415049910, 447746481, 469112481, 475723845, 467774074, 448267880, 421089244, 389639179, 356521632, 323645231, 292265168, 263063486, 236365224, 212313379, 190900159, 171984490, 155376035, 140890213, 128323483, 117439123, 108012551, 99865720, 92850378, 86833973, 81715045, 77422762, 73885830, 71018765, 68746406, 67032014, 65884514, 65349797, 65486311, 66328025, 67849679, 69917891, 72201588, 74120752, 74990185, 74344967, 72172102, 68821247, 64721078, 60205022, 55528583, 50913151, 46517400, 42416252, 38643480, 35227552, 32173742]
58073C2173742k722013k424684k144495j886036j669019j489920j328985j185634
58065A7322956j071956r80829q94028q13578p53818p10599o67752o25910n96333
58056A0208153n73810n43425n07293m78239m53685m21356l84339l55532l33097
58047F157377l05689k76375k57565k47196k32997k15817k06127k01547j90212
58038D023852j73136j61744j55943j45366j30079j19980j15401j07411r6004q9614
58028B729174q7927q2655p4137p0321p0609o7062o0392n8843o2260o2581n8971
58017A973416n7709n8530n5563n0250m9062m9947m5309l6806l3135l4463l2991
58006A469651k7675k4691k4434k1579j7043j6677j9046j7458j3152j3423j7574
$$ y = [32173742, 29451729, 27027045, 24882550, 22996514, 21327495, 19837575, 18508590, 17322956, 16251000, 15270171, 14376143, 13562565, 12808747, 12098148, 11430396, 10804486, 10208153, 9634343, 9090918, 8583625, 8105386, 7651701, 7230345, 6846006, 6490474, 6157377, 5851688, 5575313, 5317748, 5070552, 4837555, 4621738, 4415611, 4214064, 4023852, 3850716, 3688972, 3533029, 3387663, 3257584, 3137604, 3022203, 2914792, 2818788, 2729174, 2641247, 2558592, 2484455, 2414134, 2343525, 2276463, 2216071, 2157228, 2094968, 2032387, 1973416, 1915707, 1857177, 1801614, 1751364, 1702302, 1652355, 1607046, 1570240, 1537105, 1502642, 1469651, 1441976, 1417285, 1392851, 1371272, 1354229, 1337552, 1318506, 1301048, 1287896, 1274473, 1256899]
57995A256899j7812j3562j2116j4986j6177j4235j4021j6030j5379j1869j0406
57984A100306j1259j0172p755q475j0978r842o136n780q276p644l779k204l242
57971A004764k086Q83N39k608k952m08j99k474k332J68K77j548l94L004L183O32
57955I98449R57L729K994j040j756J877L829K252J638K681O54m652p486o333n903
57940I91890p608p634n870o902j0678j1805r852j0603j5443j9419k1752k7966
57928H36358l8758m6520m6454m2186l7185k9540j8862r716m224J172Q012J2304
57916E84401J2090J1362J2990J4561J4327J4639J6406J6585J4069J2078J2069
57905G35577J1402R096P837Q205P262M549L220L598K395k88l92J926J149m305
$$ y = [1256899, 1239087, 1225525, 1213409, 1198423, 1182246, 1168011, 1153990, 1137960, 1122581, 1110712, 1100306, 1089047, 1078875, 1071120, 1062645, 1051667, 1041825, 1035689, 1029909, 1021633, 1013989, 1010210, 1008006, 1004764, 1002678, 1003561, 1004100, 1001492, 998540, 998132, 997933, 995459, 993127, 993295, 993572, 992024, 991630, 994634, 997817, 998449, 999406, 1003135, 1006129, 1005089, 1003333, 1005210, 1009039, 1011291, 1012929, 1015610, 1016264, 1011612, 1004126, 997793, 991890, 984282, 976648, 970778, 963876, 953198, 941393, 931541, 920938, 905495, 886076, 864324, 836358, 797600, 751080, 704626, 662440, 625255, 595715, 576853, 567137, 562913, 564085, 572097, 584401, 596491, 607853, 620843, 635404, 649731, 664370, 680776, 697361, 711430, 723508, 735577, 746979, 756075, 763912, 772117, 779379, 783928, 787148, 790746, 793141, 792853, 792461, 794387, 795536, 791231]
57891G91231r119r971r942j1241j1018p953n901p019p679m967j404M30K112M839
57877G12398O226N083M030M309L366L50j540j191k245o471j0248j1041j1835j5286
57863F75905j8731j8996j7417j6304j4727j1548q653p733p389o269n411n115l444
57850E34168j28K073K110K544M689O235N931O122Q403J0964J2316J3348J3848
57837F22623J1745P700N600O419O559M396L101M437N218K988K72k03J83n14j270
57822F79254j298k490n596q006q182q287r770j0551r225p849p733o745l647j068
57808E88807j181k269k145j209J34K953O428P458N900N632Q113R824Q674P582
57794F44701Q592Q772N836K833L022M392L503R21j162k998n204o126m915l808
$$ y = [791231, 782112, 772141, 762199, 750958, 739940, 731987, 726086, 719067, 711388, 706421, 705017, 705447, 707559, 712398, 718624, 723707, 727737, 732046, 735412, 735762, 734222, 733031, 730786, 724315, 714067, 703026, 691191, 675905, 657174, 638178, 620761, 604457, 589730, 578182, 569529, 561796, 554407, 548138, 542727, 537612, 534168, 534040, 536113, 538223, 540767, 545456, 551691, 557622, 563744, 572147, 583111, 595427, 608775, 622623, 634368, 642068, 647668, 654087, 660646, 665042, 668143, 672580, 677798, 680786, 681058, 680855, 681038, 680524, 679254, 677956, 675466, 669870, 661864, 653682, 645395, 635625, 625074, 615849, 608000, 600267, 593522, 589875, 588807, 587626, 585357, 583212, 582003, 582137, 585090, 591518, 598976, 604876, 610508, 618621, 628445, 637119, 644701, 653293, 662065, 667901, 670734, 673756, 678148, 681651, 682572, 681410, 678412, 673208, 667082, 662167, 658359]
57780F58359m122l678j398k83k245m289l782l273n681q554q024n266m207n470
57766E98087o955q090r312r598q332p555q888j0526j0378r656j0189j0908j0282
57753D77418r380r286q441n934m383n943q300q350o976o514o339m897l424l650
57739C85601m112k695n79N2j8J004K378K884M034P477J1364J2973J2863J2820
57725D46046J2081R476P088P667J0164J1600J1642J1592J0746P770M122K269J699
57712E53962J52k496m728o354p805q063o390m565m403m782m011l136l769m780
57698D88832m340l257k923k143M45K974L179K551L838O175O758N653N022M962
57684E17726M197L508M498O019N736M118L305L191K437K135M395Q094R980R478
$$ y = [658359, 654237, 650559, 649161, 648878, 646633, 642344, 638562, 635289, 629608, 621054, 613030, 607764, 603557, 598087, 591132, 583042, 573730, 564132, 555800, 548245, 539357, 528831, 518453, 508797, 498608, 487700, 477418, 468038, 458752, 450311, 444377, 439994, 434051, 425751, 417401, 410425, 403911, 397572, 392675, 389251, 385601, 381489, 378794, 378215, 378267, 378249, 379253, 381631, 384515, 388549, 396026, 407390, 420363, 433226, 446046, 458127, 467603, 474691, 482358, 492522, 504122, 515764, 527356, 538102, 545872, 549994, 552263, 553962, 554114, 551618, 546890, 540536, 532731, 524668, 518278, 513713, 509310, 504528, 500517, 497381, 493612, 488832, 484492, 481235, 478312, 476169, 476614, 479588, 482767, 485318, 489156, 495331, 502089, 507742, 512764, 517726, 521923, 525431, 529929, 535948, 541684, 545802, 549107, 552298, 554735, 556870, 561265, 569359, 579339, 588817]
57670E88817Q767Q770Q635Q602R799J1566J2262J2362J3595J5651J6825J7268
57658G32919J8405J9762J9632J8468J8448K0051K1947K3749K5973K7828K8057
57647I75239K7714K9197L2667L5880L7318L7450L7445L8533M1680M5998M8964
57636A388085N0061N2281N7736O4222O9017P3585Q0773Q9610R7248J04429J14285
57625B241332J26649J38182J47950J58720J72527J88521K05211K21545K35952
57616C836589K47467K57491K67182K73494K71132K58177K36591K07784J71547
57607F027454J29677Q6949M7285J0710k5951o7034j15194j67555k15357k50223
57597E460761k70236k77976k75053k62420k44030k24982k06458j86704j66410
$$ y = [588817, 597584, 606354, 614989, 623591, 633390, 644956, 657218, 669580, 683175, 698826, 715651, 732919, 751324, 771086, 790718, 809186, 827634, 847685, 869632, 893381, 919354, 947182, 975239, 1002953, 1032150, 1064817, 1100697, 1138015, 1175465, 1212910, 1251443, 1293123, 1339121, 1388085, 1438146, 1490427, 1548163, 1612385, 1681402, 1754987, 1835760, 1925370, 2022618, 2127047, 2241332, 2367981, 2506163, 2654113, 2812833, 2985360, 3173881, 3379092, 3600637, 3836589, 4084056, 4341547, 4608729, 4882223, 5153355, 5411532, 5648123, 5855907, 6027454, 6157131, 6244080, 6291365, 6302075, 6276124, 6209090, 6093896, 5926341, 5710984, 5460761, 5190525, 4912549, 4637496, 4375076, 4131046, 3906064, 3699606, 3512902, 3346492]
57588C346492j48445j32649j15915r8100q2983p2360o3522n3975m4628l6638k8914
57577B468363k0552j2665n987P08Q238J5645K2506L0125L9170M8340N6634O4931
57565B715456P4268Q4486R5422J07453J20176J32353J43752J55197J66441J75919
57555C970923J82884J87630J89279J85439J74497J56230J30114R5477N3888R244
57545E335605l5163p7849j17263j50871j76783j94769k05410k09777k09800k07034
57535C750886k01228j91755j80092j68776j58380j47713j36668j26423j16971
57526B322880j07076r6767q7666q0623p4944o9840o4887n9500n3853m9470m6946
57515A531308m4233l9704l5260l3383l2556k9441k4511k1124j9580j6925j2797
$$ y = [3346492, 3198047, 3065398, 2949483, 2851383, 2768400, 2696040, 2632518, 2578543, 2533915, 2497277, 2468363, 2447811, 2435146, 2429159, 2429867, 2438105, 2453750, 2476256, 2506381, 2545551, 2593891, 2650525, 2715456, 2789724, 2874210, 2969632, 3077085, 3197261, 3329614, 3473366, 3628563, 3795004, 3970923, 4153807, 4341437, 4530716, 4716155, 4890652, 5046882, 5176996, 5272473, 5326361, 5335605, 5300442, 5222593, 5105330, 4954459, 4777676, 4582907, 4377497, 4167720, 3957920, 3750886, 3549658, 3357903, 3177811, 3009035, 2850655, 2702942, 2566274, 2439851, 2322880, 2215804, 2119037, 2031371, 1950748, 1875804, 1805964, 1741077, 1681577, 1627724, 1578254, 1531308, 1487075, 1447371, 1412111, 1378728, 1346172, 1316731, 1292220, 1271096, 1251516, 1234591, 1221794]
57504A221794j0506j1229j1683r375o123m389l487j649J007L649O462R382J1275
57491A195128J1916J2785J4679J6622J8210K0689K4419K7457K8259K7979K8817
57480A426960L1600L5908M0857M5048M7405M8840N1554N6343O2196O8540P5703
57469A990954Q3093Q9475R5443J03007J12276J21053J28198J34726J40969J45416
57459C144610J47186J46859J43777J35190J19418R7531P1106M0787Q100k4036
57449D030528n4008q2205j07759j27243j38399j42931j43833j41906j36625j28733
57439B826886j19989j11420j03181r5199q7054p8287o9461o1799n5422m9375m3347
57428A952352l7779l2393k6667k1548j8188j5042r286j502M257O094O874R863
$$ y = [1221794, 1211288, 1200059, 1188376, 1179001, 1172878, 1168489, 1165002, 1163353, 1164360, 1168009, 1174471, 1183853, 1195128, 1207044, 1219829, 1234508, 1251130, 1269340, 1290029, 1314448, 1341905, 1370164, 1398143, 1426960, 1458560, 1494468, 1535325, 1580373, 1627778, 1676618, 1728172, 1784515, 1846711, 1915251, 1990954, 2074047, 2163522, 2258965, 2361972, 2474248, 2595301, 2723499, 2858225, 2999194, 3144610, 3291796, 3438655, 3582432, 3717622, 3837040, 3934571, 4005677, 4046464, 4054564, 4030528, 3976520, 3894315, 3786556, 3659313, 3520914, 3377983, 3234150, 3092244, 2955619, 2826886, 2706897, 2595477, 2492296, 2397097, 2310043, 2231756, 2162295, 2100496, 2045074, 1995699, 1952352, 1914573, 1882180, 1855513, 1833965, 1815777, 1800735, 1791449, 1789947, 1794204, 1800298, 1807172, 1817035]
57416A817035J4718J9472K4020K9503L6167M3569N1577N9816O7504P4737Q2518
57405B320636R1049R9669J08648J18809J29001J36394J39815J40335J37998J30874
57395C553228J18072J00725P9096N1800J9296j4837m7540p8263j05899j27213
57385C548465j40526j48112j52562j53355j49449j42621j35461j28043j19272
57376B279064j09845j01245r3263q5032p7276p1220o6371o1434n6405n1845m7129
57365A457999m1376l5302l0470k7303k5214k3730k2316k0057j6811j3761j1812
57354A189847j0407q719o916n442m337l807m059m192k930q56K03L85J849M817
57340A145436O430N004K818K892N203P834R746J0690J0459J0000J1323J4597J7245
$$ y = [1817035, 1831753, 1851225, 1875245, 1904748, 1940915, 1984484, 2036061, 2095877, 2163381, 2238118, 2320636, 2411685, 2511354, 2620002, 2738811, 2867812, 3004206, 3144021, 3284356, 3422354, 3553228, 3671300, 3772025, 3851121, 3902921, 3922217, 3907380, 3859840, 3781577, 3675678, 3548465, 3407939, 3259827, 3107265, 2953910, 2804461, 2661840, 2526379, 2398336, 2279064, 2169219, 2067974, 1974711, 1889679, 1812403, 1741183, 1674812, 1613378, 1556973, 1505128, 1457999, 1416623, 1381321, 1350851, 1323548, 1298334, 1274604, 1252288, 1232231, 1215420, 1201659, 1189847, 1179440, 1170721, 1163805, 1158363, 1154026, 1150219, 1146160, 1141968, 1139038, 1138182, 1138385, 1138770, 1140619, 1145436, 1151866, 1156870, 1159688, 1162580, 1167783, 1175617, 1185363, 1196053, 1206512, 1216512, 1227835, 1242432, 1259677]
57327A259677J7655J7478J8560J9836J9554J8415J8044J8057J7194J5855J5200
57316A455525J5005J4615J4698J5910J7183J7423J7682J9463K2063K3729K4359
57305A657655K4916K5202K4453K3325K3138K3720K3945K3843K4380K5575K6378
57294A926530K6194K5376K4586K4479K5266K6072K5790K5101K5983K8533L0270
57283B214180K9737K8691K9141L0255L0165K9163K8876K9519L0130L0566L1514
57272B541937L3111L4984L6855L8071L7688L6116L5196L5624L5800L4636L3613
57261B933631L4501L6570L7903L8145L8237L8589L9047L9659M0141L9864L9364
57250C355651M0364M3220M6106M7915M9892N2888N5126N4744N2856N1993N2858
$$ y = [1259677, 1277332, 1294810, 1313370, 1333206, 1352760, 1371175, 1389219, 1407276, 1424470, 1440325, 1455525, 1470530, 1485145, 1499843, 1515753, 1532936, 1550359, 1568041, 1587504, 1609567, 1633296, 1657655, 1682571, 1707773, 1732226, 1755551, 1778689, 1802409, 1826354, 1850197, 1874577, 1900152, 1926530, 1952724, 1978100, 2002686, 2027165, 2052431, 2078503, 2104293, 2129394, 2155377, 2183910, 2214180, 2243917, 2272608, 2301749, 2332004, 2362169, 2391332, 2420208, 2449727, 2479857, 2510423, 2541937, 2575048, 2610032, 2646887, 2684958, 2722646, 2758762, 2793958, 2829582, 2865382, 2900018, 2933631, 2968132, 3004702, 3042605, 3080750, 3118987, 3157576, 3196623, 3236282, 3276423, 3316287, 3355651, 3396015, 3439235, 3485341, 3533256, 3583148, 3636036, 3691162, 3745906, 3798762, 3850755, 3903613]
57239C903613N4407N5694N6035N4740N2408N1061N1566N2478N2769N3811N6841
57228D495423O0450O2519O3068O3527O4702O7008P0745P4642P6321P5985P7191
57217E251581Q1855Q6903Q8366Q6625Q4883Q4452Q4499Q4764Q5404Q5176Q2549
57206F187057P7825P2266O6310O0587N6914N6060N6034N4886N3473N3238N3214
57195F847864N1843M9978M9120M8313M5699M1818L8430L5443L2044K9641L0449
57184G300642L3975L7890M1776M7189N4415O1971O8891P5188Q0456Q4272Q7576
57173G974241R1628R5941R8800R9329R7768R4899R2364R1913R2659R1041Q5299
57162I005882P8119P2839O9255O5515O1722N8595N4614M8038M0538L5610L4241
$$ y = [3903613, 3958020, 4013714, 4069749, 4124489, 4176897, 4227958, 4279524, 4332002, 4384771, 4438582, 4495423, 4555873, 4618392, 4681460, 4744987, 4809689, 4876697, 4947442, 5022084, 5098405, 5174390, 5251581, 5333436, 5420339, 5508705, 5595330, 5680213, 5764665, 5849164, 5933928, 6019332, 6104508, 6187057, 6264882, 6337148, 6403458, 6464045, 6520959, 6577019, 6633053, 6687939, 6741412, 6794650, 6847864, 6899707, 6949685, 6998805, 7047118, 7092817, 7134635, 7173065, 7208508, 7240552, 7270193, 7300642, 7334617, 7372507, 7414283, 7461472, 7515887, 7577858, 7646749, 7721937, 7802393, 7886665, 7974241, 8065869, 8161810, 8260610, 8359939, 8457707, 8552606, 8644970, 8736883, 8829542, 8920583, 9005882, 9084001, 9156840, 9226095, 9291610, 9353332, 9411927, 9466541, 9514579, 9555117, 9590727, 9624968]
57151I624968L4847L6341L8527M0390M0776M0089L9189L7843L6290L6740M0804
57140A0046804M6977N3106N9702O8208P7689Q6150R3667J01363J08666J14267
57130A0856599J18412J21474J21833J18015J11483J04488R6657Q6518P4920O4054
57120A1874453N4419M5434L7490L0756K3578J4816O126n74n902j0743j3668j3702
57108A2042483j3181j4374j5479j3680j0200q549r560j1867j5820k3156l3983
57097A1872634m7309o3155q1148r8633j13216j25717j38226j51235j64933j80473
57087A0708589j97118k11043k19836k25375k29695k31784k31432k31910k35190
57078H695206k38876k41859k48481k62449k81161l00883l22846l48881l75757
$$ y = [9624968, 9659815, 9696156, 9734683, 9775073, 9815849, 9855938, 9895127, 9932970, 9969260, 10006000, 10046804, 10093781, 10146887, 10206589, 10274797, 10352486, 10438636, 10532303, 10633666, 10742332, 10856599, 10975011, 11096485, 11218318, 11336333, 11447816, 11552304, 11648961, 11735479, 11810399, 11874453, 11928872, 11974306, 12011796, 12042552, 12066130, 12080946, 12087072, 12086498, 12080596, 12069853, 12056185, 12042483, 12029302, 12014928, 11999449, 11985769, 11975569, 11967020, 11957460, 11945593, 11929773, 11906617, 11872634, 11825325, 11762170, 11681022, 11582389, 11469173, 11343456, 11205230, 11053995, 10889062, 10708589, 10511471, 10300428, 10080592, 9855217, 9625522, 9393738, 9162306, 8930396, 8695206, 8456330, 8214471, 7965990, 7703541, 7422380, 7121497, 6798651, 6449770, 6074013]
57069F074013l99861m23451m50532m80955n14481n55829o08927o70414p35357
57060A234206D29225d53018r64820j049804j140748j242600j354454j474702j607988
57051i288134j759242j926375k106995k306311k529700k773847l034622l317135
57043b9042361l628721l969906m342982m761408n239404n780992o391131p087110
57035g0244015p885409q789274r803568j0943524j2202136j3518341j4804081
57028a48190348j5998946j7076796j8001294j8681782j8947270j8557439j7322200
57021b72776075j5314433j2948667j0728093q851511p114690n207766l012602
57014c35953837n57650K195346N355451Q890106J2519797J5860540J8612338K0604319
$$ y = [6074013, 5674152, 5250701, 4800169, 4319214, 3804733, 3248904, 2639977, 1969563, 1234206, 429225, -453018, -1417838, -2467642, -3608390, -4850990, -6205444, -7680146, -9288134, -11047376, -12973751, -15080746, -17387057, -19916757, -22690604, -25725226, -29042361, -32671082, -36640988, -40983970, -45745378, -50984782, -56765774, -63156905, -70244015, -78129424, -86918698, -96722266, -107665790, -119867926, -133386267, -148190348, -164189294, -181266090, -199267384, -217949166, -236896436, -255453875, -272776075, -288090508, -301039175, -311767268, -320618779, -327733469, -332941235, -335953837, -336511487, -334316141, -328960690, -320070584, -307550787, -291690247, -273077909, -252473590]
57006b52473590K1756287K2076504K1673593K0716141J9372346J7791047J6106697
56999a12980975J4426939J2819957J1328261R982956Q792981P738437O794288
56992d1097156N953275N215739M571307M005270L511957L087276K716873K385041
56984i650418K088415J829515J603669J402865J225699d27301E11813Q17818P10221
56975B039852O19313N41041M69323M04494L48719K98316K48647K01867J61960
56966E333532J26304Q9688N2764J9347j0975m0610o7739q9057j06030j22547j38898
56955E045779j53275j66393j79657j91560k00618k08965k18678k27692k33454
56946C265487k36984k38857k34919k21075j99269j74063j46150j13905p8509m2738
$$ y = [-252473590, -230717303, -208640799, -186967206, -166251065, -146878719, -129087672, -112980975, -98554036, -85734079, -74405818, -64422862, -55629881, -47891444, -41097156, -35143881, -29928142, -25356835, -21351565, -17839608, -14752332, -12035459, -9650418, -7562003, -5732488, -4128819, -2725954, -1500255, -427301, 511813, 1329631, 2039852, 2659165, 3200206, 3669529, 4074023, 4422742, 4721058, 4969705, 5171572, 5333532, 5459836, 5549524, 5602288, 5621635, 5610660, 5570050, 5502311, 5413254, 5307224, 5184677, 5045779, 4892504, 4726111, 4546454, 4354894, 4154276, 3945311, 3726633, 3498941, 3265487, 3028503, 2789646, 2554727, 2333652, 2134383, 1960320, 1814170, 1700265, 1621756, 1579018]
56936A579018o817K9882O4173Q9000R6576Q0522L9587j7235p3083j15022j41498
56925A625103j56497j61453j56924j47282j37683j28750j18801j08879j01212
56916D07622r4980q7926q0252G1245E245e2331m9677m4131l9480l3367k6289j9751
56904b65026j3116n516J428O197J0458J6334K2842K8138L2820L7743M0893L9892
56892d6913a1395A8323K2413J3388N089M0k355l568k818P73N323Q649J1315J4381
56878I0953J6740J7729J9457K3327K7165K9173L1576L6392M0760M0852L7662L4111
56866D45897K9115J9813P785k281q999j4384j8702k0217j9686k0148k2078k2733
56854C53382k0599j6998j3366j0166q298q422r126q555p254o745o375m676k657
$$ y = [1579018, 1572201, 1602083, 1666256, 1755256, 1851832, 1932354, 1971941, 1954706, 1881623, 1766601, 1625103, 1468606, 1307153, 1150229, 1002947, 865264, 736514, 617713, 508834, 407622, 312642, 224716, 144464, 71245, 5245, -52331, -102008, -146139, -185619, -218986, -245275, -265026, -278142, -283658, -282230, -276033, -265575, -249241, -226399, -198261, -165441, -127698, -86805, -46913, -11395, 18323, 40736, 54124, 59213, 59253, 56898, 53330, 50512, 51285, 56608, 65257, 76572, 90953, 107693, 125422, 144879, 168206, 195371, 224544, 256120, 292512, 333272, 374124, 411786, 445897, 475012, 494825, 502610, 500329, 491330, 476946, 458244, 438027, 418341, 398193, 376115, 353382, 332783, 315785, 302419, 292253, 283955, 275533, 266407, 257852, 250598, 243853, 237478, 232802, 230145]
56841B30145k192k182j16L248M589L234J922K457M084O245R460J2979J4843J5071
56827C03787J6163J9770K4937K9872L3295L3996L1303K6359K1207J6613J2260
56816E69562Q420N710L787K200J728L001M685N160N049N982P911R964J2773J7285
56802F63217K2257K5780K8568L2787L7928M0483L7747K9833J8325N242o925j6318
56790I18924k2872k7129k8740k7558k4719k0834j4698o034K418Q276J3214K0135
56778G90383K8287L4756L9653M5934N4613O3773P1786P7696P8470O9740N0341
56767A405432K3763m905l0982n0098n9893o2452o2159o0651n6325m8539l9242
56756I53949l0117k1206j2817n955j90O395J4444K2675L0294L7863M5335N1107
$$ y = [230145, 227953, 225771, 225655, 228903, 233492, 236726, 238648, 241105, 245189, 251434, 260894, 273873, 288716, 303787, 319950, 339720, 364657, 394529, 427824, 461820, 493123, 519482, 540689, 557302, 569562, 577982, 583692, 587479, 589679, 591407, 594408, 599093, 604253, 609302, 615284, 623195, 633159, 645932, 663217, 685474, 711254, 739822, 772609, 810537, 851020, 888767, 918600, 936925, 942167, 935242, 918924, 896052, 868923, 840183, 812625, 787906, 767072, 752374, 746340, 748758, 757034, 770248, 790383, 818670, 853426, 893079, 939013, 993626, 1057399, 1129185, 1206881, 1285351, 1355091, 1405432, 1429195, 1424290, 1393308, 1343210, 1283317, 1220865, 1158706, 1098055, 1041730, 993191, 953949, 923832, 902626, 889809, 883854, 883664, 890059, 904503, 927178, 957472, 995335, 1040670, 1091777]
56744A091777N2942M8224L4329J1796j3311l3362m5760n3041n7028n6724n2196
56733I27646m6461m1846l7482l1970k5933k0412j5044r363m075K21M062P929J1591
56720G18863J5135J8796K1127J9269J2048J355r970k0113k7833l2269l3882l4130
56708F48396l3509l1355k7783k4136k1180j8491j5967j4321j3690j3288j2600
56697D22076j1610j0004p721n844n209m649k740o24n48k037k444j172k49n76q03
56682C65846n96j592m053n565m624k790j838j178J49J283J172O09O99Q92K17p61
56666C47870q27M0J012J765K428K946L278L535L406K352P11l75l99J14O84J138
56650C69678R56k24j469j592j173j797l324l915l013k151k395k909k688j857q02
$$ y = [1091777, 1144719, 1192943, 1227272, 1239068, 1225757, 1192395, 1146635, 1093594, 1036566, 979842, 927646, 881185, 839339, 801857, 769887, 743954, 723542, 708498, 699135, 695060, 695281, 699343, 707272, 718863, 733998, 752794, 773921, 793190, 805238, 806593, 796623, 776510, 748677, 716408, 682526, 648396, 614887, 583532, 555749, 531613, 510433, 491942, 475975, 461654, 447964, 434676, 422076, 410466, 400462, 392741, 386897, 381688, 377039, 374299, 373675, 373127, 371090, 368646, 367474, 367225, 366649, 365846, 365250, 363658, 359605, 354040, 349416, 346626, 344788, 343610, 343759, 345042, 346214, 346823, 347522, 348414, 348631, 347870, 347043, 347083, 348095, 349860, 352288, 355234, 358512, 362047, 365453, 367805, 368516, 368141, 367742, 367856, 368540, 369678, 370634, 370410, 368941, 367349, 366176, 364379, 361055, 357140, 354127, 351976, 349581, 346672, 343984, 342127, 341325]
56635C41325L64R94L38r34j317p57n93j174j548j514j750j884r19K13p17l538
56619C26589n350m699l370l147l519l618l723l435j188K810N687N739M891N476
56605C19143O771O838N716M567L322J482p0k39K36q7j018j207l18Q52J748K341
56589C50077K542K377K191J998J483J067J771L335L937K621O01o55j258j845k269
56574C67973k438l085m438n306m704l446l045l968n678p308p679n959l041r91
56560C06887m02J90J677K865K561J454O51j22j551l139l855l365j813N23K671
56545C05232L472L354M019N614N989L927J306O15J724K652K278R91l12o92L84
56530C40553K070K633J652N87N46J015J447K284L353L166J155q89j079K81J813
$$ y = [341325, 341689, 342683, 343021, 342087, 340770, 340013, 339420, 338246, 336698, 335184, 333434, 331550, 330631, 330844, 330127, 326589, 321239, 316540, 313170, 310023, 306504, 302886, 299163, 295728, 294540, 297350, 303037, 308776, 313667, 319143, 325914, 332752, 338468, 343035, 346357, 347839, 347769, 347530, 347766, 347679, 346661, 345454, 345136, 345988, 347736, 350077, 352619, 354996, 357187, 359185, 360668, 361735, 363506, 366841, 370778, 373399, 374000, 373345, 372087, 370242, 367973, 365535, 362450, 358012, 352706, 348002, 344556, 341511, 337543, 331865, 324557, 316878, 310919, 307878, 306887, 306485, 306675, 308352, 311217, 313778, 315232, 315883, 315761, 314210, 311071, 307216, 303851, 302038, 302561, 305232, 308704, 312058, 316077, 321691, 327680, 331607, 332913, 333528, 335252, 337904, 340182, 341173, 340861, 340169, 340553, 342623, 345256, 346908, 347495, 348041, 349056, 350503, 352787, 356140, 359306, 360461, 359572, 358493, 358774, 360587]
56515C60587L138M530N771O626P309P692P299O758P496R295J0113R339Q943J0171
56501D65067J1422J1255J1082J2657J4838J5408J4630J4409J5029J5213J4704
56490F15714J4387J4246J3276J1325R362Q049P172O251M723K029j566m844p044
56477F93080q625j0105j1271j2085j3131j4447j5315j5739j6413j6727j4959j1441
56465E32822r225j0128j2270j3021j2235j0909q974o531n178n765o518n738m558
56452D21772m750n487m968l775l831n103n966n972n790n326m212l334l528l657
56438C56073k378q14r11j950j486O71K232J873N16p87j836k099q48J214K327J965
56422C53762J241J048J270J791K685L450L437K967K851L032K834K226J760J695
$$ y = [360587, 363725, 368255, 374026, 380652, 387961, 395653, 402952, 409710, 417206, 426501, 436614, 445953, 454896, 465067, 476489, 487744, 498826, 511483, 526321, 541729, 556359, 570768, 585797, 601010, 615714, 630101, 644347, 657623, 668948, 678310, 686359, 693531, 699782, 704505, 706534, 704968, 700124, 693080, 684455, 674350, 663079, 650994, 637863, 623416, 608101, 592362, 575949, 559222, 544263, 532822, 523597, 513469, 501199, 488178, 475943, 465034, 456060, 449529, 444351, 438586, 432068, 426330, 421772, 417022, 411535, 406567, 402792, 398961, 393858, 387892, 381920, 376130, 370804, 366592, 363258, 359730, 356073, 353695, 352881, 351970, 350020, 348534, 349205, 351437, 353310, 353826, 353039, 351203, 349104, 348256, 349470, 351797, 353762, 355003, 356051, 357321, 359112, 361797, 365247, 368684, 371651, 374502, 377534, 380368, 382594, 384354, 386049]
56408C86049K117L297M972O108O287O292O437N761M099L248M440O190O498N742
56394D57537N315M956L684K212J920K370K190J575J567J798J327Q82J723K883
56380D91939K326L87n71J75R43O49K07N88J475K064J623n04l758n556l800j15
56364D88072J585l4k323k473q86lj108l271m782n059n051n685o229n264l199k109
56348D42181k586k848j882j196j979k724j789k15K54J69Q77J676J159R6K18J183
56332D32594J469J275J890K983L148K514K346K653K391J401J60j397k843k424
56318D48160L81K979K868J279Q78J501J278O20J411L219L928L475L518L858K842
56303D82195J026Q90K844M650N036M878M755M159L367L426M225M739M875M940
$$ y = [386049, 388166, 391463, 396435, 402543, 408830, 415122, 421559, 427320, 431419, 434667, 439107, 445297, 451795, 457537, 462852, 467808, 471492, 473704, 475624, 477994, 480184, 481759, 483326, 485124, 486451, 487333, 489056, 491939, 494265, 494652, 494081, 494256, 495199, 495848, 496055, 496643, 498118, 500182, 501805, 501301, 497543, 491987, 488187, 488072, 489657, 489623, 487300, 484827, 483941, 483938, 482830, 479559, 474777, 469718, 464667, 458982, 452753, 447489, 444290, 442181, 439595, 436747, 434865, 433669, 431690, 428966, 427177, 426962, 427216, 427385, 428262, 429938, 431097, 431193, 431411, 432594, 434063, 435338, 437228, 440211, 443359, 445873, 448219, 450872, 453263, 454664, 454824, 453427, 450584, 448160, 448541, 451520, 454388, 455667, 456545, 458046, 459324, 459944, 461355, 464574, 468502, 471977, 475495, 479353, 482195, 483221, 484111, 486955, 491605, 496641, 501519, 506274, 510433, 513800, 517226, 521451, 526190, 531065, 536005]
56289E36005M286K813K549M721O674N198J776O46K610M834O095P714R595R879
56275F05395Q863Q919R981R299O437M461N143O678P211P143O995O353N884P238
56261G06000R947J1481J1106J0716J1337J1934J2112J2787J3635J3173J1786J1399
56249H47413J1955J1697J1047J2137J4168J3615R929O782O374O698N888N110N355
56236I68168N230M034L597N053O784P377P711Q687R738J0914J3295J6278J7727
56223A084593J7930J9853K4188K7906K9294L0479L3097L5268L5446L5822L9043
56212A412919M4255M8933N2481N5885N9807O4759P1194P8146Q3859Q8670R4880
56201B155788J03131J11756J20229J29976J41104J51881J62426J75067J89736
$$ y = [536005, 540291, 543104, 545653, 550374, 557048, 562246, 564022, 564668, 567278, 572112, 578207, 585921, 595516, 605395, 614258, 623177, 633158, 642457, 648894, 653355, 658498, 665176, 672387, 679530, 686525, 692878, 698762, 706000, 715947, 727428, 738534, 749250, 760587, 772521, 784633, 797420, 811055, 824228, 836014, 847413, 859368, 871065, 882112, 894249, 908417, 922032, 931961, 938743, 945117, 951815, 957703, 962813, 968168, 973398, 977432, 981029, 986082, 992866, 1000243, 1007954, 1016641, 1026379, 1037293, 1050588, 1066866, 1084593, 1102523, 1122376, 1146564, 1174470, 1203764, 1234243, 1267340, 1302608, 1338054, 1373876, 1412919, 1457174, 1506107, 1558588, 1614473, 1674280, 1739039, 1810233, 1888379, 1972238, 2060908, 2155788, 2258919, 2370675, 2490904, 2620880, 2761984, 2913865, 3076291, 3251358, 3441094]
56192C441094K02798K12040K19157K25716K30308K31392K29329K23827K12926
56183E428587J96371J76503J54191J27442R5914O3065L1986K609k5227m9856p0696
56172F130889q9192j05008j15417j20430j24253j29315j33115j33422j32290j32220
56162D916227j32614j32934j35099j39479j42565j42091j40830j41934j44049
56153C664632j44283j42612j40143j36395j31400j27135j23966j19090j11221
56144B488387j02983r6044q8270p8803p1208o7765o5130n9845n3899n0301m7453
56133A706686m2800l8118l5927l4112k9591k4298k2025k1894k0344j7424j5743
56122A404410j4916j2306p982m412k231m03P54O36J015L813P536R369R460R887
$$ y = [3441094, 3643892, 3855932, 4075089, 4300805, 4531113, 4762505, 4991834, 5215661, 5428587, 5624958, 5801461, 5955652, 6083094, 6179008, 6242073, 6274059, 6276668, 6251441, 6201585, 6130889, 6041697, 5936689, 5821272, 5700842, 5576589, 5447274, 5314159, 5180737, 5048447, 4916227, 4783613, 4650679, 4515580, 4376101, 4233536, 4091445, 3950615, 3808681, 3664632, 3520349, 3377737, 3237594, 3101199, 2969799, 2842664, 2718698, 2599608, 2488387, 2385404, 2289360, 2201090, 2122287, 2051079, 1983314, 1918184, 1858339, 1804440, 1754139, 1706686, 1663886, 1625768, 1589841, 1555729, 1526138, 1501840, 1479815, 1457921, 1437577, 1420153, 1404410, 1389494, 1377188, 1369206, 1364794, 1362563, 1362160, 1362914, 1363550, 1364565, 1368378, 1375914, 1385283, 1394743, 1404630]
56108A404630J1009J2022J3405J5767J7997J9204K0523K2602K3883K3768K4466
56097A609276K6941K8458K7168K5597K6257K7431K6973K6614K8668L1905L4797
56086A920085L9071M5704N1099N1850N0042M9137M8016M4015L8801L6326L7675
56075B411821M2416N2063O7449Q5531J03137J20837J38928J53215J59515J58782
56065C493694J53392J42535J26445J10708J00294R2914Q3952P3827O4368N2187
56055D494316L3196J0647q476k2606l4567m4512n1047n7174o7944q3507j00300
56044D068026j16891j32726j43815j46354j42540j36753j28575j15801j01234
56035B903337q9653q0440o9982n8922n0378m3659l6451l0478k8141k6480k1595
$$ y = [1404630, 1415639, 1427661, 1441066, 1456833, 1474830, 1494034, 1514557, 1537159, 1561042, 1584810, 1609276, 1636217, 1664675, 1691843, 1717440, 1743697, 1771128, 1798101, 1824715, 1853383, 1885288, 1920085, 1959156, 2004860, 2055959, 2107809, 2157851, 2206988, 2255004, 2299019, 2337820, 2374146, 2411821, 2454237, 2506300, 2573749, 2659280, 2762417, 2883254, 3022182, 3175397, 3334912, 3493694, 3647086, 3789621, 3916066, 4026774, 4127068, 4219982, 4303934, 4377761, 4442129, 4494316, 4527512, 4538159, 4529683, 4507077, 4472510, 4427998, 4376951, 4319777, 4251833, 4168326, 4068026, 3951135, 3818409, 3674594, 3528240, 3385700, 3248947, 3120372, 3004571, 2903337, 2813684, 2733244, 2663262, 2604340, 2553962, 2510303, 2473852, 2443374, 2415233, 2388753, 2367158]
56024B367158j5990j4224j4347j1439o610m418m123j779J646K560K554N509R513
56011B316010J0266R944J3691J9668K1946K1121K2624K6342K7586K6839K8862
56000B544899L3245L5224L4939L6695M0142M1243M0812M3068M7104M8799M9400
55989B995570N2875N6774N5598N1455N1295N5252N7952N9423O4050P0375P2947
55978C643566P2955P6203Q1883Q4314Q4227Q7174R2368R4567R5280J00428J08588
55967D621553J13405J15818J21710J29672J33854J36535J44479J55206J60905
55958E833137J63565J71529J83316J90322J93532K01359K12748K19307K22884
55949G591699K33609K51272K66371K79056K98798L25469L49271L69335L93502
$$ y = [2367158, 2351168, 2336944, 2322597, 2311158, 2304548, 2300130, 2296007, 2294228, 2295874, 2298434, 2300988, 2306497, 2316010, 2326276, 2336220, 2349911, 2369579, 2391525, 2412646, 2435270, 2461612, 2489198, 2516037, 2544899, 2578144, 2613368, 2648307, 2685002, 2725144, 2766387, 2807199, 2850267, 2897371, 2946170, 2995570, 3048445, 3105219, 3160817, 3212272, 3263567, 3318819, 3376771, 3436194, 3500244, 3570619, 3643566, 3716521, 3792724, 3874607, 3958921, 4043148, 4130322, 4222690, 4317257, 4412537, 4512965, 4621553, 4734958, 4850776, 4972486, 5102158, 5236012, 5372547, 5517026, 5672232, 5833137, 5996702, 6168231, 6351547, 6541869, 6735401, 6936760, 7149508, 7368815, 7591699, 7825308, 8076580, 8342951, 8622007, 8920805, 9246274, 9595545, 9964880, 10358382]
55940A0358382M19958M38925M52706M73787N02948N30267N57623N97581O49355
55931A4981532O99285P46220Q02122Q66162R23887R74328J031696J097335J157212
55922B3279779J210153J270489J339348J402911J462987J538473J632316J729420
55914C4865876J831371J958220K110607K266988K424821K605911K814862L034391
55906E3913047L269647L552658L894789M283287M734418N298033N999950O836746
55898I1782575P834604R043529J0459431J2029338J3751818J5687980J7860718
55891A78449993K0255123K2941573K6051655K9572472L3304589L7015964M0258793
55884C87850162M1744508L9264076L0993006J7269522R13755j4424925k6264044
$$ y = [10358382, 10778340, 11217265, 11669971, 12143758, 12646706, 13176973, 13734596, 14332177, 14981532, 15680817, 16427037, 17229159, 18095321, 19019208, 19993536, 21025232, 22122567, 23279779, 24489932, 25760421, 27099769, 28502680, 29965667, 31504140, 33136456, 34865876, 36697247, 38655467, 40766074, 43033062, 45457883, 48063794, 50878656, 53913047, 57182694, 60735352, 64630141, 68913428, 73647846, 78945879, 84945829, 91782575, 99617179, 108660708, 119120139, 131149477, 144901295, 160589275, 178449993, 198705116, 221646689, 247698344, 277270816, 310575405, 347591369, 387850162, 429594670, 468858746, 499851752, 517121274, 518035029, 503610104, 477346060]
55877D77346060l3910049l7788729l8689741l7497401l5075617l2069308k8832619
55870B33482596k5572850k2466475j9621950j7055028j4766664j2787418j1122551
55863A10089660r722558q537589p547851o722711o006440n367514m815511m351518
55855E7017968l945726l579308l264312l004135k773600k555175k358943k190656
55847C3346113k034039j880172j742423j626758j516789j402904j298386j212521
55839B0632121j134009j054616r84044r27541q72559q11359p54970p11632o71986
55830A2709405o28136n87853n57638n29986m98989m71413m51604m31860m07531
55821H144395l85640l69627l51746l29178l11276l02025k91578k74155k58181
$$ y = [477346060, 443436011, 405647282, 366957541, 329460140, 294384523, 262315215, 233482596, 207909746, 185443271, 165821321, 148766293, 133999629, 121212211, 110089660, 100367102, 91829513, 84281662, 77558951, 71552511, 66184997, 61369486, 57017968, 53072242, 49492934, 46228622, 43224487, 40450887, 37895712, 35536769, 33346113, 31312074, 29431902, 27689479, 26062721, 24545932, 23143028, 21844642, 20632121, 19498112, 18443496, 17459452, 16531911, 15659352, 14847993, 14093023, 13381391, 12709405, 12081269, 11493416, 10935778, 10405792, 9906803, 9435390, 8983786, 8551926, 8144395, 7758755, 7389128, 7037382, 6708204, 6396928, 6094903, 5803325, 5529170, 5270989]
55812E270989k49426k40037k24019k08282j98120j86448j67937j50213j40334
55803C506173j32905j21802j11601j07050j02716r3204q3130p7490p2234o3319
55793B540722n5116n1159m6587l8279l2633l4757l9420m1060m3122m8986n3165
55782B056438n0638m6134m5259m4668l9848l4496l3166l2099k6435j9721j7521
55771A666453j7765j5826j3417j4406j7131j8291j9516k3168k6685k7403k7987
55760A444858l1092l3869l3402l2163l2642l2319k9369k7389k8789k9553k6243
55749A108028k2184k0966j9979j6377j3348j4034j4988j2165q026o313n048j245
55737I53355K479K481O80L87O3k869o397p865r042j1657j2648r686o757q212j1662
$$ y = [5270989, 5021563, 4781526, 4557507, 4349225, 4151105, 3964657, 3796720, 3646507, 3506173, 3373268, 3251466, 3139865, 3032815, 2930099, 2836895, 2753765, 2676275, 2604041, 2540722, 2485606, 2434447, 2387860, 2349581, 2316948, 2282191, 2242771, 2201711, 2158589, 2109603, 2056438, 2005800, 1959666, 1914407, 1869739, 1829891, 1795395, 1762229, 1730130, 1703695, 1683974, 1666453, 1648688, 1632862, 1619445, 1605039, 1587908, 1569617, 1550101, 1526933, 1500248, 1472845, 1444858, 1413766, 1379897, 1346495, 1314332, 1281690, 1249371, 1220002, 1192613, 1163824, 1134271, 1108028, 1085844, 1064878, 1044899, 1028522, 1015174, 1001140, 986152, 973987, 965961, 959648, 954600, 953355, 955834, 958315, 958995, 959382, 959445, 956576, 950179, 942314, 933272, 921615, 908967, 899281, 892524, 884312, 872650]
55722H72650j2629j1809j1756j0863p132l703m086n604m042j319k147o140r567
55709G81853j1994j5051j7212j5994j3175j2230j2545j1368r335r064j0265j1025
55697F32595j1820j3887j5924j6699j8446k3350k9226l2985l5922m1204m8405
55686C44727n4376n7042n4932m6166l1951j8041q716k304L923Q449R381R473J2134
55673A14559J5677J6554J5302J4461J3562J1101Q494P337N622J519k226k518j441
55660B18003k548m647m615l380l589l964j755J528K390J391J519K602K592K443
55646B07970M300O652O603N299N902P775P858O326N676N624L953J209k81p20j584
55631B72562j673Q25M054N102N143P013R456R104O605N431N926N819N270N944
$$ y = [872650, 860021, 848212, 836456, 825593, 818461, 814758, 810672, 805068, 801026, 799707, 797560, 791420, 781853, 769859, 754808, 737596, 721602, 708427, 696197, 683652, 672284, 662949, 653885, 643620, 632595, 620775, 606888, 590964, 574265, 555819, 532469, 503243, 470258, 434336, 393132, 344727, 290351, 233309, 178377, 132211, 100260, 82219, 73503, 71199, 75122, 83571, 92952, 102425, 114559, 130236, 146790, 162092, 176553, 190115, 201216, 209710, 217047, 222669, 224188, 221962, 219444, 218003, 215455, 210808, 206193, 202813, 199224, 195260, 193505, 195033, 197423, 198814, 200333, 202935, 205527, 207970, 212270, 218922, 225525, 230824, 236726, 244501, 252359, 258685, 264361, 269985, 273938, 275147, 274866, 274146, 272562, 270889, 271714, 275768, 280870, 286013, 293026, 302482, 311586, 318191, 323622, 329548, 335367, 340637, 346581]
55617C46581O426M141P37o6R50j44l374n049m426m228m666l028O01K884L077L766
55601C44182N244M711J945M54J754L405L965N103P438Q793Q164P357P303O518
55587D16336M406K393Q08j744m943o495o259o872r134j0559r816r041j0086j1637
55573C37357j1690j0311q572p084o528p511r150r804r442r266r321q888q746j0055
55559B10989j1450j0485p669n763n243m102k104j439k623l451k787k060k239k379
55545A47195j924j589j412p30l78j856m117m385k527j382k188l058k605j843j664
55530A15537j475j202j800k958l055k006j386j286n2K340L630K717R13p68k585
55515A06564l851k930k88J394J088N66R89J235M50n45j287k294k875j288J959
$$ y = [346581, 353007, 357148, 357885, 357819, 358769, 358625, 355251, 350202, 345776, 341548, 336882, 333854, 334455, 337339, 340416, 344182, 349426, 354137, 356082, 356536, 358290, 361695, 365660, 370763, 378201, 386994, 395158, 402515, 409818, 416336, 420742, 423135, 423943, 422199, 417256, 410761, 404502, 397630, 388496, 377937, 368121, 359080, 348994, 337357, 325667, 315356, 306784, 299700, 293172, 285661, 276511, 266707, 257265, 247999, 238678, 229790, 221044, 210989, 199539, 189054, 181385, 175622, 170379, 166277, 164173, 162734, 160111, 156660, 153873, 151813, 149574, 147195, 145271, 143682, 142270, 141540, 141162, 139306, 135189, 130804, 128277, 126895, 124707, 121649, 119044, 117201, 115537, 114062, 112860, 111060, 108102, 105047, 103041, 101655, 100369, 100317, 102657, 106287, 109004, 109917, 109149, 106564, 102713, 99783, 99495, 100889, 101977, 102543, 103532, 104767, 105217, 104672, 103385, 101091, 98216, 96928, 98887]
55500I8887L801K708N73m80o96j164k054l360n138o355n584l249j037R35L756
55485H1543O712P701O746N880N348L504Q59K39K032L149K147J533L217N234N197
55470A41041L928L400L737M368N677P416P656N378K192l5j268j691m50K231L871
55455A87451K625k68k445l200l122k761k874m249o139o690n754n326o343p260
55441A33645o864o159o289o783p006p288p537o806n323m721n298n366m263l432
55427E0510l441k717o17R93Q57L41N92L78j227k486j682r9M3j078j914k318l096
55410C3039l970l918k737q80J254K895L027J843P17J36o76j602j418m03n31k037
55394B4739k535r89L39l42j327m66J194J370K17l85K11J322K405K858J784l18
$$ y = [98887, 102688, 105396, 105969, 105489, 104793, 103629, 101575, 98215, 93077, 86722, 81138, 77889, 76852, 77787, 81543, 88255, 95956, 102702, 108582, 113930, 117434, 118293, 118532, 120564, 123713, 125860, 127393, 130610, 135844, 141041, 144969, 148369, 152106, 156474, 162151, 169567, 177223, 182601, 184793, 184758, 183490, 181799, 181349, 183580, 187451, 190076, 189808, 187363, 184163, 181041, 178280, 175406, 171157, 165018, 158328, 152574, 147248, 140905, 133645, 126781, 120622, 114333, 107550, 100544, 93256, 85719, 78913, 73590, 68869, 63571, 58205, 53942, 50510, 47069, 44352, 43735, 44728, 45585, 45926, 46518, 46896, 45669, 43183, 41501, 41402, 41445, 40367, 38453, 36135, 33039, 29069, 25151, 22414, 21534, 22788, 25683, 28710, 30553, 31270, 31406, 30730, 29128, 27710, 27307, 26776, 24739, 22204, 21215, 21554, 21212, 19885, 19419, 20613, 21983, 22200, 21815, 22026, 23348, 25753, 28611, 30395, 30077]
55378C0077j277k08R36L94p61p44J34P36J302K232K589J820J278J902K271J172
55362D3853J02Q14K160K163J437J629J900K46k504l372j612M54R98N18K5m06q27
55345D7578r08o29l35p6K05K79K23O26J326J107k88j218n80J63p51k483k935k027
55327C9277j496k082k932l302l032j768N45K646L051J983R75R29J574K317K494
55312D1179J481k91j202m11Q43R37q3j159j783j806r53J39j09j819k648j000J217
55295C2532J150q33j876p18J241K486K767K096M47j345k016j489r43j238k115
55280C0146k702k145l06J526J542k34j624j215k21k49p37k16J067J682J251M32
55264B7997m84j441j881j648j703k490k667j125Q22J186J83n64p05r24q06O41
$$ y = [30077, 28800, 28592, 29528, 29922, 29161, 28417, 28551, 29287, 30589, 32821, 35410, 37230, 38508, 40410, 42681, 43853, 43955, 44769, 46929, 49092, 50529, 52158, 54058, 54304, 51800, 48428, 46816, 47270, 48268, 48786, 48811, 48405, 47578, 46670, 46041, 45706, 45630, 45835, 46114, 46337, 46963, 48289, 49396, 49108, 47890, 47310, 47473, 46722, 44239, 41304, 39277, 37781, 35699, 32767, 29465, 26433, 24665, 25210, 27856, 30907, 32890, 33865, 34794, 36368, 38685, 41179, 42660, 42369, 41167, 40756, 41599, 42536, 42453, 41294, 39511, 37705, 36752, 36891, 36782, 34963, 32315, 31315, 32532, 33682, 32849, 30973, 30255, 31496, 33982, 36749, 38845, 39292, 37947, 35931, 34442, 33499, 32261, 30146, 27444, 25299, 24993, 26519, 28061, 27827, 26203, 24988, 24767, 24518, 23781, 23565, 24632, 26314, 27565, 27997, 27513, 26072, 24191, 22543, 20840, 18350, 15683, 14558, 15380, 16566, 16749, 16185, 15480, 14556, 13750, 14391]
55248A4391K636L097J562j64m74L80J198J295R05R03J765K474J458q22j743j07
55232B8754J919J879L73n67p04r43q63L78J660J191m80j155l01P67J414J977J949
55215C7248N08j228j040J056K671K406J216J48j017k296k700j740k92O65J000
55200C6605Q09J05o97r96q16n41r7N74P41k05j525k064j839j517j032j52L78j08
55182B7623q38r34j081j949k098O8L075L879K308J173J814K379J094j254k967
55167C2292l500l025j627J99J586K354K941L146K336R38J99M58R18J169J446J557
55151D3387J109N84O25N85m89j804j792p66l09k38J130L552M447K660J69r68j074
55134E0808j216j256q84p50j141j042Q8R45K11j338j915j207m43m12n73j07Q21
$$ y = [14391, 17027, 20124, 21686, 21522, 21048, 21428, 22626, 23921, 24826, 25729, 27494, 29968, 31426, 30604, 28861, 28754, 30673, 32552, 32925, 32358, 31654, 30711, 29848, 30226, 31886, 33077, 32597, 31442, 31141, 31908, 33322, 35299, 37248, 37756, 36528, 35488, 36544, 39215, 41621, 42837, 42985, 41968, 39672, 36972, 35232, 34940, 35605, 36605, 37414, 37519, 36822, 35826, 35010, 34469, 34372, 34946, 35687, 35482, 33957, 31893, 30054, 28537, 27505, 27353, 27731, 27623, 26785, 25851, 24770, 22821, 20723, 20791, 23866, 27745, 30053, 31226, 33040, 35419, 36513, 35259, 32292, 28792, 25767, 24140, 24339, 25925, 28279, 31220, 34366, 36702, 37640, 37839, 38297, 39215, 40384, 41830, 43387, 44496, 45080, 45705, 46290, 45801, 43997, 42205, 41439, 41130, 40892, 42022, 45574, 50021, 52681, 52850, 51882, 50808, 49592, 48336, 47452, 46702, 45561, 44519, 44607, 45552, 45763, 44425, 42510, 41303, 40860, 40448, 39875, 39768, 40589]
55117D0589J161L03r20j101l19k67j721l057k546r26o2KO06J816K422K246K147
55100D0373J914N02j561k353j530q68j432k287k530k376j720J01K282K523K60
55085C1298k040k093o03M50O96J012J444J193K02n08q6J165K015J492Q6o21l0
55068C5072N66M5n83K15J815K443K108K270K996L009K372K479L223K880J295L89
55052F2594Q62J068Q6q14q11r69j804j963r29n20j915l340k769r39L33J031K136
55035E1337L304L483K749J760N09p83p98J082L194L569K500J564J141O64K89M74
55019G6038N76j49p92Q6J957K766J914J022J483K542K436O61j426k080j058J30
55003H6106R2p34r99o14n47o83K51K167L000J598n32j514j579j825k004j321l48
$$ y = [40589, 41750, 42053, 41133, 40032, 39713, 39446, 37725, 34668, 32122, 31196, 31134, 31136, 31742, 33558, 35980, 38226, 40373, 42287, 42789, 41228, 38875, 37345, 36477, 35045, 32758, 30228, 27852, 26132, 26233, 28515, 31038, 31298, 29258, 27165, 26562, 27012, 27708, 28720, 30164, 31357, 31559, 31051, 30965, 32130, 34145, 35637, 35723, 35102, 35072, 35638, 35683, 35100, 35315, 37130, 39573, 41681, 43951, 46947, 49956, 52328, 54807, 58030, 60910, 62205, 62594, 63456, 64524, 64610, 63796, 62985, 62016, 60212, 58249, 57320, 56800, 54885, 51545, 48776, 47837, 48170, 49201, 51337, 54641, 58124, 60873, 62633, 63142, 62359, 61561, 62643, 65837, 69406, 71906, 73470, 74611, 75275, 75564, 76038, 76614, 76465, 75673, 75759, 77716, 80482, 82396, 83418, 84901, 87443, 89879, 90540, 89114, 87034, 85976, 86106, 86198, 85464, 84465, 83851, 83304, 82621, 82872, 85039, 88039, 89637, 89105, 87591, 86012, 84187, 82183, 80862, 80514]
54986H0514l32j110j304l43R78J743J750J300Q31N70J99o38j327q66M19J042O97
54969H4123Q30K067K799J655q1k25J174K101J310n95k248k532j053J285K674K280
54953I5564J166O53P24Q40J132J631J349l93k540l524l163k248j100J17N62k36
54937I0534j158q30L03P33J85l42m98r53j843k334j887r33j2Q38J707K431K665
54920H8606K018L65j606k683k427j566o31Q57L113M860M576K467K89m99L51K186
54904A00276L916M631M438M218M120L232J376J04P89K670L973M287M521N122N670
54889A53343N893N949N915N948O625Q210J0022J1385J2678J4394J5693J5070J2304
54876B83429Q649N166J812j719n082p471q519q855r727j1613j3332j3328j1817
$$ y = [80514, 80182, 79072, 77768, 77425, 78403, 80146, 81896, 83196, 84027, 84597, 84796, 84158, 82831, 81965, 82384, 83426, 84123, 84953, 87020, 89819, 91474, 91393, 91168, 92342, 94443, 95753, 95158, 92910, 90378, 89325, 90610, 93284, 95564, 96730, 97383, 98107, 98947, 100079, 101710, 103059, 102666, 100126, 96602, 93439, 91191, 90091, 90208, 90770, 90534, 89376, 88546, 88849, 89582, 89767, 89425, 88927, 87974, 86131, 83797, 81910, 80977, 80965, 81803, 83510, 85941, 88606, 90624, 90989, 89383, 86700, 84273, 82707, 82076, 82933, 86046, 90906, 95482, 97949, 98238, 97739, 98090, 100276, 104192, 108823, 113261, 117479, 121599, 124831, 126207, 126311, 127100, 129770, 133743, 138030, 142551, 147673, 153343, 159236, 165185, 171100, 177048, 183673, 191883, 201905, 213290, 225968, 240362, 256055, 271125, 283429, 292078, 297244, 299056, 297337, 292255, 284784, 276265, 267410, 257683, 246070, 232738, 219410, 207593]
54863B07593j0682j0925j1425j0670q588o023l586j815j376k129k865k795k414
54850A32300k203j577J15K531N059P490R226R271P980P502R134J1446J2281J1582
54836B22137J0832J0689J0619J0031Q448N287P78l629o815r199j1463j3128j3573
54823B21014j3324j3059j2379j0883r332q455p635o211m977m843n135m747l971
54810A16063l540l015j856r80j369k068j550k35K76k13o71r13j568k452k851k912
54794I0146l040k614j087L46P5j486k573k560j948p18J205K599K297J314J431
54779H3387K202J713j04j302r28J05R70J525J194n19k360k389o83R65J862K711
54763H8349L351K665Q45m89p01n33j90P95J815J674Q48R16J730J683Q49J101K861
$$ y = [207593, 196911, 185986, 174561, 163891, 155303, 149280, 145694, 143879, 142503, 140374, 137509, 134714, 132300, 130097, 128520, 128635, 131166, 136225, 143715, 152941, 162212, 170192, 177694, 186828, 198274, 210555, 222137, 232969, 243658, 254277, 264308, 272756, 278043, 278821, 275192, 268377, 259178, 247715, 234587, 221014, 207690, 194631, 182252, 171369, 162037, 153582, 145947, 139736, 134759, 129916, 124781, 120034, 116063, 112523, 109508, 107652, 106672, 105303, 103235, 101685, 101450, 101726, 101513, 100842, 99929, 98361, 95909, 93058, 90146, 87106, 84492, 83405, 83751, 83826, 82340, 79767, 77207, 75259, 74541, 75746, 78345, 80642, 81956, 83387, 85589, 87302, 87198, 85896, 84968, 85073, 86043, 87568, 88762, 88243, 85883, 83494, 82811, 83776, 85638, 88349, 91700, 94365, 95210, 94721, 94020, 93487, 93297, 94092, 95907, 97581, 98429, 99345, 101075, 102758, 103607, 104708, 107569]
54746A07569M429M998N495N927M911K745J958L430M749M053L004M062O864R262
54732A73456J0400J0875J1165J1375J1656J1759J1226J0639J1381J3464J5010
54721C02406J4492J1994P947K588k691n725o312o665q165r628r807r409r286q794
54707B62945p498o503o440n950l962j791j149j548j457o59K72J564L423M887N236
54692B41370N440O585Q028Q808R680J1861J4677J6441J6863J6871J6671J5725
54680C89020J3958J1535Q103L730l32l390o867j2137j7627k0196j9155j6903j5630
54667C14109j5267j4891j4367j3917j3219j1675r172o425m662m596n420n451m192
54654A90855k880k541k626k328j908j739j212PQ94N98J5L17Q74L61r44j727j714
$$ y = [107569, 111998, 116996, 122491, 128418, 133329, 136074, 138032, 141462, 146211, 150264, 153268, 157330, 164194, 173456, 183856, 194731, 205896, 217271, 228927, 240686, 251912, 262551, 273932, 287396, 302406, 316898, 328892, 336839, 339427, 336736, 331011, 324699, 318034, 309869, 300241, 290434, 281025, 271739, 262945, 255447, 248944, 242504, 236554, 232592, 230801, 229652, 228104, 226647, 225988, 226260, 227824, 231247, 236134, 241370, 246810, 253395, 261423, 270231, 279911, 291772, 306449, 322890, 339753, 356624, 373295, 389020, 402978, 414513, 422616, 426346, 426014, 422624, 415757, 403620, 385993, 365797, 346642, 329739, 314109, 298842, 283951, 269584, 255667, 242448, 230773, 221601, 215176, 210514, 205918, 200498, 195047, 190855, 187975, 185434, 182808, 180480, 178572, 176833, 175621, 175628, 176522, 177120, 177135, 177452, 178326, 178687, 177743, 176016, 174302]
54637A74302j469q16N48J626J403R34J969L812M068K419J046R46M75j474l270
54622A86519l018j385l03j61K9O37J127J246J254J341J791L273N832P976P991
54607B14149O072M157L570L840M086M449N439O623O900N865M209K820K152K317
54593B76648L043L409K548R74L58J454L138M128M652N359N645M753L739M460O689
54578C30997Q385R030J0502J3796J6862J7058J4325J0500O662K634j679n927r896
54565D23249j3350j5681j6639j6836j6724j5713j3245j0195q084p301p027o616
54553B75838o098n517m642l316j620R8J153R92Q8l38Q0L96n3n41k55L59M27m2
54535B57009o49j547k790l503l004k243k797m880p232q668q751p489n489m018
$$ y = [174302, 172833, 172017, 172565, 174191, 175594, 176528, 178497, 182309, 186377, 188796, 189842, 190788, 191263, 189789, 186519, 183501, 182116, 181813, 181652, 181681, 182318, 183445, 184691, 185945, 187286, 189077, 192350, 198182, 206158, 214149, 220221, 224378, 227948, 231788, 235874, 240323, 245762, 252385, 259285, 265150, 269359, 272179, 274331, 276648, 279691, 283100, 285648, 286622, 286980, 288434, 291572, 295700, 300352, 305711, 311356, 316109, 319848, 324308, 330997, 339382, 348412, 358914, 372710, 389572, 406630, 420955, 431455, 438117, 440751, 439072, 433145, 423249, 409899, 394218, 377579, 360743, 344019, 328306, 315061, 304866, 296782, 289481, 282454, 275838, 269740, 264223, 259581, 256265, 254645, 254743, 255896, 256888, 256976, 256638, 256718, 257114, 257061, 256520, 256265, 256624, 257051, 257009, 256360, 254813, 252023, 248520, 245516, 243273, 240476, 235596, 228364, 219696, 210945, 203456, 197967, 193949]
54521A93949l875m465m755m646m629m668m436m015l523k625j462j129k062k839
54507A44820k069p28r15k777m366m371l256j826l62P21Q44K41k49m06o03o09J78
54490A24267J345J668R29K73N14J252J792J789R94m13j109K15K711L903K823J347
54474A44300J672L638N343N529M622M023M920P233R421R868Q563O814N350L843
54460B25139K199R85J29j421m062o569p596p274o640o294o294o547o530n419l350
54445A60456j875k170l325l414j926j50P01O47K53k47o91p05k08J68j56o95l48
54428A46315J090K390K326J180K46J83N29P46P75N28j33n49M03K442L557K603
54412A64631J210J708L758M742L297P85q06r23l1J410K744L087K335J521J359
$$ y = [193949, 190074, 185609, 180854, 176208, 171579, 166911, 162475, 158460, 154937, 152312, 150850, 149721, 147659, 144820, 142751, 142023, 141108, 138331, 133965, 129594, 126338, 124512, 124150, 124871, 125715, 125956, 125707, 125301, 124698, 124089, 124267, 125612, 127280, 128209, 128482, 128996, 130248, 132040, 133829, 134823, 134410, 133301, 133516, 136227, 140130, 142953, 144300, 145972, 149610, 154953, 160482, 165104, 169127, 174047, 181280, 190701, 200569, 209132, 215946, 221296, 225139, 227338, 228323, 228452, 227031, 222969, 216400, 208804, 201530, 194890, 188596, 182302, 175755, 169225, 163806, 160456, 158581, 156411, 153086, 149672, 147746, 147596, 148297, 148944, 149197, 148950, 148259, 147554, 147346, 147514, 147358, 146663, 146315, 147405, 149795, 152121, 153301, 153547, 153730, 154259, 155005, 155780, 156308, 156175, 155626, 156029, 158471, 162028, 164631, 165841, 167549, 171307, 176049, 179346, 180131, 179325, 178402, 178371, 179781, 182525, 185612, 187947, 189468, 190827]
54397A90827J169N3j413j748o69L00j93j553k045j116n0m5n56l38M57M36q52k187
54379A80477k458j884j102l03M8r01k684l236j573M10M83q69j737j992k717l239
54363A56723j580J952M338L776J812P12O70P31O77Q08J041J345K059L005L336
54348A81405K977K939L608M023L597L161L345L440K978L070M711O954Q199Q304
54334B42711Q055P485O338N376N440N800N055L268J659M95r86k767l879m098m226
54319B75726m554m589m493n169o546p289o783n987n643n077l712k449k367l030
54305B08038l295k963k466j649l15N40l34k378l553k899j539p90m99K03J413K418
54289A89932K530J611K57k51R37K863L497K352J327K110L839M433L520K570K665
$$ y = [190827, 191996, 192049, 190636, 188888, 188219, 188519, 188326, 186773, 184728, 183612, 183562, 183517, 182961, 182623, 183080, 183516, 182664, 180477, 178019, 176135, 175033, 174730, 174778, 173877, 171193, 167957, 166384, 166794, 167277, 166408, 164671, 162679, 159962, 156723, 155143, 157095, 161433, 165209, 167021, 167733, 168403, 169134, 169811, 170619, 171660, 173005, 175064, 178069, 181405, 184382, 187321, 190929, 194952, 198549, 201710, 205055, 208495, 211473, 214543, 219254, 226208, 234407, 242711, 250766, 258251, 264589, 269965, 275405, 281205, 286260, 289528, 291187, 291682, 290696, 287929, 284050, 279952, 275726, 271172, 266583, 262090, 256921, 250375, 243086, 236303, 230316, 224673, 219596, 215884, 213435, 211068, 208038, 204743, 201780, 199314, 197665, 197350, 197890, 197556, 195178, 191625, 188726, 187187, 186397, 185898, 186101, 187514, 189932, 192462, 194073, 194330, 194079, 195016, 197879, 201376, 203728, 205055, 207165, 211004, 215437, 218957, 221527, 224192]
54274B24192L481M265M550L988K639J280L61j026l727o485p059n438m003m190
54260B12828m937n000m754m741m407l586l475m664n667n161m208m499n594n902
54246A46233n318m757l951k088o0K83r98k049k178k494l378l625k674j679j508
54231A09759j452q05k41n15j147j270p96L0J172K142J845R8j634j916j110o73
54215A03487j206j951j830m45J603L043K960J737N65P6K3J86O42J106J073Q12
54199A11881J104J825J976J439J450K631L889M042L477L192L055K134K39j754
54185A40580k788k315o51Q18N21j467l126k785j140j41m38j016r87o49n85p09
54169A23122n61j07K89M86P78J374J868J576N31l28k66L28N05k9q21j338j209
$$ y = [224192, 227673, 231938, 236488, 240476, 243115, 244395, 244756, 243730, 240003, 233518, 226459, 221021, 217018, 212828, 207891, 202891, 198137, 193396, 188989, 185403, 181928, 177264, 171597, 166436, 162228, 157729, 152135, 146233, 140915, 136158, 132207, 130119, 130059, 130342, 129344, 127295, 125117, 122623, 119245, 115620, 112946, 111267, 109759, 108307, 107502, 107261, 106746, 105599, 104329, 103533, 103563, 104735, 106877, 108722, 108820, 107186, 105270, 104160, 103487, 102281, 100330, 98500, 98055, 99658, 102701, 105661, 107398, 107963, 108039, 108062, 108248, 108890, 109996, 111069, 111881, 112985, 114810, 116786, 118225, 119675, 122306, 126195, 130237, 133714, 136906, 139961, 142095, 142334, 140580, 137792, 135477, 134826, 135644, 136165, 134698, 131572, 128787, 127647, 127506, 127068, 126052, 125065, 124416, 123831, 123122, 122561, 122454, 122743, 123229, 124007, 125381, 127249, 128825, 129356, 129028, 128762, 129090, 129595, 129566, 128745, 127407, 126198]
54152A26198k61R68J241Q0j198j041J70P06L2p67r51r43r46l52R02J827J845J611
54134A29121J728J774J276O18K35j73j073k394l723m358l280l62K294J976j090
54119A22569l590l276j578j069k025k989l232k940j933q6J583J823Q80J09K00
54104A04446O87P82j28k108l906l477m57K692L333J754K73o9k21q29j059p1J632
54087A03274K779K595J237m39j464j613j568j884k076j312K91J640J811Q57l00
54072A03828o19O3O95K59p59j044o01p45j729k027q17N22N50r2j52R7k48q06p60
54053I5615o42j359k222j882o73p8k20N6Q37J006M73N02J417J805P17r11j656
54036I2785j315n16L79J332K259K960L078K222O91k92j5N34O8q53n39J037J871
$$ y = [126198, 125937, 126905, 128146, 128226, 127028, 125987, 126157, 126863, 126895, 126128, 125177, 124234, 123288, 122936, 123838, 125665, 127510, 129121, 130849, 132623, 133899, 134517, 134752, 134579, 133506, 131112, 127389, 123031, 119751, 119389, 121683, 123659, 122569, 118979, 115703, 114125, 113056, 111031, 108042, 104810, 101870, 99937, 99851, 101434, 103257, 104137, 104246, 104446, 105133, 105915, 105787, 103679, 99773, 96296, 95839, 98531, 101864, 103618, 103891, 103822, 103601, 102772, 101713, 101642, 103274, 106053, 108648, 109885, 109446, 107982, 106369, 104801, 102917, 100841, 99529, 99820, 101460, 103271, 104128, 103828, 103209, 103272, 103967, 104226, 103467, 102423, 101822, 101077, 99348, 97321, 96504, 97026, 97576, 97484, 97332, 97429, 97181, 96375, 95615, 94973, 93614, 91392, 89510, 88837, 88759, 88539, 88595, 89432, 90438, 90911, 91413, 92830, 94635, 95352, 94441, 92785, 91470, 90954, 91333, 92665, 94924, 97884, 100962, 103184, 103875, 103583, 103568, 104102, 104170, 103317, 102778, 103815, 105686]
54019A05686O96j234j845p43N66M65j149k651k180K39K499K893K095J750J979
54004A09066J755J032P21Q19M89r5P6P47N53l26J13K530M733M583K687J004K13
53987A30700j28k9P30J614K037K526L893N636O335N502M130L453L879M947N845
53972A81070O125O156O580P256P390P039P434R150J0821J0680Q767O652N473N242
53958B85835N730O757P563P013M921K518J132Q47P75K79n42j421k449l761m939
53943C10258n176m194k800k272l210n022o446o566n551m432l918l436j967J77
53929B55445J212J27j810k680k387k350l134l777l530k951k820k985k910k610
53915B22840k349j893p54R94K589L322L228K961K971K881J979L02j267k135k531
$$ y = [105686, 106382, 105148, 103303, 102560, 103126, 103591, 102442, 99791, 97611, 97850, 100349, 103242, 105337, 107087, 109066, 110821, 111853, 112574, 113393, 113882, 113787, 113863, 114610, 115163, 114837, 114950, 117480, 122213, 126796, 129483, 130487, 130700, 130572, 130543, 131273, 132887, 134924, 137450, 141343, 146979, 153314, 158816, 162946, 166399, 170278, 175225, 181070, 187195, 193351, 199931, 207187, 214577, 221616, 229050, 238200, 249021, 259701, 268468, 275120, 280593, 285835, 291565, 298322, 305885, 312898, 317819, 320337, 321469, 322316, 323091, 323370, 322828, 321407, 318958, 315197, 310258, 305082, 300888, 298088, 295816, 292606, 287584, 281138, 274572, 269021, 264589, 260671, 257235, 255268, 255445, 256657, 256784, 254974, 252294, 249907, 247557, 244423, 240646, 237116, 234165, 231345, 228360, 225450, 222840, 220491, 218598, 217844, 218838, 221427, 224749, 227977, 230938, 233909, 236790, 238769, 239071, 237804, 235669, 233138]
53900B33138k611j961o63J43j90o09M8R33M12j125j664p63k60j172j871n59J969
53883B23195L468L309K907L446M422M595L718L002L956O741R803J1360J1059R715
53869C04696P878N574L229J630P39l54j931l104l162k572j922q36J233L644N006
53854C19748M828M210M670O498Q293Q320O485M601M351N429O335O471O485O820
53840D03544P088O870O163N021L649K762K781K768J343j322l634m682n005n157
53826D22189n021m777n146o157o964p243p548q011q104q042q737r920r995q543
53812C17981p207p193p508o941o048n754n511m556l797m536o093o504n288l946
53798B37099l863m887n899n947m902l622l101l208l015k486k611l353l188j582
$$ y = [233138, 230527, 228566, 227903, 228046, 227856, 227247, 227295, 228228, 228640, 227515, 225851, 225088, 224828, 223656, 221785, 221226, 223195, 226663, 229972, 232879, 236325, 240747, 245342, 249060, 252062, 256018, 262759, 272562, 283922, 294981, 304696, 312574, 318148, 321377, 323007, 323746, 323392, 321461, 318357, 315195, 312623, 310701, 309865, 311098, 314742, 319748, 324576, 328786, 333456, 339954, 348247, 356567, 363052, 367653, 372004, 377433, 383768, 390239, 396724, 403544, 410632, 417502, 423665, 428686, 432335, 435097, 437878, 440646, 441989, 440667, 437033, 432351, 427346, 422189, 417168, 412391, 407245, 401088, 394124, 386881, 379333, 371322, 363218, 355176, 346439, 336519, 326524, 317981, 310774, 303581, 296073, 289132, 283084, 277330, 271819, 267263, 263466, 258930, 252837, 246333, 241045, 237099, 233236, 228349, 222450, 216503, 211601, 207979, 204878, 201670, 198655, 196169, 193558, 190205, 187017, 185435]
53784A85435k22m54j140q16l19j130k361j998m04J25r34j672r87j22k93q25o85
53767A71198k02j95m10J20J737L674M585L480P47j778k448j485l67L3p3m28r18
53750A77270r34J77J861K683K111J085O81J124K177L515M602M979M877M863M983
53735B16054M959M928N223N724O286P291Q746R464Q459O624N559N226M541L698
53721C02782L783M242L272J093K43J766L458L204K012J980K914K846R39j785l950
53706C28799m794m253l233l087l957m381l393j981j479j602j413j090j244j362
53692B91530o09M96R29J036J832K752K138j49k448l773m678n406n112l765l020
53677B71753m005n457n413l849k410k083k462k975l550l994l715k571j437j320
$$ y = [185435, 185213, 184759, 183619, 182803, 182484, 181354, 178993, 176995, 176591, 176716, 175782, 174110, 173123, 173001, 172708, 171883, 171198, 170996, 170801, 170391, 170511, 172248, 175922, 180507, 183987, 184734, 182956, 180508, 179023, 178656, 178689, 178616, 178188, 177270, 176336, 176513, 178374, 181057, 183168, 184253, 184934, 186058, 188235, 191750, 196352, 201331, 206208, 211071, 216054, 221013, 225941, 231164, 236888, 243174, 250465, 259211, 268675, 277134, 283758, 289317, 294543, 299084, 302782, 306565, 310807, 314079, 315172, 315415, 317181, 320639, 323843, 325855, 327835, 330749, 333595, 334534, 332749, 328799, 324005, 319752, 316519, 313432, 309475, 305094, 301701, 299720, 298241, 296639, 295226, 294136, 292892, 291530, 290921, 291417, 292346, 293382, 295214, 297966, 300104, 299955, 297507, 293734, 289056, 283650, 278538, 274773, 271753, 267748, 262291, 256878, 253029, 250619, 248536, 246074, 243099, 239549, 235555, 231840, 229269, 227832, 226512]
53663B26512j975j845K59L416N068L713O67j451j672j099n95M21K340M083M532
53648B42374M330M762N525N203L692K584K936M122N233O213O921O589N240M542
53634C10266N816P922Q539P185N571N019M975M366L278K612K803L396L472K337
53620C77557J99j730k352j923j497j291n33R61K170K244J543O78m02j695k461
53605C71468k173j401q95m65J44Q2j543l842m783l670j819p00m39l90j72J92M98
53588C50092N22L28L81P69P11l82j666j823r85m07l44J29R95Q04q96k346j928
53571C43954l93P35J708L645N753N706L089N56O93K953M598M050K300J358K148
53556C82853L971N486N968N660N223M927M558L973L555L924N308P114Q286Q187
$$ y = [226512, 224537, 222692, 222951, 226367, 231435, 235148, 235815, 234364, 232692, 231593, 230998, 231419, 233759, 237842, 242374, 246704, 251466, 256991, 262194, 265886, 268470, 271406, 275528, 280761, 286974, 293895, 300484, 305724, 310266, 316082, 324004, 332543, 339728, 345299, 350318, 355293, 359659, 362937, 365549, 368352, 371748, 375220, 377557, 377756, 376026, 373674, 371751, 370254, 368963, 368430, 369391, 371561, 373805, 375348, 376026, 375624, 373929, 371468, 369295, 367894, 366999, 366534, 366678, 366760, 365217, 361375, 356592, 352922, 351103, 350403, 349964, 349574, 349402, 349594, 350092, 350614, 350942, 351323, 352092, 352803, 352421, 350755, 348932, 347947, 347540, 347196, 347325, 348320, 349124, 348228, 345882, 343954, 343561, 344296, 346004, 349649, 355402, 361108, 364197, 364753, 365446, 368399, 372997, 377047, 379347, 380705, 382853, 386824, 392310, 398278, 403938, 409161, 414088, 418646, 422619, 426174, 430098, 435406, 442520, 450806, 458993]
53542D58993P276O634O813P361P556P257O849O680O954P878R465J1306J2795J3391
53528E77208J2487R733O011L535L883O089P672P587P068P344P860P461O254N137
53514F75329M269L280K604L166M676N508M702L171K453K996M112M910M852L933
53500G29961K989L216M871O780P698P663P502P522P448P303P393P470O885N653
53486H20354M648M408M371L683K509K092L476O102P791O625L161K54J11J865K845
53471H74295J829J57k60J052L275N447O930P554P770Q378R768J1709J3765J5489
53457I67158J6307J6150J6159J7905K1589K5748K8941L0898L1873L2028L1887
53446A236643L2326L3488L4599L5445L6999L9813M2808M4695M5807M7369M9555
$$ y = [458993, 466269, 472903, 479716, 487077, 494633, 501890, 508739, 515419, 522373, 530251, 539716, 551022, 563817, 577208, 589695, 599428, 605439, 608974, 612857, 618946, 626618, 634205, 641273, 648617, 656477, 663938, 670192, 675329, 679598, 682878, 685482, 688648, 693324, 698832, 703534, 706705, 709158, 712154, 716266, 721176, 726028, 729961, 732950, 736166, 741037, 747817, 755515, 763178, 770680, 778202, 785650, 792953, 800346, 807816, 814701, 820354, 825002, 829410, 833781, 837464, 839973, 842065, 845541, 851643, 859434, 866059, 869220, 869474, 869585, 871450, 874295, 876124, 876281, 876021, 877073, 880348, 885795, 892725, 900279, 908049, 916427, 926195, 937904, 951669, 967158, 983465, 999615, 1015774, 1033679, 1055268, 1081016, 1109957, 1140855, 1172728, 1204756, 1236643, 1268969, 1302457, 1337056, 1372501, 1409500, 1449313, 1492121, 1536816, 1582623, 1629992, 1679547]
53435A679547N1496N2756N3638N4309N4764N5497N7135N9221O0343N9699N8020
53424B296425N6785N6876N7872N8350N7196N4965N3448N3492N3960N3501N2415
53413B905285N1680N0937M9013M6072M3631M2347M1192L9228L6830L4591L2191
53402C372997K9133K5826K3095K0962J8502J4710R241K719l430p859j0475j2650
53390C482771j5981k0850k6153l0294l2535l3588l4987l7638m1093m4191m6245
53379C119216m7431m8417m9669n0920n1285n0386m9236m9152m9834m9722m8458
53368B574706m7384m6869m5000m0457l5194l2071l0826k8791k5147k1875k0328
53357B200764j9179j6563j2382p656l170M24K571L876O031R886J4510J8756K2674
$$ y = [1679547, 1731043, 1783799, 1837437, 1891746, 1946510, 2002007, 2059142, 2118363, 2178706, 2238405, 2296425, 2353210, 2410086, 2467958, 2526308, 2583504, 2638469, 2691917, 2745409, 2799369, 2852870, 2905285, 2956965, 3007902, 3056915, 3102987, 3146618, 3188965, 3230157, 3269385, 3306215, 3340806, 3372997, 3402130, 3427956, 3451051, 3472013, 3490515, 3505225, 3514466, 3517185, 3513755, 3505896, 3495421, 3482771, 3466790, 3445940, 3419787, 3389493, 3356958, 3323370, 3288383, 3250745, 3209652, 3165461, 3119216, 3071785, 3023368, 2973699, 2922779, 2871494, 2821108, 2771872, 2722720, 2672886, 2623164, 2574706, 2527322, 2480453, 2435453, 2394996, 2359802, 2327731, 2296905, 2268114, 2242967, 2221092, 2200764, 2181585, 2165022, 2152640, 2144984, 2141814, 2142238, 2144809, 2148685, 2154716, 2164602, 2179112, 2197868, 2220542]
53344B220542K6731L0718L4277L7542M0531M2730M4095M5558M7886N0854N4156
53333B675620N8154O2940O7613P1467P5062P9125Q3155Q6185Q8369R0688R3382
53322C531760R5744R7362R8728J00503J02731J04830J06105J06414J06363J06491
53312D557031J06330J04984J02621J00495R9026R6886R2585Q6129P8567P0758
53302E495412O3304N6722N0696M3907L5680K7287K0448J4930Q673K51r783j9890
53290E787637k9052l7098m4254n0795n7040o3475p0613p8368q5658r1284r5192
53279E084808r8225j00657j01921j02046j02104j02794j03402j02916j01244r8795
53269D070704r5891r3211r1746r1354r0435q8015q5053q2557p9692p5289p0260
$$ y = [2220542, 2247273, 2277991, 2312268, 2349810, 2390341, 2433071, 2477166, 2522724, 2570610, 2621464, 2675620, 2733774, 2796714, 2864327, 2935794, 3010856, 3089981, 3173136, 3259321, 3347690, 3438378, 3531760, 3627504, 3724866, 3823594, 3924097, 4026828, 4131658, 4237763, 4344177, 4450540, 4557031, 4663361, 4768345, 4870966, 4971461, 5070487, 5167373, 5259958, 5346087, 5424654, 5495412, 5558716, 5615438, 5666134, 5710041, 5745721, 5773008, 5793456, 5808386, 5817059, 5817310, 5807527, 5787637, 5758585, 5721487, 5677233, 5626438, 5569398, 5505923, 5435310, 5356942, 5271284, 5180000, 5084808, 4986583, 4885926, 4784005, 4681959, 4579855, 4477061, 4373659, 4270743, 4169499, 4070704, 3974813, 3881602, 3789856, 3698502, 3608067, 3520052, 3434999, 3352442, 3272750, 3197461, 3127201]
53258C127201o6503o3982o0835n6234n1171m6497m2042l7938l4904l2602k9414
53247B605079k4830k0612j8453j7599j6031j3145r928o920l460Q89N305Q626J0700
53234B499621J2329J4160J6185J8251K0413K2610K4451K5791K7171K9026L0745
53223B740753L1440L1622L3055L6510M0701M3898M5632M6161M5397M3507M1640
53212C180316M0703L9867L7720L4576L2155L1001K9677K6824K2791J8790J5448
53201C509868J2767J0595Q511N835K304j627n447r098j2655j6021j9353k3192
53189C462487k7606l1600l3976l4863l5948l8809m3112m6774m8291m8519m9485
53178C023504n1529n2873n2379n1476n2079n3545n3431n0916m7684m5182m2855
$$ y = [3127201, 3060698, 2996716, 2935881, 2879647, 2828476, 2781979, 2739937, 2701999, 2667095, 2634493, 2605079, 2580249, 2559637, 2541184, 2523585, 2507554, 2494409, 2484481, 2477561, 2474101, 2474990, 2480295, 2488921, 2499621, 2511950, 2526110, 2542295, 2560546, 2580959, 2603569, 2628020, 2653811, 2680982, 2710008, 2740753, 2772193, 2803815, 2836870, 2873380, 2914081, 2957979, 3003611, 3049772, 3095169, 3138676, 3180316, 3221019, 3260886, 3298606, 3333182, 3365337, 3396338, 3426015, 3452839, 3475630, 3494420, 3509868, 3522635, 3533230, 3541741, 3547576, 3549880, 3548253, 3542806, 3533708, 3521053, 3505032, 3485679, 3462487, 3434881, 3403281, 3369305, 3334442, 3298494, 3259685, 3216573, 3169799, 3121508, 3072989, 3023504, 2971975, 2919102, 2866723, 2815247, 2763168, 2709623, 2656192, 2605276, 2557592, 2512410, 2469555]
53167B469555l9935l7477l7061l8175l8438l6524l3717l2191l2485l3260l3093
53156B077199l1726k9548k6758k3579k0754j8955j7934j7039j6476j6988j8246
53145A839196j8870j8444j8281j9389k0887k1500k1611k2499k4298k6049k7166
53134A600202k7604k7215k6382k6650k9017l2003l3206l2560l2164l2979l3841
53123A266581l3970l4171l4858l4983l4013l3162l3266l3141l1510k9273k8130
53112I06104k7980k7360k5799k4068k2639k1364k0417k0025j9515j8035j6046
53101F62856j4802j4437j3923j3057j2843j3569j3928j2913j1452j1114j1921
53090E18897j2414j1529r546p401n957n797o884q126q010o298m634m845o733q196
$$ y = [2469555, 2429620, 2392143, 2355082, 2316907, 2278469, 2241945, 2208228, 2176037, 2143552, 2110292, 2077199, 2045473, 2015925, 1989167, 1965588, 1944834, 1925879, 1907945, 1890906, 1874430, 1857442, 1839196, 1820326, 1801882, 1783601, 1764212, 1743325, 1721825, 1700214, 1677715, 1653417, 1627368, 1600202, 1572598, 1545383, 1519001, 1492351, 1463334, 1431331, 1398125, 1365565, 1333401, 1300422, 1266581, 1232611, 1198440, 1163582, 1128599, 1094586, 1061424, 1028158, 995017, 963507, 934234, 906104, 878124, 850764, 824965, 800897, 778258, 756894, 736477, 716452, 696937, 678902, 662856, 648054, 633617, 619694, 606637, 593794, 580225, 566297, 553384, 541932, 530818, 518897, 506483, 494954, 485408, 478007, 472050, 466253, 459369, 451243, 443233, 436935, 432301, 427456, 420723, 412527]
53076D12527p631n599l816l084k851k446j898j482j256j338k058l313m158l630
53062C67967k042r32j562l527n027m519k102P27K487K753J982R09J77Q2K43O2
53046C57678j24J025L973O878P203M692J759O76J386K304K381J691P12k34j026
53031C90974j738k410k776k536k090k367l636m943n135m154k998k690l520m875
53017C45106n679n369m645m758n866o797o606n664m725l768k489j335r93j282
53003B85130j441j379j662k242k221j218j80k62j265j862j319l89l18j202j829
52988B66341j282l04o17k848n591o740n621l534k333k606l300l052j803q30j092
52973B24788j993k187j333m51n77j651k734k842j610L26J581J262K2o88m61l07
$$ y = [412527, 404896, 399297, 395481, 392397, 389546, 387100, 385202, 383720, 382464, 381126, 379068, 375755, 371597, 367967, 365925, 364993, 363431, 359904, 354877, 350358, 348256, 348983, 351470, 354223, 356205, 357114, 357291, 357373, 357616, 357678, 357554, 358579, 362552, 369430, 376633, 381325, 383084, 383760, 385146, 387450, 389831, 391522, 392234, 392000, 390974, 389236, 386826, 384050, 381514, 379424, 377057, 373421, 368478, 363343, 359189, 356191, 353501, 349981, 345106, 339427, 334058, 329413, 324655, 318789, 311992, 305386, 299722, 294997, 291229, 288740, 287405, 286412, 285130, 283689, 282310, 280648, 278406, 276185, 274967, 274787, 274525, 273260, 271398, 270079, 269690, 269372, 268170, 266341, 265059, 264755, 264138, 261290, 255699, 248959, 243338, 239804, 237471, 234865, 231565, 228513, 226710, 225880, 224788, 222795, 220608, 219275, 218824, 218247, 216596, 213862, 211020, 209410, 209736, 211317, 212579, 212601, 211913, 211452, 211145]
52957B11145j055k233k947l083l095l059k563j427j14N09j1q95n19J676M017M405
52941B00751L034J871J546P18r31j361O85L125L211J427M09P86P99j97o76J19
52925B15316P49K46J1J425L208L100J280M3M81J353J358Q83Q64J193J171Q00P15
52908B34196J122J677K290L288M603N460N298M538M021L994M177M580N451O530
52894B91225P063O777O089N159L584J555M29J221L018L854K960J268j43j086j739
52879C31234k078k114k047j834j309q55j285k620l713l567k546j750j565j439
52865C02512q82k05k38j537l702n362n240l444j440m44k65j5N19Q00N61J16k54
52848B81480n43o17j79N78Q79L35l76l01M96R61M00o09q22K81J863K463J448k31
$$ y = [211145, 210090, 207857, 204910, 201827, 198732, 195673, 193110, 191683, 191569, 192078, 192067, 191172, 190653, 192329, 196346, 200751, 203785, 205656, 207202, 207920, 206989, 205628, 206313, 209438, 212649, 214076, 214485, 215271, 216070, 215873, 215197, 215316, 216065, 216311, 216322, 217747, 220955, 224055, 225335, 225378, 225859, 227212, 228570, 229453, 230317, 231510, 232681, 233481, 234196, 235318, 236995, 239285, 242573, 247176, 252636, 257934, 262472, 266493, 270487, 274664, 279244, 284695, 291225, 298288, 305065, 311154, 316313, 319897, 321452, 321881, 323102, 326120, 329974, 332934, 334202, 334059, 332973, 331234, 329156, 327042, 324995, 323161, 321852, 320997, 319712, 317092, 313379, 309812, 307266, 305516, 303951, 302512, 301630, 301425, 301187, 299650, 295948, 290586, 285346, 281902, 280462, 280018, 279753, 279738, 280257, 281057, 281618, 281734, 281480, 280937, 280320, 280141, 280719, 281598, 281933, 281557, 281256, 281752, 282713, 283113, 282504, 281682, 281963, 283826, 286289, 287737, 287506]
52830B87506q73O8J161N62j579k967j822R43K829K698J702J315J594J768J686
52815B96591J815K198K289J768Q91N4m55k69P52K002K534K213J780J530P54r22
52799C15525k351k107n52L76k96j281q28R31K168J631J2r66k90J604L496M522
52783C21594M762M769M745M485M108M239N069N702N190L874K987L009L349L567
52769C81449L882M146L448J504m35r94m68l35j297k666l565l841l836l903m256
52754C68833m741m845m351l843l974m479m644m561n075o362p453p383o111m190
52740B96821k278j182j545k916l812l166j386L07J030M30j507m164o150o405n363
52725B58714m578m954n692n235l197j017l76j215j965j805j655k382l137k692
$$ y = [287506, 286633, 286701, 287862, 288424, 286845, 283878, 282056, 282999, 285828, 288526, 290228, 291543, 293137, 294905, 296591, 298406, 300604, 302893, 304661, 305552, 305606, 305151, 304882, 305634, 307636, 310170, 312383, 314163, 315693, 316447, 315525, 313174, 311067, 310515, 310891, 310595, 309314, 308486, 309417, 311585, 313216, 313228, 312262, 311972, 313576, 317072, 321594, 326356, 331125, 335870, 340355, 344463, 348702, 353771, 359473, 364663, 368537, 371524, 374533, 377882, 381449, 385331, 389477, 392925, 394429, 393994, 393000, 392532, 392197, 390900, 388234, 384669, 380828, 376992, 373089, 368833, 364092, 359247, 354896, 351053, 347079, 342600, 337956, 333395, 328320, 321958, 314505, 307122, 301011, 296821, 294543, 293361, 291816, 288900, 285088, 281922, 280536, 280843, 281873, 282303, 280796, 276632, 270482, 264077, 258714, 254136, 249182, 243490, 238255, 235058, 234041, 233665, 232450, 230485, 228680, 227025, 224643, 221506, 218814]
52711B18814j583j220j358m35J397J811m14l453m926m686l849k585p75L12q57
52696A96193l521n124m389k483j057n90r11j864k928l228k610j952j954k234k130
52681A59218j762j659j814j714j213q16j031j578j635q80J4K26j27l36l62p91
52665A43740j539j771j516j982l338l639j423J623K581J270J52M52O56n33k011
52650A32722k257j730j672j741o59J387K686K239P98m03q16l71P19J682J654R59
52634A35197J105K860M904N293L935K706K998M026M121L162K809M217O320O917
52620A90570N264K911J885K403K903K191Q95L79O90N08q58k336k614k000j833
52605B00958k506l189l403l618m218m909n532o349p048o543m528k269j085q18
$$ y = [218814, 217231, 216011, 214653, 214218, 215615, 217426, 217012, 213559, 208633, 203947, 200098, 197513, 196738, 197050, 196193, 192672, 187548, 183159, 180676, 179619, 179029, 178118, 176254, 173326, 170098, 167488, 165536, 163582, 161348, 159218, 157456, 155797, 153983, 152269, 151056, 150240, 149209, 147631, 145996, 145116, 145130, 145356, 145229, 144893, 144531, 143740, 142201, 140430, 138914, 136932, 133594, 129955, 128532, 130155, 132736, 134006, 134158, 134610, 135266, 134733, 132722, 130465, 128735, 127063, 125322, 124663, 126050, 128736, 130975, 131773, 131370, 130554, 130183, 130902, 132584, 134238, 135197, 136302, 139162, 144066, 149359, 153294, 156000, 158998, 163024, 167145, 170307, 173116, 177333, 183653, 190570, 195834, 198745, 200630, 203033, 205936, 208127, 209022, 209401, 210091, 210599, 209741, 207405, 204791, 202791, 200958, 198452, 195263, 191860, 188242, 184024, 179115, 173583, 167234, 160186, 153643, 149115, 146846, 145761, 144943]
52591A44943o79q14j807l206l826l431k969l141l514l092j283J571M020M312K102
52576A29186q99k655k792k182j230J91J609K258K492L436M922N210L262K82j740
52561A41350k221j976j677j173j48J141J953J856J289J082J281J010j02j020o91
52546A41954K03O3j366k704k887k171j085L70K068L321L585K915J579J7o91M68
52530A45639K928M752M854M029L334K593J308R8J38J558L199L888L449K690K607
52515A87064L310L749K936J393O52J297K440L146L355L175K418J344P06N83K60
52500B17828k88k7J227K040J497Q59J645L064L086J482J07L88J831L143L559L022
52484B44463J976J191J108J376J583K014K943L608K983J315j64r33j371j404l25
$$ y = [144943, 144264, 143450, 141643, 138437, 134611, 131180, 128211, 125070, 121556, 118464, 117181, 118752, 122772, 127084, 129186, 128287, 125632, 122840, 120658, 119428, 119619, 121228, 123486, 125978, 129414, 134336, 139546, 142808, 143090, 141350, 139129, 137153, 135476, 134303, 134155, 135296, 137249, 139105, 140394, 141476, 142757, 143767, 143665, 142645, 141954, 142157, 142220, 140854, 138150, 135263, 133092, 132007, 132377, 134445, 137766, 141351, 144266, 145845, 145862, 145171, 145639, 148567, 153319, 158173, 162202, 165536, 168129, 169437, 169535, 169673, 171231, 174430, 178318, 181767, 184457, 187064, 190374, 194123, 197059, 198452, 199104, 200401, 202841, 205987, 209342, 212517, 214935, 216279, 216985, 217568, 217828, 217540, 217513, 218740, 220780, 222277, 223136, 224781, 227845, 230931, 232413, 232520, 232908, 234739, 237882, 241441, 244463, 246439, 247630, 248738, 250114, 251697, 253711, 256654, 260262, 263245, 264560, 264396, 263463, 262092, 260688, 260363]
52469B60363J564K465J098j516l085k498o74P46J009N71K67L81N69N32M37M86
52453B62715M88J78k62m47l69l02l59n54j047j815k250j785q14l20n19n33L79
52436B52384J814K766K721J900P55l41r88q25J16J278J991K029J648J071L39k52
52420B68406n2J019J839J211m50j450r59J84R87J544K125K247J568Q48Q73J062
52404B81002M44n35m90O85J540J152L47L67J232J961J884J209O54O92R41M46r66
52387B92565j934j018J215K684K551K300L404N081N528M604L882M136M244L081
52373C32323J420R23J761K389J764O92M02O19j9j902l851m690m491l950l278k267
52357C17845j057k66m67j709l352m344m086l109k413k161j717r39m52l49K07J505
$$ y = [260363, 261927, 264392, 265490, 263974, 260889, 258391, 257717, 258463, 259472, 260043, 260310, 260691, 261260, 261792, 262229, 262715, 263203, 263381, 263119, 262672, 262303, 262001, 261642, 261088, 260041, 258226, 255976, 254191, 253377, 253057, 252538, 252005, 252384, 254198, 256964, 259685, 261585, 262340, 261999, 261011, 260186, 260302, 261580, 263571, 265600, 267248, 268319, 268658, 268406, 268354, 269373, 271212, 272423, 271973, 270523, 269564, 269748, 270735, 272279, 274404, 276651, 278219, 279067, 279940, 281002, 281446, 280911, 280421, 281106, 282646, 283798, 284145, 284512, 285744, 287705, 289589, 290798, 291452, 292144, 293085, 293531, 292565, 290631, 289613, 290828, 293512, 296063, 298363, 301767, 306848, 312376, 316980, 320862, 324998, 329242, 332323, 333743, 334666, 336427, 338816, 340580, 341272, 341674, 342293, 342274, 340372, 336521, 331831, 327340, 323390, 320112, 317845, 316788, 316522, 316055, 314346, 310994, 306650, 302564, 299455, 297042, 294881, 293164, 292225, 291773, 291424, 291631, 293136]
52341B93136K524K511K238K634L128K651J588J295K118L176L837M007L353J663
52327C29859j44p10O9J303K667M255N113M020J910J369L038M472L738K224K230
52312C65413L405L636K619K234L503N061N191L949K696K417L226M739O242O779
52298D21110N832M132L339M485O702P962P230N451M003K899J487L94J184L824
52284D80034O021N899M245L096L079L364L415L459L546L514L753M705N673N325
52270E39128L708K500K820L839M283M314M940O038O167M477J996P00J611M070
52256E90591O550P926Q108P735P526P799Q487R379J0321J1244J2190J3235J4354
52243G15445J5265J5523J4964J4077J3843J4946J7196J9735K1730K2727K2610
$$ y = [293136, 295660, 298171, 300409, 303043, 306171, 308822, 310410, 311705, 313823, 316999, 320836, 324843, 328196, 329859, 329715, 329005, 329074, 330377, 333044, 337299, 342412, 346432, 348342, 349711, 352749, 357221, 360959, 363183, 365413, 368818, 372454, 375073, 377307, 380810, 385871, 391062, 395011, 397707, 400124, 403350, 408089, 414331, 421110, 426942, 431074, 434413, 438898, 445600, 453562, 460792, 466243, 470246, 473145, 474632, 475026, 476210, 480034, 486055, 491954, 496199, 499295, 502374, 505738, 509153, 512612, 516158, 519672, 523425, 528130, 533803, 539128, 542836, 545336, 548156, 551995, 556278, 560592, 565532, 571570, 577737, 582214, 584210, 584910, 586521, 590591, 597141, 605067, 613175, 620910, 628436, 636235, 644722, 654101, 664422, 675666, 687856, 701091, 715445, 730710, 746233, 761197, 775274, 789117, 804063, 821259, 840994, 862724, 885451, 908061]
52232I08061K1763K1261K2312K4972K7705K8750K7885K6476K5831K5993K6221
52221A187230K6121K5853K5670K5797K6585K8077K9306K8776K6084K2629K0164
52210A472292J8965J7947J6321J4392J2721J1255R569P393M803K256N88L27Q09
52197A589638N84r20k745l742l836l528k875j788q64r49j959k817k526r22J321
52182A562072L064L491L085L331M964P068Q551R767J1655J3915J5393J5966J6605
52169A678927J7630J8248J8015J7467J7035J6482J5694J4901J3865J2053R972
52158A850289R010R369R420P936N749M325L660K742J273k13j439k528l477m391
52144A891725n856q145j0413j1542j1535j1198j0771r857q603p908q197q744q611
$$ y = [908061, 929824, 951085, 973397, 998369, 1026074, 1054824, 1082709, 1109185, 1135016, 1161009, 1187230, 1213351, 1239204, 1264874, 1290671, 1317256, 1345333, 1374639, 1403415, 1429499, 1452128, 1472292, 1491257, 1509204, 1525525, 1539917, 1552638, 1563893, 1573462, 1580855, 1585658, 1587914, 1588502, 1588829, 1589638, 1590222, 1589302, 1586557, 1582815, 1578979, 1575451, 1572576, 1570788, 1569924, 1568975, 1567016, 1564199, 1561673, 1560751, 1562072, 1565136, 1568627, 1571712, 1575043, 1580007, 1587075, 1595626, 1605393, 1617048, 1630963, 1646356, 1662322, 1678927, 1696557, 1714805, 1732820, 1750287, 1767322, 1783804, 1799498, 1814399, 1828264, 1840317, 1850289, 1859299, 1868668, 1878088, 1886024, 1891773, 1896098, 1899758, 1902500, 1903773, 1903560, 1902121, 1899593, 1896116, 1891725, 1885869, 1877724, 1867311, 1855769, 1844234, 1833036, 1822265, 1812408, 1803805, 1795897, 1787700, 1778956, 1770345]
52131A770345p831p301p618q191p718n749l528k761l523m195l613k323j331o53
52117A704010L2K67n24j742k157j491n63o1r6p21j838k773k911k734l150l881
52101A679667l730k569j810k344l178k993k118k006l156m682n777o604p470q025
52087A623205p823p211o942p041o830o262o361p824r710j0451r840r011q553p901
52073A511445o868o521p615r100r353q293p212o736o140m729l063k403l338n092
52059A424982o151n638m272l607m241n244n507m943l942k532q31N61J473K756
52045A382864M901O786P090O501O972R042J1354J2897J4287J6400J8989K1206
52033A519289K2632K3446K4135K5246K6836K8170K8699K9026K9904L0685L0147
$$ y = [1770345, 1762514, 1755213, 1747595, 1739404, 1731686, 1725937, 1722409, 1719648, 1716125, 1711930, 1708317, 1705994, 1704663, 1704010, 1704042, 1704309, 1703785, 1702043, 1699886, 1698395, 1697832, 1697771, 1697675, 1696954, 1695116, 1692343, 1689432, 1686698, 1683548, 1679667, 1675937, 1673368, 1671558, 1669214, 1666036, 1663043, 1660925, 1658919, 1655763, 1651081, 1645304, 1638700, 1631230, 1623205, 1615382, 1608171, 1601229, 1594188, 1587358, 1581096, 1574735, 1566911, 1557201, 1546750, 1536910, 1527899, 1519346, 1511445, 1504577, 1498056, 1490441, 1481341, 1471988, 1463695, 1456483, 1449747, 1443607, 1438878, 1435815, 1433412, 1430074, 1424982, 1418831, 1413193, 1408921, 1405314, 1401073, 1395829, 1390322, 1385379, 1381437, 1378905, 1378074, 1378635, 1380108, 1382864, 1387765, 1394551, 1401641, 1408142, 1415114, 1424156, 1435510, 1448407, 1462694, 1479094, 1498083, 1519289, 1541921, 1565367, 1589502, 1614748, 1641584, 1669754, 1698453, 1727479, 1757383, 1788068, 1818215]
52022A818215K8719K8225K9086K9534K8278K6373K5356K4892K3462K0546J6928
52011B099614J3456J0537Q372O865N618M504L778L202J934j54j990k992m188o584
51997B141972r178r966q662p035o686p461q092p625o116m494l711l697l480k622
51983B053147j961k324l264l707l251k024l4K293L646L194K037K006L270M409
51969B057437M598M281L762K751J535J085J412J095p05k791l339k098n00q3j345
51954B067095l756o328q479j0478j2777j4998j6267j6585j6983j8113j9537k0754
51942A902040k2005k3528k4941k6023k7383k9548l1931l3529l4156l4312l4274
51931A580410l4117l4265l5176l6610l7878l8616l8786l8183l6823l5548l5361
$$ y = [1818215, 1846934, 1875159, 1904245, 1933779, 1962057, 1988430, 2013786, 2038678, 2062140, 2082686, 2099614, 2113070, 2123607, 2131979, 2138844, 2144462, 2148966, 2152744, 2155946, 2157880, 2157726, 2155736, 2152744, 2148556, 2141972, 2132794, 2122828, 2114166, 2107131, 2100445, 2092984, 2084892, 2077267, 2071151, 2066657, 2062946, 2059249, 2055769, 2053147, 2051186, 2048862, 2045598, 2041891, 2038640, 2036616, 2036582, 2038875, 2042521, 2045715, 2047752, 2049758, 2053028, 2057437, 2062035, 2066316, 2070078, 2072829, 2074364, 2075449, 2076861, 2077956, 2077251, 2074460, 2071121, 2069023, 2068523, 2068440, 2067095, 2063339, 2057011, 2048532, 2038054, 2025277, 2010279, 1994012, 1977427, 1960444, 1942331, 1922794, 1902040, 1880035, 1856507, 1831566, 1805543, 1778160, 1748612, 1716681, 1683152, 1648996, 1614684, 1580410, 1546293, 1512028, 1476852, 1440242, 1402364, 1363748, 1324962, 1286779, 1249956, 1214408, 1179047]
51920A179047l6033l6220l5152l3596l2743l2848l3252l3244l2306l0064k6711
51909H16878k3410k1478k0885k0167j8255j5997j5173j6068j6931j6066j3747
51898F18701j1520j0257r806r946j0514j0678r384o980n292n540o909p710p212
51885E06953n751l962k656k745m177n462n292m301m130n110o048o168n992o066
51871D39093o073n704n296n043m459l365k614k956l791l977l559l549m092m054
51857C80561k791j371j203k055k366j503p00j329k998m010l512k222j121l38L01
51842C53343M32l17j380j701j110n45q01j599k123k064j798j774k015k174j982
51827C32392j635j670k389l514m527n093m964l833j704O90K264K367J102q22k341
$$ y = [1179047, 1143014, 1106794, 1071642, 1038046, 1005303, 972455, 939203, 905959, 873653, 843589, 816878, 793468, 771990, 751105, 730938, 712683, 696686, 681513, 665445, 648514, 632448, 618701, 607181, 596924, 587118, 577172, 566658, 555980, 546596, 539616, 534324, 528784, 521875, 514165, 506953, 501202, 497240, 494584, 491839, 487662, 482200, 476908, 472607, 468477, 463367, 457319, 451151, 445159, 439093, 433020, 427316, 422020, 416977, 412518, 409153, 406539, 403583, 399792, 395815, 392256, 388707, 384615, 380561, 377770, 376399, 375196, 373141, 370775, 369272, 368572, 367243, 364245, 360235, 356723, 354501, 353380, 353042, 353343, 353775, 353458, 352078, 350377, 349267, 348722, 347921, 346322, 344199, 342135, 340337, 338563, 336548, 334374, 332392, 330757, 329087, 326698, 323184, 318657, 313564, 308600, 304767, 303063, 303753, 306017, 308384, 309486, 308664, 306323]
51812C06323k637k012j775k545l099j906N08J957J445M11O41K012L076K967J935
51797C07301O79K8Q21L035N243N835M823L705L522L675K870O95j988l831l934
51782C32479k410l15R76P05p37k137k408j471j71O72R86J112J134R62Q21J093
51766C31291J712K364L144M289N263N101L900K916K758K502J339J52K68J367J807
51751C70173Q31p48j796j860r57N15J515J052n61j767j389L13K233L404L317K081
51735C76356O61K52J025J856J727R60O43J289K455L401L737L522L158L059L252
51720D07353L397L344L523M406N627O056N044L386K617L236M114M033L348L374
51706D62858M325M939M406L645L950N230O439P229Q131R322J0228J0317R589Q329
$$ y = [306323, 303686, 301674, 299899, 297354, 294255, 292349, 292857, 294814, 296259, 296670, 297311, 299323, 302399, 305366, 307301, 307980, 308008, 308829, 311864, 317107, 322942, 327765, 331470, 334992, 338667, 341537, 342232, 340244, 336413, 332479, 330069, 329754, 330730, 331435, 330698, 328561, 326153, 324682, 324511, 325183, 326169, 327281, 328415, 329377, 330198, 331291, 333003, 335367, 338511, 342800, 348063, 353164, 357064, 359980, 362738, 365240, 366579, 366731, 366999, 368366, 370173, 371004, 370256, 368460, 366600, 365643, 366158, 367673, 368725, 368164, 366397, 365008, 365321, 367554, 370958, 374275, 376356, 377017, 377269, 378294, 380150, 381877, 382837, 383480, 384769, 387224, 390625, 394362, 397884, 401042, 404101, 407353, 410750, 414094, 417617, 422023, 427650, 433706, 438750, 442136, 444753, 447989, 452103, 456136, 459484, 462858, 467183, 472122, 476528, 480173, 484123, 489353, 495792, 503021, 511152, 520474, 530702, 541019, 550608, 558937]
51692E58937O991O268O473O935O631N423M047K951J795J73j847l821m995m504
51678E91457k381j76L32q52k189k672k597k228j230J90Q95M53Q1R43K309K416
51662E84751O39k041m306n328m802l207j941k137l287l736k793j679k039l932
51648E44162n790o187n144l635k366j474j139j617k528k877k331j711j775k204
51634E03384k556l226m197l843q56L051M526K942J143J321K297K115J261J434
51620E08796K540L033K603K484L291M218M501M263L726K717J274j77j512l018
51606E38739m606n529n316m563m548o004q231r618r298q225p960q534q571p646
51592D40090p208q349r914j0003q455o627n353m459l771l421l304l244l376l571
$$ y = [558937, 565928, 572196, 578669, 585604, 592235, 597658, 601705, 604656, 606451, 606624, 604777, 600956, 595961, 591457, 589076, 588900, 589232, 588380, 586191, 583519, 580922, 578694, 577464, 577654, 578549, 579002, 579083, 580026, 582335, 584751, 585390, 583349, 579043, 573715, 568913, 565706, 563765, 561628, 558341, 554605, 551812, 550133, 548094, 544162, 538372, 532185, 527041, 523406, 521040, 519566, 518427, 516810, 514282, 511405, 509074, 507363, 505588, 503384, 500828, 497602, 493405, 489562, 488706, 491757, 496283, 499225, 500368, 501689, 503986, 506101, 507362, 508796, 511336, 514369, 516972, 519456, 522747, 526965, 531466, 535729, 539455, 542172, 543446, 543269, 541757, 538739, 534133, 528604, 523288, 518725, 514177, 508173, 499942, 490324, 481026, 472801, 464841, 456307, 447736, 440090, 432882, 424533, 414619, 404616, 396161, 389534, 384181, 379722, 375951, 372530, 369226, 365982, 362606, 359035]
51578C59035k976j237M02M05r87k221k531k358k048j560j288j797k783l469l832
51563C30755m133l709j849L72J043K02k34M76J008N63K08P14J073M79m9M60R68
51546C28347J08j303j292M10K342L669M809N845N990N019M038M252N600O918P054
51531C81806N829M259L766M769O211O852O706O684P151P512P168O264N351M712
51517D65040M088K997J343k81j117j140j012j217j722k473l398l799k803r70k93
51502D53243j650l067j806K211O248P942P555P111Q103J0326J2303J2634J1259
51489E32412R420Q140P126N588L599J812K55j564l349l905k600j83K093L474L697
51474E66015K799J355K84l4r8m76j006j182q81m02r9k69j102k389l531m144m407
$$ y = [359035, 356059, 354822, 355224, 355629, 354642, 352421, 349890, 347532, 345484, 343924, 342636, 340839, 338056, 334587, 330755, 326622, 322913, 321064, 321436, 322479, 322681, 322447, 322923, 323931, 324494, 324702, 325416, 326489, 326968, 326919, 327379, 328347, 328455, 327152, 325860, 326270, 328612, 332281, 337090, 342935, 348925, 353944, 357982, 362234, 367834, 374752, 381806, 387635, 391894, 395660, 400429, 406640, 413492, 420198, 426882, 434033, 441545, 448713, 454977, 460328, 465040, 469128, 472125, 473468, 473187, 472070, 470930, 469918, 468701, 466979, 464506, 461108, 457309, 454506, 453536, 453243, 451593, 448526, 446720, 448931, 455179, 463121, 470676, 477787, 485890, 496216, 508519, 521153, 532412, 541832, 549972, 557098, 562686, 566285, 568097, 568352, 566788, 563439, 559534, 556934, 556751, 558844, 562318, 566015, 568814, 570169, 570453, 570419, 570321, 569845, 568839, 567657, 566776, 566374, 566275, 566006, 564904, 562515, 558984, 554840, 550433]
51457E50433m514m128k914j510j310k959n342o448n302k770n21M82L16n71j783
51442E11159k810l166k922k608k289j371K97J672J666O46k7J93O22P33J015K052
51426E04862L442M237M026L192K396K166K707L756M839N821O912Q020Q582Q354
51412E73312P900P966Q686R745J0720J0945R765P701O635P762R712R983Q129O165
51398F95126N562N336L848J243r52j836j730j333j267j958k973k908r96J541K752
51383F99455K207Q39j003l728o769q546q729q944j0394j2037j2226j1068j0067
51370F08990j0072j0676j1180j1154j0483r518q823q239o837m472k484j953k141
51357E10958j723p96l02j50N41J641K091J719J629K540L983N162N555M700K607
$$ y = [550433, 545919, 541791, 538877, 537367, 536057, 533098, 527756, 521308, 516006, 513236, 512715, 513197, 513513, 512942, 511159, 508349, 505183, 502261, 499653, 497364, 495993, 496290, 497962, 499628, 500274, 500247, 500440, 501062, 501795, 502810, 504862, 508304, 512541, 516567, 519759, 522155, 524321, 527028, 530784, 535623, 541444, 548356, 556376, 564958, 573312, 581212, 589178, 597864, 607609, 618329, 629274, 639039, 646740, 653375, 661137, 670849, 680832, 688961, 695126, 700688, 706024, 709872, 711115, 710163, 708327, 706597, 705264, 703997, 702039, 699066, 696158, 695162, 696703, 699455, 701662, 702501, 701498, 697770, 691001, 682455, 673726, 664782, 654388, 642351, 630125, 619057, 608990, 598918, 588242, 577062, 565908, 555425, 545907, 537084, 528845, 522008, 517536, 515052, 513099, 510958, 509235, 508439, 508137, 507987, 508528, 510169, 512260, 513979, 515608, 518148, 522131, 527293, 532848, 537548, 540155]
51342E40155L86q65j786m028p657j0794j2122j2286j2271j1935j0919r703q908
51329D37267q569q714r629j0841j1060r920q611q051p700p002o581o744o298m506
51315C23041k980l718n921o830n465l540k687k553k142j452j080j281k021l160
51301B78211m125m135l263k556k745l288l070j717m0O52k48j761j993k98J572
51286B51196J469k27r30O58K799L134J795Q87J543K772L191K675J929J402J331
51271B75624K203M217O388P219O540N873O472P690Q019P223O299N633M504K666
51257C56570J118O04L30r91l289n293o185o433p018q305r636r805q243n906m486
51242B83032m559n078m967m437m205m247m123l891l835l701l022k017j291j006
$$ y = [540155, 540541, 539676, 537890, 533862, 526205, 515411, 503289, 491003, 478732, 466797, 455878, 446175, 437267, 428698, 419984, 410355, 399514, 388454, 378534, 369923, 361872, 354172, 347170, 340589, 333845, 327547, 323041, 320061, 316343, 310422, 303592, 298127, 294587, 291900, 289347, 287205, 285753, 284673, 283392, 281371, 278211, 274086, 269951, 266688, 264132, 261387, 258099, 255029, 253312, 253272, 253924, 253676, 251915, 249922, 249624, 251196, 252665, 252438, 251508, 252166, 254965, 258099, 259894, 260781, 262324, 265096, 268287, 270962, 272891, 274293, 275624, 277827, 282044, 288432, 295651, 302191, 308064, 314536, 322226, 330245, 337468, 343767, 349400, 353904, 356570, 357688, 358292, 358622, 357631, 354342, 349049, 342864, 336431, 329413, 321108, 311472, 301667, 293424, 287518, 283032, 278473, 273395, 268428, 263991, 259786, 255539, 251416, 247525, 243690, 239989, 236967, 234950, 233659, 232653]
51228B32653r96j394k278k958k518j050M10J125J258J201R22Q0j457l126l642
51213B18230k031R51L117L162J996J119N59m83j675j726l96J017J304M79p33j666
51197B23224j916j598j383j628j697r90j81l40j118j148j96N42K91m64j159j751
51181B08488j856q46O26P02j149k894k435l90Q33K26q66p78N49J872K191J698
51165B05971J283J374J457R16L9l77j34L54J049K259L534L661K352R64R00J830
51149B27432K263J465J00p90q95o75o43o38K7J541K897K868J550K98N4M24O01
51132B37879M15J46J6L21J543L644N524N703L658M35k034k378q65J057K309K879
51116B60252K777J393j306l684m011k701j584j260q86l89q77k344l003j846k47
$$ y = [232653, 231657, 230263, 227985, 225027, 222509, 221459, 221869, 222994, 224252, 225453, 226375, 226455, 224998, 221872, 218230, 216199, 217150, 220267, 223429, 225425, 226544, 227103, 226620, 224945, 223219, 222823, 223840, 225144, 225623, 224890, 223224, 221308, 219710, 218327, 216699, 215002, 214012, 213831, 213491, 212373, 211225, 211029, 211571, 211862, 211398, 210239, 208488, 206632, 205786, 206412, 207114, 205965, 203071, 200636, 200246, 201079, 201305, 200439, 199661, 200210, 202082, 204273, 205971, 207254, 208628, 210085, 211001, 211040, 210663, 210529, 210883, 211932, 214191, 217725, 221386, 223738, 224702, 225602, 227432, 229695, 231160, 231260, 230470, 229575, 228900, 228257, 227619, 227646, 229187, 232084, 234952, 236502, 236800, 236854, 237278, 237879, 238294, 238440, 238456, 238777, 240320, 243964, 249488, 255191, 258849, 259284, 257250, 254872, 254007, 255064, 257373, 260252, 263029, 264422, 263116, 259432, 255421, 252720, 251136, 249876, 248990, 248601, 247724, 245380, 242377, 240531, 240284]
51101B40284O6p39j558k155k759k957k437j961k196k373j536l70k67j055j289
51086B16698m98L62O49P85J130J361J321J454K001K498K434J806R31J68k19l36
51070B32545p64j720k488k227j228o01q54j509k018k254k139j629j107j053j217
51055B09737r45l40j97n62l53R69K315K363J531J446K583L450K643Q17j12M97
51039B25842J242O63q53j740j325l94lm81j446j958p44K566O225P476N445K151
51023B42666J77R9P12Q93M37k52n72j32O18Q42O91J432L515N481N627M022K009
51006B68265M44m90n72J97J089J550K015K788K904J539j30k26J049J760J240P79
50990B84201J136J314N59k12p1K58l77j631k276k177k360l267l908k998n30K025
$$ y = [240284, 240350, 239611, 238053, 235898, 233139, 230182, 227745, 225784, 223588, 221215, 219679, 219309, 219042, 217987, 216698, 216200, 216562, 217211, 217996, 219126, 220487, 221808, 223262, 225263, 227761, 230195, 232001, 232932, 233100, 232881, 232545, 231781, 230061, 227573, 225346, 224118, 223517, 222663, 221154, 219136, 216882, 214743, 213114, 212007, 210954, 209737, 208792, 208452, 208255, 207693, 207340, 208309, 210624, 212987, 214518, 215964, 218547, 221997, 224640, 225457, 225345, 225842, 227084, 227747, 226894, 225154, 223829, 223435, 223432, 222951, 221505, 219547, 218803, 221369, 227594, 235070, 240515, 242666, 242843, 242942, 243654, 244547, 244984, 244732, 244160, 244028, 244646, 245488, 246179, 247611, 251126, 256607, 262234, 266256, 268265, 268709, 268219, 267647, 267844, 268933, 270483, 272498, 275286, 278190, 279729, 279599, 279373, 280422, 282182, 283422, 284201, 285337, 286651, 287210, 286998, 286927, 287185, 286808, 285177, 282901, 280724, 278364, 275097, 271189, 268191, 267661, 269686]
50974B69686L002K177J008J014K164L240L530L313K837J877N42l61k90L39Q57
50959B94935J203J703K455L238L705L469K491J424J147J761K554K932K903K676
50945C28596K474K709L642M861N809O686P905Q820Q234O482N634P051R768J1858
50931D20529J2420J1698J0359R460J0032J1815J3260J3645J4219J6177J8522J9363
50919E81499J8743J8640K0373K3313K6146K8214K9525L0562L2244L5325L9509
50908H84093M3757M7402N0441N2982N5222N7856O1617O6330P1074P5204P8545
50897A544523Q0849Q2015Q2714Q3688Q4322Q2986P9004P3405O7494O1730N6254
50886B378984N1267M6280M0139L2693K5509K0015J5693J1283O972M125L131K913
$$ y = [269686, 272688, 274865, 275873, 276887, 279051, 282291, 285821, 289134, 291971, 293848, 294390, 294029, 293739, 294078, 294935, 296138, 297841, 300296, 303534, 307239, 310708, 313199, 314623, 315770, 317531, 320085, 323017, 325920, 328596, 331070, 333779, 337421, 342282, 348091, 354777, 362682, 371502, 379736, 386218, 391852, 398903, 408671, 420529, 432949, 444647, 455006, 464466, 474498, 486313, 499573, 513218, 527437, 543614, 562136, 581499, 600242, 618882, 639255, 662568, 688714, 716928, 746453, 777015, 809259, 844584, 884093, 927850, 975252, 1025693, 1078675, 1133897, 1191753, 1253370, 1319700, 1390774, 1465978, 1544523, 1625372, 1707387, 1790101, 1873789, 1958111, 2041097, 2120101, 2193506, 2261000, 2322730, 2378984, 2430251, 2476531, 2516670, 2549363, 2574872, 2594887, 2610580, 2621863, 2628835, 2632960, 2636091, 2639004]
50874B639004K571K235J924P98j789n211q388j1386j5607k2339l1307m0629m8304
50861B461572n3991n9218o5456p2190p7490q0460q2098q3384q3556q1227p6599
50850A645903p1467o7173o3575o0027n6462n3000m9300m4887l9936l5233l1377
50839A073466k8256k5280k2053j8831j6204j4190j2055r353o860n660n440m727
50827I04557k975j344p27j02J916M671O102N669N132N980P519Q378Q768J0010
50813I63554J2292J4381J5636J7056J9719K3126K5847K7379K8478K9902L1603
50802A208973L3322L5211L7541M0331M3648M7868N3188N9111O4761O9680P4141
50791A767775P9050Q5661R4747J05533J15968J24877J33303J42847J53047J61722
$$ y = [2639004, 2641575, 2643810, 2645734, 2646532, 2644743, 2639532, 2631144, 2619758, 2604151, 2581812, 2550505, 2509876, 2461572, 2407581, 2348363, 2282907, 2210717, 2133227, 2052767, 1970669, 1887285, 1803729, 1722502, 1645903, 1574436, 1507263, 1443688, 1383661, 1327199, 1274199, 1224899, 1180012, 1140076, 1104843, 1073466, 1045210, 1019930, 997877, 979046, 962842, 948652, 936597, 927244, 920384, 914724, 909284, 904557, 901582, 900238, 899511, 899409, 901325, 905996, 912098, 917767, 922899, 928879, 936398, 944776, 953544, 963554, 975846, 990227, 1005863, 1022919, 1042638, 1065764, 1091611, 1118990, 1147468, 1177370, 1208973, 1242295, 1277506, 1315047, 1355378, 1399026, 1446894, 1500082, 1559193, 1623954, 1693634, 1767775, 1846825, 1932486, 2027233, 2132766, 2248734, 2373611, 2506914, 2649761, 2802808, 2964530]
50781B964530J67872J72834J78060J83003J85847J85420J81579J74630J65199
50772D558974J54006J40874J24669J05263Q4883O6390N0508L5987K2233J0472
50762E354259K185k344l649k311R23N040R298J3233J5855J5351J0202K04j3736
50749E404510l0454m8866o8072q7582j07228j26483j44118j58880j70388j79120
50739D283319j85502j89145j88983j84293j75585j64377j52043j39154j25990
50730B778247j13057j00552q7955p4992o2729n2599m4303l5823k5948j5924q033
50719B156332l120k89J489K315J983R22m0p34k048m954r091j2769j4615j4995
50705B100386j5450j7059j9740k2790k5470k7172k7758k7774k7747k7307k5541
$$ y = [2964530, 3132402, 3305236, 3483296, 3666299, 3852146, 4037566, 4219145, 4393775, 4558974, 4712980, 4853854, 4978523, 5083786, 5168669, 5235059, 5285567, 5321554, 5343787, 5354259, 5356444, 5354100, 5350451, 5348140, 5349063, 5354103, 5363401, 5376634, 5392489, 5407840, 5418042, 5418246, 5404510, 5374056, 5325190, 5257118, 5169536, 5062308, 4935825, 4791707, 4632827, 4462439, 4283319, 4097817, 3908672, 3719689, 3535396, 3359811, 3195434, 3043391, 2904237, 2778247, 2665190, 2564638, 2476683, 2401691, 2338962, 2286363, 2242060, 2206237, 2180289, 2164365, 2156332, 2153212, 2152923, 2154412, 2156727, 2158710, 2159632, 2159592, 2158858, 2156810, 2151856, 2142765, 2129996, 2115381, 2100386, 2084936, 2067877, 2048137, 2025347, 1999877, 1972705, 1944947, 1917173, 1889426, 1862119, 1836578]
50694A836578k2411j9102j6753j5362j4177j2745j1116r199o383k044L345Q007
50682A718638J0517J1836J4768K0769K8182L4560L9886M6003N3520O1076O7691
50671B107446P3951Q0502Q7043R3488J00483J07840J13825J17159J18560J19103
50661C119400J18098J14092J07235R9169R0859Q1753P0953N8096M3339K7500J2188
50650C942682j152j2346k1948k9730l4699l6501l5822l3243k8643k2212j5282
50639C671104r585n868l684k596l249p027j4421k4049l3865m3347n3702o5544
50627C404167p7369q6988r3670r7886r9564r7983r3264q6657p9171p0934o2123
50616B458558n3451m5307l7230k8685j9648j0048M75J1663K2264L1495M0310N0096
$$ y = [1836578, 1814167, 1795065, 1778312, 1762950, 1748773, 1736028, 1724912, 1715713, 1709330, 1707286, 1710631, 1718638, 1729155, 1740991, 1755759, 1776528, 1804710, 1839270, 1879156, 1925159, 1978679, 2039755, 2107446, 2181397, 2261899, 2348942, 2442430, 2542913, 2650753, 2764578, 2881737, 3000297, 3119400, 3237498, 3351590, 3458825, 3557994, 3648853, 3730606, 3801559, 3859655, 3902994, 3930494, 3942682, 3941530, 3929184, 3907236, 3877506, 3842807, 3806306, 3770484, 3737241, 3708598, 3686386, 3671104, 3661519, 3655651, 3651967, 3649371, 3646122, 3639095, 3624674, 3600625, 3566760, 3523413, 3469711, 3404167, 3326798, 3239810, 3146140, 3048254, 2948690, 2850707, 2757443, 2670786, 2591615, 2520681, 2458558, 2405107, 2359800, 2322570, 2293885, 2274237, 2264189, 2264664, 2276327, 2298591, 2330086, 2370396, 2420492]
50604B420492O0292O8518P3271P5488P6826P7233P5331P0828O5421O0854N7021
50593C181575N2649M7334M2088L7879L4385L0439K5341J9589J4495J1050Q993
50582C505817P091M691K698K612M755Q075J1521J5027J9094K4043K9650L4927
50570C670001L8378L9264L8467L7252L5372L1614K6270K1279J7484J3410P836
50559C976627K076j858m156o570r413j0995r892o340j266M706J1073J7104K1866
50546C982962K4266K3472K0023J5875J2342Q481K708m695j2336k0549l1276m4819
50534C976454n8667p0408q0170q9219r7525j04087j08643j11703j13337j13118
50524C029577j10983j07359j02649r7235r1661q6213q0632p4672o8526o2263n5439
$$ y = [2420492, 2480784, 2549302, 2622573, 2698061, 2774887, 2852120, 2927451, 2998279, 3063700, 3124554, 3181575, 3234224, 3281558, 3323646, 3361525, 3395910, 3426349, 3451690, 3471279, 3485774, 3496824, 3505817, 3512908, 3517599, 3520297, 3522909, 3527664, 3535739, 3547260, 3562287, 3581381, 3605424, 3635074, 3670001, 3708379, 3747643, 3786110, 3823362, 3858734, 3890348, 3916618, 3937897, 3955381, 3968791, 3976627, 3978703, 3976845, 3972689, 3966119, 3956706, 3945711, 3935819, 3929479, 3928213, 3932919, 3943992, 3961096, 3982962, 4007228, 4030700, 4050723, 4066598, 4078940, 4087421, 4090129, 4085434, 4073098, 4052549, 4021273, 3976454, 3917787, 3847379, 3767209, 3677990, 3580465, 3476378, 3367735, 3256032, 3142695, 3029577, 2918594, 2811235, 2708586, 2611351, 2519690, 2433477, 2352845, 2278173, 2209647, 2147384, 2091945]
50513B091945m7930m0592l4325k8927k3652j8623j4654j1831r044n135J17O165
50501A863514J2226J7596K1995K5869K9962L4532L9274M3925M8466N2810N6876
50490B247045O1070O6107P2153P8595Q4791R0542R5549R9142J01068J02048J02809
50479C200919J02748J00353R5055Q8178Q1920P7698P5537P4502P3590P2667P2735
50468D115902P4824P8463Q1915Q4391Q7302R2543R9979J07579J13783J18654J22798
50457E178133J26250J28868J30588J30740J27928J21366J11671R9653Q4963O6992
50447F307152M6511K5379M611j6145l7115n7355p5629r1706j06088j18546j27431
50436E753638j30753j28046j20936j11453j00037q5843o9036n1578l5234j9904
$$ y = [2091945, 2044015, 2003423, 1969098, 1940171, 1916519, 1897896, 1883242, 1871411, 1862367, 1857232, 1857349, 1863514, 1875740, 1893336, 1915331, 1941200, 1971162, 2005694, 2044968, 2088893, 2137359, 2190169, 2247045, 2308115, 2374222, 2446375, 2524970, 2609761, 2700303, 2795852, 2894994, 2996062, 3098110, 3200919, 3303667, 3404020, 3499075, 3587253, 3669173, 3746871, 3822408, 3896910, 3970500, 4043167, 4115902, 4190726, 4269189, 4351104, 4435495, 4522797, 4615340, 4715319, 4822898, 4936681, 5055335, 5178133, 5304383, 5433251, 5563839, 5694579, 5822507, 5943873, 6055544, 6155197, 6240160, 6307152, 6353663, 6379042, 6383653, 6367508, 6330393, 6273038, 6197409, 6105703, 5999615, 5881069, 5753638, 5622885, 5494839, 5373903, 5262450, 5162413, 5076570, 5007534, 4955956, 4920722, 4900818]
50426D900818n004Q351J7981K2958K3818K0541J1966k368k1113m2380o5071q8313
50414D782184j10582j30240j46378j58585j66458j70015j70104j67665j62985
50405C399172j56146j47823j39016j30253j21531j12835j04140r5152q5562p5613
50395B231101o6101n7820n0971m4993l8937l2378k5894k0210j5059r758m755j349
50383A862876N91L279Q295J4277J8691K1176K3576K6952L0359L2796L4761L7218
50371B114847M0198M3302M6482M9570N1752N2630N3184N4600N6456N7213N6317
50360B676551N4759N3421N2104N0541M9284M8841M8716M8184M7521M7558M8424
50349C225904M9712N1588N4563N8099O0625O1462O1711O2490O3243O2618O0370
$$ y = [4900818, 4895814, 4904165, 4922146, 4945104, 4968922, 4989463, 5001429, 4999061, 4977948, 4935568, 4870497, 4782184, 4671602, 4541362, 4394984, 4236399, 4069941, 3899926, 3729822, 3562157, 3399172, 3243026, 3095203, 2956187, 2825934, 2704403, 2591568, 2487428, 2392276, 2306714, 2231101, 2165000, 2107180, 2056209, 2011216, 1972279, 1939901, 1914007, 1893797, 1878738, 1868980, 1864225, 1862876, 1863467, 1866746, 1875041, 1889318, 1908009, 1929185, 1952761, 1979713, 2010072, 2042868, 2077629, 2114847, 2155045, 2198347, 2244829, 2294399, 2346151, 2398781, 2451965, 2506565, 2563021, 2620234, 2676551, 2731310, 2784731, 2836835, 2887376, 2936660, 2985501, 3034217, 3082401, 3129922, 3177480, 3225904, 3275616, 3327204, 3381767, 3439866, 3500491, 3561953, 3623664, 3686154, 3749397, 3812015, 3872385]
50338C872385N7151N2902M6732L8537K9512K0563J0994n04j4050k8333m1964n4663
50326C989262o7120p9800r1879j01520j07463j10258j11373j11127j08224j01658
50316B998840r2343q2270p2421o2238n0979l8900k7056j6376p263J72N662Q698
50304B563526Q908O566K471k847r570j8055k7978l8330m8025n6198o2127o5541
50292B252800o7101o7955o8417o7562o4615o0424n6835n4737n3312n1204m7712
50281A592926m2826l7028l1656k8462k7757k7490k5237k0915j6451j3078j0319
50270A311707p719n817m574k432J743O700J0257J2084J3574J5459J7125J8262
50258A386369J9548K1344K2987K4031K5049K6628K8419K9903L1238L2688L3840
$$ y = [3872385, 3929536, 3982438, 4029170, 4067707, 4097219, 4117782, 4128776, 4128272, 4114222, 4085889, 4043925, 3989262, 3922142, 3842342, 3750463, 3648943, 3541480, 3431222, 3319849, 3208722, 3100498, 2998840, 2906497, 2824227, 2751806, 2689568, 2638589, 2599689, 2572633, 2556257, 2548994, 2549166, 2554828, 2563526, 2572434, 2579000, 2581471, 2578624, 2569054, 2550999, 2523021, 2484691, 2436666, 2380468, 2318341, 2252800, 2185699, 2117744, 2049327, 1981765, 1917150, 1856726, 1799891, 1745154, 1691842, 1640638, 1592926, 1550100, 1513072, 1481416, 1452954, 1425197, 1397707, 1372470, 1351555, 1335104, 1322026, 1311707, 1303988, 1298171, 1293597, 1291165, 1292908, 1299608, 1309865, 1321949, 1335523, 1350982, 1368107, 1386369, 1405917, 1427261, 1450248, 1474279, 1499328, 1525956, 1554375, 1584278, 1615516, 1648204, 1682044]
50247A682044L4265L4407L4944L5548L5200L3652L1733L0090K8301K5651K2313
50236B028148J9129J6394J3346R167M130o79m642q149j1609j4598j6492j7556
50224B016589j8757k0655k3121k5940k8962l1521l2489l1499k9630k8552k9004
50213A716459l0306l1125l0676k9345k8251k8021k8134k7673k6521k5297k4211
50202A406899k2664k0234j7531j5498j4104j2208q893m815j807q87r58l3K163
50189A289430L787L458K351K690M712O453O388N196M564N135O073O150M977L350
50175A354714K378K089J331n56k692l957m641n672o883p495p882r120j0858j1468
50161A289288j0719j0395j1590j2965j2654j0539p784n238l279k126j329J83K596
$$ y = [1682044, 1716309, 1750716, 1785660, 1821208, 1856408, 1890060, 1921793, 1951883, 1980184, 2005835, 2028148, 2047277, 2063671, 2077017, 2086184, 2090314, 2089635, 2084993, 2076844, 2065235, 2050637, 2034145, 2016589, 1997832, 1977177, 1954056, 1928116, 1899154, 1867633, 1835144, 1803645, 1774015, 1745463, 1716459, 1686153, 1655028, 1624352, 1595007, 1566756, 1538735, 1510601, 1482928, 1456407, 1431110, 1406899, 1384235, 1364001, 1346470, 1330972, 1316868, 1304660, 1295767, 1290952, 1289145, 1288258, 1287300, 1287267, 1289430, 1293217, 1296675, 1299026, 1301716, 1306428, 1312881, 1319269, 1324465, 1329029, 1334164, 1340237, 1346387, 1351364, 1354714, 1357092, 1359181, 1360512, 1359956, 1357264, 1353307, 1348666, 1342994, 1336111, 1328616, 1320734, 1311614, 1300756, 1289288, 1278569, 1268174, 1256584, 1243619, 1230965, 1220426, 1212642, 1207404, 1204125, 1201999, 1200670, 1200853, 1203449]
50148A203449M655N338N109M838M515L994L721L768L224J793P74J029J113q67
50134A246453m224o438o552o082o662q320j0187j1491j1743j1113j0704j1368
50122A141569j2392j2462j1806j1932j3205j4127j3478j1960j1030j1001j1020
50111A007156j0394r375q775q996r385q779o905m775l291k172r44j67n51j425
50097I31222j571j256j899l774n500o067n982o074o398o672o781o403n305m218
50083H63322m287n238n400m087k676k546l029k625j312m85r06j739j581P3K426
50068H29910M098M466M263M513N108N243N133O000Q020R682R941R878J1067J3200
50054I30522J4543J4194J2645J0612Q462O637N440M405K861J183N06J104J983
$$ y = [1203449, 1208104, 1213442, 1218551, 1223389, 1227904, 1231898, 1235619, 1239387, 1242611, 1244404, 1245178, 1246207, 1247320, 1246453, 1242229, 1235791, 1229239, 1223157, 1216495, 1208175, 1197988, 1186497, 1174754, 1163641, 1152937, 1141569, 1129177, 1116715, 1104909, 1092977, 1079772, 1065645, 1052167, 1040207, 1029177, 1018176, 1007156, 996762, 987387, 978612, 969616, 960231, 951452, 944547, 939772, 936481, 934309, 933365, 933198, 932647, 931222, 929651, 928395, 926496, 922722, 917222, 911155, 905173, 899099, 892701, 886029, 879248, 872845, 867540, 863322, 859035, 853797, 848397, 844310, 841634, 839088, 836059, 833434, 832122, 831637, 830731, 828992, 827411, 827484, 829910, 834008, 838474, 842737, 847250, 852358, 857601, 862734, 868734, 876754, 886436, 896377, 906255, 917322, 930522, 945065, 959259, 971904, 982516, 990978, 997615, 1003055, 1007460, 1010321, 1011504, 1012010, 1013114, 1015097]
50041A015097K358K599L259L986M129L945M370N704P041P211O015M552M423O517
50027A081206J0260J4017J6408J7346J7779J8436J9094J9192J8803J8671J9305
50016A270517K0509K1887K3377K4911K6010K6208K5835K5862K6917K8734L0612
50005A551379L2069L2973L3393L3665L4423L6238L8988M1774M3753M5183M7339
49994A971177N1014N5371N8870O1307O4146O8620P4259P9697Q4140Q7324Q8718
49983B744643Q7804Q4783Q0124P3568O4551N3527M2008L1158K1152J2160N135
49972C300613J055l02n86j886n428j0986j7698k5530l5520m8112o1870p4473q4598
49959B934679r2013r6384r7113r4391q9336q3054p6308o9891o4252n8751n2505
$$ y = [1015097, 1017455, 1020054, 1023313, 1027299, 1031428, 1035373, 1039743, 1045447, 1052488, 1059699, 1065714, 1070266, 1074689, 1081206, 1091466, 1105483, 1121891, 1139237, 1157016, 1175452, 1194546, 1213738, 1232541, 1251212, 1270517, 1291026, 1312913, 1336290, 1361201, 1387211, 1413419, 1439254, 1465116, 1492033, 1520767, 1551379, 1583448, 1616421, 1649814, 1683479, 1717902, 1754140, 1793128, 1834902, 1878655, 1923838, 1971177, 2022191, 2077562, 2136432, 2197739, 2261885, 2330505, 2404764, 2484461, 2568601, 2655925, 2744643, 2832447, 2917230, 2997354, 3070922, 3135473, 3189000, 3231008, 3262166, 3283318, 3295478, 3300613, 3301668, 3301366, 3300780, 3298894, 3293466, 3282480, 3264782, 3239252, 3203732, 3155620, 3093750, 3019277, 2934679, 2842666, 2746282, 2649169, 2554778, 2465442, 2382388, 2306080, 2236189, 2171937, 2113186, 2060681]
49948B060681m5944m0388l6035l1732k7109k3409k1561k0681j9486j8004j6926
49937A759406j6206j5501j5297j6297j8059j9352j9762j9994k0673k1620k2376
49926A554269k2746k2773k2674k2823k3322k3607k2866k1020j8993j7770j7273
49915A318402j6366j4237j1613r999r545q521n697k396q62j063p82J108L268M405
49901A246102N305P226R618J0968J1057J0959J1267J1643J1897J2321J2982J3595
49889A374940J4146J4978J6263J7855J9577K1377K3457K6411L0676L5675M0227
49878A635582M4228M8914N4995O1563O7803P4555Q2955R2322J00906J08128J14618
49867B486569J20352J24182J25082J22573J16289J06580R5477Q5434P7000O9101
$$ y = [2060681, 2014737, 1974349, 1938314, 1906582, 1879473, 1856064, 1834503, 1813822, 1794336, 1776332, 1759406, 1743200, 1727699, 1712402, 1696105, 1678046, 1658694, 1638932, 1618938, 1598265, 1576645, 1554269, 1531523, 1508750, 1486076, 1463253, 1439931, 1416324, 1393458, 1372438, 1353445, 1335675, 1318402, 1302036, 1287799, 1276186, 1266187, 1256642, 1248121, 1242424, 1240028, 1239166, 1238103, 1237321, 1238429, 1241697, 1246102, 1251407, 1258633, 1268251, 1279219, 1290276, 1301235, 1312502, 1324145, 1336042, 1348363, 1361345, 1374940, 1389086, 1404064, 1420327, 1438182, 1457759, 1479136, 1502593, 1529004, 1559680, 1595355, 1635582, 1679810, 1728724, 1783719, 1845282, 1913085, 1987640, 2070595, 2162917, 2263823, 2371951, 2486569, 2606921, 2731103, 2856185, 2978758, 3095047, 3201627, 3297104, 3382538, 3459538, 3528639]
49857C528639O1669N6278N3670N2197M9521M4564L7022K6148J1437o244k5187
$$ y = [3528639, 3590308, 3646586, 3700256, 3752453, 3801974, 3846538, 3883560, 3909708, 3921145, 3914901, 3889714]
$$ [...]
##END NTUPLES=NMR SPECTRUM
##END=
