##TITLE=coffee_type TOLI01-ROVE100E_95-5%
COFFEE_meoh_noesyp64 COFFEE_meoh {C:\Bruker\TOPSPIN} Administrator 16
##JCAMPDX= 6.0         $$ Bruker NMR JCAMP-DX V2.0
##DATA TYPE= NMR SPECTRUM
##DATA CLASS= NTUPLES
##ORIGIN= Bruker BioSpin GmbH
##OWNER= Administrator
$$ 1.72 TOPSPIN		Version 2.1
$$ 2012-05-18 15:42:42.089 -0700  Administrator@X
$$ Compression mode = diff/dup
##.OBSERVE FREQUENCY= 400.13188235
##.OBSERVE NUCLEUS= ^1H
##.ACQUISITION MODE= SIMULTANEOUS (DQD)
##.ACQUISITION SCHEME= undefined
##.AVERAGES= 64
##.DIGITISER RES= 22
##SPECTROMETER/DATA SYSTEM= spect
##.PULSE SEQUENCE= noesygpps1d.comp
##.SOLVENT NAME= COFFEE_meoh
##.SHIFT REFERENCE= INTERNAL, COFFEE_meoh, 1, 14.98061
##AUDIT TRAIL= $$ (NUMBER, WHEN, WHO, WHERE, PROCESS, VERSION, WHAT)
$$ ##TITLE= Audit trail, TOPSPIN		Version 2.1
$$ ##JCAMPDX= 5.01
$$ ##ORIGIN= Bruker BioSpin GmbH
$$ ##OWNER= Administrator
$$ $$ C:\Bruker\TOPSPIN/data/Administrator/nmr/12-COFFEE-2002/162/pdata/1/auditp.txt
$$ ##AUDIT TRAIL=  $$ (NUMBER, WHEN, WHO, WHERE, PROCESS, VERSION, WHAT)
(   1,<2012-02-21 02:20:57.891 -0500>,<Administrator>,<TOPSPIN>,<go>,<TOPSPIN 2.1>,
      <created by zg
	started at 2012-02-21 02:09:27.719 -0500,
	POWCHK enabled, PULCHK disabled,
       configuration hash MD5:
       B0 76 FB 9C 50 81 44 7D 18 B3 26 32 4E 60 AD 96
       data hash MD5: 64K
       48 56 8B 44 9B 90 4E ED 84 B2 DC 06 15 26 DD 20>)
(   2,<2012-02-21 02:21:00.859 -0500>,<Administrator>,<TOPSPIN>,<proc1d>,<TOPSPIN 2.1>,
      <Start of raw data processing
       efp LB = 0.3 FT_mod = 6 PKNL = 1 PHC0 = 0 PHC1 = 0 SI = 128K 
       data hash MD5: 128K
       93 C3 80 41 33 C1 E8 02 65 4B CE AF DF B7 AC 70>)
(   3,<2012-02-21 02:21:02.234 -0500>,<Administrator>,<TOPSPIN>,<proc1d>,<TOPSPIN 2.1>,
      <pk PHC0 = 22.79663 PHC1 = 0 
       data hash MD5: 128K
       9B E5 EC 9A 68 7F 9E D3 93 D5 9F 2E B9 59 4F CD>)
(   4,<2012-02-21 02:21:02.469 -0500>,<Administrator>,<TOPSPIN>,<proc1d>,<TOPSPIN 2.1>,
      <abs ABSG = 1 
       data hash MD5: 128K
       3E 50 28 7E D5 8E 0F 34 42 D4 33 F5 8E 18 B2 4A>)
(   5,<2012-02-21 02:21:02.578 -0500>,<Administrator>,<TOPSPIN>,<proc1d>,<TOPSPIN 2.1>,
      <abs ABSG = 2 
       data hash MD5: 128K
       9D A3 A7 43 EE 1E 98 E4 07 1D A4 6A 66 B7 E6 AE>)
(   6,<2012-02-21 02:21:02.641 -0500>,<Administrator>,<TOPSPIN>,<proc1d>,<TOPSPIN 2.1>,
      <abs ABSG = 3 
       data hash MD5: 128K
       97 5F 39 24 D8 02 9D 9B DC DD 4D 7B A1 91 0F B7>)
(   7,<2012-02-21 02:21:02.703 -0500>,<Administrator>,<TOPSPIN>,<proc1d>,<TOPSPIN 2.1>,
      <abs ABSG = 4 
       data hash MD5: 128K
       B1 0A 20 60 DF D1 6F 6E 8B 7B 1B D5 93 C3 F6 06>)
(   8,<2012-02-21 02:21:02.750 -0500>,<Administrator>,<TOPSPIN>,<proc1d>,<TOPSPIN 2.1>,
      <abs ABSG = 5 
       data hash MD5: 128K
       7A 5A E2 97 0C EB A0 2A BD AB 46 35 F9 B3 8A 0E>)
(   9,<2012-02-21 02:21:02.891 -0500>,<Administrator>,<TOPSPIN>,<audit>,<TOPSPIN 2.1>,
      <user comment:
       ICON-NMR User ID: Administrator
$$ [...]
150 150 150 150 150 150 150 150
##$TP07= 0
##$TPNAME0= <>
##$TPNAME1= <>
##$TPNAME2= <>
##$TPNAME3= <>
##$TPNAME4= <>
##$TPNAME5= <>
##$TPNAME6= <>
##$TPNAME7= <>
##$TPOAL= (0..7)
0.5 0.5 0.5 0.5 0.5 0.5 0.5 0.5
##$TPOFFS= (0..7)
0 0 0 0 0 0 0 0
##$TUNHIN= 0
##$TUNHOUT= 0
##$TUNXOUT= 0
##$USERA1= <user>
##$USERA2= <user>
##$USERA3= <user>
##$USERA4= <user>
##$USERA5= <user>
##$V9= 5
##$VALIST= <valist>
##$VCLIST= <CCCCCCCCCCCCCCC>
##$VD= 0
##$VDLIST= <DDDDDDDDDDDDDDD>
##$VPLIST= <PPPPPPPPPPPPPPP>
##$VTLIST= <TTTTTTTTTTTTTTT>
##$WBST= 1024
##$WBSW= 4
##$XGAIN= (0..3)
0 0 0 0
##$XL= 0
##$YL= 0
##$YMAX_a= 14490647
##$YMIN_a= -6743454
##$ZGOPTNS= <>
##$ZL1= 120
##$ZL2= 120
##$ZL3= 120
##$ZL4= 120
##$ABSF1= 14.98061
##$ABSF2= -5.57192
##$ABSG= 5
##$ABSL= 3
##$ALPHA= 0
##$AQORDER= 0
##$ASSFAC= 0
##$ASSFACI= 0
##$ASSFACX= 0
##$ASSWID= 0
##$AUNMP= <proc_prof1d_extract>
##$AXLEFT= 0
##$AXNAME= <>
##$AXNUC= <1H>
##$AXRIGHT= 0
##$AXTYPE= 0
##$AXUNIT= <>
##$AZFE= 0.1
##$AZFW= 0.1
##$BCFW= 0
##$BC_mod= 0
##$BYTORDP= 0
##$COROFFS= 0
##$CY= 15
##$DATMOD= 1
##$DC= 0
##$DFILT= <>
##$DTYPP= 0
##$F1P= 0
##$F2P= 0
##$FCOR= 0.5
##$FTSIZE= 131072
##$FT_mod= 6
##$GAMMA= 0
##$GB= 0
##$INTBC= 1
##$INTSCL= 1
##$ISEN= 128
##$LB= 0.3
##$LEV0= 0
##$LPBIN= 0
##$MAXI= 10000
##$MC2= 0
##$MEAN= 0
##$ME_mod= 0
##$MI= 0
##$NCOEF= 0
##$NC_proc= -3
##$NLEV= 6
##$NOISF1= 0
##$NOISF2= 0
##$NSP= 0
##$NTH_PI= 0
##$NZP= 0
##$OFFSET= 14.98061
##$PC= 1
##$PHC0= 22.79663
##$PHC1= 0
##$PH_mod= 1
##$PKNL= yes
##$PPARMOD= 0
##$PPDIAG= 0
##$PPIPTYP= 0
##$PPMPNUM= 2147483647
##$PPRESOL= 1
##$PSCAL= 4
##$PSIGN= 0
##$PYNMP= <proc.py>
##$REVERSE= no
##$SF= 400.13
##$SI= 131072
##$SIGF1= 0
##$SIGF2= 0
##$SINO= 400
##$SIOLD= 131072
##$SPECTYP= <>
##$SREGLST= <1H.CDCl3>
##$SSB= 0
##$STSI= 131072
##$STSR= 0
##$SW_p= 8223.68421052632
##$SYMM= 0
##$S_DEV= 0
##$TDeff= 65536
##$TDoff= 0
##$TI= <>
##$TILT= no
##$TM1= 0
##$TM2= 0
##$TOPLEV= 0
##$USERP1= <user>
##$USERP2= <user>
##$USERP3= <user>
##$USERP4= <user>
##$USERP5= <user>
##$WDW= 1
##$XDIM= 131072
##$YMAX_p= 512692593
##$YMIN_p= -323536275
##$CURPLOT= <Network HP LaserJet P1505>
##$CURPRIN= <$Network HP LaserJet P1505>
##$DFORMAT= <normdp>
##$LAYOUT= <+/1D_H.xwp>
##$LFORMAT= <normlp>
##$PFORMAT= <normpl>
##$SURQMSG= 1
$$ End of Bruker specific parameters
$$ ---------------------------------
##NTUPLES= NMR SPECTRUM
##VAR_NAME=  FREQUENCY,     SPECTRUM/REAL,   SPECTRUM/IMAG
##SYMBOL=    X,             R,               I
##VAR_TYPE=  INDEPENDENT,   DEPENDENT,       DEPENDENT
##VAR_FORM=  AFFN,          ASDF,            ASDF
##VAR_DIM=   131072,        131072,          131072
##UNITS=     HZ,            ARBITRARY UNITS, ARBITRARY UNITS
##FACTOR=    0.0627417313425165, 1,          1
##FIRST=     8223.62146879498, 2672,         -88706
##LAST=      0,             5824,            -88585
##MIN=       0,             -323536275,      0
##MAX=       8223.62146879498, 512692593,    0
$$ Real data points
##PAGE= N=1
##DATA TABLE= (X++(R..R)), XYDATA
$$ [...]
62927C440203M7918M4994M2202L9928L7051L2619K6473J8592R034j470j1897k2101
62915C703546l2851m4737n7450p0054q1401r0417r6644j00610j03261j04989j05425
62904B815707j04031j00682r5835r0300q4658p8851p2800o7243o3142o0051n6179
62893A941935n0752m5331m1800l9809l7439l3864l0118k7313k5463k4170k3403
62882A562473k3125k2965k2640k2148k1257j9497j7047j5104j4775j5839j7017
62871A351059j7315j6840j6314j6087j5761j4746j3077j1517j0793j0875j1104
62860A196630j0851r951q643p343o354n612m755l644k710k658l723n163n620m337
62846A115266k317j732l512n810n824l197m72N6j243k651l512m132m282l509k541
$$ y = [3440203, 3488121, 3533115, 3575317, 3615245, 3652296, 3684915, 3711388, 3729980, 3739014, 3737544, 3725647, 3703546, 3670695, 3625958, 3568508, 3498454, 3417053, 3326636, 3229992, 3129382, 3026121, 2921132, 2815707, 2711676, 2610994, 2515159, 2424859, 2340201, 2261350, 2188550, 2121307, 2058165, 1998114, 1941935, 1891183, 1845852, 1804052, 1764243, 1726804, 1692940, 1662822, 1635509, 1610046, 1585876, 1562473, 1539348, 1516383, 1493743, 1471595, 1450338, 1430841, 1413794, 1398690, 1383915, 1368076, 1351059, 1333744, 1316904, 1300590, 1284503, 1268742, 1253996, 1240919, 1229402, 1218609, 1207734, 1196630, 1185779, 1175828, 1167185, 1159842, 1153488, 1147876, 1143121, 1139477, 1136767, 1134109, 1130386, 1125223, 1119603, 1115266, 1112949, 1111217, 1107705, 1101895, 1096071, 1092874, 1092402, 1092458, 1091215, 1088564, 1085052, 1080920, 1076638, 1073129, 1070588]
62831A070588k774m227n417n499n263n489n640m992m074l934m533m866m375l452
62817A006053k723k556l115m093m555l724j997n11K27N13L51p17k415l467l256
62802I74015k761k962l185k239n49L50J35j46k17j113k995m178l342j331L76J703
62786I51561L122L967L413K440K815M380N159M236K860K484L360N274P985J0333
62772A013389J0597Q729O942P087Q435R038Q247O825N484M496M250N000O180O761
62758A111460O210M714K819J276P09J048J683K381L350M229M124L188K901L903
62744A153995M700L732J811J133K561N165P884J0207J1653J2098J2454J3734J5549
62731A256676J6820J7696J9337K1840K3992K5354K7096L0336L4889M0056M5415
$$ y = [1070588, 1067814, 1063587, 1058170, 1052671, 1047408, 1041919, 1036279, 1031287, 1027213, 1023279, 1018746, 1013880, 1009505, 1006053, 1003330, 1000774, 997659, 993566, 989011, 985287, 983290, 982779, 983006, 983519, 983870, 983153, 980738, 977271, 974015, 971254, 968292, 965107, 962868, 962319, 962669, 962804, 962658, 962441, 961328, 958333, 954155, 950813, 949482, 949858, 951561, 954683, 958650, 962063, 964503, 967318, 971698, 976857, 981093, 983953, 986437, 989797, 995071, 1003056, 1013389, 1023986, 1032715, 1039657, 1046744, 1055179, 1064217, 1072464, 1079289, 1084773, 1089269, 1093519, 1098519, 1104699, 1111460, 1117670, 1122384, 1125203, 1126479, 1127188, 1128236, 1129919, 1132300, 1135650, 1139879, 1144003, 1147191, 1150092, 1153995, 1158695, 1162427, 1164238, 1165371, 1167932, 1173097, 1180981, 1191188, 1202841, 1214939, 1227393, 1241127, 1256676, 1273496, 1291192, 1310529, 1332369, 1356361, 1381715, 1408811, 1439147, 1474036, 1514092, 1559507]
62720A559507N0424N4515N8142O2618O8148P3328P7199Q0638Q4701Q8878R2256
62709B350354R5333R8928J01830J01315R6114Q7456P7004O5133N1645L6946K1653
62698C183711N839j0593k7201m3174n7782p0268p9938q6922r2373r7133j00523
62687B523643j01213r9041r5161r0569q5470q0119p5243p1165o7311o3221n9236
62676A635894n5640n1740m6705m0931l5766l2047k9525k7538k5519k3081k0320
62665A247082j7910j6189j4403j1720q783p151p154p336o298m006j089K060N013
62652A152116P175Q676J0547J3267J5998J7972J9896K3025K7423L2134L6648M1151
62640A406028M5595M9532N2905N6283O0241O5018P0678P7057Q3573Q9494R4306
$$ y = [1559507, 1609931, 1664446, 1722588, 1785206, 1853354, 1926682, 2003881, 2084519, 2169220, 2258098, 2350354, 2445687, 2544615, 2646445, 2747760, 2843874, 2931330, 3008334, 3073467, 3125112, 3162058, 3183711, 3189550, 3178957, 3151756, 3108582, 3050800, 2980532, 2900594, 2813672, 2721299, 2624166, 2523643, 2422430, 2323389, 2228228, 2137659, 2052189, 1972070, 1896827, 1825662, 1758351, 1695130, 1635894, 1580254, 1528514, 1481809, 1440878, 1405112, 1373065, 1343540, 1316002, 1290483, 1267402, 1247082, 1229172, 1212983, 1198580, 1186860, 1178077, 1170926, 1163772, 1156436, 1150138, 1146132, 1145043, 1147103, 1152116, 1159291, 1167967, 1178514, 1191781, 1207779, 1225751, 1245647, 1268672, 1296095, 1328229, 1364877, 1406028, 1451623, 1501155, 1554060, 1610343, 1670584, 1735602, 1806280, 1883337, 1966910, 2056404, 2150710]
62629B150710R7557R8784R8089R6327R4119R0949Q5810P8287O8294N5167L8294
62618C052387J8683j163j9310l5675n1010o5358p8033q8532r6709j02269j04839
62607B428172j04839j03759j02848j01637r8398r2586q6151q1578p8915p5825
62597A501636p0724o4617n9322n5070n0854m6294m1936l8084l4541l1428k9302
62586I79464k8212k7420k6220k4528k2627k0802j9322j8291j7401j6227j4853
62575G43561j3917j3878j4366j4363j3080j0776q617p487p025o259n006l991l575
62562F21221l266k665k072j797j661j561j641j533m67J410K894L553M458O274
62548F23147P884Q293Q652J0709J3997J6349J6907J6895J7594J9030K0784K2651
$$ y = [2150710, 2248267, 2347051, 2445140, 2541467, 2635586, 2726535, 2812345, 2890632, 2958926, 3014093, 3052387, 3071070, 3069907, 3050597, 3014922, 2963912, 2898554, 2820521, 2731989, 2635280, 2533011, 2428172, 2323333, 2219574, 2116726, 2015089, 1916691, 1824105, 1737954, 1656376, 1577461, 1501636, 1430912, 1366295, 1306973, 1251903, 1201049, 1154755, 1112819, 1074735, 1040194, 1008766, 979464, 951252, 923832, 897612, 873084, 850457, 829655, 810333, 792042, 774641, 758414, 743561, 729644, 715766, 701400, 687037, 673957, 663181, 654564, 647077, 640052, 633793, 628787, 624796, 621221, 617955, 615290, 613218, 611421, 609760, 608199, 606558, 605025, 604558, 605968, 608862, 612415, 616873, 623147, 631031, 639324, 647976, 658685, 672682, 689031, 705938, 722833, 740427, 759457, 780241, 802892]
62536H02892K4417K6056K8197L1313L4582L6753L8028L9856M2947M6693N0405
62525A202139N3622N5184N3698M9381M4157L9470L5081L0296K4991J8987J1660
62514A618666K922o354j5342k3711l0803l5619l8157l9694m1055m1758m1466m1104
62502A266525m1479m1785m0614l7883l4781l2183k9958k7656k5168k2850k1329
62491I10839k0905k0955k0369j8778j6894j5465j4542j3929j3535j2987j1692
62480G30788r713p934o968o668o838p421p570n868k237J351L120L574M349N852
62466F87817P302Q488R959J1670J2857J3517J4717J6995J9451K1052K2146K3907
62454H69878K6760L0114L3462L6963M0748M4387M7505N0338N3081N5132N5909
$$ y = [802892, 827309, 853365, 881562, 912875, 947457, 984210, 1022238, 1062094, 1105041, 1151734, 1202139, 1255761, 1310945, 1364643, 1414024, 1458181, 1497651, 1532732, 1563028, 1588019, 1607006, 1618666, 1621588, 1615234, 1599892, 1576181, 1545378, 1509759, 1471602, 1431908, 1390853, 1349095, 1307629, 1266525, 1225046, 1183261, 1142647, 1104764, 1069983, 1037800, 1007842, 980186, 955018, 932168, 910839, 889934, 868979, 848610, 829832, 812938, 797473, 782931, 769002, 755467, 742480, 730788, 721075, 713141, 706173, 699505, 692667, 685246, 677676, 671808, 669571, 670922, 674042, 677616, 681965, 687817, 695119, 703607, 713566, 725236, 738093, 751610, 766327, 783322, 802773, 823825, 845971, 869878, 896638, 926752, 960214, 997177, 1037925, 1082312, 1129817, 1180155, 1233236, 1288368, 1344277]
62443A344277N6034N6453N6283N3264M6945L9828L3951K7945J9341Q749p76q118
62431A734176j5259k3757l2424l9444m4652m8501n0561n0493m9286m8091m6730
62420A284978m4564m1887l9233l6132l1912k7263k3742k1936k1026j9882j7881
62409I59520j5013j1906r396p518n481l099j414j198j678j671j193q99o38K89
62395H98705J865L506N101O958Q957J0651J1905J2692J2757J2220J1839J1743
62383A008899J0690P722L887R06j176l511o205q459j0600j3821j7643j9840j9532
62370I31317j8500j8424j8596j7644j6117j5510j5725j5297j3778j2180j0967
62359G58579r143n974k487m74m32j118q75R76L766O044O762O344O451Q148J0464
$$ y = [1344277, 1400311, 1456764, 1513047, 1566311, 1613256, 1653084, 1687035, 1714980, 1734321, 1743070, 1742294, 1734176, 1718917, 1695160, 1662736, 1623292, 1578640, 1530139, 1479578, 1429085, 1379799, 1331708, 1284978, 1240414, 1198527, 1159294, 1123162, 1091250, 1063987, 1040245, 1018309, 997283, 977401, 959520, 944507, 932601, 923205, 915687, 910206, 907107, 905693, 904495, 902817, 901146, 899953, 899054, 898416, 898705, 900570, 904076, 909177, 916135, 925092, 935743, 947648, 960340, 973097, 985317, 997156, 1008899, 1019589, 1027311, 1031198, 1032104, 1030928, 1027417, 1021212, 1012753, 1002153, 988332, 970689, 950849, 931317, 912817, 894393, 875797, 858153, 842036, 826526, 810801, 795504, 781726, 769546, 758579, 749436, 743462, 740975, 740501, 740069, 738951, 738076, 739052, 742818, 748862, 755624, 761968, 768419, 776567, 787031]
62344G87031J1432J0625R735J0179J1045J0536Q843Q096R259J0627J0038P485
62332I04931M555K261O06l27k70K69K17o90j680k273k837l408k898j73M381R049
62316I11713J2245J3551J3659J3788J5046J7902K2119K7223L2759L8062M2278
62305A160345M5215M7944N1879N7254O2947O7865P1824P4883P6633P6750P5670
62294A869209P3766P0321O4364N6339M7667L8516K7509J4360J395q846j6531k3722
62282B214347l1329l8506m4715n0450n5692n9240o0325n9708n8361n6146n2599
62271A647276m8352m4695m2078l9849l7396l4929l3078l2032l1311l0261k8707
62260A244588k6806k4348k0852j6702j3410j1949j1414j0291q491o976n941m894
$$ y = [787031, 798463, 809088, 818823, 829002, 840047, 850583, 859426, 867522, 876781, 887408, 897446, 904931, 909486, 911747, 912353, 912026, 911756, 912025, 912242, 911552, 909872, 907599, 904762, 901354, 898456, 898283, 902664, 911713, 923958, 937509, 951168, 964956, 980002, 997904, 1020023, 1047246, 1080005, 1118067, 1160345, 1205560, 1253504, 1305383, 1362637, 1425584, 1493449, 1565273, 1640156, 1716789, 1793539, 1869209, 1942975, 2013296, 2077660, 2133999, 2181666, 2220182, 2247691, 2262051, 2263446, 2254600, 2238069, 2214347, 2183018, 2144512, 2099797, 2049347, 1993655, 1934415, 1874090, 1814382, 1756021, 1699875, 1647276, 1598924, 1554229, 1512151, 1472302, 1434906, 1399977, 1366899, 1334867, 1303556, 1273295, 1244588, 1217782, 1193434, 1172582, 1155880, 1142470, 1130521, 1119107, 1108816, 1100325, 1093349, 1087408, 1082514]
62248A082514m181m658n807n990m908l979l827l333k057j618l186n220n412l814
62234A024524k347j951j902j590j344j381j030N93L553O718Q448Q107O987O926
62220A054311Q105R283J0196J1947J4547J6133J5797J5449J7187K0290K2603K3738
62208A239586K5060K7364L0393L3963L7833M1145M3648M6787N1770N7276O1069
62197A695894O3256O5777O9032P1246P1158O9113O5246N8783M9731L9474K9072
62186B347782J8449P684k477j1875k1213l0603l9165m6485n2964n8353o1482o2115
62174A987183o1446o0059n6966n1640m5653m1063l8107l5533l2295k8125k3276
62163A513020j8674j5487j3635j1459p770l627j082p64j533k110k094j633r25
$$ y = [1082514, 1078333, 1073675, 1067868, 1061878, 1056970, 1052991, 1049164, 1045831, 1043774, 1042156, 1038970, 1033750, 1028338, 1024524, 1022177, 1020226, 1018324, 1016734, 1015390, 1014009, 1012979, 1013572, 1017125, 1023843, 1032291, 1040398, 1047385, 1054311, 1062416, 1071699, 1081895, 1093842, 1108389, 1124522, 1140319, 1155768, 1172955, 1193245, 1215848, 1239586, 1264646, 1292010, 1322403, 1356366, 1394199, 1435344, 1478992, 1525779, 1577549, 1634825, 1695894, 1759150, 1824927, 1893959, 1965205, 2036363, 2105476, 2170722, 2229505, 2279236, 2318710, 2347782, 2366231, 2373915, 2371438, 2359563, 2338350, 2307747, 2268582, 2222097, 2169133, 2110780, 2049298, 1987183, 1925737, 1865678, 1808712, 1757072, 1711419, 1670356, 1632249, 1596716, 1564421, 1536296, 1513020, 1494346, 1478859, 1465224, 1453765, 1445995, 1442368, 1441286, 1440522, 1438989, 1436879, 1434785, 1433152, 1432227]
62150A432227j14Q07J959L255M349N156O019P162Q424R739J1424J3707J6284J8606
62136A539004K0265K1156K1708K2949K5642K9276L2553L5005L7311L9852M1909
62125A866630M2665M2161M0720L8228L4627L0655K7349K5180K3990K3422K3086
62114B218713K2836K3157K4794K7562L0208L2034L4084L7952M3536M8694N1260
62103B594830N1009M9471M7952M5969M1937L5289K7412K0088J3700P733K461j210
62091B936641l540o239j0318j4687j7523j8301j7773j6652j5101j3131j0737p762
62079B784877m206o07K285M132N092N557O072P356R796J2932J5758J7706J9149
62066B885899K0742K2479K3827K4874K6718L0065L3889L6515L7842L9268M1311
$$ y = [1432227, 1432113, 1432920, 1434879, 1438134, 1442483, 1447639, 1453658, 1460820, 1469244, 1478983, 1490407, 1504114, 1520398, 1539004, 1559269, 1580425, 1602133, 1625082, 1650724, 1680000, 1712553, 1747558, 1784869, 1824721, 1866630, 1909295, 1951456, 1992176, 2030404, 2065031, 2095686, 2123035, 2148215, 2172205, 2195627, 2218713, 2241549, 2264706, 2289500, 2317062, 2347270, 2379304, 2413388, 2451340, 2494876, 2543570, 2594830, 2645839, 2695310, 2743262, 2789231, 2831168, 2866457, 2893869, 2913957, 2927657, 2935390, 2937851, 2936641, 2933101, 2926862, 2916544, 2901857, 2884334, 2866033, 2848260, 2831608, 2816507, 2803376, 2792639, 2784877, 2780671, 2780064, 2782349, 2786481, 2791573, 2797130, 2803202, 2810558, 2820354, 2833286, 2849044, 2866750, 2885899, 2906641, 2929120, 2952947, 2977821, 3004539, 3034604, 3068493, 3105008, 3142850, 3182118, 3223429]
62055C223429M2840M3307M4040M6009M7896M8167M7895M9314N2231N4260N4517
62044C753905N4610N5736N7098N8014N9356O1704O3882O4827O5552O7663P0861
62033D433208P3531P5290P7546Q1417Q6115Q9459Q9690Q6941Q3267Q1041Q1075
62022E338580Q2584Q4652Q7071Q9681R1852R2819R1934Q8714Q3614P8604P5717
62011F285822P4882P4437P3813P4148P5900P7705P8503P9070Q0278Q1179Q0126
62000G135863P6697P1238O3688N4391M5125L7700L1864K5894J8906J1422M136
61989G576924k741r258j5874k3373l1526l8367m1929m2501m2007m1630m1290m0968
61977G205460m0987m0876l9544l6968l4487l2919l1478k9154k6335k4260k3279
$$ y = [3223429, 3266269, 3309576, 3353616, 3399625, 3447521, 3495688, 3543583, 3592897, 3645128, 3699388, 3753905, 3808515, 3864251, 3921349, 3979363, 4038719, 4100423, 4164305, 4229132, 4294684, 4362347, 4433208, 4506739, 4582029, 4659575, 4740992, 4827107, 4916566, 5006256, 5093197, 5176464, 5257505, 5338580, 5421164, 5505816, 5592887, 5682568, 5774420, 5867239, 5959173, 6047887, 6131501, 6210105, 6285822, 6360704, 6435141, 6508954, 6583102, 6659002, 6736707, 6815210, 6894280, 6974558, 7055737, 7135863, 7212560, 7283798, 7347486, 7401877, 7447002, 7484702, 7516566, 7542460, 7561366, 7572788, 7576924, 7574183, 7564925, 7549051, 7525678, 7494152, 7455785, 7413856, 7371355, 7329348, 7287718, 7246428, 7205460, 7164473, 7123597, 7084053, 7047085, 7012598, 6979679, 6948201, 6919047, 6892712, 6868452, 6845173]
61966F845173k2489k0930j8617j6298j4474j2907j1136r283p979p489p259o567
61954F689745n234l531j818n08o5o06j666k558k832k411j631j191j626k789m248
61939F657031o103q824j2454j6838k2411k9552l7205m3565m8638n4483o2120o9672
61927F245166p4669p6951p7880p7948p6887p5387p4701p4716p4051p2095o9507
61916E420374o6717o3519o0332n8298n7484n6288n3495m9971m7388m5900m4163
61905D816819m1367l8256l5885l4129l1988k9217k6909k6124k6212k5313k2624
61894D478795j9519j7914j7908j7614j5273j1134p118m747l548j626K157O860
61882D371411J0592J2659J4090J6234J9475K3179K6284K8046K8935L0619L4266
$$ y = [6845173, 6822684, 6801754, 6783137, 6766839, 6752365, 6739458, 6728322, 6719039, 6711060, 6703571, 6696312, 6689745, 6684511, 6680980, 6679162, 6678654, 6678589, 6677983, 6676317, 6673759, 6670927, 6668516, 6666885, 6665694, 6664068, 6661279, 6657031, 6650928, 6642104, 6629650, 6612812, 6590401, 6560849, 6523644, 6480079, 6431441, 6376958, 6314838, 6245166, 6170497, 6093546, 6015666, 5937718, 5860831, 5785444, 5710743, 5636027, 5561976, 5489881, 5420374, 5353657, 5290138, 5229806, 5171508, 5114024, 5057736, 5004241, 4954270, 4906882, 4860982, 4816819, 4775452, 4737196, 4701311, 4667182, 4635194, 4605977, 4579068, 4552944, 4526732, 4501419, 4478795, 4459276, 4441362, 4423454, 4405840, 4390567, 4379433, 4372315, 4367568, 4364020, 4362394, 4364551, 4371411, 4382003, 4394662, 4408752, 4424986, 4444461, 4467640, 4493924, 4521970, 4550905, 4581524, 4615790]
61871D615790L9031M3182M6487N0108N4307N7913O0524O3557O8389P4836Q2390
61860E256514R1503J02671J15524J29953J46950J67025J88837K10760K32959K56674
61850F899370K82451L10408L41227L75158M10767M46553M83424N23776N68276
61841A0641410O15120O62394P09208P54017P93123Q21104Q31357Q15722P65232
61832A7408687O73242N38763L67468J70521l7435k40584m24610n79209o99476
61823A7177367p85247q38824q63198q62377q42230q09176p67604p19789o68354
61814A0020568o16935n67700n20111m73571m29694l90444l55390l22696k91831
61805F052196k63510k37845k14427j93537j75344j58627j42151j26713j13725
$$ y = [4615790, 4654821, 4698003, 4744490, 4794598, 4848905, 4906818, 4967342, 5030899, 5099288, 5174124, 5256514, 5348017, 5450688, 5566212, 5696165, 5843115, 6010140, 6198977, 6409737, 6642696, 6899370, 7181821, 7492229, 7833456, 8208614, 8619381, 9065934, 9549358, 10073134, 10641410, 11256530, 11918924, 12628132, 13382149, 14175272, 14996376, 15827733, 16643455, 17408687, 18081929, 18620692, 18988160, 19158681, 19121246, 18880662, 18456052, 17876843, 17177367, 16392120, 15553296, 14690098, 13827721, 12985491, 12176315, 11408711, 10688922, 10020568, 9403633, 8835933, 8315822, 7842251, 7412557, 7022113, 6666723, 6344027, 6052196, 5788686, 5550841, 5336414, 5142877, 4967533, 4808906, 4666755, 4540042, 4426317]
61796D426317j02370r0415p7567o5635n5378m5675l6181k8401k3362k0121j7464
61785C863748j5448j4432j4150j4485j5877j8182k0353k1667k2159k1546j9231
61774C666218j5760j2692j0283o897j503M568R241J1775J2437J1491R495P407
61762C685497N361K293k223o717r376j0040r730r030p881o234l819J47O092J3271
61748C647611K0542K7562L4762M2591N1324O1016P1177Q1080R0819J01293J12738
61737D342515J24190J35064J46323J59204J73540J88356K03595K20221K38903
61728E931911K59469K81593L05334L31059L59293L90562M25064M62596N03067
61719I249948N46850N94655O47404P06122P71235Q41864R16544R94870J077583
$$ y = [4426317, 4323947, 4233532, 4155965, 4090330, 4034952, 3989277, 3953096, 3924695, 3901333, 3881212, 3863748, 3848300, 3833868, 3819718, 3805233, 3789356, 3771174, 3750821, 3729154, 3706995, 3685449, 3666218, 3650458, 3637766, 3627483, 3620586, 3619083, 3623651, 3632892, 3644667, 3657104, 3668595, 3678090, 3685497, 3690858, 3693151, 3690928, 3684211, 3674835, 3664795, 3655065, 3646035, 3638154, 3631920, 3628101, 3628248, 3634340, 3647611, 3668153, 3695715, 3730477, 3773068, 3824392, 3885408, 3956585, 4037665, 4128484, 4229777, 4342515, 4466705, 4601769, 4748092, 4907296, 5080836, 5269192, 5472787, 5693008, 5931911, 6191380, 6472973, 6778307, 7109366, 7468659, 7859221, 8284285, 8746881, 9249948, 9796798, 10391453, 11038857, 11744979, 12516214, 13358078, 14274622, 15269492, 16347075]
61710A6347075J164544J253235J339436J418441J484564J529546J541631J506202
61702B7584674J408339J237327R91404O79943L22347n4820m22009p52680j029111
61693B9965414j243787j396157j489430j530347j529029j496060j439432j364875
61685A8476297j278140j185414j091794j000581r13911q33109p58539o90156o28208
61676A0096445n72867n23507m79182m39603m04644l73119l43197l14341k87956
61667F358029k65592k47051k30692k15208k00599j87535j76276j66422j57451
61658D511203j49063j41080j33395j26206j19848j14097j08136j01757r5999r1801
61648C329821q8418q4225p8867p3340o8077o2362n6140n0920m8068m7051m6316
$$ y = [16347075, 17511619, 18764854, 20104290, 21522731, 23007295, 24536841, 26078472, 27584674, 28993013, 30230340, 31221744, 31901687, 32224034, 32169214, 31747205, 30994525, 29965414, 28721627, 27325470, 25836040, 24305693, 22776664, 21280604, 19841172, 18476297, 17198157, 16012743, 14920949, 13920368, 13006457, 12173348, 11414809, 10724653, 10096445, 9523578, 9000071, 8520889, 8081286, 7676642, 7303523, 6960326, 6645985, 6358029, 6092437, 5845386, 5614694, 5399486, 5198887, 5011352, 4835076, 4668654, 4511203, 4362140, 4221060, 4087665, 3961459, 3841611, 3727514, 3619378, 3517621, 3421622, 3329821, 3241403, 3157178, 3078311, 3004971, 2936894, 2874532, 2818392, 2767472, 2719404, 2672353, 2626037]
61637B626037m5128m3747m2426m1114l9766l8236l6163l3499l0945k9335k8838
61626B216840k8959k8976k8207k6527k4855k4361k4790k4400k2179j9368j7998
61615A946220j8524j9659k0118j9647j8594j7362j6300j5641j5452j5708j6204
61604A753011j6436j6041j5426j5301j5388j4342j1436p546m152k028j398k331
61592A631186m136m956l206P30M789P091P191N994M971N108O077O634O026M590
61578A678089K882J099k88k93J379L624N173N924O382O555O267N881N626M731
61564A733031K342r73l722n333o516p924r413j0694j1892j3241j4745j6265j7499
61551A617156j7993j7642j7009j6655j6353j5525j4244j3173j2612j2192j1468
$$ y = [2626037, 2580909, 2537162, 2494736, 2453622, 2413856, 2375620, 2339457, 2305958, 2275013, 2245678, 2216840, 2187881, 2158905, 2130698, 2104171, 2079316, 2054955, 2030165, 2005765, 1983586, 1964218, 1946220, 1927696, 1908037, 1887919, 1868272, 1849678, 1832316, 1816016, 1800375, 1784923, 1769215, 1753011, 1736575, 1720534, 1705108, 1689807, 1674419, 1660077, 1648641, 1641095, 1636943, 1634915, 1633517, 1631186, 1627050, 1622094, 1618888, 1619618, 1624407, 1631498, 1638689, 1644683, 1649654, 1654762, 1660839, 1667473, 1673499, 1678089, 1680971, 1682070, 1681782, 1681489, 1682868, 1686492, 1691665, 1697589, 1703971, 1710526, 1716793, 1722674, 1728300, 1733031, 1735373, 1734400, 1730678, 1725345, 1718829, 1710905, 1701492, 1690798, 1678906, 1665665, 1650920, 1634655, 1617156, 1599163, 1581521, 1564512, 1547857, 1531504, 1515979, 1501735, 1488562, 1475950, 1463758, 1452290]
61540A452290j0296q658o629m613l168k573k682l068l073k030J07K489M106M777
61526A416979N177O062P719R971J2468J4934J7125J8558J8627J7467J6402J6863
61514A578352J8977K1874K5124K8791L2318L4791L6434L8332M0349M0994M0070
61503A936406L9616M0982M2664M2683M1700M1675M2395M1703L8955L6054L4742
61492B379575L4610L4227L2822L0336K7005K3557K0880J8917J6533J2814P983
61481B639259K919j605m996o918p644q057r045j0941j3215j4538j3719j1018p961
61468B532521n232j709L482Q941J2659J5141J8908K4906L1444L7228M3434N1590
61456B773313O0922O9418P6734Q4481R3903J04663J16063J28262J41703J56136
$$ y = [1452290, 1441994, 1433336, 1426707, 1422094, 1418926, 1416353, 1413671, 1410603, 1407530, 1405500, 1405607, 1408096, 1412202, 1416979, 1422156, 1428218, 1435937, 1445908, 1458376, 1473310, 1490435, 1508993, 1527620, 1545087, 1561489, 1578352, 1597329, 1619203, 1644327, 1673118, 1705436, 1740227, 1776661, 1814993, 1855342, 1896336, 1936406, 1976022, 2017004, 2059668, 2102351, 2144051, 2185726, 2228121, 2269824, 2308779, 2344833, 2379575, 2414185, 2448412, 2481234, 2511570, 2538575, 2562132, 2583012, 2601929, 2618462, 2631276, 2639259, 2642178, 2640573, 2635577, 2628659, 2621015, 2612958, 2603913, 2592972, 2579757, 2565219, 2551500, 2540482, 2532521, 2527289, 2525580, 2529062, 2538003, 2550662, 2565803, 2584711, 2609617, 2641061, 2678289, 2721723, 2773313, 2834235, 2903653, 2980387, 3064868, 3158771, 3263434, 3379497, 3507759, 3649462, 3805598]
61446C805598J70894J85975K02208K20144K39147K57834K75222K91074L05061
61437E953157L15991L21903L20626L10209K89437K58408K18439J71217J18313
61428H277700O1771M745m8892r5731j33965j63957j87519k05786k17633k21139
61418G069594k16758k07862j97433j85462j70610j53313j35746j19250j03296
61409E579864q6861o9639n2004l4817j9287o051N629J6995K8275L8832M8457N7463
61397E506856O5589P1908P5923P7996P8644P8341P7835P7714P7514P6166P3530
61386F338016P0693O8728O7834O7750O8092O8184O7361O5585O3161N9960N5736
61375G061100N1036M6728M2637L7683L1573K5204J9123J2631M957l579j2123k0280
$$ y = [3805598, 3976492, 4162467, 4364675, 4584819, 4823966, 5081800, 5357022, 5648096, 5953157, 6269148, 6591051, 6911677, 7221886, 7511323, 7769731, 7988170, 8159387, 8277700, 8339471, 8344216, 8295324, 8199593, 8065628, 7901671, 7714152, 7508366, 7290733, 7069594, 6852836, 6644974, 6447541, 6262079, 6091469, 5938156, 5802410, 5683160, 5579864, 5493003, 5423364, 5371360, 5336543, 5317256, 5311205, 5316834, 5333829, 5362104, 5400936, 5449393, 5506856, 5572445, 5644353, 5720276, 5798272, 5876916, 5955257, 6033092, 6110806, 6188320, 6264486, 6338016, 6408709, 6477437, 6545271, 6613021, 6681113, 6749297, 6816658, 6882243, 6945404, 7005364, 7061100, 7112136, 7158864, 7201501, 7239184, 7270757, 7295961, 7315084, 7327715, 7332672, 7329093, 7316970, 7296690]
61363G296690k7891l4451l9294m2174m3371m3534m3513m3682m3181m0355l4419
61352F860825k6604j9499j5277j4126j3927j1954p555l017j129k293m882p760
61340F732802j0994j4246j6294j6588j5826j4330j1067n112L095J2852K4648L9428
61328F708368N6950P5834R5011J14575J35442J58508J83618K09060K32761K54387
61318H224514K75374K96433L15917L31349L41401L45235L40809L25630K99040
61309A1095702K62335K16800J63150J03431M2046j6341o9523j17843j62065k01961
61299A1315731k36857k66576k91271l10551l23429l29461l29695l26044l19690
61290H582157l10558k98498k84457k69944k55564k40651k24363k06728j88586
$$ y = [7296690, 7268799, 7234348, 7195054, 7152880, 7109509, 7065975, 7022462, 6978780, 6935599, 6895244, 6860825, 6834221, 6814722, 6799445, 6785319, 6771392, 6759438, 6751883, 6748866, 6747737, 6745444, 6740562, 6732802, 6721808, 6707562, 6691268, 6674680, 6658854, 6644524, 6633457, 6628345, 6631440, 6644292, 6668940, 6708368, 6765318, 6841152, 6936163, 7050738, 7186180, 7344688, 7528306, 7737366, 7970127, 8224514, 8499888, 8796321, 9112238, 9443587, 9784988, 10130223, 10471032, 10796662, 11095702, 11358037, 11574837, 11737987, 11841418, 11883464, 11867123, 11797600, 11679757, 11517692, 11315731, 11078874, 10812298, 10521027, 10210476, 9887047, 9557586, 9227891, 8901847, 8582157, 8271599, 7973101, 7688644, 7418700, 7163136, 6922485, 6698122, 6491394, 6302808]
61281F302808j70898j54232j38490j22865j06489q9437p2863n7809m4129l1037
61271E314559j8349o483M679J5834K6861L6293M2970M7544N1430N4851N6990N7699
61259E684878N7743N7284N5419N1662M6885M2303L8384L5074L2173K9034K4878
61248F155717J9952J5336J1056N606j731r427j5790k1527k8554l6917m4618n0323
61236E998780n4624n8536o2191o5394o8320p1049p3109p3865p2936p0303o6472
61225E261981o2383n8521n4323m9143m3439l8126l3212k8151k3320j9815j7836
61214D833712j6502j5417j5073j5505j5775j5330j4708j4338j3684j2176j0095
61203D675109p818m996j234K993O849J0117J3103J6185K0157K6461L6048M8055
$$ y = [6302808, 6131910, 5977678, 5839188, 5716323, 5609834, 5520397, 5447534, 5389725, 5345596, 5314559, 5296210, 5289727, 5294406, 5310240, 5337101, 5373394, 5416364, 5463908, 5515338, 5570189, 5627179, 5684878, 5742621, 5799905, 5855324, 5906986, 5953871, 5996174, 6034558, 6069632, 6101805, 6130839, 6155717, 6175669, 6191005, 6202061, 6207667, 6205936, 6196509, 6180719, 6159192, 6130638, 6093721, 6049103, 5998780, 5944156, 5885620, 5823429, 5758035, 5689715, 5618666, 5545557, 5471692, 5398756, 5328453, 5261981, 5199598, 5141077, 5086754, 5037611, 4994172, 4956046, 4922834, 4894683, 4871363, 4851548, 4833712, 4817210, 4801793, 4786720, 4771215, 4755440, 4740110, 4725402, 4711064, 4697380, 4685204, 4675109, 4667291, 4662295, 4661061, 4664054, 4670903, 4681020, 4694123, 4710308, 4730465, 4756926, 4792974, 4841029]
61191D841029O0428P2017Q3478R5898J08935J20803J29970J36273J39989J40208
61181E929028J34814J22143J02045P5148M2007L648l7498p7925j14287j44285
61171F034838j67059j83302j94282k00309k00790j96297j89217j81291j71641
61162D350650j59037j45205j33580j24911j16354j05482r3225q1973p2632o4788
61152C253463n8395n3596m9468m4461l8064l1077k4300j7794j1520n967j579K181
61140B919423O619J2374J8363K2606K4175K3779K2392K0117J6905J3394J0163
61129C110310O737K451k202o137r236j2183j5048j7274j9090k1621k5393k9663
61117B961651l3375l6088l7998l9795m2324m5496m7835m8098m7026m6344m6451
$$ y = [4841029, 4901457, 4973474, 5056952, 5152850, 5261785, 5382588, 5512558, 5648831, 5788820, 5929028, 6063842, 6185985, 6288030, 6363178, 6405185, 6408833, 6371335, 6293410, 6179123, 6034838, 5867779, 5684477, 5490195, 5289886, 5089096, 4892799, 4703582, 4522291, 4350650, 4191613, 4046408, 3912828, 3787917, 3671563, 3566081, 3472856, 3390883, 3318251, 3253463, 3195068, 3141472, 3092004, 3047543, 3009479, 2978402, 2954102, 2936308, 2924788, 2918821, 2917242, 2919423, 2926042, 2938416, 2956779, 2979385, 3003560, 3027339, 3049731, 3069848, 3086753, 3100147, 3110310, 3117047, 3119498, 3117296, 3111159, 3101923, 3089740, 3074692, 3057418, 3038328, 3016707, 2991314, 2961651, 2928276, 2892188, 2854190, 2814395, 2772071, 2726575, 2678740, 2630642, 2583616, 2537272, 2490821]
61106B490821m6467m6277m6849m8430n0011n0867n1142n0678m8791m5701m2705
61095A962903m0379l7869l4471l0696k7266k4490k3151k4432k8002l1411l2557
61084A628179l1760l0563k9476k7980k5907k3638k1235j8360j4911j1248p959
61073A385142n596m198k953r30J718M010N599P140R039J0805J1945J2602J3053
61060A447376J3389J3899J4907J6044J6590J6557J6547J6584J6366J6547J8172
61049A622978K0578K1539K0131J7777J5764J3289R133L973k99k753l812m195m476
61036A729627n247o802q758j0346j0830r861q157p590r401j2298j3686j2925j1979
61023A601747j2567j4224j5699j6771j7726j8336j8184j7229j5569j3574j2365
$$ y = [2490821, 2444354, 2398077, 2351228, 2302798, 2252787, 2201920, 2150778, 2100100, 2051309, 2005608, 1962903, 1922524, 1884655, 1850184, 1819488, 1792222, 1767732, 1744581, 1720149, 1692147, 1660736, 1628179, 1596419, 1565856, 1536380, 1508400, 1482493, 1458855, 1437620, 1419260, 1404349, 1393101, 1385142, 1379546, 1375348, 1372395, 1371465, 1373183, 1377193, 1382792, 1389932, 1398971, 1409776, 1421721, 1434323, 1447376, 1460765, 1474664, 1489571, 1505615, 1522205, 1538762, 1555309, 1571893, 1588259, 1604806, 1622978, 1643556, 1665095, 1685226, 1703003, 1718767, 1732056, 1741189, 1745162, 1744863, 1742110, 1738298, 1734103, 1729627, 1724380, 1717578, 1708820, 1698474, 1687644, 1677783, 1669626, 1662036, 1652635, 1640337, 1626651, 1613726, 1601747, 1589180, 1574956, 1559257, 1542486, 1524760, 1506424, 1488240, 1471011, 1455442, 1441868, 1429503]
61012A429503j2797j3713j2760r435n725l351k135j699k539m316n007l419j073
60999A351534k8n8M96K032L464M086M330M887N916O807O540M891L319L640N697
60984A407553P664Q600R154R749J0102J0821J3197J6789J9417K0401K1509K3863
60972A578819K6332K8101L0241L3276L5706L6762L8196M1297M4380M5502M5711
60961A984323M7205M9971N2497N4380N6084N7452N8550O0539O3903O7334P0252
60950B622490P4508Q1485Q9416R6094J02427J10566J20033J28757J36785J46053
60940C708614J57161J68925J80663J92757K05680K20272K38148K60186K85708
60931E618114L14343L46912L83081M20735M59560N02469N51524O05980O66968
$$ y = [1429503, 1416706, 1402993, 1390233, 1380798, 1375073, 1371722, 1369587, 1367888, 1365349, 1361033, 1356026, 1352607, 1351534, 1351506, 1351448, 1351944, 1353976, 1357440, 1361526, 1365856, 1370743, 1376659, 1383466, 1390006, 1394897, 1398216, 1401856, 1407553, 1415217, 1423817, 1432971, 1442720, 1452822, 1463643, 1476840, 1493629, 1513046, 1533447, 1554956, 1578819, 1605151, 1633252, 1663493, 1696769, 1732475, 1769237, 1807433, 1848730, 1893110, 1938612, 1984323, 2031528, 2081499, 2133996, 2188376, 2244460, 2301912, 2360462, 2421001, 2484904, 2552238, 2622490, 2696998, 2778483, 2867899, 2963993, 3066420, 3176986, 3297019, 3425776, 3562561, 3708614, 3865775, 4034700, 4215363, 4408120, 4613800, 4834072, 5072220, 5332406, 5618114, 5932457, 6279369, 6662450, 7083185, 7542745, 8045214, 8596738, 9202718, 9869686]
60922I869686P39859Q28144R29198J040657J166377J310824J473359J655688J868669
60913B0882461K121188K409023K728751L089588L471370L754457L732571L258145
60905D5447554K398697J427241O36100J60909k2836J5815K17962M70526N58357
60896E1310325K63703m56187j408759k299717k925981l251881l345353l286115
60888C4600035l131274k922794k691169k451617k209738j971787j744886j531946
60880A5944824j334090j156460j005914q83833p85381p04754o37763n80817n31298
60871H324514m88404m51274m17535l85820l57640l34102l12676k90325k68009
60862E018729k49018k34126k21543k10349k00740j91589j81041j69158j57477
$$ y = [9869686, 10609545, 11437689, 12366887, 13407544, 14573921, 15884745, 17358104, 19013792, 20882461, 23003649, 25412672, 28141423, 31231011, 34702381, 38456838, 42189409, 45447554, 47846251, 49273492, 49909592, 50070501, 50047665, 50063480, 50281442, 50751968, 51310325, 51574028, 51117841, 49709082, 47409365, 44483384, 41231503, 37886150, 34600035, 31468761, 28545967, 25854798, 23403181, 21193443, 19221656, 17476770, 15944824, 14610734, 13454274, 12448360, 11564527, 10779146, 10074392, 9436629, 8855812, 8324514, 7836110, 7384836, 6967301, 6581481, 6223841, 5889739, 5577063, 5286738, 5018729, 4769711, 4535585, 4314042, 4103693, 3902953, 3711364, 3530323, 3361165, 3203688]
60853C203688j46314j35006j24216j15363j08009j00239r1572q3297p6192p0003
60843B153477o5016o1841n9530n5942n0363m4163l8716l4207l0468k7466k4725
60832A661040k1576j8184j5202j2599r963p639o254n263l577j627j254l124n634
60819A549144o995p464q764j1846j5934j9566k2033k3552k4349k4225k3361k2760
60807A338295k2983k2895k1005j7866j5631j5054j4569j2713r843o865m023j746
60795A173102r40j224n24K289N813Q447J0655J3346J5632J6421J7024J9673K3925
60782A303639K6857K6894K5502K4783K4959K4766K3219K0575J8029J6546J5658
60771A551427J3846J0653P692O686P093O752M562J444j200l022m591o312p756
$$ y = [3203688, 3057374, 2922368, 2798152, 2682789, 2574780, 2474541, 2382969, 2299672, 2223480, 2153477, 2088461, 2026620, 1967090, 1911148, 1860785, 1816622, 1777906, 1743699, 1713231, 1685765, 1661040, 1639464, 1621280, 1606078, 1593479, 1583516, 1575877, 1569623, 1564360, 1560783, 1559156, 1557902, 1554778, 1549144, 1542149, 1534685, 1525921, 1514075, 1498141, 1478575, 1456542, 1432990, 1408641, 1384416, 1361055, 1338295, 1315312, 1292417, 1271412, 1253546, 1237915, 1222861, 1208292, 1195579, 1185736, 1178871, 1174848, 1173102, 1172162, 1170938, 1170414, 1172703, 1178516, 1186963, 1197618, 1210964, 1226596, 1243017, 1260041, 1279714, 1303639, 1330496, 1357390, 1382892, 1407675, 1432634, 1457400, 1480619, 1501194, 1519223, 1535769, 1551427, 1565273, 1575926, 1583618, 1590304, 1597397, 1604149, 1608711, 1610155, 1608955, 1605933, 1601342, 1595030, 1587274]
60758A587274q159p691p794r485j1694j2574j2310j2946j5271j7782j9239k0173
60746A432156k0884k0208j7815j5837j6198j7775j8192j7224j6270j5472j3698
60735A242583j0914q350o404m260j674M70J671K606M217O769R824J2428J3605
60722A262571J3364J2866J3110J4094J5638J7884K0208K1044J9987J8851J9305
60711A448922K0533K0762J9977J9408J9264J8859J8357J8527J9123J9158J8421
60700A661311J7293J5465J2426Q888O239M843M110L844M051L940K542J69j962
60687A743159l216l639l295k584k508l395m315n005o987j1038j4895j5804j4352
60674A652126j3411j4056j5063j5813j6797j7459j6463j4359j3266j3486j2974
$$ y = [1587274, 1579115, 1571424, 1563630, 1554145, 1542451, 1529877, 1517567, 1504621, 1489350, 1471568, 1452329, 1432156, 1411272, 1391064, 1373249, 1357412, 1341214, 1323439, 1305247, 1288023, 1271753, 1256281, 1242583, 1231669, 1223319, 1216915, 1212655, 1210981, 1211451, 1213122, 1215728, 1219945, 1226714, 1236538, 1248966, 1262571, 1275935, 1288801, 1301911, 1316005, 1331643, 1349527, 1369735, 1390779, 1410766, 1429617, 1448922, 1469455, 1490217, 1510194, 1529602, 1548866, 1567725, 1586082, 1604609, 1623732, 1642890, 1661311, 1678604, 1694069, 1706495, 1715383, 1721622, 1726465, 1730575, 1734419, 1738470, 1742410, 1744952, 1745121, 1743159, 1739943, 1736304, 1733009, 1730425, 1727917, 1724522, 1720207, 1715202, 1708215, 1697177, 1682282, 1666478, 1652126, 1638715, 1624659, 1609596, 1593783, 1576986, 1559527, 1543064, 1528705, 1515439, 1501953, 1488979]
60663A488979j0782q447p106n634l006m39K94p44k135k909k849k187j615j736
60649A439684j969j185K73O13r41l068m221m231l446j847K01J557J542P19j30
60634A423551q84j640k567m459q009j2163j4698j5083j5266j6856j9035k0171
60622A292720k0144j9854j9593j9156j8750j8587j8159j6770j4485j1890r575
60611A105757q163p997q329p693n636l127q56J709M853P500Q599Q583Q381P892
60597A111473O712N492N208N494N097L851K978L408M762O171P219P871Q061P728
60583A191525P020O269N885O215P351R083J1028J2674J3452J3137J2310J2045
60571A307994J3065J5319J8245K0977K2566K2698K2188K2159K2660K2821K2261
$$ y = [1488979, 1478197, 1469750, 1462644, 1457010, 1454004, 1453565, 1453859, 1453115, 1450980, 1448071, 1445222, 1443035, 1441420, 1439684, 1437715, 1436530, 1436803, 1437416, 1436475, 1433407, 1429186, 1424955, 1421509, 1419662, 1419863, 1421420, 1422962, 1423681, 1423551, 1422667, 1421027, 1418460, 1414001, 1405992, 1393829, 1379131, 1364048, 1348782, 1331926, 1312891, 1292720, 1272576, 1252722, 1233129, 1213973, 1195223, 1176636, 1158477, 1141707, 1127222, 1115332, 1105757, 1097594, 1089597, 1081268, 1073575, 1067939, 1064812, 1063956, 1065665, 1070518, 1078018, 1086617, 1095200, 1103581, 1111473, 1118185, 1123677, 1128885, 1134379, 1139476, 1143327, 1146305, 1149713, 1154475, 1160646, 1167865, 1175736, 1183797, 1191525, 1198545, 1204814, 1210699, 1216914, 1224265, 1233348, 1244376, 1257050, 1270502, 1283639, 1295949, 1307994, 1321059, 1336378, 1354623, 1375600, 1398166, 1420864, 1443052, 1465211, 1487871, 1510692, 1532953]
60560A532953K1573K1170K0580J9165J6894J4016J0602O771K909n92l423n222
60548A657396o062p047r404j2642j4582j3806j1358r448r188j0224j1814j3331
60536A528490j4077j3520j1903j0198r341r564j0196j0102q786p091o159n651
60524A411902l906l24L389N324N740O177O759O066L740J559J106J683J668J066
60510A451949J287K682L912M095M209N567P754R073Q579O842N030L947L696L592
60496A522214K663Q19q10j286j054q52k34J531L643M592M635N764R044J3603J8344
60481A582616K2928K6897K9761L2484L6938M3186M9241N4102N8745O3038O4324
60470B064260O0849N4336M7023L8097K5638J0511m211j6614k6208l2026l3252
$$ y = [1532953, 1554526, 1575696, 1596276, 1615441, 1632335, 1646351, 1656953, 1663724, 1666633, 1666041, 1662618, 1657396, 1651334, 1644287, 1634883, 1622241, 1607659, 1593853, 1582495, 1573047, 1563859, 1553635, 1541821, 1528490, 1514413, 1500893, 1488990, 1478792, 1469451, 1459887, 1449691, 1439589, 1430803, 1423712, 1417553, 1411902, 1407996, 1407672, 1411061, 1416385, 1422125, 1428302, 1435061, 1441127, 1444867, 1446426, 1447532, 1449215, 1450883, 1451949, 1453236, 1455918, 1459830, 1463925, 1468134, 1473701, 1481455, 1490528, 1499107, 1505949, 1510979, 1514926, 1518622, 1522214, 1524877, 1525696, 1524886, 1523600, 1522546, 1521694, 1521460, 1522991, 1526634, 1531226, 1535861, 1541625, 1550669, 1564272, 1582616, 1605544, 1632441, 1662202, 1694686, 1731624, 1774810, 1824051, 1878153, 1936898, 1999936, 2064260, 2125109, 2179445, 2226468, 2264565, 2290203, 2300714, 2296503, 2279889, 2253681, 2221655, 2188403]
60459B188403l1188k8026k4009j8152j1205n268n30M925J1873J8700K3663K6392
60447B155578K7058K6230K5765K7729L2043L6974M2132M8853N7513O6683P5679
60436B622237Q5735R7709J10460J22725J35250J49745J66426J83386J98213K10096
60426D081982K20774K33076K48132K64973K83422L05730L33497L64311L93247
60417F729144M15848M26748M17176L78614L09749K16962J08148j0256j29980k39535
60407H622618l29139l95046m38032m60213m64749m55851m36901m10104l78782
60398D853801l47391l18029k89352k60431k33121k09068j87193j66267j47501
60389B695448j32253j19346j07112r6130q7495q0193p2833o6319o2083n9059n5128
$$ y = [2188403, 2157215, 2129189, 2105180, 2087028, 2075823, 2070555, 2070025, 2074950, 2086823, 2105523, 2129186, 2155578, 2182636, 2208866, 2234631, 2262360, 2294403, 2331377, 2373509, 2422362, 2479875, 2546558, 2622237, 2707972, 2805681, 2916141, 3038866, 3174116, 3323861, 3490287, 3673673, 3871886, 4081982, 4302756, 4535832, 4783964, 5048937, 5332359, 5638089, 5971586, 6335897, 6729144, 7144992, 7571740, 7988916, 8367530, 8677279, 8894241, 9002389, 8992133, 8862153, 8622618, 8293479, 7898433, 7460401, 7000188, 6535439, 6079588, 5642687, 5232583, 4853801, 4506410, 4188381, 3899029, 3638598, 3405477, 3196409, 3009216, 2842949, 2695448, 2563195, 2443849, 2336737, 2240607, 2153112, 2072919, 2000086, 1933767, 1871684, 1812625, 1757497]
60378A757497n0513m6992m4666m2107l9023l6209l3434k9958k6707k5336k5244
60367A357308k4005k0962j8021j6568j5707j4254j2577j1565j1013r969p983n546
60355A189138l675l172l763m181l533k237j143l23O23J719K792L885M709M470
60341A185309L062J621J143J387J918L089M924O227O206N975O898Q395Q957Q556
60327A253667Q255Q019O903N129M096M182M092K612j08l125n492o481o062n240
60313A270447n100n536n548m553k751o17J231K176K277K375K874L206L114L356
60299A266951M216M570L669K804L526N201O091O119O647P976R036R436R948J0784
60285A356974J1087J0445R603R309R537R901R969R276P984P154P282P022M744
$$ y = [1757497, 1706984, 1659992, 1615326, 1573219, 1534196, 1497987, 1464553, 1434595, 1407888, 1382552, 1357308, 1333303, 1312341, 1294320, 1277752, 1262045, 1247791, 1235214, 1223649, 1212636, 1202667, 1194684, 1189138, 1185463, 1182291, 1178528, 1174347, 1170814, 1168577, 1167434, 1167111, 1167734, 1169453, 1172245, 1176130, 1180839, 1185309, 1188371, 1189992, 1191135, 1192522, 1194440, 1197529, 1202453, 1208680, 1214886, 1220861, 1227759, 1236154, 1245111, 1253667, 1261922, 1269941, 1276844, 1281973, 1286069, 1290251, 1294343, 1296955, 1296847, 1293722, 1288230, 1281749, 1275687, 1270447, 1265347, 1259811, 1254263, 1249710, 1246959, 1246342, 1247573, 1249749, 1252026, 1254401, 1257275, 1260481, 1263595, 1266951, 1271167, 1275737, 1279406, 1282210, 1285736, 1290937, 1297028, 1303147, 1309794, 1317770, 1326806, 1336242, 1346190, 1356974, 1368061, 1378506, 1388109, 1397418, 1406955, 1416856, 1426825, 1436101, 1444085, 1451239, 1458521, 1465543, 1470287]
60272A470287R77k070l171k737j193J448M364O204O934P775Q821Q335N284J109
60258A512367k002l596m706n940o884p020o448n635m968m568m423m652n369o096
60244A440060n790m006j771n95o94q73j68J009J488P96j67J8J633L183L053J700
60228A438876J237K682M777O013O452O787O952O807P095Q311R539R758R468R683
60214A534437J0222J0570J1482J3834J6403J6988J5653J4907J6403J9193K1698
60203A701790K3702K5827K8252L0876L3848L7271M0809M4031M6935N0108N4445
60192B117894O0380O7142P3338P8655Q4195R0643R7347J03980J11705J21249J31107
60181C137635J39340J46164J52795J58840J63040J65920J69058J71870J71730
$$ y = [1470287, 1471264, 1469194, 1466023, 1463286, 1462093, 1463541, 1467905, 1474109, 1481043, 1488818, 1497639, 1505974, 1511258, 1512367, 1510365, 1506769, 1502063, 1496123, 1489239, 1482219, 1475771, 1470136, 1465168, 1460600, 1456177, 1451525, 1446156, 1440060, 1434270, 1430264, 1428493, 1427898, 1427204, 1426331, 1426163, 1427172, 1428660, 1429456, 1429289, 1429307, 1430940, 1434123, 1437176, 1438876, 1440113, 1442795, 1447572, 1453585, 1460037, 1466824, 1473776, 1480583, 1487678, 1495989, 1505528, 1515286, 1524754, 1534437, 1544659, 1555229, 1566711, 1580545, 1596948, 1613936, 1629589, 1644496, 1660899, 1680092, 1701790, 1725492, 1751319, 1779571, 1810447, 1844295, 1881566, 1922375, 1966406, 2013341, 2063449, 2117894, 2178274, 2245416, 2318754, 2397409, 2481604, 2572247, 2669594, 2773574, 2885279, 3006528, 3137635, 3276975, 3423139, 3575934, 3734774, 3897814, 4063734, 4232792, 4404662, 4576392]
60172D576392J67504J60574J51919J40694J26515J10923R5356P9489O2782M6047
60162E718195L0237J5087L25j2906k3195l0533l5617l8182l7382l3190k6393j7466
60150E508980o559N605J7854K9868M2752N7821P4968R2379J08054J21585J34093
60139F187400J46227J56744J63531J65630J63560J57955J48747J35665J18962
60130G544421R9576P8767N7328L4855J0560j4813l8650n8850p5639r0126j02037
60119G445392j10048j13458j12087j05449r3784p9346o4621m9565l2440j3093
60109F671501O549K5220M3214O0334P5189Q7271R7689J06769J12618J13237J08770
60098G508361J00629Q9562P5766O0031M3660K7836J3562J600q091j5989k1541
$$ y = [4576392, 4743896, 4904470, 5056389, 5197083, 5323598, 5434521, 5529877, 5609366, 5672148, 5718195, 5748432, 5763519, 5763844, 5750938, 5727743, 5697210, 5661593, 5623411, 5586029, 5552839, 5526446, 5508980, 5502421, 5508026, 5525880, 5555748, 5598500, 5656321, 5731289, 5823668, 5931722, 6053307, 6187400, 6333627, 6490371, 6653902, 6819532, 6983092, 7141047, 7289794, 7425459, 7544421, 7643997, 7722764, 7780092, 7814947, 7825507, 7810694, 7772044, 7713194, 7637555, 7547429, 7445392, 7335344, 7221886, 7109799, 7004350, 6910566, 6831220, 6766599, 6717034, 6684594, 6671501, 6678050, 6703270, 6746484, 6806818, 6882007, 6969278, 7066967, 7173736, 7286354, 7399591, 7508361, 7608990, 7698552, 7774318, 7834349, 7878009, 7905845, 7919407, 7921007, 7912916, 7896927, 7875386]
60087G875386k2916j8880j0173J587J5661L2242N1472P3102R6793J22205J49046
60076H365525J77222K06670K37178K68733L01741L36084L70238M02353M32095
60067A1097839M60249M86613N09545N27657N40438N46746N44214N31072N07616
60058A5751989M75189M34641L86532L32003K72340K08084J39418O7414n722p7803
60048A7984085j47854k15776k80433l38209l84512m17240m37860m48390m48578
60039A4865233m37459m16551l89343l57911l22059k81826k38795j94574j49852
60030A2076863j05442o2699k2267J5904N0626P9108R9377J11670J16673J13862
60020A2473675J02806Q4857O2228L6214P595k2018n0657p7679j03753j29079j52478
$$ y = [7875386, 7852470, 7833590, 7823417, 7825004, 7840665, 7872907, 7924379, 7997481, 8094274, 8216479, 8365525, 8542747, 8749417, 8986595, 9255328, 9557069, 9893153, 10263391, 10665744, 11097839, 11558088, 12044701, 12554246, 13081903, 13622341, 14169087, 14713301, 15244373, 15751989, 16227178, 16661819, 17048351, 17380354, 17652694, 17860778, 18000196, 18067610, 18061888, 17984085, 17836231, 17620455, 17340022, 17001813, 16617301, 16200061, 15762201, 15313811, 14865233, 14427774, 14011223, 13621880, 13263969, 12941910, 12660084, 12421289, 12226715, 12076863, 11971421, 11908722, 11886455, 11902359, 11952985, 12032093, 12131470, 12243140, 12359813, 12473675, 12576481, 12661338, 12723566, 12759780, 12767375, 12745357, 12694700, 12617021, 12513268, 12384189, 12231711]
60009A2231711j72604j89566k04745k18929k31049k39291k43246k44018k42112
60000A0246151k36511k26564k13421j98318j80680j59562j36212j13093r0832
59991H690958o8013m3839j9139N182K8844N1356P2267R2210J11736J29090J41252
59980I191904J47388J49152J47176J39715J25524J05942Q2885N6694K7326l908
59970A0169798l5120o5377r4303j21067j44568j63792j77584j85170j87311j85782
59960H809724j81238j72808j60046j43961j25749j05967q5199o4074m2433k0053
59950G708196J860K1900M1311O3161Q8109J13399J36805J58976J80720K00434
59940H714871K15922K26677K32787K33385K27733K16139J98498J73891J43187
$$ y = [12231711, 12059107, 11869541, 11664796, 11445867, 11214818, 10975527, 10732281, 10488263, 10246151, 10009640, 9783076, 9569655, 9371337, 9190657, 9031095, 8894883, 8781790, 8690958, 8622945, 8579106, 8559967, 8565149, 8593993, 8645349, 8717616, 8809826, 8921562, 9050652, 9191904, 9339292, 9488444, 9635620, 9775335, 9900859, 10006801, 10089686, 10146380, 10173706, 10169798, 10134678, 10069301, 9974998, 9853931, 9709363, 9545571, 9367987, 9182817, 8995506, 8809724, 8628486, 8455678, 8295632, 8151671, 8025922, 7919955, 7834756, 7770682, 7728249, 7708196, 7710056, 7731956, 7773267, 7836428, 7924537, 8037936, 8174741, 8333717, 8514437, 8714871, 8930793, 9157470, 9390257, 9623642, 9851375, 10067514, 10266012, 10439903, 10583090]
59931A0583090J09951P7005M3881R420k5148n7958q9363j20247j48677j70868
59921A0211086j84941j91693j92273j87244j77421j63827j46886j26859j04497
59912H735445q0155n3425k4857L081K8269N0980P2315R2095J09955J26861J43076
59901I203640J55952J62466J63227J61393J58195J52174J42724J31621J20643
59892A0552035J09767R8411Q6821P5844O6678O1065O0423O4641P2714Q4467J00504
59881A1433370J20876J45228J73907K07391K44756K84124L24574L66054M07577
59872A3707857M47064M83039N14806N40569N56606N58874N44446N11423M58829
59863A8323513L87271K99103J97581Q6570k8758j41836k46090l36697m11279m69158
$$ y = [10583090, 10693041, 10770046, 10813927, 10823347, 10798199, 10740241, 10650878, 10530631, 10381954, 10211086, 10026145, 9834452, 9642179, 9454935, 9277514, 9113687, 8966801, 8839942, 8735445, 8655290, 8601865, 8577008, 8580089, 8608358, 8659338, 8731653, 8823748, 8933703, 9060564, 9203640, 9359592, 9522058, 9685285, 9846678, 10004873, 10157047, 10299771, 10431392, 10552035, 10661802, 10760213, 10847034, 10922878, 10989556, 11050621, 11111044, 11175685, 11248399, 11332866, 11433370, 11554246, 11699474, 11873381, 12080772, 12325528, 12609652, 12934226, 13300280, 13707857, 14154921, 14637960, 15152766, 15693335, 16249941, 16808815, 17353261, 17864684, 18323513, 18710784, 19009887, 19207468, 19294038, 19265280, 19123444, 18877354, 18540657, 18129378, 17660220]
59853A7660220n10096n33876n41329n35154n18497m92771m58249m16784l72134
59844A3281330l26952k81287k34919j89188j45138j01840n8416j6140K3356O0504
59834A2011310R6138J28651J55194J74770J87719J92858J87769J71544J44865
59825A3450818J07681N9476K013o0537j24479j87514k46753k98468l40671l73945
59815A1987621l98861m14411m20026m17408m09013l95854l77911l55920l31661
59806H466556l06930k82814k59478k36258k12489j88624j66185j46362j29145
59797F538271j13881j00357q9220q1474p7367p5645p4410p2925p1746p0832o8671
59786E641743o4107n7868n1266m4575l7985l3003l1134l1883l3734l6495m0961
$$ y = [17660220, 17150124, 16616248, 16074919, 15539765, 15021268, 14528497, 14070248, 13653464, 13281330, 12954378, 12673091, 12438172, 12248984, 12103846, 12002006, 11943590, 11927450, 11950806, 12011310, 12107448, 12236099, 12391293, 12566063, 12753782, 12946640, 13134409, 13305953, 13450818, 13558499, 13617975, 13619988, 13559451, 13434972, 13247458, 13000705, 12702237, 12361566, 11987621, 11588760, 11174349, 10754323, 10336915, 9927902, 9532048, 9154137, 8798217, 8466556, 8159626, 7876812, 7617334, 7381076, 7168587, 6979963, 6813778, 6667416, 6538271, 6424390, 6324033, 6234813, 6153339, 6075972, 6000327, 5925917, 5852992, 5781246, 5710414, 5641743, 5577636, 5519768, 5468502, 5423927, 5385942, 5352939, 5321805, 5289922, 5256188, 5219693, 5178732]
59775E178732m6780n2566n7818o2926o7269o9231o8216o5133o0674n4546m6651
59764D526922l7615k7844j7120n459O453J7659K7138L4054L8691M2728M7579N3024
59752D706210N8452O4463P1811P9486Q5564Q9376R1274R0947Q7903Q2945P7227
59741E585658P0296O1170N1011M2372L6001L0788K6783K5659K7700L1030L4796
59730F023264M0912N1388O5506Q0877R6008J11124J27554J47021J70331J96312
59720G110297K23027K50218K79283L10834L43927L77802M12431M46610M76851
59711A0231280M98439N05835M91823M48908L73848K70841J50225K5059r1687j89776
59701A2714795k64035l14088l41638l49098l40536l21402k95707k64662k28872
$$ y = [5178732, 5131952, 5079386, 5021568, 4958642, 4891373, 4822142, 4753926, 4688793, 4628119, 4573573, 4526922, 4489307, 4461463, 4444343, 4438884, 4445337, 4462996, 4490134, 4524188, 4562879, 4605607, 4653186, 4706210, 4764662, 4829125, 4900936, 4980422, 5065986, 5155362, 5246636, 5337583, 5425486, 5508431, 5585658, 5655954, 5717124, 5768135, 5810507, 5846508, 5877296, 5904079, 5929738, 5957438, 5988468, 6023264, 6064176, 6115564, 6181070, 6261947, 6357955, 6469079, 6596633, 6743654, 6913985, 7110297, 7333324, 7583542, 7862825, 8173659, 8517586, 8895388, 9307819, 9754429, 10231280, 10729719, 11235554, 11727377, 12176285, 12550133, 12820974, 12971199, 12996258, 12904571, 12714795, 12450760, 12136672, 11795034, 11445936, 11105400, 10783998, 10488291, 10223629, 9994757]
59692I994757j90529j52383j15781q0771m7166j4654J7192M8196P7683J05743
59682I642287J33379J61042J88415K16059K45556K77143L08948L39797L71358
59673A1883984M05972M43539M82231N21470N62494O06398O53098P02095P52999
59664A7014280Q05159Q57525R08855R57508J001043J036537J061347J073529J072129
59655B5787912J057452J030984R95031R53056R10186Q72284Q43677Q26063Q19508
59646C4096153Q23498Q36395Q54550Q72789Q85802Q89008Q78615Q51255Q03818
59637D1791883P34220O43134N34745M15231K90680J67002N0936n0739j33345j94768
59627D4248979k33841k49562k42125k13474j66182j02513k4716O4657J63090K68326
$$ y = [9994757, 9804228, 9651845, 9536064, 9455293, 9408127, 9393473, 9410665, 9458861, 9536544, 9642287, 9775666, 9936708, 10125123, 10341182, 10586738, 10863881, 11172829, 11512626, 11883984, 12289956, 12733495, 13215726, 13737196, 14299690, 14906088, 15559186, 16261281, 17014280, 17819439, 18676964, 19585819, 20543327, 21544370, 22580907, 23642254, 24715783, 25787912, 26845364, 27876348, 28871379, 29824435, 30734621, 31606905, 32450582, 33276645, 34096153, 34919651, 35756046, 36610596, 37483385, 38369187, 39258195, 40136810, 40988065, 41791883, 42526103, 43169237, 43703982, 44119213, 44409893, 44576895, 44627831, 44577092, 44443747, 44248979, 44015138, 43765576, 43523451, 43309977, 43143795, 43041282, 43016566, 43081223, 43244313, 43512639]
59617D3512639L78306M91655O07938P26295Q43582R54544J053445J134579J191472
59608E0894455J216739J202762J141795J026551Q53012O23579L47151L7114k89469
59599E7053689o12236r10964j170466j381860j540176j643395j694117j699483
59591D6400992j668144j608391j529113j440031j350135j267807j202878j165472
59583C5169021j160342j183020j222406j265980j302492j323023j322901j302755
59575B5086102j266459j218052j160724j097153j029473r59426q89070q20579
59567A6645166p55104o92922o34973n82665n35760m92201m50805m12491l77988
59558A1710257l46170l15814k87484k62281k40094k20342k03267j89247j77907
$$ y = [43512639, 43890945, 44382600, 44990538, 45716833, 46560415, 47514959, 48568404, 49702983, 50894455, 52111194, 53313956, 54455751, 55482302, 56335314, 56958893, 57306044, 57343158, 57053689, 56441453, 55530489, 54360023, 52978163, 51437987, 49794592, 48100475, 46400992, 44732848, 43124457, 41595344, 40155313, 38805178, 37537371, 36334493, 35169021, 34008679, 32825659, 31603253, 30337273, 29034781, 27711758, 26388857, 25086102, 23819643, 22601591, 21440867, 20343714, 19314241, 18354815, 17465745, 16645166, 15890062, 15197140, 14562167, 13979502, 13443742, 12951541, 12500736, 12088245, 11710257, 11364087, 11048273, 10760789, 10498508, 10258414, 10038072, 9834805, 9645558, 9467651]
59549I467651j69029j63280j60895j60727j61680j64007j68015j72523j75860
59540G971635j77405j77185j74795j69922j63185j55521j47312j38653j29448
59531F538209j18951j06532r3395q1798p1830o0935m7864l4998k5052j7233q842
59520E870779P11R872J7898K5472L2607L8197M1770M4097M6056M8170N1204N5832
59508F282665O1616O7423P3019P9476Q7834R8062J09402J21363J34303J49018
59498G264181J65565J82746J99500K16486K35119K55208K75157K94646L15219
59489I403827L37587L60163L81167M00373M17530M30884M38816M41688M40505
59480A3052540M34845M23683M07415L87597L65212L40229L12125K80111K44070
$$ y = [9467651, 9298622, 9135342, 8974447, 8813720, 8652040, 8488033, 8320018, 8147495, 7971635, 7794230, 7617045, 7442250, 7272328, 7109143, 6953622, 6806310, 6667657, 6538209, 6419258, 6312726, 6219331, 6137533, 6065703, 6004768, 5956904, 5921906, 5896854, 5879621, 5870779, 5871490, 5881362, 5899260, 5924732, 5957339, 5995536, 6037306, 6081403, 6127459, 6175629, 6226833, 6282665, 6344281, 6411704, 6484723, 6564199, 6652033, 6750095, 6859497, 6980860, 7115163, 7264181, 7429746, 7612492, 7811992, 8028478, 8263597, 8518805, 8793962, 9088608, 9403827, 9741414, 10101577, 10482744, 10883117, 11300647, 11731531, 12170347, 12612035, 13052540, 13487385, 13911068, 14318483, 14706080, 15071292, 15411521, 15723646, 16003757, 16247827]
59471A6247827K06289J71052J41302J16646R5531P8034O5453N8661N8248O4918
59461A7303961P8206R5981J16332J38400J59969J76148J82432J77458J60830J30260
59451A8719977Q3847K3903m4701j19353j99765k83487l64625m37775n00665n52160
59441A6325196n89983o12034o18699o12718n97244n74419n45232n10372m71399
59432A1193096m30749l90177l49990l10482k72981k38435k05971j74491j44661
59423H675159j17522r1808o4914l6424q598J7004M1606O7367R4761J22428J48645
59412H847704J72577J94748K16477K38405K59646K78774K95098L08155L16513
59403A1128097L17930L10461K92906K64882K27264J81693J28802O7999K16p0274
$$ y = [16247827, 16454116, 16625168, 16766470, 16883116, 16978647, 17056681, 17122134, 17180795, 17239043, 17303961, 17382167, 17478148, 17594480, 17732880, 17892849, 18068997, 18251429, 18428887, 18589717, 18719977, 18803824, 18827727, 18783026, 18663673, 18463908, 18180421, 17815796, 17378021, 16877356, 16325196, 15735213, 15123179, 14504480, 13891762, 13294518, 12720099, 12174867, 11664495, 11193096, 10762347, 10372170, 10022180, 9711698, 9438717, 9200282, 8994311, 8819820, 8675159, 8557637, 8465829, 8400915, 8364491, 8355893, 8372897, 8414503, 8481870, 8576631, 8699059, 8847704, 9020281, 9215029, 9431506, 9669911, 9929557, 10208331, 10503429, 10811584, 11128097, 11446027, 11756488, 12049394, 12314276, 12541540, 12723233, 12852035, 12920034, 12920250, 12849976]
59393A2849976j38260k00990k57649l06607l45503l73754l92923m04354m08168
59384A0021768m04686l95363l81855l65310l46660l26673l05724k84359k63724
59375F947414k44407k25353k05341j85231j67267j52249j38752j25206j11389
59366E392219r7678q4115p0776n8255m7282l8148l0426k3070j5166o859J065Q643
59354D930152J6804K5636L4125M2180N0943N9693O4503O2468N6072N1027N0649
59343E444252N4663O2502P4297Q8581J02370J14783J28102J43721J58936J69727
59333F541934J75866J81689J92052K08624K30033K54515K81526L11062L42542
59324H719843L75506M10985M50680M94487N40242N86463O33783O82726P31432
$$ y = [12849976, 12711716, 12510726, 12253077, 11946470, 11600967, 11227213, 10834290, 10429936, 10021768, 9617082, 9221719, 8839864, 8474554, 8127894, 7801221, 7495497, 7211138, 6947414, 6703007, 6477654, 6272313, 6087082, 5919815, 5767566, 5628814, 5503608, 5392219, 5294541, 5210426, 5139650, 5081395, 5034113, 4995965, 4965539, 4942469, 4927303, 4920444, 4921509, 4930152, 4946956, 4972592, 5006717, 5048897, 5099840, 5159533, 5224036, 5286504, 5342576, 5393603, 5444252, 5498915, 5561417, 5635714, 5724295, 5826665, 5941448, 6069550, 6213271, 6372207, 6541934, 6717800, 6899489, 7091541, 7300165, 7530198, 7784713, 8066239, 8377301, 8719843, 9095349, 9506334, 9957014, 10451501, 10991743, 11578206, 12211989, 12894715, 13626147]
59315A3626147P76746Q16202Q47587Q67893Q74422Q66136Q42843Q04497P52974
59306B1075447O93176O30261N66456N02145M38784L78548L21904K67716K15028
59297B5089465J62754J08408M9515j4021q0771j50092k21356k91686l57171m16025
59287B3879020m68140n12120n45825n70094n89047o06025o21338o34329o45095
59278A8687007o53301o57477o56440o49989o37709o18990n94750n67436n38580
59269A3112335n07862m74967m40788m06194l71175l35990l01880k69910k40014
59260I763555k11566j84270j58356j34583j13551r4250p4103n1861k9724j0902
59250H700389M221J7779L0992M3031N2802N9737O3145O2903O0355N6520N0074
$$ y = [13626147, 14402893, 15219095, 16066682, 16934575, 17808997, 18675133, 19517976, 20322473, 21075447, 21768623, 22398884, 22965340, 23467485, 23906269, 24284817, 24606721, 24874437, 25089465, 25252219, 25360627, 25410142, 25396121, 25315350, 25165258, 24943902, 24652216, 24295045, 23879020, 23410880, 22898760, 22352935, 21782841, 21193794, 20587769, 19966431, 19332102, 18687007, 18033706, 17376229, 16719789, 16069800, 15432091, 14813101, 14218351, 13650915, 13112335, 12604473, 12129506, 11688718, 11282524, 10911349, 10575359, 10273479, 10003569, 9763555, 9551989, 9367719, 9209363, 9074780, 8961229, 8866979, 8792876, 8741015, 8711291, 8700389, 8704610, 8722389, 8753381, 8796412, 8849214, 8908951, 8972096, 9034999, 9095354, 9151874, 9201948]
59239I201948L9479K6364J3934K480j0188k3884l5159m1942m5738m8103m8077
59228I031114m4512l8132k9513j7535j739J5803L2864M9636O7354Q5963J04816
59217I256119J24231J44576J64623J82341J96547K06824K12616K13401K09159
59208A0910437J99919J85321J64890J38136J04699O5716K5012j2613m4454p0227
59198A1666836q9854j02991j10640j14917j16683j15401j11661j07702j04913
59189A0692074j02920j01673j02184j04325j06194j06777j07095j07578j06265
59180I747063j01111r2457q1911p0090n6631m1105k2927j516K2740M8908P7280
59169I428243J09161J44472J81404K18913K57639K97688L37621L76261M13238
$$ y = [9201948, 9241427, 9267791, 9281725, 9284205, 9274017, 9250133, 9214974, 9173032, 9127294, 9079191, 9031114, 8986602, 8948470, 8918957, 8901422, 8899683, 8915486, 8948350, 8997986, 9065340, 9151303, 9256119, 9380350, 9524926, 9689549, 9871890, 10068437, 10275261, 10487877, 10701278, 10910437, 11110356, 11295677, 11460567, 11598703, 11703402, 11769118, 11794130, 11781517, 11737063, 11666836, 11576982, 11473991, 11363351, 11248434, 11131751, 11016350, 10904689, 10796987, 10692074, 10589154, 10487481, 10385297, 10280972, 10174778, 10068001, 9960906, 9853328, 9747063, 9645952, 9553495, 9471584, 9401494, 9344863, 9303758, 9280831, 9279315, 9302055, 9350963, 9428243, 9537404, 9681876, 9863280, 10082193, 10339832, 10637520, 10975141, 11351402, 11764640]
59160A1764640M46818M73469M90623M97525M92196M70272M28827L69111K93809
59151A5727290K04006J01259r361j21144k29432l31046m21368m95160n50233n88011
59141A3286800o10325o17636o10753n92567n67079n37227n04136m68213m30658
59132H348206l93487l58080l24482k92858k64650k40904k20226k00372j81259
59123E871888j64171j48538j32336j15804j01492r0057p9170o7730n7782n0454
59113D864354m3217l3686k3447j5194q112P45J1672K1957K9692L5530M0918M6709
59101D927921N3451O1328O9646P7425Q4338R0514R6124J01768J08269J15291J21139
59090E907214J24569J25812J25310J22855J18541J12950J05677R5353Q1872O6784
$$ y = [11764640, 12211458, 12684927, 13175550, 13673075, 14165271, 14635543, 15064370, 15433481, 15727290, 15931296, 16032555, 16023194, 15902050, 15672618, 15341572, 14920204, 14425044, 13874811, 13286800, 12676475, 12058839, 11448086, 10855519, 10288440, 9751213, 9247077, 8778864, 8348206, 7954719, 7596639, 7272157, 6979299, 6714649, 6473745, 6253519, 6053147, 5871888, 5707717, 5559179, 5426843, 5311039, 5209547, 5119490, 5040320, 4972590, 4914808, 4864354, 4821137, 4787451, 4764004, 4748810, 4740698, 4741443, 4753115, 4775072, 4804764, 4840294, 4881212, 4927921, 4981372, 5042700, 5112346, 5189771, 5274109, 5364623, 5460747, 5562515, 5670784, 5786075, 5907214, 6031783, 6157595, 6282905, 6405760, 6524301, 6637251, 6742928, 6838281, 6920153, 6986937]
59080F986937N0886L3671J6114J118j0468k1574l4237m5505n0703m9219m4275
59069F832745l8316l1262k2572j2279l07J3302K7752M2619N8867P7258R6683J15682
59057G160172J34502J54041J73718J92318K09987K27610K45141K62257K79649
59048I039395K97646L14544L28276L38909L47296L52019L49906L39244L20401
59039A2027636K93507K57566K11924J57155R4654K6928m2077j08481j70349k27112
59029A2521351k77647l20345l54575l80758l99379m11085m17204m18764m15511
59020I126083m07106l94625l79686l62830l44282l25478l08159k92266k76351
59011F035300k59805k43454k28135k13993k00805j88046j75021j61940j50264
$$ y = [6986937, 7037823, 7071494, 7087608, 7088726, 7078258, 7056684, 7022447, 6976942, 6926239, 6877020, 6832745, 6794429, 6763167, 6740595, 6728316, 6728009, 6741311, 6769063, 6811682, 6870549, 6947807, 7044490, 7160172, 7294674, 7448715, 7622433, 7814751, 8024738, 8252348, 8497489, 8759746, 9039395, 9337041, 9651585, 9979861, 10318770, 10666066, 11018085, 11367991, 11707235, 12027636, 12321143, 12578709, 12790633, 12947788, 13042442, 13069370, 13027293, 12918812, 12748463, 12521351, 12243704, 11923359, 11568784, 11188026, 10788647, 10377562, 9960358, 9541594, 9126083, 8718977, 8324352, 7944666, 7581836, 7237554, 6912076, 6603917, 6311651, 6035300, 5775495, 5532041, 5303906, 5089913, 4889108, 4701062, 4526041, 4364101, 4213837]
59002D213837j40976j33173j25369j17396j09840j02584r5218q8224q2428p7755
58992C140874p3731p0349o7375o3652n8630n3826n1150n0189m8547m4735l9520
58981B519170l4715l1475k9491k7152k2959j7261j1943q077n064k517j238j319
58969B325959q99J733N924R880J2910J5198J6461J6427J5734J5135J4446J3124
58957B462032J1041Q055M160P30q8J884M347N653O525P772Q645Q895J0026J2687
58943B552364J4958J5270J4774J4696J3569R786M959J802K34j618l802m884m806
58930B627302m677m436l168j042J276M096P456R697R773R673J1925J5728J8308
58917B701911J9170K0118K1899K3653K5306K7653L0394L2527L4330L6786L9550
$$ y = [4213837, 4072861, 3939688, 3814319, 3696923, 3587083, 3484499, 3389281, 3301057, 3218629, 3140874, 3067143, 2996794, 2929419, 2865767, 2807137, 2753311, 2702161, 2651972, 2603425, 2558690, 2519170, 2484455, 2452980, 2423489, 2396337, 2373378, 2356117, 2344174, 2336097, 2331033, 2328516, 2327278, 2325959, 2325060, 2326793, 2332717, 2342597, 2355507, 2370705, 2387166, 2403593, 2419327, 2434462, 2448908, 2462032, 2473073, 2481128, 2485288, 2486018, 2485930, 2487814, 2492161, 2497814, 2504339, 2512111, 2520756, 2529651, 2539677, 2552364, 2567322, 2582592, 2597366, 2612062, 2625631, 2635417, 2640376, 2642178, 2642412, 2640794, 2636992, 2632108, 2627302, 2622625, 2618189, 2615021, 2613979, 2615255, 2619351, 2626807, 2636504, 2646277, 2655950, 2667875, 2683603, 2701911, 2721081, 2741199, 2763098, 2786751, 2812057, 2839710, 2870104, 2902631, 2936961, 2973747, 3013297]
58906C013297M1744M4082M7757N1909N4582N5711N6869N8693O0898O3918O8043
58895C617503P1759P3560P4679P7368Q1296Q4638Q7969R3814J02496J11582J19509
58884D596173J27028J34932J43049J51608J61214J71421J81594J92859K06769
58875F066647K22358K37270K51507K67373K85777L05496L26173L49084L74653
58866H686338M01804M30172M60566M92981N26564N61855O00589O42838O86616
58857A3490323P30589P75057Q20040Q64532R07727R48927R85891J015337J034888
58848B1573311J042456J033839J003476R47920Q66675P59829O27495M72067K99063
58839B8626131J15461p1157k52381m20397n70294o99536q05763q86975r43450
$$ y = [3013297, 3055041, 3099123, 3146880, 3198789, 3253371, 3309082, 3365951, 3424644, 3485542, 3549460, 3617503, 3689262, 3762822, 3837501, 3914869, 3996165, 4080803, 4168772, 4262586, 4365082, 4476664, 4596173, 4723201, 4858133, 5001182, 5152790, 5314004, 5485425, 5667019, 5859878, 6066647, 6289005, 6526275, 6777782, 7045155, 7330932, 7636428, 7962601, 8311685, 8686338, 9088142, 9518314, 9978880, 10471861, 10998425, 11560280, 12160869, 12803707, 13490323, 14220912, 14995969, 15816009, 16680541, 17588268, 18537195, 19523086, 20538423, 21573311, 22615767, 23649606, 24653082, 25601002, 26467677, 27227506, 27855001, 28327068, 28626131, 28741592, 28670435, 28418054, 27997657, 27427363, 26727827, 25922064, 25035089, 24091639]
58830B4091639r77399r91147r87426r70483r44333r10469q69481q23925p77006
58821A5839970p29412o80647o32678n88947n50085n13979m79813m48777m20824
58812A0794808l94197l68557l45426l25140l06147k87591k69780k52019k32997
58803H012954k13551j96241j81898j69109j56950j45391j33366j19663j05652
58794F591133r3842q3725p2312n8809m5343l3092k1190r625N39J0100K1218L3549
58782F238601M4645N4581O6279Q0540R4860J08078J22132J37940J53410J67249
58772G268315J81203J96901K13724K31184K50217K70727K91076L11378L33939
58763I548664L59183L84578M09303M36554M69159N05926N44208N83354O23856
$$ y = [24091639, 23114240, 22123093, 21135667, 20165184, 19220851, 18310382, 17440901, 16616976, 15839970, 15110558, 14429911, 13797233, 13208286, 12658201, 12144222, 11664409, 11215632, 10794808, 10400611, 10032054, 9686628, 9361488, 9055341, 8767750, 8497970, 8245951, 8012954, 7799403, 7603162, 7421264, 7252155, 7095205, 6949814, 6816448, 6696785, 6591133, 6497291, 6413566, 6341254, 6282445, 6237102, 6204010, 6182820, 6173195, 6173734, 6183834, 6205052, 6238601, 6283246, 6337827, 6404106, 6484646, 6579506, 6687584, 6809716, 6947656, 7101066, 7268315, 7449518, 7646419, 7860143, 8091327, 8341544, 8612271, 8903347, 9214725, 9548664, 9907847, 10292425, 10701728, 11138282, 11607441, 12113367, 12657575, 13240929, 13864785]
58754A3864785O65745P09497P56029Q04107Q50099Q91522R28272R59365R81133
58745B1410554R89688R82204R54698R02013Q21655P15034N84063M30058K57427
58736B8047394P4842j09250k89270m59325o11337p39117q41593r19985r74581
58727B3177778j006408j019017j016042r99069r69851r32144q89428q43079p94412
58718A4708328p46035o99529o54356o10686n70625n35133n02538m71940m44962
58709I472524m22173m00714l77914l54810l33851l15371k98364k82368k66720
58700F420239k50145k32956k17477k04681j92647j79703j66594j54229j42167
58691D679640j30723j21604j14678j07098r7463q7891q0361p4013o7895o3118
$$ y = [13864785, 14530530, 15240027, 15996056, 16800163, 17650262, 18541784, 19470056, 20429421, 21410554, 22400242, 23382446, 24337144, 25239157, 26060812, 26775846, 27359909, 27789967, 28047394, 28122236, 28012986, 27723716, 27264391, 26653054, 25913937, 25072344, 24152359, 23177778, 22171370, 21152353, 20136311, 19137242, 18167391, 17235247, 16345819, 15502740, 14708328, 13962293, 13262764, 12608408, 11997722, 11427097, 10891964, 10389426, 9917486, 9472524, 9050351, 8649637, 8271723, 7916913, 7583062, 7267691, 6969327, 6686959, 6420239, 6170094, 5937138, 5719661, 5514980, 5322333, 5142630, 4976036, 4821807, 4679640, 4548917, 4427313, 4312635, 4205537, 4108074, 4020183, 3939822, 3865809, 3797914, 3734796]
58681C734796o0128n6962n2446m8336m6201m5047m3904m3754m4745m4630m2187
58670C206456l9470l8563l8907l9505m0655m1850m1396l9947m0753m4501m7715
58659B753194m8282m8322m9437m9739m8381m8225n0661n2328n0798m8950m9540
58648B208531m9885m6795m2647m1226m1004l8214l3841l1755l1929l1025k8411
58637A791799k6517k6096k5602k4541k3641k2566k0724j9151j8570j7357j4378
58626A552656j1719j1210j0803q019m525l199k980j133J455J827K51o47p09j796
58612A499449l578l986l159k959l356k790j395n56k12M38R25J065K524N652P041
58597A495103M067l64j713l58K10j96J190M548P297Q869J1133J4386J7009J8883
$$ y = [3734796, 3674668, 3617706, 3565260, 3516924, 3470723, 3425676, 3381772, 3338018, 3293273, 3248643, 3206456, 3166986, 3128423, 3089516, 3050011, 3009356, 2967506, 2926110, 2886163, 2845410, 2800909, 2753194, 2704912, 2656590, 2607153, 2557414, 2509033, 2460808, 2410147, 2357819, 2307021, 2258071, 2208531, 2158646, 2111851, 2069204, 2027978, 1986974, 1948760, 1914919, 1883164, 1851235, 1820210, 1791799, 1765282, 1739186, 1713584, 1689043, 1665402, 1642836, 1622112, 1602961, 1584391, 1567034, 1552656, 1540937, 1529727, 1518924, 1510905, 1506380, 1503181, 1500201, 1499068, 1500523, 1502350, 1502601, 1501954, 1501245, 1499449, 1495871, 1491885, 1488726, 1485767, 1482411, 1479621, 1478226, 1477670, 1477458, 1477896, 1478821, 1479886, 1482410, 1488062, 1495103, 1499170, 1498806, 1497093, 1496735, 1496945, 1496749, 1497939, 1502487, 1509784, 1518653, 1529786, 1544172, 1561181, 1580064]
58583A580064K1401K4476K6994K9544L3476L8013M1548M4685M8775N2784N5111
58572A996871N7126O1205O6624P1219P5652Q2146R0295R8089J05942J15706J26956
58561B947831J38212J50408J65004J80216J93502K06330K21873K39207K54765
58552D697348K68297K82225K95624L04064L05208K99702K86573K62787K27758
58543G229586J83987J32962P4741J1948m9911j06603j56256j96736k26012k45296
58533F652410k57932k65017k65435k59812k50729k39384k25667k11085j97773
58524D479576j85232j71738j58193j46496j35172j21301j06178r4162q6101p8658
58514C196345p0221o2676n7011n1792m6777m3728m2852m2112m0688l9591l8724
$$ y = [1580064, 1601465, 1625941, 1652935, 1682479, 1715955, 1753968, 1795516, 1840201, 1888976, 1941760, 1996871, 2053997, 2115202, 2181826, 2253045, 2328697, 2410843, 2501138, 2599227, 2705169, 2820875, 2947831, 3086043, 3236451, 3401455, 3581671, 3775173, 3981503, 4203376, 4442583, 4697348, 4965645, 5247870, 5543494, 5847558, 6152766, 6452468, 6739041, 7001828, 7229586, 7413573, 7546535, 7621276, 7633224, 7583313, 7476710, 7320454, 7123718, 6897706, 6652410, 6394478, 6129461, 5864026, 5604214, 5353485, 5114101, 4888434, 4677349, 4479576, 4294344, 4122606, 3964413, 3817917, 3682745, 3561444, 3455266, 3361104, 3275003, 3196345, 3126124, 3063448, 3006437, 2954645, 2907868, 2864140, 2821288, 2779176, 2738488, 2698897, 2660173]
58503B660173l6894l4854l4767l6627l8532m0169m2533m4935m6046m7014m9415
58492B208387n1046m8381m2611l8487l7499l6880l5112l3468l2122k9615k6463
58481A796703k4667k3456k0090j5036j1741j1122j0824j0002j0018j0496r591
58470A639660q448j0294j4697j7724j8265j9200k1705k3523k3692k4023k4879
58459A433210k4309k2301k1261k1421k0421j8139j7057j7156j5575j2313j1026
58448A232231j2727j3659j1228p463m944l475k420k255k334q94J516K292J191
58435A175831P72J902K874L270M551O405O817O027O149O794N686L508L132M146
58421A237864L496J502J529L389L258Q49M31L439O120O133N575N788M752J710
$$ y = [2660173, 2623279, 2588425, 2553658, 2517031, 2478499, 2438330, 2395797, 2350862, 2304816, 2257802, 2208387, 2157341, 2108960, 2066349, 2027862, 1990363, 1953483, 1918371, 1884903, 1852781, 1823166, 1796703, 1772036, 1748580, 1728490, 1713454, 1701713, 1690591, 1679767, 1669765, 1659747, 1649251, 1639660, 1631212, 1620918, 1606221, 1588497, 1570232, 1551032, 1529327, 1505804, 1482112, 1458089, 1433210, 1408901, 1386600, 1365339, 1343918, 1323497, 1305358, 1288301, 1271145, 1255570, 1243257, 1232231, 1219504, 1205845, 1194617, 1187154, 1182210, 1178735, 1176315, 1174060, 1171726, 1170832, 1172348, 1174640, 1175831, 1176603, 1178505, 1181379, 1184649, 1189200, 1195605, 1202422, 1208449, 1214598, 1221392, 1227078, 1230586, 1233718, 1237864, 1241360, 1242862, 1244391, 1247780, 1251038, 1251887, 1252318, 1255757, 1261877, 1268010, 1273585, 1279373, 1284125, 1285835]
58407A285835q99j992l469n871p319p887r856j2647j2983j1033j0589j2104j1816
58394A177370r012p673r081r385o708m289m103l563j296j49j639l097k927l066
58380A111382l813k135K253N045M358L753N558P142O760O972Q914R180N942K665
58366A173976K108K113P02M6J767L487L558M196O688Q482Q287Q913J1866J4168
58352A250357J3775J3103J4085J4837J4173J4182J5343J4483J0583P160N982M130
58340A392193K68k244j971k882p308j1259j0951q598p627p351o393o341p988q576
58326A302972o462m055l153k088l8J011R27K408N165N329K881K808O364Q569P323
58311A329961P164J0372J2333J0183Q224R913J1917J1263J1041J3676J5559J3846
$$ y = [1285835, 1284936, 1282944, 1279475, 1273604, 1266285, 1258398, 1248542, 1235895, 1222912, 1211879, 1201290, 1189186, 1177370, 1168358, 1160685, 1151604, 1142219, 1135511, 1131222, 1127119, 1123556, 1122260, 1122111, 1120472, 1117375, 1114448, 1111382, 1107569, 1105434, 1107687, 1112732, 1117090, 1120843, 1126401, 1133543, 1140303, 1147275, 1156189, 1165369, 1171311, 1173976, 1176084, 1178197, 1178899, 1178945, 1180712, 1184199, 1187757, 1191953, 1198641, 1207123, 1215410, 1224323, 1236189, 1250357, 1264132, 1277235, 1291320, 1306157, 1320330, 1334512, 1349855, 1364338, 1374921, 1382081, 1388063, 1392193, 1392461, 1390217, 1388246, 1385364, 1378056, 1366797, 1355846, 1347248, 1339621, 1332270, 1325877, 1319536, 1311548, 1302972, 1296510, 1292455, 1289302, 1287214, 1287176, 1288187, 1289114, 1291522, 1296687, 1302016, 1304897, 1307705, 1314069, 1322638, 1329961, 1337125, 1347497, 1359830, 1370013, 1378237, 1388150, 1400067, 1411330, 1422371, 1436047, 1451606, 1465452]
58299A465452J1936J2818J3650J2083J1300J3388J4522J2146J0238J1985J3937
58288A603455J2885J1729J2959J3192R910O879P128P274M538K508M193O181N402
58275A708233M844P052R020Q999J0826J5925J8924J7077J5813J8889K1567K0083
58263A877252J9025K2180K4912K3320K2272K6207L0378K9507K7084K7808K8961
58252B158906K7531K7483L1465L3687K9899K5982K7661L0256K7919K4509K5505
58241B470803K7499K5863K4626K8575L3377L3713L3372L7320M1646M1404M0320
58230B838518M2820M4869M2882M2615M8790N4945N4659N3483N8331O4527O5232
58219C411671O4451O8536P3991P5904P8956Q7629R5270R5630R5206J01010J06759
$$ y = [1465452, 1477388, 1490206, 1503856, 1515939, 1527239, 1540627, 1555149, 1567295, 1577533, 1589518, 1603455, 1616340, 1628069, 1641028, 1654220, 1664130, 1671009, 1678137, 1685411, 1689949, 1692457, 1696650, 1702831, 1708233, 1713077, 1720129, 1729149, 1738148, 1748974, 1764899, 1783823, 1800900, 1816713, 1835602, 1857169, 1877252, 1896277, 1918457, 1943369, 1966689, 1988961, 2015168, 2045546, 2075053, 2102137, 2129945, 2158906, 2186437, 2213920, 2245385, 2279072, 2308971, 2334953, 2362614, 2392870, 2420789, 2445298, 2470803, 2498302, 2524165, 2548791, 2577366, 2610743, 2644456, 2677828, 2715148, 2756794, 2798198, 2838518, 2881338, 2926207, 2969089, 3011704, 3060494, 3115439, 3170098, 3223581, 3281912, 3346439, 3411671, 3476122, 3544658, 3618649, 3694553, 3773509, 3861138, 3956408, 4052038, 4147244, 4248254, 4355013]
58208D355013J04941J01839J05917J12042J12333J11991J18746J27269J30042
58199E380133J32792J42867J53677J57843J64056J82620K05738K21049K33168
58190F973943K52036K71653K81351K87354L01685L20133L32660L44905L67271
58181I732991L93367M11726M28136M53798M83035N06006N31026N69502O11646
58172A4121233O43091O72298P14430P62283Q02252Q44742R07352R81646J048783
58163B1498110J113890J191302J270995J336602J402249J493077J603445J714252
58155C2623922J836000J991631K172424K357463K561605K814862L109218L417411
58147E2884536L748117M127567M545509M981897N469380O061836O759192P536894
$$ y = [4355013, 4459954, 4561793, 4667710, 4779752, 4892085, 5004076, 5122822, 5250091, 5380133, 5512925, 5655792, 5809469, 5967312, 6131368, 6313988, 6519726, 6740775, 6973943, 7225979, 7497632, 7778983, 8066337, 8368022, 8688155, 9020815, 9365720, 9732991, 10126358, 10538084, 10966220, 11420018, 11903053, 12409059, 12940085, 13509587, 14121233, 14764324, 15436622, 16151052, 16913335, 17715587, 18560329, 19467681, 20449327, 21498110, 22612000, 23803302, 25074297, 26410899, 27813148, 29306225, 30909670, 32623922, 34459922, 36451553, 38623977, 40981440, 43543045, 46357907, 49467125, 52884536, 56632653, 60760220, 65305729, 70287626, 75757006, 81818842, 88578034, 96114928]
58139I6114928Q429056R497416J0734743J2089109J3564331J5201536J7002998
58132A82634117J9010732K1428430K4496812K8258300L2585860L7256857M1474027
58125C87145135M3185719L9585899K9183023J3592817l076278j6860475k6044783
58118D66711057l1090829l3249145l3561128l2721040l1193650k9229159k6932450
58111B48733656k4418576k1846690j9324945j6893537j4610042j2562650j0787875
58104A28289341r249404p910898o767850n798717m947140m174938l485608k871705
58096H3083081k277246j641598r54674k35842N21216J316303K008998K254120
58088H4074358J685099K56404j607909l279344m365755m881966n044634n012941
$$ y = [96114928, 104543984, 114041400, 124776143, 136865252, 150429583, 165631119, 182634117, 201644849, 223073279, 247570091, 275828391, 308414251, 345671108, 387145135, 430330854, 469916753, 499099776, 512692593, 509616315, 492755840, 466711057, 435620228, 402371083, 368809955, 336088915, 304895265, 275666106, 248733656, 224315080, 202468390, 183143445, 166249908, 151639866, 139077216, 128289341, 119039937, 111129039, 104361189, 98562472, 93615332, 89440394, 85954786, 83083081, 80805835, 79164237, 78209563, 77973721, 78494937, 79811240, 81820238, 84074358, 85759457, 86015861, 84407952, 81128608, 76762853, 71880887, 66836253, 61823312]
58080F1823312m847325m595642m308101l995168l645752l279444k933921k616193
58072C1601766k311765k029163j792606j600752j432513j285733j173281j088055
58064A8887898j007585r28730q65495q16965p68200p18683o80215o49813o12736
58055A1839476n69617n34013n05924m73472m37954m11938l94828l74836l53067
58046G783827l41404l38095l29204l13289l01727k95240k82770k63669k48930
58037E069499k39686k25635k05914j91098j82963j71954j56336j44979j39391
58028C411543j31274j19698j12893j11135j05318r4544q8056q7566q4330p6275
58018B400454p1546p2204p0317o3430n8794n8892n7171n1472m7842m7931m5930
$$ y = [61823312, 56975987, 52380345, 48072244, 44077076, 40431324, 37151880, 34217959, 31601766, 29290001, 27260838, 25468232, 23867480, 22434967, 21149234, 19975953, 18887898, 17880313, 16951583, 16086088, 15269123, 14500923, 13782240, 13102025, 12452212, 11839476, 11269859, 10735846, 10229922, 9756450, 9318496, 8906558, 8511730, 8136894, 7783827, 7442423, 7104328, 6775124, 6461835, 6160108, 5864868, 5582098, 5318429, 5069499, 4829813, 4604178, 4398264, 4207166, 4024203, 3852249, 3695913, 3550934, 3411543, 3280269, 3160571, 3047678, 2936543, 2831225, 2736681, 2648625, 2561059, 2476729, 2400454, 2328908, 2256704, 2186387, 2122957, 2064163, 2005271, 1948100, 1896628, 1848786, 1800855, 1754925]
58007A754925m0929l9114m1043l9723l3905l0538l1326k9718k3926k0279k0717
57996A403707j9524j5483j4892j9068k1005j8076j6317j8382j8732j4784j1768
57985A215676j2259j1540p624n693q191j0029p964n785o286o697n683o209q197
57972A113519o838j600J440o45l608m522n839q207p712l579o20r36q69J150J658
57957A072792k40l98K385L729J850O07J566R06k796n517n519o516r983j1831j0051
57942A030984q389r208r747q509q346r973r580o128m100n737p287o180n147n933
57928I26720n614k612J3M63J177K906K374j004k650m34J673Q54p2J060J496n63
57912I25787j994o62M79r57k565k384k762n030n756k525J394K107L82j576m042
$$ y = [1754925, 1713996, 1674882, 1633839, 1594116, 1560211, 1529673, 1498347, 1468629, 1444703, 1424424, 1403707, 1384183, 1368700, 1353808, 1334740, 1313735, 1295659, 1279342, 1260960, 1242228, 1227444, 1215676, 1203417, 1191877, 1184253, 1178560, 1170369, 1160340, 1152376, 1146591, 1140305, 1133608, 1127925, 1121716, 1113519, 1106681, 1105081, 1106521, 1105876, 1102268, 1097746, 1091907, 1083700, 1075988, 1072409, 1071789, 1070853, 1069984, 1071134, 1072792, 1072552, 1072154, 1074539, 1078268, 1080118, 1080725, 1082291, 1083197, 1080401, 1074884, 1069365, 1062849, 1052866, 1041035, 1030984, 1022595, 1013387, 1003640, 995131, 986785, 976812, 967232, 961104, 957004, 951267, 943980, 937800, 932653, 926720, 921106, 918494, 918507, 918970, 920147, 923053, 925427, 924423, 921773, 921339, 923012, 923866, 923794, 924854, 926350, 925787, 923793, 923131, 923610, 922653, 920088, 917704, 914942, 909912, 904156, 901631, 903025, 905132, 905514, 903938, 899896]
57897H99896o993q029o526n678p342q999q576p801q097p774o034n118n865n732
57883H01332l707k357k610j749R12J818m66k256j238m14k086l432k137j264m185
57868G76161r100j2614j4587j5762j4935j2176j0714j1810j2055r165o143n847
57856F41253n888l162N34J814J157J010J639K522M668Q034R882R006Q257R762
57842F90488J1241J0326Q816R112R942R263Q055P786P323N659M382M316L133m11
57828G89431l532l988l889n539p214o835o157p392r027q893q234q864r487q542
57814F91838p492p511o351k477J159J702J513M088P898Q990P316N728M882L661
57800G14944K756L521M803M867M724N958P135O080L754K249R03j812m520m938
$$ y = [899896, 892903, 884874, 878348, 872670, 865328, 856329, 847753, 839952, 831855, 824081, 818047, 812929, 807064, 801332, 797625, 795268, 792658, 790909, 791821, 793639, 793173, 790917, 789679, 789265, 787179, 783747, 781610, 780346, 776161, 767061, 754447, 739860, 724098, 709163, 696987, 686273, 674463, 662408, 653243, 647100, 641253, 635365, 632203, 632737, 634551, 635708, 636718, 638357, 640879, 645547, 653581, 663463, 672469, 680726, 690488, 701729, 712055, 720871, 729983, 739925, 749188, 757243, 765029, 772352, 778011, 782393, 786709, 789842, 789431, 785899, 781911, 778022, 772483, 765269, 758434, 752277, 744885, 735858, 726965, 718731, 709867, 700380, 691838, 684346, 676835, 670484, 668007, 669166, 670868, 672381, 676469, 684367, 693357, 700673, 706401, 711283, 714944, 717700, 721221, 726024, 730891, 735615, 741573, 748708, 754788, 758542, 760791, 761694, 759882, 755362, 750424]
57786G50424l998m146n119n026m077l860m272m445n031o528p230o012n112o737
57772F78831r010q774o537m944m316l432l091m870p742r499j0320j1588j2737
57759E81971j2573j2158j2902j3457j1989r827r329r767r047p780p650p424m936
57746D53132j754j385l569m654l235j261J17J837L939N040N121N780P405Q828
57732D75341R603J0122R774P740N217M191M349L735K015O30K31L92J197K720L565
57717E40822K344o5j867l166n138p469q916r400r338q209n948m309m418m683l573
57702D66667k492l082l853k787j160r45m95K794P081Q143N963M533N444O374O051
57687D98236O179P695R134R609R925R978Q429N751M419N176O064N893N788O479
$$ y = [750424, 746426, 742280, 737161, 732135, 728058, 724198, 719926, 715481, 710450, 703922, 696692, 690680, 685568, 678831, 669821, 661047, 654510, 649566, 645250, 641818, 638727, 633857, 626115, 616616, 606296, 594708, 581971, 569398, 557240, 544338, 530881, 518892, 509065, 499736, 489969, 480922, 473142, 465492, 458068, 453132, 451378, 449993, 446424, 441770, 438535, 437274, 437391, 439228, 443167, 448207, 453328, 459108, 466513, 475341, 484944, 495066, 504840, 512580, 517797, 521988, 526337, 530072, 532087, 532717, 532948, 533340, 534537, 537257, 540822, 543166, 543101, 541234, 538068, 532930, 525461, 516545, 507145, 497807, 489598, 483650, 479341, 474923, 470240, 466667, 464175, 461093, 457240, 454453, 453293, 452348, 451853, 454647, 461728, 469871, 475834, 480367, 485811, 492185, 498236, 504415, 512110, 521244, 530853, 540778, 550756, 559185, 564936, 569355, 574531, 580595, 586488, 592276, 598755]
57673E98755O903O516O509P613Q824R274R566J0542J2141J3922J5490J6392J6812
57660G39259J7838J9783K1323K1872K3142K6108K8272K7163K4932K5595K8738
57649A004025L0333K9567L0127L3958L8168L9884M0473M2861M7457N2855N8380
57638A448088O3933O8836P2646P6190Q0649Q6308R2787R9679J06768J14461J23845
57627B434190J35389J48131J61255J75545J91649K08077K23027K37295K52798
57618D167356K68738K81857K90067K93078K89666K77349K55207K24603J86936
57609F534857J43283R6810N2688J4161k0281n5440r5962j43290j93531k38335
57599F094960k70097k86748k90675k84406k69875k50570k30717k11933j93232
$$ y = [598755, 605658, 612174, 618683, 626296, 635120, 644394, 653960, 664502, 676643, 690565, 706055, 722447, 739259, 757097, 776880, 798203, 820075, 843217, 869325, 897597, 924760, 949692, 975287, 1004025, 1034358, 1063925, 1094052, 1128010, 1166178, 1206062, 1246535, 1289396, 1336853, 1389708, 1448088, 1512021, 1580857, 1653503, 1729693, 1810342, 1896650, 1989437, 2089116, 2195884, 2310345, 2434190, 2569579, 2717710, 2878965, 3054510, 3246159, 3454236, 3677263, 3914558, 4167356, 4436094, 4717951, 5008018, 5301096, 5590762, 5868111, 6123318, 6347921, 6534857, 6678140, 6774950, 6827638, 6841799, 6821518, 6766078, 6670116, 6526826, 6333295, 6094960, 5824863, 5538115, 5247440, 4963034, 4693159, 4442589, 4211872, 3999939, 3806707]
57590C806707j74337j56244j38748j20558j02295q6433p3753o2578n1970m2828
57580B796963l5166k7219j8218r459j569O873J6812K7095L6491M5425N4639O3956
57568B956623P3394Q3861R5782J08320J20612J32563J44306J56157J69052J83184
57558D223854J96411K05864K10918K12520K09758J99688J80571J52801J16523
57549E908908P1344J9349l4078q3656j26802j62570j90390k10675k24666k32754
57539D734010k34576k31050k24557k16638k07206j96230j84396j72043j59360
57530B907954j47514j37564j28477j18466j08014r9110r1786q4305p6559p0243
57520A845916o5468o0497n5096n0915m7968m4115l8919l4645l2492l0876k8649
$$ y = [3806707, 3632370, 3476126, 3337378, 3216820, 3114525, 3028092, 2954339, 2891761, 2839791, 2796963, 2761797, 2734578, 2716360, 2706901, 2705332, 2712205, 2729017, 2756112, 2792603, 2838028, 2892667, 2956623, 3030017, 3113878, 3209660, 3317980, 3438592, 3571155, 3715461, 3871618, 4040670, 4223854, 4420265, 4626129, 4837047, 5049567, 5259325, 5459013, 5639584, 5792385, 5908908, 5980252, 5999601, 5965523, 5881867, 5755065, 5592495, 5402105, 5191430, 4966764, 4734010, 4499434, 4268384, 4043827, 3827189, 3619983, 3423753, 3239357, 3067314, 2907954, 2760440, 2622876, 2494399, 2375933, 2267919, 2168809, 2077023, 1992718, 1916159, 1845916, 1780448, 1719951, 1664855, 1613940, 1565972, 1521857, 1482938, 1448293, 1415801, 1384925, 1356276]
57509A356276k6794k5828k4492k2260k0202j8230j4834j0736r151j0559j0824
57498A162366o851r14L170N318P741J0798J3296J5114J6818J8126J9039K0996
57486A285017K4827K8953L1552L3113L5196L8188M1933M6791N2441N7333O1101
57475A736445O5636P2103P8876Q4280Q9470R6395J04707J12769J20220J27503
57465B688404J34345J40657J47302J54070J58385J57853J52499J42597J26356
57456D002468J02187P1702L8103L052l2464o5768r3876j16387j34567j48306j56315
57445C469829j58700j57119j52739j45950j37488j28124j17744j06267r4783q4456
57435B186459p5178o6578n9129n2842m6315l8839l2063k7536k3925j8806j2174
$$ y = [1356276, 1329482, 1303654, 1279162, 1256902, 1236700, 1218470, 1203636, 1192900, 1183749, 1173190, 1162366, 1155515, 1154601, 1157771, 1163089, 1170830, 1181628, 1194924, 1210038, 1226856, 1244982, 1264021, 1285017, 1309844, 1338797, 1370349, 1403462, 1438658, 1476846, 1518779, 1565570, 1618011, 1675344, 1736445, 1802081, 1874184, 1953060, 2037340, 2126810, 2223205, 2327912, 2440681, 2560901, 2688404, 2822749, 2963406, 3110708, 3264778, 3423163, 3581016, 3733515, 3876112, 4002468, 4104655, 4176357, 4214460, 4217512, 4185048, 4119280, 4025404, 3909017, 3774450, 3626144, 3469829, 3311129, 3154010, 3001271, 2855321, 2717833, 2589709, 2471965, 2365698, 2270915, 2186459, 2111281, 2044703, 1985574, 1932732, 1886417, 1847578, 1815515, 1787979, 1764054, 1745248, 1733074]
57424A733074n917o25M825J1063J7486K3381K8289L1887L4866L8951M4724N0694
57412B012698N5972O2220P0905Q0340Q8018R4641J02934J13173J22812J30338
57402B934051J36666J42349J45737J44652J38254J26555J09211Q5389N4658J8247
57392D035769k0395n7236r0341j19779j44683j62421j71800j74958j74583j71130
57382B748443j64458j56121j47839j39446j30495j22134j15113j07831r8969r0237
57372A475800q3703p8096p1001o3147n7119n3076m9296m5877m4156m3175m0654
57361H46500l7055l4853l3959l1941k8840k7506k8409k8198k4803k0314j7303
57350E33319j5595j4343j4249j5610j6657j5852j4042j2752j2179j2103j2822
$$ y = [1733074, 1727157, 1726532, 1731357, 1742420, 1759906, 1783287, 1811576, 1843463, 1878329, 1917280, 1962004, 2012698, 2068670, 2130890, 2201795, 2282135, 2370153, 2464794, 2567728, 2680901, 2803713, 2934051, 3070717, 3213066, 3358803, 3503455, 3641709, 3768264, 3877475, 3962864, 4017522, 4035769, 4015374, 3958138, 3867797, 3748018, 3603335, 3440914, 3269114, 3094156, 2919573, 2748443, 2583985, 2427864, 2280025, 2140579, 2010084, 1887950, 1772837, 1665006, 1566037, 1475800, 1392097, 1314001, 1243000, 1179853, 1122734, 1069658, 1020362, 974485, 930329, 887154, 846500, 809445, 774592, 740633, 708692, 679852, 652346, 623937, 595739, 570936, 550622, 533319, 517724, 503381, 489132, 473522, 456865, 441013, 426971, 414219, 402040, 389937, 377115]
57339C77115j3825j3447j1243q984q052p568o425n205m651m007k552j271j338
57326B88547k225k738k830k912k578j501n61n85r43p44m86r71j491q58K59j18
57310B67265k344m390m363k628q02L42J247K274L059L194K857K259J192j19l18
57295B68725J561M053M533K793J432J917K502J512M12J283L108L569L117M029
57281C04546O073O694N493M914N889O194M369K379K699N026P451R112J0150J0703
57267C91692J1172J2144J3045J2459J0640R959J1763J4603J6624J7901J9007J9340
57255E60349J8690J8832K1369K5056K7343K7837K8376L0087L2207L3660L4310
57244H58116L4685L5458L7221L9821M1953M2213M0528L8160L6489L6085L6497
$$ y = [377115, 363290, 349843, 338600, 329616, 321564, 313996, 307571, 302366, 297715, 293708, 291156, 289885, 288547, 286322, 283584, 280754, 277842, 275264, 273763, 273202, 272617, 271674, 270930, 270444, 269473, 267982, 267124, 267383, 267265, 264921, 260531, 256168, 253540, 252738, 253080, 254327, 256601, 259660, 262854, 265711, 267970, 269162, 269043, 268725, 270286, 274339, 278872, 281665, 283097, 285014, 287516, 289028, 289440, 290723, 293831, 297400, 300517, 304546, 310619, 317313, 322806, 327720, 333609, 339803, 344172, 346551, 349250, 354276, 361727, 370839, 380989, 391692, 402864, 415008, 428053, 440512, 451152, 461111, 472874, 487477, 504101, 522002, 541009, 560349, 579039, 597871, 619240, 644296, 671639, 699476, 727852, 757939, 790146, 823806, 858116, 892801, 928259, 965480, 1005301, 1047254, 1089467, 1129995, 1168155, 1204644, 1240729, 1277226]
57233A277226L6620L5749L4591L4734L6916M0405M4190M7975N1780N5551N9532
57222A755269O4103O8926P3082P6372P9613Q3260Q6606Q8576Q8574Q6369Q2104
57211B632854P6444O9696O0932M9280L6072K4122J4600O196k268j0006j5539j8180
57199B924203j7719j4181q680l066J833O454J0661J3319J4196J4504J4878J4554
57187B970956J3164J1580J0281Q836P818R114J3214J8237K2944K8672L6897M6743
57175C198456N6540O5993P5131Q2834Q8172R1824R4585R5914R5351R3647R1087
57164D129534Q6530P9808P3118O8059O3246N7079N1030M7666M6994M7287M8153
57153D798504N0295N3626N8005O4414P2798Q0269Q4335Q6418Q9201R1987R2253
$$ y = [1277226, 1313846, 1349595, 1384186, 1418920, 1455836, 1496241, 1540431, 1588406, 1640186, 1695737, 1755269, 1819372, 1888298, 1961380, 2037752, 2117365, 2200625, 2287231, 2375807, 2464381, 2550750, 2632854, 2709298, 2778994, 2839926, 2889206, 2925278, 2949400, 2964000, 2970196, 2967928, 2957922, 2942383, 2924203, 2906484, 2892303, 2883623, 2880557, 2882390, 2888844, 2899505, 2912824, 2927020, 2941524, 2956402, 2970956, 2984120, 2995700, 3005981, 3014817, 3022635, 3031749, 3044963, 3063200, 3086144, 3114816, 3151713, 3198456, 3254996, 3320989, 3396120, 3478954, 3567126, 3658950, 3753535, 3849449, 3944800, 4038447, 4129534, 4216064, 4295872, 4368990, 4437049, 4500295, 4557374, 4608404, 4656070, 4703064, 4750351, 4798504, 4848799, 4902425, 4960430, 5024844, 5097642, 5177911, 5262246, 5348664, 5437865, 5529852, 5622105]
57142E622105R0458Q9189Q8342Q5486Q0975P8259P8397P8358P5961P2760P0558
57131F510848O8492O5627O3536O3904O5599O6333O5881O5941O7783P1348P5757
57120G251049P9738Q2228Q3055Q2199P8702P1803O3053N5256M9045M2534L4574
57109G973236K6276J8790J1970N997K070L82p06k375m056n175o357p988r585j1584
57095G990895j5718k2361k9107l3259l4106l1865k6465j8818j1647p440o748r469
57083G743892j6109k6518l8834n0974o1972p1220p8246q4470r3265j06841j24392
57072F991051j44226j65797j88578k11219k33742k58618k87679l19529l51908
57063D829755l85455m23349m68452n22273n85415o57516p37817B22608g03835
$$ y = [5622105, 5712563, 5801752, 5890094, 5975580, 6056555, 6134814, 6213211, 6291569, 6367530, 6440290, 6510848, 6579340, 6644967, 6708503, 6772407, 6838006, 6904339, 6970220, 7036161, 7103944, 7175292, 7251049, 7330787, 7413015, 7496070, 7578269, 7656971, 7728774, 7791827, 7847083, 7896128, 7938662, 7973236, 7999512, 8018302, 8030272, 8036269, 8038339, 8038721, 8038015, 8035640, 8031584, 8026409, 8020052, 8012064, 8002479, 7990895, 7975177, 7952816, 7923709, 7890450, 7856344, 7824479, 7798014, 7779196, 7767549, 7760109, 7753361, 7743892, 7727783, 7701265, 7662431, 7611457, 7549485, 7478265, 7400019, 7315549, 7222284, 7115443, 6991051, 6846825, 6681028, 6492450, 6281231, 6047489, 5788871, 5501192, 5181663, 4829755, 4444300, 4020951, 3552499, 3030226, 2444811, 1787295, 1049478, 222608, -703835]
57053a741002j158288j290874j438943j606509j795985k010532k255151k534400
57045a5831684k852198l214997l630775m102673m627533n203149n833545o526906
57037e1823460p295169q156518r125548j0190644j1308132j2431140j3543983
57030a23874594j4662398j5801004j6932937j7948671j8626152j8668999j7854314
57023b44369069j6212622j4076134j1919354j0098755q672432p396354n877542
57016c18622262l801276j112737J968837N122255Q136647J0975987J3665060J6145042
57008b67522447J8243794J9759263K0558397K0624710K0052592J9007346J7669683
57001a31606662J6190656J4676955J3198571J1797516J0492502R287876Q185124
$$ y = [-1741002, -2899290, -4190164, -5629107, -7235616, -9031601, -11042133, -13297284, -15831684, -18683882, -21898879, -25529654, -29632327, -34259860, -39463009, -45296554, -51823460, -59118629, -67275147, -76400695, -86591339, -97899471, -110330611, -123874594, -138536992, -154337996, -171270933, -189219604, -207845756, -226514755, -244369069, -260581691, -274657825, -286577179, -296675934, -305348366, -312744720, -318622262, -322423538, -323536275, -321567438, -316445183, -308308536, -297332549, -283667489, -267522447, -249278653, -229519390, -208960993, -188336283, -168283691, -149276345, -131606662, -115416006, -100739051, -87540480, -75742964, -65250462, -55962586, -47777462]
56994d7777462P186666O292137N497116M796195M184116L653893L196866K804648
56986a0165825K468817K179550J927445J706424c70669I72369J192802J059868
56978C225039R42464Q37198P40751O53064N76250N10630M54192M05344L63466
56969H708398L26913K93250K61594K32423K04669J75328J42520J07369P2578M0791
56959A0565833J4320n610k0135l2019m3197n3819o3451p1898p9006q5082r1548
56948A0034388j00079j11068j23839j37698j51748j64516j75394j85721j96744
56939H687581k07383k15716k21659k26031k28541k30408k38416k61694l02488
56930F555245l52393l98856m33193m51950m54544m42842m21344l94745l65421
$$ y = [-47777462, -40590796, -34298659, -28801543, -24005348, -19821232, -16167339, -12970473, -10165825, -7697008, -5517458, -3590013, -1883589, -370669, 972369, 2165171, 3225039, 4167503, 5004701, 5745452, 6398516, 6974766, 7485396, 7939588, 8344932, 8708398, 9035311, 9328561, 9590155, 9822578, 10027247, 10202575, 10345095, 10452464, 10525042, 10565833, 10580153, 10574543, 10554408, 10522389, 10479192, 10425373, 10361922, 10290024, 10211018, 10125936, 10034388, 9934309, 9823241, 9699402, 9561704, 9409956, 9245440, 9070046, 8884325, 8687581, 8480198, 8264482, 8042823, 7816792, 7588251, 7357843, 7119427, 6857733, 6555245, 6202852, 5803996, 5370803, 4918853, 4464309, 4021467, 3600123, 3205378, 2839957]
56921B839957l34269l02865k73221k46301k22178k00955j82437j65612j49463
56912G62656j33833j18801j04150r0050p7264o5842n4626m2931l1713B1241F895
56900d55p81D546J3093K0999K7660L0930L0117K5835J9149J1500M566o52l966
56887A83777n031l499n29J543J950K375M054N877O638P469J0041J3804J6993J9420
56873B64882K2200K5505K8523L0888L2134L0411K4093J4535N087k635r706j6984
56861D48933k3276k6984k7998k7255k5583k3532k1427j9127j6361j3442j0993
56850B12955q990o871m447j982L69K489L934M524M903N701O525O691O411O247
56836B38459O018N469N290O102P037O821N762N030M441K942R32nK33K1j280k467
$$ y = [2839957, 2505688, 2202823, 1929602, 1683301, 1461123, 1260168, 1077731, 912119, 762656, 628823, 510022, 405872, 315822, 238558, 172716, 118090, 75159, 43446, 21241, 6895, -455, -1236, 4546, 17639, 38638, 66298, 97228, 127345, 153180, 172329, 183829, 188395, 187743, 183777, 178746, 175247, 174718, 176261, 178211, 180586, 184640, 190517, 197155, 204624, 214665, 228469, 245462, 264882, 287082, 312587, 341110, 371998, 404132, 434543, 458636, 473171, 478258, 475623, 465917, 448933, 425657, 398673, 370675, 343420, 317837, 294305, 272878, 253751, 237390, 223948, 212955, 203965, 197094, 192647, 190665, 191034, 193523, 197457, 201981, 206884, 212585, 219110, 225801, 232212, 238459, 244477, 249946, 255236, 261338, 268375, 275196, 280958, 285988, 290429, 293371, 294303, 294298, 294531, 294552, 293272, 290805]
56820B90805k904l643n094n560l459L44L850O539R250J2211J4664J6349J8145
56807C51497K0963K4563K7804L0097L2294L5720M0345M4698M7904N0501N2132
56796G58518M9715M0078K4218P214o202j4558j8583j9508j8888j8126j7157j4775
56784G51946j0733o205j824L102Q887J4730K0367K6913L5071M4068N3299O3173
56772A002794P2632P7186P1473N3809K7550j174k6173m3178n1535n4106n4406
56761A074872n3532n0384m4337l6595k8964k2196j5683q452l29P638J4213J9504
56749H55755K5136L2556M1306M8955N2256M8495L6730J8497k628k2447l7600m6698
56737A050313n0785n2191n2126m9938m5356m0138l6048l2220k6686j9742j3445
$$ y = [290805, 287901, 284258, 279164, 273604, 270145, 270489, 274339, 280878, 290128, 302339, 317003, 333352, 351497, 372460, 397023, 424827, 454924, 487218, 522938, 563283, 607981, 655885, 706386, 758518, 808233, 848311, 872529, 879743, 873541, 858983, 840400, 820892, 802004, 783878, 766721, 751946, 741213, 735008, 733184, 736286, 745173, 759903, 780270, 807183, 842254, 886322, 939621, 1002794, 1075426, 1152612, 1224085, 1277894, 1305444, 1304270, 1278097, 1234919, 1183384, 1129278, 1074872, 1021340, 970956, 926619, 890024, 861060, 838864, 823181, 814729, 814400, 822038, 836251, 855755, 880891, 913447, 954753, 1003708, 1055964, 1104459, 1141189, 1159686, 1157058, 1134611, 1097011, 1050313, 999528, 947337, 895211, 845273, 799917, 759779, 723731, 691511, 664825, 645083, 631638]
56726F31638q135k229M336R492J2628J5957K0880K5226K5629K0901J1932L86j1080
56713G57561j9530k4447k8123l1865l3768l2003k8220k5386k3821k1775j8704
56702D69919j5590j2979j0842r722r915j0180r049o805m614k715j139r31k583
56689C72855m353m347l350l299l974l770k910l016l836l358j240M73M48n34j577
56674C34212k831m209n074n708p021q413p975n477l101k471k796k711k217j919
56660B72289j880k192l274m757n323m493l333k683j856p6J816K177M91k191m397
56645B40318n223m673l393j985n82P82J868K639L315L481K125m55j972q21J565
56630B36989K684K422K471L149L249K702K728L254K757J121J67O82J260R45P51
$$ y = [631638, 623503, 621274, 625610, 635102, 647730, 663687, 684567, 709793, 735422, 756323, 768255, 768641, 757561, 738031, 713584, 685461, 653596, 619828, 587825, 559605, 534219, 510398, 488623, 469919, 454329, 441350, 430508, 420786, 410871, 400691, 391642, 384837, 380223, 377508, 376369, 375438, 372855, 368502, 364155, 360805, 357506, 353532, 349762, 346852, 343836, 340000, 336642, 335402, 335875, 336323, 335789, 334212, 331381, 327172, 322098, 316390, 309369, 300956, 292981, 287504, 284403, 281932, 279136, 276425, 274208, 272289, 270409, 268217, 264943, 260186, 254863, 250370, 247037, 244354, 242498, 242422, 244238, 246415, 246906, 244715, 240318, 235095, 230422, 227029, 225044, 224462, 225244, 227112, 229751, 233066, 236547, 238672, 238217, 236245, 235424, 236989, 239673, 242095, 244566, 247715, 250964, 253666, 256394, 259648, 262405, 263526, 263693, 264375, 265635, 266580, 267331]
56615B67331J409J848J322J051K132L315K681M74j350j707j154o52o56j175j885
56600B72984k418k862l607m423m496l556k265j371j204j896l091l611k603r40
56586B34641j32n9O02J771J780J04j686k240j890j205nJ403J873J310J216K288
56570B39771L101K400J176J126K335L674M438M371L158J124l85l96O12J610K223
56555B70338K392J908R59K35r5n22r94q00j0L25q8l56m2K68N70J725L522M309
56537B83644L406K134J645J563J666K715M484N130L965K780K914L133K204J393
56523C22776K286L879M229L572L411L678L077J455k37j454j814l49L081O613Q387
56508C62590Q725Q718Q090O612O154Q595J2574J5006J5326J5546J6485J6717J5487
$$ y = [267331, 268740, 270588, 271910, 272961, 275093, 278408, 281089, 281563, 280213, 278506, 277352, 276700, 276044, 274869, 272984, 270566, 267704, 264097, 259674, 255178, 251622, 249357, 247986, 246782, 244886, 241795, 238184, 235581, 234641, 234509, 234450, 235052, 236823, 238603, 238707, 237021, 234781, 232891, 231686, 231681, 233084, 234957, 236267, 237483, 239771, 242872, 245272, 246448, 247574, 249909, 253583, 258021, 262392, 265550, 266674, 266289, 265893, 266505, 268115, 270338, 272730, 274638, 275597, 275832, 275737, 275215, 274221, 273421, 273411, 273736, 273648, 273292, 273250, 273518, 274088, 275813, 279335, 283644, 287050, 289184, 290829, 292392, 294058, 296773, 301257, 306387, 310352, 313132, 316046, 319179, 321383, 322776, 325062, 328941, 333170, 336742, 340153, 343831, 346908, 348363, 348126, 346672, 344858, 344509, 347590, 354203, 362590, 371315, 380033, 388123, 394735, 400889, 409484, 422058, 437064, 452390, 467936, 484421, 501138, 516625]
56495E16625J4102J3743J3906J3678J3077J2540J2210J2106J2084J1570J0113
56484F55754P914N170J560k715o272q171r266j0602j1540j1114j0276j0700j2084
56471E77658j2724j2417j2674j4051j5226j4925j3226j0831q472o955o514o249
56459D43394n395m701n245o458o934o726o992p642p243n407l614l274m218n310
56445C64235n528m441k566j233j265k082k743l134l307k670j095J34j08j057j254
56430C31886o20K8N44J049R40j21j236j728k263k948k038J179M106M156K915L692
56414C39541O037O427L923J425J107K106L249M753O343O650N579M786M900M649
56400D01475L568L148M275N731O318O344O072M771K492R28J174K126K137J068
$$ y = [516625, 530727, 544470, 558376, 572054, 585131, 597671, 609881, 621987, 634071, 645641, 655754, 663668, 668838, 670398, 667683, 661411, 653240, 643974, 633372, 621832, 610718, 600442, 589742, 577658, 564934, 552517, 539843, 525792, 510566, 495641, 482415, 471584, 463112, 456157, 449643, 443394, 437999, 433298, 428053, 421595, 414661, 407935, 400943, 393301, 386058, 380651, 377037, 373763, 369545, 364235, 358707, 354266, 351700, 350467, 349202, 347120, 344377, 341243, 337936, 335266, 334171, 334305, 334197, 333140, 331886, 331266, 331294, 331838, 332887, 333827, 333706, 332470, 330742, 328479, 325531, 323493, 324672, 328778, 332934, 335849, 339541, 345578, 352005, 355928, 357353, 358460, 360566, 363815, 368568, 374911, 381561, 387140, 391926, 396826, 401475, 405043, 408191, 412466, 418197, 424515, 430859, 436931, 441702, 444194, 445122, 446296, 448422, 450559, 451627]
56386D51627o8m20J89R74L81k003l973l041m0J777J228K20M0m00j784k616j790
56369D40301o76r67k184k881k802k432j707n27M47N31j99j454k980l864l002q25
56353D14779P81Q77M54N81Q50L43j199l430n394n483l033k5P25o36j173N55K660
56336D02232L101K358J821J568J091N92L07k2l2J257L455M398K979Q00r8K60O64
56319D26731P12O92O24O14J196K329K931K271J057M68Q71J896K957L354K772J846
56303D53321J430J362J041P82J277K092K429K929M686O661O370L422J69j357j221
56288D85393j94J221K127J833J324K037L216K912J549J568L330M511M112L889
56274E18828M838N523N204N602P848J0264J0971J0453J0007R753R521R772J0382
$$ y = [451627, 451559, 451139, 451328, 452302, 452683, 450680, 446707, 443666, 443626, 445403, 446631, 446851, 446891, 446491, 444707, 442091, 440301, 439625, 438658, 436474, 433593, 430791, 428359, 426652, 426125, 426572, 427103, 426904, 425450, 422470, 418606, 415604, 414779, 415560, 416437, 416891, 417472, 418322, 418665, 417466, 414036, 408642, 403159, 400126, 400101, 400826, 400190, 399017, 399572, 402232, 405333, 407691, 409512, 411080, 412171, 412763, 413070, 413048, 413016, 414273, 417728, 422126, 425105, 425905, 425807, 426067, 426731, 427443, 428135, 428759, 429373, 430569, 432898, 435829, 438100, 439157, 439625, 440496, 442392, 445349, 448703, 451475, 453321, 454751, 456113, 457154, 457936, 459213, 461305, 463734, 466663, 471349, 478010, 484380, 487802, 487971, 486614, 485393, 485199, 486420, 488547, 490380, 491704, 493741, 496957, 499869, 501418, 502986, 506316, 510827, 514939, 518828, 523666, 529189, 534393, 539995, 547843, 558107, 569078, 579531, 589538, 599291, 608812, 618584, 628966]
56261F28966J0498J0404J1398J3098J3468J2289J1824J2993J3897J3415J3166
56250G65416J4261J5136J4399J3056J2065J0438P756N840N894O457O143N865O392
56237H89118O357M881L611L925M688M956O310R883J3585J5036J5098J5812J6896
56224A010156J7150J7474J9675K3588K7805L1850L5590L8109L9292M0956M4376
56213A346021M8340N1442N4493N8701O3564O8563P4821Q2909R0988R7418J03400
56202B140660J10909J19810J29126J39186J50516J62311J73857J85537J97014
56193C508926K06733K14704K22860K30912K35104K33254K27636K20353K09345
56184E509827J92039J69660J44466J15967Q3716N0971K1495n050l0737n4681p4660
$$ y = [628966, 639464, 649868, 661266, 674364, 687832, 700121, 711945, 724938, 738835, 752250, 765416, 779677, 794813, 809212, 822268, 834333, 844771, 852527, 858367, 864261, 870718, 876861, 882726, 889118, 895475, 900356, 903967, 907892, 912580, 917536, 923846, 933729, 947314, 962350, 977448, 993260, 1010156, 1027306, 1044780, 1064455, 1088043, 1115848, 1147698, 1183288, 1221397, 1260689, 1301645, 1346021, 1394361, 1445803, 1500296, 1558997, 1622561, 1691124, 1765945, 1848854, 1939842, 2037260, 2140660, 2251569, 2371379, 2500505, 2639691, 2790207, 2952518, 3126375, 3311912, 3508926, 3715659, 3930363, 4153223, 4384135, 4619239, 4852493, 5080129, 5300482, 5509827, 5701866, 5871526, 6015992, 6131959, 6215675, 6266646, 6288141, 6283091, 6252354, 6197673, 6123013]
56173F123013r1145j05659j17088j23708j27249j30895j34653j36436j36394j36451
56163D883335j36908j37187j38456j41944j45870j47588j47399j46937j45517
56154C595529j41781j37421j35240j34640j32753j28899j24338j18874j11447
56145B430136j03218r6366r0678q4513p8053p2429o6939o0427n4033m9483m6051
56134A627946m2466l9772l8888l7356l2670k6978k4261k4306k3678k1338j8968
56123A297265j6997j4524j2253j1335j0297p025k763k84O90K450M959O652Q063
56110A244601J0532J2675J2520J1785J3599J7140J8989J8655J8202J7667J5539
56099A411904J2886J2248J3163J3267J2841J3785J5043J4031J1806J1933J4643
$$ y = [6123013, 6031868, 5926209, 5809121, 5685413, 5558164, 5427269, 5292616, 5156180, 5019786, 4883335, 4746427, 4609240, 4470784, 4328840, 4182970, 4035382, 3887983, 3741046, 3595529, 3453748, 3316327, 3181087, 3046447, 2913694, 2784795, 2660457, 2541583, 2430136, 2326918, 2230552, 2139874, 2055361, 1977308, 1904879, 1837940, 1777513, 1723480, 1673997, 1627946, 1585480, 1545708, 1506820, 1469464, 1436794, 1409816, 1385555, 1361249, 1337571, 1316233, 1297265, 1280268, 1265744, 1253491, 1242156, 1231859, 1224834, 1222071, 1221787, 1222477, 1224927, 1229886, 1236538, 1244601, 1255133, 1267808, 1280328, 1292113, 1305712, 1322852, 1341841, 1360496, 1378698, 1396365, 1411904, 1424790, 1437038, 1450201, 1463468, 1476309, 1490094, 1505137, 1519168, 1530974, 1542907, 1557550]
56088A557550J6811J7384J8411K0985K4514K9522L7047M5650N2944N9395O7023
56077A947236P5616Q4081R3832J06545J20289J32264J43257J54455J62061J60792
56067C180428J51287J38690J25522J11457R8392Q9409Q3431P6497O7296N6478
56057D178887M2333K3310L254j2029k2232l0998l9133m5960n5119p1232r1695
56046C879386j09134j21175j30714j37684j38554j33590j26856j19015j07540
56037B755124r3861q2694p4242o4570n3786m6201m2218l7797l2445k9980l0629
56026B166701k9858k5992k2041j9385j6404j3629j3350j4056j2059q167n807l708
56014A982245J695P993R527P380P679J0931J2400J2274J5252K0391K1868J9932
$$ y = [1557550, 1574361, 1591745, 1610156, 1631141, 1655655, 1685177, 1722224, 1767874, 1820818, 1880213, 1947236, 2022852, 2106933, 2200765, 2307310, 2427599, 2559863, 2703120, 2857575, 3019636, 3180428, 3331715, 3470405, 3595927, 3707384, 3805776, 3895185, 3978616, 4055113, 4122409, 4178887, 4221220, 4244530, 4247784, 4235755, 4213523, 4182525, 4143392, 4097432, 4042313, 3971081, 3879386, 3770252, 3649077, 3518363, 3380679, 3242125, 3108535, 2981679, 2862664, 2755124, 2661263, 2578569, 2504327, 2439757, 2385971, 2339770, 2297552, 2259755, 2227310, 2197330, 2166701, 2136843, 2110851, 2088810, 2069425, 2053021, 2039392, 2026042, 2011986, 1999927, 1991760, 1985953, 1982245, 1983940, 1991933, 2001460, 2008840, 2016519, 2027450, 2039850, 2052124, 2067376, 2087767, 2109635, 2129567]
56002B129567K0626K4225K4906K2573K3768K9423L2877L1924L1911L4801L6034
55991B442635L4435L4672L7748L9367L9410M2336M6919M6994M3743M5245N2204
55980B905708N6665N6721N9248O5671O8769O6980O8216P5379Q1520Q3433Q6703
55969C675013R2971R5779R3817R4953J02205J08872J12072J17642J27179J34070
55959D754573J36919J42792J52958J60176J64231J74381J91871K06615K16020
55950F300536K29525K48895K62608K66671K72368K85732K98112L05352L17047
55941H786846L37697L57681L72432L91402M18545M43721M63399M89459N26884
55932A2588066N63585N93212O26600O69396P11011P47846P94087Q56228R20404
$$ y = [2129567, 2150193, 2174418, 2199324, 2221897, 2245665, 2275088, 2307965, 2339889, 2371800, 2406601, 2442635, 2477070, 2511742, 2549490, 2588857, 2628267, 2670603, 2717522, 2764516, 2808259, 2853504, 2905708, 2962373, 3019094, 3078342, 3144013, 3212782, 3279762, 3347978, 3423357, 3504877, 3588310, 3675013, 3767984, 3863763, 3957580, 4052533, 4154738, 4263610, 4375682, 4493324, 4620503, 4754573, 4891492, 5034284, 5187242, 5347418, 5511649, 5686030, 5877901, 6084516, 6300536, 6530061, 6778956, 7041564, 7308235, 7580603, 7866335, 8164447, 8469799, 8786846, 9124543, 9482224, 9854656, 10246058, 10664603, 11108324, 11571723, 12061182, 12588066, 13151651, 13744863, 14371463, 15040859, 15751870, 16499716, 17293803, 18150031, 19070435]
55923A9070435R78161J040269J111664J179268J239571J311044J403759J504908
55915B8839079J609690J735419J888500K051390K221171K425320K678607K961750
55907D6410926L263818L604027L989105M397306M833475N348777N972941O681352
55899H4501727P465674Q375677R447569J0657745J1998328J3527009J5288983
55892A61262712J7277755J9536158K2185001K5269433K8709822L2458807L6345660
55885C43045348L9342715L9192936L3552336K2054684P146747p397322j8821880
55878D58115564k6398162l0717408l2622096l2798375l1813522l0100667k7916353
55871B45748981k5435223k2843856k0292101j7840446j5528675j3437913j1632470
$$ y = [19070435, 20048596, 21088865, 22200529, 23379797, 24619368, 25930412, 27334171, 28839079, 30448769, 32184188, 34072688, 36124078, 38345249, 40770569, 43449176, 46410926, 49674744, 53278771, 57267876, 61665182, 66498657, 71847434, 77820375, 84501727, 91967401, 100343078, 109790647, 120448392, 132446720, 145973729, 161262712, 178540467, 198076625, 220261626, 245531059, 274240881, 306699688, 343045348, 382388063, 421580999, 455133335, 477188019, 484334766, 476937444, 458115564, 431717402, 400999994, 368377898, 335579523, 303766001, 273665334, 245748981, 220313758, 197469902, 177177801, 159337355, 143808680, 130370767, 118738297]
55864A18738297j0099328q796116p709885o826523o093069n458198m914223m462834
55856F4378121m076339l727626l424071l177323k968828k775046k598323k444466
55848C9186099k297219k142832j995253j870638j759328j646906j540353j449408
55840B4484162j363115j268650j174653j093802j019785r42502q69252q10568
55832A5941835p60455p09639o63569o29358n99431n65445n34248n13254m93898
55823A0472538m66298m36916m15410l96665l72096l46598l28215l12209k90967
55814G107164k69389k55435k45269k31980k19596k14475k11792k04011j94358
55805E060859j89316j86157j79933j74372j73958j73296j65823j55265j47641
$$ y = [118738297, 108638969, 99842853, 92132968, 85306445, 79213376, 73755178, 68840955, 64378121, 60301782, 56574156, 53150085, 49972762, 47003934, 44228888, 41630565, 39186099, 36888880, 34746048, 32750795, 30880157, 29120829, 27473923, 25933570, 24484162, 23121047, 21852397, 20677744, 19583942, 18564157, 17621655, 16752403, 15941835, 15181380, 14471741, 13808172, 13178814, 12579383, 12013938, 11479690, 10966436, 10472538, 10006240, 9569324, 9153914, 8757249, 8385153, 8038555, 7710340, 7398131, 7107164, 6837775, 6582340, 6337071, 6105091, 5885495, 5671020, 5459228, 5255217, 5060859, 4871543, 4685386, 4505453, 4331081, 4157123, 3983827, 3818004, 3662739, 3515098]
55796C515098j40120j28355j16357j08562j00475q7932p7186p5015p6883p5555
55786B528658p3264p4526p5120o9589o2155n8941n6560m9464m1598l9408l9759
55775A888274l6069l0398k8482k8541k5946k3508k6242l0892l1245k9206l0427
55764A567318l3430l3237l1549l3270l6705l6814l4599l4113l3847l0095k5346
55753A204313k4379k5335k3278j9390j8313j9350j8380j5591j3758j1991q421
55742A006127n697o552p492m162O30J409j110k741l601n932p994p329o555q952
55728I40049j1962j1851j0770j2237j4034j2746j0925j2227j3908j1939r021r522
55716G98907j0862q628n940q539j4111j5981j4344j4386j5780j3850r470q320
$$ y = [3515098, 3374978, 3246623, 3130266, 3021704, 2921229, 2833297, 2756111, 2681096, 2604213, 2528658, 2455394, 2380868, 2305748, 2236159, 2174004, 2115063, 2058503, 2009039, 1967441, 1928033, 1888274, 1852205, 1821807, 1793325, 1764784, 1738838, 1715330, 1689088, 1658196, 1626951, 1597745, 1567318, 1533888, 1500651, 1469102, 1435832, 1399127, 1362313, 1327714, 1293601, 1259754, 1229659, 1204313, 1179934, 1154599, 1131321, 1111931, 1093618, 1074268, 1055888, 1040297, 1026539, 1014548, 1006127, 1000430, 993878, 986386, 982224, 982854, 984263, 983153, 980412, 976811, 970879, 962885, 955556, 949001, 940049, 928087, 916236, 905466, 893229, 879195, 866449, 855524, 843297, 829389, 817450, 808429, 798907, 788045, 779417, 773477, 764938, 750827, 734846, 720502, 706116, 690336, 676486, 667016, 658696]
55704F58696j0989j2454j0956r480r087q164p610r629j2309j2171j0717j1577
55692E33553j2961j0355n236l324n220o281n072m453m824l653j592k070m764n959
55678D57789n252n705p521p801o313n598n717m634l137l594m704l412j109j840
55664C91452n188p082o871p346q530p754n399m335m234k517k64q22l099k864k72
55649C24875N56p51k91K628M224L206K655L931M636L677K922K822J577n48j026
55634C55093K52R35J001K580M982N187L444L088M567M995L928M129N996O675N436
55619D12288M727N104M185J473n28q36j052j506q87j2j165l435l499j263J64K20
55603D13978J360L503L503R32p01M14K321L552M636M799K158j899l461j983p77
$$ y = [658696, 647707, 635253, 624297, 614817, 605730, 597566, 589956, 580327, 568018, 555847, 545130, 533553, 520592, 510237, 505001, 501677, 496457, 490176, 485104, 480651, 475827, 472174, 470582, 468512, 463748, 457789, 452537, 446832, 439311, 431510, 425197, 419599, 413882, 409248, 406111, 402517, 397813, 394401, 393292, 391452, 386264, 379182, 372311, 364965, 356435, 348681, 343282, 338947, 334713, 332196, 331932, 331110, 328011, 325147, 324875, 325431, 324680, 324389, 327017, 331241, 334447, 337102, 341033, 345669, 349346, 352268, 355090, 356667, 356119, 355093, 355345, 356280, 357281, 359861, 364843, 370030, 373474, 376562, 381129, 386124, 390052, 394181, 400177, 406852, 412288, 417015, 422119, 426304, 427777, 427249, 426413, 425361, 423855, 422968, 422956, 421791, 418356, 414857, 413594, 413758, 413978, 415338, 418841, 422344, 423276, 422575, 422989, 425310, 428862, 433498, 438297, 440455, 438556, 435095, 433112, 432335]
55588D32335j054o05Q77M61k649n421o041o151o867p183p370r316j2306j3067
55574C55643j1182r896j0498j0629r417r251j0887j1554r795p859p431p033n469
55561B34742m009l562l174k607k834l236k082l52r24l421m368l071k470l399l177
55546A92056j195o62k905m901m482l389l189k614j062l69r69n53J439K218M73
55531A69896j341j446j308j752r88J331K358Q25n77L7O53m81j670j391j209k298
55515A60639k728j014J033J651J982L057L322J901J148L090O156P944Q608R136
55501B05925Q991P692O261N179L451J171J36M70k18k796n111n896o652q080q474
55486B02049p376o834p177n728j932N45n46k438k124p93n22m59M99Q69k55o25
$$ y = [432335, 431281, 430676, 431553, 432014, 429365, 423944, 417903, 411752, 404885, 397702, 390332, 381016, 368710, 355643, 344461, 334565, 324067, 313438, 304021, 294770, 283883, 272329, 262534, 254675, 247244, 240211, 234742, 230733, 227171, 223997, 221390, 218556, 215320, 213238, 212886, 211962, 208541, 204173, 201102, 198632, 195233, 192056, 190861, 190199, 187294, 182393, 177911, 174522, 171333, 168719, 167657, 167288, 166319, 165766, 167205, 169423, 169896, 168555, 167109, 165801, 164049, 163061, 164392, 166750, 167575, 166998, 167035, 167688, 167207, 165537, 164146, 162937, 160639, 157911, 156897, 157930, 159581, 161563, 164620, 167942, 169843, 170991, 174081, 180237, 188181, 196789, 205925, 214916, 222608, 228869, 234048, 237499, 238670, 238806, 239276, 239058, 236262, 231151, 225255, 218603, 210523, 202049, 194673, 187839, 180662, 174934, 173002, 173547, 173001, 170563, 168439, 167646, 167124, 166665, 167164, 168033, 167778, 167153]
55470A67153J270L071K548J443J990K855K085R65J204J257o94k698j877P69K035
55455A83376J141m72k059l300l274k479l542p106r569q087n116m575n986o272
55441A22680n139m628n036n067m830n160n164l679k010k190l629m297l970l627
55427F4254l044j671n12m66l06J100K249J371l30o32Km17j932l085l484l360k046
55410D7691M47J877O09j517j829q39p31j311o45J304K641K409J170m08j482p73
55394D8613J475K768J628j34m71l59j388k401j587k3J21p09p47l92j023j775r16
55377D2680O82Q70N7K96J394J188o67k309k634k014o20J380K630K168J364J758
55361D8223K162O81j465j336J253L609M007K885R23j211j805J86K815L163J250
$$ y = [167153, 168423, 171494, 174042, 175485, 177475, 180330, 182415, 183380, 184584, 185841, 185147, 182449, 180572, 181341, 183376, 184517, 184045, 181986, 178686, 175412, 172933, 169391, 162285, 152716, 144629, 139513, 134938, 128952, 122680, 117541, 112913, 107877, 102810, 97980, 92820, 87656, 83977, 81967, 79777, 76148, 71851, 67881, 64254, 61210, 59539, 59027, 58561, 58255, 59355, 61604, 62975, 62645, 62013, 62015, 61598, 59666, 56581, 53097, 49737, 47691, 48138, 50015, 50624, 49107, 47278, 46439, 45708, 44397, 43752, 45056, 47697, 50106, 51276, 50868, 49386, 48613, 50088, 52856, 54484, 54350, 53879, 53520, 52132, 49731, 48144, 48121, 48242, 47533, 46786, 46394, 45371, 43596, 42680, 43362, 44232, 44289, 44585, 45979, 47167, 46500, 44191, 41557, 39543, 38923, 40303, 42933, 45101, 46465, 48223, 50385, 51066, 49601, 48265, 49518, 53127, 57134, 60019, 60942, 59731, 57926, 58112, 60927, 64090, 65340]
55346F5340n39j059q34J50J990L037J707m96r38j34p04k562k984j450o15j744
55330E8165k773k045q26o76r63n80j08o62j854k232j037J027K257J254j370l014
55314D4563j859Q41K329J594k28j837k661k412j283j62N28J356K299K060K39j358
55298D4009j275n26k95M31K574M217L127M74j017j274j969k624j385R80J617J20
55282D7184r56l42L29j84q15l82O52J341J449R58j1p50q53j146k161k647j391
55265D0275L56O40l1J89J115J054R4j67K33k12j367j518n96l83j265j566n15O34
55247C6970Q49M51k28j165j508l08J609K509K257J849J182k37j055L95K736K912
55231D9218P96p43m14J87J26M71J385J207m20j493q67N6j1m15l88l17j90Q34K256
$$ y = [65340, 64801, 63742, 62908, 63058, 65048, 68085, 69792, 69296, 68358, 68224, 67520, 64958, 61974, 60524, 59909, 58165, 55392, 53347, 52521, 51845, 50882, 50302, 50194, 49532, 47678, 45446, 44409, 45436, 47693, 48947, 47577, 44563, 42704, 43545, 45874, 47468, 47240, 45403, 42742, 40330, 39047, 38885, 39413, 40769, 43068, 45128, 45367, 44009, 42734, 42208, 41913, 42344, 44918, 49135, 52262, 52736, 51719, 50445, 48476, 45852, 44467, 45447, 47064, 47184, 46228, 45886, 46215, 46031, 45216, 44834, 45486, 46827, 48276, 49234, 49223, 48473, 47620, 46474, 44313, 41666, 40275, 40631, 41271, 41240, 41429, 42544, 43598, 43692, 43525, 43758, 43546, 42179, 40661, 40065, 39682, 38417, 36851, 36336, 36970, 37819, 38270, 38042, 36877, 35369, 35061, 36670, 39179, 41436, 43285, 44467, 44230, 43175, 43570, 46306, 49218, 50014, 49271, 48857, 49044, 49170, 49641, 51026, 52233, 51813, 50320, 49453, 49509, 49498, 49083, 48695, 48378, 48188, 49022, 51278]
55212E1278K061j91k256k338j301o46l66MR3k95l55L89J147J020oj510k775k535
55194D1418k32K501L399K557J934K032J486O9m94O30K000K091R11r32k877l798
55178E2695k819j017k63m11J39J125N84j401k176n57J323J299j39j498k148j624
55162D3112N55L238L981K229J91l84k40o19j311j693j763j306J08J759K278J851
55146E1986J749J615j5k326k533m04R02k68j675j159K15Q74J572L070L760K133
55130E9496l54j363q73j95M14J134J137q8j286j166l51r1l62o71j206j772j248
55113E1155L83J200J01j282j053K26R50J013J118J060M92N0R5k54j301j570j26
55096E2257J489J530O87N83R08K13j486k889l404l276k523j286m01k78j09O58
$$ y = [51278, 53339, 53148, 50892, 48554, 47253, 46607, 46241, 46245, 46338, 46043, 45688, 46077, 47224, 48244, 48238, 46728, 43953, 41418, 41186, 43687, 47086, 49643, 51577, 53609, 55095, 55164, 54670, 55300, 57300, 59391, 60302, 59370, 56493, 52695, 49876, 48859, 48596, 48185, 48324, 49449, 50033, 48632, 46456, 45899, 47222, 48521, 48382, 46884, 44736, 43112, 43667, 46905, 50886, 53115, 53306, 52922, 52682, 52063, 50752, 49059, 47296, 45990, 46098, 47857, 50135, 51986, 53735, 55350, 55335, 53009, 50476, 50072, 50974, 50706, 49031, 47872, 48087, 48961, 50533, 53603, 57363, 59496, 59142, 57779, 56906, 56711, 57125, 58259, 59396, 59308, 58022, 56856, 56505, 56414, 56052, 55381, 54175, 52403, 51155, 51538, 52738, 52839, 51557, 50504, 50730, 51680, 52693, 53811, 54871, 55363, 55413, 55508, 55254, 53953, 52383, 52257, 53746, 55276, 55963, 56546, 57454, 57667, 56181, 53292, 49888, 46612, 44089, 42803, 42402, 42124, 42015, 42673]
55080D2673J184P86K89N30Q79O38M96J081J460O79m52o96k27L10J180K382K641
55063E5833J338j0K3N40K40q5Q12J989J820R60J106J732Q98j155j991o46J129
55046F4533J624J070L72k69q56r93m25N34J273J219L18m12L40K290L472K823J611
55029G8524J198Q89n17k309k805j767k38J153K093J834L25p13K49K240L229L110
55013H6495L159L249J959n56k004q10J998M051L801J483j014j532J58J924J948
54998A04309R36N31O19L9r52j027k25J00l67n79k61l72j136j388n61K20k26j492
54980I8168k293k051j222n56m48o48n86j52Q6k65q52j285j720k136j775k66J397
54963H3396J920J276L35m47j057j163m23Q01J802K313K376K100J963K428K773
$$ y = [42673, 43857, 44643, 44932, 45462, 46341, 46979, 47475, 48556, 50016, 50695, 50243, 49547, 49320, 49630, 50810, 53192, 55833, 57171, 57161, 57184, 57724, 57964, 57879, 58691, 60680, 62500, 63460, 64566, 66298, 67196, 66041, 64050, 63404, 64533, 66157, 67227, 67599, 67330, 66474, 65481, 65056, 65590, 66863, 68082, 68400, 67988, 68328, 70618, 74090, 76913, 78524, 79722, 80611, 80094, 77785, 74980, 73213, 72975, 74128, 76221, 78055, 78380, 77667, 77916, 80156, 83385, 86495, 89654, 92903, 94862, 94306, 92302, 91492, 93490, 97541, 101342, 102825, 101811, 100279, 100437, 102361, 104309, 105245, 105776, 106395, 106434, 105482, 104455, 104230, 104330, 103963, 103384, 103123, 102751, 101615, 100227, 99666, 99886, 99660, 98168, 95875, 93824, 92602, 92046, 91598, 90950, 90364, 90212, 90298, 90033, 89181, 87896, 86176, 84040, 82265, 81999, 83396, 85316, 86592, 86927, 86480, 85423, 84260, 83837, 84638, 86440, 88753, 91129, 93229, 95192, 97620, 100393]
54948A00393J562r53k384j347M70Q80L01M02J020Q31K19Q75K594L023R71j857
54932A07000l070k138k48J252J800J661J401J024O1j225j756j371j385k314k414
54917I8278k33K642L450K094Q58P84P41j8o63n45q2N04J597K869L224K576K134
54900A20210K492K892K943L454M757N698N322M474M648N981P379Q078Q277Q471
54886A95076Q940R773J0863J1803J2148J1869J1385J0929R997P812M540J359j216
54873C05278m281q629j2599j3757j2545j2045j3558j4809j3671j1274r730q812
54861A69568p097m874l403k394o84J231J736Q00L1K66R94J890K972L532K918K201
54845A69687L190N785Q135R339J0205J1304J2206J2756J3344J3592J2441R677
$$ y = [100393, 101955, 101002, 98618, 97271, 97741, 98621, 98922, 99324, 100344, 101175, 101394, 102269, 104863, 107886, 108857, 107000, 103930, 101792, 101544, 102796, 104596, 106257, 107658, 108682, 108743, 107518, 105762, 104391, 103006, 100692, 98278, 98045, 100687, 104137, 106231, 107089, 107873, 108614, 108596, 107933, 107388, 107306, 107810, 109407, 112276, 115500, 118076, 120210, 122702, 125594, 128537, 131991, 136748, 142446, 147768, 152242, 156890, 162871, 170250, 178328, 186605, 195076, 204016, 213789, 224652, 236455, 248603, 260472, 271857, 282786, 292783, 300595, 305135, 306494, 305278, 300997, 292368, 279769, 266012, 253467, 241422, 227864, 213055, 199384, 188110, 178380, 169568, 162471, 157597, 154194, 151800, 151116, 152347, 154083, 154883, 154914, 155180, 156174, 158064, 161036, 164568, 167486, 169687, 172877, 178662, 186797, 196136, 206341, 217645, 229851, 242607, 255951, 269543, 281984, 291661]
54833B91661O037J830k941p279r832j0882j1915j3087j3044j1524j0102r805r803
54820A89314r077p817o495n074l797l373l737l891l478l179l120k380p66M68M34
54805A34032j54m01p17j822l219l665k621o42J130J518J43j914k973k619k003
54790A14073k146k765k982k288o73J251K055N94k253l988l217j162L4l44j438
54775I4751k230k419k225j910j372l04J112K042K134K266L276M317L700J314j063
54760A03389j960j552n56R30K805M178M112K945K063K297K854K253M16p75K33
54745A23632K352L211K666K919M711N808M666L212L880N824O752O967Q401J0663
54731A95664J1544J1126J1877J4295J5828J5018J3664J3539J3626J2157R202N564
$$ y = [291661, 297698, 299528, 296587, 289308, 279476, 268594, 256679, 243592, 230548, 219024, 208922, 199117, 189314, 180237, 172420, 165925, 160851, 157054, 153681, 149944, 146053, 142575, 139396, 136276, 133896, 133130, 133598, 134032, 133878, 133477, 132760, 130938, 127719, 124054, 121433, 120791, 121921, 123439, 123582, 121668, 118695, 116076, 114073, 111927, 109162, 106180, 103892, 103219, 104470, 106525, 107119, 104866, 100878, 97661, 96499, 96533, 96189, 94751, 92521, 90102, 87877, 85967, 84595, 84291, 85403, 87445, 89579, 91845, 95121, 99438, 103138, 104452, 103389, 101429, 99877, 99321, 100251, 103056, 107234, 111346, 114291, 116354, 118651, 121505, 123758, 124174, 123399, 123632, 125984, 129195, 131861, 134780, 139491, 145299, 149965, 153177, 157057, 162881, 169633, 176600, 185001, 195664, 207208, 218334, 230211, 244506, 260334, 275352, 289016, 302555, 316181, 328338, 337540, 343104]
54719C43104J102l987p813q761p886p722r081j0405r954p687n119l837m044m449
54705B53461m002l341l688m745m925l522j308R67L184M916N556N559O013O909
54691B61034P422P953R939J3250J5874J6779J7123J7862J8215J7422J6047J4240
54679D33160J0665M750j591o197r367j2647j5924j7577j7103j5907j5491j5922
54667C20849j6181j5327j3339j1102r506q580p785o913o074n209m454m578n820
54654B05981o826o206m621l636k946j062J576K737J904R53Q02J83j311j838m08
54639A85282J199J346J011J503K051J688J444K344L061K127P88R58J746R27j146
54624B06329k100j486j099j447q81J218K938K666J392J069J919K662K565K275
$$ y = [343104, 344206, 340219, 332406, 323645, 315759, 308037, 298956, 288551, 278597, 270910, 265791, 261954, 257910, 253461, 249459, 246118, 242430, 237685, 232760, 229238, 227930, 228897, 232081, 236997, 242553, 248112, 254125, 261034, 268456, 276409, 286348, 299598, 315472, 332251, 349374, 367236, 385451, 402873, 418920, 433160, 443825, 448575, 446984, 440787, 431420, 418773, 402849, 385272, 368169, 352262, 336771, 320849, 304668, 289341, 276002, 264900, 255394, 246814, 239029, 232116, 226042, 220833, 216379, 211801, 205981, 199155, 192949, 188328, 184692, 181746, 180684, 182260, 184997, 186901, 187854, 188656, 188839, 187528, 185690, 185282, 186481, 187827, 188838, 190341, 192392, 194080, 195524, 197868, 200929, 203056, 203844, 204802, 206548, 207475, 206329, 204229, 202743, 201644, 200197, 199316, 200534, 203472, 206138, 207530, 208599, 210518, 213180, 215745, 218020]
54610B18020K716L804M428L875L076L777O105P984P594N699M554N108O197O126
54596B89063M232J245j156j647o08L13M77J077L034N295O346O362O426O522N885
54581C32866M842M613N497O743Q082R935J1967J2901J2097J0278Q371O513M452
54568D39157K049r11m653q684j1771j3122j3289j3439j3865j3677j2072r624p737
54555C18362o881o076m588l228l109l711l580k572j898j949j718o59L65N25K9
54540B79312p77j876k657k114p68p20k813n213n978n589n629o265o504n984n043
54525B21382l871k875l002m397n582n264m152l697l831l472k595k311l188m711
54511A68434o062o455n248k771n09M85O90Q25N05p15j903j930j347j550k600l350
$$ y = [218020, 220736, 224540, 228968, 232843, 235919, 239696, 245801, 253785, 261379, 267078, 271632, 276740, 282937, 289063, 293295, 294540, 293384, 291737, 291129, 291442, 291919, 292996, 296030, 301325, 307671, 314033, 320459, 326981, 332866, 337708, 342321, 347818, 354561, 362643, 372578, 384545, 397446, 409543, 419821, 428192, 434705, 439157, 441206, 440295, 435642, 426958, 415187, 402065, 388776, 375337, 361472, 347795, 335723, 326099, 318362, 311481, 305405, 300817, 297589, 294480, 290769, 287189, 284617, 282719, 280770, 279052, 278393, 278758, 279283, 279312, 278535, 276659, 274002, 271888, 271120, 270400, 267587, 262374, 256396, 250807, 245178, 238913, 232409, 226425, 221382, 217511, 214636, 211634, 207237, 201655, 196391, 192239, 188542, 184711, 181239, 178644, 176333, 173145, 168434, 162372, 155917, 150669, 147898, 147389, 147874, 148564, 149389, 149894, 149179, 147276, 145346, 143999, 142449, 139849, 136499]
54495A36499l303k974k589j735k48J445K723K888J554l85j090M4J512J975K119
54480A38435K912L409K276M70K27J838L563M477N264O208O403N336L805K850L059
54465A90532M837P921J0526J0350O961K245j675m029n034n199n150n264n285m867
54451A96869m256l785l179k247j786k657m446n980o702o467m815j883O42J067
54437A50375j01r96j000q36n10Q07K778L669K615O98o81j184j069n58l5J57L74
54420A54503J185K287K870K928L048L120K614J957K163L025L184K234J310J267
54406A87695J690K064K581L187L057J720j02j283j360n29O55J432J345P24J61
54391B03037l21r50j443j491j574k205k719k088p15j14r13k374l690m445l999
$$ y = [136499, 133196, 130222, 127633, 125898, 125650, 127095, 129818, 132706, 134260, 133875, 132785, 132829, 134341, 136316, 138435, 141347, 144756, 147032, 147502, 147729, 149567, 153130, 157607, 162871, 169079, 175482, 180818, 184623, 187473, 190532, 195369, 203290, 213816, 224166, 231127, 233372, 231697, 227668, 222634, 217435, 212285, 207021, 201736, 196869, 192613, 188828, 185649, 183402, 181616, 178959, 174513, 168533, 161831, 155364, 150549, 148666, 149308, 150375, 150274, 149278, 148278, 147442, 146932, 147739, 150517, 154186, 156801, 157499, 156818, 155634, 154565, 154007, 153972, 154129, 154503, 155688, 157975, 160845, 163773, 166821, 169941, 172555, 174512, 176675, 179700, 182884, 185118, 186428, 187695, 189385, 191449, 194030, 197217, 200274, 201994, 201892, 200609, 199249, 198720, 199375, 200807, 202152, 202876, 203037, 202716, 201766, 200323, 198832, 197258, 195053, 192334, 190246, 189531, 189417, 188504, 186130, 182440, 177995, 173996]
54376A73996k033K17Q71j59r97l86Q91J561J508J341J277J043L20r28k066k027
54360A74429o14Q73J235R06Q29O60k38q42M56L094M838N012M991N415N255M157
54344B10456L427L770M090L626L452M559N979O138N006L742L049K839K902L204
54330B66239L998N621P452P440M243k96k703k095q65r21j568j904k794n014p360
54315B69473q330q166p597o194l724j895k588n048o622o004m312l217l202l561
54301A99013l224j847n13o69j988k362p57J166J358J84l94L81J517K056K132K412
54285A98465L236M264M577L718K725L110M574N228M512M023M488M108J636q23
54271B47841n92J348J666m92k859l874m309m811m530l331k923m363o071n942m301
$$ y = [173996, 171963, 172180, 173051, 172892, 171895, 171509, 172400, 173961, 175469, 176810, 178087, 179130, 179450, 178522, 176456, 174429, 173815, 174688, 175923, 176829, 177658, 178318, 178080, 177238, 177694, 180788, 185626, 190638, 195629, 201044, 206299, 210456, 213883, 217653, 221743, 225369, 228821, 233380, 239359, 245497, 250503, 254245, 257294, 260133, 263035, 266239, 270237, 275858, 283310, 290750, 294993, 294697, 291994, 289899, 289034, 288113, 286545, 284641, 281847, 276833, 269473, 261143, 252977, 245380, 239186, 235462, 233567, 230979, 225931, 219309, 213305, 208993, 205776, 202574, 199013, 195789, 193942, 193429, 192760, 190772, 188410, 187653, 188819, 190177, 190361, 189967, 190348, 191865, 193921, 196053, 198465, 201701, 205965, 210542, 214260, 216985, 220095, 224669, 229897, 234409, 238432, 242920, 247028, 248664, 247841, 247249, 248597, 250263, 249771, 246912, 243038, 238729, 233918, 229388, 226057, 223134, 218771, 212700, 206758, 202457]
54256B02457l244l790n077o050o632p147p465p126n875m015k320j576j947k855
54242A37338l474l331k495j450q32r84j624k070j924j339p22l87n05j048j700
54227A13453k019j850j325m78P85K048K213N79j934l341k679r49K60N98P68J234
54211A07363J973L081M434M952L655J495N80J125J044o83k037r29J581K920K669
54196A33223K255J960Q60m98j98J840L165K138nj249j229n91K97R68O66k68k66
54179A43068J084J942Q70q36j076j23M7j096k080j906j267j049j163j319j746
54164A33350k440k523j283O55J855J768J224J167J501J593J397J319J176L53q07
54149A40305r85J21R75L35p46m58J098K224K081J237J94r42j583j260r23j809
$$ y = [202457, 199213, 195423, 190346, 184296, 177664, 170517, 163052, 155926, 150051, 146036, 143716, 142140, 140193, 137338, 133864, 130533, 128038, 126588, 125756, 124772, 123148, 121078, 119154, 117815, 117093, 116706, 116201, 115153, 113453, 111434, 109584, 108259, 107781, 108566, 110614, 112827, 113406, 111472, 108131, 105452, 104503, 104763, 105361, 106129, 107363, 109336, 112417, 116851, 121803, 125458, 126953, 127533, 128658, 129702, 129019, 126982, 126053, 127634, 130554, 133223, 135478, 137438, 138298, 137800, 137602, 139442, 142607, 144745, 144740, 143491, 142262, 141671, 141968, 142936, 143602, 143334, 143068, 144152, 146094, 146964, 146128, 145052, 144929, 144976, 143880, 141800, 139894, 138627, 137578, 136415, 135096, 133350, 130910, 128387, 127104, 127759, 129614, 131382, 132606, 133773, 135274, 136867, 138264, 139583, 140759, 141112, 140305, 139320, 139441, 140416, 140751, 140005, 139547, 140645, 142869, 144950, 146187, 146381, 145439, 143856, 142596, 141673, 139864]
54133A39864l152l013j460o87j529k203j273L09J201J625K017J640P4j384j448
54118A30581p53o36j106j446j730k276k542j967j203j240j913k438k548k153p98
54103A05832J384L019L038K051J158L17q60j749j554p72l65j34N98J358J069j12
54087A14278r10p32j69J58K11Q4j49l26m55p54j030p34p2q1r29j361p11j96r94
54068A05128k199k195j155n58q65j260j193p71l1Q72J110J48j153j502r27m25
54052I3024l98n40p12q27l61Q44J867J806J049N17M18P00J669L015L404K386J448
54035A09309J672J769M06j007m74Q34Q6k471l511j684M54L91j019j432k09J589
54019A04703K833K890J721K74j49N03R83N50k62q68j219j022J81J693J876L52
$$ y = [139864, 136712, 133699, 132239, 131552, 130023, 127820, 126547, 126856, 128057, 129682, 131699, 133339, 133413, 132029, 130581, 129828, 129192, 128086, 126640, 124910, 122634, 120092, 118125, 116922, 115682, 113769, 111331, 108783, 106630, 105832, 107216, 110235, 113273, 115324, 116482, 116799, 115939, 114190, 112636, 111864, 111499, 111365, 111963, 113321, 114390, 114278, 113368, 112636, 112467, 112625, 112836, 112920, 112771, 112445, 111990, 111236, 110206, 109472, 109400, 109319, 108390, 107029, 106318, 106122, 105128, 102929, 100734, 99579, 99021, 98156, 96896, 95703, 94932, 94901, 95773, 96883, 97031, 95878, 94376, 93449, 93024, 92626, 92086, 91374, 90547, 90186, 91030, 92897, 94703, 95752, 96269, 96687, 97387, 99056, 102071, 105475, 107861, 109309, 110981, 112750, 113156, 112149, 111675, 112509, 112595, 110124, 106613, 104929, 105383, 105774, 104755, 103323, 103114, 104703, 107536, 110426, 112147, 112421, 112272, 112775, 113758, 114308, 114046, 113178, 111959, 110937, 111118, 112811, 114687, 115039]
54003A15039j274j459m33P02J402J651J486J228J310J552J386J103J758L427M642
53988A33520M096K121O3r63m12J657M279N940N750M044J947Q22J712M314O685
53973A75575P028N778M995N804P543R087R784R250P747O760P658R644J0505R498
53959B86656P998P091O328N346M931N581O364O156N031L682K485J680J524J601
53945C52454R00j007l534o032q123r129q514p111o529p000p280o868o626o823
53931B68778o298m438k280q66r6N8j032k907l643k441j038j083j749j541q72r04
53915B37648j226p60Kj12o78m02M12L30n48o46L16P90K2o94j52J015J593J630
53897B38540J896K394K389J606P56Q50K213M074N164M839L519J917L63p68o94
$$ y = [115039, 113765, 112306, 111873, 112575, 113977, 115628, 117114, 118342, 119652, 121204, 122590, 123693, 125451, 128878, 133520, 137616, 139737, 139800, 138837, 138425, 140082, 144361, 150301, 156051, 160095, 162042, 162864, 164576, 168890, 175575, 182603, 188381, 193376, 199180, 206723, 215810, 225594, 234844, 242591, 249351, 257009, 266653, 277158, 286656, 294654, 301745, 308073, 313419, 318350, 323931, 330295, 336451, 341482, 345164, 347649, 349329, 350853, 352454, 353354, 352347, 348813, 342781, 334658, 325529, 317015, 309904, 303375, 296375, 289095, 282227, 275601, 268778, 262480, 258042, 255762, 254896, 254800, 254858, 253826, 250919, 247276, 244835, 243797, 242714, 240965, 239424, 238552, 237648, 236422, 235662, 235664, 235552, 234874, 234472, 234884, 235214, 234666, 234020, 234336, 235126, 235148, 234454, 234302, 235317, 236910, 238540, 240436, 242830, 245219, 246825, 247581, 248431, 250644, 254718, 259882, 264721, 268240, 270157, 270520, 269752, 269058]
53882B69058P98K490K874K073J593K320L794N471P442R469J0386R303O816M339
53868C38226K576J299K58l40l05J55P24J288J837K184K108J779J719K215K929
53853C58652L341L487L869M662N457N912O291P042Q069Q784Q694P797O503N368
53839D43928M704M258L470K200R62J50p44k579n140o803o114l658j805k261m294
53824D26274n829n971n785o522p999r142r416r125q775q710r020r259q676p255
53810C14790n968n525n481n309n556o783q101q051o736n599n328n293n058m949
53796B31053m887m160k861k263l054m270m633l971k823j504k88K28l40j675l067
53781A91485l716k883p28J013N06j711l092k405j125p78n62Q98K757K852Q51j177
$$ y = [269058, 269856, 272346, 275220, 277293, 278886, 281206, 285000, 290471, 297913, 307382, 317768, 327071, 333887, 338226, 340802, 342101, 342359, 342019, 341714, 341869, 342593, 343881, 345718, 347902, 350010, 351789, 353508, 355723, 358652, 361993, 365480, 369349, 374011, 379468, 385380, 391671, 398713, 406782, 415566, 424260, 432057, 438560, 443928, 448632, 452890, 456360, 458560, 459522, 459672, 458928, 456349, 451209, 444406, 438292, 434634, 432829, 430568, 426274, 420445, 414474, 408689, 402167, 394168, 385026, 375610, 366485, 357710, 349000, 339980, 330721, 322045, 314790, 308822, 303297, 297816, 292507, 286951, 280168, 272067, 264016, 257280, 251681, 246353, 241060, 236002, 231053, 226166, 222006, 219145, 216882, 213828, 209558, 204925, 200954, 198131, 196627, 196339, 196567, 196227, 194552, 191485, 187769, 184886, 184158, 185171, 185677, 183966, 180874, 178469, 177344, 176566, 176004, 176902, 179659, 182511, 183362, 182185]
53765A82185j483n49n1p40j842k114j318n15p32j499j378Q5J773K595K652K473
53749A79542K162J873K091K780L286L705N071P335Q572P513N592M866N073M704
53735B44165M060M775O624P223N475L242K778M095N768O881P115O061L783J511
53721C13556O82J409K520K906K430J678J247J113O29n96j892k227j674j369j760
53706C18652j913j089q8j2n01m23J12k43j926l657m240m093m185m364l736k333
53690B85961j225j107j570j902j774j124j86K67l69j404j413l26K15p51j977j921
53674B69394j091r70j374q38P00J560R11o0j98Mk93p80q71r68j629k310k265k083
53656B56839k960m568m986l052J49K532L135K642K105J770J270O99R65K696N054
$$ y = [182185, 180702, 180153, 180102, 179362, 177520, 175406, 174088, 173573, 172841, 171342, 169964, 170049, 171822, 174417, 177069, 179542, 181704, 183577, 185668, 188448, 191734, 195439, 200510, 207845, 216417, 223930, 229522, 234388, 239461, 244165, 248225, 253000, 259624, 266847, 272322, 275564, 278342, 282437, 288205, 295086, 302201, 308262, 312045, 313556, 314238, 315647, 318167, 321073, 323503, 325181, 326428, 327541, 328170, 327574, 325682, 323455, 321781, 320412, 318652, 316739, 315650, 315562, 315550, 315049, 314626, 314738, 314495, 312569, 308912, 304672, 300579, 296394, 292030, 288294, 285961, 284736, 283629, 282059, 280157, 278383, 277259, 277073, 277340, 276971, 275567, 274154, 273828, 274043, 273292, 271315, 269394, 268303, 267333, 265959, 265121, 265821, 267381, 268292, 268232, 268034, 268038, 267745, 266965, 266094, 265126, 263497, 261187, 258922, 256839, 253879, 249311, 244325, 241273, 241422, 243954, 247089, 249731, 251836, 253606, 254876, 255575, 256540, 259236, 264290]
53641B64290O326N682L985K715K656L654N019N891N811N216N032N531O113O227
53627C34148N938N506N120N201O058P054P037O047N481N871N694L543N30r56m53
53612D01819K27k01r76j023p33j052j669j418k08O24L1j507k898l801m442m592
53596C78181l724k142j035j191k317l689m693m592k875l92R08K30j013j202n70
53581C49884k30j49L52R20O66q6l28k42p71j510r86Q28K242K418K294K537K500
53564C60339J958J969K964L651L042K175K491L658M214L667K844K770L906N844
53550D05492P333P374O717P069Q523R197Q061O549O416P354P954P771P365P155
53536E10330P294P835Q281P889O921O467O606O291N665O466R051J1094J0682Q926
$$ y = [264290, 270616, 276298, 280283, 282998, 285654, 289308, 294327, 300218, 306029, 311245, 316277, 321808, 327921, 334148, 340086, 345592, 350712, 355913, 361971, 369025, 376062, 382109, 387590, 393461, 399155, 402698, 403228, 402272, 401819, 402046, 401845, 400869, 399846, 399113, 398061, 396392, 394974, 394766, 395390, 395421, 393914, 391016, 387215, 382773, 378181, 374457, 372315, 371280, 370089, 367772, 364083, 359390, 354798, 351923, 351531, 352439, 352669, 351656, 350454, 349884, 349654, 349505, 349857, 350777, 351443, 351357, 351029, 350787, 350016, 348506, 347520, 348348, 350590, 353008, 355302, 357839, 360339, 362297, 364266, 367230, 370881, 373923, 376098, 378589, 382247, 386461, 390128, 392972, 395742, 399648, 405492, 412825, 420199, 426916, 433985, 442508, 451705, 459766, 466315, 472731, 480085, 488039, 495810, 503175, 510330, 517624, 525459, 533740, 541629, 548550, 555017, 561623, 567914, 573579, 580045, 589096, 600190, 610872, 619798]
53522F19798P775P121O001M913M733M633L431J920J530J725J120K70P67K168K540
53507F70445J774J776L216M570M691M192L743K995J850J254K014L801N630O532
53493G18483O003M786M668O310P894P422N575M471M410M129L739M684O787P936
53479G97297P297O371O172N697M232L058L547N082O288P060Q081R340J0232J0470
53465H90224J0205R784R853J0970J2741J4201J5185J6397J7939J8896J8830J8680
53453A063905J9672K1984K4738K6709K7131K6658K7153K9557L2360L3635L4090
53442A367592L6229M0505M4435M5911M5580M5237M5614M6603M8192N0223N2218
53431A868339N4013N5529N5823N3986N1317N0750N3221N6254N7133N5933N4433
$$ y = [619798, 627573, 634694, 640695, 645608, 650341, 654974, 658405, 660325, 661855, 663580, 664700, 664970, 665737, 667905, 670445, 672219, 673995, 677211, 681781, 686472, 690664, 694407, 697402, 699252, 700506, 702520, 706321, 711951, 718483, 724486, 729272, 733940, 740250, 748144, 755566, 761141, 765612, 770022, 774151, 777890, 782574, 789361, 797297, 804594, 810965, 817137, 822834, 827066, 830124, 833671, 838753, 845041, 852101, 860182, 869522, 879754, 890224, 900429, 910213, 920066, 931036, 943777, 957978, 973163, 989560, 1007499, 1026395, 1045225, 1063905, 1083577, 1105561, 1130299, 1157008, 1184139, 1210797, 1237950, 1267507, 1299867, 1333502, 1367592, 1403821, 1444326, 1488761, 1534672, 1580252, 1625489, 1671103, 1717706, 1765898, 1816121, 1868339, 1922352, 1977881, 2033704, 2087690, 2139007, 2189757, 2242978, 2299232, 2356365, 2412298, 2466731]
53420B466731N3486N2824N2264N1678N0629M9068M7797M7279M6913M6165M5476
53409C010310M5147M4362M2278L9230L5943L2488K8945K6153K4702K3875K2486
53398C375919K0112J6762J2300P081K230j808o019j1120j6008j9288k1464k4083
53386C334614k7278k9769l1188l2813l5739l9477m2735m4838m6037m6912m7694
53375B910134m8026m7550m6844m7165m8811n0247m9667m6988m3670m0841l8244
53364B402081l5049l1025k6971k4087k2774k1914j9911j6565j3229j0802q499
53353B171255n284j613J392L918P267J1842J6424J9757K1991K4203K7144L0753
53341B329049L4492L7808M0520M3074M6211N0150N4182N7325N9327O0869O2780
$$ y = [2466731, 2520217, 2573041, 2625305, 2676983, 2727612, 2776680, 2824477, 2871756, 2918669, 2964834, 3010310, 3055457, 3099819, 3142097, 3181327, 3217270, 3249758, 3278703, 3304856, 3329558, 3353433, 3375919, 3396031, 3412793, 3425093, 3432174, 3434404, 3432596, 3426577, 3415457, 3399449, 3380161, 3358697, 3334614, 3307336, 3277567, 3246379, 3213566, 3177827, 3138350, 3095615, 3050777, 3004740, 2957828, 2910134, 2862108, 2814558, 2767714, 2720549, 2671738, 2621491, 2571824, 2524836, 2481166, 2440325, 2402081, 2367032, 2336007, 2309036, 2284949, 2262175, 2240261, 2220350, 2203785, 2190556, 2179754, 2171255, 2165971, 2164358, 2165750, 2169668, 2176935, 2188777, 2205201, 2224958, 2246949, 2271152, 2298296, 2329049, 2363541, 2401349, 2441869, 2484943, 2531154, 2581304, 2635486, 2692811, 2752138, 2813007, 2875787]
53330B875787O5427O8917P3336P8196Q2147Q4218Q5309Q7382R0941R4479R6890
53319C783029R8952J01590J04038J05070J04996J04822J04295J02634J00472R9096
53309D808994R8026R5452R0977Q5826Q0290P3317O5076N7664N2144M6940M0332
53298E595038L2882K5920J9055J0920J580p378j4900k1476k8196l5564m3154n0169
53286E484558n6409o2573o9183p5628q1053q5790r0656r5196r8051r8964r8909
53275D572146r8411r7337r6204r5676r4911r2684r0146q9706r0793q9863q5741
53264C550674q1682q0394p9956p7052p1801o6560o2031n7525n3498n0811m8466
53253B820898m4908m0876l8314l7185l5778l3628l1492k9015k5073k0293j6602
$$ y = [2875787, 2941214, 3010131, 3083467, 3161663, 3243810, 3328028, 3413337, 3500719, 3591660, 3686139, 3783029, 3881981, 3983571, 4087609, 4192679, 4297675, 4402497, 4506792, 4609426, 4709898, 4808994, 4907020, 5002472, 5093449, 5179275, 5259565, 5332882, 5397958, 5455622, 5507766, 5554706, 5595038, 5627920, 5653840, 5672895, 5683815, 5685395, 5678017, 5663117, 5641641, 5613445, 5577881, 5534727, 5484558, 5428149, 5365576, 5296393, 5220765, 5139712, 5053922, 4963266, 4868070, 4770019, 4671055, 4572146, 4473735, 4376398, 4280194, 4184518, 4089607, 3996923, 3906777, 3817071, 3726278, 3636415, 3550674, 3468992, 3388598, 3308642, 3231590, 3159789, 3093229, 3031198, 2973673, 2920175, 2869364, 2820898, 2775990, 2735114, 2696800, 2659615, 2623837, 2590209, 2558717, 2529702, 2504629, 2484336, 2467734]
53242B467734j4250j1604q051m662j897J044M259O836Q845J1421J4352J6033J6478
53229B506538J8035K1910K6281K9157L1133L3579L5967L7197L8242M1106M5561
53218B864706M9102N0258N0011M9647M8802M6680M4024M2486M2260M1568L8732
53207C368276L4053K9101K4856K1329J8543J6681J5106J2507Q442L889l63m809
53195C547611r904j4616j7649j9457k1751k5128k8543l1193l3698l6993m0958
53184C267721m4643m7365m9116n0236n0927n1155n0952n0746n1036n1621n1607
53173B718317n0410m8452m6659m5678m5533m5419m3873m0237l6231l4797l6692
53162B244336l9344l9793l7679l4579l1725k9590k8520k8135k6917k3915k0377
$$ y = [2467734, 2453484, 2441880, 2433829, 2429167, 2427270, 2428314, 2432573, 2439409, 2448254, 2459675, 2474027, 2490060, 2506538, 2524573, 2546483, 2572764, 2601921, 2633054, 2666633, 2702600, 2739797, 2778039, 2819145, 2864706, 2913808, 2964066, 3014077, 3063724, 3112526, 3159206, 3203230, 3245716, 3287976, 3329544, 3368276, 3402329, 3431430, 3456286, 3477615, 3496158, 3512839, 3527945, 3540452, 3548894, 3552783, 3552420, 3547611, 3537707, 3523091, 3505442, 3485985, 3464234, 3439106, 3410563, 3379370, 3345672, 3308679, 3267721, 3223078, 3175713, 3126597, 3076361, 3025434, 2974279, 2923327, 2872581, 2821545, 2769924, 2718317, 2667907, 2619455, 2572796, 2527118, 2481585, 2436166, 2392293, 2352056, 2315825, 2281028, 2244336, 2204992, 2165199, 2127520, 2092941, 2061216, 2031626, 2003106, 1974971, 1948054, 1924139, 1903762]
53151A903762j8319j8016j8257j8393j8577j8598j8149j7947j8830k0081k0257
53140A698338j9514j9366k0169k0763k0668k0822k1698k2441k2507k2633k3423
53129A464334k4310k4702k4920k5346k5697k5854k6412k7573k8562k8830k8947
53118A173181k9503k9951k9538k8698k8376k8465k7968k6582k5134k4232k3334
53107H71400k1647j9521j8239j8454j9362j9736j9335j8740j8085j6890j5198
53096F66193j3908j3461j3132j2203j1134j0785j1106j1447j1544j1374j0581
53085E35518q995p434o988p655q431q567q044p132o178n578n385n227n063n352
53071D39489n975n767l987j552M7L60k49j489k776l058k209j647k266k779j785
$$ y = [1903762, 1885443, 1867427, 1849170, 1830777, 1812200, 1793602, 1775453, 1757506, 1738676, 1718595, 1698338, 1678824, 1659458, 1639289, 1618526, 1597858, 1577036, 1555338, 1532897, 1510390, 1487757, 1464334, 1440024, 1415322, 1390402, 1365056, 1339359, 1313505, 1287093, 1259520, 1230958, 1202128, 1173181, 1143678, 1113727, 1084189, 1055491, 1027115, 998650, 970682, 944100, 918966, 894734, 871400, 849753, 830232, 811993, 793539, 774177, 754441, 735106, 716366, 698281, 681391, 666193, 652285, 638824, 625692, 613489, 602355, 591570, 580464, 569017, 557473, 546099, 535518, 526523, 519089, 512101, 504446, 496015, 487448, 479404, 472272, 466094, 460516, 455131, 449904, 444841, 439489, 433514, 427747, 423760, 422208, 422255, 422615, 422366, 420877, 418101, 415043, 412834, 411187, 408921, 406142, 404357]
53056D04357l25l10j172n29K048M267M360L027J835J417J801K802L714L839L551
53041D34682L627L624K504P54oL66J59j588l948n952p672q890q632o883n119m383
53025C92643m316m696o157q292q965o938l958k695l508m539m331l217k534l303
53011C25194n299o965o803n084l433k557j634k55M57n25k503m006m423l897k609
52996B75658j005O3K98M02Q21R02jj269j768j348q22q54j428k123k437k224j997
52979B60868k375l134l368k707j693r69p79j205j972k172j150K98O92j82j195
52964B38957j618j654j384o77j97q37j988k143j422j613l134l989k709n12O19
52949B15699N72N49J155K095K763K374N34j595j980k21J807K368J590M53l38J30
$$ y = [404357, 404032, 403722, 402550, 402021, 404069, 408336, 412696, 415723, 417558, 418975, 420776, 423578, 427292, 431131, 434682, 438309, 441933, 444437, 445191, 445185, 445551, 445710, 444122, 440174, 434222, 426550, 417660, 409028, 402145, 397026, 392643, 388327, 383631, 377474, 369182, 360217, 353279, 349321, 346626, 343118, 338579, 334248, 331031, 328497, 325194, 319895, 312930, 306127, 301043, 297610, 295053, 293419, 293164, 293621, 293096, 290593, 286587, 282164, 278267, 275658, 274653, 274716, 275014, 275416, 276237, 277139, 277138, 275869, 274101, 272753, 271931, 271077, 269649, 267526, 265089, 262865, 260868, 258493, 255359, 251991, 249284, 247591, 246622, 245843, 244638, 242666, 240494, 239344, 239642, 240334, 240152, 238957, 237339, 235685, 234301, 233624, 233427, 232590, 230602, 228459, 227037, 225424, 222290, 218301, 215592, 215080, 215699, 216271, 216820, 217975, 220070, 222833, 225207, 225741, 224146, 222166, 221945, 223752, 226120, 227710, 228163, 227825, 227955]
52933B27955K476N229N583L086N67J12L41o77j971j445N76K039K297K197J978
52918B50343J262N41O22J081R93O84R90J465J085K92N83K285M299N742O482O458
52902B85207N784N116M823M384L640L681N142O734P010O493O351O003M283J977
52888C56628Q71Q09J52j136j354r0R15L10j390l159m513m972m190k949k491k763
52872C30678k823k779l411l984k822l88O66n75j677n47J345J204r74k614k223
52857C09076r77o47j350j788j027M77J485J299L76l25k68N08J522J924J085m03
52841C10967j025k84M89Q2q20r14l60j44k09M3J40o86j535q31Q64J384M39J62
52823C07762J577K789K000L61K43J884L341L109J454l61j185n34J168K964M116
$$ y = [227955, 230431, 235660, 241243, 244329, 244896, 245008, 245349, 244672, 242701, 241256, 241832, 243871, 246168, 248365, 250343, 251605, 252146, 252768, 253849, 254842, 255526, 256516, 257981, 259066, 259358, 259941, 262226, 266525, 272267, 278749, 285207, 290991, 296107, 300930, 305314, 308954, 312635, 317777, 324511, 331521, 338014, 344365, 350368, 354651, 356628, 357499, 358308, 358460, 357324, 355970, 355880, 356795, 357105, 355715, 352556, 348043, 343071, 338881, 335932, 333441, 330678, 327855, 325076, 321665, 317681, 314859, 314471, 315137, 314562, 312885, 312338, 313683, 314887, 313913, 311299, 309076, 308099, 307452, 306102, 304314, 303287, 303764, 305249, 306548, 306924, 306599, 306331, 306839, 308361, 310285, 311370, 310967, 309942, 309658, 310147, 310229, 309409, 308495, 308135, 307991, 307782, 307825, 307965, 307279, 305744, 304913, 305777, 307161, 307600, 307762, 309339, 312128, 314128, 314489, 314732, 316616, 319957, 323066, 324520, 324159, 322974, 322440, 323608, 326572, 330688]
52808C30688M290L248J195o40q51L90J501J631J527J871J929P40j226k458k020
52793C41815k51J656K449J703K95l95J04J207K390L600M546M688M241M231N095
52778C77374O091O430O221N924N659N522N688N748M741K420j22j649k055k077
52764D25915k332l039m158n345o091o233o041n756n466n353n454n323m550l605
52750C57169l309l563l567l229l369m360n510o067n926n248m186l178k647k353
52736C00657j853j498j905k685k916k786l229l981l687k317j637k667m250m913
52722B60333m582l675k156n39k30j621l107l307k987l426m044l351j416K26O73
52707B26791K44n32j284j447q50l32p97j836k213j443j28Q42P37q46l305n061
$$ y = [330688, 334978, 338226, 339421, 338781, 337930, 338320, 339821, 341452, 342979, 344850, 346779, 347519, 346293, 343835, 341815, 341564, 343220, 345669, 347372, 347667, 347272, 347376, 348583, 350973, 354573, 359119, 363807, 368048, 372279, 377374, 383465, 389895, 396116, 402040, 407699, 413221, 418909, 424657, 429398, 431818, 431696, 430047, 427992, 425915, 423583, 420544, 416386, 411041, 404950, 398717, 392676, 386920, 381454, 376101, 370647, 365324, 360774, 357169, 353860, 350297, 346730, 343501, 340132, 335772, 330262, 324195, 318269, 313021, 308835, 305657, 303010, 300657, 298804, 297306, 295401, 292716, 289800, 287014, 283785, 279804, 276117, 273800, 272163, 269496, 265246, 260333, 255751, 252076, 249920, 249381, 249151, 247530, 244423, 241116, 238129, 234703, 230659, 227308, 225892, 226118, 226791, 227035, 226503, 225219, 223772, 222922, 222590, 221793, 219957, 217744, 216301, 216173, 217015, 217752, 216906, 213601, 208540]
52691B08540n033l740k360j478j373k447m287n270m382k757k080k372k673l002
52677A65286l807m198k829l53J056O87r8l58o61j188q81N94J755J402M24L15R10
52660A58056R75K46m22n39m79o31r49j240j232n74P39K077K799K849K282P41j803
52643A62895m095m460k721m43R74J643K284K855K831K541L041M520N564M700K358
52628A84487P03J476M313P218Q378P423N332L366K054J103J78n00o40o13j138
52613B23140k211k999k972k580k525k864l214l411l523l589l739m229m908n021
52599A75355m084k609j544j272j656k612l868m503l697j990r52j379k453k893
52585A39843k358j435q54r65j441j245M48K931M145K863K90j255r45K1L47J71
$$ y = [208540, 203507, 199767, 197407, 195929, 194556, 192109, 187822, 182552, 178170, 175413, 173333, 170961, 168288, 165286, 161479, 157281, 154452, 154099, 155155, 155842, 155744, 155386, 154725, 153537, 152656, 153250, 155005, 156407, 156831, 157146, 158056, 159031, 159277, 158855, 158316, 157837, 157206, 156257, 155017, 153785, 153211, 153950, 156027, 158826, 161675, 163957, 164698, 162895, 158800, 154340, 151619, 151176, 152150, 153793, 156077, 158932, 161763, 164304, 167345, 171865, 177429, 182129, 184487, 185190, 186666, 190979, 198197, 206575, 213998, 219330, 222696, 224750, 225853, 226031, 225531, 224891, 224278, 223140, 220929, 217930, 214958, 212378, 209853, 206989, 203775, 200364, 196841, 193252, 189513, 185284, 180376, 175355, 171271, 168662, 167118, 165846, 164190, 161578, 157710, 153207, 149510, 147520, 146568, 145189, 142736, 139843, 137485, 136050, 135196, 134231, 132790, 131545, 131993, 134924, 139069, 141932, 142222, 140967, 140022, 140043, 140390, 140561]
52569A40561L76J197K051K388K142J619J245J252J296O83n60j325p62L12K79j046
52553A51708k153k014j410j433j707j158J10R59J011J086J692K137J580K80o39
52538A50049l94P78J946K406K362K549K964K597Q86j034j493m10P31R46P77J119
52522A66779K044K993L364K757J506R38K066L866M160K554J129J477K547K540
52508B00720J699J686K848L823L699L132L109L565L689K998J893J349J968L026
52494B39204K988J331n90j138k93P12J160J341J580J837K138K489K471J704O77
52479B57611L39Q50J502J748J551Q76k17j005o54N85J621K055K457L095L475L442
52463B79331L437L363K399N83o98o27j85m50r18p28n12j264k114j319P33J574
$$ y = [140561, 140937, 142134, 144185, 146573, 148715, 150334, 151579, 152831, 154127, 154810, 154250, 152925, 152163, 152475, 152754, 151708, 149555, 147541, 146131, 144698, 142991, 141833, 141943, 142902, 143913, 144999, 146691, 148828, 150408, 150688, 150049, 149655, 150433, 152379, 154785, 157147, 159696, 162660, 165257, 166143, 165109, 163616, 163206, 163937, 164883, 165660, 166779, 168823, 171816, 175180, 177937, 179443, 180381, 182447, 186313, 190473, 193027, 194156, 195633, 198180, 200720, 202419, 204105, 206953, 210776, 214475, 217607, 220716, 224281, 227970, 230968, 232861, 234210, 236178, 239204, 242192, 243523, 242933, 241795, 241502, 242214, 243374, 244715, 246295, 248132, 250270, 252759, 255230, 256934, 257611, 257950, 258800, 260302, 262050, 263601, 264477, 264260, 263255, 262601, 263186, 264807, 266862, 269319, 272414, 275889, 279331, 282768, 286131, 288530, 289113, 288415, 287788, 287603, 287153, 286235, 285507, 284995, 283731, 281617, 280298, 281031, 282605]
52447B82605J25j795k143j289q63j308j839j960j723j093j94K97L6k12K28N81
52431B69453j32j084n31J353K468J905J215J856L045L353K918K647K305J156j51
52416B91776o1J616L297L603K659J386N85P43J739K604K451J769J863K876L386
52401C22292K288K11j331j546p24L58R78Q36L12J07N19J343K332L300L849L632
52385C38756K891K111J303L63o3R14K920M291L901K189K09j445k430k320j119
52370C52471N45K086L220L520K658J337R64J797K475J928P62J2m61j284k085j916
52354C68029q46o5n11k026l699m472l770k167j090j253j746j297lR31Q77M18L93
$$ y = [282605, 282730, 280935, 278792, 277503, 276640, 275332, 273493, 271533, 269810, 268717, 268523, 268820, 268856, 268644, 268872, 269453, 269321, 268237, 267706, 269059, 271527, 273432, 274647, 276503, 279548, 282901, 285819, 288466, 290771, 291927, 291776, 291715, 293331, 296628, 300231, 302890, 304276, 304861, 305604, 307343, 309947, 312398, 314167, 316030, 318906, 322292, 324580, 324791, 323460, 321914, 321190, 321548, 322526, 323362, 323674, 323781, 324300, 325643, 327975, 331275, 335124, 338756, 341647, 343758, 345061, 345424, 345361, 346275, 349195, 353486, 357387, 359576, 359785, 358340, 355910, 353590, 352471, 353016, 355102, 358322, 361842, 364500, 365837, 366801, 368598, 371073, 373001, 373763, 373775, 373314, 372030, 369945, 368029, 367183, 367118, 366607, 364581, 360882, 356410, 352640, 350473, 349383, 348130, 346384, 345087, 345084, 346015, 346892, 347310, 347703]
$$ [...]
##END NTUPLES=NMR SPECTRUM
##END=
