##TITLE=coffee_type TOLI01
COFFEE_meoh_noesyp64 COFFEE_meoh {C:\Bruker\TOPSPIN} Administrator 14
##JCAMPDX= 6.0         $$ Bruker NMR JCAMP-DX V2.0
##DATA TYPE= NMR SPECTRUM
##DATA CLASS= NTUPLES
##ORIGIN= Bruker BioSpin GmbH
##OWNER= Administrator
$$ 1.72 TOPSPIN		Version 2.1
$$ 2012-05-18 15:45:58.604 -0700  Administrator@X
$$ Compression mode = diff/dup
##.OBSERVE FREQUENCY= 400.13188235
##.OBSERVE NUCLEUS= ^1H
##.ACQUISITION MODE= SIMULTANEOUS (DQD)
##.ACQUISITION SCHEME= undefined
##.AVERAGES= 64
##.DIGITISER RES= 22
##SPECTROMETER/DATA SYSTEM= spect
##.PULSE SEQUENCE= noesygpps1d.comp
##.SOLVENT NAME= COFFEE_meoh
##.SHIFT REFERENCE= INTERNAL, COFFEE_meoh, 1, 14.98061
##AUDIT TRAIL= $$ (NUMBER, WHEN, WHO, WHERE, PROCESS, VERSION, WHAT)
$$ ##TITLE= Audit trail, TOPSPIN		Version 2.1
$$ ##JCAMPDX= 5.01
$$ ##ORIGIN= Bruker BioSpin GmbH
$$ ##OWNER= Administrator
$$ $$ C:\Bruker\TOPSPIN/data/Administrator/nmr/12-COFFEE-2302/152/pdata/1/auditp.txt
$$ ##AUDIT TRAIL=  $$ (NUMBER, WHEN, WHO, WHERE, PROCESS, VERSION, WHAT)
(   1,<2012-02-24 00:19:51.516 -0500>,<Administrator>,<TOPSPIN>,<go>,<TOPSPIN 2.1>,
      <created by zg
	started at 2012-02-24 00:08:21.281 -0500,
	POWCHK enabled, PULCHK disabled,
       configuration hash MD5:
       B0 76 FB 9C 50 81 44 7D 18 B3 26 32 4E 60 AD 96
       data hash MD5: 64K
       4C A5 6A BE 0C 8E 15 A5 B9 68 82 E0 0F C9 18 0B>)
(   2,<2012-02-24 00:19:54.203 -0500>,<Administrator>,<TOPSPIN>,<proc1d>,<TOPSPIN 2.1>,
      <Start of raw data processing
       efp LB = 0.3 FT_mod = 6 PKNL = 1 PHC0 = 0 PHC1 = 0 SI = 128K 
       data hash MD5: 128K
       66 A7 B9 EE F8 97 12 22 A2 FD A4 34 F5 BD D6 8A>)
(   3,<2012-02-24 00:19:55.734 -0500>,<Administrator>,<TOPSPIN>,<proc1d>,<TOPSPIN 2.1>,
      <pk PHC0 = 23.51074 PHC1 = 0 
       data hash MD5: 128K
       1F 9D 83 9E 9C A1 04 E5 88 B7 15 F2 95 5E B6 3C>)
(   4,<2012-02-24 00:19:55.984 -0500>,<Administrator>,<TOPSPIN>,<proc1d>,<TOPSPIN 2.1>,
      <abs ABSG = 1 
       data hash MD5: 128K
       15 25 26 52 4D F8 56 A7 BE 3D 7D DE C6 92 2B 6D>)
(   5,<2012-02-24 00:19:56.062 -0500>,<Administrator>,<TOPSPIN>,<proc1d>,<TOPSPIN 2.1>,
      <abs ABSG = 2 
       data hash MD5: 128K
       7E AD 86 C5 D2 D2 A4 3A A6 9A 59 E2 57 54 0F D1>)
(   6,<2012-02-24 00:19:56.109 -0500>,<Administrator>,<TOPSPIN>,<proc1d>,<TOPSPIN 2.1>,
      <abs ABSG = 3 
       data hash MD5: 128K
       8C B4 FE 9F 97 E6 1F BD A7 59 2B 9C C1 E2 D9 AD>)
(   7,<2012-02-24 00:19:56.312 -0500>,<Administrator>,<TOPSPIN>,<proc1d>,<TOPSPIN 2.1>,
      <abs ABSG = 4 
       data hash MD5: 128K
       21 C5 6E C0 55 EF BB 1D B7 E9 C4 2A 91 07 33 E0>)
(   8,<2012-02-24 00:19:56.453 -0500>,<Administrator>,<TOPSPIN>,<proc1d>,<TOPSPIN 2.1>,
      <abs ABSG = 5 
       data hash MD5: 128K
       4D 83 DD A3 38 AE C6 5D 46 3E 93 01 79 2C 0F 1B>)
(   9,<2012-02-24 00:19:56.562 -0500>,<Administrator>,<TOPSPIN>,<audit>,<TOPSPIN 2.1>,
      <user comment:
       ICON-NMR User ID: Administrator
$$ [...]
150 150 150 150 150 150 150 150
##$TP07= 0
##$TPNAME0= <>
##$TPNAME1= <>
##$TPNAME2= <>
##$TPNAME3= <>
##$TPNAME4= <>
##$TPNAME5= <>
##$TPNAME6= <>
##$TPNAME7= <>
##$TPOAL= (0..7)
0.5 0.5 0.5 0.5 0.5 0.5 0.5 0.5
##$TPOFFS= (0..7)
0 0 0 0 0 0 0 0
##$TUNHIN= 0
##$TUNHOUT= 0
##$TUNXOUT= 0
##$USERA1= <user>
##$USERA2= <user>
##$USERA3= <user>
##$USERA4= <user>
##$USERA5= <user>
##$V9= 5
##$VALIST= <valist>
##$VCLIST= <CCCCCCCCCCCCCCC>
##$VD= 0
##$VDLIST= <DDDDDDDDDDDDDDD>
##$VPLIST= <PPPPPPPPPPPPPPP>
##$VTLIST= <TTTTTTTTTTTTTTT>
##$WBST= 1024
##$WBSW= 4
##$XGAIN= (0..3)
0 0 0 0
##$XL= 0
##$YL= 0
##$YMAX_a= 15193459
##$YMIN_a= -6861894
##$ZGOPTNS= <>
##$ZL1= 120
##$ZL2= 120
##$ZL3= 120
##$ZL4= 120
##$ABSF1= 14.98061
##$ABSF2= -5.57192
##$ABSG= 5
##$ABSL= 3
##$ALPHA= 0
##$AQORDER= 0
##$ASSFAC= 0
##$ASSFACI= 0
##$ASSFACX= 0
##$ASSWID= 0
##$AUNMP= <proc_prof1d_extract>
##$AXLEFT= 0
##$AXNAME= <>
##$AXNUC= <1H>
##$AXRIGHT= 0
##$AXTYPE= 0
##$AXUNIT= <>
##$AZFE= 0.1
##$AZFW= 0.1
##$BCFW= 0
##$BC_mod= 0
##$BYTORDP= 0
##$COROFFS= 0
##$CY= 15
##$DATMOD= 1
##$DC= 0
##$DFILT= <>
##$DTYPP= 0
##$F1P= 0
##$F2P= 0
##$FCOR= 0.5
##$FTSIZE= 131072
##$FT_mod= 6
##$GAMMA= 0
##$GB= 0
##$INTBC= 1
##$INTSCL= 1
##$ISEN= 128
##$LB= 0.3
##$LEV0= 0
##$LPBIN= 0
##$MAXI= 10000
##$MC2= 0
##$MEAN= 0
##$ME_mod= 0
##$MI= 0
##$NCOEF= 0
##$NC_proc= -3
##$NLEV= 6
##$NOISF1= 0
##$NOISF2= 0
##$NSP= 0
##$NTH_PI= 0
##$NZP= 0
##$OFFSET= 14.98061
##$PC= 1
##$PHC0= 23.51074
##$PHC1= 0
##$PH_mod= 1
##$PKNL= yes
##$PPARMOD= 0
##$PPDIAG= 0
##$PPIPTYP= 0
##$PPMPNUM= 2147483647
##$PPRESOL= 1
##$PSCAL= 4
##$PSIGN= 0
##$PYNMP= <proc.py>
##$REVERSE= no
##$SF= 400.13
##$SI= 131072
##$SIGF1= 0
##$SIGF2= 0
##$SINO= 400
##$SIOLD= 131072
##$SPECTYP= <>
##$SREGLST= <1H.CDCl3>
##$SSB= 0
##$STSI= 131072
##$STSR= 0
##$SW_p= 8223.68421052632
##$SYMM= 0
##$S_DEV= 0
##$TDeff= 65536
##$TDoff= 0
##$TI= <>
##$TILT= no
##$TM1= 0
##$TM2= 0
##$TOPLEV= 0
##$USERP1= <user>
##$USERP2= <user>
##$USERP3= <user>
##$USERP4= <user>
##$USERP5= <user>
##$WDW= 1
##$XDIM= 131072
##$YMAX_p= 528109600
##$YMIN_p= -171475824
##$CURPLOT= <Network HP LaserJet P1505>
##$CURPRIN= <$Network HP LaserJet P1505>
##$DFORMAT= <normdp>
##$LAYOUT= <+/1D_H.xwp>
##$LFORMAT= <normlp>
##$PFORMAT= <normpl>
##$SURQMSG= 1
$$ End of Bruker specific parameters
$$ ---------------------------------
##NTUPLES= NMR SPECTRUM
##VAR_NAME=  FREQUENCY,     SPECTRUM/REAL,   SPECTRUM/IMAG
##SYMBOL=    X,             R,               I
##VAR_TYPE=  INDEPENDENT,   DEPENDENT,       DEPENDENT
##VAR_FORM=  AFFN,          ASDF,            ASDF
##VAR_DIM=   131072,        131072,          131072
##UNITS=     HZ,            ARBITRARY UNITS, ARBITRARY UNITS
##FACTOR=    0.0627417313425165, 1,          1
##FIRST=     8223.62146879498, -118,         -92045
##LAST=      0,             3169,            -93570
##MIN=       0,             -171475824,      0
##MAX=       8223.62146879498, 528109600,    0
$$ Real data points
##PAGE= N=1
##DATA TABLE= (X++(R..R)), XYDATA
$$ [...]
60654A489540k485j799j145j138j674k312k754l171l957m979n432m849l663k318
60640A447864n97J449K647J980L10n04j22j94k100n341q484j0882j2900j4983
60626A398143j7152j9188k0902k2115k2519k1823k0222j8621j7903j7974j7953
60615A181771j7367j6480j5175j2600q561m596k545k364k338j255N99K489M202
60602A105780N604O226N919N410N484N927N889N261M920N386N893N468M635N026
60588A182828P140R424J0168R548Q896Q681Q452Q431R500J1419J2430J1438R578
60575A307933Q884J0084J2335J4525J6114J7178J8209J9650K1413K3124K4809
60564A494258K6515K7355K6155K3333K0787J9235J7171J3438R424P037N628L016
$$ y = [1489540, 1487055, 1485256, 1484111, 1482973, 1481299, 1478987, 1476233, 1473062, 1469105, 1464126, 1458694, 1453845, 1450182, 1447864, 1447267, 1448716, 1451363, 1453343, 1453653, 1453149, 1453027, 1452833, 1450733, 1445392, 1436908, 1426026, 1413126, 1398143, 1380991, 1361803, 1340901, 1318786, 1296267, 1274444, 1254222, 1235601, 1217698, 1199724, 1181771, 1164404, 1147924, 1132749, 1120149, 1111588, 1106992, 1104447, 1102083, 1099745, 1098490, 1099089, 1101578, 1105780, 1111384, 1117610, 1123529, 1128939, 1134423, 1140350, 1146239, 1151500, 1156420, 1161806, 1167699, 1173167, 1177802, 1182828, 1189968, 1199392, 1209560, 1219108, 1228004, 1236685, 1245137, 1253568, 1263068, 1274487, 1286917, 1298355, 1307933, 1316817, 1326901, 1339236, 1353761, 1369875, 1387053, 1405262, 1424912, 1446325, 1469449, 1494258, 1520773, 1548128, 1574283, 1597616, 1618403, 1637638, 1654809, 1668247, 1677671, 1684708, 1690336, 1693352]
60552A693352r58m079n116n489o805q375q532p393o930q399j0851j2462j2706
60539A595257j2667j3433j4708j5332j4807j3650j2369j0819r002p703p667q377
60527A454723q347o538l198N06L301M614N022N629O608O830N487L495K462K572
60513A483166K579J792R46Q17J093J245J710L265N554P146P050N645L942K567
60499A528517J649J189J051P47j00j124j502j018l57j52j58L93J993M731Q356
60484A544215J2158J5257J7599K0130K3512K7332L1267L6115M2513M9324N4791
60473A874213N8843O2509O5060O3728N6850M5775L2954J9588N984p091j8557k7602
60461B232254l3304l4612l1728k6706k1663j6863j1406n129J037O276J0543J4288
$$ y = [1693352, 1692394, 1688315, 1683199, 1677710, 1670905, 1662530, 1653998, 1646605, 1639675, 1631276, 1620425, 1607963, 1595257, 1582590, 1569157, 1554449, 1539117, 1524310, 1510660, 1498291, 1487472, 1478470, 1470767, 1463100, 1454723, 1446376, 1439838, 1436640, 1437146, 1440447, 1445061, 1450083, 1455712, 1462320, 1469150, 1474637, 1478132, 1480594, 1483166, 1485745, 1487537, 1488483, 1489300, 1490393, 1491638, 1493348, 1496613, 1502167, 1509313, 1516363, 1522008, 1525950, 1528517, 1530166, 1531355, 1532406, 1533153, 1533053, 1531929, 1530427, 1529409, 1529052, 1528900, 1528742, 1529135, 1531128, 1535859, 1544215, 1556373, 1571630, 1589229, 1609359, 1632871, 1660203, 1691470, 1727585, 1770098, 1819422, 1874213, 1933056, 1995565, 2060625, 2124353, 2181203, 2226978, 2259932, 2279520, 2285504, 2278413, 2259856, 2232254, 2198950, 2164338, 2132610, 2105904, 2084241, 2067378, 2055972, 2050843, 2051880, 2058156, 2068699, 2082987]
60449B082987J8005K1756K4937K6982K8510L0942L4828L9437M4216M9573N5842
60438B458015O2819P0746Q0410R1567J02734J13349J24715J37805J51685J65189
60428C559034J78556J92096K04957K17042K30603K47915K68615K91471L17214
60419E707503L46626L76262L98726M06966L96084L61813L01016K15095J10795
60410H620886l113j18266k25788l16259l83016m24879m44778m46849m35362m14700
60400E407876l88709l60201l31379l03722k77143k50591k24279k00297j80219
60391B891336j63131j46906j30853j16273j04735r6286q9120q1048p1775o3393
60381A827816n7827n4172m9823m4003l8587l5221l3348l1528k9295k6890k4471
$$ y = [2082987, 2100992, 2122748, 2147685, 2174667, 2203177, 2234119, 2268947, 2308384, 2352600, 2402173, 2458015, 2520834, 2591580, 2671990, 2763557, 2866291, 2979640, 3104355, 3242160, 3393845, 3559034, 3737590, 3929686, 4134643, 4351685, 4582288, 4830203, 5098818, 5390289, 5707503, 6054129, 6430391, 6829117, 7236083, 7632167, 7993980, 8294996, 8510091, 8620886, 8617773, 8499507, 8273719, 7957460, 7574444, 7149565, 6704787, 6257938, 5822576, 5407876, 5019167, 4658966, 4327587, 4023865, 3746722, 3496131, 3271852, 3071555, 2891336, 2728205, 2581299, 2450446, 2334173, 2229438, 2133152, 2044032, 1962984, 1891209, 1827816, 1769989, 1715817, 1665994, 1621991, 1583404, 1548183, 1514835, 1483307, 1454012, 1427122, 1402651]
60370A402651k2399k1205k0605j9546j7762j6198j5319j4288j2517j0748r641
60359A222423q556o762m782l438k538j672j286j603j347Q42M079N791M645J945
60345A207741J35N92K684M340L843J737N32J908M694O421O290N613N683O472P309
60330A265994P796P764P229O610O529P076P605P298N720L080K51j735k654l338
60316A325225m588o115o937o568n287l553j774m83j48p11j587k090j736l61J623
60301A284910L367M222M261L970L763L989M944O526Q102R104R490R465R082Q508
60287A373703Q310R052J0615J2160J2684J1741R909Q508Q378Q882Q625P090M949
60274A494606K836P86r96j785j248J28J907M106O297P347O785N545M573L660K448
$$ y = [1402651, 1380252, 1359047, 1338442, 1318896, 1301134, 1284936, 1269617, 1255329, 1242812, 1232064, 1222423, 1213867, 1207105, 1202323, 1198885, 1196347, 1194675, 1193389, 1191786, 1190439, 1191281, 1195360, 1201151, 1205796, 1207741, 1207876, 1208468, 1211152, 1215492, 1219335, 1221072, 1221604, 1223512, 1228206, 1234627, 1240917, 1246530, 1252213, 1258685, 1265994, 1273790, 1281554, 1288783, 1295393, 1301922, 1308998, 1316603, 1323901, 1329621, 1332701, 1332952, 1331217, 1328563, 1325225, 1320637, 1314522, 1307585, 1301017, 1295730, 1292177, 1290403, 1289920, 1289772, 1289061, 1287474, 1285384, 1283648, 1283287, 1284910, 1288277, 1292499, 1296760, 1300730, 1304493, 1308482, 1313426, 1319952, 1328054, 1337158, 1346648, 1356113, 1365195, 1373703, 1382013, 1391065, 1401680, 1413840, 1426524, 1438265, 1448174, 1456682, 1465060, 1473942, 1482567, 1489657, 1494606, 1497442, 1498228, 1497232, 1495447, 1494199, 1494327, 1496234, 1500340, 1506637, 1513984, 1520769, 1526314, 1530887, 1534547, 1536995]
60259A536995J603J765K066R61j738m734o836p749p709p293p290p738p481n681
60245A479141l378k501l495m987n596m997l410j305L48P71M52O97J984L653N105
60230A462482O186O477N429L497J984J516J735K624M817Q099J0896J2081J2278
60217A540101J2682J3399J3835J3766J3248J2208J1068J1183J3454J6940J9801
60206A691685K1382K2491K3828K5300K6898K9258L2782L6807M0275M2956M5699
60195B039361M9346N3675N7637O0785O4072O8797P4953Q1434Q7899R5376J04457
60184B837792J13894J22066J29215J37016J46126J55376J63489J70323J76015
60175D151312J79906J81146J79748J76284J70843J62860J51931J38295J22609
$$ y = [1536995, 1538598, 1540363, 1542429, 1543390, 1541652, 1536918, 1530082, 1522333, 1514624, 1507331, 1500041, 1492303, 1484822, 1479141, 1475763, 1473262, 1469767, 1464780, 1459184, 1454187, 1450777, 1449472, 1449820, 1450591, 1451043, 1451740, 1453724, 1457377, 1462482, 1468668, 1475145, 1480574, 1484071, 1486055, 1487571, 1489306, 1491930, 1496747, 1504846, 1515742, 1527823, 1540101, 1552783, 1566182, 1580017, 1593783, 1607031, 1619239, 1630307, 1641490, 1654944, 1671884, 1691685, 1713067, 1735558, 1759386, 1784686, 1811584, 1840842, 1873624, 1910431, 1950706, 1993662, 2039361, 2088707, 2142382, 2200019, 2260804, 2324876, 2393673, 2468626, 2550060, 2637959, 2733335, 2837792, 2951686, 3073752, 3202967, 3339983, 3486109, 3641485, 3804974, 3975297, 4151312, 4331218, 4512364, 4692112, 4868396, 5039239, 5202099, 5354030, 5492325, 5614934]
60166E614934J05588Q7755O9382N0729L2445J5432L08j2674k3194l0988l6572
60155E873145m0851m3400m2090l5513k5218j4137l154R288K4174M0326N6348P2559
60143E871477Q9739J07102J22963J36692J48683J58717J65771J69318J69591J66596
60133G306649J59928J49568J35729J17850R5135O8518M0935J4877r438l2922n5552
60122G991277p6285r4142j08317j17728j21573j20240j14882j06170r4197p9377
60112F958366o2544m4044k3694j981J9448L9148N7241P4743R1519J05634J15059
60101G328895J19545J20260J17802J11496J00996Q7735P3716N9229M2952K4753
60091H187379P412n349j2211j5034j6259j6119j2525l525J0521K7371M5338O4757
$$ y = [5614934, 5720522, 5808277, 5877659, 5928388, 5960833, 5976265, 5976573, 5963899, 5940705, 5909717, 5873145, 5832294, 5788894, 5746804, 5711291, 5686073, 5671936, 5668782, 5678070, 5702244, 5742570, 5798918, 5871477, 5961216, 6068318, 6191281, 6327973, 6476656, 6635373, 6801144, 6970462, 7140053, 7306649, 7466577, 7616145, 7751874, 7869724, 7964859, 8033377, 8074312, 8089189, 8079751, 8046829, 7991277, 7914992, 7820850, 7712533, 7594805, 7473232, 7352992, 7238110, 7131940, 7037743, 6958366, 6895822, 6851778, 6828084, 6826103, 6845551, 6884699, 6941940, 7016683, 7108202, 7213836, 7328895, 7448440, 7568700, 7686502, 7797998, 7898994, 7986729, 8060445, 8119674, 8162626, 8187379, 8194791, 8189442, 8177231, 8162197, 8145938, 8129819, 8117294, 8113769, 8124290, 8151661, 8196999, 8261756]
60079H261756Q6846J11845J39069J68179J99152K31197K63206K95554L29976L66718
60069A0453498M03274M36990M67851M97170N24197N45857N59647N65259N63116
60060A5016859N52800N33523N05104M67814M21924L68023L07267K40839J69574
60051A8583727R4553J7651n9021j33982k06209k74157l35205l86342m25458m52163
60041A6423394m67231m71259m64144m46268m19712l87566l51884l12925k70402
60032A2832003k24963j78083j31167q5190m1117l05L5692O5837R0159J09096J21883
60021A2593845J26098J19750J03776Q1549N5863K7409l513l5170o5351r3289j19506
60010A2791461j44112j66490j86454k04521k20732k34141k43946k50364k53878
$$ y = [8261756, 8348602, 8460447, 8599516, 8767695, 8966847, 9198044, 9461250, 9756804, 10086780, 10453498, 10856772, 11293762, 11761613, 12258783, 12782980, 13328837, 13888484, 14453743, 15016859, 15569659, 16103182, 16608286, 17076100, 17498024, 17866047, 18173314, 18414153, 18583727, 18678280, 18695931, 18636910, 18502928, 18296719, 18022562, 17687357, 17301015, 16875557, 16423394, 15956163, 15484904, 15020760, 14574492, 14154780, 13767214, 13415330, 13102405, 12832003, 12607040, 12428957, 12297790, 12212600, 12171483, 12171178, 12206870, 12272707, 12362866, 12471962, 12593845, 12719943, 12839693, 12943469, 13025018, 13080881, 13108290, 13104777, 13069607, 13004256, 12910967, 12791461, 12647349, 12480859, 12294405, 12089884, 11869152, 11635011, 11391065, 11140701, 10886823]
60001A0886823k54100k50081k41453k28884k13381j95478j75076j51997j26844
59992I049529j01236p6698n3164k9065l407K2749M7442P0107R1799J13104J32642
59981I263802J48035J57723J61397J59169J51096J37440J18830R6001O9616M0336
59971A0503445Q837k4201n7775r0195j19416j43996j63700j78931j89680j95229
59961I349159j95061j89868j81273j70254j56171j37962j16234r3506p2068n2132
59951G984630l2475j2208Q909L1443N6275Q3179J10287J35621J58798J80755K01932
59940H907146K21259K36763K46769K50279K46570K35011K15676J89922J59931
59931A0909326J27403R2909N6663J9457j7624n4042q9618j23372j53102j76493
$$ y = [10886823, 10632723, 10382642, 10141189, 9912305, 9698924, 9503446, 9328370, 9176373, 9049529, 8948293, 8871595, 8818431, 8789366, 8785959, 8808708, 8856150, 8926257, 9018056, 9131160, 9263802, 9411837, 9569560, 9730957, 9890126, 10041222, 10178662, 10297492, 10393493, 10463109, 10503445, 10512282, 10488081, 10430306, 10340111, 10220695, 10076699, 9912999, 9734068, 9544388, 9349159, 9154098, 8964230, 8782957, 8612703, 8456532, 8318570, 8202336, 8108830, 8036762, 7984630, 7952155, 7939947, 7948856, 7980299, 8036574, 8119753, 8230040, 8365661, 8524459, 8705214, 8907146, 9128405, 9365168, 9611937, 9862216, 10108786, 10343797, 10559473, 10749395, 10909326, 11036729, 11129638, 11186301, 11205758, 11188134, 11134092, 11044474, 10921102, 10768000, 10591507]
59921A0591507j92432k01195k03613k00278j91446j77430j58957j37030j12484
59912I016642q5989n8545l1552n791J9367M5056P1119R5655J16697J34008J48936
59901I465603J62437J73529J79858J79891J74351J65324J54290J41611J27634
59892A0924528J13231R9067Q5412P3270O4597O0445N9728O0950O4603P2750Q6703
59881A1765284J06279J30908J60204J93628K30756K71657L15885L61555M06692
59872A3942848M50841M93569N31796N60860N78186N83504N75144N48973N02274
59863A8767995M36253L53193K53684J39262J6231j05917k19417l19795m03818
59854A8917671m68927n14966n44076n58101n57583n43645n19185m87358m49989
$$ y = [10591507, 10399075, 10197880, 9994267, 9793989, 9602543, 9425113, 9266156, 9129126, 9016642, 8930653, 8872108, 8840556, 8834765, 8854132, 8899188, 8970307, 9065962, 9182659, 9316667, 9465603, 9628040, 9801569, 9981427, 10161318, 10335669, 10500993, 10655283, 10796894, 10924528, 11037759, 11136826, 11222238, 11295508, 11360105, 11420550, 11480278, 11541228, 11605831, 11678581, 11765284, 11871563, 12002471, 12162675, 12356303, 12587059, 12858716, 13174601, 13536156, 13942848, 14393689, 14887258, 15419054, 15979914, 16558100, 17141604, 17716748, 18265721, 18767995, 19204248, 19557441, 19811125, 19950387, 19966618, 19860701, 19641284, 19321489, 18917671, 18448744, 17933778, 17389702, 16831601, 16274018, 15730373, 15211188, 14723830, 14273841]
59845A4273841m08113l63113l16441k68876k20779j72842j26094q1269l8265L748
59835A2281797M5459Q6129J23311J54282J77724J93656K01942K01468J90615J68058
59825A3824441J33241Q6871L1107l1068r6794j63473k28190k87533l38200l77850
59815A2552552m05726m22819m31092m32100m26343m13947l95688l73136l48163
59806H903538l22441k96891k71433k45862k21118j98814j79158j60492j41664
59797F865665j24033j10081j00689r4782r1078q8915q7548q5780q2666p7980p2054
59786E850059o5509n8963n2536m6025l9903l5627l4296l5516l8121m1548m5898
59775E356117n1171n7033o2816o7256o9032o8072o5478o1671n5854m8036l9907
$$ y = [14273841, 13865728, 13502615, 13186174, 12917298, 12696519, 12523677, 12397583, 12316314, 12278049, 12281797, 12327256, 12413385, 12536696, 12690978, 12868702, 13062358, 13264300, 13465768, 13656383, 13824441, 13957682, 14044553, 14075660, 14044592, 13947798, 13784325, 13556135, 13268602, 12930402, 12552552, 12146826, 11724007, 11292915, 10860815, 10434472, 10020525, 9624837, 9251701, 8903538, 8581097, 8284206, 8012773, 7766911, 7545793, 7346979, 7167821, 7007329, 6865665, 6741632, 6631551, 6530862, 6436080, 6345002, 6256087, 6168539, 6082759, 6000093, 5922113, 5850059, 5784550, 5725587, 5673051, 5627026, 5587123, 5551496, 5517200, 5481684, 5443563, 5402015, 5356117, 5304946, 5247913, 5185097, 5117841, 5048809, 4980737, 4915259, 4853588, 4797734, 4749698, 4709791]
59764D709791l2359k3757j2589m22J0042J8862K8125L7906M5878N1072N5339O0564
59752D948452O6819P3956Q2467R1555R8471J01239J00535R7666R2384Q4195P4325
59741E912064O4714N5810M7002L8545L1697K7245K5055K4869K6663L0472L6550
59730F320686M5377N7003P0796Q6320J03831J23426J44610J67406J93097K22699
59720G535251K55188K88420L21620L55969L92594M30667M67454M99296N21837
59711A1068296N29448N15078M71722L95722K89878J63890L1574r3061j98691k78261
59701A2895595l29675l55284l60085l49640l28648l00413k67005k30126j91753
59692A0182966j53754j17012q1564m7526j5183J5910M6969P8564J09667J38774
$$ y = [4709791, 4677432, 4653675, 4641086, 4640664, 4650706, 4669568, 4697693, 4735599, 4781477, 4832549, 4887888, 4948452, 5015271, 5089227, 5171694, 5263249, 5361720, 5462959, 5563494, 5661160, 5753544, 5837739, 5912064, 5976778, 6032588, 6079590, 6118135, 6149832, 6177077, 6202132, 6227001, 6253664, 6284136, 6320686, 6366063, 6423066, 6493862, 6580182, 6684013, 6807439, 6952049, 7119455, 7312552, 7535251, 7790439, 8078859, 8400479, 8756448, 9149042, 9579709, 10047163, 10546459, 11068296, 11597744, 12112822, 12584544, 12980266, 13270144, 13434034, 13465608, 13372547, 13173856, 12895595, 12565920, 12210636, 11850551, 11500911, 11172263, 10871850, 10604845, 10374719, 10182966, 10029212, 9912200, 9830636, 9783110, 9767927, 9783837, 9830806, 9909370, 10019037, 10157811]
59682A0157811J65848J92705K21429K52493K84544L16054L47054L79048M13355
59673A2730341M50180M89346N30921N74642O19795O66485P16066P68983Q23054
59664A8369813Q75320R24978R72618J016857J053618J079083J091628J090729
59656B6474644J075934J048042J010096R66498R22022Q81936Q51341Q33086Q26903
59647C4890502Q31225Q44866Q66152Q91158R13759R27239R25895R05990Q65747
59638D2862533Q04299P20990O16824M96408L67052K35721J08059r773j10536j88372
59628D5903205k40771k67633k69772k49114k08730j51376p8678P728J05432K12452
59618D4762743L27672M49198N73587O97828Q20723R40662J052714J149093J221606
$$ y = [10157811, 10323659, 10516364, 10737793, 10990286, 11274830, 11590884, 11937938, 12316986, 12730341, 13180521, 13669867, 14200788, 14775430, 15395225, 16061710, 16777776, 17546759, 18369813, 19245133, 20170111, 21142729, 22159586, 23213204, 24292287, 25383915, 26474644, 27550578, 28598620, 29608716, 30575214, 31497236, 32379172, 33230513, 34063599, 34890502, 35721727, 36566593, 37432745, 38323903, 39237662, 40164901, 41090796, 41996786, 42862533, 43666832, 44387822, 45004646, 45501054, 45868106, 46103827, 46211886, 46202113, 46091577, 45903205, 45662434, 45394801, 45125029, 44875915, 44667185, 44515809, 44437131, 44444859, 44550291, 44762743, 45090415, 45539613, 46113200, 46811028, 47631751, 48572413, 49625127, 50774220, 51995826]
59609E1995826J262504J263889J217899J117832R59266P41737M71049J59633j75743
59600E9013892n16133q40985j130111j368454j549381j672853j741626j760297
59592D8434052j736312j679565j600917j511644j422772j343442j280604j241061
59584C6617735j231264j252140j294780j343703j384434j407415j407415j383529
59576B5913055j339956j283580j219417j149570j075915j001208r27338q55084
59568A7060987p86106p22728o65094o10833n58607n09887m66215m26750l89954
59559A1924813l55851l25030k96808k70118k45213k22993k03441j86162j71791
59550I647406j61458j55155j51878j51066j52862j57040j62553j68098j72643
$$ y = [51995826, 53258330, 54522219, 55740118, 56857950, 57817216, 58558953, 59030002, 59189635, 59013892, 58497759, 57656774, 56526663, 55158209, 53608828, 51935975, 50194349, 48434052, 46697740, 45018175, 43417258, 41905614, 40482842, 39139400, 37858796, 36617735, 35386471, 34134331, 32839551, 31495848, 30111414, 28703999, 27296584, 25913055, 24573099, 23289519, 22070102, 20920532, 19844617, 18843409, 17916071, 17060987, 16274881, 15552153, 14887059, 14276226, 13717619, 13207732, 12741517, 12314767, 11924813, 11568962, 11243932, 10947124, 10677006, 10431793, 10208800, 10005359, 9819197, 9647406, 9485948, 9330793, 9178915, 9027849, 8874987, 8717947, 8555394, 8387296, 8214653]
59541H214653j75593j76936j76860j74910j70076j62296j53199j44447j35729
59532F744607j25309j12485r8633q5738p4481o3941n2761m0498k8122j7135p985
59521F037519N06R727J9456K8039L4512L9863M5574N1290N4936N5544N5175N7170
59509F489311O2783P0370P7889Q5086R2828J01426J10645J20813J32825J47104
59499G491080J63276J80772J99080K17595K36041K55027K75489K97420L19777
59490I635557L41704L63204L84446M04943M23622M39277M50702M56895M57499
59481A3357849M52852M43303M28649M08425L82919L53680L22716K90882K57341
59472A6698616K21227J83848J48564J18319R4018P5410O2513N5498N4180N8580
$$ y = [8214653, 8039060, 7862124, 7685264, 7510354, 7340278, 7177982, 7024783, 6880336, 6744607, 6619298, 6506813, 6408180, 6322442, 6247961, 6184020, 6131259, 6090761, 6062639, 6045504, 6037519, 6038025, 6047752, 6067208, 6095247, 6129759, 6169622, 6215196, 6266486, 6321422, 6376966, 6432141, 6489311, 6552094, 6622464, 6700353, 6785439, 6878267, 6979693, 7090338, 7211151, 7343976, 7491080, 7654356, 7835128, 8034208, 8251803, 8487844, 8742871, 9018360, 9315780, 9635557, 9977261, 10340465, 10724911, 11129854, 11553476, 11992753, 12443455, 12900350, 13357849, 13810701, 14254004, 14682653, 15091078, 15473997, 15827677, 16150393, 16441275, 16698616, 16919843, 17103691, 17252255, 17370574, 17464592, 17540002, 17602515, 17658013, 17712193, 17770773]
59462A7770773O9317Q6440J08189J31733J54483J73693J85478J85781J72266J44295
59452A9182448J01549M4237k5321j02933j84809k68434l50875m27722m94688n49482
59442A6923970n91367o19667o33646o33541o20952n98270n68096n32958m95021
59433A1630452m55772m15944l75745l35462k96174k59528k26257j95112j64078
59424H906380j32640j02154p3940m7675k1967M171L0854N7828Q4929J12170J39584
59413H957540J66887J93400K18530K42366K65349K87255L06767L22116L31828
59404A1292038L34816L29997L16012K91465K55645K09172J53691R0973K2791m8226
59394A3248374j18354j84167k43868k96783l41928l77757m03060m17713m22797
$$ y = [17770773, 17840090, 17926530, 18034719, 18166452, 18320935, 18494628, 18680106, 18865887, 19038153, 19182448, 19283997, 19328234, 19302913, 19199980, 19015171, 18746737, 18395862, 17968140, 17473452, 16923970, 16332603, 15712936, 15079290, 14445749, 13824797, 13226527, 12658431, 12125473, 11630452, 11174680, 10758736, 10382991, 10047529, 9751355, 9491827, 9265570, 9070458, 8906380, 8773740, 8671586, 8597646, 8549971, 8528004, 8532175, 8563029, 8620857, 8705786, 8817956, 8957540, 9124427, 9317827, 9536357, 9778723, 10044072, 10331327, 10638094, 10960210, 11292038, 11626854, 11956851, 12272863, 12564328, 12819973, 13029145, 13182836, 13273809, 13296600, 13248374, 13130020, 12945853, 12701985, 12405202, 12063274, 11685517, 11282457, 10864744, 10441947]
59385A0441947m20413m12853m01357l86000l67179l46516l25536l04306k82395
59376G195392k60547k40046k20829k01729j82545j64498j48355j33338j18354
59367E525151j03340q8899p5397o2878n1363m0677l0449k0505j1046k315N690
59356E043972J3175K0463K7880L5638M4069N3697O4037P2261P4659P0700O4579
59345E585130O1426O2943O8016P6130Q7644J01497J15632J30002J46319J63784
59335F598523J77764J84877J87884J93501K06070K25004K47809K73473L02497
59326H597402L35037L70322M07654M47285M89922N35674N83857O33739O84667
59317A3085559P35097P82203Q23154Q56248Q80052Q92041Q89165Q69743Q34311
$$ y = [10441947, 10021534, 9608681, 9207324, 8821324, 8454145, 8107629, 7782093, 7477787, 7195392, 6934845, 6694799, 6473970, 6272241, 6089696, 5925198, 5776843, 5643505, 5525151, 5421811, 5332912, 5257515, 5194637, 5143274, 5102597, 5072148, 5051643, 5040597, 5038282, 5043972, 5057147, 5077610, 5105490, 5141128, 5185197, 5238894, 5302931, 5375192, 5449851, 5520551, 5585130, 5646556, 5709499, 5777515, 5853645, 5941289, 6042786, 6158418, 6288420, 6434739, 6598523, 6776287, 6961164, 7149048, 7342549, 7548619, 7773623, 8021432, 8294905, 8597402, 8932439, 9302761, 9710415, 10157700, 10647622, 11183296, 11767153, 12400892, 13085559, 13820656, 14602859, 15426013, 16282261, 17162313, 18054354, 18943519, 19813262, 20647573]
59308B0647573P85237P26397O62409N96743N30625M64675M00876L41463K86237
59299B5442235K32646J78413J22669O4715L497o1575j30598k03592k79076l52319
59289B5017015m17419m71737n16673n53868n83115o04760o21578o36449o49677
59280A9961739o60082o67412o72109o73708o70900o62587o47981o26645n99360
59271A4080955n68149n34637m99356m63166m27822l93993l60120l24772k89047
59262A0219893k55281k24349j95688j69099j44773j22021r9542p6938n4831l3768
59252H843603j3918M396K0789L5163M7150N5721O0184O1197O0019N7213N2591
59241I284108M5784L6280K3734R085n483j8538l0346m0895m8364n1228n0920n0226
$$ y = [20647573, 21432810, 22159207, 22821616, 23418359, 23948984, 24413659, 24814535, 25155998, 25442235, 25674881, 25853294, 25975963, 26040678, 26044175, 25982600, 25852002, 25648410, 25369334, 25017015, 24599596, 24127859, 23611186, 23057318, 22474203, 21869443, 21247865, 20611416, 19961739, 19301657, 18634245, 17962136, 17288428, 16617528, 15954941, 15306960, 14680315, 14080955, 13512806, 12978169, 12478813, 12015647, 11587825, 11193832, 10833712, 10508940, 10219893, 9964612, 9740263, 9544575, 9375476, 9230703, 9108682, 9009140, 8932202, 8877371, 8843603, 8829685, 8834081, 8854870, 8890033, 8937183, 8992904, 9053088, 9114285, 9174304, 9231517, 9284108, 9329892, 9366172, 9389906, 9398991, 9393508, 9374970, 9344624, 9303729, 9255365, 9204137, 9153217, 9102991]
59229I102991m9301m5229l5712k1537n065J2187K9914M8323O7917Q9008J10776
59218I304272J31423J49945J67119J84043K00048K12777K20275K22402K20019
59209A1012323K13278K01093J82102J55644J21914Q2221L9734p49l5091o2077
59199A1910392q2868r8515j08940j14251j15848j15672j15135j14921j15106j15278
59189A0813858j15245j15651j17055j18681j19146j18337j17157j15393j11464
59180I765729j04590r5407q3983o9142n0629l0063q533J5163M2464P2759J04556
59169I558324J37744J73091K10608K49977K91567L35260L78946M19723M56010
59160A2211250M87073N10947N24231N23426N05386M67429M08836L32064K41220
$$ y = [9102991, 9053690, 9008461, 8972749, 8951212, 8946147, 8958334, 8988248, 9036571, 9104488, 9193496, 9304272, 9435695, 9585640, 9752759, 9936802, 10136850, 10349627, 10569902, 10792304, 11012323, 11225601, 11426694, 11608796, 11764440, 11886354, 11968575, 12008309, 12007560, 11972469, 11910392, 11827524, 11729009, 11620069, 11505818, 11389970, 11274298, 11159163, 11044242, 10929136, 10813858, 10698613, 10582962, 10465907, 10347226, 10228080, 10109743, 9992586, 9877193, 9765729, 9661139, 9565732, 9481749, 9412607, 9361978, 9331915, 9323382, 9338545, 9381009, 9453768, 9558324, 9696068, 9869159, 10079767, 10329744, 10621311, 10956571, 11335517, 11755240, 12211250, 12698323, 13209270, 13733501, 14256927, 14762313, 15229742, 15638578, 15970642, 16211862]
59151A6211862J39660L0011q4127j97888l06133m03766m85974n49809n95306o23984
59141A3134546o36840o34819o20226n96148n65194n30007m93787m58410m22966
59132H176149l86175l49488l15758k85582k57518k31261k07928j87262j67582
59123E787595j48869j33097j20583j08613r4954q0606o7706n6598m6488l7331
59113D892750k9377k1912j4031n879K034R887J7835K5157L1427L7751M5530N4438
59101E045610O2863P0060P6675Q3344Q9950R6387J03049J10099J16831J22119
59091E976987J25296J26356J25483J22621J17512J10084J00563Q9168P5901O0882
59081G030853M4746K8384J2398k895j7047k9266l8641m4449m6604m5876m3291
$$ y = [16211862, 16351522, 16381533, 16297406, 16099518, 15793385, 15389619, 14903645, 14353836, 13758530, 13134546, 12497706, 11862887, 11242661, 10646513, 10081319, 9551312, 9057525, 8599115, 8176149, 7789974, 7440486, 7124728, 6839146, 6581628, 6350367, 6142439, 5955177, 5787595, 5638726, 5505629, 5385046, 5276433, 5181479, 5100873, 5033167, 4976569, 4930081, 4892750, 4863373, 4841461, 4827430, 4821551, 4823585, 4833472, 4851307, 4876464, 4907891, 4945642, 4991172, 5045610, 5108473, 5178533, 5255208, 5338552, 5428502, 5524889, 5627938, 5738037, 5854868, 5976987, 6102283, 6228639, 6354122, 6476743, 6594255, 6704339, 6804902, 6894070, 6969971, 7030853, 7075599, 7103983, 7116381, 7113486, 7096439, 7067173, 7028532, 6984083, 6937479, 6891603, 6848312]
59070F848312l9006l2307k3083j2618k262Q197K0171L4675N1686P0555R0172J09195
59058G123687J27008J44375J62349J80792J98737K15999K33577K52499K72878
59049H911901K93799L13585L30532L44081L54889L63011L66418L62209L48787
59040A1989212L26014K93757K51523J99367J38370P0423j641p4268j44510k10671
59030A2837576k70865l22051l62149l92337m15360m31830m40189m40263m34645
59021I327887m25980m14702m00308l83329l65048l46198l26852l07067k87219
59012F071184k68192k51082k35946k21180k05429j89940j77344j68046j59481
59003D194544j49435j38417j28042j18724j09961j01661r4034q7017q0680p5386
$$ y = [6848312, 6809306, 6776999, 6753916, 6741298, 6739036, 6747233, 6767404, 6802079, 6853765, 6924320, 7014492, 7123687, 7250695, 7395070, 7557419, 7738211, 7936948, 8152947, 8386524, 8639023, 8911901, 9205700, 9519285, 9849817, 10193898, 10548787, 10911798, 11278216, 11640425, 11989212, 12315226, 12608983, 12860506, 13059873, 13198243, 13268666, 13267025, 13192757, 13048247, 12837576, 12566711, 12244660, 11882511, 11490174, 11074814, 10642984, 10202795, 9762532, 9327887, 8901907, 8487205, 8086897, 7703568, 7338520, 6992322, 6665470, 6358403, 6071184, 5802992, 5551910, 5315964, 5094784, 4889355, 4699415, 4522071, 4354025, 4194544, 4045109, 3906692, 3778650, 3659926, 3549965, 3448304, 3354270, 3267253, 3186573, 3111187]
58993C111187p0865o6173o1275n7650n6291n5968n4487n1103m6740m2497l8836
58982B509302l5848l3304l0623k7489k4216k1058j7483j2795p334k473N52J728
58970B298959K370M163P633J1516J4154J5469J6788J8650J9815J8912J6080J2509
58958B457018R179O689N447N160M797L880L325M151N853P175Q157J0245J4077
58945B545153J8175K0412K0198J8617J6712J4400J1116O941K745n33k351k574
58933B669011j587k98N26R63J585K452L200M027N601P720R233R923J1289J4518
58919B738163J8568K1400K2536K3243K4598K6432K7962K8695K9022L0409L4172
58908C025200L9386M3220M4425M5285M8508N3420N7265N9350O1470O4622O7915
$$ y = [3111187, 3040322, 2974149, 2912874, 2855224, 2798933, 2742965, 2688478, 2637375, 2590635, 2548138, 2509302, 2473454, 2440150, 2409527, 2382038, 2357822, 2336764, 2319281, 2306486, 2299152, 2296679, 2297231, 2298959, 2301329, 2305492, 2313125, 2324641, 2338795, 2354264, 2371052, 2389702, 2409517, 2428429, 2444509, 2457018, 2466197, 2472886, 2478333, 2483493, 2488290, 2492170, 2495495, 2499646, 2505499, 2512674, 2520831, 2531076, 2545153, 2563328, 2583740, 2603938, 2622555, 2639267, 2653667, 2664783, 2671724, 2674469, 2673936, 2671585, 2669011, 2667424, 2667126, 2667652, 2668615, 2670200, 2672652, 2675852, 2679879, 2685480, 2693200, 2702433, 2712356, 2723645, 2738163, 2756731, 2778131, 2800667, 2823910, 2848508, 2874940, 2902902, 2931597, 2960619, 2991028, 3025200, 3064586, 3107806, 3152231, 3197516, 3246024, 3299444, 3356709, 3416059, 3477529, 3542151, 3610066]
58897C610066P0918P4515P8768Q2237Q4361Q6657R0451R5174J00046J05898J13775
58886D592866J22824J31126J38164J45376J54376J65350J77069J88148J98467
58877F013766K09289K21600K34754K47637K60749K75895K93840L13710L34783
58868H406023L57485L82261M08855M37223M67949N01253N36683N74216O14569
58859A2686517O57919P03284P49569P96361Q43432Q90447R37077R82123J022247
58850B0268976J052940J070972J074626J061413J027272R68527Q83214P70219
58842B8178159O29254M63122K78794Q5203j09281k96977m70518o23937p53550
58833B7380269q57340r34688r87299j018847j032405j029186j010616r80328r42780
$$ y = [3610066, 3680984, 3755499, 3834267, 3916504, 4000865, 4087522, 4177973, 4273147, 4373193, 4479091, 4592866, 4715690, 4846816, 4984980, 5130356, 5284732, 5450082, 5627151, 5815299, 6013766, 6223055, 6444655, 6679409, 6927046, 7187795, 7463690, 7757530, 8071240, 8406023, 8763508, 9145769, 9554624, 9991847, 10459796, 10961049, 11497732, 12071948, 12686517, 13344436, 14047720, 14797289, 15593650, 16437082, 17327529, 18264606, 19246729, 20268976, 21321916, 22392888, 23467514, 24528927, 25556199, 26524726, 27407940, 28178159, 28807413, 29270535, 29549329, 29634532, 29525251, 29228274, 28757756, 28133819, 27380269, 26522929, 25588241, 24600942, 23582095, 22549690, 21520504, 20509888, 19529560, 18586780]
58824A8586780r00633q54613q05327p54339p03844o55929o11740n70960n32713
58815A2196682m96824m63557m32446m02863l75456l51180l28861l06025k82564
58806H756906k61152k43055k26101k08263j90777j75662j62163j48140j33527
58797G008066j19857j07400r5244q3536p3136o3253n1838l8499k5051j2721n95
58786F336936J2507K6005L8347M9126N9608P1314Q4408R7598J09755J21501J34690
58775G141795J50230J67045J83308J98157K11992K25955K41336K58698K77358
58766I055874K96482L16680L39338L64386L90343M16912M45795M78257N13625
58757A2617692N51184N91832O36498O84302P33651P83874Q34358Q83141R27837
$$ y = [18586780, 17686147, 16831534, 16026207, 15271868, 14568024, 13912095, 13300355, 12729395, 12196682, 11699858, 11236301, 10803855, 10400992, 10025536, 9674356, 9345495, 9039470, 8756906, 8495754, 8252699, 8026598, 7818335, 7627558, 7451896, 7289733, 7141593, 7008066, 6888209, 6780809, 6685565, 6602029, 6528893, 6465640, 6413802, 6375303, 6350252, 6337531, 6336936, 6349443, 6375448, 6413795, 6462921, 6522529, 6593843, 6678251, 6775849, 6885604, 7007105, 7141795, 7292025, 7459070, 7642378, 7840535, 8052527, 8278482, 8519818, 8778516, 9055874, 9352356, 9669036, 10008374, 10372760, 10763103, 11180015, 11625810, 12104067, 12617692, 13168876, 13760708, 14397206, 15081508, 15815159, 16599033, 17433391, 18316532, 19244369]
58748A9244369R66939R98671J019351J024339J010013R73575R11863Q22101P03900
58739B7675121N59754L94160K13133K3802j66742l51831n24177o75957q01579
58730B6345684q99980r73109j022838j050341j057645j048121j025555r93525
58722A8274570r55143r12440q66259q17391p67453p18263o71135o27265n87659
58713A1351562n52007n18580m86148m55220m26785m00909l77279l55875l36183
58704G442576l16858k97206k78050k60386k44195k29213k15517k02542j88931
58695E209678j74398j60450j48383j37780j27790j18286j09045r9557r0569q3811
58685C959609p9145p4134o7723o1914n8231n5092n0889m7118m5755m5621m4394
$$ y = [19244369, 20211308, 21209979, 22229330, 23253669, 24263682, 25237257, 26149120, 26971221, 27675121, 28234875, 28629035, 28842168, 28865970, 28699228, 28347397, 27823220, 27147263, 26345684, 25445704, 24472595, 23449757, 22399416, 21341771, 20293650, 19268095, 18274570, 17319427, 16406987, 15540728, 14723337, 13955884, 13237621, 12566486, 11939221, 11351562, 10799555, 10280975, 9794827, 9339607, 8912822, 8511913, 8134634, 7778759, 7442576, 7125718, 6828512, 6550462, 6290076, 6045881, 5816668, 5601151, 5398609, 5209678, 5035280, 4874830, 4726447, 4588667, 4460877, 4342591, 4233546, 4133989, 4043420, 3959609, 3880464, 3806330, 3738607, 3676693, 3618462, 3563370, 3512481, 3465363, 3419608, 3373987, 3329593]
58674C329593m2475m1691m1534m0107l7892l7277l8639l9947m0128m0159m0865
58663B888879m2009m3555m5670m7581m8402m8843n0129n1693n1965n1012n0237
58652B357783m9917m9071m7487m5839m4236m2492m1223m0705l9485l6325l2629
58641A888374l0539k9523k7571k4973k3728k3658k2595k0451j9701k1111k2130
58630A622394k0657j7787j5596j4375j3200j1492q984n648k405n69j63o6Mp48
58616A510708k443m158n467o657p362o649m666k615j081R4N63m9o27M85L042N241
58600A478359O356P028P214O119M207L061L011K981K850L789O042Q497J0648J3031
58586A563193J5534J7460J9347K2514K6598K9872L2173L5152L9271M3106M6176
$$ y = [3329593, 3287118, 3245427, 3203893, 3163786, 3125894, 3088617, 3049978, 3010031, 2969903, 2929744, 2888879, 2846870, 2803315, 2757645, 2710064, 2661662, 2612819, 2562690, 2510997, 2459032, 2408020, 2357783, 2307866, 2258795, 2211308, 2165469, 2121233, 2078741, 2037518, 1996813, 1957328, 1921003, 1888374, 1857835, 1828312, 1800741, 1775768, 1752040, 1728382, 1705787, 1685336, 1665635, 1644524, 1622394, 1601737, 1583950, 1568354, 1553979, 1540779, 1529287, 1520303, 1514655, 1512250, 1511681, 1511518, 1511452, 1511456, 1510708, 1508265, 1504107, 1498640, 1491983, 1484621, 1477972, 1473306, 1470691, 1469610, 1469704, 1470267, 1470218, 1469591, 1470076, 1473118, 1478359, 1484715, 1491743, 1498957, 1505076, 1509283, 1512344, 1515355, 1518336, 1521186, 1524975, 1531017, 1539514, 1550162, 1563193, 1578727, 1596187, 1615534, 1638048, 1664646, 1694518, 1726691, 1761843, 1801114, 1844220, 1890396]
58575A890396M9908N4926N9791O3494O7119P1930P7550Q3134Q8816R5215J02736
58564B705015J11719J21916J31838J40501J49686J62354J78654J95726K11753
58555D109162K27725K44723K61961K78329K93478L06231L13869L14046L05881
58546F655405K88649K61267K23678J76990J22059O0083n102o7796j24185j73268
58536G417780k13914k43877k62660k72620k75972k73025k64551k53348k41891
58527E115922k30237k17627k04275j90436j75684j60420j46281j33906j22055
58518C535001j09990r8769q9212q0523p2128o4830n8934n3307m7663m3704m2448
58507B773493m2212m0934l8842l7303l6574l6323l6937l8699m0749m2292m3847
$$ y = [1890396, 1940304, 1995230, 2055021, 2118515, 2185634, 2257564, 2335114, 2418248, 2507064, 2602279, 2705015, 2816734, 2938650, 3070488, 3210989, 3360675, 3523029, 3701683, 3897409, 4109162, 4336887, 4581610, 4843571, 5121900, 5415378, 5721609, 6035478, 6349524, 6655405, 6944054, 7205321, 7428999, 7605989, 7728048, 7788131, 7783029, 7715233, 7591048, 7417780, 7203866, 6959989, 6697329, 6424709, 6148737, 5875712, 5611161, 5357813, 5115922, 4885685, 4668058, 4463783, 4273347, 4097663, 3937243, 3790962, 3657056, 3535001, 3425011, 3326242, 3237030, 3156507, 3084379, 3019549, 2960615, 2907308, 2859645, 2815941, 2773493, 2731281, 2690347, 2651505, 2614202, 2577628, 2541305, 2504368, 2465669, 2424920, 2382628, 2338781]
58496B338781m6031m8153m9027m8375m6583m4037m1315l8932l6463l3105k9388
58485A877372k6778k5314k3361k0292j7542j6299j5811j4701j2588r881p441o746
58473A680618q691j2014j4537j5924j7409j9107k0172k1285k3964k7171k7886
58462A472458k5672k3452k2960k2713k1587k0911k1393k1280j9478j7545j6621
58451A238846j5192j2035q790p320o821n763m562m141l904l096k408k298j629
58438A160887J40J371P57l66p1J410K670L231L178K395J564K205M419O302O561
58423A196653N767M296J733p64n38K561N156N019L928M219N392O175O845P357
58409A253799O065K750M9o23j755n661j0536j3411j4497j5480j6029j5198j4173
$$ y = [2338781, 2292750, 2244597, 2195570, 2147195, 2100612, 2056575, 2015260, 1976328, 1939865, 1906760, 1877372, 1850594, 1825280, 1801919, 1781627, 1764085, 1747786, 1731975, 1717274, 1704686, 1694805, 1687364, 1680618, 1671927, 1659913, 1645376, 1629452, 1612043, 1592936, 1572764, 1551479, 1527515, 1500344, 1472458, 1446786, 1423334, 1400374, 1377661, 1356074, 1335163, 1313770, 1292490, 1273012, 1255467, 1238846, 1223654, 1211619, 1202829, 1195509, 1188688, 1182925, 1178363, 1174222, 1170318, 1167222, 1164814, 1162516, 1160887, 1161027, 1162398, 1163155, 1162789, 1162718, 1164128, 1166798, 1170029, 1173207, 1175602, 1177166, 1179371, 1183790, 1190092, 1196653, 1202420, 1206716, 1208449, 1207685, 1207147, 1209708, 1214864, 1219883, 1223811, 1228030, 1233422, 1239597, 1246442, 1253799, 1259864, 1262614, 1262663, 1262040, 1260285, 1254624, 1244088, 1230677, 1216180, 1200700, 1184671, 1169473, 1155300]
58396A155300j4302j4154j1646p590m349k561j796k627n146p091o356m012k365
58383A071305j572n97J54p3k57R78L054M792O395Q027Q409P049N891O314O693
58368A126562N285L292K406J690j66j710r92R85K180L040N048P609R383J1028
58354A175640J3599J5943J6605J6580J7190J7085J4576J1215R797J0261J0456
58343A328947R535P755M590J00l515m520m328m963n794n454m793n000m974l612
58329A303974k416k561j802K179P610J1462J4220J7848K1057K0827J7176J2607
58317A422181Q127L438l69j939k242k824k944j422O04J754L072N455O862N669
58303A445422M259N531Q259R690J0176J1137J1205Q919O780P921J0812J1925J1472
$$ y = [1155300, 1140998, 1126844, 1115198, 1107608, 1103259, 1100698, 1098902, 1096275, 1091129, 1084038, 1077682, 1073670, 1071305, 1069733, 1069136, 1069290, 1069217, 1068960, 1069938, 1072992, 1077784, 1084179, 1092206, 1100615, 1107664, 1113555, 1119869, 1126562, 1131847, 1135139, 1137545, 1139235, 1139069, 1137359, 1136367, 1137352, 1139532, 1142572, 1147620, 1155229, 1164612, 1175640, 1189239, 1205182, 1221787, 1238367, 1255557, 1272642, 1287218, 1298433, 1308230, 1318491, 1328947, 1338482, 1346237, 1350827, 1350927, 1347412, 1342892, 1338564, 1333601, 1327807, 1322353, 1317560, 1312560, 1307586, 1303974, 1301558, 1298997, 1297195, 1299374, 1306984, 1318446, 1332666, 1350514, 1371571, 1392398, 1409574, 1422181, 1430308, 1433746, 1433377, 1431438, 1429196, 1426372, 1423428, 1422006, 1422610, 1424364, 1427436, 1432891, 1439753, 1445422, 1449681, 1455212, 1463471, 1473161, 1483337, 1494474, 1505679, 1514598, 1521378, 1529299, 1540111, 1552036, 1563508]
58290A563508J1921J3027J3096J3042J4312J4862J2160Q093O090N385L284P93
58278A679573O90J978J897J519L739P371Q924Q815J0235J3091J4493J3971J3259
58265A779555J2418J1203J2184J7053K1994K2366J9995J9965K2327K3280K2629
58254A984969K3462K5831K7080K7216K8101K8873K7872K7087K8758L0081K7547
58243B286877K3824K3527K5078K4251K2789K5365L0423L2653L2448L4232L7261
58232B598728L7216L5360L6817M0796M1844M0030M0652M4368M6759M7347M9949
58221C059866N4489N7444N9824O5661P3342P7726P9932Q5301R2662R5909R5453
58210C897609R7527J02446J04441J02916J02996J05047J04680J03145J06437J14115
$$ y = [1563508, 1575429, 1588456, 1601552, 1614594, 1628906, 1643768, 1655928, 1664021, 1670111, 1675496, 1678780, 1679573, 1680263, 1682241, 1684138, 1685657, 1689396, 1696767, 1705691, 1714506, 1724741, 1737832, 1752325, 1766296, 1779555, 1791973, 1803176, 1815360, 1832413, 1854407, 1876773, 1896768, 1916733, 1939060, 1962340, 1984969, 2008431, 2034262, 2061342, 2088558, 2116659, 2145532, 2173404, 2200491, 2229249, 2259330, 2286877, 2310701, 2334228, 2359306, 2383557, 2406346, 2431711, 2462134, 2494787, 2527235, 2561467, 2598728, 2635944, 2671304, 2708121, 2748917, 2790761, 2830791, 2871443, 2915811, 2962570, 3009917, 3059866, 3114355, 3171799, 3231623, 3297284, 3370626, 3448352, 3528284, 3613585, 3706247, 3802156, 3897609, 3995136, 4097582, 4202023, 4304939, 4407935, 4512982, 4617662, 4720807, 4827244, 4941359]
58200D941359J20428J26157J37245J52009J62629J69578J81277J98896K15104
58191F404682K28683K46280K68198K86840L01152L18255L38865L55800L69058
58182I117813L87418M12493M36425M57862M84490N17021N46988N73787O07563
58173A3541860O51643O98195P44227P94814Q47856Q93871R34295R81678J038927
58164B1127366J097676J159133J234773J323495J411283J496966J593974J702940
58156C2147606J809327J912756K029997K163136K295637K427553K582453K770655
58148E0139120K979369L208307L478470L795245M143243M531011M999595N574464
58140H2848824O256150P071441Q077179R291900J0681238J2231320J3970282J5899178
$$ y = [4941359, 5061787, 5187944, 5325189, 5477198, 5639827, 5809405, 5990682, 6189578, 6404682, 6633365, 6879645, 7147843, 7434683, 7735835, 8054090, 8392955, 8748755, 9117813, 9505231, 9917724, 10354149, 10812011, 11296501, 11813522, 12360510, 12934297, 13541860, 14193503, 14891698, 15635925, 16430739, 17278595, 18172466, 19106761, 20088439, 21127366, 22225042, 23384175, 24618948, 25942443, 27353726, 28850692, 30444666, 32147606, 33956933, 35869689, 37899686, 40062822, 42358459, 44786012, 47368465, 50139120, 53118489, 56326796, 59805266, 63600511, 67743754, 72274765, 77274360, 82848824, 89104974, 96176415, 104253594, 113545494, 124226732, 136458052, 150428334, 166327512]
58132A66327512J7993206K0311991K3016690K6236468L0005208L4256555L8477774
58125C56625404M1079257L9479940L1634914J7968023J674418j3163392k3896813
58118D51401751l0086749l2664490l2842145l1639668k9800302k7727784k5523769
58111B41116844k3202077k0847540j8567675j6410223j4399671j2583834j0986356
58104A24119468r568742q286422p134973o106957n158848m262076l437099k695587
58096G7468764j994609j285351n54026K24111J086069J928987K393054K043233
58088H1310232P54241j108852k925309m225954m895369n074867m962717m704110
58080E4167295m385986m056729l732285l406912l077539k757405k463565k200130
$$ y = [166327512, 184320718, 204632709, 227649399, 253885867, 283891075, 318147630, 356625404, 397704661, 437184601, 468819515, 486787538, 488461956, 475298564, 451401751, 421315002, 388650512, 355808367, 324168699, 294368397, 266640613, 241116844, 217914767, 197067227, 178499552, 162089329, 147689658, 135105824, 124119468, 114550726, 106264304, 99129331, 93022374, 87863526, 83601450, 80164351, 77468764, 75474155, 74188804, 73634778, 73858889, 74944958, 76873945, 79266999, 81310232, 82064473, 80955621, 78030312, 73804358, 68908989, 63834122, 58871405, 54167295, 49781309, 45724580, 41992295, 38585383, 35507844, 32750439, 30286874, 28086744]
58072B8086744j962314j750282j567973j411927j273395j150640j048122r63654
58064A6958437q87875q17615p58532p12325o71928o32146n95094n61952n28959
58055A0792011m95073m64588m38856m13754l88295l67055l51251l36198l20562
58046G216379l09073l02714k95243k83112k70240k59219k46634k31175k17632
58037D801337k08193j97936j83768j69870j59549j49477j37204j26724j21123
58028C347493j16775j10417j05232j04005j02599r6473q8398q3716q2502q1697
58018B375679q0657p9545p6280o9915o3521n9679n6718n2757m9250m7237m4473
58007A695647l9729l5629l3942l2418k9409k6967k6234k4638k0971j8349j8607
$$ y = [28086744, 26124430, 24374148, 22806175, 21394248, 20120853, 18970213, 17922091, 16958437, 16070562, 15252947, 14494415, 13782090, 13110162, 12478016, 11882922, 11320970, 10792011, 10296938, 9832350, 9393494, 8979740, 8591445, 8224390, 7873139, 7536941, 7216379, 6907306, 6604592, 6309349, 6026237, 5755997, 5496778, 5250144, 5018969, 4801337, 4593144, 4395208, 4211440, 4041570, 3882021, 3732544, 3595340, 3468616, 3347493, 3230718, 3120301, 3015069, 2911064, 2808465, 2711992, 2623594, 2539878, 2457376, 2375679, 2295022, 2215477, 2139197, 2069282, 2005761, 1946082, 1889364, 1836607, 1787357, 1740120, 1695647, 1655918, 1620289, 1586347, 1553929, 1524520, 1497553, 1471319, 1446681, 1425710, 1407361, 1388754]
57996A388754j8774j6797j5732j8112k0883k0430j8324j7743j8030j7131j5773
57985A191025j5238j4317j2210j0986j1735j1895r775p915q513r459q478p209
57973A063295p440p187m559j722j081j105J30R71k09j101O00K725K557J705K767
57958A050346M289L789K703L485M452K488j342l723m761o949r989j1394j1205
57945A022189j1863j4049j6107j6973j6703j5224j3274j3100j5485j7701j7199
57934H54511j5422j5073j5682j5123j3615j2737j1959r390m835P18P144J3917
57922G62454J8456J8799J6663J5120J4672J4064J3157J2304J0649P860N793N682
57910I15673N523L139j52j973k935m819o529n756l396k576l880n012m807m549
$$ y = [1388754, 1369980, 1353183, 1337451, 1319339, 1298456, 1278026, 1259702, 1241959, 1223929, 1206798, 1191025, 1175787, 1161470, 1149260, 1138274, 1126539, 1114644, 1104869, 1096954, 1088441, 1078982, 1070504, 1063295, 1055855, 1048668, 1044109, 1042387, 1041306, 1040201, 1040331, 1041302, 1041093, 1039992, 1040592, 1043317, 1045874, 1047579, 1050346, 1054635, 1058424, 1061127, 1064612, 1069064, 1071552, 1070210, 1066487, 1061726, 1054777, 1044788, 1033394, 1022189, 1010326, 996277, 980170, 963197, 946494, 931270, 917996, 904896, 889411, 871710, 854511, 839089, 824016, 808334, 793211, 779596, 766859, 754900, 745510, 740675, 741393, 748537, 762454, 780910, 799709, 816372, 831492, 846164, 860228, 873385, 885689, 896338, 904198, 909991, 915673, 921196, 924335, 924183, 922210, 919275, 914456, 907927, 902171, 898775, 896199, 892319, 887307, 882500, 877951]
57896H77951n397p082q983j0532j0919j0011q766p551n517k886j738k689l196
57883G92684j339J014J344L64k7k62j484k535j940j046j835l371l819m211o551
57868G66986r826j1616j2295j3685j4820j3290r966q136q173p204m200j537r38
57855F51300j282j076k45J200L654O443Q128Q683R461J0755J1388J0820R861R291
57841G38381R230R616R901Q870O215L431J779O47o09q67M86J320n79l954n896
57826G77971o074o390p597q931j0036j0586r242n816l136l657n548n412l580k938
57812F89028l664l272j326J03M91J347K621K664K018L211O146P611O324M810N120
57797G23232O111O213N644M602K366k78p57J509L545K700k05k963m780n580m889
$$ y = [877951, 872554, 865472, 856489, 845957, 835038, 825027, 816261, 808710, 803193, 800307, 798569, 795880, 792684, 791345, 792359, 793703, 794067, 794040, 793778, 792294, 789759, 787819, 786773, 784938, 781567, 777748, 773537, 766986, 757160, 745544, 733249, 719564, 704744, 691454, 681488, 673352, 665179, 657975, 653775, 652238, 651300, 650018, 648942, 648697, 649897, 653551, 659994, 668122, 676805, 686266, 697021, 708409, 719229, 729090, 738381, 747611, 757227, 767128, 775998, 782213, 785644, 787423, 788070, 787461, 786594, 787080, 788400, 787821, 783867, 777971, 771897, 765507, 757910, 748979, 738943, 728357, 719115, 713299, 710163, 706506, 700958, 695546, 691966, 689028, 685364, 682092, 680766, 680869, 681360, 682707, 685328, 687992, 690010, 693221, 699367, 706978, 713302, 718112, 723232, 729343, 735556, 741200, 745802, 748168, 747890, 747133, 748642, 752187, 754887, 754682, 751719, 746939, 741359, 736470]
57782G36470l187k409l424m650m661m371n123o277o374n565n143n572o267o770
57768F66677p174p760q771j0028j0667j0084r051q804r258r356r040r230r892
57755E47562r859q767p491o534n596m877n038n672n584m791m387m350l524j990
57741D69102j273j609j292M73K277L007L669N385P359Q163P689O639N294L857
57727E18740K869K302J341j92j281j231o35r9O77J792K272J257q36l018m689n524
57711E13745n331m620m264m215l604k422j803k168k416j701p86q36j867l028l607
57696D71077l151j530N06J775K230L185N400P784Q644P686O259O000P268Q703
57682E31836Q550O937O155P805J0491J1728J1401J1390J2235J2494J1500J0503
$$ y = [736470, 733283, 730874, 727450, 722800, 718139, 713768, 708645, 702368, 695994, 690429, 685286, 679714, 673447, 666677, 659503, 651743, 642972, 632944, 622277, 612193, 603142, 594338, 585080, 575724, 566684, 557454, 547562, 537703, 528936, 521445, 514911, 509315, 504438, 499400, 493728, 488144, 483353, 478966, 474616, 471092, 469102, 467829, 466220, 464928, 465401, 467678, 470685, 474354, 479739, 487098, 495261, 502950, 509589, 514883, 518740, 521609, 523911, 525252, 525060, 523779, 522548, 521913, 521814, 522491, 524283, 526555, 527812, 526976, 523958, 519269, 513745, 508414, 503794, 499530, 495315, 491711, 489289, 487486, 485318, 482902, 481201, 480415, 479579, 477712, 474684, 471077, 467926, 466396, 466902, 468677, 470907, 474092, 479492, 487276, 495920, 503606, 509865, 515865, 523133, 531836, 540386, 547323, 553478, 561283, 571774, 583502, 594903, 606293, 618528, 631022, 642522, 653025]
57670F53025J0473J0705J0441J0190J0640J1709J3388J6067J9307K1572K1970
57659H09487K1130J9986J9035J9187K1645K6063L0212L2357L2911L3194L3832
57648A099039L5008L6892L9117M0944M2556M5020M8538N2088N5297N9052O3702
57637A617253O8331P2608P7636Q3974R0584R6842J04011J13242J23649J34008
57627B582138J45093J58530J74135J90203K05814K21257K36502K50791K63627
57618D428090K74904K83679K87637K83830K69746K44195K08117J64600J17655
57609F562453P0845K7014j1529m3435o9346r2605j18560j51564j90781k29029
57599E753463k57273k70945k71483k62631k47308k28142k08232j89588j71957
$$ y = [653025, 663498, 674203, 684644, 694834, 705474, 717183, 730571, 746638, 765945, 787517, 809487, 830617, 850603, 869638, 888825, 910470, 936533, 966745, 999102, 1032013, 1065207, 1099039, 1134047, 1170939, 1210056, 1251000, 1293556, 1338576, 1387114, 1439202, 1494499, 1553551, 1617253, 1685584, 1758192, 1835828, 1919802, 2010386, 2107228, 2211239, 2324481, 2448130, 2582138, 2727231, 2885761, 3059896, 3250099, 3455913, 3677170, 3913672, 4164463, 4428090, 4702994, 4986673, 5274310, 5558140, 5827886, 6072081, 6280198, 6444798, 6562453, 6633298, 6660312, 6648783, 6605348, 6536002, 6443397, 6324837, 6173273, 5982492, 5753463, 5496190, 5225245, 4953762, 4691131, 4443823, 4215681, 4007449, 3817861, 3645904]
57590C645904j54279j36500j19245j02973q8278p5796o4854n3553m1289k9991
57580B779146k1588j5372r163j970N973J4762K4497L4108M2441N0416O0226P2288
57568C035764Q4635R5713J06264J17796J30553J43928J57691J71620J84554J95159
57558D423677K03404K09765K12735K08533J94274J70509J39520J02127N7953Q595
57548E931092m1664q8828j31198j67669j96147k15218k26114k31222k31574k27333
57538D174125k19656k10247j99669j87967j76169j65305j54543j42422j29718
57529B588429j18882j10718j03648r6200q8279q0076p1904o5219o1440n9456n6451
57518A676156n1612m6830m3303l9901l5726l1849k9247k7041k4147k0996j8404
$$ y = [3645904, 3491625, 3355125, 3235880, 3132907, 3044629, 2968833, 2903979, 2850426, 2809137, 2779146, 2757558, 2742186, 2733023, 2731053, 2737026, 2751788, 2776285, 2810393, 2852834, 2903250, 2963476, 3035764, 3120399, 3216112, 3322376, 3440172, 3570725, 3714653, 3872344, 4043964, 4228518, 4423677, 4627081, 4836846, 5049581, 5258114, 5452388, 5622897, 5762417, 5864544, 5922497, 5931092, 5889428, 5800600, 5669402, 5501733, 5305586, 5090368, 4864254, 4633032, 4401458, 4174125, 3954469, 3744222, 3544553, 3356586, 3180417, 3015112, 2860569, 2718147, 2588429, 2469547, 2358829, 2255181, 2158981, 2070702, 1990626, 1918722, 1853503, 1792063, 1732607, 1676156, 1624544, 1577714, 1534411, 1494510, 1458784, 1426935, 1397688, 1370647, 1346500, 1325504, 1307100]
57507A307100j6164j3883j1773r752p166m289k467j885q32J782M826O919Q448
57494A260864J0407J2756J5107J7722K0525K2477K3107K3512K4745K6526K8569
57483A486317L1770L6711M2166M6458M9506N2487N6337O1396O7560P4065Q0031
57472B084804Q5788R2482J00169J07812J15416J24238J34199J43205J49740J53980
57462C291833J55511J52407J43701J30278J11949Q6539N3994J8769j4471m5246
57452D085264p4858j01844j23170j38377j49137j55571j56277j51659j44309j36053
57442B754009j26962j17216j07695r8694q9823q1054p2380o3108n3212m4659l9342
57431A859864l6213l2391k6656j9974j3289o915j614K026N126R370J4553J9191
$$ y = [1307100, 1290936, 1277053, 1265280, 1255528, 1248362, 1244073, 1241606, 1239721, 1238889, 1240671, 1245497, 1252416, 1260864, 1271271, 1284027, 1299134, 1316856, 1337381, 1359858, 1382965, 1406477, 1431222, 1457748, 1486317, 1518087, 1554798, 1596964, 1643422, 1692928, 1745415, 1801752, 1863148, 1930708, 2004773, 2084804, 2170592, 2263074, 2363243, 2471055, 2586471, 2710709, 2844908, 2988113, 3137853, 3291833, 3447344, 3599751, 3743452, 3873730, 3985679, 4072218, 4126212, 4144981, 4130510, 4085264, 4010406, 3908562, 3785392, 3647015, 3497878, 3342307, 3186030, 3034371, 2890062, 2754009, 2627047, 2509831, 2402136, 2303442, 2213619, 2132565, 2060185, 1997077, 1943865, 1899206, 1859864, 1823651, 1791260, 1764604, 1744630, 1731341, 1724426, 1722812, 1724838, 1729964, 1739334, 1753887, 1773078]
57419A773078K3207K7903L3559L9265M5018N1765N9303O6384P3076Q0862R0045
57408B363465R9178J07565J16135J25157J32983J38121J40885J41833J39777J32495
57398C637594J18650R8265P2073M1185P094k8404o3147r4821j21744j43247j58932
57387C364566j68216j71497j70937j68666j64679j57777j48236j38013j28547
57378A947998j19793j11343j03133r5021q7083q0255p5373p1573o7024o1372n6029
57367A019999n1887m8189m4100m0068l6881l4395l1948k9516k7743k6983k6661
57356F21628k5704k3746k1729k0776k0445j9129j6409j3867j2818j2533j1637
57345D22835j0056q407o679m967m514o221q737r677q428o459n355n612o707p179
$$ y = [1773078, 1796285, 1824188, 1857747, 1897012, 1942030, 1993795, 2053098, 2119482, 2192558, 2273420, 2363465, 2462643, 2570208, 2686343, 2811500, 2944483, 3082604, 3223489, 3365322, 3505099, 3637594, 3756244, 3854509, 3926582, 3967767, 3974861, 3946457, 3883310, 3788489, 3666745, 3523498, 3364566, 3196350, 3024853, 2853916, 2685250, 2520571, 2362794, 2214558, 2076545, 1947998, 1828205, 1716862, 1613729, 1518708, 1431625, 1351370, 1275997, 1204424, 1137400, 1076028, 1019999, 968112, 919923, 875823, 835755, 798874, 764479, 732531, 703015, 675272, 648289, 621628, 595924, 572178, 550449, 529673, 509228, 490099, 473690, 459823, 447005, 434472, 422835, 412779, 404372, 397693, 392726, 388212, 381991, 373254, 363577, 355149, 348690, 343335, 337723, 331016, 323837]
57331C23837n547k313j10m17j474j089j5l11j645k051j592k154l820m406k987
57316B93906j184l92o3N76J232J737K561L426L208J999J509K696M514N890P326
57301C28941R587J2037J3375J3305J2658J2383J2846J3577J3657J2825J2049J2207
57289D79447J2707J2354J1219J0480J0687J1301J1712J1586J0690R446R106J0177
57277F10912J1379J1554J1621J2994J4948J5694J5253J4988J4853J3606J1475
57266G59277J0093R768R276Q555R055J1080J3072J4132J5117J6680J8152J8901
57254I13158J9083J8736J7890J7587J8826K0430K0224J8442J7615J8775K0223
57243A120989K0620K0799K1783K3288K4949K6875K8309K8043K6908K7560L0826
$$ y = [323837, 318290, 315977, 315867, 315450, 313976, 312887, 312872, 312561, 310916, 308865, 307273, 305119, 301299, 296893, 293906, 292722, 292330, 292267, 292843, 294075, 295812, 298373, 301799, 305007, 307006, 308515, 311211, 315725, 321615, 328941, 338528, 350565, 363940, 377245, 389903, 402286, 415132, 428709, 442366, 455191, 467240, 479447, 492154, 504508, 515727, 526207, 536894, 548195, 559907, 571493, 582183, 591629, 600735, 610912, 622291, 633845, 645466, 658460, 673408, 689102, 704355, 719343, 734196, 747802, 759277, 769370, 779138, 788414, 796969, 806024, 817104, 830176, 844308, 859425, 876105, 894257, 913158, 932241, 950977, 968867, 986454, 1005280, 1025710, 1045934, 1064376, 1081991, 1100766, 1120989, 1141609, 1162408, 1184191, 1207479, 1232428, 1259303, 1287612, 1315655, 1342563, 1370123, 1400949]
57232A400949L4565L7000L8857M1016M2485M2239M1108M0296L9650L8728L7954
57221A834847L7474L6433L4462L2391L0545K8012K4607K1779K0409J9313J6985
57210B137257J3253Q329K203m012q041r229r686j1383j3691j5136j5824j6647
57198B057393j7567j8094j8312j8016j6187j2539q464n324k909n29J777L990O675
57185A951894R813J2376J3959J5322J6582J6632J5332J4469J5251J6583J7116
57174B115329J7341J8266J9416J9771J9431J9089J8982J9363K0775K2841K4165
57163B334769K4381K4922K6819K9325L1615L4166L7339M0273M2416M4678M7810
57152B718513N1031N3352N4854N5660N5162N3333N1288M9832M8909M9051N1414
$$ y = [1400949, 1435514, 1472514, 1511371, 1552387, 1594872, 1637111, 1678219, 1718515, 1758165, 1796893, 1834847, 1872321, 1908754, 1943216, 1975607, 2006152, 2034164, 2058771, 2080550, 2100959, 2120272, 2137257, 2150510, 2158839, 2161042, 2157030, 2148989, 2139760, 2130074, 2118691, 2105000, 2089864, 2074040, 2057393, 2039826, 2021732, 2003420, 1985404, 1969217, 1956678, 1948214, 1942890, 1939981, 1939452, 1941229, 1945219, 1951894, 1961707, 1974083, 1988042, 2003364, 2019946, 2036578, 2051910, 2066379, 2081630, 2098213, 2115329, 2132670, 2150936, 2170352, 2190123, 2209554, 2228643, 2247625, 2266988, 2287763, 2310604, 2334769, 2359150, 2384072, 2410891, 2440216, 2471831, 2505997, 2543336, 2583609, 2626025, 2670703, 2718513, 2769544, 2822896, 2877750, 2933410, 2988572, 3041905, 3093193, 3143025, 3191934, 3240985, 3292399]
57141C292399N5634N9942O4177P0207P8287Q5727R0702R4726R9528J04021J06563
57130D201913J07942J09625J11009J10881J09947J09546J09208J07814J05955
57121E183840J05002J04731J03782J01638R8688R5333R2348R0897R0867R0521
57111F157647Q8852Q6721Q4673Q1702P7567P4139P2648P1518O8784O5008O1864
57100F991123N9417N6554N2670M7448M0600L3415K8731K7650K7630K5368K0078
57089G410684J2963N307j641o774j0398j3854j7406k0737k5834l6181n2139p0343
57077G173647q8686j08316j29252j48070j62251j73423j84074j94320k04200k15730
57067E565325k30236k46758k65204k87994l16496l49137l84905m25210m70625
$$ y = [3292399, 3348033, 3407975, 3472152, 3542359, 3620646, 3706373, 3797075, 3891801, 3991329, 4095350, 4201913, 4309855, 4419480, 4530489, 4641370, 4751317, 4860863, 4970071, 5077885, 5183840, 5288842, 5393573, 5497355, 5598993, 5697681, 5793014, 5885362, 5976259, 6067126, 6157647, 6246499, 6333220, 6417893, 6499595, 6577162, 6651301, 6723949, 6795467, 6864251, 6929259, 6991123, 7050540, 7107094, 7159764, 7207212, 7247812, 7281227, 7309958, 7337608, 7365238, 7390606, 7410684, 7423647, 7428954, 7427313, 7420539, 7410141, 7396287, 7378881, 7358144, 7332310, 7296129, 7243990, 7173647, 7084961, 6976645, 6847393, 6699323, 6537072, 6363649, 6179575, 5985255, 5781055, 5565325, 5335089, 5088331, 4823127, 4535133, 4218637, 3869500, 3484595, 3059385, 2588760]
57058B588760n19964n74421o38279A42674f54889q89974r94050j112391j244383
57049d895687j390469j552801j729886j917681k118872k343926k599726k884030
57041b1433078l193380l527830l885001m259830m654635n079091n534776o009570
57033e7577191o491603o977455p461928p931035q366645q745283r039436r242749
57025a21833325r368143r344035q901948p697308n689487l391102j596452p70197
57017a68591997p22118q84595q25663m51451J75214J048449K223590L705969N398591
57008a58924011P131164Q709983R968759J0815579J1243180J1293943J1025493
57001h8735910J0508173R827747R066158Q280181P502748O754113O044019N373230
$$ y = [2588760, 2068796, 1494375, 856096, 142674, -654889, -1544863, -2538913, -3651304, -4895687, -6286156, -7838957, -9568843, -11486524, -13605396, -15949322, -18549048, -21433078, -24626458, -28154288, -32039289, -36299119, -40953754, -46032845, -51567621, -57577191, -64068794, -71046249, -78508177, -86439212, -94805857, -103551140, -112590576, -121833325, -131201468, -140545503, -149447451, -157144759, -162834246, -166225348, -167821800, -168591997, -169314115, -170198710, -171024373, -171475824, -171300610, -170252161, -168028571, -164322602, -158924011, -151792847, -143082864, -133114105, -122298526, -111055346, -99761403, -88735910, -78227737, -68399990, -59333832, -51053651, -43550903, -36796790, -30752771, -25379541]
56993b5379541M744191M167049L650763L194575K793044K443095K141197c65711
56984A287176J458677J295140J154666J029038R15072Q11690P15496O23159N35154
56975I825268M54055L81684L19857K70670K33683K05340J82365J63064J44911
56966A2180897J24973J03731Q4589O8591N3453L8504K6066J6750P952j531r975
56955A2694000j7603k8355m4442o3103q1134r8911j17436j34870j48656j58210
56945A1801280j63280j62539j56331j48367j42235j37809j32590j24761j14205
56936A0519163j03388r8919j09801j41914j94483k61158l31729l93306m34671
56927H449794m52366m51063m37485m16337l91719l67873l46358l25587l04896
$$ y = [-25379541, -20635350, -16468301, -12817538, -9622963, -6829919, -4386824, -2245627, -365711, 1287176, 2745853, 4040993, 5195659, 6224697, 7139769, 7951459, 8666955, 9290114, 9825268, 10279323, 10661007, 10980864, 11251534, 11485217, 11690557, 11872922, 12035986, 12180897, 12305870, 12409601, 12494190, 12562781, 12616234, 12654738, 12680804, 12697554, 12705506, 12703975, 12694000, 12676397, 12648042, 12603600, 12540497, 12459363, 12360452, 12243016, 12108146, 11959490, 11801280, 11638000, 11475461, 11319130, 11170763, 11028528, 10890719, 10758129, 10633368, 10519163, 10415775, 10316856, 10207055, 10065141, 9870658, 9609500, 9277771, 8884465, 8449794, 7997428, 7546365, 7108880, 6692543, 6300824, 5932951, 5586593, 5261006, 4956110]
56918D956110k86252k70481k54977k37198k17935j99297j81905j65747j51467
56909B990851j38970j26887j14914j04633r6806r0047q3227p6760p0456o2918
56899B025233n4404m7262m1985l5973k8416k3373k5229l3274m3324n2622o0450
56888A578921o5732o7234o5424o1837n7152n1641m6548m3205m1313l9475l6746
56877A002614l2713k7134k0667j4817j0073n176P91O708J0683J1666Q959J825
56865I32666q919k0034k7978l1499l1706l0613l0004l0389l0416k8474k4986k1695
56853F15953j8833j5268j1532r974j0935j1491r443o130l778k253l90J444K073
56840E19443J538O31l41r66k54J866L928N025O154Q252J0491J1825J2679J3619
$$ y = [4956110, 4669858, 4399377, 4144400, 3907202, 3689267, 3489970, 3308065, 3142318, 2990851, 2851881, 2724994, 2610080, 2505447, 2408641, 2318594, 2235367, 2158607, 2088151, 2025233, 1970829, 1923567, 1881582, 1845609, 1817193, 1793820, 1768591, 1735317, 1691993, 1639371, 1578921, 1513189, 1445955, 1380531, 1318694, 1261542, 1209901, 1163353, 1120148, 1078835, 1039360, 1002614, 969901, 942767, 922100, 907283, 897210, 892034, 892825, 899533, 910216, 921882, 930841, 932666, 923747, 903713, 875735, 844236, 812530, 781917, 751913, 721524, 691108, 662634, 637648, 615953, 597120, 581852, 570320, 560346, 549411, 537920, 528477, 522347, 518569, 516316, 515926, 517370, 519443, 520981, 521612, 521271, 520305, 520051, 521917, 525845, 530870, 537024, 545276, 555767, 567592, 580271, 593890]
56826E93890J3913J2914J1450J0252Q294M269j440p505j3098j7263j8440j6247
56814E80989j2497q983n549j711J468L031M285P220J1759J6449K0943K5850L0815
56801F74069L4750L7572M0047M2023M2180L9271L2619K2024Q497n278j6291k3013
56789I28470k5508k4683k1989j8847j5400j0625m309K268Q331J4797K2462L0325
56777H85292L7153M3445N0580N9089O8812P9049Q6628Q5358P0268M2757J0101
56766A518532j9907m2836n7324o3675o3494n9286n3325m6958m0762l4691k8185
56755A008089k0728j2480m123L730J0896J7673K4692L2438M0944M9694N6814N8036
56743A265675M8414K7267O15k3466m1340n3770o0969o1689n7295n2279m9043m5467
$$ y = [593890, 607803, 620717, 632167, 642419, 650713, 654982, 653542, 646037, 632939, 615676, 597236, 580989, 568492, 559509, 553960, 552249, 553717, 556748, 561033, 568253, 580012, 596461, 617404, 643254, 674069, 708819, 746391, 786438, 828461, 870641, 909912, 942531, 964555, 973052, 967774, 951483, 928470, 902962, 878279, 856290, 837443, 822043, 811418, 807109, 809377, 817708, 832505, 854967, 885292, 922445, 965890, 1016470, 1075559, 1144371, 1223420, 1310048, 1395406, 1465674, 1508431, 1518532, 1498625, 1455789, 1398465, 1334790, 1271296, 1212010, 1158685, 1111727, 1070965, 1036274, 1008089, 987361, 974881, 970758, 974488, 985384, 1003057, 1027749, 1060187, 1101131, 1150825, 1207639, 1265675, 1314089, 1341356, 1341971, 1318505, 1277165, 1223395, 1162426, 1100737, 1043442, 991163, 942120, 896653]
56731H96653l9381l2250k6306k1017j5040r164m424N51P375J4792K0570K4942
56719H17301K9006L0900K6930J6369K437j1200k2679l1073l5929l7987l8552l7913
56707G07610l5633l2053k8111k4177k0431j7756j6674j6035j4439j2329j1047
56696D78925j0416r114p000n229m363m075m400n608o903o912n562m180l659l604
56682C97900l239k265r98k71p75j831j798m34L82o91k333k660k096k352l432l819
56666C69288l040k076j555j258j337k347m004n261n615n323m506l134j609m99
56652C27724N4K6p24j777k139j703j592k291k739k287k004k757l477k929j765
56637B99620j186r91o32p21j572j821n95N13O9k47J751M561M822K516Q20J022
$$ y = [896653, 857272, 825022, 798716, 777699, 762659, 753495, 749071, 749622, 756997, 771789, 792359, 817301, 846307, 877207, 904137, 920506, 922943, 911743, 889064, 857991, 822062, 784075, 745523, 707610, 671977, 639924, 611813, 587636, 567205, 549449, 532775, 516740, 502301, 489972, 478925, 468509, 459395, 452395, 447166, 442803, 438728, 434328, 428720, 421817, 414905, 409343, 405163, 401504, 397900, 394661, 392396, 391398, 391127, 390352, 388521, 386723, 386289, 386671, 385980, 383647, 380987, 378891, 376539, 373107, 369288, 366248, 364172, 362617, 361359, 360022, 357675, 353671, 348410, 342795, 337472, 332966, 329832, 328223, 327724, 327778, 327804, 327080, 325303, 323164, 321461, 319869, 317578, 314839, 312552, 310548, 307791, 304314, 301385, 299620, 298434, 297443, 296811, 296090, 294518, 292697, 292102, 292615, 292684, 292437, 294188, 298749, 303571, 306087, 306907, 307929]
56621C07929J181J47n24L55J588J960K145K922L476K963K126J979K134J674P56
56606C32811K18K59M17N23R70K047L242L412J936k44j455j350j288k211l326l571
56590C32390l225l062l110l180l467l629k662p80Q7r70k295k310j848k081k135
56575B97723j084l44j369k459j029K098L771L076J803J110O85P23J607K060O41
56560C09012j216q12J450K513J437L85O28J054J190K241M123M647L020J471J835
56545C32978K986L131K514K286K357J978J293J083J721L002M274M622L888L203
56531C71316L432L745L179K635L169L410J418j537k244l91J176J149J231K323
56517C94011K809J873J337K590M360N112N355O048O899P608Q805J0411J1114J0731
$$ y = [307929, 309110, 309257, 308733, 309088, 310676, 312636, 314781, 317703, 321179, 324142, 326268, 328247, 330381, 332055, 332811, 333029, 333288, 333705, 334228, 335198, 337245, 340487, 343899, 345835, 345591, 344136, 342786, 341498, 339287, 335961, 332390, 329165, 326103, 322993, 319813, 316346, 312717, 310055, 309275, 309362, 308392, 306097, 303787, 301939, 299858, 297723, 296639, 296295, 294926, 292467, 291438, 293536, 297307, 300383, 302186, 303296, 303981, 304704, 306311, 308371, 309012, 307796, 306984, 308434, 310947, 312384, 312769, 313397, 314451, 315641, 317882, 322005, 326652, 329672, 331143, 332978, 335964, 339095, 341609, 343895, 346252, 348230, 349523, 350606, 352327, 355329, 359603, 364225, 368113, 371316, 374748, 378493, 381672, 384307, 387476, 390886, 392304, 390767, 388523, 388132, 389308, 390457, 391688, 394011, 396820, 398693, 400030, 402620, 406980, 412092, 417447, 423495, 430394, 438002, 446807, 457218, 468332, 479063]
56503D79063J0955J2473J3500J2782J2046J3511J6509J8480J8268J6868J5726
56492F40181J5476J5777J5627J4442J3019J2396J1892R748N765J639j404l525
56480G51033m876n487o627r772j3809j5740j4842j3669j4122j5139j5276j4981
56468F06693j4906j4420j3306j2864j3626j3913j2158r110o401m604l855m593
56456D82937o316p229o412n013m310m204m406n314o717p376o866o113n386l764
56442D03511j452l92j443l033l712l926m146l531j869n94m17KJ489K604K052Q75
56426C86018N48P64P85J134K256L138K905K313K231K171J633J169J048O04k0M54
56410D09151J933K595K234L232O490R165Q605O106M361L682L222L668N719P602
$$ y = [479063, 490018, 502491, 515991, 528773, 540819, 554330, 570839, 589319, 607587, 624455, 640181, 655657, 671434, 687061, 701503, 714522, 726918, 738810, 748558, 754323, 755962, 754558, 751033, 746157, 740670, 734043, 724271, 710462, 694722, 679880, 666211, 652089, 636950, 621674, 606693, 591787, 577367, 564061, 551197, 537571, 523658, 511500, 502390, 495989, 491385, 487530, 482937, 476621, 469392, 462980, 457967, 453657, 449453, 445047, 439733, 433016, 425640, 418774, 412661, 407275, 403511, 402059, 401667, 400224, 397191, 393479, 389553, 385407, 381876, 380007, 379413, 378996, 378998, 380487, 383091, 385143, 386018, 386566, 387330, 388115, 389249, 391505, 394643, 397548, 399861, 402092, 404263, 405896, 407065, 408113, 408717, 408697, 409151, 411084, 413679, 415913, 419145, 425635, 434800, 443405, 449511, 453872, 457554, 460776, 464444, 470163, 477765]
56396D77765P132N100M078M815O058O738O339M312J215p81n14K84m40k074k880
56381E17147k809k671k067o17R2j584m491n996n344l736k127q92o82j619k529
56366D80075k592k546k894k565j107k62j369l080l785m232n250n214k862o22j518
56351D40177m221n016l606l038m284m893l371j360o85j041j494j836j749n43J492
56336D04532L083L701M037M571N064N324N330M751L675L189M001N087N139M625
56322D66109M796N461N511N091N302O032N844M038J578n2j03R19J474M61j139
56307E11322j278J12R48N05O45K363L697K915J440J212J447O51j34R90L334M745
56291E34914M970N186N358M717L820L616L457K450J591K067K709J832M05O96K686
$$ y = [477765, 484897, 489997, 494075, 498890, 504948, 511686, 518025, 522337, 523552, 522771, 522257, 522541, 522101, 520027, 517147, 514338, 511667, 509600, 508983, 509075, 507491, 503000, 497004, 491660, 487924, 485797, 484905, 484223, 482604, 480075, 477483, 474937, 472043, 469478, 468371, 468109, 466740, 463660, 459875, 455643, 450393, 445179, 442317, 441695, 440177, 435956, 430940, 427334, 424296, 420012, 415119, 411748, 410388, 409703, 408662, 407168, 405332, 403583, 403040, 404532, 407615, 411316, 415353, 419924, 424988, 430312, 435642, 440393, 444068, 447257, 451258, 456345, 461484, 466109, 470905, 476366, 481877, 486968, 492270, 498302, 504146, 508184, 509762, 509710, 509607, 510526, 512000, 512461, 511322, 510044, 510156, 511104, 511609, 512254, 514617, 518314, 521229, 522669, 523881, 525328, 525979, 525845, 526835, 530169, 534914, 539884, 545070, 550428, 555145, 558965, 562581, 566038, 568488, 570079, 572146, 574855, 576687, 577092, 577788, 580474]
56276E80474M508N495O191O379N734N460O684Q242Q497Q135Q508Q895Q287Q342
56262F79831J1025J4617J5699J4248J3148J3400J3518J3159J3594J4695J4988
56251H31922J4592J4848J5166J3626J0719R090R435R804R114Q260P600O447N326
56238I65949N731P296Q023P565P583Q711R967J1200J3270J5675J6871J7197J8660
56225A113698K1567K4143K5749K7651L0292L2560L4305L7011M1334M6170N0542
56214A485022N4475N7942O0924O4420O9342P4799P9516Q4321R0926R9027J07216
56203B327930J15949J26733J38969J50629J61637J73617J86730J99614K12039
56194C793847K24610K36377K45742K53108K59495K63163K60954K52594K40255
$$ y = [580474, 584982, 590477, 596668, 603047, 608781, 614241, 620925, 629167, 637664, 645799, 654307, 663202, 671489, 679831, 690856, 705473, 721172, 735420, 748568, 761968, 775486, 788645, 802239, 816934, 831922, 846514, 861362, 876528, 890154, 900873, 909963, 919398, 929202, 938316, 946576, 954176, 960623, 965949, 971680, 978976, 986999, 994564, 1002147, 1010858, 1020825, 1032025, 1045295, 1060970, 1077841, 1095038, 1113698, 1135265, 1159408, 1185157, 1212808, 1243100, 1275660, 1309965, 1346976, 1388310, 1434480, 1485022, 1539497, 1597439, 1658363, 1722783, 1792125, 1866924, 1946440, 2030761, 2121687, 2220714, 2327930, 2443879, 2570612, 2709581, 2860210, 3021847, 3195464, 3382194, 3581808, 3793847, 4018457, 4254834, 4500576, 4753684, 5013179, 5276342, 5537296, 5789890, 6030145]
56185F030145K24377K03303J76770J46277J12415P5331L7464K354k8935n6931
56175F922570q0429r8010j11899j25555j37922j44930j46756j48422j52496j56181
56165E619970j57023j56869j58503j62001j66039j69643j71575j70907j68874
56156D138536j67334j65486j61355j56022j52315j49708j45009j38014j31576
56147B771717j25928j18254j08550j00467r5088q9144q1101p3753o8781o3746
56137A846905n7064n1209m8149m5722m1519l6758l3488l1115k8401k5981k4465
56126A423034k2584j9293j5513j2303r684q133q351q764o438j486K687M390N517
56113A323079P639R846J1456J3318J5353J6236J6302J7244J8571J8245J7166J8419
$$ y = [6030145, 6254522, 6457825, 6634595, 6780872, 6893287, 6968618, 7006082, 7008436, 6979501, 6922570, 6842141, 6744131, 6632232, 6506677, 6368755, 6223825, 6077069, 5928647, 5776151, 5619970, 5462947, 5306078, 5147575, 4985574, 4819535, 4649892, 4478317, 4307410, 4138536, 3971202, 3805716, 3644361, 3488339, 3336024, 3186316, 3041307, 2903293, 2771717, 2645789, 2527535, 2418985, 2318518, 2223430, 2134286, 2053185, 1979432, 1910651, 1846905, 1789841, 1738632, 1690483, 1644761, 1603242, 1566484, 1532996, 1501881, 1473480, 1447499, 1423034, 1400450, 1381157, 1365644, 1353341, 1343657, 1335524, 1327173, 1318409, 1311971, 1310485, 1313172, 1317562, 1323079, 1330718, 1340564, 1352020, 1365338, 1380691, 1396927, 1413229, 1430473, 1449044, 1467289, 1484455, 1502874]
56101A502874K1436K1845J8227J4272J2894J2905J2912J3664J4961J4890J3931
56090A674811J5214J9193K2667K4653K8252L5126M3050N0676N9514O9299P6641
56079B119096Q0597Q4541R0436R6399J01996J10431J22857J35638J45677J53163
56069C240831J56797J52363J39285J23184J08640R4791Q0938P0378O4540N8699
56059D290446M7914L2873J6409p89j7298k9073l4766l8828m5717n5218o6434q1147
56047D018372r9308j16109j27533j34556j38487j37148j29474j18986j08854r8079
56037B809838q5934p5114o6846n8174m7977m0327l7860l7075l4333l1295l0274
56026B264629k9522k7298k5299k4110k0776j5045j1906j3381j4052r626l865j577
$$ y = [1502874, 1524310, 1546155, 1564382, 1578654, 1591548, 1604453, 1617365, 1631029, 1645990, 1660880, 1674811, 1690025, 1709218, 1731885, 1756538, 1784790, 1819916, 1862966, 1913642, 1973156, 2042455, 2119096, 2199693, 2284234, 2374670, 2471069, 2573065, 2683496, 2806353, 2941991, 3087668, 3240831, 3397628, 3549991, 3689276, 3812460, 3921100, 4015891, 4096829, 4167207, 4231747, 4290446, 4338360, 4371233, 4387642, 4386853, 4369555, 4340482, 4305716, 4266888, 4221171, 4165953, 4099519, 4018372, 3919064, 3802955, 3675422, 3540866, 3402379, 3265231, 3135757, 3016771, 2907917, 2809838, 2723904, 2648790, 2581944, 2523770, 2475793, 2435466, 2397606, 2360531, 2326198, 2294903, 2264629, 2235107, 2207809, 2182510, 2158400, 2137624, 2122579, 2110673, 2097292, 2083240, 2073614, 2069749, 2068172]
56014B068172q04K278O268Q335R921J3034J5660J6166J7333K0982K3858K3698
56002B224901K3804K6703K9188K8697K8362L0554L1900L0246K9798L3472L7003
55991B554628L6671L5960L8122L9445L6844L5034L8636M3916M5835M6754N0628
55980C002473N5237N7714O1166O8320P5186P8447Q2026Q8929R4110R3498R2341
55969C849447R6328J02001J04407J06229J10753J14253J14406J17604J28244J39597
55959D983269J45292J50651J62006J74337J81140J87331K00098K15783K28292
55950F628199K41658K61319K81809K96355L10054L29997L51119L65805L78824
55941I445139L98601M22410M44300M68362M99656N31850N58979N89222O31385
$$ y = [2068172, 2067368, 2069646, 2075914, 2084249, 2094170, 2107204, 2122864, 2139030, 2156363, 2177345, 2201203, 2224901, 2248705, 2275408, 2304596, 2333293, 2361655, 2392209, 2424109, 2454355, 2484153, 2517625, 2554628, 2591299, 2627259, 2665381, 2704826, 2741670, 2776704, 2815340, 2859256, 2905091, 2951845, 3002473, 3057710, 3115424, 3176590, 3244910, 3320096, 3398543, 3480569, 3569498, 3663608, 3757106, 3849447, 3945775, 4047776, 4152183, 4258412, 4369165, 4483418, 4597824, 4715428, 4843672, 4983269, 5128561, 5279212, 5441218, 5615555, 5796695, 5984026, 6184124, 6399907, 6628199, 6869857, 7131176, 7412985, 7709340, 8019394, 8349391, 8700510, 9066315, 9445139, 9843740, 10266150, 10710450, 11178812, 11678468, 12210318, 12769297, 13358519, 13989904]
55932A3989904O78552P21147P64480Q15908Q67239R09055R50472J004713J067339
55923B1768809J129155J197461J282228J374569J462234J553121J659335J772606
55915C3199518J881123J995220K128712K271198K408966K556873K737942K949069
55907E2128621L180316L447730L769393M130885M517356M959520N504640O167434
55899H7805895O957954P925656R113541J0497267J2037971J3767459J5753616
55892A63859359J8028296K0636937K3693550K7253972L1189944L5318949L9464159
55885C59445166M2929167M3842988L9649308K8984438J3258533l851472j8611571
55878E05646557k9041154l5035431l7448922l7348587l5732576l3369150l0676938
$$ y = [13989904, 14668456, 15389603, 16154083, 16969991, 17837230, 18746285, 19696757, 20701470, 21768809, 22897964, 24095425, 25377653, 26752222, 28214456, 29767577, 31426912, 33199518, 35080641, 37075861, 39204573, 41475771, 43884737, 46441610, 49179552, 52128621, 55308937, 58756667, 62526060, 66656945, 71174301, 76133821, 81638461, 87805895, 94763849, 102689505, 111803046, 122300313, 134338284, 148105743, 163859359, 181887655, 202524592, 226218142, 253472114, 284662058, 319981007, 359445166, 402374333, 446217321, 485866629, 514851067, 528109600, 524258128, 505646557, 476605403, 441569972, 404121050, 366772463, 331039887, 297670737, 266993799]
55871B66993799k7816895k4905119k2085110j9457616j7061445j4928329j3086146
55864A27653139j1514381j0158226q984634p981022p114919o344855n661836n076995
55856F4816271m577697m134800l742005l408713l122578k856198k604245k380442
55848C7989593k184327k002899j838964j706751j603237j511527j428063j360074
55840B4353751j300655j232656j154496j078589j007497r34227q62397q03454
55832A5979780p55887p07863o58196o15684n80518n45252n11182m85501m64958
55823A0654739m40089m12829l92669l78313l60191l38433l21523l09713k96200
55814G404779k82257k74825k71197k61994k47668k36722k29559k19285k06564
$$ y = [266993799, 239176904, 214271785, 192186675, 172729059, 155667614, 140739285, 127653139, 116138758, 105980532, 96995898, 89014876, 81899957, 75555102, 69893266, 64816271, 60238574, 56103774, 52361769, 48953056, 45830478, 42974280, 40370035, 37989593, 35805266, 33802367, 31963403, 30256652, 28653415, 27141888, 25713825, 24353751, 23053096, 21820440, 20665944, 19587355, 18579858, 17645631, 16783234, 15979780, 15223893, 14516030, 13857834, 13242150, 12661632, 12116380, 11605198, 11119697, 10654739, 10214650, 9801821, 9409152, 9030839, 8670648, 8332215, 8010692, 7700979, 7404779, 7122522, 6847697, 6576500, 6314506, 6066838, 5830116, 5600557, 5381272, 5174708]
55805E174708j98402j93763j85437j74723j69159j66871j58481j43961j32742
55796C651169j26939j19149j07353r7738r1742q4075p5115p2096p6080p9866q0325
55785B640691q1146q2318p8818p1211o5945o3599n8162m9361m4285m4874m4953
55774A956019m1772l9517l9304l6581l1262k9821l4050l7564l6803l6068l8176
55763A555101l9209l6507l3684l3599l3523l0975k7963k6407k5194k3902k3857
55752A220281k4000k1651j8164j7547j9029j7829j3645j1034j0762q762m661l254
55740A049943n640o859m621k893m266n910n939p125j1146j5052j6327j6296j6267
55727I31602j5396j4021j4086j4843j3479j0768j0506j2604j2798j0094q066p758
$$ y = [5174708, 4976306, 4782543, 4597106, 4422383, 4253224, 4086353, 3927872, 3783911, 3651169, 3524230, 3405081, 3297728, 3199990, 3108248, 3024173, 2949058, 2876962, 2800882, 2721016, 2640691, 2559545, 2477227, 2398409, 2327198, 2261253, 2197654, 2139492, 2090131, 2045846, 2000972, 1956019, 1914247, 1874730, 1835426, 1798845, 1767583, 1737762, 1703712, 1666148, 1629345, 1593277, 1555101, 1515892, 1479385, 1445701, 1412102, 1378579, 1347604, 1319641, 1293234, 1268040, 1244138, 1220281, 1196281, 1174630, 1156466, 1138919, 1119890, 1102061, 1088416, 1077382, 1066620, 1057858, 1053197, 1049943, 1044303, 1037444, 1032823, 1029930, 1025664, 1019754, 1013815, 1006690, 995544, 980492, 964165, 947869, 931602, 916206, 902185, 888099, 873256, 859777, 849009, 838503, 825899, 813101, 803007, 794941, 787183]
55715G87183o177l420m239j0135j6333j9215k0744k2955k4019k2547k0464j8939
55703E97996j6487j3278j2227j3612j3846j1652j0295j1622j3194j3598j5095
55692D53090j8580k1079k0899k0283k0398j8669j3691q003l318K150Q764J2780
55680C31864J1776Q659P034O382M803K924K173K165K231K707L035J682o55j275
55666C85505KK50j393k263j219p64k470m486n305n869o370n285l110k556l447
55651C41220k226J694M137K962J520K714M536M603M455N824O811N322K832J525
55637C87929Q76j01m25M66J091R36J773L896M839L902L875N910P051N512L998
55622D31528M620M894K325j018k220k104k361j781N95K018j1l016l021m02J613
$$ y = [787183, 781006, 777586, 773347, 763212, 746879, 727664, 706920, 683965, 659946, 637399, 616935, 597996, 581509, 568231, 556004, 542392, 528546, 516894, 506599, 494977, 481783, 468185, 453090, 434510, 413431, 392532, 372249, 351851, 333182, 319491, 311488, 308170, 310320, 319084, 331864, 343640, 352299, 359333, 365715, 370518, 373442, 375615, 377780, 380011, 382718, 385753, 387435, 386780, 385505, 385507, 385757, 384364, 382101, 380882, 380118, 377648, 373162, 367857, 361988, 355618, 350333, 347223, 344667, 341220, 338994, 340688, 344825, 347787, 349307, 352021, 356557, 361160, 365615, 371439, 378250, 383572, 386404, 387929, 388805, 388704, 388279, 388745, 389836, 390772, 392545, 396441, 401280, 405182, 409057, 414967, 422018, 427530, 431528, 436148, 441042, 443367, 442349, 440129, 438025, 435664, 433883, 434478, 436496, 436485, 433469, 430448, 430046, 431659]
55607D31659K095K314K489K177K264L346L853K467N24l52p48j185j52K724M499
55592D57974L043O33J13K95j209l277l476k805m004o783q686r338j0078j0629
55578D01773r940r220j0453j2686j3233j1925j0915j0829j0295q981q224q687
55566B76385r685j0584j0906r779p156m844m392m876m600l711l355l488l567l978
55552A91464m798m593k605n97k90n83K61J340Q00n71n32P85J085m60k424l532
55536A74750l678k956j694j062j911l378m047l604k303j32K067K441P66n48lN60
55520A55268p70k388j808J3K03j430k682k870l083l221j977K46J401Q75K0l69
55504A37428o96p21M96K528L632L074J704K80j025j607q81L32N37k29n72j4M47
$$ y = [431659, 433754, 436068, 438557, 440734, 442998, 446344, 450197, 452664, 453188, 452836, 452088, 450903, 450751, 453475, 457974, 461017, 461650, 461763, 462058, 460849, 457572, 454096, 451291, 447287, 440504, 431818, 422480, 412402, 401773, 391833, 382613, 372160, 359474, 346241, 334316, 323401, 312572, 302277, 293296, 285072, 276385, 266700, 256116, 245210, 235431, 228275, 223431, 219039, 214163, 209563, 205852, 202497, 199009, 195442, 191464, 186666, 182073, 179468, 178871, 178581, 177998, 178259, 179599, 180399, 179828, 179296, 180081, 181166, 180706, 178282, 174750, 171072, 168116, 166422, 165360, 163449, 160071, 156024, 152420, 150117, 149985, 152052, 154493, 155259, 154711, 154708, 155268, 154498, 152110, 150302, 150315, 150518, 149088, 146406, 143536, 140453, 137232, 135255, 135501, 136902, 137777, 137797, 137428, 136732, 136011, 136507, 139035, 142667, 145741, 147445, 147725, 146700, 145093, 144212, 144544, 145081, 144852, 144280, 144266, 144713]
55487A44713L6j040k416l756m193l004q18R48J697J824J772J947K952M711N827
55472A51200N068L132J866K151L419M696N233M741L835L456L303J963p28k807
55458A90528k793j710j457k414l922n619o960o894n549m849n853o900o083m209
55444A25316l430m043m647m477l776k722j698j774l316m921n148m371l689l121
55430G4183k303j559r07N06K409K545k21l559m549l456k483k205j714j136j347
55415E4204j931j736r85p27q53n54o4j25m96o20p54q64J90K589M169L242J214
55398E5899J89l34j794l292l020j672j214j328l30J281J452K86j44O09J064P25
55382D8377M21Qj315k568j961r9P13J60o9K66j97j185q71N26P06o19j033L95J525
$$ y = [144713, 144749, 143709, 141293, 137537, 133344, 130340, 129522, 130470, 132167, 133991, 135763, 137710, 140662, 145373, 151200, 156268, 159400, 161266, 163417, 166836, 171532, 176765, 181506, 185341, 188797, 192100, 194063, 193335, 190528, 187735, 186025, 184568, 182154, 178232, 172613, 165653, 158759, 153210, 148361, 142508, 135608, 129525, 125316, 121886, 117843, 113196, 108719, 104943, 102221, 100523, 98749, 95433, 90512, 85364, 80993, 77304, 74183, 71880, 70321, 69414, 69920, 72329, 74874, 74653, 71094, 66545, 63089, 60606, 58401, 56687, 55551, 54204, 52273, 50537, 49552, 48825, 47972, 47418, 47354, 47229, 46733, 46113, 45359, 44495, 44685, 47274, 51443, 54685, 55899, 56088, 55754, 53960, 50668, 47648, 45976, 44762, 43434, 43104, 44385, 45837, 46123, 45979, 46588, 47652, 48377, 48798, 48806, 47491, 44923, 42962, 42863, 43576, 43736, 43667, 43933, 43736, 42551, 41680, 42206, 42912, 42293, 41260, 41655, 43180]
55363D3180R44P6K38N68L21L77Q67J18k170l327j440J442K205R38J5L44R29J252
55345D6877J827K600K739K018J151O57L24k32j158k332l214l034j605J95J152
55330D7965R01K89M69J593K443J780kj256j347j360k119k858k739k353k281j586
55314C7539N30K678K882J529N71L68l81j818k311j063O39J356J178J056J532K464
55298D8749L077K389M26j417k020j903j884j522l66L75n75k095j996k31J271J585
55282D3863J395J044K22n99o42o06j852l876m724l893k640j509J86K162K792J462
55266C2785n53j902k246j513P6J229O78q46j478q29j6O33J759L064L449K978K583
55249C9851J993K93j756k345j532j030j145n70P94J524J346J403J741J382R25
$$ y = [43180, 44124, 44200, 44438, 45006, 45327, 45704, 46571, 46689, 44519, 41192, 39752, 41194, 43399, 44337, 44352, 44696, 45625, 46877, 48704, 51304, 54043, 56061, 57212, 57869, 58193, 57961, 56803, 54471, 51257, 48223, 46618, 46813, 47965, 48866, 49155, 49624, 51217, 53660, 55440, 55438, 54182, 52835, 51475, 49356, 46498, 43759, 41406, 39125, 37539, 38069, 40747, 43629, 45158, 45729, 46097, 45716, 43898, 41587, 40524, 41163, 42519, 43697, 44753, 46285, 48749, 51826, 54215, 54641, 53224, 51204, 49301, 47417, 45895, 45529, 45904, 45329, 43234, 41238, 41007, 42278, 43863, 45258, 46302, 46524, 45925, 45283, 44677, 42825, 38949, 34225, 30332, 27692, 26183, 26369, 28531, 31323, 32785, 32232, 30330, 28084, 26571, 26647, 27876, 28554, 27708, 26230, 25401, 25385, 26018, 27777, 30841, 34290, 37268, 39851, 41844, 42137, 40381, 38036, 36504, 35474, 34329, 33759, 34553, 36077, 37423, 38826, 40567, 41949, 42874]
55234D2874J889L265K186j267l506k708j193j117j232J39J946K443J936J468Q78
55219D8001k8l55J25J04q86j335m59J94m79j052j24J102Q83k89r45j099j502j940
55201C9916k062k516l595m089k968r65Q22K353L482L208J453r0l99n94j605k294
55185C0057j556l45J69M97J156J062l64j382m38J259J807J586J822J934Q60m59
55169C7665n17P4k7r0J327L183L099J148k68n8O11Q31R28Q97K04o58l19J390L061
55150E2481L521K709J006q46j585q22k12j491l640l872j407J521K572J651J00
55135E1686r23r54k26M07L09r5p5K02M1m94p71p35q44r94n99L06Q57L94p55j496
55115D5241q25R84J976L73k873m632l306n91J145J660J813J460J19j393j864j455
$$ y = [42874, 44763, 48028, 50214, 48947, 45441, 42733, 41540, 40423, 39191, 39330, 41276, 43719, 45655, 47123, 48001, 47973, 47618, 47743, 47847, 46961, 45626, 45167, 45361, 44882, 43830, 43706, 44808, 45691, 45402, 44457, 43358, 41856, 39916, 37854, 35338, 31743, 27654, 24686, 23721, 24543, 26896, 30378, 33586, 35039, 34949, 34550, 33956, 32351, 30057, 28501, 28156, 28325, 28822, 29978, 31040, 30676, 29294, 28856, 30115, 31922, 33508, 35330, 37264, 38124, 37665, 37148, 37222, 37195, 37105, 38432, 41615, 44714, 45862, 45594, 45536, 46147, 46978, 47906, 48803, 49007, 48349, 48030, 49420, 52481, 56002, 58711, 59717, 58871, 57286, 56464, 56252, 54761, 51121, 47249, 45842, 47363, 49935, 51586, 51686, 50763, 49809, 49583, 49990, 50299, 50204, 50129, 50331, 50372, 49878, 49107, 48372, 47528, 46534, 45935, 46241, 47098, 47492, 46737, 45241, 44416, 45400, 47376, 47749, 44876, 40244, 36938, 36347, 37492, 39152, 40965, 42425, 42544, 41151, 39287, 37832]
55099C7832j152j095q97p38p57k03J232K174J279o16j638j463j061o81J35J033
55083C3384J155O10P4n21j377j594k88J587K339J987J849K135J895J095Q25J458
55067D6613K259K790L177L193K605K181K749L496K896J084l84q74j028j018m67
55052F9272O8m22j311q63Q86J838R62j90qR58J242N58l66r96j148p34m1L68M31
55033G0504O14R69J025O99M82N89Q01J197K052K857K618J357L10K92P33Q19P01
55016H8619J126K227L104K604O20j358j602k44Q90R97J426L060M099K397r69k761
55000A04235j903m57k82q96j187j329j966k744k758j760l33O87Q25L94J82L13
54984I1021Mr57j371l83R17J106P54J315K421K454J389P40O67l20k471l933l502
$$ y = [37832, 36680, 35585, 34688, 33950, 33193, 32990, 34222, 36396, 37675, 37059, 35421, 33958, 32897, 32216, 32351, 33384, 34539, 35149, 35223, 34702, 33325, 31731, 31443, 33030, 35369, 37356, 39205, 41340, 43235, 44330, 45155, 46613, 48872, 51662, 54839, 58032, 60637, 62818, 65567, 69063, 71959, 73043, 72659, 71785, 70757, 69739, 69272, 69340, 68918, 67607, 66744, 67630, 69468, 70430, 70240, 70232, 71190, 72432, 72990, 72624, 71628, 70480, 69746, 69705, 70073, 70504, 71118, 72087, 73112, 73811, 74293, 74882, 75683, 76880, 78932, 81789, 84407, 85764, 86074, 86366, 87099, 87918, 88619, 89745, 91972, 95076, 97680, 98300, 96942, 95340, 95096, 95986, 96983, 98409, 101469, 105568, 107965, 106996, 104235, 102332, 101875, 101593, 100697, 99510, 98181, 96215, 93471, 90713, 88953, 88620, 89307, 90132, 90526, 90708, 91021, 91025, 90068, 88697, 88314, 89231, 90337, 91091, 92406, 94827, 97281, 98670, 99410, 100077, 99757, 97286, 93353, 89851]
54967H9851k123q45O21K303K766J072j449k675k071o60M78Q46N66N05J500K962
54951I3647L213J677k33r83n15M01J233J484O54p80j377m46J007J660J311N26
54935A02479j48k08M56Q67j19j789j992j72J617J694R96J109J601J182L39P01
54919A08613K232K959J622q27k569k741j708m23K44J12l02n62p55p84J86K637
54903A07934N442O657N697L923K964L141L814M672N919P408Q289Q019P378P772
54889A89029R443J0998J1213J0609J0621J1687J2929J3368J2558J0267O582K328
54877C11632j344m020o070p857r497j1062j2250j2250j0886r374q892q837p923
54864B01370o566o391p483q040p063n528m372l133j383J05P20J139K106L152L593
$$ y = [89851, 87728, 86883, 87504, 89807, 92573, 93645, 92196, 89521, 87450, 86790, 87268, 88114, 88680, 89185, 90685, 93647, 96860, 98537, 98304, 97321, 96806, 97207, 98440, 99924, 100578, 99798, 98421, 97975, 98982, 100642, 101953, 102479, 102331, 102123, 102579, 103446, 103327, 101538, 99546, 99374, 100991, 102685, 103681, 104790, 106391, 107573, 107912, 108613, 110845, 113804, 115426, 114599, 112030, 109289, 107581, 107158, 107402, 107514, 107212, 106650, 105895, 105111, 105297, 107934, 113376, 120033, 125730, 129653, 132617, 135758, 139572, 144244, 150163, 157571, 165860, 173879, 181257, 189029, 198472, 209470, 220683, 231292, 241913, 253600, 266529, 279897, 292455, 302722, 309304, 311632, 310288, 306268, 300198, 292341, 282844, 271782, 259532, 247282, 236396, 227022, 218130, 209293, 201370, 194804, 188413, 180930, 172890, 165827, 160299, 155927, 152794, 151411, 151516, 152236, 153375, 155481, 158633, 162226]
54849A62226L656L779L896M207N543P949J0087J1036J1483J2146J2293J1255J0020
54836B69576R662R132O514J917k697o160q903j1234j2701j3202j3218j2650j0899
54823B05137q462p028p393q384q550p941p395o875n543l255j116l54j034k100
54809A29707k555k446k438k553k002o63Oj368l694m051j281K119K713K25k371
54794A09348k667j482j159k349l613l708k948k182j597j006n68m57l34K54J191
54779H6723J990K282J772K92j587k543j888n79n9m02m99J51Q42Q52M49M33J225
54762H9454K444L140K592J268O75J664L300M041L553K707K256K393L100L972M103
54747A30662L269K804M121O604Q225Q029O749N308M120L792M795O336P057P154
$$ y = [162226, 165882, 169661, 173557, 177764, 183307, 191256, 201343, 212379, 223862, 236008, 248301, 259556, 269576, 279238, 288370, 294884, 296801, 294104, 287944, 279041, 267807, 255106, 241904, 228686, 216036, 205137, 196675, 189647, 182254, 173870, 165320, 157379, 149984, 143109, 137566, 134311, 133195, 132841, 131807, 129707, 127152, 124706, 122268, 119715, 117713, 117050, 117056, 115688, 111994, 107943, 106662, 108781, 111494, 111719, 109348, 106681, 105199, 104040, 101691, 98078, 94370, 91422, 89240, 87643, 86637, 86069, 85612, 85278, 85532, 86723, 88713, 90995, 92767, 93059, 91472, 88929, 87041, 86462, 86403, 86001, 85502, 85653, 86495, 87347, 87796, 88229, 89454, 91898, 95038, 97630, 98898, 99573, 101237, 104537, 108578, 112131, 114838, 117094, 119487, 122587, 126559, 130662, 133931, 136735, 140856, 147460, 155685, 163714, 170463, 175771, 179891, 183683, 188478, 194814, 201871, 209025]
54733B09025Q282J1041J4001J5670J6074J5811J4894J3243J1193Q896O125L086
54721C47341M31j880m520p285q909q887q228p829p371o444n526n133n034m967
54707B65759n081n152m445k988j748j067j42J353K501K739K858L536M184M270
54693B66577M586O160Q831J1787J4537J6582J7307J6940J6650J6868J6768J5820
54681D29413J4425J2180P514K88o946j1815j4687j6833j7746j6430j4073j3034
54669C52256j3846j5194j6174j6627j5840j3267j0226q804q945q506o376l860
54657B14591k619k745l320l646l355k259o29Q17J442J011k02j393j765j482j320
54642A93126j141O8K072K882J544r1k8Q77N88n81o17O83J383O15l19l69j46l34
$$ y = [209025, 217307, 228348, 242349, 258019, 274093, 289904, 304798, 318041, 329234, 338130, 344255, 347341, 347772, 345892, 341372, 334087, 325178, 316291, 308063, 300234, 292863, 286419, 280893, 275760, 270726, 265759, 260678, 255526, 251081, 248093, 246345, 245278, 245136, 246489, 248990, 251729, 254587, 258123, 262307, 266577, 271163, 277323, 286154, 297941, 312478, 329060, 346367, 363307, 379957, 396825, 413593, 429413, 443838, 456018, 463532, 463820, 456874, 445059, 430372, 413539, 395793, 379363, 365290, 352256, 338410, 323216, 307042, 290415, 274575, 261308, 251082, 242278, 233333, 224827, 218451, 214591, 211972, 209227, 205907, 202261, 198906, 196647, 196018, 196835, 198277, 199288, 199086, 197693, 195928, 194446, 193126, 191985, 192053, 194125, 197007, 198551, 198460, 198432, 199309, 199897, 199316, 198699, 199382, 200765, 201380, 201061, 200692, 200546, 200212]
54624B00212m44J45J247K428L373L470K355J085J316K929L868K771N75j007j389
54609B22934r49NJ419L315N794Q564J0523J0600R181P718O921O278N410M666M223
54594C06602L625K681J854J478J361J366J596J879J956K218L259M681N403N307
54580C45266N485O557P888Q750R263R771J0200J0415J0399R767P785M322J76l707
54566D42337o848r196j1236j3795j6832j8672j7709j4750j2311j1529j1180r908
54554B88371p855n744l829k367j815j816j185M85K161K916K983K785K160J261
54540B78511R54J354J153n50k691l627l270k839l129m095n476o768p066o022m684
54525B31755m555n934p805r038r170q367p200o105m832k978j330j503l534m988
$$ y = [200212, 199768, 199913, 201160, 203588, 206961, 210431, 212786, 213871, 215187, 218116, 221984, 224755, 225330, 224323, 222934, 221985, 221990, 223409, 226724, 232518, 241082, 251605, 262205, 271386, 279104, 286025, 292303, 297713, 302379, 306602, 310227, 312908, 314762, 316240, 317601, 318967, 320563, 322442, 324398, 326616, 329875, 334556, 339959, 345266, 350751, 357308, 365196, 373946, 383209, 392980, 403180, 413595, 423994, 433761, 441546, 445868, 446044, 442337, 435489, 426293, 415057, 401262, 384430, 365758, 348049, 333299, 320988, 309459, 298279, 288371, 280516, 274772, 270943, 268576, 266761, 264945, 263760, 264245, 266406, 269322, 272305, 275090, 277250, 278511, 279465, 280819, 281972, 281422, 278731, 275104, 271834, 268995, 265866, 261771, 256295, 249527, 242461, 236439, 231755, 227200, 221266, 213461, 204423, 195253, 186886, 179686, 173581, 168749, 165771, 164441, 162938, 159404, 154416]
54511A54416l731p57J094P16n75j521k292l060l006j654j39O5r27j615j054K39
54495A36199J251J559J294O71K0j34L74Q45M28n47o41Q52K702L044J556l87j497
54478A47589j646j208k38J253K814L901M399M617M934N637O669P516P589O786
54464B00612N467M031K919K744L619M405L499P05k402m264m908n362o131o815
54450A98119o802n887m349k889k318k991m479n847o200n210l478k151j797j760
54436A41961j131n8N49N53Q44J915L041L193K113K54j675k776k286l70J812L174
54420A51113L466K908J753N31J05Q90K367L611M138M012L598L324L215K647J085
54405A88763q96j973j575l68Q31J764K261K017J235O53M93K76m0K58J179J416
$$ y = [154416, 150685, 149928, 151022, 151738, 151163, 149642, 147350, 144290, 141284, 139630, 139491, 139556, 138629, 137014, 135960, 136199, 137450, 139009, 140303, 140974, 140994, 140860, 141234, 142079, 142507, 141960, 141319, 142171, 144873, 147917, 149473, 149086, 147589, 145943, 144735, 144497, 145750, 148564, 152465, 156864, 161481, 166415, 172052, 178721, 186237, 193826, 200612, 206079, 210110, 213029, 215773, 219392, 223797, 227296, 228001, 225599, 221335, 216427, 211065, 204934, 198119, 191317, 185430, 181081, 178192, 175874, 172883, 168404, 162557, 156357, 151147, 147669, 145518, 143721, 141961, 140830, 140772, 141321, 141874, 142718, 144633, 147674, 150867, 152980, 153234, 151559, 148783, 146497, 146127, 147939, 151113, 154579, 157487, 159240, 159771, 159876, 160766, 163133, 166744, 170882, 174894, 178492, 181816, 185031, 187678, 188763, 187867, 185894, 184319, 183951, 184782, 186546, 188807, 190824, 192059, 192712, 193205, 193481, 193441, 193699, 194878, 196294]
54389A96294Q3j758k371j525m08O2q2n06q29n46K81N76n82k473l471l146k583
54372A77016k554k523j785p15k12n31j168j592j548q82L95J837K676K495J744
54357A72653J416K019K913L029K326K035L058M489M482K591O24O94K752M590M339
54342B14010K558J510K517M611N886N717N119N190N888O366O055N138M310M154
54328B79029M464M215K615K75j270j398j247k292m477o286o589n901n624o301
54314B49213p032o704n499m666m810n109m633l789l600m034m058l339k739k817
54300A86384k861j989n03N51P24M69L00K24k1n17r21p31J74J183J584J504J807
54283A87361K993M539N586N854N731N650N651N422M715L803L312L423L562L198
$$ y = [196294, 196377, 194619, 192248, 190723, 190315, 190377, 190295, 189789, 188960, 188414, 188695, 189271, 188689, 186216, 182745, 179599, 177016, 174462, 171939, 170154, 169439, 169227, 168696, 167528, 165936, 164388, 163506, 163901, 165738, 168414, 170909, 172653, 174069, 176088, 179001, 182030, 184356, 186391, 189449, 193938, 198420, 201011, 201635, 202329, 205081, 209671, 214010, 216568, 218078, 220595, 225206, 231092, 236809, 241928, 247118, 253006, 259372, 265427, 270565, 274875, 279029, 283493, 287708, 290323, 290598, 289328, 287930, 286683, 284391, 279914, 273628, 267039, 261138, 255514, 249213, 242181, 235477, 229978, 225312, 220502, 215393, 210760, 206971, 203371, 199337, 195279, 191940, 189201, 186384, 183523, 181534, 181031, 181582, 182306, 182775, 183075, 183299, 183278, 182761, 181840, 181109, 181283, 182466, 184050, 185554, 187361, 190354, 194893, 200479, 206333, 212064, 217714, 223365, 228787, 233502, 237305, 240617, 244040, 247602, 250800]
54269B50800K535J907R93p05k870m728o132p444q554r025q930q504p233m667k120
54254A85323j798l834n784n806m834m619n061m836l699k672k372k491k678k887
54240A31952k970k739k461k534k787k604j681l31P70R02j73j675k316j715p52
54225A08886k34K0L34L33k50o91k83L14j48j619k526j563R44L337L945K369Nj018
54207A12155Q9K115L530M082M190L666K199O05K47J300K633L378L603L415K512
54192A49719R89k78n76j69K52L61J21o52j939k892k313j86J715J462o22k045j145
54175A41802O29N52j637l226k097N90K089J452P7n23k77O4J65K82O02P54K08q01
54157A40705j202m07N81K54j352k670k658j670j63J960M164M952L783K239K106
$$ y = [250800, 253335, 255242, 256235, 255530, 252660, 247932, 241800, 234356, 225802, 216777, 207847, 199343, 192110, 187443, 185323, 183525, 179691, 173907, 168101, 163267, 158648, 153587, 148751, 145052, 142380, 140008, 137517, 134839, 131952, 128982, 126243, 123782, 121248, 118461, 115857, 114176, 113845, 114615, 115517, 115344, 113669, 111353, 109638, 108886, 108652, 108672, 109006, 109339, 109089, 108398, 108115, 108429, 108281, 106662, 104136, 102573, 103517, 106854, 110799, 113168, 113173, 112155, 112244, 114359, 117889, 121971, 126161, 129827, 132026, 132631, 132878, 134178, 136811, 140189, 143792, 147207, 149719, 150708, 150430, 149854, 149685, 149937, 150298, 150419, 149767, 147828, 144936, 142623, 142437, 144152, 145614, 144992, 142947, 141802, 142431, 142983, 141346, 138120, 136023, 136613, 138702, 140154, 140231, 139708, 139431, 139495, 139660, 139942, 140544, 141298, 141506, 140705, 139503, 139096, 139677, 139931, 138579, 135909, 133251, 131581, 131418, 133378, 137542, 142494, 146277, 148516, 150622]
54142A50622L099L598K821J173q08k574l242k478j400j401k313k824k446k010
54128A39817k221k808l173k996k155p44O48J167L46j482l195l445j961m10q62
54113A16526k956l850j735J827L980L767K140O3j792k445j466N1P97R06J095J038
54097A17946K69k29O07J704J228j85l6K148L948L519J657j73j800l299l879l066
54081A20359j797j239j379j516j265n76K92M05j077l362m328k955m70J318J733
54066A04143R88m82j887k298j642n54P32K206K874J569p50j612o26k97j984l379
54050I7001j959R12J848K81j157p83K25K46m90p94j93J036K456L399L107J597
54034A06732j29j065j081o56j97K7k65j110j912j603L92L238N006M394K110N5
$$ y = [150622, 153721, 157319, 160140, 161313, 160505, 157931, 154689, 152211, 150811, 149410, 147097, 144273, 141827, 139817, 137596, 134788, 131615, 128619, 126464, 125720, 126368, 127535, 127881, 126399, 123204, 119759, 117798, 117388, 116526, 113570, 109720, 107985, 109812, 113792, 117559, 119699, 119762, 117970, 115525, 114059, 114110, 114907, 115813, 116908, 117946, 118215, 117986, 118593, 120297, 121525, 121340, 121304, 123452, 127400, 130919, 132576, 132403, 130603, 127304, 123425, 120359, 118562, 117323, 115944, 114428, 113163, 112587, 112879, 113284, 112207, 108845, 104517, 101562, 101092, 102410, 104143, 105131, 104649, 102762, 100464, 98822, 98268, 99000, 101206, 104080, 105649, 104899, 103287, 102661, 102364, 100380, 97001, 95042, 95954, 97802, 98083, 96926, 96143, 96368, 96614, 96124, 95330, 95137, 96173, 98629, 102028, 105135, 106732, 106603, 105538, 104457, 103801, 103604, 103631, 103366, 102256, 100344, 98741, 99133, 102371, 107377, 111771, 113881, 113936]
54018A13936q47j342k291l349l646l030j988q76N0L77P2k1R21K487L393L086K350
54001A09282K287L165M282M582L497J574K52N03J649K000Q04q21j189k9J307J610
53985A34755J285J640L012M278M394L748L456L852M321M412M310M372M744N477
53971A88056O329O618N933M982N037O483Q486J0080J0813J0448R003P279O454
53958B86001O730P119O828O097N378M620L866L760M632N600N332L529J122p90
53944C49824j932k798l972n423o521o801o480n973n378m857m939n586n601m106
53930B79457k296k197l799m947m358l137k820l350l840m038m081l776l013k166
53916B31639j491q81o98j660l291l749k074M15J919K254K284K310K229K261K362
$$ y = [113936, 113089, 111747, 109456, 106107, 102461, 99431, 97443, 96567, 96617, 96994, 97066, 97045, 97966, 100453, 103846, 106932, 109282, 111569, 114734, 119016, 123598, 127095, 128669, 128921, 129424, 131073, 133073, 133877, 133056, 131867, 131838, 133145, 134755, 136040, 137680, 140692, 144970, 149364, 153112, 156568, 160420, 164741, 169153, 173463, 177835, 182579, 188056, 194385, 201003, 206936, 211918, 216955, 223438, 231924, 242004, 252817, 263265, 272268, 279547, 286001, 292731, 299850, 306678, 312775, 318153, 322773, 326639, 330399, 335031, 340631, 345963, 349492, 350614, 349824, 347892, 345094, 341122, 335699, 329178, 322377, 315897, 309924, 304546, 299689, 294750, 289164, 283563, 279457, 277161, 274964, 271165, 266218, 261860, 258723, 255903, 252553, 248713, 244675, 240594, 236818, 233805, 231639, 230148, 229267, 228569, 226909, 223618, 219869, 217795, 218210, 220129, 222383, 224667, 226977, 229206, 231467, 233829]
53901B33829J744K40p32J77K277L903M599M899M689L531K204K142L327M189L737
53886B74755K595J859K021K977M054M120K758J239J230K741M445N787P268Q653
53872C26502Q639O876M980M657N633O179N130K924R25P2lm15j380j631j71K000
53856C70917K993K559K102K381K620K243K046K975M774O504P629Q043P835P525
53842D33146P769Q394Q300O770M298J794j96j241j032k38m65k425m794n747n147
53827D49186m431m736n928p258q188q548q464q171p729p033o321o170o708p354
53813C52147p765q411r519j0035q744o186m424m682o127p181p236o563n467m302
53799B55505l829m628o128p000o633n589m616l899l586m127n338n796m210j322
$$ y = [233829, 235573, 235813, 235081, 235258, 237535, 241438, 246037, 250936, 255625, 259156, 261360, 263502, 266829, 271018, 274755, 277350, 279209, 281230, 284207, 288261, 292381, 295139, 296378, 297608, 300349, 304794, 310581, 317849, 326502, 335141, 342017, 346997, 351654, 357287, 363466, 368596, 371520, 372445, 372517, 372514, 372099, 370719, 369088, 368917, 370917, 373910, 376469, 378571, 380952, 383572, 385815, 387861, 390836, 395610, 402114, 409743, 417786, 425621, 433146, 440915, 449309, 457609, 464379, 468677, 470471, 470275, 469034, 468002, 467764, 467299, 464874, 460080, 454333, 449186, 444755, 440019, 434091, 426833, 418645, 410097, 401633, 393462, 385733, 378700, 372379, 366209, 359501, 352147, 344382, 335971, 326452, 316417, 307673, 301487, 297063, 292381, 286254, 279073, 271837, 265274, 259807, 255505, 251676, 247048, 240920, 233920, 227287, 221698, 217082, 213183, 209597, 205470, 200132, 194336, 190126, 188804]
53785A88804N67J94j415k511k615k430k505k726k818k644k152j380m23P30J990
53770A68666K610J573r01k874k506r9K407L582L451K630J617Q54N84M54q0q02
53754A81166r47l95J15J52J80O03J001Q58N21Q48K080L590M597M857M689M644
53738B08559N054N770O270O172N680N619O802R005J0604R935P332N063M703N287
53724C01855N004L903L533M192M290K850J030L32N31M79L6m2K55k7j379l062l973
53707C19807l674k516j225n41p42j426j844j559o67L92R44K89j636l849n048m945
53691B91760m414m190l908k854j302l99o89j362j297m42L88P94J186J842K364
53676B77477K429K413K624K387P49j929l973m225l279k576k712l161l338l367
$$ y = [188804, 189371, 189565, 188150, 185639, 183024, 180594, 178089, 175363, 172545, 169901, 167749, 166369, 165946, 166676, 168666, 171276, 172849, 171948, 169074, 166568, 166469, 168876, 172458, 175909, 178539, 180156, 181010, 181594, 182048, 181968, 181166, 180219, 179824, 179939, 180091, 180271, 180874, 181875, 182733, 183254, 184102, 186182, 189772, 194369, 199226, 203915, 208559, 213613, 219383, 225653, 231825, 237505, 243124, 249926, 258931, 269535, 279470, 286802, 291865, 296568, 301855, 306859, 310762, 314295, 318487, 322777, 325627, 326657, 326989, 327520, 327999, 328035, 327993, 328248, 328221, 326842, 323780, 319807, 316133, 313617, 312392, 311851, 311109, 309683, 307839, 306280, 305613, 306005, 306949, 307238, 305602, 301753, 296705, 291760, 287346, 283156, 279248, 276394, 275092, 274693, 274004, 272642, 271345, 270903, 271291, 272085, 273271, 275113, 277477, 279906, 282319, 284943, 287330, 288079, 286150, 282177, 277952, 274673, 272097, 269385, 266224, 262886, 259519]
53662B59519l608l848l382j972m11K14k50r16r66l93L99J049J073O1j317j229
53646B44023J269M547N901M667K680J676J531J510J774K763M072N059N969P247
53632B94688Q196P626N804M508M812N795O030N514N286N688N965N615N209N452
53618C76188O008N935N057M253M146M155L253J380m45j383j564j550j566j692
53604D02175k318l653m899m702k859q87l33r03j134o53o74j967l504l863l142
53589C66684k425j942j086M0M45k15j093j462j481j354r06l50l67q09n52O82J592
53572C55401J267N28J97n15k165k930p41L020M547K603K04N89L377N872O548N972
53556C83774N098M155L008J857J419K457M770O903P571P230P302Q095Q710Q889
$$ y = [259519, 255911, 252063, 248681, 246709, 246298, 246512, 246262, 245346, 244380, 243987, 244386, 245435, 246508, 246569, 245252, 244023, 245292, 249839, 255740, 260407, 263087, 264763, 266294, 267804, 269578, 272341, 276413, 281472, 287441, 294688, 302884, 310510, 316314, 320822, 325634, 331429, 337459, 342973, 348259, 353947, 359912, 365527, 370736, 376188, 382196, 388131, 393188, 397441, 401587, 405742, 408995, 410375, 409930, 408547, 406983, 405433, 403867, 402175, 399857, 396204, 391305, 386603, 383744, 382857, 382524, 381621, 380487, 379834, 379160, 377193, 373689, 369826, 366684, 364259, 362317, 361231, 361271, 361716, 361501, 360408, 358946, 357465, 356111, 355205, 354855, 354488, 353679, 353127, 353809, 355401, 356668, 357196, 357393, 356878, 354713, 351783, 351042, 354062, 358609, 361212, 361416, 362005, 365382, 371254, 377802, 383774, 388872, 393027, 396035, 397892, 399311, 401768, 406538, 413441, 421012, 428242, 435544, 443639, 452349, 461238]
53542D61238R234R461Q362O197N227O655Q764R508R310R545R638Q069N438M055
53528E70701M624N529N624N641O326P049P117O941O978O713N708M679M458M673
53514F52761M419L639K960K563K182J801J641J613J572J836K820M215N133N105
53500F94260M494M049M312N196N889N548M467M012M713N121L618R96j21J535M563
53485G52652O997Q356Q977Q684P312N776N279N792O326O410O319O121N637N262
53471H45900N704O795P581P690P717Q009Q206Q305R117J0946J2756J3425J3290
53458I65441J3617J4947J6617J7683J7863J7857J8969K1819K5224K7149K7238
53447A184424K7380K9159L1747L3481L4533L6356L8993M0789M1010M1129M2720
$$ y = [461238, 470472, 479933, 488295, 494492, 499719, 506374, 515138, 524646, 533956, 543501, 553139, 561208, 566646, 570701, 575325, 580854, 586478, 592119, 598445, 605494, 612611, 619552, 626530, 633243, 638951, 643630, 648088, 652761, 657180, 660819, 663779, 666342, 668524, 670325, 671966, 673579, 675151, 676987, 679807, 684022, 689155, 694260, 698754, 702803, 707115, 712311, 718200, 723748, 728215, 732227, 736940, 742061, 745679, 746675, 746554, 748089, 752652, 759649, 768005, 776982, 785666, 792978, 798754, 804033, 809825, 816151, 822561, 828880, 835001, 840638, 845900, 851604, 858399, 865980, 873670, 881387, 889396, 897602, 905907, 915024, 925970, 938726, 952151, 965441, 979058, 994005, 1010622, 1028305, 1046168, 1064025, 1082994, 1104813, 1130037, 1157186, 1184424, 1211804, 1240963, 1272710, 1306191, 1340724, 1377080, 1416073, 1456862, 1497872, 1539001, 1581721]
53436A581721M5272M7041M7453M7725M9105N1247N2693N2861N2976N4514N6954
53425B139562N8091N6824N4652N3730N4333N5242N5761N6002N5743N4493N2560
53414B746993N0819M9430M8017M6897M6748M7075M6547M5067M3936M3475M2066
53403C257070L8372L3267K8588K5065K2385K0361J8881J7192J4366J0211N243
53392C491001N1m807q910j2490j6388k0922k5387k9051l2058l4723l6748l7898
53380C231670l8926m0864m3635m6189m7857m8893m9729n0300n0246m9531m8602
53369B716898m7930m7324m6026m3785m1475l9776l7698l3639k8088k3849k2766
53358B304542k3363k2708j9747j5782j2109q624m752p87K316M243O128R677J5264
$$ y = [1581721, 1626993, 1674034, 1721487, 1769212, 1818317, 1869564, 1922257, 1975118, 2028094, 2082608, 2139562, 2197653, 2254477, 2309129, 2362859, 2417192, 2472434, 2528195, 2584197, 2639940, 2694433, 2746993, 2797812, 2847242, 2895259, 2942156, 2988904, 3035979, 3082526, 3127593, 3171529, 3215004, 3257070, 3295442, 3328709, 3357297, 3382362, 3404747, 3425108, 3443989, 3461181, 3475547, 3485758, 3491001, 3491052, 3486245, 3477335, 3464845, 3448457, 3427535, 3402148, 3373097, 3341039, 3306316, 3269568, 3231670, 3192744, 3151880, 3108245, 3062056, 3014199, 2965306, 2915577, 2865277, 2815031, 2765500, 2716898, 2668968, 2621644, 2575618, 2531833, 2490358, 2450582, 2412884, 2379245, 2351157, 2327308, 2304542, 2281179, 2258471, 2238724, 2222942, 2210833, 2202209, 2197457, 2196670, 2198986, 2203229, 2209357, 2219034, 2234298]
53345B234298K1143K5153K7074K8616L1263L5028L9241M3222M6044M7030M7195
53334B625307M8898N3229N8684O3170O6244O8634P0824P3174P6445Q0883Q5360
53323C370852Q8640R0858R2883R4971R7007R9296J01883J03833J04490J04712
53313D349425J05533J06160J04818J01321R7334R4242R1950Q9584Q6213Q1081
53303E307661P4300O7169O0749N4528M7590M0384L3902K7634K0183J1734L771
53292E749605l689j2470k3134l3496m1307m6965n2283n7815o2887o7645p3421
53281E274493q0847q8546r4232r7032r8293r9782j01335j01124r8508r5486r4277
53270D225031r4507r4186r2738r1175q9696q7315q4100q1638q0441p8762p5087
$$ y = [2234298, 2255441, 2280594, 2307668, 2336284, 2367547, 2402575, 2441816, 2485038, 2531082, 2578112, 2625307, 2674205, 2727434, 2786118, 2849288, 2915532, 2984166, 3054990, 3128164, 3204609, 3285492, 3370852, 3459492, 3550350, 3643233, 3738204, 3835211, 3934507, 4036390, 4140223, 4244713, 4349425, 4454958, 4561118, 4665936, 4767257, 4864591, 4958833, 5050783, 5140367, 5226580, 5307661, 5381961, 5449130, 5509879, 5564407, 5611997, 5652381, 5686283, 5713917, 5734100, 5745834, 5749605, 5745916, 5733446, 5710312, 5676816, 5635509, 5588544, 5536261, 5478446, 5415559, 5347914, 5274493, 5193646, 5105100, 5010868, 4913836, 4815543, 4715761, 4614426, 4513302, 4414794, 4319308, 4225031, 4130524, 4036338, 3943600, 3852425, 3762729, 3675414, 3591314, 3509676, 3429235, 3350473, 3275386]
53259C275386p0341o6266o2867n8971n4514n0734m8304m6530m4484m2054l9746
53248B690575l7791l5669l2458k7925k3148j9542j7221j4981j1928q411n110k036
53236B454355J185M546P550R495J0014R873J0961J4455J9133K2619K4324K5881
53224B614391K8617L2157L5840L9782M3724M6454M7488M8059M9257N0296M9843
53213C085908M7998M5701M3206M0514L8366L7246L6127L3766L0723K8391K6453
53202C494399K3118J7909J2560Q741O203L603J89l852p938j1690j5345j9507k4149
53189C484241k8307l1398l4255l7816m1446m3780m4865m5957m7498m8907n0252
53178C029760n2152n3907n3729n1651n0173n0850n1957n1111m8679m6713m5533
$$ y = [3275386, 3205045, 3138779, 3075912, 3016941, 2962427, 2911693, 2863389, 2816859, 2772375, 2730321, 2690575, 2652784, 2617115, 2584657, 2556732, 2533584, 2514042, 2496821, 2481840, 2469912, 2461501, 2456391, 2454355, 2455540, 2460086, 2467636, 2477131, 2487145, 2497018, 2507979, 2522434, 2541567, 2564186, 2588510, 2614391, 2643008, 2675165, 2711005, 2750787, 2794511, 2840965, 2888453, 2936512, 2985769, 3036065, 3085908, 3133906, 3179607, 3222813, 3263327, 3301693, 3338939, 3375066, 3408832, 3439555, 3467946, 3494399, 3517517, 3535426, 3547986, 3556727, 3562930, 3566533, 3566722, 3562870, 3554932, 3543242, 3527897, 3508390, 3484241, 3455934, 3424536, 3390281, 3352465, 3311019, 3267239, 3222374, 3176417, 3128919, 3080012, 3029760, 2977608, 2923701, 2869972, 2818321, 2768148, 2717298, 2665341, 2614230, 2565551, 2518838, 2473305]
53167B473305m3701m1000l9103l8900l9096l8288l6990l6480l6585l5901l3728
53156B053533l0727k7831k5436k3668k2552k1626k0065j7704j5522j4690j5283
53145A818429j6272j6696j6482j6251j6581j7451j8254j8413j8178j8491j9750
53134A625610k0963k0801j9330j8014j8045j9421k1638k4250k6401k6966k6087
53123A383694k5643k7103k9472l0560k9881k9004k9082k9505k9345k8760k8308
53112A067031k7842k6975k6020k5531k5290k4566k3212k1876k1079k0691k0362
53101H03587k0034j9817j9589j8925j7576j5952j4941j4922j5173j4660j3349
53090F18649j2114j1396j0688r659q900r009r550r679r323q977q688q069p162
$$ y = [2473305, 2429604, 2388604, 2349501, 2310601, 2271505, 2233217, 2196227, 2159747, 2123162, 2087261, 2053533, 2022806, 1994975, 1969539, 1945871, 1923319, 1901693, 1881628, 1863924, 1848402, 1833712, 1818429, 1802157, 1785461, 1768979, 1752728, 1736147, 1718696, 1700442, 1682029, 1663851, 1645360, 1625610, 1604647, 1583846, 1564516, 1546502, 1528457, 1509036, 1487398, 1463148, 1436747, 1409781, 1383694, 1358051, 1330948, 1301476, 1270916, 1241035, 1212031, 1182949, 1153444, 1124099, 1095339, 1067031, 1039189, 1012214, 986194, 960663, 935373, 910807, 887595, 865719, 844640, 823949, 803587, 783553, 763736, 744147, 725222, 707646, 691694, 676753, 661831, 646658, 631998, 618649, 606535, 595139, 584451, 574792, 565892, 556883, 547333, 537654, 528331, 519354, 510666, 502597, 495435]
53077D95435o415n920n439n136n400n886n579m230k951k919l986m978m958l822
53063D27816k106o48j47o26j423j854j770j355p97j90O01J974L783M630L002l32
53047D30558k261p14K618M290L310J939K258L460L210O74k718n079n871n851n793
53032D24030n607m901m110m326n775p225p474o831o216n573m420l438l855n223
53018C49056n566m212k812k820l485l438l018l539n093o476o876o416n355l918
53004B86032k688k163j985j462o52j84j53j19j2k00p35j264j583j607j076p9L84
52987B70454n80k396l519l331k545j888j420j226j590k226k263j492q38j153k127
52972B41860k732k274q99M91P97j82j285j277m72k19r45j755k000k021k034j520
$$ y = [495435, 489020, 483100, 477661, 472525, 467125, 461239, 455660, 451430, 448479, 445560, 441574, 436596, 431638, 427816, 425710, 425062, 424915, 424289, 422866, 421012, 419242, 417887, 417090, 416900, 417501, 419475, 423258, 427888, 430890, 430558, 428297, 427583, 430201, 434491, 437801, 439740, 441998, 445458, 448668, 449342, 446624, 441545, 435674, 429823, 424030, 418423, 413522, 409412, 405086, 399311, 392086, 384612, 377781, 371565, 365992, 361572, 358134, 354279, 349056, 343490, 339278, 336466, 333646, 330161, 326723, 323705, 320166, 315073, 308597, 301721, 295305, 289950, 286032, 283344, 281181, 279196, 277734, 277082, 276898, 276745, 276626, 276614, 276414, 275679, 274415, 272832, 271225, 270149, 270070, 270454, 269874, 267478, 263959, 260628, 258083, 256195, 254775, 253549, 251959, 249733, 247470, 245978, 245140, 243987, 241860, 239128, 236854, 235955, 236446, 237243, 237061, 235776, 234499, 234027, 233808, 232863, 231108, 229108, 227087, 225053, 223533]
52956B23533l11Q11J182J169J359J678J794J639R35p61k933l929k751l71J518
52941B24562K304K299J726R11P23J612K658K708K023J647J575Q71n06j366r79
52926B42768P6R93J569J681R48m45j383j044P1R05J232J634K381L055L319L447
52910B61207L874M548N071N279N331N229M705L843L380L835M714N195N452O359
52896C28022P842Q584P809O358N299M395K923J333P56J172J282L01j237k566l569
52881C68704m244m298l746l190l012k858k507k534l519n006o012o229o000n347
52867C10202l949k166j165j458k006j491k05K50p73j858j283O67J992J525K71
52852B98553q1Q42K111K922L160K788J728N39K01P07O80p13k081j313J333L206
$$ y = [223533, 223222, 224033, 225215, 226384, 227743, 229421, 231215, 232854, 233789, 233028, 230095, 226166, 223415, 223044, 224562, 226866, 229165, 230891, 231802, 232525, 234137, 236795, 239503, 241526, 243173, 244748, 245619, 245113, 243747, 242768, 242844, 243837, 245406, 247087, 248035, 247590, 246207, 245163, 245234, 246139, 247371, 249005, 251386, 254441, 257760, 261207, 265081, 269629, 274700, 279979, 285310, 290539, 295244, 299087, 302467, 306302, 311016, 316211, 321663, 328022, 335864, 344448, 352257, 358615, 363914, 368309, 371232, 372565, 373321, 374493, 375775, 376076, 374839, 372273, 368704, 364460, 360162, 356416, 353226, 350214, 347356, 344849, 342315, 338796, 333790, 327778, 321549, 315549, 310202, 306253, 304087, 302922, 301464, 299458, 297967, 297762, 298012, 297239, 295381, 294098, 294765, 296757, 298282, 298553, 298472, 299314, 301425, 304347, 307507, 310295, 312023, 312562, 312763, 313470, 314150, 313437, 311356, 310043, 311376, 314582]
52836C14582K734J531J910L444L780K234N15j08k87o03j97J341K477J844M94J77
52820C35868M80k1o28O92L498M711K941M81j72M16L75l46n29q1J25M1L66J053
52802C49270J426J454J638J867J625J055P90R08J074J417K179K806K568J802J486
52787C73365J727J905K057K908M473N927O902P784Q514Q345P274O448O591O830
52773D51050N882L712J413j05p22q54j060j759k958m311n501o374o856o994o934
52758D17629o523n314l526k539l510n683p060o836o026n646n456m975m560m634
52744C45341m695m103l406l839n526o987o692m701k566j693k003k288j791j019
52730B94032q47j363k089k912l918m477l649j651l4Q4p69j441j754k406l695m998
$$ y = [314582, 317316, 318847, 320757, 324201, 327981, 330215, 330730, 330622, 330335, 329732, 329535, 330876, 333353, 335197, 335691, 335868, 336348, 336327, 335699, 336391, 339889, 344600, 347541, 348022, 347850, 348266, 348641, 348295, 347766, 347685, 347810, 347851, 348217, 349270, 350696, 352150, 353788, 355655, 357280, 358335, 359125, 360033, 361107, 362524, 364703, 367509, 370077, 371879, 373365, 375092, 376997, 379054, 381962, 386435, 392362, 399264, 407048, 415562, 423907, 431181, 437629, 444220, 451050, 456932, 460644, 462057, 461952, 461230, 460376, 459316, 457557, 454599, 450288, 444787, 438413, 431557, 424563, 417629, 411106, 405792, 402266, 399727, 396217, 390534, 383474, 376638, 370612, 364966, 359510, 354535, 349975, 345341, 340646, 336543, 333137, 329298, 323772, 316785, 310093, 305392, 302826, 301133, 299130, 296842, 295051, 294032, 293185, 291822, 289733, 286821, 282903, 278426, 274777, 273126, 273092, 273176, 272407, 270966, 269212, 266806, 263111, 258113]
52714B58113n465m766l238j608n43m10j225k607l617l172j227P40J140%j369k241
52698B28505k986l771m073l813l836m461m700l793k678k674l301k791p36J046
52684A85938P86j065k561k602j888j699k342l084l241k923k646k673k835k798
52670A54367k222j025J80L30p93j911j689n45K4k02J68J793L268K984J305k43
52654A55789j068j627j959j530n25nm91j252j310n37N89J682K491K775K574K384
52638A57980K683L290L495K872J926J693K639M084N006N253N432N644N223M051
52624B11271L135L106L009J799L57N27K164K829Q50k596n094n583m540k742r38
52609B07554j10p37k026k854l208l836m781n299n120m704m216l322k205j683j928
$$ y = [258113, 252648, 247882, 244644, 243036, 242493, 242083, 240858, 238251, 234634, 231462, 230235, 230975, 232115, 232115, 230746, 228505, 225519, 221748, 217675, 213862, 210026, 205565, 200865, 197072, 194394, 191720, 188419, 185628, 184892, 185938, 186724, 185659, 183098, 180496, 178608, 176909, 174567, 171483, 168242, 165319, 162673, 160000, 157165, 154367, 152145, 151120, 151300, 151630, 150837, 148926, 147237, 146692, 146716, 146514, 146682, 148475, 151743, 154727, 156032, 155789, 154721, 153094, 151135, 149605, 149080, 149075, 148584, 147332, 146022, 145485, 146074, 147756, 150247, 153022, 155596, 157980, 160663, 163953, 167448, 170320, 172246, 173939, 176578, 180662, 185668, 190921, 196353, 201997, 207220, 211271, 214406, 217512, 220521, 222320, 222677, 223204, 225368, 228197, 229047, 226451, 221357, 215774, 211234, 208492, 207554, 207444, 206707, 204681, 201827, 198619, 194783, 190002, 184703, 179583, 174879, 170663, 167341, 165136, 163453, 161525]
52594A61525k028j333l57J87L58L54k17j512k632k609j766j202j310j636j800
52579A44022j642r01L06J090R47Q01J644K623K082L25n62J99J051O64m10j463
52563A50776k940m729m909k246J272K551J344J15K33N23j57r70n70P60J627J423
52547A44103P89M86M64J99m14p53k59O12P33r9o60J58J802K713K220J050L29N68
52529A54041J370J725R90n3O6J292J756N71m04R02L507M680L816K887L186L873
52513A84205M030M026M086L397J672J92K68J650L279M593N366N256M344L293K355
52498B32012J023p35j914j765p84K16J143K066K667K892L325M052M130L037J761
52483B53126J494K014K268J976J633J583J908K720L648L658K306O44PL86Q77J131
$$ y = [161525, 159497, 158164, 157807, 157994, 158352, 158706, 158489, 156977, 154345, 151736, 149970, 148768, 147458, 145822, 144022, 142380, 141479, 141785, 142875, 143822, 144623, 146267, 148890, 150972, 151297, 150735, 150934, 151985, 152649, 152239, 150776, 147836, 143107, 138198, 135952, 137224, 139775, 141119, 141234, 141467, 141990, 141833, 140863, 140293, 141053, 142680, 144103, 144892, 145378, 145842, 146041, 145627, 144874, 144615, 145227, 145960, 145861, 145201, 145359, 147161, 149874, 152094, 153144, 153473, 154041, 155411, 157136, 158126, 158073, 158139, 159431, 161187, 161758, 161354, 162256, 165763, 170443, 174259, 177146, 180332, 184205, 188235, 192261, 196347, 199744, 201416, 201608, 201876, 203526, 206805, 211398, 216764, 222020, 226364, 229657, 232012, 233035, 232300, 230386, 228621, 227837, 228053, 229196, 231262, 233929, 236821, 240146, 244198, 248328, 251365, 253126, 254620, 256634, 258902, 260878, 262511, 264094, 266002, 268722, 272370, 276028, 278334, 278978, 278985, 279371, 280248, 281379]
52467B81379J387J551J351J126J422K027K213J723P80m54j612j753m15J282J633
52452B93640L19j472k685l127k814j823q14n91q48m71P34J549J077Q6KJ053K022
52435B85837J649p0j837k236j103L33R33R46J391K363K835K236J340J160J588
52420B97365J746J308Q03P80J151J502J502R36k46j528j785k85K238L973L858
52405C13318K511J214M40o9l63j80M03J071J845K871L713L759L221K844K630J913
52389C41141Q09L74R82J624J374O51M01Q09J420J827J830J518J518K313L223L143
52373C64957K398K376L031K607P38k21J461L905M056J936K40M27J397J737J195
52358C92240j32k151l978m373l391k360k019j922j765j967k481k393j264O7N72
$$ y = [281379, 282766, 284317, 285668, 286794, 288216, 290243, 292456, 294179, 294959, 294505, 292893, 291140, 290725, 292007, 293640, 293959, 292487, 289802, 286675, 283861, 282038, 281224, 280633, 279785, 279314, 280048, 281597, 282674, 282760, 282762, 283815, 285837, 287486, 287416, 285579, 283343, 282240, 282573, 283506, 284452, 285843, 288206, 291041, 293277, 294617, 295777, 297365, 299111, 300419, 301222, 302002, 303153, 304655, 306157, 307093, 306847, 305319, 303534, 303249, 305487, 309460, 313318, 315829, 317043, 317483, 317414, 317051, 316871, 317274, 318345, 320190, 323061, 326774, 330533, 333754, 336598, 339228, 341141, 341950, 342324, 343306, 344930, 346304, 346955, 347356, 348165, 349585, 351412, 353242, 354760, 356278, 358591, 361814, 364957, 367355, 369731, 372762, 375369, 376107, 375886, 377347, 381252, 385308, 387244, 387484, 387911, 389308, 391045, 392240, 392108, 389957, 385979, 381606, 378215, 375855, 373836, 371914, 370149, 368182, 365701, 363308, 362044, 362111, 362683]
52343C62683K00m64r58j013m74M69J325J759J774J510J245J273J428J197O93Q20
52327C73467J707K030J038K54J511L811M238J949o48j160N8J104J076N10L10J085
52311C92340K814M546M949L772K335K215L707N597O159M649K245J159K222L894
52297D42603M438M301N054O689P621P077N848M682L598K810K747L042L006L053
52283E06569M060N370N411M349L935M380L832J783M31J435L499M793N668P022
52269E62537P804O456L717J921K094L446N024O298O857O953P698R345J0249R022
52255F49421O889O125O941P677P517P145P103P388Q436J0627J2922J3847J3878
52242G65916J4977J7541J9678J9960J9229J8997J9536K0352K1201K1875K2092
$$ y = [362683, 362883, 362419, 361461, 360448, 359974, 360443, 361768, 363527, 365301, 366811, 368056, 369329, 370757, 371954, 372647, 373467, 375174, 377204, 378242, 378496, 380007, 383818, 388056, 390005, 389357, 388197, 388255, 389359, 390435, 390945, 391255, 392340, 395154, 399700, 404649, 408421, 410756, 412971, 416678, 422275, 428434, 433083, 435328, 436487, 438709, 442603, 447041, 451342, 456396, 463085, 470706, 477783, 483631, 488313, 491911, 494721, 497468, 500510, 503516, 506569, 510629, 515999, 521410, 525759, 529694, 534074, 537906, 539689, 540120, 541555, 545054, 549847, 555515, 562537, 570341, 576797, 580514, 582435, 584529, 587975, 592999, 599297, 606154, 613107, 620805, 630150, 640399, 649421, 656310, 662435, 669376, 677053, 684570, 691715, 698818, 706206, 714642, 725269, 738191, 752038, 765916, 780893, 798434, 818112, 838072, 857301, 876298, 895834, 916186, 937387, 959262, 981354]
52231I81354K2342K3814K6625K9104K9696K8861K8167K8233K8520K8622K8646
52220A283984K8504K7859K6951K6680K7506K8680K8975K8013K6598K5613K4924
52209A584287K3628K1342J8737J6661J5095J3402J1226Q771O456M664L550K606
52197A730425Q88j745l894l990k304p99r01k189l377l756l313k122l29J530K867
52182A706991L580M061M635N321O119P279R117J1568J4063J5912J6790J6831J6413
52169A838680J6078J6411J7468J8409J8210J6852J5231J3831J2260J0364Q895
52158B002689Q447Q373P529N599L066M69j568k283j702j127j642k767l745n427
52144B015911r011j3080j4322j1766q420p540q873j0065j0367j0955j2155j2546
$$ y = [981354, 1003696, 1027510, 1054135, 1083239, 1112935, 1141796, 1169963, 1198196, 1226716, 1255338, 1283984, 1312488, 1340347, 1367298, 1393978, 1421484, 1450164, 1479139, 1507152, 1533750, 1559363, 1584287, 1607915, 1629257, 1647994, 1664655, 1679750, 1693152, 1704378, 1713149, 1719605, 1724269, 1727819, 1730425, 1731313, 1729568, 1725674, 1721684, 1719380, 1718581, 1717680, 1715491, 1712114, 1708358, 1705045, 1702923, 1702594, 1704124, 1706991, 1710571, 1714632, 1719267, 1724588, 1730707, 1737986, 1747103, 1758671, 1772734, 1788646, 1805436, 1822267, 1838680, 1854758, 1871169, 1888637, 1907046, 1925256, 1942108, 1957339, 1971170, 1983430, 1993794, 2002689, 2011136, 2019509, 2027038, 2032637, 2035703, 2036172, 2034604, 2032321, 2030619, 2029492, 2027850, 2025083, 2021338, 2015911, 2006900, 1993820, 1979498, 1967732, 1959312, 1951772, 1942899, 1932834, 1922467, 1911512, 1899357, 1886811]
52132A886811j1159r010p729p686p972p592o132l877j787q66j111j419j028n18
52118A818925p90j529j580q10o28k221m865o595o285m584k937k148j992j909j849
52103A778203k318l630n177n853n346m616m777n811o672o439m944k762j051r89
52089A717818k579m167m153k994k646l866n293n547n192n817p823j0025j1047
52076A646669j0523r152q148q259q896q614o861m850m186n091o526p559p930p743
52062A542331p463p941r370j0437r507o845m622m358n156n037l323r87R78K612
52048A470875M236N534N973N918O552Q360J0317J1131J1025J1461J3258J5803
52036A580443J8247K0580K3022K5184K6581K7529K8857L0784L2620L3467L3026
$$ y = [1886811, 1875652, 1866642, 1858913, 1851227, 1843255, 1835663, 1829531, 1825654, 1823867, 1823001, 1821890, 1820471, 1819443, 1818925, 1818135, 1816606, 1815026, 1814216, 1813588, 1811367, 1806502, 1799907, 1793622, 1789038, 1786101, 1783953, 1781961, 1780052, 1778203, 1775885, 1772255, 1767078, 1761225, 1755879, 1751263, 1746486, 1740675, 1734003, 1727564, 1722620, 1719858, 1718807, 1717818, 1715239, 1711072, 1706919, 1703925, 1701279, 1697413, 1692120, 1686573, 1681381, 1675564, 1667741, 1657716, 1646669, 1636146, 1626994, 1618846, 1610587, 1601691, 1593077, 1586216, 1581366, 1577180, 1572089, 1565563, 1558004, 1550074, 1542331, 1534868, 1526927, 1517557, 1507120, 1497613, 1490768, 1486146, 1481788, 1476632, 1471595, 1468272, 1467285, 1468263, 1470875, 1475111, 1480645, 1486618, 1492536, 1499088, 1507448, 1517765, 1528896, 1539921, 1551382, 1564640, 1580443, 1598690, 1619270, 1642292, 1667476, 1694057, 1721586, 1750443, 1781227, 1813847, 1847314, 1880340]
52025A880340L1938L1399L1992L2789L2287L0371K8421K7187K5723K3311K1148
52014B196906K0665K0970J9648J5940J1558Q262O085M316K846J871J174L76p20
52001B309897k367m820p600r495r801r096q387q023p788p539p273o877o296n663
51987B208872n011m154l157k524k484k433j527K19J916K806K946K868K887K959
51973B204183K964K851K517J879J226J217K197L574M327M087L247K057K98j889
51959B234735l666m528n126o403q288r902j0810j1497j2703j4695j7015j8679
51947B111423j9063j8947k0067k3043k6410k8387k8947k9254k9743l0087l0552
51936A826923l1921l4012l5618l6104l5952l5648l5233l5136l6153l8039l9302
$$ y = [1880340, 1912278, 1943677, 1975669, 2008458, 2040745, 2071116, 2099537, 2126724, 2152447, 2175758, 2196906, 2217571, 2238541, 2258189, 2274129, 2285687, 2293949, 2300034, 2304350, 2307196, 2309067, 2310241, 2310617, 2309897, 2307530, 2302710, 2295110, 2285615, 2275814, 2266718, 2258331, 2250308, 2242520, 2234981, 2227708, 2220831, 2214535, 2208872, 2203861, 2199707, 2196550, 2194026, 2191542, 2189109, 2187582, 2187801, 2189717, 2192523, 2195469, 2198337, 2201224, 2204183, 2207147, 2209998, 2212515, 2214394, 2215620, 2216837, 2219034, 2222608, 2226935, 2231022, 2234269, 2236326, 2236624, 2234735, 2231069, 2226541, 2221415, 2215012, 2206724, 2196822, 2186012, 2174515, 2161812, 2147117, 2130102, 2111423, 2092360, 2073413, 2053346, 2030303, 2003893, 1975506, 1946559, 1917305, 1887562, 1857475, 1826923, 1795002, 1760990, 1725372, 1689268, 1653316, 1617668, 1582435, 1547299, 1511146, 1473107, 1433805]
51925A433805l8992l7847l7043l6749l6530l6427l6807l7590l8207l7932l6139
51914A023542l2994l0066k9240l0361l0929k8854k4836k1270j9569j9460k0070
51903G35893k0531j9948j8017j5698j4270j3742j3049j1761j0613j0184j0006
51892E78074r459q838q881r595j0073r487p960o377n502n348n567o159p371q719
51878D68738q773o660l541j833k680m759n853n097l341j740p95o16j289k523l468
51863D15770l511l071l107l824m473m476m177m197m510m599m135l165j904q16
51849C65805n74j446k798l649l593k925k095j559j831l061m543n202m645l372
51835C24512k102j295j205j706k151j960j443j414j930k093j262n1K98p48k482
$$ y = [1433805, 1394813, 1356966, 1319923, 1283174, 1246644, 1210217, 1173410, 1135820, 1097613, 1059681, 1023542, 990548, 960482, 931242, 900881, 869952, 841098, 816262, 794992, 775423, 755963, 735893, 715362, 695414, 677397, 661699, 647429, 633687, 620638, 608877, 598264, 588080, 578074, 568615, 559777, 550896, 541301, 531228, 521741, 513781, 507404, 501902, 496554, 490987, 484828, 477457, 468738, 459965, 453305, 449764, 447931, 445251, 440492, 434639, 429542, 426201, 424461, 423666, 423050, 421761, 419238, 415770, 412259, 409188, 406081, 402257, 397784, 393308, 389131, 384934, 380424, 375825, 371690, 368525, 366621, 365805, 365231, 363785, 360987, 357338, 353745, 350820, 348725, 347166, 345335, 342274, 337731, 332529, 327884, 324512, 322410, 321115, 319910, 318204, 316053, 314093, 312650, 311236, 309306, 307213, 305951, 305900, 306198, 305450, 302968]
51820C02968l592l318k148j284j351j883k239k480k768k502j005J133K347J904
51806B83782O46j80k67j90n76j466k173j841m42R72J569J809K546L471L498K607
51790B93765K051K602L553L762K969J854J356J955L051L345K564K263L736N621
51776C34447N376K851M99k84p97k267l586l217j826j217j752k322k202j546n53
51761C21604N25J055Q44Q52J938L396L776K832J575P77M47M70O88N73j31o48j7
51744C40556J361K068J492L13p82j815k621k377p70R76J134l95j781j414j2L51
51728C36284q36j622l59J748K246R45Q7J111L113M713N617N739M638K851K030
51713C68305K605K878J645J23j42L12K89K06R86J859J643J238K497N119O946P018
$$ y = [302968, 299376, 296058, 293910, 292626, 291275, 289392, 287153, 284673, 281905, 279403, 278398, 279531, 281878, 283782, 284428, 284248, 283981, 283791, 283215, 281749, 279576, 277735, 277293, 278265, 279834, 281643, 284189, 287660, 291158, 293765, 295816, 298418, 301971, 305733, 308702, 310556, 311912, 313867, 316918, 320263, 322827, 325090, 328826, 334447, 339823, 342674, 343173, 342889, 342092, 339825, 336239, 333022, 331196, 329979, 328227, 325905, 323703, 322157, 321604, 322129, 323184, 324028, 324880, 326818, 330214, 333990, 336822, 338397, 339174, 339621, 340091, 340779, 341352, 341221, 340573, 340556, 341917, 343985, 345477, 345790, 345008, 343193, 340572, 338195, 337425, 338401, 339535, 339140, 337359, 335945, 335933, 336284, 335448, 333826, 333467, 335215, 337461, 338406, 338493, 339604, 342717, 347430, 353047, 358786, 363424, 366275, 368305, 370910, 373788, 375433, 375556, 375414, 375726, 376015, 376221, 377207, 379066, 380709, 381947, 384444, 389563, 396509, 403527]
51697D03527O271N424M468M033M971O488O847O105N964O756O897N804N092O092
51683D84739Q213J0477J2660J4058J3319J0574P808N977L796P65q86O59L457M128
51669E79744K444J221K221M462O327P275P202N968M073K485J412K13j164j664
51655F22219n61J322K308J452o94k639l174k363j245n54j74L2m45j924l552l992
51639F06016k885j164o0k41j461k571k339q15N08M98k79o89o88p91o08N34J901
51622E94866J917O54J70J777M296N618N009L051L38k601m748n135l930k137m23
51607E98722J087K122K232J505O46J46l2L3K63L2j633m643p385q333p886p798
51591E69078q962j0518j1133j0505r349q561q564r017q882p477n718n560p605
$$ y = [403527, 409798, 415222, 419690, 423723, 428694, 435182, 442029, 448134, 454098, 460854, 467751, 473555, 478647, 484739, 492952, 503429, 516089, 530147, 543466, 554040, 561848, 567825, 571621, 572386, 571500, 572159, 575616, 579744, 582188, 583409, 585630, 590092, 596419, 603694, 610896, 616864, 620937, 623422, 624834, 625047, 623883, 622219, 621658, 622980, 625288, 626740, 626046, 623407, 620233, 617870, 616625, 616071, 615897, 615929, 615484, 613560, 610008, 606016, 603131, 601967, 601907, 601666, 600205, 597634, 595295, 594480, 594988, 595486, 595207, 594518, 593830, 593039, 592431, 592965, 594866, 596783, 597437, 597607, 599384, 603680, 609298, 614307, 617358, 617696, 615095, 610347, 605212, 601282, 599145, 598722, 599809, 601931, 604163, 605668, 606314, 606460, 606428, 606461, 606724, 606756, 605123, 600480, 593095, 584762, 576876, 569078, 560116, 549598, 538465, 527960, 518611, 510050, 501486, 492469, 483587, 476110, 470392, 464832, 457227]
51578D57227r957j0257q404o250n036m301l373k622k654l167l336k979k672k997
51564C89222m021n257n817m997l108j523j377k338l016k458j013L00Q58Q88R20
51549C57263R38K74j358k911k723m94J997K662J310m85j434j654j695j367j79
51534C50144J565K937L578L936M211L911K990K695M249O930Q492P704N621M153
51520D13116M186N478P381Q966R211Q030O618N977N561M366K750K003K263K177
51506D88083Q47j097k623l571m257m680m751m709m706m240k594J47K717L540K274
51491D60380N57O14K770N025N725N777P044R345J0697J0254R078P965O466M547
51477E46244L240K709J519q97k699k153m29l5j252k081j201P66K776M345M861
$$ y = [457227, 447270, 437013, 428609, 422359, 417323, 413022, 409649, 407027, 404373, 401206, 397870, 394891, 392219, 389222, 385201, 379944, 374127, 369130, 366022, 364499, 363122, 360784, 357768, 355310, 354297, 354597, 355455, 356343, 357263, 358201, 358475, 357117, 354206, 351483, 350989, 352986, 355648, 356958, 356473, 355039, 353385, 351690, 350323, 350144, 351709, 354646, 358224, 362160, 366371, 370282, 373272, 375967, 380216, 387146, 395638, 403342, 408963, 413116, 417302, 422780, 430161, 439127, 448338, 456368, 462986, 468963, 474524, 478890, 481640, 483643, 485906, 488083, 488930, 487833, 485210, 481639, 477382, 472702, 467951, 463242, 458536, 454296, 451702, 451849, 454566, 458106, 460380, 460937, 461551, 464321, 469346, 475071, 480848, 487892, 497237, 507934, 518188, 527266, 535231, 541697, 546244, 549484, 552193, 553712, 552815, 550116, 547963, 547534, 547499, 546247, 544166, 542965, 543731, 546507, 550852, 555713]
51462E55713L563Q41j510j948n25J619L337L891L046J233p46k405l777n062o368
51447E50902p566q169p673o549o197p176q057p089m662k891k776l168k733j753
51433D74443j292j585j945j752r47O2P67J081J627K853L967L674K135J147J782
51418D86017K978L257K936L435M950O257O684O938P737Q765R570J0499J1893J3042
51404E84958J2898J1635J0588J0624J1308J1797J1756J1180J0060Q800Q240Q533
51392G12377Q569P312N354M113L763L112J600J41l38j13J78M58O35J10j018j263
51376G44990N22L101L905K032q69k693k915k599l225n480q485j0308j0053r216
51362F98707r931j2084j3394j2369r889p658o448o342p300q559q660p145n506
$$ y = [555713, 559276, 560117, 558607, 556659, 556134, 557753, 561090, 564981, 568027, 569260, 568514, 566109, 562332, 557270, 550902, 543336, 535167, 527494, 520945, 514748, 507572, 499515, 492426, 487764, 484873, 482097, 478929, 476196, 474443, 473151, 471566, 469621, 467869, 466922, 466984, 467751, 468832, 470459, 473312, 477279, 480953, 483088, 484235, 486017, 488995, 492252, 495188, 498623, 503573, 509830, 516514, 523452, 531189, 539954, 549524, 560023, 571916, 584958, 597856, 609491, 620079, 630703, 642011, 653808, 665564, 676744, 686804, 695604, 703844, 712377, 720946, 728258, 733612, 737725, 741488, 744600, 746200, 746341, 746003, 745890, 746068, 746526, 747161, 747271, 746253, 744990, 745512, 748613, 752518, 754550, 753681, 750988, 748073, 745474, 742249, 736769, 728284, 717976, 707923, 698707, 688776, 676692, 663298, 650929, 641040, 633382, 626934, 620592, 613292, 604733, 596073, 588928, 583422]
51349E83422n338o194o275m727k276N7J817K893L401L751M136M098L254K184J663
51334E85866J340J66j826l334l541l106l058l735n224p691j0587j2464j2625j2311
51320E07870j3164j4845j5308j3446j0405q155p611q373r525j0109r499p843n991
51307C73596m735m377n072o879r034r874q323n209k538j496j821k792m051n345
51293C02050o119n876m607k832j319p13j001j342q38M36J569J993J987J912J601
51278B86901P93k74j120j506j394p63J46P20N67N6l1O92J893K897L203K907K714
51261B98401L236M242M958N249N928P521R183R503Q196O493N802O198O417N266
51247C86593L072J351P75J3k556o248q533q187o697n961o091o323o713p542q122
$$ y = [583422, 578084, 571890, 565615, 560888, 558612, 558669, 560486, 563379, 566780, 570531, 574667, 578765, 582019, 584203, 585866, 587206, 587372, 585546, 582212, 578671, 575565, 572507, 568772, 563548, 555857, 545270, 532806, 520181, 507870, 494706, 479861, 464553, 451107, 440702, 432547, 424936, 416563, 407038, 396929, 387430, 379587, 373596, 368861, 364484, 359412, 352533, 343499, 333625, 325302, 320093, 317555, 316059, 314238, 311446, 307395, 302050, 295931, 290055, 285448, 282616, 281297, 280584, 279583, 278241, 277403, 277839, 279408, 281401, 283388, 285300, 286901, 287694, 287420, 286300, 284794, 283400, 282637, 282783, 283503, 284070, 284126, 284095, 284787, 286680, 289577, 292780, 295687, 298401, 301637, 305879, 310837, 316086, 322014, 329535, 338718, 348221, 356417, 362910, 368712, 374910, 381327, 386593, 389665, 391016, 391791, 391804, 389248, 383000, 374467, 366280, 359583, 353622, 347531, 341208, 334495, 326953, 318831]
51232C18831p787p372p927q552p431m873l216l484m110l603k602k262k236j558
51218B51818m05L58O66R71J089N37l01n23j45j97j308k911l963l964l276k748
51202B35698k906l254k699r31J093K343K812K892K446J369M22L49N76lj056j042
51186B38109M14J746J600O26J82K39k32j276j710r67q0k88j313j742r47R0O8r44
51168B33575j656j231k89k8p40j618j772r44O28K414L488L037J240o94j819k290
51152B31301k452j845J04K656M160M046L434L365L374K534J098J84J93N64Q85
51137B53601J241J508J269P08O15J178J575J230O79O12P53N01O5R2M58M12k60
51120B66237j008j395j572j822k268k940l609l670k785j473l78O26J835K445J368
$$ y = [318831, 311044, 303672, 295745, 287193, 279762, 274889, 271673, 268189, 264079, 260476, 257874, 255612, 253376, 251818, 251413, 251771, 252437, 253408, 254497, 255034, 254733, 254210, 254065, 253868, 252560, 249649, 245686, 241722, 238446, 235698, 232792, 229538, 226839, 225908, 227001, 229344, 232156, 235048, 237494, 238863, 239285, 239634, 240210, 240207, 239151, 238109, 238523, 240269, 241869, 242495, 242677, 242916, 242684, 241408, 239698, 238731, 238651, 238363, 237050, 235308, 234361, 234451, 234519, 233575, 231919, 230688, 230399, 230371, 229631, 228013, 226241, 225297, 225925, 228339, 231827, 234864, 236104, 235410, 233591, 231301, 228849, 227004, 227108, 229764, 233924, 237970, 241404, 244769, 248143, 250677, 251775, 251959, 252152, 252716, 253601, 254842, 256350, 257619, 258327, 258942, 260120, 261695, 262925, 263604, 264216, 264969, 265470, 265535, 265627, 266085, 266497, 266237, 265229, 263834, 262262, 260440, 258172, 255232, 251623, 247953, 245168, 243695, 243317, 243943, 245778, 248223, 249591]
51105B49591o78j399J09J876J562n78k308k276j104l9J82p40k655m667n634n292
51089B25950m292l176j920n76M74J071J435J539J017O2l95J09P61N48l12p53k73
51072B21269O97J651K412K749K468J987K055K724L226L098K692K188J089o99k105
51057B47501k169j483j269j473j111k04J37l09l83L77O31p86k950m045l605k485
51041B26374j252K1J116K041L569N884P218N626K092j9R31L008L625K638J430
51026B64302N28k89n21N15J983K140Q23p8P63K161J872n33l173m061l078j491
51010B61863j74R78K077K618K397K230K849L454K588M20j127r31p7J3k72L72J876
50993B81154K822K481J627J259J463J714J557Q59L4j0J122K299J849j73j650r84
$$ y = [249591, 248913, 247514, 247623, 249499, 251061, 250483, 248175, 245899, 244795, 244756, 244938, 244198, 241543, 236876, 231242, 225950, 221658, 218482, 216562, 215986, 216460, 217531, 218966, 220505, 221522, 221584, 221189, 221298, 222059, 222607, 222295, 221542, 221269, 221966, 223617, 226029, 228778, 231246, 233233, 235288, 238012, 241238, 244336, 247028, 249216, 250305, 249606, 247501, 245332, 243849, 242580, 241107, 239996, 239792, 239929, 239620, 239237, 239614, 240245, 239459, 236509, 232464, 228859, 226374, 225122, 225143, 226259, 228300, 231869, 237753, 244971, 250597, 252689, 252670, 253601, 256609, 260234, 262872, 264302, 264830, 264541, 264020, 264535, 266518, 268658, 269481, 269403, 270166, 272327, 274199, 273666, 270493, 266432, 263354, 261863, 261689, 262667, 264744, 267362, 269759, 271989, 274838, 278292, 280880, 281300, 280173, 279242, 279165, 279178, 278906, 279278, 281154, 283976, 286457, 288084, 289343, 290806, 292520, 294077, 294936, 294970, 294960, 296082, 298381, 300230, 300057, 298407, 297423]
50977B97423Q02J387J00j454j604l97J024J914K127J515J46r84n48J432L311L781
50961C09975L420L496L842L128J145m37j02J741L536M429M696M846N098N316N029
50946C59158L841K236J531K422M056N208N934P140Q963J0500J1243J1690J2295
50933D46217J2632J2097J1024J0541J1421J3286J4911J5328J4786J4575J5738
50922E92556J8046K0438K2216K3537K4896K6624K8776L1217L3705L6091L8384
50911H96486M0594M2722M5062M8145N2108N6543O1181O6262P1740P6762Q0608
50900A538213Q3593Q6323Q8580Q9845R0516R1319R1705R0144Q6063Q0410P4021
50889B490732O6778N8803N1197M4761L8838L2334K5307J8692J3036Q288M590K429
$$ y = [297423, 298225, 299612, 299712, 298258, 296654, 296257, 297281, 299195, 301322, 302837, 302983, 301999, 301451, 302883, 306194, 309975, 313395, 316891, 320733, 323861, 325006, 324569, 324467, 326208, 329744, 334173, 338869, 343715, 348813, 354129, 359158, 362999, 365235, 366766, 369188, 373244, 378452, 384386, 391526, 400489, 410989, 422232, 433922, 446217, 458849, 470946, 481970, 492511, 503932, 517218, 532129, 547457, 562243, 576818, 592556, 610602, 631040, 653256, 676793, 701689, 728313, 757089, 788306, 822011, 858102, 896486, 937080, 979802, 1024864, 1073009, 1125117, 1181660, 1242841, 1309103, 1380843, 1457605, 1538213, 1621806, 1708129, 1796709, 1886554, 1977070, 2068389, 2160094, 2250238, 2336301, 2416711, 2490732, 2557510, 2616313, 2667510, 2712271, 2751109, 2783443, 2808750, 2827442, 2840478, 2848766, 2853356, 2855785]
50877B855785J997K803L784L648J596j869n391q481j2312j8240k5981l4008m1403
50864B721928m8474n5673o2827o9557p5746q1285q5805q8774q9726q8462q5469
50853A890130q1935p8800p5824p2102o7456o2748n8635n4835n0813m6570m2229
50842A198183l7485l2269k7586k4730k3513k1999j8522j3556r151o710n904n596
50830I71162n090m204k785q88Q56J774K114K796M101N225N522N508O165P730R856
50815A009842J2491J5699J8703K0326K0727K1721K4605K8350L0805L1435L1999
50804A266703L4392L8542M2755M5688M7577M9821N3644N9099O5257P1382P7786
50793A852646Q5224R3618J01950J09661J17502J26569J36871J47465J57713J67659
$$ y = [2855785, 2857782, 2860585, 2864369, 2868017, 2869613, 2867744, 2862353, 2853872, 2841560, 2823320, 2797339, 2763331, 2721928, 2673454, 2617781, 2554954, 2485397, 2409651, 2328366, 2242561, 2153787, 2064061, 1975599, 1890130, 1808195, 1729395, 1653571, 1581469, 1514013, 1451265, 1392630, 1337795, 1286982, 1240412, 1198183, 1160698, 1128429, 1100843, 1076113, 1052600, 1030601, 1012079, 998523, 989372, 982662, 976758, 971162, 966072, 961868, 959083, 958195, 959051, 960825, 962939, 965735, 969836, 975061, 980583, 986091, 992256, 999986, 1009842, 1022333, 1038032, 1056735, 1077061, 1097788, 1119509, 1144114, 1172464, 1203269, 1234704, 1266703, 1301095, 1339637, 1382392, 1428080, 1475657, 1525478, 1579122, 1638221, 1703478, 1774860, 1852646, 1937870, 2031488, 2133438, 2243099, 2360601, 2487170, 2624041, 2771506, 2929219, 3096878]
50783C096878J77198J85706J92681J98227K02425K04632K03766J99104J90595
50774D851212J78567J63442J45633J25573J03954Q2048O1568M3968K9738J8287
50764E803990Q524ro181p967m824P88N295P393Q493R495Q464K405r650k6335m5868
50749E754013o6979q8350j08654j27475j45331j62512j78303j91229j99692k02844
50739D282644k01548j97926j93045j85690j74523j60790j47251j34782j22009
50730B765080j08443r5724q4915p4585o3015n0874m0057l0957k2611j4949r138
50719B169812n771m211l868m903p158r366j0121r455r025j0560j3992j7290j8702
50706B045390j8974k0428k3647k6422k6729k5501k5141k6177k6976k6271k4245
$$ y = [3096878, 3274076, 3459782, 3652463, 3850690, 4053115, 4257747, 4461513, 4660617, 4851212, 5029779, 5193221, 5338854, 5464427, 5568381, 5650429, 5711997, 5755965, 5785703, 5803990, 5812514, 5812505, 5806324, 5798357, 5793533, 5794321, 5799616, 5807009, 5815502, 5824997, 5833461, 5835866, 5826216, 5799881, 5754013, 5687034, 5598684, 5490030, 5362555, 5217224, 5054712, 4876409, 4685180, 4485488, 4282644, 4081096, 3883170, 3690125, 3504435, 3329912, 3169122, 3021871, 2887089, 2765080, 2656637, 2560913, 2475998, 2401413, 2338398, 2287524, 2247467, 2216510, 2193899, 2178950, 2169812, 2164041, 2159830, 2155962, 2151059, 2143901, 2134535, 2124414, 2114959, 2105934, 2095374, 2081382, 2064092, 2045390, 2026416, 2005988, 1982341, 1955919, 1929190, 1903689, 1878548, 1852371, 1825395, 1799124, 1774879]
50695A774879k1334j7593j3566j0175p321l714J288O625J0941J4234J7589K1930
50683A773783K7398L3292L8301M1559M3856M6952N1504N6474O1041O5942P2144
50672B312246P9212Q6054R2612R9565J06686J12765J17184J20492J23191J24769
50662C374776J24340J21566J16551J09160R8986Q6059P1300N6025M0946K5695
50652D225404R695o576k1351l2727l9791m2678m2088l8967l4363k9182k4125j9750
50640C903501j6249j3219j0387q716j0027j5021k2382l0574l9837n1615o6137
50629C619337q1477r4916j04647j10245j12244j11519j08757j04287r8433r1569
50619B601243q3655p4313o3927n3982m5423l7131k7194j5579m374M828J2702K0885
$$ y = [1774879, 1753545, 1735952, 1722386, 1712211, 1704890, 1701176, 1702464, 1709089, 1720030, 1734264, 1751853, 1773783, 1801181, 1834473, 1872774, 1914333, 1958189, 2005141, 2056645, 2113119, 2174160, 2240102, 2312246, 2391458, 2477512, 2570124, 2669689, 2776375, 2889140, 3006324, 3126816, 3250007, 3374776, 3499116, 3620682, 3737233, 3846393, 3945379, 4031438, 4102738, 4158763, 4199709, 4225404, 4235099, 4228523, 4207172, 4174445, 4134654, 4091976, 4049888, 4010921, 3976558, 3947376, 3923251, 3903501, 3887252, 3874033, 3863646, 3854930, 3844903, 3829882, 3807500, 3776926, 3737089, 3685474, 3619337, 3537860, 3442944, 3338297, 3228052, 3115808, 3004289, 2895532, 2791245, 2692812, 2601243, 2517588, 2443275, 2379348, 2325366, 2279943, 2242812, 2215618, 2200039, 2195665, 2200493, 2213195, 2234080]
50607B234080K9925L9078M7489N4742O0538O4433O6024O5285O2841N9659N6103
50596B840197N1509M5426L9038L4390L1936K9927K6598K2136J7949J5006J3681
50585C167793J4280J6473J8570J8702J6975J5702J7163K1517K6926L1423L4458
50574C399982L6795L9135M1145M2217M2663M3253M3526M1841L7623L2390K7704
50563C828274K3214J7926J2365P926M650J373k099m525n122m316k371J173O214
50550C884682J1548J6306K0662K4448K6313K5144K1424J6197R674J861o302j3818
50538D038139k1257l0218m1284n3402o5251p6262q6311r5064j01992j06671j09126
50527C251301j10015j10119j09381j07001j02872r8224r4099q9909q4346p7259
$$ y = [2234080, 2264005, 2303083, 2350572, 2405314, 2465852, 2530285, 2596309, 2661594, 2724435, 2784094, 2840197, 2891706, 2937132, 2976170, 3010560, 3042496, 3072423, 3099021, 3121157, 3139106, 3154112, 3167793, 3182073, 3198546, 3217116, 3235818, 3252793, 3268495, 3285658, 3307175, 3334101, 3365524, 3399982, 3436777, 3475912, 3517057, 3559274, 3601937, 3645190, 3688716, 3730557, 3768180, 3800570, 3828274, 3851488, 3869414, 3881779, 3889705, 3894355, 3895728, 3893629, 3889104, 3883982, 3879666, 3877295, 3878468, 3884682, 3896230, 3912536, 3933198, 3957646, 3983959, 4009103, 4030527, 4046724, 4056398, 4058259, 4051957, 4038139, 4016882, 3986664, 3945380, 3891978, 3826727, 3750465, 3664154, 3569090, 3467098, 3360427, 3251301, 3141286, 3031167, 2921786, 2814785, 2711913, 2613689, 2519590, 2429681, 2345335, 2268076]
50517B268076o9595o1972n4508m7806m2713l8879l4752k9393k3371j7622j2444
50506A835021p903m173q30L306Q887J5091K0599K5022K8830L2422L5899L9564
50494B031735M3854M8883N4325N9789O5050P0139P5261Q0427Q5132Q8724R1090
50483B794409R2515R2871R1681Q9114Q6165Q3392Q0376P6929P4111P3153P3839
50472C708555P4883P5631P6526P8072Q0185Q2678Q5700Q9413R3695R8146J02193
50461D645677J05274J07304J08845J10420J11816J12386J11702J09412J04715
50452E627551R6822Q5890P2795N8006M1297K2707L128j6207l4442n1291o7011
50441E839245q2047r6085j07565j14825j17616j16657j11943j02824q9950p5606
$$ y = [2268076, 2198481, 2136509, 2082001, 2034195, 1991482, 1952603, 1917851, 1888458, 1865087, 1847465, 1835021, 1827118, 1822945, 1822115, 1825421, 1834308, 1849399, 1869998, 1895020, 1923850, 1956272, 1992171, 2031735, 2075589, 2124472, 2178797, 2238586, 2303636, 2373775, 2449036, 2529463, 2614595, 2703319, 2794409, 2886924, 2979795, 3071476, 3160590, 3246755, 3330147, 3410523, 3487452, 3561563, 3634716, 3708555, 3783438, 3859069, 3935595, 4013667, 4093852, 4176530, 4262230, 4351643, 4445338, 4543484, 4645677, 4750951, 4858255, 4967100, 5077520, 5189336, 5301722, 5413424, 5522836, 5627551, 5724373, 5810263, 5883058, 5941064, 5982361, 6005068, 6008196, 5991989, 5957547, 5906256, 5839245, 5757198, 5661113, 5553548, 5438723, 5321107, 5204450, 5092507, 4989683, 4899733, 4824127]
50431D824127o1381m6791l1207j5960l089P082J5516K1998K4739K2392J5006K967
50419D775399j3530l3458n4750p5706r5659j13916j29224j40939j49538j55218
50409C813461j57086j54821j50140j45247j40344j33980j25466j15712j05918
50400B584747r6727q8496q1126p3656o5300n6900n0034m4533l8484l1060k3705
50389A934726j7677j2125n962j96L470N574Q432J2914J7535K0937K3647K6740
50377B018015L0080L2812L4833L6913L9691M3102M6571M9467N1628N3577N5799
50366B492488N7716N7936N5902N2840N0820N0907N2287N2847N0863M6635M2493
50355C063734M0554M0626M1016M1123M1955M3913M5762M6539M7150M8779N0767
$$ y = [4824127, 4762746, 4715955, 4684748, 4668788, 4665699, 4672781, 4688297, 4710295, 4735034, 4757426, 4772432, 4775399, 4761869, 4728411, 4673661, 4597955, 4502296, 4388380, 4259156, 4118217, 3968679, 3813461, 3656375, 3501554, 3351414, 3206167, 3065823, 2931843, 2806377, 2690665, 2584747, 2488020, 2399524, 2318398, 2244742, 2179442, 2122542, 2072508, 2027975, 1989491, 1958431, 1934726, 1917049, 1904924, 1898962, 1898766, 1902236, 1907810, 1916242, 1929156, 1946691, 1967628, 1991275, 2018015, 2048095, 2080907, 2115740, 2152653, 2192344, 2235446, 2282017, 2331484, 2383112, 2436689, 2492488, 2550204, 2608140, 2664042, 2716882, 2767702, 2818609, 2870896, 2923743, 2974606, 3021241, 3063734, 3104288, 3144914, 3185930, 3227053, 3269008, 3312921, 3358683, 3405222, 3452372, 3501151, 3551918]
50344C551918N1511N0774M9667M8659M7097M4432M0520L4745K6468J6570P068
50333C969429j283r872k0207l2258m5189n8335p0669q0645q7863r3796r9652j04388
50321C265272j06197j05060j02238r7762r0554q0945p1040o1968n2520m1499k9913
50310B425576j9701j1252l610L541R359J2932J3640J0730L887n626j5458k4291
50298B399727l2580m0868m8207n3011n5086n5916n7050n8611n9429n8286n5023
50287A825660n0748m6996m4495m2611m0089l6464l2575k9617k7746k5926k3123
50276A425270j9430j5797j3031j1293j0269r268p263l605J068N245Q135J0314
50264A360076J2548J4685J6295J7634J9183K0782K2174K3912K6579K9331L0528
$$ y = [3551918, 3603429, 3654203, 3703870, 3752529, 3799626, 3844058, 3884578, 3919323, 3945791, 3962361, 3969429, 3968146, 3958274, 3938067, 3905809, 3860620, 3802285, 3731616, 3650971, 3563108, 3469312, 3369660, 3265272, 3159075, 3054015, 2951777, 2854015, 2763461, 2682516, 2611476, 2549508, 2496988, 2455489, 2425576, 2405875, 2394623, 2391013, 2394554, 2403913, 2416845, 2430485, 2441215, 2445102, 2439476, 2424018, 2399727, 2367147, 2326279, 2278072, 2225061, 2169975, 2114059, 2057009, 1998398, 1938969, 1880683, 1825660, 1774912, 1727916, 1683421, 1640810, 1600721, 1564257, 1531682, 1502065, 1474319, 1448393, 1425270, 1405840, 1390043, 1377012, 1365719, 1355450, 1346182, 1338919, 1335314, 1336382, 1341627, 1349762, 1360076, 1372624, 1387309, 1403604, 1421238, 1440421, 1461203, 1483377, 1507289, 1533868, 1563199, 1593727]
50253A593727K9992K9515L0708L3222L5497L6464L6189L5516L5400L5945L5968
50242A968143L4260L1277K8583K6537K3909K0160J6486J3742J0851O528J376l126
50230B178726o648r546j1395j1795j2085j4287j8534k3137k6889k9726l1489l2005
50218A951190l2315l3703l5272l4695l1938k9995l0886l2914l3297l1819l0242
50207A594114k9411k8737k7726k6261k3948k0660j7405j5340j4210j2897j1098
50196A366421r285p383m806j652J190L079L873L440K066J058J690L561N166N993
50182A374411O773P689P824O782N536M929M475L292J340r45l450n943p575p790
50168A397348p361p627q914j0401j1274j1363j0748r559q220p361p235p498p590
$$ y = [1593727, 1623719, 1653234, 1683942, 1717164, 1752661, 1789125, 1825314, 1860830, 1896230, 1932175, 1968143, 2002403, 2033680, 2062263, 2088800, 2112709, 2132869, 2149355, 2163097, 2173948, 2180476, 2181852, 2178726, 2172078, 2162532, 2151137, 2139342, 2127257, 2112970, 2094436, 2071299, 2044410, 2014684, 1983195, 1951190, 1918875, 1885172, 1849900, 1815205, 1783267, 1753272, 1722386, 1689472, 1656175, 1624356, 1594114, 1564703, 1535966, 1508240, 1481979, 1458031, 1437371, 1419966, 1404626, 1390416, 1377519, 1366421, 1357136, 1349753, 1344947, 1343295, 1344485, 1347564, 1351437, 1354877, 1356943, 1358001, 1359691, 1363252, 1368418, 1374411, 1381184, 1388873, 1396697, 1403479, 1409015, 1413944, 1418419, 1421711, 1423051, 1422106, 1418656, 1412713, 1405138, 1397348, 1389987, 1382360, 1373446, 1363045, 1351771, 1340408, 1329660, 1320101, 1311881, 1304520, 1297285, 1289787, 1282197]
50155A282197o998n179j834K288N373N933M365K738K749M068M986M443L023J962
50141A310114J734J817J484M87r06k217l167l935m912o141p314q376r650j1100
50127A257918j2043j2100j1889j2098j2344j1829j0878j0700j1555j2296j2178
50116A128008j2102j3307j5358j6467j5594j3512j1657j0549r641q377o850n362
50104I89232l832k104o87m79j564k892l621m192n374o768p339p162p414q488r316
50089I18000r118q721r257j0313j0473r290p732o756o363o081n609m799l558k114
50075H17816r26k82j36l57o51l80Q74K528L505L766M428N854O610N407L490L544
50059H55090O227R219J0261R878J0044J1203J2037J1706J0807J0003R150Q156
$$ y = [1282197, 1275199, 1270020, 1268186, 1270474, 1275847, 1281780, 1286145, 1288883, 1291632, 1295700, 1300686, 1305129, 1308152, 1310114, 1311848, 1313665, 1315149, 1315636, 1314730, 1312513, 1309346, 1305411, 1300499, 1294358, 1287044, 1278668, 1269018, 1257918, 1245875, 1233775, 1221886, 1209788, 1197444, 1185615, 1174737, 1164037, 1152482, 1140186, 1128008, 1115906, 1102599, 1087241, 1070774, 1055180, 1041668, 1030011, 1019462, 1009821, 1001444, 994594, 989232, 985400, 983296, 982609, 982130, 980566, 977674, 974053, 969861, 964487, 957719, 950380, 943218, 935804, 927316, 918000, 908882, 900161, 890904, 880591, 870118, 860828, 853096, 846340, 839977, 833896, 828287, 823488, 819930, 817816, 816890, 816608, 816472, 816115, 815464, 815084, 815958, 818486, 821991, 825757, 830185, 836039, 842649, 848056, 851546, 855090, 861317, 870536, 880797, 890675, 900719, 911922, 923959, 935665, 946472, 956475, 965625, 973781]
50047I73781P584P587P174N461L183K072K893M741O211O664O382N864N182M072
50033A048851K807K601M395P136Q412P344N948O687R460J2049J2984J2643J2003
50020A153320J1700J2355J4400J7184J9314K0198K0427K0489K0199J9638J9603
50009A348827K0469K1602K2447K3313K4484K5425K5619K5404K5229K4746K3500
49998A611065K2033K1384K1871K3038K4433K5590K5799K4809K3638K3613K4758
49987A872031K5822K5861K4946K3400K1238J8664J6278J4510J3334J2788J3183
49976B082055J4561J6318J7813J9013K0344K2179K4555K7223K9826L2334L5290
49965B341511L9307M4206M8920N2326N3815N3065M9791M4081L6672K8714K1403
$$ y = [973781, 981365, 988952, 996126, 1001587, 1004770, 1006842, 1009735, 1014476, 1020687, 1027351, 1033733, 1039597, 1044779, 1048851, 1051658, 1054259, 1058654, 1065790, 1074202, 1081546, 1087494, 1094181, 1103641, 1115690, 1128674, 1141317, 1153320, 1165020, 1177375, 1191775, 1208959, 1228273, 1248471, 1268898, 1289387, 1309586, 1329224, 1348827, 1369296, 1390898, 1413345, 1436658, 1461142, 1486567, 1512186, 1537590, 1562819, 1587565, 1611065, 1633098, 1654482, 1676353, 1699391, 1723824, 1749414, 1775213, 1800022, 1823660, 1847273, 1872031, 1897853, 1923714, 1948660, 1972060, 1993298, 2011962, 2028240, 2042750, 2056084, 2068872, 2082055, 2096616, 2112934, 2130747, 2149760, 2170104, 2192283, 2216838, 2244061, 2273887, 2306221, 2341511, 2380818, 2425024, 2473944, 2526270, 2580085, 2633150, 2682941, 2727022, 2763694, 2792408, 2813811]
49954B813811J5832J2606J1307J0704J0016R668J0335J1468J1395Q904M033k787
49942B927292j1728k3057l5958m8490n8933o6828p2619p6590p8526p8307p6491
49931B299765p4087p1884p0034o8275o6237o3620o0260n6302n2174m8243m4522
49920A624127m1037l8290l6843l6239l4971l2109k8593k6084k4774k3230k0528
49909A281429j7509j5451j4388j3558j2812j2514j2316j1288r336p563o876o929
49897A140889o904o690o712o910o591n402m010l596m585o081o668n845m419l409
49883A063067k880k124o35J433L559N146N691N203M429M385N718Q571J2598J6644
49869A130805J9046J9111J8007J7548J8435K0431K3531K7613L1314L2977L3046
$$ y = [2813811, 2829643, 2842249, 2853556, 2864260, 2874276, 2883944, 2894279, 2905747, 2917142, 2926046, 2930079, 2927292, 2915564, 2892507, 2856549, 2808059, 2749126, 2682298, 2609679, 2533089, 2454563, 2376256, 2299765, 2225678, 2153794, 2083760, 2015485, 1949248, 1885628, 1825368, 1769066, 1716892, 1668649, 1624127, 1583090, 1544800, 1507957, 1471718, 1436747, 1404638, 1376045, 1349961, 1325187, 1301957, 1281429, 1263920, 1248469, 1234081, 1220523, 1207711, 1195197, 1182881, 1171593, 1162257, 1154694, 1147818, 1140889, 1133985, 1127295, 1120583, 1113673, 1107082, 1101680, 1097670, 1094074, 1089489, 1083408, 1076740, 1070895, 1066476, 1063067, 1060187, 1058063, 1057428, 1058861, 1062420, 1067566, 1073257, 1078460, 1082889, 1087274, 1092992, 1101563, 1114161, 1130805, 1149851, 1168962, 1186969, 1204517, 1222952, 1243383, 1266914, 1294527, 1325841, 1358818, 1391864]
$$ [...]
##END NTUPLES=NMR SPECTRUM
##END=
