##TITLE=Coffee green (TOPA01 0.1001g + 1.5mL buffer 50/50,  450uL extracto + 50uL (D2O+TMS))
without heating, vortex and centrifuged, temperature 0oC.
##JCAMPDX= 6.0         $$ Bruker NMR JCAMP-DX V2.0
##DATA TYPE= NMR SPECTRUM
##DATA CLASS= NTUPLES
##ORIGIN= Bruker BioSpin GmbH
##OWNER= Administrator
$$ 1.72 TOPSPIN		Version 2.1
$$ 2012-03-17 12:52:11.734 -0800  Administrator@X
$$ Compression mode = diff/dup
##.OBSERVE FREQUENCY= 400.13188172
##.OBSERVE NUCLEUS= ^1H
##.ACQUISITION MODE= SIMULTANEOUS (DQD)
##.ACQUISITION SCHEME= undefined
##.AVERAGES= 64
##.DIGITISER RES= 22
##SPECTROMETER/DATA SYSTEM= spect
##.PULSE SEQUENCE= noesygppr1d
##.SOLVENT NAME= H2O+D2O
##.SHIFT REFERENCE= INTERNAL, H2O+D2O, 1, 14.97904
##AUDIT TRAIL= $$ (NUMBER, WHEN, WHO, WHERE, PROCESS, VERSION, WHAT)
$$ ##TITLE= Audit trail, TOPSPIN		Version 2.1
$$ ##JCAMPDX= 5.01
$$ ##ORIGIN= Bruker BioSpin GmbH
$$ ##OWNER= Administrator
$$ $$ C:\Bruker\TOPSPIN/data/jwist/nmr/11-coffee-green-origin/141/pdata/1/auditp.txt
$$ ##AUDIT TRAIL=  $$ (NUMBER, WHEN, WHO, WHERE, PROCESS, VERSION, WHAT)
(   1,<2011-10-06 19:26:29.659 -0500>,<Administrator>,<TOPSPIN>,<go>,<TOPSPIN 2.1>,
      <created by zg
	started at 2011-10-06 19:17:35.050 -0500,
	POWCHK enabled, PULCHK disabled,
       configuration hash MD5:
       DA 63 81 1B EF 4C B5 72 B4 DF EA D9 B4 DB 4C 08
       data hash MD5: 64K
       0A D1 A5 40 A7 82 65 47 D0 E3 E8 14 4B C0 8F 20>)
(   2,<2011-10-06 19:26:36.753 -0500>,<Administrator>,<TOPSPIN>,<proc1d>,<TOPSPIN 2.1>,
      <Start of raw data processing
       efp LB = 0 FT_mod = 6 PKNL = 1 PHC0 = 0 PHC1 = 0 SI = 32K 
       data hash MD5: 32K
       96 70 B9 EC 7D EE 74 F8 72 7F 16 53 EF DE 72 AB>)
(   3,<2011-10-06 19:26:37.456 -0500>,<Administrator>,<TOPSPIN>,<proc1d>,<TOPSPIN 2.1>,
      <pk PHC0 = 26.45508 PHC1 = 0 
       data hash MD5: 32K
       1B 7B B9 90 C8 8A B5 51 71 FE 26 9C D1 3A 4A 8F>)
(   4,<2011-10-06 19:43:06.144 -0500>,<Administrator>,<TOPSPIN>,<audit>,<TOPSPIN 2.1>,
      <user comment:
       TITLE=Coffee green (TOPA01 0.1001g + 1.5mL buffer 50/50,  450uL extracto + 50uL (D2O+TMS))
       without heating, vortex and centrifuged, temperature 0oC.TITLE_END
       data hash MD5: 32K
       1B 7B B9 90 C8 8A B5 51 71 FE 26 9C D1 3A 4A 8F>)
$$ ##END=
$$ 
$$ $$ hash MD5
$$ $$ 3B 91 4A 0E 77 FB 77 87 EA DD 8A 2B 6B 76 5E 54
##$RELAX= 
##$RELAX= 
##$RELAX= 
##$RELAX= 
##$RELAX= 
##$RELAX= 
$$ Bruker specific parameters
$$ --------------------------
##$DU= <Z:>
##$EXPNO= 141
##$NAME= <11-coffee-green-origin>
##$PROCNO= 1
##$TYPE= <nmr>
##$USER= <jwist>
##$ACQT0= -8.14109350058272
##$AMP= (0..31)
100 100 100 100 100 100 100 100 100 100 100 100 100 100 100 100 100 100
100 100 100 100 100 100 100 100 100 100 100 100 100 100
##$ANAVPT= -1
##$AQSEQ= 0
##$AQ_mod= 3
##$AUNM= <au_prof>
##$AUTOPOS= <>
##$BF1= 400.13
##$BF2= 400.13
##$BF3= 400.13
##$BF4= 400.13
##$BF5= 400.13
##$BF6= 400.13
##$BF7= 400.13
##$BF8= 400.13
##$BYTORDA= 0
##$CFDGTYP= 0
##$CFRGTYP= 9
$$ [...]
##$TP= (0..7)
150 150 150 150 150 150 150 150
##$TP07= 0
##$TPNAME0= <>
##$TPNAME1= <>
##$TPNAME2= <>
##$TPNAME3= <>
##$TPNAME4= <>
##$TPNAME5= <>
##$TPNAME6= <>
##$TPNAME7= <>
##$TPOAL= (0..7)
0.5 0.5 0.5 0.5 0.5 0.5 0.5 0.5
##$TPOFFS= (0..7)
0 0 0 0 0 0 0 0
##$TUNHIN= 0
##$TUNHOUT= 0
##$TUNXOUT= 0
##$USERA1= <user>
##$USERA2= <user>
##$USERA3= <user>
##$USERA4= <user>
##$USERA5= <user>
##$V9= 5
##$VALIST= <valist>
##$VCLIST= <CCCCCCCCCCCCCCC>
##$VD= 0
##$VDLIST= <DDDDDDDDDDDDDDD>
##$VPLIST= <PPPPPPPPPPPPPPP>
##$VTLIST= <TTTTTTTTTTTTTTT>
##$WBST= 2048
##$WBSW= 25
##$XGAIN= (0..3)
0 0 0 0
##$XL= 0
##$YL= 0
##$YMAX_a= 5012794
##$YMIN_a= -2003422
##$ZGOPTNS= <>
##$ZL1= 120
##$ZL2= 120
##$ZL3= 120
##$ZL4= 120
##$ABSF1= 0
##$ABSF2= 0
##$ABSG= 0
##$ABSL= 0
##$ALPHA= 0
##$AQORDER= 0
##$ASSFAC= 0
##$ASSFACI= 0
##$ASSFACX= 0
##$ASSWID= 0
##$AUNMP= <proc_prof1d>
##$AXLEFT= 0
##$AXNAME= <>
##$AXNUC= <1H>
##$AXRIGHT= 0
##$AXTYPE= 0
##$AXUNIT= <>
##$AZFE= 0.1
##$AZFW= 0.1
##$BCFW= 0
##$BC_mod= 0
##$BYTORDP= 0
##$COROFFS= 0
##$CY= 15
##$DATMOD= 1
##$DC= 0
##$DFILT= <>
##$DTYPP= 0
##$F1P= 0
##$F2P= 0
##$FCOR= 0.5
##$FTSIZE= 32768
##$FT_mod= 6
##$GAMMA= 0
##$GB= 0
##$INTBC= 1
##$INTSCL= 1
##$ISEN= 128
##$LB= 0
##$LEV0= 0
##$LPBIN= 0
##$MAXI= 10000
##$MC2= 0
##$MEAN= 0
##$ME_mod= 0
##$MI= 0
##$NCOEF= 0
##$NC_proc= -6
##$NLEV= 6
##$NOISF1= 0
##$NOISF2= 0
##$NSP= 0
##$NTH_PI= 0
##$NZP= 0
##$OFFSET= 14.97904
##$PC= 1
##$PHC0= 26.45508
##$PHC1= 0
##$PH_mod= 1
##$PKNL= yes
##$PPARMOD= 0
##$PPDIAG= 0
##$PPIPTYP= 0
##$PPMPNUM= 2147483647
##$PPRESOL= 1
##$PSCAL= 4
##$PSIGN= 0
##$PYNMP= <proc.py>
##$REVERSE= no
##$SF= 400.13
##$SI= 32768
##$SIGF1= 0
##$SIGF2= 0
##$SINO= 400
##$SIOLD= 32768
##$SPECTYP= <>
##$SREGLST= <1H.CDCl3>
##$SSB= 0
##$STSI= 32768
##$STSR= 0
##$SW_p= 8223.68421052632
##$SYMM= 0
##$S_DEV= 0
##$TDeff= 65536
##$TDoff= 0
##$TI= <>
##$TILT= no
##$TM1= 0
##$TM2= 0
##$TOPLEV= 0
##$USERP1= <user>
##$USERP2= <user>
##$USERP3= <user>
##$USERP4= <user>
##$USERP5= <user>
##$WDW= 1
##$XDIM= 32768
##$YMAX_p= 389596844
##$YMIN_p= -695336
##$CURPLOT= <Network HP LaserJet P1505>
##$CURPRIN= <$Network HP LaserJet P1505>
##$DFORMAT= <normdp>
##$LAYOUT= <+/1D_H.xwp>
##$LFORMAT= <normlp>
##$PFORMAT= <normpl>
##$SURQMSG= 1
$$ End of Bruker specific parameters
$$ ---------------------------------
##NTUPLES= NMR SPECTRUM
##VAR_NAME=  FREQUENCY,     SPECTRUM/REAL,   SPECTRUM/IMAG
##SYMBOL=    X,             R,               I
##VAR_TYPE=  INDEPENDENT,   DEPENDENT,       DEPENDENT
##VAR_FORM=  AFFN,          ASDF,            ASDF
##VAR_DIM=   32768,         32768,           32768
##UNITS=     HZ,            ARBITRARY UNITS, ARBITRARY UNITS
##FACTOR=    0.250966925370066, 1,           1
##FIRST=     8223.43324360095, -184209,      -103830
##LAST=      0,             81718,           -159464
##MIN=       0,             -695336,         0
##MAX=       8223.43324360095, 389596844,    0
$$ Real data points
##PAGE= N=1
##DATA TABLE= (X++(R..R)), XYDATA
$$ [...]
$$ plain form
19690 1773839 1977975 1845447 1735235 1745060 1654119 1795357 1791600 1751122 1789906 1766641 1870211
19679 1870211 1703616 1487878 1719925 1588220 1951085 1834251 2020815 1541083 1842762
19670 1842762 1818882 1725383 1641355 1814689 1652029 1714450 1434833 1675245 1638294 1843665
19660 1843665 1439256 1846884 1840104 1857674 1783920 1608461 1729254 1589981 1584597 1733527
19650 1733527 1385736 1740339 1669075 1594293 1515918 1714458 1668355 1701233 1817309 1690968
19640 1690968 1503223 1642836 1739776 1726575 1671381 1855158 1597537 1384998 1729985 1803499
19630 1803499 1485568 1601674 1799517 1663401 1759581 1611683 1676483 1711044 1805613 1741885
19620 1741885 1734425 1714457 1645040 1446088 1753579 1240387 1353133 1475907 1515122 1306186
$$ packed form
19690A773839K04136j32528j10212R825r0941J41238l757m0478L8784k3265J03570
19679A870211j66595k15738K32047j31705L62865j16834J86564m79732L01679
19670A842762k3880r3499q4028J73334j62660O2421k79617K40412l6951K05371
19660A843665m04409M07628o780J7570p3754j75459J20793j39273n384J48930
19650A733527l47791L54603p1264p4782p8375J98540m6103L2878J16076j26341
19640A690968j87745J39613R6940j3201n5194J83777k57621k12539L44987P3514
19630A803499l17931J16106J97843j36116R6180j47898O4800L4561R4569o3728
19620A741885p460j9968o9417j98952L07491n13192J12746J22774L9215k08936
$$ plain form
19610 1306186 1369561 1583304 1382201 1407281 1465701 1514978 1473598 1405721 1356842 1326280 1143142
19599 1143142 1403902 1290631 1421317 1670576 1335530 1461250 1234200 1326143 1364846 1372179
19589 1372179 1409593 1293290 1428548 1294865 1114994 1201203 1297017 1377083 1304385 1390432
19579 1390432 1161177 1254417 1367944 1186160 1225759 1220725 1362843 1060956 1261608 1151212
19569 1151212 1173526 1314115 921292 976404 1024785 1011567 1137689 1166922 1220080 1138040 1157970
19558 1157970 1167446 1126010 1207192 1167102 1233292 1314457 1053322 1243430 1114484 1028606 1343793
19547 1343793 1246062 1370018 1306895 1109521 1204049 1282401 1174576 1123140 1092607 1212355
19537 1212355 1200669 1199811 1037870 1339671 1020680 1068468 1217291 1206582 1149139 1193445 1009036
$$ packed form
19610A306186O3375K13743k01103K5080N8420M9277m1380o7877m8879l0562j83138
19599A143142K60760j13271J30686K49259l35046J25720k27050R1943L8703P333
19589A372179L7414j16303J35258j33683j79871Q6209R5814Q0066p2698Q6047
19579A390432k29255R3240J13527j81784L9599n034J42118l01887K00652j10396
19569A151212K2314J40589l92823N5112M8381j3218J26122K9233N3158q2040J9930
19558A157970R476m1436Q1182m0090O6190Q1165k61135J90108j28946q5878L15187
19547A343793r7731J23956o3123j97374R4528P8352j07825n1436l0533J19748
19537A212355j1686q58j61941L01801l18991M7788J48823j0709n7443M4306j84409
$$ plain form
19526 1009036 1275961 1095361 1253966 1164795 1348220 1036881 1113165 1289566 988756 1276353
19516 1276353 1437228 1318229 1057682 1254837 1142613 1290017 1288865 999677 1362016 1044741
19506 1044741 1086566 915627 1218053 1233779 1233552 1063683 1103478 1129521 1319486 853133 1034688
19495 1034688 1058127 1055078 1236775 1357574 1221192 1225363 907987 1144657 1075989 1057724 1077568
19484 1077568 1050558 1114366 1211438 1284158 1080837 1017249 843249 986744 1167467 897779
19474 897779 992375 1053573 1105382 801828 898297 1089344 691898 956584 995654 1088567 767895
19463 767895 755510 632822 611725 671332 818359 915277 674205 722229 777509 738774 679984
19452 679984 1020972 662100 909037 680437 929235 704734 670666 960367 923070 860357
$$ packed form
19526A009036K66925j80600J58605q9171J83425l11339P6284J76401l00810K87597
19516A276353J60875j18999k60547J97155j12224J47404j152k89188L62339l17275
19506A044741M1825j70939L02426J5726k27j69869L9795K6043J89965m66353J81555
19495A034688K3439l049J81697J20799j36382M171l17376K36670o8668j8265J9844
19484A077568k7010O3808R7072P2720k03321o3588j74000J43495J80723k69688
19474H97779R4596O1198N1809l03554R6469J91047l97446K64686L9070R2913l20672
19463G67895j2385j22688k1097N9607J47027R6918k41072M8024N5280l8735n8790
19452F79984L40988l58872K46937k28600K48798k24501l4068K89701l7297o2713
$$ plain form
19442 860357 821181 696571 605735 574783 723449 777920 776769 526252 639877 782537 676138
19431 676138 818997 679645 727611 770514 649719 660166 672620 602275 744913 815790 677761
19420 677761 812190 719336 668561 953378 719791 771621 1008092 724760 828801 844509
19410 844509 773730 749234 1022560 723858 522592 706893 670791 797474 704143 764010
19400 764010 928162 781269 724140 759217 785674 631221 793002 590491 870844 466225
19390 466225 763917 1008818 889643 694518 728761 761756 582695 747659 731777 855245
19380 855245 654676 1012259 682397 612167 1007147 744310 675412 761095 737458 920193
19370 920193 794184 786933 815895 437752 489265 734755 743645 814697 575944 792700 1038866
$$ packed form
19442H60357l9176j24610r0836l0952J48666N4471j151k50517J13625J42660j06399
19431F76138J42859j39352M7966M2903j20795J0447J2454p0345J42638P0877j38029
19420F77761J34429r2854n0775K84817k33587N1830K36471k83332J04041J5708
19410H44509p0779k4496K73326k98702k01266J84301l6102J26683r3331N9867
19400G64010J64152j46893n7129L5077K6457j54453J61781k02511K80353m04619
19390D66225K97692K44901j19175j95125L4243L2995j79061J64964j5882J23468
19380H55245k00569L57583l29862p0230L94980k62837o8898Q5683k3637J82735
19370I20193j26009p251K8962l78143N1513K45490Q890P1052k38753K16756K46166
$$ plain form
19359 1038866 853158 563946 792388 674051 995073 835334 701301 1041331 783111
19350 783111 869347 755221 1059564 860084 1034930 1032878 852901 870639 846489 1000626
19340 1000626 1042785 758647 1075253 953297 1091082 1030875 1017386 932003 1108620 924815
19330 924815 824941 956659 837238 813994 780004 786018 785123 842686 706758 724382 716600 565462
19318 565462 858769 554594 765526 754308 801452 965582 408757 717032 1043221 746981
19308 746981 579734 666131 532021 673950 754391 689531 843215 722354 605221 573081
19298 573081 804136 543370 571157 449582 649222 619037 601472 854258 615141 488358
19288 488358 572560 583340 777766 532615 478333 679929 817192 631526 1067605 545990
$$ packed form
19359A038866j85708k89212K28442j18337L21022j59739j34033L40030k58220
19350G83111Q6236j14126L04343j99480J74846k052j79977J7738k4150J54137
19340A000626M2159k84138L16606j21956J37785o0207j3489q5383J76617j83805
19330I24815r9874J31718j19421k3244l3990O014q95N7563j35928J7624p782j51138
19318E65462K93307l04175K10932j1218M7144J64130D08757L08275L26189k96240
19308G46981j67247Q6397j34110J41929Q0441o4860J53684j20861j17133l2140
19298E73081K31055k60766K7787j21575J99640l0185j7565K52786k39117j26783
19288D88358Q4202J0780J94426k45151n4282K01596J37263j85666M36079n21615
$$ plain form
19278 545990 528584 537027 736354 651994 770622 562178 470002 663867 547053 840235
19268 840235 714628 603355 597747 717192 652189 855788 754831 876464 964314 811653
19258 811653 930996 803814 660825 702954 666837 545044 709876 852123 742448 956891
19248 956891 483194 667697 619769 568358 612899 1107145 1112457 999623 880303 1020729
19238 1020729 879820 1163527 1356960 915271 805260 994136 893639 726339 778348 703140
19228 703140 704460 488268 788844 727350 693637 973080 842375 534792 669387 926651
19218 926651 783785 939725 789306 740795 555456 523718 476600 610712 614473 758682
19208 758682 748430 722614 527324 566104 716600 625602 816726 644639 521425 532539
$$ packed form
19278E45990j7406Q443J99327q4360J18628k08444r2176J93865j16814K93182
19268H40235j25607j11273n608J19445o5003K03599j00957J21633Q7850j52661
19258H11653J19343j27182j42989M2129l6117j21793J64832J42247j09675K14443
19248I56891m73697J84503m7928n1411M4541M94246N312j12834j19320J40426
19238A020729j40909K83707J93433m41689j10011J88876j00497j67300N2009p5208
19228G03140J320k16192L00576o1494l3713K79443j30705l07583J34595K57264
19218I26651j42866J55940j50419m8511j85339l1738m7118J34112L761J44209
19208G58682j0252k5816j95290L8780J50496r0998J91124j72087j23214J1114
$$ plain form
19198 532539 604594 783341 702640 735524 635453 622790 899634 657305 728805 626183
19188 626183 905023 714021 734258 837302 907498 946214 839051 1069038 909439 1025364
19178 1025364 987753 896703 824571 726446 899508 943756 1089199 803538 967385 879147
19168 879147 920139 1012252 917004 1111145 1065495 910504 832511 982597 873563 1137124
19158 1137124 789253 907637 837655 926845 967497 968593 833677 801051 960857 948261 748225
19147 748225 1240269 1004108 946055 1191222 1037224 1175821 1038417 892724 1232993 958363
19137 958363 1131432 850878 855728 1046339 1008759 789437 1171522 1189196 1237411 1148406 977962
19126 977962 1098088 950068 1217292 1328467 1408836 1332785 1710363 1484150 1779527 1703105
$$ packed form
19198E32539P2055J78747q0701L2884j00071j2663K76844k42329P1500j02622
19188F26183K78840j91002K0237J03044P0196L8716j07163K29987j59599J15925
19178A025364l7611r1050p2132r8125J73062M4248J45443k85661J63847q8238
19168H79147M0992R2113r5248J94141m5650j54991p7993J50086j09034K63561
19158A137124l47871J18384o9982Q9190M0652J096j34916l2626J59806j2596k00036
19147G48225M92044k36161n8053K45167j53998J38597j37404j45693L40269k74630
19137I58363J73069k80554M850J90611l7580k19322L82085J7674M8215q9005j70444
19126I77962J20126j48020K67224J11175Q0369p6051L77578k26213K95377p6422
$$ plain form
19116 1703105 2071157 2308228 2622179 3028398 3413661 3810389 3966152 4103113 4604783
19107 4604783 4298133 4182668 3677046 3838793 3204418 2805562 2206796 1934528 1847667 1631680
19097 1631680 1523996 1555661 1486862 1458308 1348830 1500953 1139060 1605513 1619886 1776894
19087 1776894 2011900 2338140 2582275 3025327 3377058 3717133 3846607 4553191 4258204
19078 4258204 4887092 5198023 4877659 4748493 4339849 4198256 4170753 4139570 3885604 3542485
19068 3542485 3173197 2928266 2421072 2300901 2098183 1830829 1827417 1576940 1813270 1670082
19058 1670082 1797073 1511043 1614075 1735771 1856549 2082364 2184630 2516156 2846416
19049 2846416 3382555 3560104 4100844 4100755 4154131 4304917 4332693 3984563 3953909 3522626 2986181
$$ packed form
19116A703105L68052K37071L13951M06219L85263L96728J55763J36961N01670
19107D604783l06650j15465n05622J61747o34375l98856n98766k72268q6861k15987
19097A631680j07684L1665o8799k8554j09478J52123l61893M66453J4373J57008
19087A776894K35006L26240K44135M43052L51731L40075J29474P06584k94987
19078D258204O28888L10931l20364j29166m08644j41593k7503l1183k53966l43119
19068C542485l69288k44931n07194j20171k02718k67354l412k50477K36330j43188
19058A670082J26991k86030J03032J21696J20778K25815J02266L31526L30260
19049B846416N36139J77549N40740q9N3376J50786K7776l48130l0654m31283n36445
$$ plain form
19038 2986181 2405294 2150273 1902593 1812836 1772457 1558068 1482917 1932355 1943984 1681166
19028 1681166 1864813 1976371 2007284 2258037 2500863 2799369 3120157 3385972 3846311 4145634
19018 4145634 4642425 4837470 5517114 5662268 6218394 6599402 6757415 6973444 7018091 7326001
19008 7326001 7990656 8456767 9450236 10931677 12537681 13766140 15749839 17457444 18834319
18999 18834319 20021177 20750491 21147957 20968925 20271798 18600274 16643836 14507887 11962219
18990 11962219 10063275 8192086 6738505 5731421 4947386 4192954 3657664 3416891 2940035
18981 2940035 2818374 2569664 2404603 2230403 2047133 1972558 1916213 1789171 1690777 1713608
18971 1713608 1669892 1816347 1513474 1714539 1913630 1608849 1563869 1628820 1598850 1647076
$$ packed form
19038B986181n80887k55021k47680q9757m0379k14389p5151M49438J1629k62818
19028A681166J83647J11558L0913K50753K42826K98506L20788K65815M60339K99323
19018D145634M96791J95045O79644J45154N56126L81008J58013K16029M4647L07910
19008G326001O64655M66111R93469J481441J606004J228459J983699J707605J376875
18999A8834319J186858P29314L97466j79032o97127j671524j956438k135949k545668
18990A1962219j898944j871189j453581j007084p84035p54432n35290k40773m76856
18981B940035j21661k48710j65061j74200j83270p4575n6345j27042r8394K2831
18971A713608m3716J46455l02873K01065J99091l04781m4980O4951k9970M8226
$$ plain form
18961 1647076 1966396 1787582 1529965 1703230 1833255 2029137 1805421 2207076 2294625 2203654
18951 2203654 2508594 2545402 2896961 3055756 3535440 3968997 4645765 5220221 6283897
18942 6283897 7560236 8837457 10883392 12637760 14425982 16037878 17626192 18573220
18934 18573220 19056855 19347208 18780901 17894651 16136948 14409336 12093205 9629522 8165025
18925 8165025 6588280 5415795 4455545 3762491 3088915 2771496 2595852 2317759 2149237
18916 2149237 2010605 1776142 1485465 1343595 1522856 1259006 1167620 1321672 1078901 1187934
18906 1187934 1023829 787289 1031115 1004109 607013 853907 1021601 747361 799895 809620
18896 809620 722206 726704 804801 649784 751611 683491 897559 651690 578294 834373 651100
$$ packed form
18961A647076L19320j78814k57617J73265J30025J95882k23716M01655Q7549r0971
18951B203654L04940L6808L51559J58795M79684M33557O76768N74456J063676
18942F283897J276339J277221K045935J754368J788222J611896J588314R47028
18934A8573220M83635K90353n66307q86250j757703j727612k316131k463683j464497
18925H165025j576745j172485r60250o93054o73576l17419j75644k78093j68522
18916B149237j38632k34463k90677j41870J79261k63850r1386J54052k42771J09033
18906A187934j64105k36540K43826k7006l97096K46894J67694k74240N2534R725
18896H09620q7414M498P8097j55017J01827o8120K14068k45869p3396K56079j83273
$$ plain form
18885 651100 551221 677780 702445 610053 430160 571642 629218 623938 440746 790035 687486
18874 687486 633103 400840 791442 485516 455201 354999 580204 623088 381375 599169
18864 599169 382203 625044 571926 573741 486752 442820 659776 538645 577906 483024 427405
18853 427405 184236 551419 548347 742415 801070 609434 762503 768898 473071 616204
18843 616204 594427 587736 674319 550716 720713 739596 565958 582205 579662 652592 654980
18832 654980 676847 443079 667925 366513 881107 566810 485225 559315 691464 312543
18821 795398 628757 716792 484114 646955 514436 470668 826386 627864 643309 436808
18811 436808 608788 727026 566811 578428 527193 662707 448416 492947 603255 566250
$$ packed form
18885F51100r9879J26559K4665r2392j79893J41482N7576n280j83192L49289j02549
18874F87486n4383k32263L90602l05926l0315j00202K25205M2884k41713K17794
18864E99169k16966K42841n3118J815q6989m3932K16956j21131L9261r4882n5619
18853D27405A84236L67183l072J94068N8655j91636J53069O395k95827J43133
18843F16204k1777o691Q6583j23603J69997J8883j73638J6247k543P2930K388
18832F54980K1867k33768K24846l01412N14594l14297q1585P4090J32149C12543
18821G95398j66641Q8035k32678J62841j32519m3768L55718j98522J5445k06501
18811D36808J71980J18238j60215J1617n1235J35514k14291M4531J10308l7005
$$ plain form
18801 566250 389998 632464 545474 754952 602938 390051 456399 403959 567574 586009
18791 586009 625303 655124 699348 432921 555018 553560 680981 744213 564149 598685 489774
18780 489774 535802 543253 653382 399637 652031 559627 765376 657805 590018 603604 551641
18769 551641 838725 596061 613529 516909 726308 618037 459365 280747 418267 822211
18759 822211 566137 822097 411175 379594 589065 729766 411089 592352 509310 397636
18749 397636 646549 492965 615535 589731 425803 611025 449423 674833 579006 556611
18739 556611 628617 443920 454336 527149 713462 533473 385891 784312 551722 359604
18729 359604 406933 556040 549264 595378 436638 448651 427480 611337 880544 613207 527800
$$ packed form
18801E66250j76252K42466q6990K09478j52014k12887O6348n2440J63615J8435
18791E86009L9294K9821M4224k66427J22097j458J27421O3232j80064L4536j08911
18780D89774M6028P451J10129k53745K52394r2404K05749j07571o7787J3586n1963
18769E51641K87084k42664J7468r6620K09399j08271j58672j78618J37520M03944
18759H22211k56074K55960m10922l1581K09471J40701l18677J81263q3042j11674
18749C97636K48913j53584J22570k5804j63928J85222j61602K25410r5827k2395
18739E56611P2006j84697J0416P2813J86313j79989j47582L98421k32590j92118
18729C59604M7329J49107o776M6114j58740J2013k1171J83857K69207k67337q5407
$$ plain form
18718 527800 653081 402011 551511 489233 453710 636247 429556 437788 724709 550793
18708 550793 476281 617385 486657 552671 664469 784521 602617 664202 246980 509824
18698 509824 474121 578191 541848 443412 718912 453871 436853 593612 461257 496514
18688 496514 523025 386110 671427 709291 508830 508347 643343 549922 428828 818958 497080
18677 497080 488476 636159 460041 505178 468983 291681 556055 661623 704735 651863 594325
18666 594325 478132 612425 580136 567609 563385 421614 785599 517200 429129 409888 618223
18655 618223 467315 570091 449862 518583 462341 686889 412354 655746 314006 549284
18645 549284 553442 460481 543182 361962 385783 448203 441154 579281 443621 365177 519763
$$ packed form
18718E27800J25281k51070J49500o2278l5523J82537k06691Q232K86921j73916
18708E50793p4512J41104j30728O6014J11798J20052j81904O1585B46980K62844
18698E09824l5703J04070l6343r8436K75500k65041j7018J56759j32355L5257
18688D96514K6511j36915K85317L7864k00461m83J34996r3421j21094L90130l21878
18677D97080q604J47683j76118M5137l6195j77302K64374J05568M3112n2872n7538
18666E94325j16193J34293l2289j2527m224j41771L63985k68399q8071j9241K08335
18655F18223j50908J02776j20229O8721n6242K24548k74535K43392C14006K35278
18645E49284M158r2961Q2701j81220K3821O2420p049J38127j35660p8444J54586
$$ plain form
18634 519763 237218 424282 566425 398315 381857 583464 458061 509715 817910 410016
18624 410016 464323 524135 581027 365181 820770 471935 578928 524673 477414 372236
18614 372236 562469 645994 396705 364386 417361 430931 606270 440954 493448 435208 533935
18603 533935 744529 465993 416160 386585 560910 625542 586352 471533 566918 611242 480938
18592 480938 717678 763896 756728 692347 864318 727780 854842 613490 623176 898253 731182
18581 731182 738713 337262 591980 547411 630002 630010 577586 839844 567132 653793 612935 589099
18569 589099 582504 657740 558922 595645 511134 366342 607011 461091 696057 458814 665882
18558 665882 458894 510210 352349 624751 458660 483502 535401 442922 393769 444526 277129
$$ packed form
18634E19763B37218J87064J42143j68110j6458K01607j25403N1654L08195m07894
18624D10016N4307N9812N6892k15846M55589l48835J06993n4255m7259j05178
18614C72236J90233Q3525k49289l2319N2975J3570J75339j65316N2494n8240R8727
18603E33935K10594k78536m9833k9575J74325O4632l9190j14819R5385M4324j30304
18592D80938K36740M6218p168o4381J71971j36538J27062k41352R686K75077j67071
18581G31182P531C37262K54718m4569Q2591Qn2424K62258k72712Q6661m0858k3836
18569E89099o595P5236r8818L6723q4511j44792K40669j45920K34966k37243K07068
18558F65882k06988N1316j57861K72402j66091K4842N1899r2479m9153N0757j67397
$$ plain form
18547 277129 527677 341197 541149 434322 306585 543373 489061 439788 535435 447401
18537 447401 372460 498154 233368 475747 508268 643381 516089 589521 684012 507754
18527 507754 531081 372645 523558 566506 186703 721358 509533 313431 483305 316083
18517 316083 555347 598737 409580 427498 476269 327456 520371 522966 470866 701541 383368
18506 383368 441708 418882 486084 589844 372764 516137 786079 452881 400916 442665
18496 442665 385038 618586 562937 437404 491942 666711 443554 455307 586923 658506
18486 658506 510001 519058 478259 546184 250309 595090 617258 517132 616575 646469 632628
18475 632628 422445 465405 736971 292237 486375 369644 507403 528141 672276 742650
$$ packed form
18547B77129K50548j86480J99952j06827j27737K36788n4312m9273R5647q8034
18537D47401p4941J25694B33368K42379L2521J35113j27292P3432R4491j76258
18527E07754K3327j58436J50913M2948A86703N34655k11825j96102J69874j67222
18517C16083K39264M3390j89157J7918M8771j48813J92915K595n2100K30675l18173
18506C83368N8340k2826O7202J03760k17080J43373K69942l33198n1965M1749
18496D42665n7627K33548n5649j25533N4538J74769k23157J1753J31616P1583
18486F58506j48505R057m0799O7925B50309L44781K2168j00126R9443K9894j3841
18475F32628k10183M2960K71566B92237J94138j16731J37759K0738J44135P0374
$$ plain form
18465 742650 703897 610891 573230 898119 653149 783971 760642 721232 686889 729228 843912
18454 843912 688978 774180 897618 641633 553487 641233 519749 632106 528346 388025
18444 388025 488887 499727 552389 562676 477960 477674 589210 539549 747728 627563 513308
18433 513308 690500 603192 609220 840007 565203 623728 752869 564571 615561 511645
18423 511645 713118 600999 451141 518298 292784 331818 473038 453487 456259 288859
18413 288859 377159 624202 368061 489185 472450 518270 627203 367713 452860 548473
18403 548473 565990 526690 425985 459474 342826 436690 382296 444517 316665 439852 468650
18392 468650 522121 337620 541125 420039 383936 527255 464712 344015 416923 235152
$$ packed form
18465G42650l8753r3006l7661L24889k44970J30822k3329l9410l4343M2339J14684
18454H43912j54934Q5202J23438k55985q8146Q7746j21484J12357j03760j40321
18444C88025J00862J0840N2662J0287q4716k86J11536m9661K08179j20165j14255
18433E13308J77192q7308O028K30787k74804N8525J29141j88298N0990j03916
18423E11645K01473j12119j49858O7157k25514L9034J41220j9551K772j67400
18413B88859Q8300K47043k56141J21124j6735M5820J08933k59490Q5147R5613
18403E48473J7517l9300j00705L3489j16648R3864n4394O2221j27852J23187K8798
18392D68650N3471j84501K03505j21086l6103J43319o2543j20697P2908j81771
$$ plain form
18382 235152 458114 302051 826129 502776 539644 458386 571129 604725 468978 348340
18372 348340 189558 431401 551083 567381 522990 376718 451338 652973 342417 620668
18362 620668 515190 540382 503291 488140 542828 414997 469713 549953 751281 641283 618196
18351 618196 490294 755929 551671 511869 487230 447631 630685 527344 538144 335267
18341 335267 477386 391169 442886 246288 644220 416999 529543 359735 489843 371134
18331 371134 511054 433783 524218 461708 634501 648254 660911 662903 788975 531696 434386
18320 434386 674803 765089 860176 571646 511865 728435 748965 473816 554305 458193 436720
18309 436720 391782 594047 347453 512503 592549 461037 676673 413903 489781 258073
$$ packed form
18382B35152K22962j56063N24078l23353L6868q1258J12743L3596j35747j20638
18372C48340j58782K41843J19682J6298m4391j46272P4620K01635l10556K78251
18362F20668j05478K5192l7091j5151N4688j27831N4716Q0240K01328j09998k3087
18351F18196j27902K65635k04258l9802k4639l9599J83054j03341J0800k02877
18341C35267J42119q6217N1717j96598L97932k27221J12544j69808J30108j18709
18331C71134J39920p7271R0435o2510J72793J3753J2657J992J26072k57279r7310
18320D34386K40417R0286R5087k88530n9781K16570K0530k75149Q0489r6112k1473
18309D36720m4938K02265k46594J65050Q0046j31512K15636k62770P5878k31708
$$ plain form
18299 258073 606842 333600 475569 323115 477462 561840 404442 429760 543616 491007
18289 491007 439128 573284 507196 358709 281236 502498 641412 445988 392255 656960
18279 656960 484361 512849 456499 422999 413977 446177 408723 257491 631892 340811 547195
18268 547195 452132 253831 463018 324231 593547 323570 484441 349399 487015 492734
18258 492734 617009 615388 372969 353157 661305 673474 402871 741985 702125 531885
18248 531885 577448 565455 616424 426961 402220 467939 277870 504657 479557 484506 396022
18237 396022 731115 534012 397325 367560 517384 625820 384848 463792 525042 366263
18227 366263 491831 593280 625057 319571 350000 570299 519805 556624 467547 742305
$$ packed form
18299B58073L48769k73242J41969j52454J54347Q4378j57398K5318J13856n2609
18289D91007n1879J34156o6088j48487p7473K21262J38914j95424n3733K64705
18279F56960j72599K8488n6350l3500r022L2200l7454j51232L74401k91081K06384
18268E47195r5063j98301K09187j38787K69316k69977J60871j35042J37616N719
18258D92734J24275j621k42419j9812L08148J2169k70603L39114l9860j70240
18248E31885M5563j1993N0969j89463k4741O5719j90069K26787k5100M949q8484
18237C96022L35093j97103j36687k9765J49824J08436k40972P8944O1250j58779
18227C66263J25568J01449L1777l05486L0429K20299n0494L6819q9077K74758
$$ plain form
18217 742305 459770 446678 380126 473385 483749 789934 460080 520845 275724 315331 402794
18206 402794 633576 505995 528040 651535 618087 520321 215354 576058 714366 772150
18196 772150 669719 734940 183404 671954 393020 522758 506012 458689 581547 662981
18186 662981 844382 515135 552876 534602 659445 557839 444103 272028 317555 350899
18176 350899 438849 508107 459832 462342 542920 388192 368290 397556 353712 381093 381703 402934
18164 402934 732980 579086 624744 441357 525225 601689 457616 458719 499727 424609 502027
18153 502027 441093 631686 337985 520764 250717 502143 599058 669474 405275 557699
18143 557699 630169 446584 463570 371686 358617 441838 440031 604156 740904 459487 493035
$$ packed form
18217G42305k82535j3092o6552R3259J0364L06185l29854O0765k45121L9607Q7463
18206D02794K30782j27581K2045J23495l3448r7766B15354L60704J38308N7784
18196G72150j02431O5221A83404M88550k78934J29738j6746m7323J22858Q1434
18186F62981J81401l29247L7741j8274J24843j01606j13736j72075M5527L3344
18176C50899Q7950O9258m8275K510Q0578j54728j9902K9266m3844K7381O10K1231
18164D02934L30046j53894M5658j83387Q3868P6464j44073J103M1008p5118P7418
18153E02027o0934J90593k93701J82779B50717K51426R6915P0416k64199J52424
18143E57699P2470j83585J6986r1884j3069Q3221j807J64125J36748k81417L3548
$$ plain form
18132 493035 522586 609061 286792 457221 459650 396054 595373 482627 312901 480038
18122 480038 518914 594013 495440 460933 441658 576349 572857 554071 423602 549559 563213
18111 563213 611559 620580 502964 634054 583058 288431 540533 504531 343522 631813
18101 631813 564045 381313 591673 421608 487246 538496 642512 575528 682085 372156
18091 372156 526784 455550 403019 504626 686531 352468 385610 655480 266111 570461
18081 570461 458725 386632 375241 351655 386816 484952 544144 527034 665103 337941 497965
18070 497965 424047 307348 569250 535470 371113 355270 630204 471282 500066 543157
18060 543157 336412 377591 375597 502306 399155 558943 166253 629650 197169 636187
$$ packed form
18132D93035K9551Q6475B86792J70429K429o3596J99319j12746j69726J67137
18122D80038L8876P5099r8573l4507j9275J34691l492j8786j30469J25957J3654
18111E63213M8346R021j17616J31090n0996B88431K52102l6002j61009K88291
18101F31813o7768j82732K10360j70065O5638N1250J04016o6984J06557l09929
18091C72156J54628p1234n2531J01607J81905l34063L3142K69870B66111L04350
18081E70461j11736p2093j1391k3586L5161R8136N9192j7110J38069l27162J60024
18070D97965p3918j16699K61902l3780j64357j5843K74934j58922K8784M3091
18060E43157k06745M1179j994J26709j03151J59788A66253M63397A97169M39018
$$ plain form
18050 636187 518239 382378 293602 502765 382271 391282 436639 290281 656028 553692
18040 553692 473875 386161 479852 238303 255402 322221 578516 605298 467625 452606 240674
18029 240674 366584 187164 695025 262258 609857 364743 562413 327262 625667 384649
18019 384649 393279 387716 356579 577206 363207 200924 340790 345150 471437 280132 639884
18008 639884 255087 470487 262518 470680 364966 658669 391532 395690 383816 762416
17998 762416 502732 605737 485216 460217 279330 487926 370842 417192 458723 457903 338234
17987 338234 418081 399215 260024 620269 507371 569229 504168 531250 407399 594037
17977 594037 495238 483584 292938 341769 449238 729110 461970 586521 111687 319280
$$ packed form
18050F36187j17948j35861q8776K09163j20494R011M5357j46358L65747j02336
18040E53692p9817q7714R3691B38303J7099O6819K56295K6782j37673j5019k11932
18029B40674J25910j79420N07861B62258L47599k45114J97670k35151K98405k41018
18019C84649Q630n563l1137K20627k13999j62283J39866M360J26287j91305L59752
18008F39884B55087K15400k07969K08162j05714K93703k67137M158j1874L78600
17998G62416k59684J03005j20521k4999j80887K08596j17084M6350M1531q20j19669
17987C38234P9847j8866j39191L60245j12898O1858o5061K7082j23851J86638
17977E94037r8799j1654j90646M8831J07469K79872k67140J24551A11687K07593
$$ plain form
17967 319280 592006 384110 456340 390093 464971 279354 474244 346627 464479 428371
17957 428371 427178 573466 550808 404479 263849 350668 341752 472199 717225 522992 402836
17946 402836 508375 513280 602176 446193 616461 607427 595268 588761 367874 534000 510184
17935 510184 383614 496306 476717 679635 481095 598340 357164 540530 439645 496831
17925 496831 692313 628051 782857 531153 489177 729909 578345 597089 278632 549122
17915 549122 402263 686072 522992 314965 802290 428483 655467 273610 517907 470486
17905 470486 472351 577415 556931 530167 690973 540716 563088 488897 542138 447747 559796
17894 559796 557722 324024 457031 482249 794884 301853 539698 647174 695441 771761
$$ packed form
17967C19280K72726k07896P2230o6247P4878j85617J94890j27617J17852l6108
17957D28371j193J46288k2658j46329j40630Q6819q916J30447K45026j94233j20156
17946D02836J05539M905Q8896j55983J70268r034j2159o507k20887J66126k3816
17935E10184j26570J12692j9589K02918j98540J17245k41176J83366j00885N7186
17925D96831J95482o4262J54806k51704m1976K40732j51564J8744B78632K70490
17915E49122j46859K83809j63080k08027M87325l73807K26984B73610K44297m7421
17905D70486J865J05064k0484k6764J60806j50257K2372p4191N3241r4391J12049
17894E59796k074k33698J33007K5218L12635C01853K37845J07476M8267P6320
$$ plain form
17884 771761 374487 642795 755202 535867 558292 654501 616531 599210 806263 451979
17874 451979 593347 663084 466378 614481 661531 499021 701241 711684 710186 413347
17864 413347 566359 661791 578080 579581 459421 731305 708713 547589 688002 427327
17854 427327 583793 562299 665628 462056 777677 544585 746385 815371 674386 377339
17844 377339 766192 601161 614539 726242 611503 412554 652074 573727 549400 553613
17834 553613 642825 368943 678618 695962 657690 442535 753695 595518 528885 708974
17824 708974 869711 647782 765821 660044 759813 640399 772598 699148 968498 782980
17814 782980 751767 989062 857066 1041642 1051097 949867 887988 1013557 687228 606972
$$ packed form
17884G71761C74487K68308J12407k19335K2425R6209l7970j7321K07053l54284
17874D51979J41368O9737j96706J48103M7050j62510K02220J0443j498k96839
17864D13347J53012R5432q3711J501j20160K71884k2592j61124J40413k60675
17854D27327J56466k1494J03329k03572L15621k33092K01800O8986j40985k97047
17844C77339L88853j65031J3378J11703j14739j98949K39520p8347k4327M213
17834E53613Q9212k73882L09675J7344l8272k15155L11160j58177o6633J80089
17824G08974J60737k21929J18039j05777R9769j19414J32199p3450K69350j85518
17814G82980l1213K37295j31996J84576R455j01230o1879J25569l26329q0256
$$ plain form
17804 606972 986292 719277 564819 953224 928086 1082763 836120 886776 796777 1021140
17794 1021140 970373 862335 838141 817550 718436 690514 581480 873653 610969 685080
17784 685080 661024 819359 645149 616906 695735 529684 543804 406055 641224 391588
17774 391588 678119 698198 735904 656686 630043 529023 517710 551550 658669 639339 675038
17763 675038 605510 575558 422964 465507 524536 613852 462218 483738 635443 378341 657873
17752 657873 621057 396849 440281 756694 493436 743419 608808 602208 593657 535402 652935
17741 652935 608285 601902 305163 532375 561531 518580 495240 743671 712702 714188 377751
17730 377751 573780 702651 594698 649899 430083 670098 763573 485042 557339 601328
$$ packed form
17804F06972L79320k67015j54458L88405k5138J54677k46643N0656q9999K24363
17794A021140n0767j08038k4194k0591r9114k7922j09034K92173k62684P4111
17784F85080k4056J58335j74210k8243P8829j66051J4120j37749K35169k49636
17774C91588K86531K0079L7706p9218k6643j01020j1313L3840J07119j9330L5699
17763F75038o9528k9952j52594M2543N9029Q9316j51634K1520J51705k57102K79532
17752F57873l6816k24208M3432L16413k63258K49983j34611o600q551n8255J17533
17741F52935m4650o383k96739K27212K9156m2951k3340K48431l0969J486l36437
17730C77751J96029J28871j07953N5201k19816K40015R3475k78531P2297M3989
$$ plain form
17720 601328 768755 320045 756286 776176 631430 753903 632127 582694 526657 459635
17710 459635 628400 598704 600296 528578 615861 637323 505846 682882 730572 685456 597324
17699 597324 734580 641711 646375 644637 630297 633309 478654 537359 815174 528921 631711
17688 631711 483103 627709 532962 686896 597156 412530 767122 530061 541975 774687
17678 774687 588869 562990 421837 758150 729157 521963 477923 767755 629954 622498
17668 622498 577469 621043 886338 792941 442036 710239 684150 523135 575319 792687
17658 792687 317180 669446 712490 803386 672287 605437 584647 712838 742977 736461 876970
17647 876970 876272 977931 752763 735637 940643 548620 860202 869255 755867 750828 803747
$$ packed form
17720F01328J67427C20045M36241J9890j44746J22473j21776m9433n6037o7022
17710D59635J68765k9696J592p1718Q7283K1462j31477J77036M7690m5116q8132
17699E97324J37256r2869M664j738j4340L012j54655N8705K77815k86253J02790
17688F31711j48608J44606r4747J53934q9740j84626L54592k37061J1914K32712
17678G74687j85818k5879j41153L36313k8993k07194m4040K89832j37801p456
17668F22498m5029M3574K65295r3397l50905K68203k6089j61015N2184K17368
17658G92687C17180L52266M3044R0896j31099o6850k0790J28191L0139o516J40509
17647H76970o98J01659k25168j7126K05006l92023L11582R053j13388n039N2919
$$ plain form
17636 803747 760951 647799 779765 895053 964989 980276 977306 817554 1142246 1055164 870205
17625 870205 1122257 1012337 1030011 1114232 1015462 971158 1013225 1086022 1085770 1130532 1107517
17614 1107517 1217636 1168222 1049529 1094773 1072002 1266191 1107804 993024 1342282 1146813
17604 1146813 1133907 1429493 1103824 1119336 1481018 1269158 1156576 1191430 1035522 1154564
17594 1154564 1482272 1193065 1409680 1041367 1154943 1161205 1403353 1326833 1343200 1273934
17584 1273934 1289143 1425027 1401747 1596306 1306736 1483285 1225894 1478682 1391200 1491121
17574 1491121 1478519 1416295 1529530 1412866 1337565 1421244 1473601 1512754 1430181 1176556 970692
17563 970692 1405436 1134194 1230021 1294374 954045 1277558 1245586 1253196 903909 1401023
$$ packed form
17636H03747m2796j13152J31966J15288O9936J5287k970j59752L24692q7082j84959
17625H70205K52052j09920J7674Q4221r8770m4304M2067P2797k52M4762k3015
17614A107517J10119m9414j18693M5244k2771J94189j58387j14780L49258j95469
17604A146813j2906K95586l25669J5512L61682k11860j12582L4854j55908J19042
17594A154564L27708k89207K16615l68313J13576O262K42148p6520J6367o9266
17584A273934J5209J35884k3280J94559k89570J76549k57391K52788q7482R9921
17574A491121j2602o2224J13235j16664p5301Q3679N2357L9153q2573k53625k05864
17563I70692M34744k71242R5827O4353l40329L23513l1972P610l49287M97114
$$ plain form
17553 1401023 1040919 1016907 1217463 1349152 1490786 1292750 1473029 1198929 1276789 1501504
17543 1501504 1299418 1641390 1428514 1476761 1406844 1464596 1385130 1397037 1373206 1199109
17533 1199109 1463831 1278129 1218829 1338576 1330577 1435616 1295653 1291235 1255513 1330409 1331084
17522 1331084 1301870 1382256 1414148 1541326 1369545 1457890 1264617 1644341 1810869 1702966
17512 1702966 1762668 1936168 1928439 2022869 2251888 2316550 2459412 2425436 2457159 2171908 2345691
17501 2345691 2345775 2705712 2481816 2797535 2997135 3241923 3550237 3819277 4314541 4625332
17491 4625332 5087795 5919052 6730793 8421055 11483693 16051275 24066345 34166721
17483 34166721 45792377 56678580 65586680 71839154 76416832 79332048 80616346 79196715
$$ packed form
17553A401023l60104k4012K00556J31689J41634j98036J80279k74100P7860K24715
17543A501504k02086L41972k12876M8247o9917N7752p9466J1907k3831j74097
17533A199109K64722j85702n9300J19747p999J05039j39963m418l5722P4896O75
17522A331084k9214Q0386L1892J27178j71781Q8345j93273L79724J66528j07903
17512A702966N9702J73500p729R4430K29019O4662J42862l3976L1723k85251J73783
17501B345691Q4L59937k23896L15719J99600K44788L08314K69040M95264L10791
17491D625332M62463Q31257Q11741J690262L062638M567582Q015070J0100376
17483C4166721J1625656J0886203Q908100O252474M577678K915216J284298j419631
$$ plain form
17475 79196715 74349241 65474101 53749027 42443033 34951470 34469028 39529303 48277018
17467 48277018 58592759 67073265 73076753 77548811 80542321 80778492 79404782 74792455
17459 74792455 66349118 53832414 39399941 26392861 16946409 11114672 8175377 6367532
17451 6367532 5418914 4436413 3945631 3882944 3789875 3604893 3558481 3446794 3353077 3212785
17441 3212785 3325627 2999813 3296355 3143144 2894482 2940668 2880659 2643558 2666914 2896452
17431 2896452 2747644 2969986 2781630 2614190 3075288 2649618 2682888 2593054 2563082 2412675
17421 2412675 2410831 2070694 2130363 2008592 1925413 2002004 2006927 2182720 2160964 1950961 1923942
17410 1923942 1906783 2100492 1854257 2025604 1895051 1885351 1925897 2075495 2638471 2433910
$$ packed form
17475G9196715m847474q875140j1725074j1305994p491563m82442N060275Q747715
17467D8277018J0315741Q480506O003488M472058K993510K36171j373710m612327
17459G4792455q443337j2516704j4432473j3007080r446452n831737k939295j807845
17451F367532r48618r82501m90782o2687r3069j84982m6412j11687r3717j40292
17441C212785J12842l25814K96542j53211k48662M6186o0009k37101K3356K29538
17431B896452j48808K22342j88356j67440M61098m25670L3270q9834k9972j50407
17421B412675j844l40137N9669j21771q3179P6591M923J75793k1756k10003k7019
17410A923942j7159J93709k46235J71347j30553r700M0546J49598N62976k04561
$$ plain form
17400 2433910 2453538 2512279 2469445 2821879 2861001 3314265 3474550 3893172 4315799 4354124
17390 4354124 5116036 5299602 5862145 6309416 6269925 6457656 6335137 6452934 6163065 6060854
17380 6060854 5737472 5674548 5434005 5356432 5110135 5364843 5441571 5622267 6275390 6138660
17370 6138660 6600091 6831131 6997504 7296058 7332620 7409608 7293203 7321396 7028052 6917324
17360 6917324 6931945 6559969 6751600 6568023 6835743 6761164 7243125 7589674 7870643 8659694
17350 8659694 8930410 9473153 10238574 10845440 11117602 11874174 11788983 12184421 12490595 12258735
17340 12258735 12260605 11855014 11462664 11177127 11084649 10827208 10205595 10570659 10196981 10855721
17330 10855721 10930420 11028188 11497374 11524061 11731014 11928361 12074616 11947167 11689227 11406261
$$ packed form
17400B433910J9628N8741m2834L52434L9122M53264J60285M18622M22627L8325
17390D354124P61912J83566N62543M47271l9491J87731j22519J17797k89869j02211
17380F060854l23382o2924k40543p7573k46297K54708P6728J80696O53123j36730
17370F138660M61431K31040J66373K98554L6562P6988j16405K8193k93344j10728
17360F917324J4621l71976J91631j83577K67720p4579M81961L46549K80969P89051
17350H659694K70716N42743P65421O06866K72162P56572q5191L95438L06174k31860
17340A2258735J870m05591l92350k85537r2478k57441o21613L65064l73678O58740
17330A0855721P4699R7768M69186K6687K06953J97347J46255j27449k57940k82966
$$ plain form
17320 11406261 11454933 11247846 10608040 10487421 9994439 9874560 9583841 9342578 9321053 9359523
17310 9359523 9424892 9441979 9623304 9922293 10037045 10344956 10581883 11130785 11242697 11209415
17300 11209415 11389564 10927570 10686004 10146063 9932884 9656595 9590787 9307415 8936708
17291 8936708 8903045 9121288 9206862 9264592 9741861 9654640 9679161 9782314 9945589 9495640
17281 9495640 9343358 8772596 8176880 8033364 7260755 6484222 6003014 5640190 5120572
17272 5120572 4793994 4542746 4312063 3914222 3768566 3615922 3430922 3413542 3390346 3283114
17262 3283114 3168681 3174602 3220002 3168623 3273178 3234935 3080856 2769612 3031082 2694469
17252 2694469 2907223 2445492 2735038 2664140 2639003 2790871 2414171 2301435 2585631 2721214
$$ packed form
17320A1406261M8672k07087o39806j20619m92982j19879k90719k41263k1525L8470
17310I359523O5369J7087J81325K98989J14752L07911K36927N48902J11912l3282
17300A1209415J80149m61994k41566n39941k13179k76289o5808k83372l70707
17291H936708l3663K18243Q5574N7730M77269q7221K4521J03153J63275m49949
17281I495640j52282n70762n95716j43516p72609p76533m81208l62824n19618
17272E120572l26578k51248k30683l97841j45656j52644j85000j7380k3196j07232
17262C283114j14433N921M5400n1379J04555l8243j54079l11244K61470l36613
17252B694469K12754m61731K89546p0898k5137J51868l76700j12736K84196J35583
$$ plain form
17242 2721214 2401568 2677635 2413302 2479589 2596819 2489160 2626063 2597545 2590024 2469295
17232 2469295 2391208 2218716 2482802 2169385 2415023 2253083 2333484 2220044 2193036 2411900
17222 2411900 2213211 2290365 2316383 2404614 2367290 2311304 2135724 2327602 2334297 2221709 2559156
17211 2559156 2302819 2420766 2563743 2347384 2521250 2414186 2446023 2494887 2442528 2408922
17201 2408922 2502706 2125492 2505689 2364465 1935499 1908789 1831768 1805020 1660440 1466512
17191 1466512 1882571 1783485 1494991 1781434 1716767 1628137 1432389 1598868 1461074 1640964
17181 1640964 1592893 1721502 1402202 1355465 1390331 1538276 1470458 1364173 1550830 1450125
17171 1450125 1517200 1506459 1562173 1619120 1626652 1613868 1756124 1755002 1685399 1309033 1633560
$$ packed form
17242B721214l19646K76067k64333O6287J17230j07659J36903k8518p521j20729
17232B469295p8087j72492K64086l13417K45638j61940Q0401j13440k7008K18864
17222B411900j98689P7154K6018Q8231l7324n5986j75580J91878O695j12588L37447
17211B559156k56337J17947J42977k16359J73866j07064L1837M8864n2359l3606
17201B408922R3784l77214L80197j41224m28966k6710p7021k6748j44580j93928
17191A466512M16059r9086k88494K86443o4667q8630j95748J66479j37794J79890
17181A640964m8071J28609l19300m6737L4866J47945o7818j06285J86657j00705
17171A450125O7075j0741N5714N6947P532j2784J42256j122o9603l76366L24527
$$ plain form
17160 1633560 1525272 1477562 1520260 1556153 1649297 1770147 1811617 1837530 1710869 1836684
17150 1836684 1778346 1881792 1709305 1936161 1695107 1827024 1754521 1797042 1896403 1931650
17140 1931650 1983327 1984559 2203378 1900310 2059546 2078544 1973520 1833189 1931950 2020949
17130 2020949 2153015 2117683 1962608 2084398 2029054 1865291 1994751 1958767 2099665 2239675
17120 2239675 2358102 2424729 2421101 2350016 2350702 2272791 2498714 2550661 2800807 2769371 2976612
17109 2976612 3052141 3355772 3267469 3161066 3233992 3297977 2985466 2860413 3017087 2629477
17099 2629477 2485556 2361140 2145742 1996187 1807861 1814234 1501614 1234388 1454098 1155766
17089 1155766 1459308 1205126 1133302 1025366 1193090 1391080 1314778 1329701 1154856 1007062
$$ packed form
17160A633560j08288m7710M2698L5893R3144J20850M1470K5913j26661J25815
17150A836684n8338J03446j72487K26856k41054J31917p2503M2521R9361L5247
17140A931650N1677J232K18819l03068J59236J8998j05024j40331R8761Q8999
17130B020949J32066l5332j55075J21790n5344j63763J29460l5984J40898J40010
17120B239675J18427O6627l628p1085O86p7911K25923N1947K50146l1436K07241
17109B976612P5529L03631q8303j06403P2926O3985l12511j25053J56674l87610
17099B629477j43921j24416k15398j49555j88326O373l12620k67226K19710k98332
17089A155766L03542k54182p1824j07936J67724J97990p6302J4923j74845j47794
$$ plain form
17079 1007062 1132432 1130575 1304467 1026396 1223164 1186025 1090401 1214402 1227895 1364773
17069 1364773 1117144 954034 1239329 1095308 1127365 1219243 1297499 1314939 1285390 1412238
17059 1412238 1678991 1746566 1878222 2196175 2246369 2484928 2620575 2870651 3098594 3560199
17049 3560199 3421472 3518301 3558056 3598888 3678043 3491061 3623859 3752772 3564653 3655776
17039 3655776 3791164 3614733 3408599 3536082 3331982 3262132 3096166 2776589 2643846 2251937
17029 2251937 2019663 1728854 1915734 1697735 1661527 1544212 1575265 1616366 1535385 1468477
17019 1468477 1485013 1326418 1083200 1079441 1235482 1516786 1047651 1265446 836539 901928
17009 901928 1076456 1108535 1066200 1263767 1015955 897258 1013336 1010494 900796 1118003
$$ packed form
17079A007062J25370j857J73892k78071J96768l7139r5624J24001J3493J36878
17069A364773k47629j63110K85295j44021L2057R1878P8256J7440k9549J26848
17059A412238K66753O7575J31656L17953N0194K38559J35647K50076K27943M61605
17049C560199j38727R6829L9755M0832P9155j86982J32798J28913j88119R1123
17039C655776J35388j76431k06134J27483k04100o9850j65966l19577j32743l91909
17029B251937k32274k90809J86880k17999l6208j17315L1053M1101q0981o6908
17019A468477J6536j58595k43218l759J56041K81304m69135K17795m28907O5389
17009I01928J74528L2079m2335J97567k47812j18697J16078k842j09698K17207
$$ plain form
16999 1118003 944097 859552 1051742 1102940 1153864 1159499 1106995 1149688 1000086 1196080 946283
16988 946283 1200849 964221 1222910 1119845 1260157 1167532 923550 1085462 1092077 1120444
16978 1120444 1292535 1446966 1085473 1292191 1419817 1455064 1344371 1684509 1701573 1426392
16968 1426392 1757731 1892693 1975450 1992671 1866792 1971783 1928831 2180636 2321277 2285207
16958 2285207 2512016 2532071 2524443 2469131 2620425 2315913 2491140 2321755 2440582 2328183
16948 2328183 2173991 2101233 1857375 2026051 1984826 1651470 1890978 1755650 1620816 1354635
16938 1354635 1292571 1337638 1487451 1265500 1332981 1221693 898887 1309365 1219317 1219650 1208592
16927 1208592 1144930 944744 1180322 739794 996111 856167 748683 885004 940450 913287
$$ packed form
16999A118003j73906q4545J92190N1198N0924N635n2504M2693j49602J95994k49797
16988I46283K54566k36628K58689j03065J40312r2625k43982J61912O615K8367
16978A120444J72091J54431l61493K06718J27626L5247j10693L40138J7064k75181
16968A426392L31339J34962Q2757J7221j25879J04991m2952K51805J40641l6070
16958B285207K26809K0055p628n5312J51294l04512J75227j69385J18827j12399
16948B328183j54192p2758k43858J68676m1225l33356K39508j35328j34834k66181
16938A354635o2064M5067J49813k21951O7481j11288l22806M10478r0048L33j1058
16927A208592o3662k00186K35578m40528K56317j39944j07484J36321N5446k7163
$$ plain form
16917 913287 855710 1067858 1066964 991398 847220 843899 887651 930901 714185 1028957 855438
16906 855438 853010 856077 804873 990513 824272 860106 850498 889830 825608 736271 789914 596308
16894 596308 705998 797145 993780 927979 466745 568414 732449 702981 804642 860893
16884 860893 718634 803975 751297 634776 700919 961373 752441 782483 583055 619890
16874 619890 749982 784461 813271 678273 668598 732650 896931 717656 780649 798486 636757
16863 636757 860583 711896 624175 919406 694295 869952 592243 872866 830399 797590
16853 797590 718667 647836 681628 811083 562370 693593 870840 893959 769684 899679
16843 899679 633052 692257 672768 852071 760782 786773 893435 1030320 784435 889736
$$ packed form
16917I13287n7577K12148q94p5566j44178l321M3752M3250k16716L14772j73519
16906H55438k428L067n1204J85640j66241L5834r608L9332o4222q9337N3643j93606
16894E96308J09690R1147J96635o5801m61234J01669J64035k9468J01661N6251
16884H60893j42259Q5341n2678j16521O6143K60454k08932L0042j99428L6835
16874F19890J30092L4479K8810j34998r675O4052J64281j79275O2993J7837j61729
16863F36757K23826j48687q7721K95231k25111J75657k77709K80623m2467l2809
16853G97590p8923p0831L3792J29455k48713J31223J77247K3119j24275J29995
16843H99679k66627N9205j9489J79303r1289K5991J06662J36885k45885J05301
$$ plain form
16833 889736 1005890 875536 1195295 1058657 1239864 1125717 915380 1198647 1426697 1065802
16823 1065802 1181870 1309745 1428295 1492627 1588356 1646520 1746456 1543671 1761774 1904813
16813 1904813 1944576 1666950 1721620 1928712 1835368 1861409 1812982 1783889 1779368 1603652 1616367
16802 1616367 1353986 1599716 1541982 1784666 1835429 1742865 1509646 1624183 1320185 1202925
16792 1202925 1286293 1289744 1131218 939623 1170993 939503 1192471 993681 799086 829240
16782 829240 698419 741915 808400 681460 761811 638428 838732 624185 789780 679310
16772 679310 735347 688234 533692 804427 574705 526632 496689 845466 867170 708671
16762 708671 813771 727802 876062 752875 876035 404004 837009 679738 952826 708311
$$ packed form
16833H89736J16154j30354L19759j36638J81207j14147k10337K83267K28050l60895
16823A065802J16068J27875J18550O4332R5729N8164R9936k02785K18103J43039
16813A904813L9763k77626N4670K07092r3344K6041m8427k9093m521j75716J2715
16802A616367k62381K45730n7734K42684N0763r2564k33219J14537l03998j17260
16792A202925Q3368L451j58526j91595K31370k31490K52968j98790j94595L0154
16782H29240j30821M3496O6485j26940Q0351j23383K00304k14547J65595j10470
16772F79310N6037m7113j54542K70735k29722m8073k9943L48777K1704j58499
16762G08671J05100q5969J48260j23187J23160D04004M33005j57271K73088k44515
$$ plain form
16752 708311 842071 880154 832393 754765 717930 815948 746040 557160 610882 697288 829368
16741 829368 711886 726129 703250 841105 892896 597807 650483 711806 552906 733380
16731 733380 734865 776566 875090 722777 888337 835053 746882 980569 871574 910573 827204
16720 827204 999898 948391 763048 872105 820794 1012174 876091 914852 1097016 1067019
16710 1067019 877188 1050447 1387818 1049714 1105636 1377236 1336932 1427249 1508707 1500617
16700 1500617 1464071 1393462 1611491 1251684 1477389 1367255 1467801 1472452 1358820 1444652
16690 1444652 1418132 1621724 1580074 1602028 1617391 1596240 1374516 1280621 1594466 1317021
16680 1317021 1240519 1283290 1222535 1252301 1081733 1320451 1263081 1008883 1058958 1210600
$$ packed form
16752G08311J33760L8083m7761p7628l6835R8018o9908j88880N3722Q6406J32080
16741H29368j17482J4243k2879J37855N1791k95089N2676O1323j58900J80474
16731G33380J485M1701R8524j52313J65560n3284q8171K33687j08995L8999q3369
16720H27204J72694n1507j85343J09057n1311J91380j36083L8761J82164k9997
16710A067019j89831J73259L37371l38104N5922K71600m0304R0317Q1458q090
16700A500617l6546p0609K18029l59807K25705j10134J00546M651j13632Q5832
16690A444652k6520K03592m1650K1954J5363k1151k21724r3895L13845k77445
16680A317021p6502M2771o0755K9766j70568K38718n7370k54198N0075J51642
$$ plain form
16670 1210600 1261291 1376000 1529278 1399081 1896227 1630933 1766294 1877556 1846164 1659071
16660 1659071 1703033 1272279 1519087 1820515 1742849 1499197 1752323 1463446 1615380 1578424
16650 1578424 1418786 1455840 1206475 1282503 689264 1059048 999902 1142348 950659 554634
16640 554634 957241 865081 763139 808471 677031 828273 993495 747613 698531 824664
16630 824664 509941 936765 931971 961559 914177 867458 951905 662082 636992 996544 946443
16619 946443 807864 832690 831796 925408 959635 876003 787164 787344 582090 791685 1034904
16608 1034904 597014 970990 719611 844877 891582 932175 834366 824357 719634 950475
16598 950475 1130632 1004356 1084979 836405 947766 1078974 827047 977953 1126574 877623
$$ packed form
16670A210600N0691J14709J53278j30197M97146k65294J35361J11262l1392j87093
16660A659071M3962m30754K46808L01428p7666k43652K53126k88877J51934l6956
16650A578424j59638L7054k49365P6028n93239L69784n9146J42446j91689l96025
16640E54634M02607r2160j01942M5332j31440J51242J65222k45882m9082J26133
16630H24664l14723M26824m794K9588m7382m6719Q4447k89823k5090L59552n0101
16619I46443j38579K4826q94R3612L4227q3632q8839J80k05254K09595K43219
16608A034904m37890L73976k51379J25266M6705M0593r7809j0009j04723K30841
16598I50475J80157j26276Q0623k48574J11361J31208k51927J50906J48621k48951
$$ plain form
16588 877623 1077552 891671 979453 1280458 1056643 877766 885951 1170216 920808 1096630
16578 1096630 927599 935730 1009806 813455 687213 729638 823947 722979 699946 602906 974567
16567 974567 836100 643634 725037 690541 592204 757601 490018 731073 807309 600076
16557 600076 505301 574244 719388 560049 580281 650853 665412 848644 709687 851940
16547 851940 859869 785797 754208 599091 811336 956442 608641 675267 1000827 928210 758909
16536 758909 725909 940750 707536 617141 520901 633332 756520 814455 773899 927255
16526 927255 700170 585794 728465 845703 1025343 821536 890994 609016 839026 901153
16516 901153 928159 960988 1021539 1080792 1232509 1066531 1002852 1091395 1046716 1077970 922601
$$ packed form
16588H77623J99929j85881Q7782L01005k23815j78877Q185K84265k49408J75822
16578A096630j69031Q131P4076j96351j26242M2425R4309j00968k3033r7040L71661
16567I74567j38467j92466Q1403l4496r8337J65397k67583K41055P6236k07233
16557F00076r4775O8943J45144j59339K0232P0572J4559J83232j38957J42253
16547H51940P929p4072l1589j55117K12245J45106l47801O6626L25560p2617j69301
16536G58909l3000K14841k33214r0395r6240J12431J23188N7935m0556J53356
16526I27255k27085j14376J42671J17238J79640k03807O9458k81978K30010O2127
16516I01153K7006L2829O0551N9253J51717j65978o3679Q8543m4679L1254j55369
$$ plain form
16505 922601 1048566 1024487 691778 1177694 906920 931431 974961 833323 655067 709151
16495 709151 1006782 598820 916196 758772 517429 650329 799838 708438 782514 679046
16485 679046 944005 1012670 1167597 1176297 867631 1134142 953524 853154 928940 800508
16475 800508 1046110 1050959 901591 748057 1066408 844541 859461 1040902 902018 1002840
16465 1002840 1083778 901598 1116893 1370605 1318366 1193553 1265721 1185159 1006358 1143566
16455 1143566 1278175 1246541 1320313 972473 1340695 1224150 1154142 1142573 1143647 825137
16445 825137 774749 563683 762907 582811 616538 767136 899813 1118842 1219050 1435130
16435 1435130 1964766 2425476 2849664 3347094 3555593 4265967 4521937 4620492 5206292 5377425
$$ packed form
16505I22601J25965k4079l32709M85916k70774K4511M3530j41638j78256N4084
16495G09151K97631m07962L17376j57424k41343J32900J49509r1400P4076j03468
16485F79046K64959O8665J54927Q700l08666K66511j80618j00370P5786j28432
16475H00508K45602M849j49368j53534L18351k21867J4920J81441j38884J00822
16465A002840Q0938j82180K15295K53712n2239j24813P2168q0562j78801J37208
16455A143566J34609l1634P3772l47840L68222j16545p0008j1569J074l18510
16445H25137n0388k11066J99224j80096L3727J50598J32677K19029J00208K16080
16435A435130N29636M60710M24188M97430K08499P10374K55970R8555N85800J71133
$$ plain form
16425 5377425 5772933 6222199 6187113 6679721 7477313 7961431 9136420 10091388 11258268
16416 11258268 12763136 14091457 15677189 17537002 19255703 21492911 23858638 25880680
16408 25880680 28502978 31223264 34128419 36801151 39691089 42527566 45211679 47896855
16400 47896855 50377798 52473451 54631822 57507832 60699785 63438690 66459796 70245091
16392 70245091 76694823 86517897 97846447 107176768 109924723 105293989 97048907 86700296
16384 86700296 76349252 66316701 57003986 48685271 40544642 32915548 26181511 20088687
16376 20088687 15039070 11526216 9401478 8032572 6780325 5504531 4233217 3243929
16368 3243929 2452179 1584075 1039840 942933 889672 1050807 932403 1233201 1324023 1424202
$$ packed form
16425E377425L95508M49266l5086M92608P97592M84118J174989R54968J166880
16416A1258268J504868J328321J585732J859813J718701K237208K365727K022042
16408B5880680K622298K720286K905155K672732K889938K836477K684113K685176
16400D7896855K480943K095653K158371K876010L191953K738905L021106L785295
16392G0245091O449732R823074J1328550R330321K747955m630734q245082j0348611
16384H6700296j0351044j0032551r312715q318715q140629p629094o734037o092824
16376B0088687n049617l512854k124738j368906j252247j275794j271314r89288
16368C243929p91750q68104n44235r6907n3261J61135j18404L00798R0822J00179
$$ plain form
16358 1424202 1276716 1316159 996669 875849 605816 515540 449390 100058 -242835 -254037
16348 -254037 -280578 -628822 -496880 -513220 -695336 -690290 -672433 -596906 -378526 -279717 120944
16336 406717 362255 351626 780992 746398 863460 925808 788703 1074841 962591 998117
16326 998117 951340 763876 483822 320071 261012 -181311 -134554 -309706 -78404 148203
16315 -131334 169290 -17293 71389 206517 394027 -74576 188058 138924 -6555 -34028 174970
16303 -3010 -110845 362151 280537 404121 566331 590417 525929 828862 589107 726915
16293 726915 805321 712905 671059 408543 368780 507048 436641 307319 225879 229375 221751
16282 221751 402298 350867 334662 485092 405087 784888 806962 850037 627030 912875
$$ packed form
16358A424202j47486L9443l19490j20820k70033r0276o6150A00058b42835j1202
16348b54037k6541l48244J31942j6340j82116N046J7857P5527K18380R8809A20944
16336D06717m4462j0629M29366l4594J17062O2348j37105K86138j12250L5526
16326I98117m6777j87464k80054j63751n9059a81311M6757j75152g8404A48203
16315a31334A69290a7293G1389J35128J87510g4576A88058m9134f555k7473A74970
16303c010j07835C62151q1614J23584J62210K4086o4488L02933k39755J37808
16293G26915P8406r2416m1846k62516l9763J38268p0407j29322q1440L496p624
16282B21751J80547n1431j6205J50430q0005L79801K2074M3075k23007K85845
$$ plain form
16272 912875 695873 648070 878464 773984 787333 476867 441338 405959 402605 269549 352793
16261 352793 564230 488536 557545 353514 432770 721896 713629 759679 733936 900301 984802
16250 984802 710129 803592 801667 806260 794652 948302 665095 1021604 1288687 1218098 1206840
16239 1206840 988251 1089844 1201891 982453 1138795 1033183 868880 916693 724754 730721
16229 730721 526518 818038 684332 575089 859381 442409 520200 708683 619855 680413
16219 680413 547093 717905 700082 504532 700571 629409 907010 903348 871293 615260
16209 615260 413055 776042 609220 677662 691700 598033 841426 1025284 968759 814886
16199 814886 919326 844440 904249 1098013 884592 799115 885472 830939 973374 964291 1184841
$$ packed form
16272I12875k17002m7803K30394j04480J3349l10466l5529l5379l354j33056Q3244
16261C52793K11437p5694O9009k04031P9256K89126q267M6050k5743J66365Q4501
16250I84802k74673R3463j925M593j1608J53650k83207L56509K67083p0589j1258
16239A206840k18589J01593J12047k19438J56342j05612j64303M7813j91939N967
16229G30721k04203K91520j33706j09243K84292m16972P7791J88483q8828O0558
16219F80413j33320J70812j7823j95550J96039p1162K77601l662l2055k56033
16209F15260k02205L62987j66822O8442J4038r3667K43393J83858n6525j53873
16199H14886J04440p4886N9809J93764k13421q5477Q6357n4533J42435r083K20550
$$ plain form
16188 1184841 785251 980690 1083976 830662 719939 841184 1015066 703871 757006 775801
16178 775801 740102 643729 896364 745506 705867 779212 687583 682473 700414 921483 826416
16167 826416 828729 831675 702370 884456 512739 701378 556227 539999 581421 659335 692963
16156 692963 588462 469699 573609 578159 683000 516575 511362 645992 556822 663494
16146 663494 716404 635044 775702 579511 758659 586724 699635 530863 535672 599699
16136 599699 891278 788373 819672 651394 693312 945228 743052 678512 688376 581907
16126 581907 817896 910963 863312 999119 674475 858559 681667 865059 747064 621174
16116 621174 894894 484789 674928 907005 672163 1001857 835804 929327 644218 541576
$$ packed form
16188A184841l99590J95439J03286k53314j10723J21245J73882l11195N3135J8795
16178G75801l5699r6373K52635j50858l9639P3345r1629n110J7941K21069r5067
16167H26416K313K946j29305J82086l71717J88639j45151j6228M1422P7914L3628
16156F92963j04501j18763J03910M550J04841j66425n213J34630q9170J06672
16146F63494N2910q1360J40658j96191J79148j71935J12911j68772M809O4027
16136E99699K91579j02905L1299j68278M1918K51916k02176o4540R864j06469
16126E81907K35989R3067m7651J35807l24644J84084j76892J83392j17995j25890
16116F21174K73720m10105J90139K32077k34842L29694j66053R3523k85109j02642
$$ plain form
16106 541576 939854 885305 885538 769567 855161 1136450 1165997 886873 1035800 764263 989137
16095 989137 988001 798016 1093128 772882 927404 799938 1038247 1263440 927431 1139279
16085 1139279 1001742 1116028 1187033 995460 1147660 1241675 1272908 1097531 1089131 1045536
16075 1045536 1026348 1170965 1018929 1026065 1012719 1276518 1036717 1350991 1284343 1184589
16065 1184589 1054109 1278897 1413370 1598139 1259423 1138505 1268577 1347059 1221998 1168293
16055 1168293 1326999 1342335 1395406 1274500 1485629 1267332 1378365 1312151 1412917 1340054
16045 1340054 1489454 1280156 1443281 1639431 1440615 1642761 1820099 1313103 1745801
16036 1745801 1525667 1702936 1479545 1514334 1647676 1675289 1745841 1781522 1502725 1536871
$$ packed form
16106E41576L98278n4549K33j15971Q5594K81289K9547k79124J48927k71537K24874
16095I89137j136j89985K95112l20246J54522j27466K38309K25193l36009K11848
16085A139279j37537J14286P1005j91573J52200R4015L1233j75377q400m3595
16075A045536j9188J44617j52036P136j3346K63799k39801L14274o6648r9754
16065A184589j30480K24788J34473J84769l38716j20918J30072P8482j25061n3705
16055A168293J58706J5336N3071j20906K11129k18297J11033o6214J00766p2863
16045A340054J49400k09298J63125J96150j98816K02146J77338n06996M32698
16036A745801k20134J77269k23391L4789J33342K7613P0552L5681k78797L4146
$$ plain form
16026 1536871 1648041 1839594 1658429 1717493 1707465 1909180 1986198 1728090 1862772 1814065
16016 1814065 2141057 1959265 2035622 1990867 1987144 2159555 2117974 1696878 1946355 1861635
16006 1861635 2115024 1972203 2126492 2040119 1791208 2037076 2050703 1920702 2033257 2070572
15996 2070572 1818156 2006554 1854276 1969680 1939737 1941794 1998158 2064809 2029226 1745920
15986 1745920 1853027 1925450 2065526 2122411 2138283 2381930 2348586 2080141 2301219 2348805
15976 2348805 2274292 2339026 2247964 2183415 2031303 2219794 2044073 2134788 2070950 2010239 2185893
15965 2185893 2029246 2054932 1958534 2167112 2068105 2190165 2162411 2133789 2115329 2094513 2017503
15954 2017503 1913864 2072599 2087432 2219158 1936292 1919297 2273549 2205253 2160667 2166661
$$ packed form
16026A536871J11170J91553j81165N9064j0028K01715P7018k58108J34682m8707
16016A814065L26992j81792P6357m4755l723J72411m1581m21096K49477q4720
16006A861635K53389j42821J54289q6373k48911K45868J3627j30001J12555L7315
15996B070572k52416J88398j52278J15404k9943K057N6364O6651l5583k83306
15986A745920J07107P2423J40076N6885J5872K43647l3344k68445K21078M7586
15976B348805p4513O4734r1062o4549j52112J88491j75721R0715o3838o0711J75654
15965B185893j56647K5686r6398K08578r9007J22060k7754k8622j8460k0816p7010
15954B017503j03639J58735J4833J31726k82866j6995L54252o8296m4586N994
$$ plain form
15944 2166661 2200851 2259580 2041904 2102025 2288899 2184304 2595779 2535457 2379598 2444039
15934 2444039 2553800 2318336 2451602 2722726 2623835 2725122 2825163 2967218 3038911 3162858
15924 3162858 3279688 3400670 3370950 3910150 4191881 4213312 4832448 5223520 5782572 6641292
15914 6641292 7820586 9214483 11861680 15479629 20545154 27214839 35395204 43703506
15906 43703506 51959910 59323116 65028719 68988347 70838261 70945331 67989988 62752637
15898 62752637 54964144 45450384 35376995 26498715 19595052 14510344 11018725 8720294
15890 8720294 7461221 5983017 5153257 4672882 4344533 3782323 3414644 3414041 3034966 2929827
15880 2929827 2561758 2736309 2466175 2611029 2511082 2634374 2347416 2536566 2238288 2580435
$$ packed form
15944B166661L4190N8729k17676O0121J86874j04595M11475o0322j55859O4441
15934B444039J09761k35464J33266K71124r8891J01287J00041J42055P1693J23947
15924C162858J16830J20982k9720N39200K81731K1431O19136L91072N59052Q58720
15914F641292J179294J393897K647197L617949N065525O669685Q180365Q308302
15906D3703506Q256404P363206N705603L959628J849914J07070k955343n237351
15898F2752637p788493r513760j0073389q878280o903663n084708l491619k298431
15890H720294j259073j478204q29760m80375l28349n62210l67679o03l79075j05139
15880B929827l68069J74551k70134J44854r9947J23292k86958J89150k98278L42147
$$ plain form
15870 2580435 2762909 2400187 2469941 2322937 2352339 2409884 2249259 2309786 2141789 2215006
15860 2215006 2195810 2269115 2193004 2267032 1981972 2289815 1899085 2096021 1995299 2089102
15850 2089102 2124598 2095125 2369289 2099254 2156323 2135261 2246391 2149727 2010949 1981859
15840 1981859 1844359 2118271 2262870 2237592 2341999 2303244 2358804 2428671 2425012 2430062 2398307
15829 2398307 2204913 2327330 2130105 2269641 2234919 1933440 2097316 2080159 1786733 1904271
15819 1904271 1837653 1754697 2169542 2025192 2002149 2050173 2124014 2044760 1878665 2032091
15809 2032091 2050712 1997241 2322866 2295886 2240356 2323704 2346720 2341473 2141549 2412306 2514041
15798 2514041 2577824 2465577 2881046 2555066 2784804 2920863 3330701 3138349 3078782 3063076
$$ packed form
15870B580435J82474l62722O9754j47004K9402N7545j60625O0527j67997P3217
15860B215006j9196P3305p6111P4028k85060L07843l90730J96936j00722R3803
15850B089102L5496k9473K74164k70035N7069k1062J11130r6664j38778k9090
15840A981859j37500K73912J44599k5278J04407l8755N5560O9867l659N050l1755
15829B398307j93394J22417j97225J39536l4722l01479J63876j7157k93426J17538
15819A904271o6618q2956M14845j44350k3043M8024P3841p9254j66095J53426
15809B032091J8621n3471L25625k6980n5530Q3348K3016n247j99924K70757J01735
15798B514041O3783j12247M15469l25980K29738J36059M09838j92352n9567j5706
$$ plain form
15788 3063076 3282532 3188038 3210468 3359779 3400975 3776746 3755426 3731003 3913344 4273043
15778 4273043 4349166 4489529 4368155 4368597 4517426 4411354 4303752 4516708 4405398 4403183
15768 4403183 4334879 4491331 4550525 4806891 4747975 4836523 4718647 4856949 4955201 4911533
15758 4911533 4912592 5007710 4890663 4805976 4460251 4790230 5029083 4408803 4930852 4922237
15748 4922237 5281863 5123439 5259871 5509847 5432267 5669510 6084643 5973470 6562843 6729078
15738 6729078 6671378 6776864 6747311 6818631 6799406 6937972 6903740 7062208 6923256 7336876
15728 7336876 7356374 7231877 7235437 7367076 7208211 7143536 6860114 6768555 6559489 5990822
15718 5990822 6089830 6169009 6261734 6532512 6214979 6578886 6369708 6265238 6211962 5971691
$$ packed form
15788C063076K19456r4494K2430J49311M1196L75771k1320k4423J82341L59699
15778D273043P6123J40363j21374M42J48829j06072j07602K12956j11310k215
15768D403183o8304J56452N9194K56366n8916Q8548j17876J38302R8252m3668
15758D911533J059R5118j17047q4687l45725L29979K38853o20280N22049q615
15748D922237L59626j58424J36432K49976p7580K37243M15133j11173N89373J66235
15738F729078n7700J05486k9553P1320j9225J38566l4232J58468j38952M13620
15728G336876J9498j24497L560J31639j58865o4675k83422r1559k09066n68667
15718E990822R9008P9179R2725K70778l17533L63907k09178j04470n3276k40271
$$ plain form
15708 5971691 5896020 6068399 6014523 5982782 6113228 6340497 6655905 6704962 6780967 7141204
15698 7141204 7266712 7405650 7543892 7412312 7731118 7594041 7636325 7582836 7796864 7586768
15688 7586768 7524804 7452545 7297621 7070523 6960869 7194331 7046383 7088816 7006683 6916620
15678 6916620 6840582 6963525 6894043 6425615 6570326 6505566 6261605 6110755 6027834 6347237
15668 6347237 6305127 6232021 6201787 6728025 6371410 6971299 6711800 6962270 7284396 7649053
15658 7649053 7673575 8161821 8487632 8959809 9332516 10018001 10640851 11089459 11425600 12179660
15648 12179660 12964829 13305927 13645247 14484837 15004458 15625127 16164173 16890553 17844567
15639 17844567 18802139 19541003 20323214 21193058 21764392 22015057 22280927 22404537 22240008
$$ packed form
15708E971691p5671J72379n3876l1741J30446K27269L15408M9057P6005L60237
15698G141204J25508J38938J38242j31580L18806j37077M2284n3489K14028k10096
15688G586768o1964p2259j54924k27098j09654K33462j47948M2433q2133r0063
15678F916620p6038J22943o9482m68428J44711o4760k43961j50850q2921L19403
15668F347237m2110p3106l0234N26238l56615N99889k59499K50470L22126L64657
15658G649053K4522M88246L25811M72177L72707O85485O22850M48608L36141P54060
15648A2179660P85169L41098L39320Q39590N19621O20669N39046P26380R54014
15639A7844567R57572P38864P82211Q69844N71334K50665K65870J23610j64529
$$ plain form
15630 22240008 22100001 21750660 21376366 21511190 21508373 21727024 21602677 21806552 21385560 21357481
15620 21357481 20559063 20054899 19209037 18523549 17519336 16353454 15708789 14806927 14097059
15611 14097059 13908537 13093688 12785376 12746982 12228332 12099690 11673505 11376288 10899504
15602 10899504 10499605 10267792 10229221 9889388 10113523 9966829 10234465 10544464 10689825
15593 10689825 11916333 13601861 17612182 26034352 38895718 52694564 62670279 69368252
15585 69368252 74047498 77091487 79504787 80580186 79171325 73750581 60644518 42791881
15577 42791881 27563637 18018967 13428946 10919516 9577287 8867051 8613521 8426629
15569 8426629 8423195 8686948 8436505 8806705 8909425 9050886 9471473 9631094 10118421 10341345
$$ packed form
15630B2240008j40007l49341l74294J34824k817K18651j24347K03875m20992k8079
15620B1357481p98418n04164q45862o85488j004213j165882o44665r01862p09868
15611A4097059j88522q14849l08312l8394n18650j28642m26185k97217m76784
15602A0899504l99899k31813l8571l39833K24135j46694K67636L09999J45361
15593A0689825J226508J685528M010321Q422170J2861366J3798846R975715O697973
15585F9368252M679246L043989K413300J075399j408861n420744j3106063j7852637
15577D2791881j5228244r544670m590021k509430j342229p10236k53530j86892
15569H426629l434K63753k50443L70200J02720J41461M20587J59621M87327K22924
$$ plain form
15559 10341345 11184970 12848537 15481811 22115507 34517319 52710820 69713457 80973388
15551 80973388 89514892 94921029 98781679 101129669 101793700 98618113 89441034 69407499
15543 69407499 46332266 27921756 17576401 12545557 9889124 8645427 7946783 6894700
15535 6894700 6478434 6354378 6005949 6171983 5984804 5602186 5655864 5614510 5297231 4813801
15525 4813801 4849033 4806165 4581280 4271835 4248659 4134797 4005882 3942466 4118249 4173576
15515 4173576 4058646 4100563 4205611 4417560 4400044 4682589 4698507 4868628 4879789 4842499
15505 4842499 4752563 4991978 4690576 4468863 4794006 4140049 4306876 4106592 4060988 4250857
15495 4250857 4291169 4222140 4475549 4481271 4421846 4819755 4656790 4698776 4782394 5055745 5197746
$$ packed form
15559A0341345Q43625J663567K633274O633696J2401812J8193501J7002637J1259931
15551H0973388Q541504N406137L860650K347990O64031l175587r177079k0033535
15543F9407499k3075233j8410510j0345355n030844k656433j243697o98644j052083
15535F894700m16266j24056l48429J66034j87179l82618N3678m1354l17279m83430
15525D813801L5232m2868k24885l09445k3176j13862j28915o3416J75783N5327
15515D173576j14930M1917J05048K11949j7516K82545J5918J70121J1161l7290
15505D842499q9936K39415l01402k21713L25143o53957J66827k00284m5604J89869
15495D250857M0312o9029K53409N722n9425L97909j62965M1986Q3618K73351J42001
$$ plain form
15484 5197746 5598574 5920101 5871659 5993463 6260537 6612203 6795108 6702892 6661293 6497462
15474 6497462 6928588 6808983 7280141 7838514 9019004 9489869 10100669 11050177 11446397
15465 11446397 11591944 12011221 12219778 11726644 11447496 10769949 10423654 10176063 9983038
15456 9983038 10260057 11327708 11689413 12009595 12488979 12969269 12825552 13096050 12670991
15447 12670991 12512499 11674469 11132525 10371222 9724170 9680524 9730577 9738941 9926362 9922539
15437 9922539 10083669 10022239 9755249 9771962 9594317 8982589 8662963 8247715 7633483 7489840
15427 7489840 7377284 7317133 6987480 6959297 6665568 6665548 6319739 6114539 5768579 5576632
15417 5576632 5429742 5468446 5328494 5016562 4995528 4889850 5082228 4907116 4787289 5008175
$$ packed form
15484E197746M00828L21527m8442J21804K67074L51666J82905r2216m1599j63831
15474F497462M31126j19605M71158N58373J180490M70865O10800R49508L96220
15465A1446397J45547M19277K08557m93134k79148o77547l46295k47591j93025
15456I983038K77019J067651L61705L20182M79384M80290j43717K70498m25059
15447A2670991j58492q38030n41944p61303o47052m3646N0053Q364J87421l823
15437I922539J61130o1430k66990J6713j77645o11728l19626m15248o14232j43643
15427G489840j12556o0151l29653k8183k93729k0l45809k05200l45960j91947
15417E576632j46890L8704j39952l11932k1034j05678J92378j75112j19827K20886
$$ plain form
15407 5008175 4906048 4753899 4882273 5053164 5095478 5254889 5194830 5289453 5056954 5262058
15397 5262058 5454203 5412510 5235159 5383879 5467403 5089468 5112295 5212615 5083819 4886376
15387 4886376 5131854 4849633 4876665 5185955 5118870 5128790 5065948 5297107 5369954 5205616
15377 5205616 5390791 5273813 5408251 5355847 5451258 5448787 5582268 5310026 5465037 5583210
15367 5583210 5441650 5501803 5814397 5691859 5886011 5960977 5909257 6093690 6070727 6644093
15357 6644093 6366424 6506609 6973741 7004139 7502772 7685154 8051060 8964323 10646561
15348 10646561 13704146 18861396 26540757 33660847 39254529 43445304 46274091 48172118
15340 48172118 49527676 49983910 49393130 45810296 38661040 30016188 22567107 17918999
$$ packed form
15407E008175j02127j52149J28374J70891M2314J59411o0059R4623k32499K05104
15397E262058J92145m1693j77351J48720Q3524l77935K2827J00320j28796j97443
15387D886376K45478k82221K7032L09290o7085R920o2842K31159P2847j64338
15377E205616J85175j16978J34438n2404R5411k471J33481k72242J55011J18173
15367E583210j41560O0153L12594j22538J94152P4966n1720J84433k2963N73366
15357F644093k77669J40185M67132L0398M98633J82382L65906R13263J682238
15348A0646561L057585N157250P679361P120090N593682M190775K828787J898027
15340D8172118J355558M56234n90780l582834p149256q644852p449081m648108
$$ plain form
15332 17918999 15419483 14425337 14048950 13408096 13356256 12964132 12523109 12399276 12364773
15323 12364773 12082179 12293662 12346051 12724714 13180142 13858841 15102356 17373869 21594590
15314 21594590 29006286 40110102 53481294 65699627 75297348 82155006 86738634 90021579
15306 90021579 91617825 90237752 85425276 74763686 60138685 43573408 30759399
15299 30759399 22090926 17536090 14752571 13665197 13290690 12704115 12867071 12708923 12692102
15290 12692102 12857999 12770014 12648853 12872963 12737507 12846036 12760848 12731210 13527988 15222112
15280 15222112 18398502 24065378 31085801 37624215 42708091 45655680 48414603 49987726
15272 49987726 50756520 50840673 49149307 44749077 36851751 28237160 21144599 16869959
$$ packed form
15332A7918999k499516r94146l76387o40854n1840l92124m41023j23833l4503
15323A2364773k82594K11483N2389L78663M55428O78699J243515K271513M220721
15314B1594590P411696J1103816J3371192J2218333R597721O857658M583628L282945
15306I0021579J596246j380073m812476j0661590j4625001j6565277j2814009
15299C0759399q668473m554836k783519j087374l74507n86575J62956j58148j6821
15290A2692102J65897q7985j21161K24110j35456J08529q5188k9638P96778J694124
15280A5222112L176390N666876P020423O538414N083876K947589K758923J573123
15272D9987726P68794Q4153j691366m400230p897326q614591p092561m274640
$$ plain form
15264 16869959 14405681 13099374 12089366 11313554 10724921 9921319 9630507 9489254 9349041
15255 9349041 9457435 9724857 9843451 10165957 10511626 10669507 11013294 10833458 10696005
15246 10696005 10549663 10031073 9911193 9686943 9347322 9083721 8924323 8376940 8460405
15237 8460405 8639142 8701923 9400759 9816683 10260153 10709554 11153690 11468185 11412045 11603910
15227 11603910 11302875 11025422 10938386 10628140 9823293 9587059 9161200 8995555 9206464
15218 9206464 9483170 9729956 9663216 10238961 10554262 10822768 11101727 11401065 11451539 11235015
15208 11235015 11066570 10340822 9805532 9304272 8589070 8182591 7729918 7469507 6937537
15199 6937537 6682565 6605113 6452026 6239509 6273959 6370668 6297941 6541520 6454479 6626811
$$ packed form
15264A6869959k464278j306307j010008p75812n88633q03602k90812j41253j40213
15255I349041J08394K67422J18594L22506L45669J57881L43787j79836j37453
15246A0696005j46342n18590j19880k24250l39621k63601j59398n47383Q3465
15237H460405J78737O2781O98836M15924M43470M49401M44136L14495n6140J91865
15227A1603910l01035k77453q7036l10246q04847k36234m25859j65645K10909
15218I206464K76706K46786o6740N75745L15301K68506K78959K99338N0474k16524
15208A1235015j68445p25748n35290n01260p15202m06479m52673k60411n31970
15199F937537k54972p7452j53087k12517L4450R6709p2727K43579q7041J72332
$$ plain form
15189 6626811 6679277 6723725 7142702 6982735 7143153 7130334 7302777 7206614 7349480 7334255
15179 7334255 7319602 7581464 7651882 7930686 7955219 8018881 7993401 8068722 8205613 8091144
15169 8091144 8120149 8301068 8180182 7979000 7993444 8306832 8168254 8296231 8156488 8630883
15159 8630883 8608896 8680692 9001845 8882842 9175859 9105521 9340361 8860908 9055050 9066231
15149 9066231 8857831 8850483 8429073 8694048 8631234 8343141 8503168 8373016 8712066 8487762
15139 8487762 8246969 8370696 8440074 8142821 8119433 7997313 8356559 8031746 7940896 8138166
15129 8138166 8115999 8175301 8185599 7974211 7812973 7901694 7721985 8199303 7789644 7835802
15119 7835802 7900616 7865347 7842004 7676776 7914434 7753905 7928151 7791114 7888821 7902504
$$ packed form
15189F626811N2466M4448M18977j59967J60418j2819J72443r6163J42866j5225
15179G334255j4653K61862P0418K78804K4533O3662k5480P5321J36891j14469
15169H091144K9005J80919j20886k01182J4444L13388j38578J27977j39743M74395
15159H630883k1987P1796L21153j19003K93017p0338K34840m79453J94142J1181
15149I066231k08400p348m21410K64975o2814k88093J60027j30152L39050k24304
15139H487762k40793J23727O9378k97253k3388j22120L59246l24813r0850J97270
15129H138166k2167N9302J0298k11388j61238Q8721j79709M77318m09659M6158
15119G835802O4814l5269k3343j65228K37658j60529J74246j37037R7707J3683
$$ plain form
15109 7902504 8192799 8184176 8308118 8501734 8611292 8996580 9154200 9228665 9512168 9703390
15099 9703390 9950344 10115731 10498126 10773422 11555394 11765024 12362949 13341452 14808024
15090 14808024 17165260 20265045 22924489 25043046 27030363 28294983 29128939 29834730
15082 29834730 29869768 29606709 28003344 26272317 23990624 22827694 23349566 25232107 27692663
15073 27692663 29706958 31346034 32770686 33891205 34299740 34723978 34806244 34592398 34271946
15064 34271946 35167564 37833589 40263201 42654823 45064612 47309917 50237460 53285119
15056 53285119 56024526 57898041 57405667 54418958 51468624 50694950 52797527 55930507
15048 55930507 59710626 62078112 63340125 64118785 65673250 67482963 69653194 70963575
$$ packed form
15109G902504K90295q623J23942J93616J09558L85288J57620P4465K83503J91222
15099I703390K46954J65387L82395K75296P81972K09630N97925R78503J466572
15090A4808024K357236L099785K659444K118557J987317J264620Q33956P05791
15082B9834730L5038k63059j603365j731027k281693j162930N21872J882541K460556
15073B7692663K014295J639076J424652J120519M08535M24238Q2266k13846l20452
15064C4271946Q95618K666025K429612K391622K409789K245305K927543L047659
15056E3285119K739407J873515m92374k986709k950334p73674K102577L132980
15048E5930507L780119K367486J262013P78660J554465J809713K170231J310381
$$ plain form
15040 70963575 70856885 68654048 65662226 63952312 63668668 64252531 66342372 68232223
15032 68232223 70634552 75229250 81722320 89445325 96063846 101358217 105256432 107235303
15024 107235303 107682861 106425959 103522982 98835396 91048325 82328587 74785280 69786559
15016 69786559 67715683 66838135 66204609 65515101 65328073 65415209 65465085 65224165 63529724
15007 63529724 60905752 57201052 52678594 49440616 47372693 46220110 45645487 45738928
14999 45738928 46654833 47836606 49318088 50592599 51705107 52678390 53463757 53248392 52247092
14990 52247092 51097144 49838451 48758195 48325516 48407644 48213173 48266488 48346784 48785537
14981 48785537 49181200 49560782 48896612 47066807 43817217 39683353 36221813 33525561
$$ packed form
15040G0963575j06690k202837k991822j709914k83644N83863K089841J889851
15032F8232223K402329M594698O493070P723005O618521N294371L898215J978871
15024A07235303M47558j256902k902977m687586p787071q719738p543307m998721
15016F9786559k070876q77548o33526o89508j87028Q7136M9876k40920j694441
15007F3529724k623972l704700m522458l237978k067923j152583n74623R3441
14999D5738928R15905J181773J481482J274511J112508R73283P85367k15365j001300
14990E2247092j149948j258693j080256m32679Q2128j94471N3315Q0296M38753
14981D8785537L95663L79582o64170j829805l249590m133864l461540k696252
$$ plain form
14973 33525561 31235453 29074777 27130957 25983369 25385855 25373365 25955463 26539955 27333990
14964 27333990 27810388 28822352 29676510 30496912 32920240 35334289 39195100 45137266
14956 45137266 53443651 64771586 81137916 102103960 127099397 155494138 188035383
14949 188035383 223125384 259024751 295063423 330622807 361682451 382042120 389596844
14942 389596844 386666681 377021923 362435297 343332366 320275495 294026684 263234457
14935 263234457 230132987 200734798 180381193 167266141 159019679 150736677 139667959
14928 139667959 126573766 113859670 103588979 96356386 91808285 89119841 85714052
14921 85714052 81973622 77923891 74125169 70824520 67666628 63824209 58798771 51342847
$$ packed form
14973C3525561k290108k160676j943820j147588n97514j2490N82098N84492P94035
14964B7333990M76398J011964Q54158Q20402K423328K414049L860811N942166
14956D5137266Q306385J1327935J6366330K0966044K4995437K8394741L2541245
14949A88035383L5090001L5899367L6038672L5559384L1059644K0359669P554724
14942C89596844k930163r644758j4586626j9102931k3056871k6248811l0792227
14935B63234457l3101470k9398189k0353605j3115052q246462q283002j1068718
14928A39667959j3094193j2714096j0270691p232593m548101k688444l405789
14921H5714052l740430m049731l798722l300649l157892l842419n025438p455924
$$ plain form
14913 51342847 41503007 32140960 24716565 19958965 17291871 15490653 14497300 14211319
14905 14211319 14103952 14510305 15158247 15915034 17003315 18463657 19509160 21330303 24331448
14896 24331448 28736788 34096835 39360276 43400675 45993193 47169880 47892992 47888995 47514052
14887 47514052 46071005 42525867 36265856 29860374 23660361 19303722 17058462 15587101
14879 15587101 15585562 15376130 15694596 16290362 17171878 18344780 18968824 19232026 19623711
14870 19623711 19906401 20391213 20682269 20921498 20997693 20804742 20265715 20582167 21885448
14861 21885448 25032222 30100961 37580110 46643540 56331273 66382394 76316768 85014595
14853 85014595 91595252 95899213 97537323 96044956 90868952 82356588 72138922 60475729
$$ packed form
14913E1342847r839840r362047p424395m757600k667094j801218r93353k85981
14905A4211319j07367M06353O47942P56787J088281J460342J045503J821143L001145
14896B4331448M405340N360047N263441M040399K592518J176687P23112l997l74943
14887D7514052j443047l545138o260011o405482o200013m356639k245260j471361
14879A5587101j539k09432L18466N95766Q81516J172902O24044K63202L91685
14870A9623711K82690M84812K91056K39229P6195j92951n39027L16452J303281
14861B1885448L146774N068739P479149R063430R687733J0051121R934374Q697827
14853H5014595O580657M303961J638110j492367n176004q512364j0217666j1663193
$$ plain form
14845 60475729 48990168 37890868 29576087 23863813 20804328 18737672 17488865 16635848
14837 16635848 16184656 15291683 15322269 15204415 15173674 15432070 15402490 15590045 15984065 16358164
14827 16358164 16947845 17512975 18857390 19797615 21107417 23468223 27446588 33883822
14819 33883822 41768521 49626495 55894387 60194524 63096978 64864977 65472455 65014162
14811 65014162 62411323 56716026 47640403 37054034 27488081 20819149 17041335 15155871
14803 15155871 13886869 12978818 12331106 12145396 11740732 11480215 11281087 10827326 10453999
14794 10453999 10108742 9762831 9540661 9134594 9040732 8678060 8484380 8282113 8409027
14785 8409027 8354290 8459507 8828058 9157485 9770031 10274342 10998441 11782331 12412618 12946890
$$ packed form
14845F0475729j1485561j1099300q314781n712274l059485k066656j248807q53017
14837A6635848m51192q92973L0586j17854l0741K58396k9580J87555L94020L74099
14827A6358164N89681N65130J344415R40225J309802K360806L978365O437234
14819C3883822P884699P857974O267892M300137K902454J767999O07478m58293
14811F5014162k602839n695297r075623j0586369r565953o668932l777814j885464
14803A5155871j269002r08051o47712j85710m04664k60517j99128m53761l73327
14794A0453999l45257l45911k22170m06067r3862l62672j93680k02267J26914
14785H409027n4737J05217L68551L29427O12546N04311P24099P83890O30287N34272
$$ plain form
14775 12946890 13100203 13242082 13202252 12988633 12673155 11987236 11262183 10160210 9440904
14766 9440904 9103092 8858144 8708645 8860962 8837381 9076664 9371407 9392312 10043242 10157438
14756 10157438 10668358 10350279 10681731 10741122 10924485 11446624 11306196 11463350 11452319 11259516
14746 11259516 11092426 11663255 11860441 12208802 12402402 13275849 13730775 14882645 16265105
14737 16265105 17883479 20564757 23818963 28204598 34775254 45661446 61882248 85931118
14729 85931118 116895329 151489649 186596350 218424678 243913472 262226281 273245931
14722 273245931 277413589 272964978 257099217 228658922 191822686 151189041 111862147
14715 111862147 79568735 56797357 41531445 32646822 26379588 22194526 19258859
$$ packed form
14775A2946890J53313J41879l9830k13619l15478o85919p25053j101973p19306
14766I440904l37812k44948j49499J52317k3581K39283K94743K0905O50930J14196
14756A0157438N10920l18079L31452N9391J83363N22139j40428J57154j1031j92803
14746A1259516j67090N70829J97186L48361J93600Q73447M54926J151870J382460
14737A6265105J618374K681278L254206M385635O570656J0886192J6220802K4048870
14729H5931118L0964211L4594320L5106701L1828328K5488794J8312809J1019650
14722B73245931M167658m448611j5865761k8440295l6836236m0633645l9326894
14715A11862147l2293412k2771378j5265912q884623o267234m185062k935667
$$ plain form
14708 19258859 16879410 15284472 14150774 12982432 12253154 11439330 10729425 9883260 8970484
14699 8970484 8721057 8472406 8326090 7840350 7670450 7505531 7347528 7192984 7207881 7173892
14689 7173892 7319685 7630432 7656128 7927172 7954963 7842818 8096648 8234407 8471141 9071496
14679 9071496 9297387 9784198 10465294 11291796 11884116 12307317 12652137 12444185 12596612
14670 12596612 12177070 11563817 11361011 10482371 9028329 8366582 7678262 7098439 6569286
14661 6569286 6467712 6365389 6648063 6621522 6433706 6372024 6074765 5859366 5548908 5901830
14651 5901830 5654118 5949726 6213975 5914645 6097763 6174086 6064847 6270500 6170475 6179520
14641 6179520 6796875 6802607 7241577 8020629 8300039 8957466 9377455 9940764 9916038 10458439
$$ packed form
14708A9258859k379449j594938j133698j168342p29278q13824p09905q46165r12776
14699H970484k49427k48651j46316m85740j69900j64919j58003j54544J4897l3989
14689G173892J45793L10747K5696K71044K7791j12145K53830J37759K36734O00355
14679I071496K25891M86811O81096Q26502N92320M23201L44820k07952J52427
14670A2596612m19542o13253k02806q78640j454042o61747o88320n79823n29153
14661F569286j01574j02323K82674k6541j87816o1682k97259k15399l10458L52922
14651E901830k47712K95608K64249k99330J83118P6323j09239K05653j00025R045
14641F179520O17355N732M38970P79052K79410O57427M19989N63309k4726N42401
$$ plain form
14631 10458439 10314491 10189608 9527204 8974885 8282806 7363035 6647127 6163846 5253851
14622 5253851 4901881 4929405 4791494 4794857 4802334 4823002 4590896 4479206 4127312 4290322
14612 4290322 4057319 4364110 3940751 3513548 3897225 3623691 3459442 3276010 3277387 3312998
14602 3312998 3700516 3901893 4496010 4978504 5699071 6223318 6911237 7478319 7331968
14593 7331968 7639289 7503493 7340848 7069752 6184736 5468141 4778970 4265477 3696763
14584 3696763 3734912 3690987 3521245 4064623 4071715 4021588 3904543 4091635 4308633 4253480
14574 4253480 4461154 4513370 4602190 4694792 4890566 5002273 5102796 5509529 5790265 6466854
14564 6466854 6913488 7613362 8910635 12138314 17269911 24850674 33668292 39963075
$$ packed form
14631A0458439j43948j24883o62404n52319o92079r19771p15908m83281r09995
14622E253851l51970K7524j37911L363P477K0668k32106j11690l51894J63010
14612D290322k33003L06791m23359m27203L83677k73534j64249j83432J377L5611
14602C312998L87518K01377N94117M82494P20567N24247O87919N67082j46351
14593G331968L07321j35796j62645k71096q85016p16595o89171n13493n68714
14584C696763L8149m3925j69742N43378P092n0127j17045J87092K16998n5153
14574D253480K07674N2216Q8820R2602J95774J11707J00523M06733K80736O76589
14564F466854M46634O99874J297273L227679N131597P580763Q817618O294783
$$ plain form
14556 39963075 44488234 48028853 50121464 51851887 53008033 52064483 49357384 42258504
14548 42258504 32955514 25475728 21404019 22596057 28208351 36344916 43787470 49416489
14540 49416489 53216819 55848279 57515228 58382112 57767272 55114953 48880136 38949761
14532 38949761 28776841 21329007 17324124 15251096 14218746 14357424 14170199 14387882
14524 14387882 14639789 15223756 16017909 17451607 20837727 25599552 30693571 34782464
14516 34782464 37256594 39591462 41021358 42309931 43097642 43054229 40688694 35351615
14508 35351615 29172996 24971009 24025471 26246587 31280525 36807439 41253380 44155871
14500 44155871 45832751 47146202 47593181 47403273 45956395 43230867 38020907 30682065
$$ packed form
14556C9963075M525159L540619K092611J730423J156146r43550k707099p098880
14548D2258504r302990p479786m071709J192038N612294Q136565P442554N629019
14540D9416489L800330K631460J666949Q66884o14840k652319o234817r930375
14532C8949761j0172920p447834m004883k073028j032350J38678j87225K17683
14524A4387882K51907N83967P94153J433698L386120M761825N094019M088893
14516C4782464K474130K334868J429896J288573P87711m3413k365535n337079
14508C5351615o178619m201987r45538K221116N033938N526914M445941K902491
14500D4155871J676880J313451M46979j89908j446878k725528n209960p338842
$$ plain form
14492 30682065 24089469 18956650 16218928 14145271 12390646 11328888 10494340 9523749
14484 9523749 8399910 7065822 6313565 5649602 4980469 4778816 4766515 4669547 4365074
14475 4365074 4701356 4645919 4920445 4986083 5333593 5713938 6049718 6300516 6477262 6754816
14465 6754816 6915596 7107229 7352622 7332496 7239709 7241740 7311511 7536599 7823181 8009169
14455 8009169 8385257 8500580 8586404 8345576 8301549 7833754 7356020 7283338 6989504 7155848
14445 7155848 7249895 7761121 7870831 8433860 8698107 8906552 9107196 9323812 9025209 9325842
14435 9325842 9448737 9762798 10075205 10603739 11846553 14232188 18061026 23161375 29293415
14426 29293415 35194431 40012544 43936779 46596005 48676190 49870674 49617023 47613303
$$ packed form
14492C0682065o592596n132819k737722k073657j754625j061758q34548r70591
14484I523749j123839j334088p52257o63963o69133k01653j2301r6968l04473
14475D365074L36282n5437K74526O5638L47510L80345L35780K50798J76746K77554
14465F754816J60780J91633K45393k0126r2787K031O9771K25088K86582J85988
14455H009169L76088J15323Q5824k40828m4027m67795m77734p2682k93834J66344
14445G155848R4047N11226J09710N63029K64247K08445K00644K16616k98603L00633
14435I325842J22895L14061L12407N28534J242814K385635L828838N100349O132040
14426B9293415N901016M818113L924235K659226K080185J194484k53651k003720
$$ plain form
14418 47613303 43174014 36809071 29493767 23088208 18875084 15689601 13351662 12060806
14410 12060806 10866446 10091393 9721075 9478636 9103959 9263570 8996235 9161928 9124281
14401 9124281 9361757 9305701 9751579 9993934 10830597 11968827 13525857 16965570 21558105
14392 21558105 29305142 38724072 49153599 58590740 66517775 72607917 77039202 79667217
14384 79667217 80266138 78028990 72576341 63587672 52366352 40453264 30432361 23063796
14376 23063796 18011415 14702706 12469734 10985864 10192896 9911871 9327515 9186400 8896836
14367 8896836 8580065 8725927 8683607 8571794 8720814 9147961 9453918 9911099 10927329
14358 10927329 12566282 14638128 17582443 21428597 26375746 31734694 37485217 42300949
$$ packed form
14418D7613303m439289o364943p315304o405559m213124l185483k337939j290856
14410A2060806j194360p75053l70318k42439l74677J59611k67335J65693l7647
14401I124281K37476n6056M45878K42355Q36663J138230J557030L439713M592535
14392B1558105P747037R418930J0429527R437141P927035O090142M431285K628015
14384G9667217N98921k237148n452649q988669j1221320j1913088j0020903p368565
14376B3063796n052381l308709k232972j483870p92968k81025n84356j41115k89564
14367H896836l16771J45862m2320j11813J49020M27147L05957M57181J016230
14358A0927329J638953K071846K944315L846154M947149N358948N750523M815732
$$ plain form
14350 42300949 47380878 52463023 57967283 64029436 71469281 79049185 85342983 89083581
14342 89083581 90899617 91903538 91924264 91842080 90734864 87616827 82649301 73447373 62281189
14333 62281189 51885926 42846209 36395022 31594327 28163151 25051937 21839377 17126482
14325 17126482 13076839 9949734 8303653 7083261 6268175 5804745 5549565 4929912 4720737
14316 4720737 4475030 3872092 4102311 3933585 3590647 3627327 3668586 3341535 3332169 3192746
14306 3192746 3299470 3290463 3061144 2790866 2909422 2610645 2572229 2378136 2607029 2696718
14296 2696718 2537537 2676373 2630921 2602452 2626672 2695287 2631662 2352162 2457084 2298143
14286 2298143 2617144 2558072 2504689 2632094 2564208 2791876 2715789 2723582 2724843 2875466 3061020
$$ packed form
14350D2300949N079929N082145N504260O062153P439845P579904O293798L740598
14342H9083581J816036J003921K0726q2184j107216l118037m967526r201928j1166184
14333F2281189j0395263r039717o451187m800695l431176l111214l212560m712895
14325A7126482m049643l127105j646081j220392q15086m63430k55180o19653k09175
14316D720737k45707o02938K30219j68726l42938L6680M1259l27051r366j39423
14306C192746J06724r007k29319k70278J18556k98777l8416j94093K28893Q9689
14296B696718j59181J38836m5452k8469K4220O8615o3625k79500J04922j58941
14286B298143L19001n9072n3383J27405o7886K27668p6087P793J261J50623J85554
$$ plain form
14275 3061020 3303816 3152514 3270502 3440172 3315489 3242349 3396826 3124790 3081641 2964473
14265 2964473 2995346 2654450 2562308 2612120 2583079 2504416 2460335 2543101 2559406 2315171 2416509
14254 2416509 2122449 1972283 2094093 2188451 2228192 1973210 2104234 2154000 1848109 2272782
14244 2272782 2183954 2094650 2081883 1962302 2206822 2281270 2395473 2442503 2265619 2590273
14234 2590273 2769820 2760327 2889913 2487270 2626328 2487347 2237700 2120827 2025534 1951385
14224 1951385 1848265 1839359 1614125 1817299 2127730 2129827 2070083 2086885 2281365 2320928 2322005
14213 2322005 2605068 2525799 2740857 2763736 3029147 3684738 3945556 4153452 4044044 4294274
14203 4294274 4445952 4394438 4435471 4608536 4327970 3766917 2706641 2297656 2068537 2102090
$$ packed form
14275C061020K42796j51302J17988J69670j24683p3140J54477k72036m3149j17168
14265B964473L0873l40896r2142M9812k9041p8663m4081Q2766J6305k44235J01338
14254B416509k94060j50166J21810R4358L9741k54982J31024M9766l05891M24673
14244B272782q8828q9304j2767j19581K44520P4448J14203M7030j76884L24654
14234B590273J79547r493J29586m02643J39058j38981k49647j16873r5293p4149
14224A951385j03120q906k25234K03174L10431K097n9744J6802J94480L9563J077
14213B322005K83063p9269K15058K2879K65411O55591K60818K07896j09408K50230
14203D294274J51678n1514M1033J73065k80566n61053j060276m08985k29119L3553
$$ plain form
14193 2102090 2192690 2413098 2279544 2202430 2375338 2093266 2238335 2104548 1955820 2146730
14183 2146730 2064496 1805362 1988856 1934694 2392481 2603349 2659174 2823077 2951777 3022366
14173 3022366 3049830 2942862 2818354 2862576 2479202 2126378 2218621 1850956 1884345 1892517
14163 1892517 1854139 2077740 1830038 2081024 1825405 1935804 2282989 2128775 2258822 2062296
14153 2062296 2269265 2525188 2376760 2511105 2191827 2581652 2666052 2528761 2611370 3271252
14143 3271252 2894945 3486907 4235139 5274239 6425413 7218766 7993377 8730232 9185995
14134 9185995 9689568 9998888 9920949 9418231 8530075 7201225 5950690 5010883 4025073
14125 4025073 3680280 3142749 3074363 3118565 3317528 3355078 3795868 3741433 3700343 3829474
$$ packed form
14193B102090R0600K20408j33554p7114J72908k82072J45069j33787j48728J90910
14183B146730q2234k59134J83494n4162M57787K10868N5825J63903J28700P0589
14173C022366K7464j06968j24508M4222l83374l52824R2243l67665L3389Q172
14163A892517l8378K23601k47702K50986k55619J10399L47185j54214J30047j96526
14153B062296K06969K55923j48428J34345l19278L89825Q4400j37291Q2609O59882
14143C271252l76307N91962P48232J039100J151174P93353P74611P36855M55763
14134I185995N03573L09320p7939n02718q88156j328850j250535r39807r85810
14125D025073l44793n37531o8386M4202J98963L7550M40790n4435m1090J29131
$$ plain form
14115 3829474 3726266 3773621 3770893 3804454 3721158 3016225 2786040 2413657 2494948 2390429
14105 2390429 2431025 2481916 2732752 2641607 2921577 3047939 3649478 3957948 4165631 4653805
14095 4653805 4919935 5349396 5264940 5421161 5602412 5659983 5774754 5254265 5061697 4783602
14085 4783602 5364521 5903270 6364783 7035022 7335403 8043682 8862643 9391838 10268001
14076 10268001 10982339 12304934 13754365 15418729 18036525 22078638 28080506 36254123
14068 36254123 46369041 57027163 66577725 74397567 80296434 84420636 86775735 86872797
14060 86872797 84608009 78910485 69306294 57368727 45091625 34828110 27049408 21560233
14052 21560233 17482157 14466925 12194026 10301951 8920057 7852004 7694209 7120401
$$ packed form
14115C829474j03208M7355k728L3561q3296p04933k30185l72383Q1291j04519
14105B390429M0596N0891K50836r1145K79970J26362O01539L08470K07683M88174
14095D653805K66130M29461q4456J56221J81251N7571J14771n20489j92568k78095
14085D783602N80919N38749M61513O70239L00381P08279Q18961N29195Q76163
14076A0268001P14338J322595J449431J664364K617796M042113O001868Q173617
14068C6254123J0114918J0658122R550562P819842N898867M124202K355099R7062
14060H6872797k264788n697524r604191j1937567j2277102j0263515p778702n489175
14052B1560233m078076l015232k272899j892075j381894j068053j57795n73808
$$ plain form
14044 7120401 6866861 6904015 6452088 6291335 5938550 5879612 5564248 5278530 4977877 4465787
14034 4465787 4246674 3778215 3294262 3166283 3160073 2896345 2987524 2617928 2815216 2556828
14024 2556828 2404920 2479285 2477566 2427568 2390937 2196077 2446148 2229799 2310234 2408994 2076279
14013 2076279 2348095 2097423 2158336 2334027 2225049 2188847 2246436 2317974 2322000 2358712 1842778
14002 1842778 2054293 2071273 2141122 2398025 2188477 2553168 2459424 2453269 2608135 2682547
13992 2682547 2858053 3089736 3363908 3794266 4058824 4986422 5820550 7375483 8622671
13983 8622671 9451224 10235311 10728665 11134073 11155780 11050912 10325342 9909816 8393271
13974 8393271 6808467 5717374 4836961 4168101 3873564 3644443 3288297 3324139 3165101
$$ packed form
14044G120401k53540L7154m51927j60753l52785n8938l15364k85718l00653n12090
14034D465787k19113m68459m83953j27979o210k63728R1179l69596J97288k58388
14024B556828j51908P4365j719m9998l6631j94860K50071k16349Q0435R8760l32715
14013B076279K71816k50672O0913J75691j08978l6202N7589P1538M026L6712n15934
14002A842778K11515J6980O9849K56903k09548L64691r3744o155J54866P4412
13992B682547J75506K31683K74172M30358K64558R27598Q34128J554933J247188
13983H622671Q28553P84087M93354M05408K1707j04868p25570m15526j516545
13974H393271j584804j091093q80413o68860k94537k29121l56146L5842j59038
$$ plain form
13965 3165101 3409390 3413855 3348808 3071094 3306427 3189017 3275174 2725185 2724666 2660048 2589771
13954 2589771 2650040 2411970 2362141 2403149 2676456 2631736 2911746 3074143 3187767 3309317
13944 3309317 3703559 4026730 5466850 6642695 8440381 10885707 12938906 15034085
13936 15034085 16816976 18258454 19341190 19620577 19614132 18331779 16315205 13808763 11358859
13927 11358859 9048079 6521422 4889077 3587930 3090523 3033130 2526142 2191951 1994636
13918 1994636 1982475 1876166 1693347 1734780 1655944 1708142 1940170 1466909 1564423 1616916
13908 1616916 1768012 1314492 1378339 1457553 1391385 1455072 1459328 1414560 1495373 1475169 1481408
13897 1481408 1408544 1557119 1508468 1299906 1559671 1508872 1601121 1352387 1601008 1601280 1436294
$$ packed form
13965C165101K44289M465o5047k77714K35333j17410Q6157n49989n19o4618p0277
13954B589771O0269k38070m9829M1008K73307m4720K80010J62397J13624J21550
13944C309317L94242L23171J440120J175845J797686K445326K053199K095179
13936A5034085J782891J441478J082736K79387o445j282353k016574k506442k449904
13927A1358859k310780k526657j632345j301147m97407n7393n06988l34191j97315
13918A994636j2161j06309j82819M1433p8836N2198K32028m73261R7514N2493
13908A616916J51096m53520O3847P9214o6168O3687M256m4768Q0813k0204O239
13897A481408p2864J48575m8651k08562K59765n0799R2249k48734K48621K72j64986
$$ plain form
13886 1436294 1435521 1511435 1673745 1563827 1468609 1249510 1154655 1471021 1351682 1340490 1379527
13875 1379527 1422780 1391322 1265191 1246376 1549586 1423652 1516134 1485380 1605587 1726494
13865 1726494 1941231 1690907 1554824 1469743 1539382 1404683 1517350 1782849 1518121 1591274
13855 1591274 1310638 1697411 1360907 1575627 1773062 1586546 1701451 1641715 1586923 1756775
13845 1756775 1612689 1592169 1644242 1471571 1595075 1457305 1571398 1426234 1185586 1490590
13835 1490590 1336993 1563116 1331010 1524434 1490069 1436956 1462628 1377677 1293913 1552208
13825 1552208 1447996 1381032 1272981 1547094 1606393 1515700 1333149 1196903 1355318 1269150
13815 1269150 1257097 1425689 1126363 1120586 1220397 1200288 1167653 1245341 1343653 1487825 1335395
$$ packed form
13886A436294p73P5914J62310j09918r5218k19099r4855L16366j19339j1192L9037
13875A379527M3253l1458j26131j8815L03210j25934R2482l0754J20207J20907
13865A726494K14737k50324j36083q5081O9639j34699J12667K65499k64728P3153
13855A591274k80636L86773l36504K14720J97435j86516J14905n9736n4792J69852
13845A756775j44086k0520N2073j72671J23504j37770J14093j45164k40648L05004
13835A490590j53597K26123k32106J93424l4365n3113K5672q4951q3764K58295
13825A552208j04212o6964j08051K74113N9299r0693j82551j36246J58415q6168
13815A269150j2053J68592k99326n777R9811k0109l2635P7688R8312J44172j52430
$$ plain form
13804 1335395 1337694 1242580 1313325 1346920 1549215 1286905 1480214 1548822 1214045 1356358
13794 1356358 1408450 1350851 1217814 1283844 1546593 1263354 1168049 1097550 1336247 1232973
13784 1232973 1197848 1226294 1303625 1429507 1357778 1421361 1653432 1753344 1673143 1811399 1621469
13773 1621469 1738540 1666919 1448805 1720461 1719426 1453119 1281273 1400918 1276455 1178621
13763 1178621 1184129 1329003 1285320 1336971 1459547 1014511 1305095 1434076 1185368 1355729
13753 1355729 1503597 1352915 1493622 1442615 1497597 1364782 1419683 1417725 1477194 1397968 1735434
13742 1735434 1733214 1639101 1641321 1713389 1795645 1765286 1698595 1744847 1626541 1669790 1703983
13731 1703983 1769156 1871012 1731144 1695751 1807709 2039122 1926203 1843472 2034932 1891361
$$ packed form
13804A335395K299r5114P0745L3595K02295k62310J93309O8608l34777J42313
13794A356358N2092n7599j33037O6030K62749k83239r5305p0499K38697j03274
13784A232973l5125K8446P7331J25882p1729O3583K32071R9912q0201J38256j89930
13773A621469J17071p1621k18114K71656j035k66307j71846J19645j24463r7834
13763A178621N508J44874m3683N1651J22576m45036K90584J28981k48708J70361
13753A355729J47868j50682J40707n1007N4982j32815N4901j958N9469p9226L37466
13742A735434k220r4113K220P2068Q2256l0359o6691M6252j18306M3249L4193
13731A703983O5173J01856j39868l5393J11958K31413j12919q2731J91460j43571
$$ plain form
13721 1891361 1955284 1945364 2011685 1941062 1919863 2195794 1894989 2326766 2248467 2248623 2274684
13710 2274684 2127601 2340150 2168463 2330969 2118625 2466010 2119315 2244598 2046884
13701 2046884 2249851 2039005 2221661 1978272 1980564 2348924 2476893 2649941 2732333 2863857
13691 2863857 2876332 2740055 2763800 2795079 2826043 2677788 2491916 2346633 2113963 2049119
13681 2049119 2069295 2302020 1855470 1985138 1889101 2116712 1757479 1839070 2010786 2087798
13671 2087798 1983588 2005693 1909896 1962442 2430756 2301320 2603897 2673760 2630531 2954623
13661 2954623 2993336 3072442 2845903 2832697 2811432 2959419 2731693 2589606 2301367 2328777
13651 2328777 2303292 2196201 2199760 2356351 2144925 2073855 2115527 2077350 1987505 2053475 2123325
$$ packed form
13721A891361O3923r920O6321p0623k1199K75931l00805M31777p8299J56K6061
13710B274684j47083K12549j71687J62506k12344L47385l46695J25283j97714
13701B046884K02967k10846J82656k43389K292L68360J27969J73048Q2392J31524
13691B863857J2475j36277K3745L1279L0964j48255j85872j45283k32670o4844
13681B049119K0176K32725m46550J29668r6037K27611l59233Q1591J71716P7012
13671B087798j04210K2105r5797N2546M68314j29436L02577O9863m3229L24092
13661B954623L8713P9106k26539j3206k1265J47987k27726j42087k88239K7410
13651B328777k5485j07091L559J56591k11426p1070M1672l8177q9845O5970O9850
$$ plain form
13640 2123325 2133887 2410732 2152737 2257176 2424598 2552661 2887582 2554926 2891259 2796070
13630 2796070 2778371 3052235 2677594 2986141 2727301 2465824 2316607 2032953 1965604 1853172
13620 1853172 1690873 1928794 1848833 1881385 1558832 1802262 1927515 1709909 1877112 1861985
13610 1861985 2106462 2129419 2104793 2076075 2050045 2211353 2180658 2308541 2026836 2180437
13600 2180437 1810355 1999259 1879198 1969990 1987906 2024869 2128711 1959472 1945842 1974294
13590 1974294 2150293 2291038 2138257 2201678 1945929 1925581 1909916 1886906 1992293 1806186
13580 1806186 1864135 1949120 1790593 1918348 1841020 1819720 1688259 1743276 1876011 1881334 1610815
13569 1610815 1666767 1758739 1761447 1780789 1930668 1620368 1637885 1643992 1783792 1885001 1683370
$$ packed form
13640B123325J0562K76845k57995J04439J67422J28063L34921l32656L36333r5189
13630B796070j7699K73864l74641L08547k58840k61477j49217k83654o7349j12432
13620A853172j62299K37921p9961L2552l22553K43430J25253k17606J67203j5127
13610A861985K44477K2957k4626k8718k6030J61308l0695J27883k81705J53601
13600B180437l70082J88904j20061R0792J7916L6963J03842j69239j3630K8452
13590A974294J75999J40745j52781O3421k55749k0348j5665k3010J05387j86107
13580A806186N7949Q4985j58527J27755p7328k1300j31461N5017J32735N323k70519
13569A610815N5952R1972K708J9342J49879l10300J7517O107J39800J01209k01631
$$ plain form
13558 1683370 1454086 1435542 1348075 1654555 1645765 1441706 1396392 1620844 1553228 1413544
13548 1413544 1613704 1504700 1804288 1688148 1846334 2090520 1978626 2188475 2205647 2307384
13538 2307384 2230736 2050694 2401280 2290279 2146758 1698205 1405583 1668453 1451337 1682206
13528 1682206 1620144 1733997 1940207 1948991 2216776 2221489 1963573 2037096 2125203 2357140 2115981
13517 2115981 1927368 1907016 1635323 1620070 1281305 1482548 1457125 1239570 1311469 1200794
13507 1200794 1318212 1079167 1283608 1292051 1215875 1298039 1440034 1341174 1439553 1248145
13497 1248145 1164348 1405636 1409178 1293043 1389997 1182952 1419764 1497783 1243852 1283592
13487 1283592 1549558 1306917 1418183 1179598 1378127 1491505 1257992 1485081 1560585 1229214
$$ packed form
13558A683370k29284j8544q7467L06480q790k04059m5314K24452o7616j39684
13548A413544K00160j09004K99588j16140J58186K44186j11894K09849J7172J01737
13538B307384p6648j80042L50586j11001j43521m48553k92622K62870k17116K30869
13528A682206o2062J13853K06210Q784K67785M713k57916P3523Q8107K31937k41159
13517B115981j88613k0352k71693j5253l38765K01243k5423k17555P1899j10675
13507A200794J17418k39045K04441Q443p6176Q2164J41995r8860R8379j91408
13497A248145q3797K41288L542j16135R6954k07045K36812P8019k53931L9740
13487A283592K65966k42641J11266k38585J98529J13378k33513K27089P5504l31371
$$ plain form
13477 1229214 1260509 1391711 1142101 1258651 1253160 1318782 1186076 1485737 1406637 1234866
13467 1234866 1350301 1290519 1287350 1191586 1133804 1366628 1433809 1481041 1349124 1631738 1479650
13456 1479650 1615457 1728848 1535246 1815529 1950921 1984840 2277456 2310467 2385625 2472472
13446 2472472 2228651 2132978 2226735 1961327 1840042 1730510 1651479 1511098 1585007 1740871
13436 1740871 1665808 1673545 1453352 1512360 1644698 1475700 1452470 1478687 1383845 1540023 1611487
13425 1611487 1586962 1664765 2071659 2157750 2052002 2179521 2169134 2146186 2413342 2613693
13415 2613693 2512928 2242453 1980027 1801474 1865530 1761709 1762254 1860217 1658108 1635475
13405 1635475 1985550 1563025 1728941 1566273 1622698 1834064 1755086 1919992 1669422 1737045
$$ packed form
13477A229214L1295J31202k49610J16550n491O5622j32706K99661p9100j71771
13467A234866J15435n9782l169r5764n7782K32824O7181M7232j31917K82614j52088
13456A479650J35807J13391j93602K80283J35392L3919K92616L3011P5158Q6847
13446B472472k43821r5673R3757k65408j21285j09532p9031j40381P3909J55864
13436A740871p5063P737k20193N9008J32338j68998k3230K6217r4842J56178P1464
13425A611487k4525P7803M06894Q6091j05748J27519j0387k2948K67156K00351
13415B613693j00765k70475k62426j78553O4056j03821N45R7963k02109k2633
13405A635475L50075m22525J65916j62668N6425K11366p8978J64906k50570O7623
$$ plain form
13395 1737045 1629698 2026241 1936228 1807577 2118433 2230284 2280781 2234070 2115852 2126799
13385 2126799 2663237 2513836 2504517 2530502 2282996 2469830 2369862 2422802 2317075 2423075
13375 2423075 2017674 2124537 2254575 2115928 1934614 2078247 1904311 2084728 2167782 2184121
13365 2184121 2174211 1945706 1949872 2279128 1990064 2246831 2127177 2264654 2093734 2268679
13355 2268679 2481942 2363016 2388415 2490604 2328798 2685314 2290841 2184465 2394533 2450618
13345 2450618 2293637 2282108 2325168 2230108 2315216 2020802 2145356 2184700 2111238 2638617
13335 2638617 2101653 1983195 1899296 2379118 2271594 2051611 2446382 2390657 2362057 2487005
13325 2487005 2274191 2441955 2491699 2507749 2402868 2524556 2399696 2198602 2645285 2543429
$$ packed form
13395A737045j07347L96543r0013j28651L10856J11851N0497m6711j18218J0947
13385B126799N36438j49401r319K5985k47506J86834r9968N2940j05727J06000
13375B423075m05401J06863J30038j38647j81314J43633j73936J80417Q3054J6339
13365B184121r910k28505M166L29256k89064K56767j19654J37477j70920J74945
13355B268679K13263j18926K5399J02189j61806L56516l94473j06376K10068N6085
13345B450618j56981j1529M3060r5060Q5108k94414J24554L9344p3462N27379
13335B638617n36964j18458q3899M79822j07524k19983L94771n5725k8600J24948
13325B487005k12814J67764M9744J6050j04881J21688j24860k01094M46683j01856
$$ plain form
13315 2543429 2473932 2652033 2922326 2919047 2756402 3001126 2848272 3005294 3077383 2971441
13305 2971441 3064080 2785469 3094130 2942869 2794949 2883104 3099086 3092600 3571760 3326300
13295 3326300 3176395 3355202 3460589 3485020 3398339 3481313 3418757 3390638 3220254 3109460
13285 3109460 3258828 3378666 3332497 3349512 3572376 3584624 3480727 3490897 3387537 3342614
13275 3342614 3594768 3678775 3716273 3993239 3869788 3964972 3825235 4175647 3835856 4039756
13265 4039756 3971809 4260907 4230628 4536037 4167841 4368466 4332681 4299395 4646230 4512744
13255 4512744 4938674 4774335 4795263 4924700 4974416 5409025 5267139 5461756 5708186 5642873
13245 5642873 5916971 5925792 5903918 6010976 6163731 6356977 6402896 6203286 6529865 6786459
$$ packed form
13315B543429o9497J78101K70293l279j62645K44724j52854J57022P2089j05942
13305B971441R2639k78611L08661j51261j47920Q8155K15982o486M79160k45460
13295C326300j49905J78807J05387K4431q6681Q2974o2556k8119j70384j10794
13285C109460J49368J19838m6169J7015K22864J2248j03897J0170j03360m4923
13275C342614K52154Q4007L7498K76966j23451R5184j39737L50412l39791K03900
13265D039756o7947K89098l0279L05409l68196K00625l5785l3286L46835j33486
13255D512744M25930j64339K0928J29437M9716M34609j41886J94617K46430o5313
13245E642873K74098Q821k1874J07058J52755J93246M5919j99610L26579K56594
$$ plain form
13235 6786459 6687792 6684376 6636206 6798204 6992319 7186420 7106821 7254169 7375286 7694179
13225 7694179 7669769 7734694 7931582 7900685 8073937 8312533 8312713 8461830 8811888 8580881
13215 8580881 8575702 8823432 8573209 8768232 8389250 8458170 8369045 8363166 7977199 8023239 7728892
13204 7728892 7730094 7742556 7603891 7670798 7610540 7543086 7586566 7485728 7163529 7176911 7148616
13193 7148616 7174517 7196203 6910087 7029883 6725602 6656324 6752668 6381256 6236162 6293464
13183 6293464 6062279 6142670 5919105 5802788 5740773 5612643 5432698 5516889 5249836 5098125
13173 5098125 5362503 5190670 5440583 5174213 5242291 5359155 5377710 5382233 5238314 5248769
13163 5248769 5652873 5891133 5863483 5975480 6237314 6284481 6709806 6800619 6728060 7124226
$$ packed form
13235F786459r8667l416m8170J61998J94115J94101p9599J47348J21117L18893
13225G694179k4410O4925J96888l0897J73252K38596J80J49117L50058k31007
13215H580881n179K47730k50223J95023l78982O8920q9125n879l85967M6040k94347
13204G728892J202J2462j38665O6907o0258o7454M3480j00838l22199J3382k8295
13193G148616K5901K1686k86116J19796l04281o9278R6344l71412j45094N7302
13183F293464k31185Q0391k23565j16317o2015j28130j79945Q4191k67053j51711
13173E098125K64378j71833K49913k66370O8078J16864J8555M523j43919J0455
13163E248769M04104K38260k7650J11997K61834M7167M25325R0813p2559L96166
$$ plain form
13153 7124226 7125056 6808355 6920889 7141824 6914952 6878651 6729467 6645457 6592082 6642632 6621005
13142 6621005 6440129 6408741 6330199 5937407 5758399 5623102 5433144 5081727 4723024 4574660
13132 4574660 4237179 4252378 4096109 4516110 4091042 3932656 4150900 4086907 4150284 4149413
13122 4149413 3841950 3887725 3868812 4035411 3608565 3333833 3671769 3626909 3539063 3361015
13112 3361015 3436121 3393534 3384459 3591830 3385157 3516768 3297759 3579406 3607944 3729517
13102 3729517 3707399 4159700 3931556 4283521 4522792 5006649 5232795 5738075 5901392 5982198
13092 5982198 6397810 6416695 6779716 6750769 6624973 6811868 6701822 6679758 6512174 6650331
13082 6650331 6787782 6502279 6227036 6393855 6005179 5620809 5527664 5246260 4815731 4562238
$$ packed form
13153G124226Q30l16701J12534K20935k26872l6301j49184q4010n3375N0550k1627
13142F621005j80876l1388p8542l92792j79008j35297j89958l51417l58703j48364
13132D574660l37481J5199j56269M20001m25068j58386K18244o3993O3377q71
13122D149413l07463M5775j8913J66599m26846k74732L37936m4860q7846j78048
13112C361015P5106m2587r075K07371k06673J31611k19009K81647K8538J21573
13102C729517k2118M52301k28144L51965K39271M83857K26146N05280J63317Q0806
13092E982198M15612J8885L63021k8947j25796J86895j10046k2064j67584J38157
13082F650331J37451k85503k75243J66819l88676l84370r3145k81404m30529k53493
$$ plain form
13072 4562238 4236062 4106823 3976555 3802092 3843106 3547019 3566197 3587738 3284916 3554924
13062 3554924 3496969 3567905 3573640 3604023 3660864 3629934 3536279 3823937 3484037 3697332 3630212
13051 3630212 3727935 3665264 3640320 3553626 3792111 3516136 3518580 3555196 3616877 3581595 3779414
13040 3779414 3498372 3742753 3963754 4007378 4076380 4126678 3944113 4280923 4164861 4255854
13030 4255854 4346041 4603199 4474005 4319040 4826322 4618946 4689072 4546351 4908697 4833732
13020 4833732 4963661 4901774 5051082 5128871 5266931 5189418 5354069 5322070 5454073 5526965
13010 5526965 5550691 5769996 5756184 5573788 5833493 6005232 6160312 6261044 6300740 6343077
13000 6343077 6452274 6267789 6238127 6515070 6653120 6840830 6827150 6693502 7104436 7311772
$$ packed form
13072D562238l26176j29239j30268j74463M1014k96087J9178K1541l02822K70008
13062C554924n7955P0936N735L0383N6841l0930r3655K87658l39900K13295o7120
13051C630212R7723o2671k4944q6694K38485k75975K444L6616O1681l5282J97819
13040C779414k81042K44381K21001M3624O9002N0298j82565L36810j16062R0993
13030D255854R0187K57158j29194j54965N07282k07376P0126j42721L62346p4965
13020D833732J29929o1887J49308P7789J38060p7513J64651l1999J32003P2892
13010E526965K3726K19305j3812j82396K59705J71739J55080J00732L9696M2337
13000F343077J09197j84485k9662K76943J38050J87710j3680j33648M10934K07336
$$ plain form
12990 7311772 7147133 6893910 7101475 7111680 7253488 7198062 6914022 6890606 6795652 7020244
12980 7020244 7281074 6931592 7031661 6969004 6926915 6759290 6946948 6973125 6686380 6468605
12970 6468605 6130471 6345412 6505683 6303225 6113314 6094809 6242053 6069159 5900957 6149715
12960 6149715 5754762 6047324 5954667 5980774 5941370 6080030 5881682 5859565 6047679 6132075
12950 6132075 6200333 5987130 6234656 6100011 6150376 6074470 6118051 5977255 6209286 6201729
12940 6201729 6054125 5957167 6162663 5964114 6048779 6076881 6279069 6425338 6232177 6213877
12930 6213877 6494906 6464642 6298632 6180395 6480274 6163400 6041257 5955087 5645036 5459978
12920 5459978 5937173 5654148 5693962 5673787 5474555 5168328 5350408 5171135 5143080 5066491
$$ packed form
12990G311772j64639k53223K07565J0205J41808n5426k84040k3416r4954K24592
12980G020244K60830l49482J00069o2657m2089j67625J87658K6177k86745k17775
12970F468605l38134K14941J60271k02458j89911j8505J47244j72894j68202K48758
12960F149715l94953K92562r2657K6107l9404J38660j98348k2117J88114Q4396
12950F132075O8258k13203K47526j34645N0365p5906M3581j40796K32031p557
12940F201729j47604r6958K05496j98549Q4665K8102K02188J46269j93161j8300
12930F213877K81029l0264j66010j18237K99879l16874j22143q6170l10051j85058
12920E459978M77195k83025L9814k0175j99232l06227J82080j79273k8055p6589
$$ plain form
12910 5066491 4784194 4574336 4342010 4527641 4115299 4316249 4319548 4296782 4069743 4118864
12900 4118864 4027464 3756559 4021051 3712731 3674034 3827171 3803254 3696060 3563129 3509762
12890 3509762 3568677 3565285 3446486 3566974 3385234 3606413 3484364 3536748 3484559 3723153
12880 3723153 3546285 3535083 3363665 3437209 3236499 3254129 3291750 3132340 3114042 3106594 3142927
12869 3142927 3289687 3207824 3023755 3108852 3082143 2764328 2811308 3074533 2918367 3398794
12859 3398794 2799379 2703628 3023415 2867664 3091161 2891811 3000712 2847824 2994460 2647872
12849 2647872 2862943 3090652 2933931 2851654 2668880 2890827 2720414 2947847 2458949 2835516
12839 2835516 2750578 2801183 2746398 2865506 2892601 2665942 2721000 2730210 2880631 2677028 2781796
$$ packed form
12910E066491k82297k09858k32326J85631m12342K00950L299k2766k27039M9121
12900D118864r1400k70905K64492l08320l8697J53137k3917j07194j32931n3367
12890C509762N8915l392j18799J20488j81740K21179j22049N2384n2189K38594
12880C723153j76868j1202j71418P3544k00710J7630L7621j59410j8298p448L6333
12869C142927J46760q1863j84069Q5097k6709l17815M6980K63225j56166M80427
12859C398794n99415r5751L19787j55751K23497j99350J08901j52888J46636l46588
12849B647872K15071K27709j56721q2277j82774K21947j70413K27433m88898L76567
12839B835516q4938N0605n4785J19108K7095k26659N5058R210J50421k03603J04768
$$ plain form
12828 2781796 2813551 2665563 2812412 2720654 2772673 2801262 2749898 2712055 2872837 2882069 2605133
12817 2605133 2932339 2741535 2940402 2925397 2914336 2879099 2858173 2715746 2701077 2879135
12807 2879135 2753847 2930563 2726934 2711542 2869640 2906519 2980114 2752725 2724906 2846714
12797 2846714 3089484 2926173 2901140 2644403 2730249 3047066 3123748 2940267 3005055 3132724
12787 3132724 2968893 3116092 2692571 3065045 3132440 3137680 2745305 3079684 2906958 2938340
12777 2938340 2989208 2809300 2651426 2872881 2603471 2997352 2898219 2902608 2999076 2867449
12767 2867449 2817867 3001272 3081220 2960913 2928135 2952943 2800381 3184954 3066279 3049662
12757 3049662 2857857 3033109 3174390 2956617 2814945 3126926 2909663 2957761 3167403 3041772
$$ packed form
12828B781796L1755j47988J46849r1758N2019K8589n1364l7843J60782R232k76936
12817B605133L27206j90804J98867j5005j1061l5237k0926j42427j4669J78058
12807B879135j25288J76716k03629j5392J58098L6879P3595k27389k7819J21808
12797B846714K42770j63311k5033k56737Q5846L16817P6682j83481O4788J27669
12787C132724j63831J47199m23521L72474O7395N240l92375L34379j72726L1382
12777B938340N0868j79908j57874K21455k69410L93881r9133M389R6468j31627
12767B867449m9582J83405P9948j20307l2778K4808j52562L84573j18675j6617
12757C049662j91805J75252J41281k17773j41672L11981k17263M8098K09642j25631
$$ plain form
12747 3041772 2927859 3274472 2860197 3001897 3016382 3224410 3122344 3120661 3130956 3217998
12737 3217998 3157321 3243137 3050758 2834164 3038685 3113500 3104347 2977872 3101696 3159790
12727 3159790 2974627 3337452 2951742 3256306 2900922 3232568 3333885 3094667 3507400
12718 3507400 3270124 3424984 3293128 3406658 3395731 3482684 3464904 3560371 3396746 3422877
12708 3422877 3467751 3499382 3556306 3487834 3575933 3443473 3883098 3889557 3823843 3955621 3913846
12697 3913846 4250688 4147106 4318772 4615059 4891999 5006350 4973957 5546339 5890186 6419300
12687 6419300 6992619 7130486 7262201 7137499 6890715 7005873 6573928 6157759 5960648
12678 5960648 5442300 4913174 4856103 4357394 4556143 4221993 4390944 4449696 4366893 4587614
$$ packed form
12747C041772j13913L46613m14275J41700J4485K08028j02066j683J0295Q7042
12737C217998o0677Q5816j92379k16594K04521P4815r153j26475J23824N8094
12727C159790j85163L62825l85710L04564l55384L31646J01317k39218M12733
12718C507400k37276J54860j31856J13530j0927Q6953j7780R5467j63625K6131
12708C422877M4874L1631N6924o8472Q8099j32460M39625O459o5714J31778m1775
12697C913846L36842j03582J71666K96287K76940J14351l2393N72382L43847N29114
12687F419300N73319J37867J31715j24702k46784J15158m31945m16169j97111
12678E960648n18348n29126n7071m98709J98749l34150J68951N8752q2803K20721
$$ plain form
12668 4587614 4760456 4427443 4684854 4842190 4946817 4869452 4932428 4772997 4900284 5062850
12658 5062850 4968758 4860909 4949920 4870625 5158283 5301510 5560975 5524570 5640462 5846201
12648 5846201 6201583 6320623 6110989 6287968 6356168 6442219 6251475 6261672 6107116 6090982
12638 6090982 6193023 6290150 6318926 6579393 6651893 6645995 6613501 6644925 6860115 6896845 7010930
12627 7010930 6905429 6862717 6718638 6565680 6570110 6045596 6224608 6013845 6014291 5453014
12617 5453014 5383752 5059192 5207689 5057558 5142337 5425498 5671184 6233690 6445540 6828147
12607 6828147 7270184 7496073 8113565 8481578 8587568 8357018 7864338 7645624 7488827
12598 7488827 6798664 6313628 5966374 5570460 5351182 5379919 5131138 5061552 5357373 5246444
$$ packed form
12668D587614J72842l33013K57411J57336J04627p7365O2976j59431J27287J62566
12658E062850r4092j07849Q9011p9295K87658J43227K59465l6405J15892K05739
12648E846201L55382J19040k09634J76979O8200Q6051j90744J0197j54556j6134
12638F090982J02041R7127K8776K60467P2500n898l2494L1424K15190L6730J14085
12627G010930j05501m2712j44079j52958M430n24514J79012k10763M46n61277
12617E453014o9262l24560J48497j50131Q4779K83161K45686N62506K11850L82607
12607F828147M42037K25889O17492L68013J05990k30550m92680k18714j56797
12598G488827o90163m85036l47254l95914k19278K8737k48781o9586K95821j10929
$$ plain form
12588 5246444 5464734 5752027 5587151 5581179 5887704 5798652 5969431 5979296 6125189 5963895
12578 5963895 6443785 6519430 6637647 6709009 6901643 6785174 6794307 6673313 6208222 5973919
12568 5973919 5514159 5328229 4989402 4886211 4544974 4766348 4556694 4815712 4799989 4935985
12558 4935985 4756127 4914577 4680272 4890833 4892902 4682275 4642715 4763641 4789627 4686738
12548 4686738 4663759 4718080 4616200 4775759 5019883 4993112 5180637 5266477 5396708 5473309
12538 5473309 5803398 5628014 5537521 5619619 5565925 5297904 5240703 5264123 4829679 4687603
12528 4687603 4653240 4669202 4565105 4812548 4564319 4697760 4776111 4586986 4979977 4849030
12518 4849030 4591670 4796811 4923432 5216817 5370579 5759787 5865316 6261012 6602324
$$ packed form
12588E246444K18290K87293j64876n972L06525q9052J70779R865J45893j61294
12578E963895M79890P5645J18217P1362J92634j16469R133j20994m65091k34303
12568E973919m59760j85930l38827j03191l41237K21374k09654K59018j5723J35996
12558D935985j79858J58450k34305K10561K069k10627l9560J20926K5986j02889
12548D686738k2979N4321j01880J59559K44124k6771J87525Q5840J30231P6601
12538E473309L30089j75384r0493Q2098n3694k68021n7201K3420m34444j42076
12528D687603l4363J5962j04097K47443k48229J33441P8351j89125L92991j30947
12518D849030k57360K05141J26621K93385J53762L89208J05529L95696L41312
$$ plain form
12509 6602324 6567445 6737956 7100737 6934832 6800294 6670911 6467367 6163569 5886369 5331659
12499 5331659 5371302 5267308 5324490 5201559 5053298 5360728 5161939 5260425 5169779 5231873
12489 5231873 5410497 5250359 5158778 5293031 5211950 5448286 5516979 5580492 5770112 5974011
12479 5974011 5887370 6240932 5999706 5982227 5999023 5969777 5838435 5418942 5365969 5338738
12469 5338738 4914932 5147897 5122713 4930438 5225569 5207225 5036987 5254452 5271330 5257313
12459 5257313 5332068 5440738 5205381 5272169 5291021 5414913 5444287 5341069 5284965 5514380
12449 5514380 5775142 5845334 5514542 5657003 6141803 6151897 6300390 6297429 6480912 6444250
12439 6444250 6771751 6795211 7193771 7096780 7413966 7295264 7413798 7711626 7627417 7729597
$$ packed form
12509F602324l4879J70511L62781j65905j34538j29383k03544l03798k77200n54710
12499E331659L9643j03994N7182j22931j48261L07430j98789R8486r0646O2094
12489E231873J78624j60138r1581J34253q1081K36336O8693O3513J89620K03899
12479E974011q6641L53562k41226j7479J6796k9246j31342m19493n2973k7231
12469E338738m23806K32965k5184j92275K95131j8344j70238K17465J6878j4017
12459E257313P4755J08670k35357O6788J8852J23892K9374j03218n6104K29415
12449E514380K60762P0192l30792J42461M84800J0094J48493k961J83483l6662
12439F444250L27501K3460L98560r6991L17186j18702J18534K97828q4209J02180
$$ plain form
12429 7729597 7927109 8209698 8149026 8298859 8085247 8248503 8342245 8512093 8342670 8607534
12419 8607534 8397841 8504454 8710805 8670772 9056066 9350987 9613715 9803626 10027244 10371344
12409 10371344 10510396 10878089 10907436 11256983 11297320 11273402 11312876 11062005 11179107 11193759
12399 11193759 11235106 11397157 11215647 11266704 10980759 11226104 11313498 11370615 11603111 11544070
12389 11544070 11736532 12092257 12262506 12689082 12939237 13033471 13567015 13909534 14342780
12380 14342780 14328809 14485222 14689382 15008434 15137598 15314135 15328431 15534219 15507870 15588615
12370 15588615 15885103 15775483 15400923 16002471 15784933 15506218 15498020 15502743 15403267 15291738
12360 15291738 15284696 14970265 15087837 14766594 14678971 14751238 14602663 14519421 14220166 14114843
$$ packed form
12429G729597J97512K82589o0672J49833k13612J63256R3742J69848j69423K64864
12419H607534k09693J06613K06351m0033L85294K94921K62728J89911K23618L44100
12409A0371344J39052L67693K9347L49547M0337k3918L9474k50871J17102J4652
12399A1193759M1347J62051j81510N1057k85945K45345Q7394N7117K32496n9041
12389A1544070J92462L55725J70249M26576K50155R4234N33544L42519M33246
12380A4342780j3971J56413K04160L19052J29164J76537J4296K05788k6349Q0745
12370A5588615K96488j09620l74560O01548k17538k78715q198M723r9476j11529
12360A5291738p042l14431J17572l21243q7623P2267j48575q3242k99255j05323
$$ plain form
12350 14114843 14063358 13718617 13632799 13627832 13245255 12796018 12898397 12943844 12933607 12836168
12340 12836168 13524944 13488328 13513101 13898548 14525859 14831269 14990271 15445517 15803050 16091080
12330 16091080 16439215 16772803 16801711 17158600 17535859 17760512 17849235 18244094 18620212 18281185
12320 18281185 18468854 18738438 18749346 18588715 18673479 18543741 18672951 18516481 18720005 18693577
12310 18693577 18760595 19111234 19277349 19482874 19926165 20350413 20750963 21074762 21255017
12301 21255017 21584950 21271577 21515166 21282477 20947838 20403182 19943246 19386892 18874776
12292 18874776 18293847 18037584 18067372 17620725 17286754 16842137 16884766 16563270 16363123 15811862
12282 15811862 15389136 14760338 14329109 13793094 13174086 12618201 12687782 12285666 12128782
$$ packed form
12350A4114843n1485l44741q5818m967l82577m49237J02379M5447j0237r7439
12340A2836168O88776l6616K4773L85447O27311L05410J59002M55246L57533K88030
12330A6091080L48135L33588K8908L56889L77259K24653Q8723L94859L76118l39027
12320A8281185J87669K69584J0908j60631Q4764j29738J29210j56470K03524k6428
12310A8693577O7018L50639J66115K05525M43291M24248M00550L23799J80255
12301B1255017L29933l13373K43589k32689l34639n44656m59936n56354n12116
12292A8874776n80929k56263K9788m46647l33971m44617M2629l21496k00147n51261
12282A5811862m22726o28798m31229n36015o19008n55885O9581m02116j56884
$$ plain form
12273 12128782 11920167 11605094 11574609 11432286 11304814 11204215 11447712 11340130 11532164
12264 11532164 11251522 11346837 11329168 11140463 11123754 10956341 11274424 11256448 11340710 11612887
12254 11612887 11895715 12234464 12497720 13102988 13661747 14465587 15223007 16266378 17086216
12245 17086216 17941218 18938306 19975643 21047313 21666216 22531231 22643649 23124484 23344326
12236 23344326 23480781 23133935 22992760 22736303 22006020 22211438 22088167 21929857 21648964
12227 21648964 21404404 20737095 19965331 19307737 18381063 17321245 16256357 15074137 14398195
12218 14398195 13627753 12983275 12291193 12098486 11460307 11111623 10914753 10571590 10635839
12209 10635839 10170761 9983342 10014325 9657000 9410036 9277435 9062165 9147092 9292146 9423328
$$ packed form
12273A2128782k08615l15073l0485j42323j27472j00599K43497j07582J92034
12264A1532164k80642R5315j7669j88705j6709j67413L18083j7976Q4262K72177
12254A1612887K82828L38749K63256O05268N58759Q03840P57420J043371Q19838
12245A7086216Q55002R97088J037337J071670O18903Q65015J12418M80835K19842
12236B3344326J36455l46846j41175k56457p30283K05418j23271j58310k80893
12227B1648964k44560o67309p71764o57594r26674j059818j064888j182220o75942
12218A4398195p70442o44478o92082j92707o38179l48684j96870l43163O4249
12209A0635839m65078j87419L0983l57325k46964j32601k15270Q4927J45054J31182
$$ plain form
12199 9423328 9209260 9268242 9235040 9272528 9452371 9316722 9366309 9468748 9729528 9815865
12189 9815865 9777102 9982885 10176727 10364036 10739330 10690438 11140085 11167853 11506929 11533426
12179 11533426 11672976 11801435 11678424 11646387 11684833 11586372 11647861 11681081 11562303 11574901
12169 11574901 11668773 11803660 11853588 11948278 11849444 12252328 12763152 13416529 13755744 14187810
12159 14187810 14593256 14836797 15272713 15415873 15569330 15579161 15589705 15141407 14871134 14728913
12149 14728913 14599775 14768350 15079818 15327226 15777076 16080508 16483742 16923433 16922619 17173363
12139 17173363 17459934 17559606 18055635 18096857 18999267 19649980 20898281 22130031 23372188
12130 23372188 25080254 26919933 28836579 30838722 32851352 34463410 36090360 37272017
$$ packed form
12199I423328k14068N8982l3202L7488J79843j35649M9587J02439K60780Q6337
12189I815865l8763K05783J93842J87309L75294m8892M49647K7768L39076K6497
12179A1533426J39550J28459j23011l2037L8446r8461O1489L3220j18778J2598
12169A1574901R3872J34887M9928R4690r8834M02884N10824O53377L39215M32066
12159A4187810M05446K43541M35916J43160J53457R831J0544m48298k70273j42221
12149A4728913j29138J68575L11468K47408M49850L03432M03234M39691q14K50744
12139A7173363K86571R9672M96029M1222R02410O50713J248301J231750J242157
12130B3372188J708066J839679J916646K002143K012630J612058J626950J181657
$$ plain form
12122 37272017 38395380 38669096 39336588 39492433 39423653 39059340 38479068 37783390 37007140
12113 37007140 36292857 35682146 34688105 34248107 33866484 33014688 32477231 32011158 31767553
12104 31767553 31692884 32023504 32516675 32790624 33404141 33595591 33481514 33408557 33120208 32667623
12094 32667623 32523095 31394416 30858439 29877364 29517406 29249934 29264677 29377384 29835107
12085 29835107 30437161 30998089 31656352 32470621 32893808 33016657 33053574 32867558 32390690
12076 32390690 32292698 32343886 31950888 32123368 32268450 32078472 31720118 31066691 30360917 29832594
12066 29832594 28930776 28245126 27193374 26678603 25394710 24501693 23822807 23184062 22646118
12057 22646118 22069045 21973299 21466535 21115924 20710086 20391524 20157411 19652046 19255970
$$ packed form
12122C7272017J123363K73716O67492J55845o8780l64313n80272o95678p76250
12113C7007140p14283o10711r94041m39998l81623q51796n37457m66073k43605
12104C1767553p4669L30620M93171K73949O13517J91450j14077p2957k88349m52585
12094C2667623j44528j128679n35977r81075l59958k67472J4743J12707M57723
12085B9835107O02054N60928O58263Q14269M23187J22849L6917j86016m76868
12076C2390690r7992N1188l92998J72480J45082j89978l58354o53427p05774n28323
12066B9832594r01818o85650j051752n14771j283893q93017o78886o38745n37944
12057B2646118n77073r5746n06764l50611m05838l18562k34113n05365l96076
$$ plain form
12048 19255970 18880733 18421907 18246532 17992983 17945806 17610216 17096792 17080776 16453086 16403013
12038 16403013 15756355 15491806 15199318 14616396 14907933 14690397 14864432 14986576 15288150
12029 15288150 15593928 16342220 16407762 16704394 16777067 17063150 17055310 16668989 16288908 15940874
12019 15940874 15148170 15023182 14354718 13963159 13840544 13616810 13257504 12911118 12870405
12010 12870405 12713247 12235215 11943889 11887436 11411573 11523234 11373687 11534041 11859868
12001 11859868 12341340 12695395 12721550 12793638 12541316 12377519 11926860 11605851 11166217 11213844
11991 11213844 10744610 10431320 10389248 10106264 9963867 9925155 9810406 9840577 9319024 9380132
11981 9380132 8943443 8551016 8083843 7915127 8077437 7491046 7414994 7220732 7103834 7124694
$$ packed form
12048A9255970l75237m58826j75375k53549m7177l35590n13424j6016o27690n0073
12038A6403013o46658k64549k92488n82922K91537k17536J74035J22144L01574
12029A5288150L05778P48292O5542K96632P2673K86083p840l86321l80081l48034
12019A5940874p92704j24988o68464l91559j22615k23734l59306l46386m0713
12010A2870405j57158m78032k91326n6453m75863J11661j49547J60354L25827
12001A1859868M81472L54055K6155P2088k52322j63797m50659l21009m39634M7627
11991A1213844m69234l13290m2072k82984j42397l8712j14749L0171n21553O1108
11981I380132m36689l92427m67173j68716J62310n86391p6052j94262j16898K0860
$$ plain form
11971 7124694 7008442 6772944 6826527 6527619 6630626 6113708 5819313 5875201 5746741 5954768
11961 5954768 5915685 6006480 5859069 6184647 6377332 6663361 6501691 6693305 6854051 6782852
11951 6782852 6991739 6854857 6963049 6827581 6659327 6951295 7033891 7203742 7352080 7562400
11941 7562400 7755905 8078184 8363191 8275672 8274049 8520131 8288219 8463851 8242618 8374051
11931 8374051 8680407 8439304 8434986 8265624 8306155 8114929 8078269 7912897 7656412 7223262
11921 7223262 7210746 6900014 6736839 6544614 6527195 6506253 6455478 6144736 6272680 6094050
11911 6094050 6390728 7082957 8016024 9294798 10222313 10760957 10990212 11330480 11130611
11902 11130611 11400105 11328572 11017021 9961201 8198115 6705694 5644418 5697461 5321783
$$ packed form
11971G124694j16252k35498N3583k98908J03007n16918k94395N5888j28460K08027
11961E954768l9083R0795j47411L25578J92685K86029j61670J91614J60746p1199
11951F782852K08887j36882J08192j35468j68254K91968Q2596J69851J48338K10320
11941G562400J93505L22279K85007q7519j623K46082k31912J75632k21233J31433
11931H374051L06356k41103m318j69362M0531j91226l6660j65372k56485m33150
11921G223262j2516l10732j63175j92225j7419k0942n0775l10742J27944j78630
11911F094050K96678O92229R33067J278774R27515N38644K29255L40268j99869
11902A1130611K69494p1533l11551j055820j763086j492421j061276N3043l75678
$$ plain form
11893 5321783 5452246 5704105 5847003 6005478 6245449 6596353 7348039 7943061 8632725
11884 8632725 9375466 10030573 10540874 10847105 11321750 11363798 11311652 11014968 10307319 9563456
11874 9563456 8833317 8066129 7393578 6976078 6746098 6070169 5851179 5255334 5315473 5229119
11864 5229119 5216061 4827544 4929951 4895646 4634201 4619933 4726884 4724733 4537083 4624528
11854 4624528 4751427 4856649 5066930 5274354 5230120 5390986 5557158 5737517 6092752 6521488
11844 6521488 6965357 7386287 8511201 8677201 9219664 9700206 9932161 9669862 9810510
11835 9810510 9761031 9640505 9202091 8824693 8640645 8557613 8342711 8328770 8333707 8156223
11825 8156223 7977904 7631109 7055818 6872830 6015286 5708794 5114174 4663434 4473945
$$ packed form
11893E321783J30463K51859J42898J58475K39971L50904P51686N95022O89664
11884H632725P42741O55107N10301L06231M74645M2048n2146k96684p07649p43863
11874I563456p30139p67188o72551m17500k29980o75929k18990n95845O0139q6354
11864E229119j3058l88517J02407l4305k61445j4268J06951k151j87650Q7445
11854D624528J26899J05222K10281K07424m4234J60866J66172J80359L55235M28736
11844F521488M43869M20930J124914J66000N42463M80542K31955k62299J40648
11835I810510m9479j20526m38414l77398j84048q3032k14902j3941M937j77484
11825H156223j78319l46795n75291j82988q57544l06492n94620m50740j89489
$$ plain form
11816 4473945 4632045 4220231 4276331 4388625 4070948 4148718 4128960 4152990 3974158 3736430
11806 3736430 3787093 3939053 3746712 4039147 3957230 4057133 3905580 3907773 4131004 3959631
11796 3959631 4023072 4151795 4358215 4323606 4775181 4935244 5332823 5867234 6281934 6525974
11786 6525974 7058965 7122601 7429949 7256568 7150039 6785016 6651678 6031458 5225065 4979887
11776 4979887 4285562 3816761 3928770 3966811 3696504 3609498 3460232 3338613 3325270 3339713
11766 3339713 3367135 3172550 3284119 3305872 3259993 3182247 3321899 3171030 2974346 3133727
11756 3133727 3051875 3065090 2975294 2950389 3126273 3132803 3349961 3076734 2972019 3080814
11746 3080814 3176462 3077126 2893041 3139330 2898255 2973450 2846764 2767339 2991483 2860323
$$ packed form
11816D473945J58100m11814N6100J12294l17677P7770j9758K4030j78832k37728
11806C736430N0663J51960j92341K92435q1917R9903j51553K193K23231j71373
11796C959631O3441J28723K06420l4609M51575J60063L97579N34411M14700K44040
11786F525974N32991O3636L07348j73381j06529l65023j33338o20220q06393k45178
11776D979887o94325m68801J12009L8041k70307q7006j49266j21619j3343J4443
11766C339713K7422j94585J11569K1753m5879p7746J39652j50869j96684J59381
11756C133727q1852J3215q9796k4905J75884O530K17158k73227j04715J08795
11746C080814R5648r9336j84085K46289k41075P5195j26686p9425K24144j31160
$$ plain form
11736 2860323 2895221 2592681 2915013 2743546 2762711 2799854 2683883 2847785 2598933 2606994
11726 2606994 2584865 2811854 2749512 2704241 2867546 2633279 2677145 2739242 2968684 2865934
11716 2865934 2919443 2610114 2718555 2656818 2716240 2674224 2882816 2669312 2522291 2875142
11706 2875142 2736765 2765280 2733739 2687903 3059117 2752133 2946485 2783682 2968163 2859843
11696 2859843 2952776 2716482 2948769 2999885 3006883 3039398 3150624 3147106 2905315 3035582 3309520
11685 3309520 3185306 3298171 3005659 3345754 3641440 3413471 3231761 3366282 3591646
11676 3591646 3663366 3636606 3799942 3689752 3714948 3353584 3833332 3713590 3677556 3716177
11666 3716177 3616249 3856439 3643662 3715140 3803956 3764886 3801750 3817258 3566529 3573367 3768254
$$ packed form
11736B860323L4898l02540L22332j71467J9165L7143j15971J63902k48852Q061
11726B606994k2129K26989o2342m5271J63305k34267M3866O2097K29442j02750
11716B865934N3509l09329J08441o1737N9422m2016K08592k13504j47021L52851
11706B875142j38377K8515l1541m5836L71214l06984J94352j62803J84481j08320
11696B859843R2933k36294K32287N1116O998L2515J11226l518k41791J30267K73938
11685C309520j24214J12865k92512L40095K95686k27969j81710J34521K25364
11676C591646P1720k6760J63336j10190K5196l61364M79748j19742l6034L8621
11666C716177r9928K40190k12777P1478Q8816l9070L6864J5508k50729O838J94887
$$ plain form
11655 3768254 3658627 3524093 3359681 3523958 3393717 3889318 3600107 3531987 3254374 3561582
11645 3561582 3536581 3246157 3419191 3362400 3484531 3339643 3324360 3167466 3428161 3466840
11635 3466840 3086906 3188948 3212162 3243152 3120065 3425734 3009591 3123146 3100680 3086562
11625 3086562 2945229 3068320 3071514 2952114 3209622 2974015 3229631 2831930 3067577 3212549
11615 3212549 2932201 3111204 3198138 3188190 3093483 3015341 3156666 3073176 3332816 3096952
11605 3096952 3241058 3257608 3055577 3182733 3339644 3252675 3236332 3265661 3565610 3392281
11595 3392281 3558832 3268454 3301397 3330805 3348662 3129376 3170964 3280196 3249631 3335497
11585 3335497 3295845 3056508 3305936 3535264 3351145 3550367 3677583 3662439 3791861 3649322
$$ packed form
11655C768254j09627j34534j64412J64277j30241M95601k89211o8120k77613L07208
11645C561582k5001k90424J73034n6791J22131j44888j5283j56894K60695L8679
11635C466840l79934J02042K3214L0990j23087L05669m16143J13555k2466j4118
11625C086562j41333J23091L194j19400K57508k35607K55616l97701K35647J44972
11615C212549k80348J79003Q6934r948r4707p8142J41325q3490K59640k35864
11605C096952J44106J6550k02031J27156J56911q6969j6343K9329K99949j73329
11595C392281J66551k90378L2943K9408J7857k19286M1588J09232l0565Q5866
11585C335497l9652k39337K49428K29328j84119J99222J27216j5144J29422j42539
$$ plain form
11575 3649322 3446833 3635419 3669722 3663184 3573215 3591799 3572483 3815858 3821273 3623035 3555729
11564 3555729 3946352 3952425 3974808 3905330 3918818 3942963 3980770 4173177 4217859 4216381 4420818
11553 4420818 3944833 4346020 4359704 4469639 3914883 4117056 4151905 4118334 3910480 3826410
11543 3826410 3721919 3500757 3779484 3638456 3564175 3546814 3711409 3565173 3388420 3468921
11533 3468921 3561669 3557631 3373542 3462860 3364519 3508754 3545016 3582757 3525608 3335179 3335683
11522 3335683 3665354 3461537 3737445 3617337 3677975 3743009 3930604 3992053 4058272 3961009
11512 3961009 3931115 4022045 4164339 4151788 4119834 4198063 4042545 4152848 4348131 4215066
11502 4215066 4221374 4156489 4290275 4156169 3973184 4013776 3876707 3838462 4034228 4137335
$$ packed form
11575C649322k02489J88586L4303o538q9969J8584j9316K43375N415j98238o7306
11564C555729L90623O073K2383o9478J3488K4145L7807J92407M4682j478K04437
11553D420818m75985M01187J3684J09935n54756K02173L4849l3571k07854q4070
11543C826410j04491k21162K78727j41028p4281j7361J64595j46236j76753Q0501
11533C468921R2748m038j84089Q9318r8341J44235L6262L7741n7149j90429N04
11522C335683L29671k03817K75908j20108O0638O5034J87595O1449O6219r7263
11512C961009k9894R0930J42294j2551l1954P8229j55518J10303J95283j33065
11502D215066O308o4885J33786j34106j82985M0592j37069l8245J95766J03107
$$ plain form
11492 4137335 4047698 3836408 3910458 3987437 3941083 4003177 3918018 4196823 4020094 3895894
11482 3895894 4276403 4282383 4107438 4081081 3945430 3947780 4213289 4130561 4241249 4125843
11472 4125843 4085805 4289752 4011142 4394658 4108880 4158046 3977299 3677985 3937686 3883356
11462 3883356 4028577 3975490 3927019 4116108 4110342 3961142 3952967 3992283 3977439 3954611 3911944
11451 3911944 4152035 3930433 4259339 4122921 3976680 4294014 4222879 4254846 4320668 4398619
11441 4398619 4245993 4483263 4594886 4340190 4553919 4759410 4712406 4821676 5013752 4962872
11431 4962872 4865357 4823533 5107195 4802356 5073248 4793650 4840971 4833178 5106714 4875042
11421 4875042 4848490 4927897 4786936 4855837 4861819 4810813 4833006 4781373 4831715 4706871 4942061
$$ packed form
11492D137335q9637k11290P4050P6979m6354O2094q5159K78805j76729j24200
11482C895894L80509N980j74945k6357j35651K350K65509q2728J10688j15406
11472D125843m0038K03947k78610L83516k85778M9166j80747k99314K59701n4330
11462C883356J45221n3087m8471J89089n766j49200q175L9316j4844k2828m2667
11451C911944K40091k21602L28906j36418j46241L17334p1135L1967O5822P7951
11441D398619j52626K37270J11623k54696K13729K05491m7004J09270J92076n0880
11431D962872r7515m1824K83662l04839K70892k79598M7321p793K73536k31672
11421D875042k6552P9407j40961O8901N982n1006K2193n1633N0342j24844K35190
$$ plain form
11410 4942061 4680142 4992289 5010593 4910793 4949715 5071920 4946231 5208346 5211409 5356878
11400 5356878 5321337 5546349 5461637 5583993 5627160 5509489 5624834 5716396 5790469 5826344
11390 5826344 5985371 6189861 5972865 6091987 6297473 6453537 6340206 6443559 6432152 6576955
11380 6576955 6419768 6570681 6594286 6289539 6706235 6743918 6598001 6610582 6675683 6769971
11370 6769971 6940881 6971597 6568409 6951902 6749621 6705799 6951680 6560444 6776501 7067830
11360 7067830 7015178 7022366 6847131 6826684 6754614 7035158 6893401 7009470 6948695 6940143 7106925
11349 7106925 7019800 7004207 6950829 6914838 7083789 6974533 6880203 6961111 6996610 6893929 6894460
11338 6894460 7128008 6851828 6923111 6925801 6885845 6875132 6823841 6474601 6536637 6570225 6616236
$$ packed form
11410D942061k61919L12147J8304r9800L8922J22205j25689K62115L063J45469
11400E356878l5541K25012q4712J22356M3167j17671J15345R1562P4073L5875
11390E826344J59027K04490k16996J19122K05486J56064j13331J03353j1407J44803
11380F576955j57187J50913K3605l04747M16696L7683j45917J2581O5101R4288
11370F769971J70910L0716m03188L83493k02281m3822K45881l91236K16057K91329
11360G067830n2652P188j75235k0447p2070K80544j41757J16069o0775q552J66782
11349G106925q7125j5593n3378l5991J68951j09256r4330Q0908L5499j02681N31
11338F894460K33548k76180P1283K690l9956j0713n1291l49240O2036L3588M6011
$$ plain form
11327 6616236 6371020 6459302 6492721 6247719 6396159 6109667 6172551 6302715 5843932 5591810
11317 5591810 5480252 5579576 5710043 5462281 5346258 5190204 5401350 5224744 4930922 5023641
11307 5023641 4809081 4800313 4687160 4839961 4519810 4709323 4402728 4460214 4112329 4209429
11297 4209429 4282315 4228449 4139912 3990448 3965168 3734200 3648990 3911952 3545940 3708596
11287 3708596 3556117 3733191 3602544 3392766 3519923 3629383 3435153 3235404 3186209 3299880
11277 3299880 3223442 3004047 2998298 3220938 3188516 3142866 2834499 2891321 3180980 3144336 3011637
11266 3011637 3023974 3067783 2987457 2959205 2917750 2810946 2823057 2899111 2800142 2655418 2653681
11255 2653681 2707779 2827478 2824561 3005651 2864916 2738978 2689738 2631486 2995149 2747953
$$ packed form
11327F616236k45216Q8282L3419k45002J48440k86492O2884J30164m58783k52122
11317E591810j11558R9324J30467k47762j16023j56054K11146j76606k93822R2719
11307E023641k14560q768j13153J52801l20151J89513l06595N7486l47885R7100
11297D209429P2886n3866q8537j49464k5280k30968q5210K62962l66012J62656
11287C708596j52479J77074j30647k09778J27157J09460j94230j99749m9195J13671
11277C299880p6438k19395n749K22640l2422m5650l08367N6822K89659l6644j32699
11266C011637J2337M3809q0326k8252m1455j06804J2111P6054r8969j44724j737
11255B653681N4098J19699k917J81090j40735j25938m9240n8252L63663k47196
$$ plain form
11245 2747953 2714051 2811379 2565557 2742997 2849375 2791972 2823557 2929595 2949914 2724051
11235 2724051 2745365 2587899 2908261 2745236 2701681 2863974 2825313 2913779 3028091 3351472
11225 3351472 3486454 3855919 4597221 4823774 5050557 5577089 5549062 5711323 5814953 5715539
11215 5715539 5864535 5359845 4607978 3838025 3492896 3274605 3206597 2919212 2973360 2899004
11205 2899004 3068182 2828459 2982206 3137153 3047377 2930623 3077095 3132899 3404143 3757161
11195 3757161 4116403 4558639 5224926 5583087 5839253 5819971 5910282 6137108 5959574 5882553
11185 5882553 5358566 4461424 3997140 3722894 3542809 3158165 3103578 3390672 3353429 3330592
11175 3330592 3252531 3411118 3185680 3290623 3629561 3349870 3336159 3534678 3296073 3273737
$$ packed form
11245B747953l3902R7328k45822J77440J06378n7403L1585J06038K0319k25863
11235B724051K1314j57466L20362j63025m3555J62293l8661Q8466J14312L23381
11225C351472J34982L69465P41302K26553K26783N26532k8027J62261J03630r9414
11215E715539J48996n04690p51867p69953l45129k18291o8008k87385N4148p4356
11205B899004J69178k39723J53747J54947q9776j16754J46472N5804K71244L53018
11195C757161L59242M42236O66287L58161K56166j9282R0311K26826j77534p7021
11185E882553n23987q97142m64284k74246j80085l84644n4587K87094l7243k2837
11175C330592p8061J58587k25438J04943L38938k79691j3711J98519k38605k2336
$$ plain form
11165 3273737 3299407 3516093 3046312 3666760 3405577 3440404 3494646 3385139 3318121 3343369
11155 3343369 3677337 3459989 3537061 3474302 3249878 3622335 3234183 3723715 3448268 3729516
11145 3729516 3322479 3627942 3595552 3660832 3735702 3618992 3696425 3869482 3653835 3629414
11135 3629414 3779244 3659632 4064681 3829744 3929686 3731261 3787246 3666010 3886016 4062933
11125 4062933 4127006 4087690 4003845 4106149 3773935 4073740 4311085 4249937 4139190 3887319
11115 3887319 4088542 3983766 4186489 4066177 4238995 4268318 4257061 4345562 4161691 4344408
11105 4344408 4250359 4043941 4091720 4126298 4000464 4062964 3973713 3920621 4060142 3877815
11095 3877815 3756503 3550905 3724720 3802563 3678366 3618081 3559883 3548044 3729817 3555887
$$ packed form
11165C273737K5670K16686m69781O20448k61183L4827N4242j09507o7018K5248
11155C343369L33968k17348P7072o2759k24424L72457l88152M89532k75447K81248
11145C729516m07037L05463l2390O5280P4870j16710P7433J73057k15647k4421
11135C629414J49830j19612M05049k34937R9942j98425N5985j21236K20006J76917
11125D062933O4073l9316q3845J02304l32214K99805K37345o1148j10747k51871
11115C887319K01223j04776K02723j20312J72818K9323j1257Q8501j83871J82717
11105D344408r4049k06418M7779L4578j25834O2500q9251n3092J39521j82327
11095C877815j21312k05598J73815P7843j24197o0285n8198j1839J81773j73930
$$ plain form
11085 3555887 3660168 3733643 3632682 3505289 3517396 3602979 3815367 3758666 3706732 3684173
11075 3684173 3687566 3595957 3685997 3635917 3920813 3851596 4128222 4056565 3868606 3771055 3908843
11064 3908843 4100312 4123029 4224854 4056799 4279412 4141643 4135597 4315813 4150208 4132390
11054 4132390 4181861 4323593 4283999 4171448 4162228 4121163 4074598 3951102 4135477 4289414
11044 4289414 3973260 3907801 4179405 4014819 4193799 4061460 4152408 4313735 4392904 4276050
11034 4276050 4167974 4425596 4551396 4606863 4537020 4741491 4931137 5022532 5252778 5258763
11024 5258763 5292675 5574421 5403975 5542603 5401017 5775448 5791131 5829321 6112976 5933568
11014 5933568 6060821 6174054 6380031 6222625 6193053 6213321 6564631 6415462 6541585 6581527
$$ packed form
11085C555887J04281P3475j00961j27393J2107Q5583K12388n6701n1934k2559
11075C684173L393r1609R0040n0080K84896o9217K76626p1657j87959r7551J37788
11064C908843J91469K2717J01825j68055K22613j37769o046J80216j65605j7818
11054D132390M9471J41732l9594j12551r220m1065m6565j23496J84375J53937
11044D289414l16154o5459K71604j64586J78980j32339R0948J61327P9169j16854
11034D276050j08076K57622J25800N5467o9843K04471J89646R1395K30246N985
11024E258763L3912K81746j70446J38628j41586L74431J5683L8190K83655j79408
11014E933568J27253J13233K05977j57406k9572K0268L51310j49169J26123L9942
$$ plain form
11004 6581527 6721429 6643712 6895931 7166075 7187927 7257466 7379866 7548469 7877878 7928555
10994 7928555 8137423 8189391 8199039 8436834 8784477 8726994 8643254 8966182 8881628 9292082
10984 9292082 9158181 9625396 9714105 10006772 10049475 10576128 10639095 11051676 10914660 11251264
10974 11251264 11167496 11462436 11329638 11509027 11351083 11656107 11913921 11719184 12190703
10965 12190703 12267314 12736704 12831307 12865527 13189203 13489447 13810182 13859797 13954749 14321599
10955 14321599 14802046 15177260 15365941 15811032 15915331 16503224 16559218 17134638 17421397
10946 17421397 17564864 17568433 17711112 17851544 18081923 18218430 18433990 18472333 18874371 18981650
10936 18981650 19495154 19409791 19367173 19847731 20255887 20384878 20655451 21049550 21243987 21319578
$$ packed form
11004F581527J39902p7717K52219K70144K1852O9539J22400J68603L29409N0677
10994G928555K08868N1968R648K37795L47643n7483q3740L22928q4554M10454
10984I292082j33901M67215Q8709K92667M2703N26653O2967M12581j37016L36604
10974A1251264q3768K94940j32798J79389j57944L05024K57814j94737M71519
10965A2190703P6611M69390R4603L4220L23676L00244L20735M9615R4952L66850
10955A4321599M80447L75214J88681M45091J04299N87893N5994N75420K86759
10946A7421397J43467L569J42679J40432K30379J36507K15560L8343M02038J07279
10936A8981650N13504q5363m2618M80558M08156J28991K70573L94099J94437P5591
$$ plain form
10926 21319578 21800892 22543622 23078469 23331920 23916064 24152885 24597511 24920904 25096714
10917 25096714 25379440 25663076 25484226 25585668 25540372 25612408 25715652 25739363 25981787 26090003
10907 26090003 26071746 25866203 26153937 26100474 26183986 26409333 26387652 26339824 26803102 26750242
10897 26750242 26577835 26903074 27073824 26826593 27003347 27524364 27726733 27739071 28205033
10888 28205033 28564872 28832458 29362837 29755150 30230897 31010931 31819725 32581675 33425256
10879 33425256 34580861 35607329 37040937 38431664 39872111 41573919 43248530 44996323
10871 44996323 47075650 48736929 50301634 51942166 53071886 54418512 55264053 55716103
10863 55716103 55533999 55561339 55080296 54210579 53316289 51826762 50201879 48520260 46616787
$$ packed form
10926B1319578M81314P42730N34847K53451N84144K36821M44626L23393J75810
10917B5096714K82726K83636j78850J01442m5296P2036J03244K3711K42424J08216
10907B6090003j8257k05543K87734n3463Q3512K25347k1681m7828M63278n2860
10897B6750242j72407L25239J70750k47231J76754N21017K02369J2338M65962
10888B8205033L59839K67586N30379L92313M75747P80034Q08794P61950Q43581
10879C3425256J155605J026468J433608J390727J440447J701808J674611J747793
10871D4996323K079327J661279J564705J640532J129720J346626Q45541M52050
10863E5716103j82104K7340m81043q69717q94290j489527j624883j681619j903473
$$ plain form
10854 46616787 44805296 42899568 41230329 39388514 37308239 35446963 33653947 31771747
10846 31771747 30096505 28638166 26991801 25552599 24309961 22970805 21923440 20751931
10838 20751931 19644871 18612382 17660039 16747407 16207755 15393492 14483000 13888050 13259769
10829 13259769 12586813 12194696 11645692 11218284 10581155 10243142 9847608 9440375 9373278
10820 9373278 8808088 8796737 8512012 8506356 8196563 8351388 8212809 7949507 8126694 7972980
10810 7972980 7705612 7920284 7523246 7381734 7086909 6663264 6429572 6481167 5639416 5570305
10800 5570305 5380324 5277092 5152200 5140679 4922657 4836249 4481448 4566415 4525578 4221116
10790 4221116 4370267 4248827 4368012 4258820 3971319 4072359 3970046 4035322 4101495 3927861
$$ packed form
10854D6616787j811491j905728j669239j841815k080275j861276j793016j882200
10846C1771747j675242j458339j646365j439202j242638j339156j047365j171509
10838B0751931j107060j032489r52343r12632n39652q14263r10492n94950o28281
10829A3259769o72956l92117n49004m27408o37129l38013l95534m07233o7097
10820I373278n65190j1351k84725n656l09793J54825j38579k63302J77187j53714
10810G972980k67368K14672l97038j41512k94825m23645k33692N1595q41751o9111
10800E570305j89981j03232j24892j1521k18022q6408l54801Q4967m0837l04462
10790D221116J49151j21440J19185j09192k87501J01040j02313O5276O6173j73634
$$ plain form
10780 3927861 3851384 3859188 3564074 3666408 3868534 3220296 3694547 3679769 3397355 3583816
10770 3583816 3387872 3267200 3525865 3281778 3464663 3377966 3194348 3274064 3135352 3354831
10760 3354831 3434376 3022706 3021736 3279704 3213718 3001213 3189328 3277734 3214627 3292327 3391034
10749 3391034 3388278 3405885 3187276 3319436 3466756 3348303 2890751 2935474 2879077 2784760
10739 2784760 3043041 2944068 2839366 2861274 2804362 2964230 3114562 3108980 3176762 3354342
10729 3354342 3351289 3342194 3049501 3369120 3346955 3454330 3550150 3215203 3275851 2955087 2921853
10718 2921853 2970212 3214078 3267068 3017544 2989151 3234067 3166665 3306557 3367675 3157823
10708 3157823 3443947 3301937 3407432 3470800 3307612 3311913 3263595 3447385 3215642 3292207
$$ packed form
10780C927861p6477P804k95114J02334K02126o48238M74251j4778k82414J86461
10770C583816j95944j20672K58665k44087J82885q6697j83618P9716j38712K19479
10760C354831P9545m11670r70K57968o5986k12505J88115Q8406o3107P7700R8707
10749C391034k756J7607k18609J32160J47320j18453m57552M4723n6397r4317
10739B784760K58281r8973j04702K1908n6912J59868J50332n582O7782J77580
10729C354342l053r095k92693L19619k2165J07375R5820l34947O0648l20764l3234
10718B921853M8359K43866N2990k49524k8393K44916o7402J39892O1118k09852
10708C157823K86124j42010J05495O3368j63188M301m8318J83790k31743P6565
$$ plain form
10698 3292207 3129234 2993353 3068791 3021268 3006366 2819398 2807908 3085148 2831894 3067436
10688 3067436 3016269 3069966 3120449 2980088 3238627 3223031 2925294 3051021 2972079 2908547
10678 2908547 3082172 2881944 3114084 3080888 3188603 3485302 3238931 3057983 3070255 2885679
10668 2885679 3057632 2739576 2680386 2371680 2318189 2526084 2677178 2255104 2190698 2275990
10658 2275990 2268619 2219245 2207152 2169733 2369228 2501430 2578550 2392760 2436346 2445616 2239425
10647 2239425 2198530 2308008 2091921 2368520 2189531 2163684 2052958 1676994 1838539 1813023
10637 1813023 1642928 1769615 1722051 1647883 1622249 1730958 1907089 1547440 1757625 1970980
10627 1970980 1686462 1716016 1736970 1769935 1614751 1653712 1612400 1858372 1727953 1579050
$$ packed form
10698C292207j62973j35881P5438m7523j4902j86968j1490K77240k53254K35542
10688C067436n1167N3697N0483j40361K58539j5596k97737J25727p8942o3532
10678B908547J73625k00228K32140l3196J07715K96699k46371j80948J2272j84576
10668B885679J71953l18056n9190l08706n3491K07895J51094m22074o4406Q5292
10658B275990p371m9374j2093l7419J99495J32202P7120j85790M3586R270k06191
10647B239425m0895J09478k16087K76599j78989k5847j10726l75964J61545k5516
10637A813023j70095J26687m7564p4168k5634J08709J76131l59649K10185K13355
10627A970980k84518K9554K0954L2965j55184L8961m1312K45972j30419j48903
$$ plain form
10617 1579050 1722158 1881504 1888287 1838260 1715240 1636109 1694054 1650571 1565201 1561939 1892045
10606 1892045 1776877 1738353 2219264 1596249 1649751 1651322 1683803 1758698 1795163 1633657 1903912
10595 1903912 1694097 1662094 1529188 1778096 1838870 1815039 1690078 1864878 1977795 1760868
10585 1760868 2075494 1774271 1693381 1872317 1899518 1845654 1773596 1915466 2034719 1915289
10575 1915289 1760828 1837159 1784515 2014857 1761325 1869208 1735885 1996820 1767712 1800993
10565 1800993 1738944 1602766 1611357 1591769 1669395 1672658 1235207 1578936 1426380 1346099 1512756
10554 1512756 1495696 1494880 1488705 1280253 1355536 1410723 1506297 1564111 1595985 1310034 1208716
10543 1208716 1432856 1302272 1730445 1430098 1669416 1543302 1343876 1371536 1502870 1393408
$$ packed form
10617A579050J43108J59346O783n0027j23020p9131N7945m3483q5370l262L30106
10606A892045j15168l8524M80911o23015N3502J571L2481P4895L6465j61506K70255
10595A903912k09815l2003j32906K48908O0774k3831j24961J74800J12917k16927
10585A760868L14626l01223q0890J78936K7201n3864p2058J41870J19253j19430
10575A915289j54461P6331n2644K30342k53532J07883j33323K60935k29108L3281
10565A800993o2049j36178Q591j9588P7626L263m37451L43729j52556q0281J66657
10554A512756j7060q16o175k08452P5283N5187R5574N7814L1874k85951j01318
10543A208716K24140j30584M28173l00347K39318j26114j99426K7660J31334j09462
$$ plain form
10533 1393408 1566024 1705077 1575314 1716746 1751588 1814616 1643503 1553694 1632416 1576312
10523 1576312 1619591 1899160 1861596 1817210 2040435 2313785 2269458 2505607 2474892 2221281
10513 2221281 2577338 2383756 2382928 2299715 1851974 1764921 1884045 1557745 1624997 1876687
10503 1876687 1816333 1718254 1815167 1888868 1808852 1980977 1930951 1950270 2006470 2046419 2095144
10492 2095144 2184686 2097084 2387697 2270286 2597389 2453074 2499455 2382522 2356166 2109482
10482 2109482 2199295 2143609 2079873 2171831 2183656 1877635 1900300 2170947 2046854 2010496 2162583
10471 2162583 2188505 2134691 2170068 2373629 2161961 2377724 2519743 2434471 2636961 2848965
10461 2848965 2957053 2927648 2902581 2810030 2787505 3154202 3302511 3024179 3204266 3247152
$$ packed form
10533A393408J72616J39053j29763J41432L4842O3028j71113q9809P8722n6104
10523A576312M3279K79569l7564m4386K23225K73350m4327K36149l0715k53611
10513B221281L56057j93582q28q3213m47741q7053J19124l26300O7252K51690
10503A876687o0354r8079R6913P3701q0016J72125n0026J9319N6200L9949M8725
10492B095144Q9542q7602K90613j17411L27103j44315M6381j16933k6356k46684
10482B109482Q9813n5686o3736R1958J1825l06021K2665K70647j24093l6358J52087
10471B162583K5922n3814L5377K03561k11668K15763J42019q5272K02490K12004
10461B848965J08088k9405k5067r2551k2525L66697J48309k78332J80087M2886
$$ plain form
10451 3247152 3266006 3139903 3567796 3167835 2961969 3124700 2944327 2889302 2646708 2504687
10441 2504687 2559418 2676532 2853321 2955268 2984575 3149784 3164798 3298220 3360595 3021299
10431 3021299 3231446 3213725 2899460 2500707 2444629 2261117 2132433 2366228 2225954 2226376
10421 2226376 2356668 2282128 2326781 2173248 2223267 2320496 2318907 2381307 2501946 2433996 2691046
10410 2691046 2895229 3220655 2808809 3353179 3297481 3603502 3785121 4007095 3965538 3816250
10400 3816250 4061090 4196424 4303631 4847320 5001465 5653278 5968350 6599261 7128150
10391 7128150 7637947 8112010 8566559 8918471 8889111 9000848 8643862 8670297 8193729 7770339
10381 7770339 7276485 6709651 6410549 5913780 5698677 5451943 5302117 5145680 5178126 5138476
$$ packed form
10451C247152J8854j26103M27893l99961k05866J62731j80373n5025k42594j42021
10441B504687N4731J17114J76789J01947K9307J65209J5014J33422O2375l39296
10431C021299K10147j7721l14265l98753n6078j83512j28684K33795j40274M22
10421B226376J30292p4540M4653j53533N0019R7229j589O2400J20639o7950K57050
10410B691046K04183L25426m11846N44370n5698L06021J81619K21974m1557j49288
10400C816250K44840J35334J07207N43689J54145O51813L15072O30911N28889
10391G128150N09797M74063M54549L51912k9360J11737l56986K6435m76568m23390
10381G770339m93854n66834k99102m96769k15103k46734j49826j56437L2446l9650
$$ plain form
10371 5138476 5149850 5335055 5260029 5501135 5492336 5408801 5610810 5603148 5582475 5338841 5270406
10360 5270406 5044535 4900320 5095620 4694549 4728238 4620308 4559057 4628328 4565082 4358561
10350 4358561 4395610 4301650 4059260 4191352 4040871 3963752 4110609 3918390 3912350 4006502
10340 4006502 4402640 4161833 4055706 4300279 4047466 4515271 4005389 4170768 4195069 4226699
10330 4226699 4286715 4036114 4007130 3928154 4121860 4172830 3863376 4023084 4100190 4399926
10320 4399926 3974713 4225266 4244855 4172164 4067692 4191023 4374429 4174525 4172498 4247711
10310 4247711 4497415 4748633 4799362 4734598 4842407 4735068 4954825 5098804 4725895 4842446
10300 4842446 4776950 4846480 4618053 4520485 4642737 4932091 4518996 4970755 4849763 4900480
$$ packed form
10371E138476J1374J85205p5026K41106q799q3535K02009p662k0673k43634o8435
10360E270406k25871j44215J95300m01071L3689j07930o1251O9271o3246k06521
10350D358561L7049r3960k42390J32092j50481p7119J46857j92219o040R4152
10340D006502L96138k40807j06127K44573k52813M67805n09882J65379K4301L1630
10330D226699O0016k50601k8984p8976J93706N0970l09454J59708P7106K99736
10320D399926m25213K50553J9589p2691j04472J23331J83406j99904k027P5213
10310D247711K49704K51218N0729o4764J07809j07339K19757J43979l72909J16551
10300D842446o5496O9530k28427r7568J22252K89354m13095M51759j20992N0717
$$ plain form
10290 4900480 4864369 5006420 5207555 5298989 5497352 5847588 5956488 6175713 6261153 6604427
$$ packed form
10290D900480l6111J42051K01135R1434J98363L50236J08900K19225Q5440L43274
$$ [...]
##END NTUPLES=NMR SPECTRUM
##END=
