##TITLE=coffee_type TORI01-ROVE100C_70-30%
COFFEE_meoh_noesyp64 COFFEE_meoh {C:\Bruker\TOPSPIN} Administrator 14
##JCAMPDX= 6.0         $$ Bruker NMR JCAMP-DX V2.0
##DATA TYPE= NMR SPECTRUM
##DATA CLASS= NTUPLES
##ORIGIN= Bruker BioSpin GmbH
##OWNER= Administrator
$$ 1.72 TOPSPIN		Version 2.1
$$ 2012-05-18 15:52:47.401 -0700  Administrator@X
$$ Compression mode = diff/dup
##.OBSERVE FREQUENCY= 400.13188235
##.OBSERVE NUCLEUS= ^1H
##.ACQUISITION MODE= SIMULTANEOUS (DQD)
##.ACQUISITION SCHEME= undefined
##.AVERAGES= 64
##.DIGITISER RES= 22
##SPECTROMETER/DATA SYSTEM= spect
##.PULSE SEQUENCE= noesygpps1d.comp
##.SOLVENT NAME= COFFEE_meoh
##.SHIFT REFERENCE= INTERNAL, COFFEE_meoh, 1, 14.98061
##AUDIT TRAIL= $$ (NUMBER, WHEN, WHO, WHERE, PROCESS, VERSION, WHAT)
$$ ##TITLE= Audit trail, TOPSPIN		Version 2.1
$$ ##JCAMPDX= 5.01
$$ ##ORIGIN= Bruker BioSpin GmbH
$$ ##OWNER= Administrator
$$ $$ C:\Bruker\TOPSPIN/data/Administrator/nmr/12-COFFEE-2502/242/pdata/1/auditp.txt
$$ ##AUDIT TRAIL=  $$ (NUMBER, WHEN, WHO, WHERE, PROCESS, VERSION, WHAT)
(   1,<2012-02-25 22:29:06.047 -0500>,<Administrator>,<TOPSPIN>,<go>,<TOPSPIN 2.1>,
      <created by zg
	started at 2012-02-25 22:17:35.812 -0500,
	POWCHK enabled, PULCHK disabled,
       configuration hash MD5:
       B0 76 FB 9C 50 81 44 7D 18 B3 26 32 4E 60 AD 96
       data hash MD5: 64K
       D3 F9 05 3D C7 79 38 03 7F D3 C3 4E D0 63 AC F1>)
(   2,<2012-02-25 22:29:08.812 -0500>,<Administrator>,<TOPSPIN>,<proc1d>,<TOPSPIN 2.1>,
      <Start of raw data processing
       efp LB = 0.3 FT_mod = 6 PKNL = 1 PHC0 = 0 PHC1 = 0 SI = 128K 
       data hash MD5: 128K
       8A 9D DE 5E 91 13 81 A0 F2 4B 9A C0 64 7A 6B 96>)
(   3,<2012-02-25 22:29:10.078 -0500>,<Administrator>,<TOPSPIN>,<proc1d>,<TOPSPIN 2.1>,
      <pk PHC0 = 24.87854 PHC1 = 0 
       data hash MD5: 128K
       F9 60 8D 84 90 00 71 45 60 A7 C5 88 4D 56 38 92>)
(   4,<2012-02-25 22:29:10.297 -0500>,<Administrator>,<TOPSPIN>,<proc1d>,<TOPSPIN 2.1>,
      <abs ABSG = 1 
       data hash MD5: 128K
       90 83 FD DA DF 8D A9 21 C8 7C CC C7 B7 58 10 E4>)
(   5,<2012-02-25 22:29:10.453 -0500>,<Administrator>,<TOPSPIN>,<proc1d>,<TOPSPIN 2.1>,
      <abs ABSG = 2 
       data hash MD5: 128K
       6E B6 2E BB 57 62 75 02 FE 71 AB E5 98 B4 2C D5>)
(   6,<2012-02-25 22:29:10.656 -0500>,<Administrator>,<TOPSPIN>,<proc1d>,<TOPSPIN 2.1>,
      <abs ABSG = 3 
       data hash MD5: 128K
       71 D3 1D 84 89 9E 9A 09 A2 40 2F 0D A8 4C 3D 7D>)
(   7,<2012-02-25 22:29:10.734 -0500>,<Administrator>,<TOPSPIN>,<proc1d>,<TOPSPIN 2.1>,
      <abs ABSG = 4 
       data hash MD5: 128K
       6B 9C 5D 3E C5 AC 42 39 B0 5B 47 6B DE AE 0F A7>)
(   8,<2012-02-25 22:29:10.781 -0500>,<Administrator>,<TOPSPIN>,<proc1d>,<TOPSPIN 2.1>,
      <abs ABSG = 5 
       data hash MD5: 128K
       AC 07 74 46 C6 C4 96 81 73 DA EE E3 AA 62 43 DB>)
(   9,<2012-02-25 22:29:10.922 -0500>,<Administrator>,<TOPSPIN>,<audit>,<TOPSPIN 2.1>,
      <user comment:
       ICON-NMR User ID: Administrator
$$ [...]
150 150 150 150 150 150 150 150
##$TP07= 0
##$TPNAME0= <>
##$TPNAME1= <>
##$TPNAME2= <>
##$TPNAME3= <>
##$TPNAME4= <>
##$TPNAME5= <>
##$TPNAME6= <>
##$TPNAME7= <>
##$TPOAL= (0..7)
0.5 0.5 0.5 0.5 0.5 0.5 0.5 0.5
##$TPOFFS= (0..7)
0 0 0 0 0 0 0 0
##$TUNHIN= 0
##$TUNHOUT= 0
##$TUNXOUT= 0
##$USERA1= <user>
##$USERA2= <user>
##$USERA3= <user>
##$USERA4= <user>
##$USERA5= <user>
##$V9= 5
##$VALIST= <valist>
##$VCLIST= <CCCCCCCCCCCCCCC>
##$VD= 0
##$VDLIST= <DDDDDDDDDDDDDDD>
##$VPLIST= <PPPPPPPPPPPPPPP>
##$VTLIST= <TTTTTTTTTTTTTTT>
##$WBST= 1024
##$WBSW= 4
##$XGAIN= (0..3)
0 0 0 0
##$XL= 0
##$YL= 0
##$YMAX_a= 14402714
##$YMIN_a= -6668014
##$ZGOPTNS= <>
##$ZL1= 120
##$ZL2= 120
##$ZL3= 120
##$ZL4= 120
##$ABSF1= 14.98061
##$ABSF2= -5.57192
##$ABSG= 5
##$ABSL= 3
##$ALPHA= 0
##$AQORDER= 0
##$ASSFAC= 0
##$ASSFACI= 0
##$ASSFACX= 0
##$ASSWID= 0
##$AUNMP= <proc_prof1d_extract>
##$AXLEFT= 0
##$AXNAME= <>
##$AXNUC= <1H>
##$AXRIGHT= 0
##$AXTYPE= 0
##$AXUNIT= <>
##$AZFE= 0.1
##$AZFW= 0.1
##$BCFW= 0
##$BC_mod= 0
##$BYTORDP= 0
##$COROFFS= 0
##$CY= 15
##$DATMOD= 1
##$DC= 0
##$DFILT= <>
##$DTYPP= 0
##$F1P= 0
##$F2P= 0
##$FCOR= 0.5
##$FTSIZE= 131072
##$FT_mod= 6
##$GAMMA= 0
##$GB= 0
##$INTBC= 1
##$INTSCL= 1
##$ISEN= 128
##$LB= 0.3
##$LEV0= 0
##$LPBIN= 0
##$MAXI= 10000
##$MC2= 0
##$MEAN= 0
##$ME_mod= 0
##$MI= 0
##$NCOEF= 0
##$NC_proc= -3
##$NLEV= 6
##$NOISF1= 0
##$NOISF2= 0
##$NSP= 0
##$NTH_PI= 0
##$NZP= 0
##$OFFSET= 14.98061
##$PC= 1
##$PHC0= 24.87854
##$PHC1= 0
##$PH_mod= 1
##$PKNL= yes
##$PPARMOD= 0
##$PPDIAG= 0
##$PPIPTYP= 0
##$PPMPNUM= 2147483647
##$PPRESOL= 1
##$PSCAL= 4
##$PSIGN= 0
##$PYNMP= <proc.py>
##$REVERSE= no
##$SF= 400.13
##$SI= 131072
##$SIGF1= 0
##$SIGF2= 0
##$SINO= 400
##$SIOLD= 131072
##$SPECTYP= <>
##$SREGLST= <1H.CDCl3>
##$SSB= 0
##$STSI= 131072
##$STSR= 0
##$SW_p= 8223.68421052632
##$SYMM= 0
##$S_DEV= 0
##$TDeff= 65536
##$TDoff= 0
##$TI= <>
##$TILT= no
##$TM1= 0
##$TM2= 0
##$TOPLEV= 0
##$USERP1= <user>
##$USERP2= <user>
##$USERP3= <user>
##$USERP4= <user>
##$USERP5= <user>
##$WDW= 1
##$XDIM= 131072
##$YMAX_p= 523022974
##$YMIN_p= -453076899
##$CURPLOT= <Network HP LaserJet P1505>
##$CURPRIN= <$Network HP LaserJet P1505>
##$DFORMAT= <normdp>
##$LAYOUT= <+/1D_H.xwp>
##$LFORMAT= <normlp>
##$PFORMAT= <normpl>
##$SURQMSG= 1
$$ End of Bruker specific parameters
$$ ---------------------------------
##NTUPLES= NMR SPECTRUM
##VAR_NAME=  FREQUENCY,     SPECTRUM/REAL,   SPECTRUM/IMAG
##SYMBOL=    X,             R,               I
##VAR_TYPE=  INDEPENDENT,   DEPENDENT,       DEPENDENT
##VAR_FORM=  AFFN,          ASDF,            ASDF
##VAR_DIM=   131072,        131072,          131072
##UNITS=     HZ,            ARBITRARY UNITS, ARBITRARY UNITS
##FACTOR=    0.0627417313425165, 1,          1
##FIRST=     8223.62146879498, -7400,        -85668
##LAST=      0,             -4931,           -88396
##MIN=       0,             -453076899,      0
##MAX=       8223.62146879498, 523022974,    0
$$ Real data points
##PAGE= N=1
##DATA TABLE= (X++(R..R)), XYDATA
$$ [...]
$$ plain form
60651 1434922 1424874 1416156 1409207 1404217 1400354 1396242 1391591 1387702 1385852 1385666 1385490 1383991 1381089 1377644
60637 1377644 1374376 1370760 1365024 1355848 1343890 1330842 1317320 1302944 1288307 1274948 1262726 1249095
60625 1249095 1232330 1214160 1197656 1183501 1170022 1156318 1143529 1132971 1124589 1117656 1111911 1107447
60613 1107447 1104209 1102138 1101402 1102069 1103794 1106260 1109851 1115556 1123896 1133972 1143904 1152371 1159541 1166408
60599 1166408 1173818 1182439 1192862 1204831 1216799 1227204 1235959 1243930 1251504 1258781 1266623 1275946 1286249
60586 1286249 1296456 1307063 1319604 1333869 1347750 1360421 1373596 1388660 1404498 1419583 1434544
60575 1434544 1451080 1469523 1489101 1509643 1531332 1553342 1574241 1593438 1611113 1627037 1640600
60564 1640600 1651750 1660978 1668480 1673856 1676260 1674476 1667609 1656295 1642545 1627815 1612065 1595186
$$ packed form
60651A434922j0048q718o949m990l863m112m651l889j850j86j76j499k902l445
60637A377644l268l616n736r176j1958j3048j3522j4376j4637j3359j2222j3631
60625A249095j6765j8170j6504j4155j3479j3704j2789j0558q382o933n745m464
60613A107447l238k071p36O67J725K466L591N705Q340J0076R932Q467P170O867
60599A166408P410Q621J0423J1969J1968J0405Q755P971P574P277P842R323J0303
60586A286249J0207J0607J2541J4265J3881J2671J3175J5064J5838J5085J4961
60575A434544J6536J8443J9578K0542K1689K2010K0899J9197J7675J5924J3563
60564A640600J1150R228P502N376K404j784o867j1314j3750j4730j5750j6879
$$ plain form
60552 1595186 1578117 1561625 1545216 1528497 1512692 1499516 1489303 1481602 1476832 1475778 1477839 1481229
60540 1481229 1484907 1489265 1495147 1503175 1513681 1526077 1538482 1549092 1557934 1566365 1574848 1582089 1586466
60527 1586466 1587727 1587322 1587446 1589530 1593248 1597322 1601488 1606946 1614358 1622288 1628417 1631736 1632808 1632580 1631784
60512 1631784 1630843 1629343 1626002 1620055 1612378 1604595 1597388 1590115 1581618 1571097 1558920 1546893 1536708
60499 1536708 1527869 1518451 1508361 1500030 1494890 1491138 1486737 1482984 1482797 1486494 1491671 1496952 1503674 1513750
60485 1513750 1527599 1544468 1563664 1585307 1610604 1640955 1676040 1713697 1752835 1795509 1844680
60474 1844680 1900946 1963199 2031495 2107041 2189772 2278096 2370729 2466555 2562407 2652862 2732608
60463 2732608 2797798 2845480 2873882 2883813 2878410 2861318 2836284 2808127 2782195 2762367 2750570 2747768
$$ packed form
60552A595186j7069j6492j6409j6719j5805j3176j0213p701m770j054K061L390
60540A481229L678M358N882Q028J0506J2396J2405J0610Q842Q431Q483P241M377
60527A586466J261m05J24K084L718M074M166N458P412P930O129L319J072k28p96
60512A631784r41j500l341n947p677p783p207p273q497j0521j2177j2027j0185
60499A536708q839r418j0090q331n140l752m401l753j87L697N177N281O722J0076
60485A513750J3849J6869J9196K1643K5297L0351L5085L7657L9138M2674M9171
60474A844680N6266O2253O8296P5546Q2731Q8324R2633R5826R5852R0455P9746
60463B732608O5190M7682K8402R931n403j7092k5034k8157k5932j9828j1797k802
$$ plain form
60451 2747768 2753907 2767437 2786920 2812800 2845632 2882913 2920243 2955667 2990405 3025277 3059431
60440 3059431 3093389 3130211 3172144 3218706 3269988 3329564 3401897 3488540 3589188 3705216 3839842
60429 3839842 3995582 4173750 4376129 4605051 4861594 5145223 5455472 5792851 6157963
60420 6157963 6550899 6972173 7423768 7908727 8429564 8986651 9576857 10191672 10814131
60411 10814131 11416221 11960381 12406314 12718950 12872542 12851515 12652393 12287029 11782393
60402 11782393 11174729 10501930 9798344 9092167 8404274 7748858 7135473 6570074 6054431
60393 6054431 5586446 5162625 4780250 4437095 4130112 3855266 3608379 3385958 3185724
60384 3185724 3006469 2846832 2704356 2576524 2462224 2360715 2269398 2184508 2104384 2030215
$$ packed form
60451B747768O139J3530J9483K5880L2832L7281L7330L5424L4738L4872L4154
60440C059431L3958L6822M1933M6562N1282N9576P2333Q6643J00648J16028J34626
60429C839842J55740J78168K02379K28922K56543K83629L10249L37379L65112
60420F157963L92936M21274M51595M84959N20837N57087N90206O14815O22459
60411A0814131O02090N44160M45933L12636J53592k1027j99122l65364n04636
60402A1782393o07664o72799p03586p06177o87893o55416o13385n65399n15643
60393F054431m67985m23821l82375l43155l06983k74846k46887k22421k00234
60384C185724j79255j59637j42476j27832j14300j01509r1317q4890q0124p4169
$$ plain form
60374 2030215 1962952 1901326 1843626 1789470 1738585 1689748 1642713 1599788 1563402 1532797 1504879
60363 1504879 1477802 1452101 1428631 1407177 1387306 1369343 1353943 1341199 1330356 1320225 1310103
60352 1310103 1300436 1292112 1284962 1277771 1270089 1263052 1257838 1254191 1251140 1248347 1246062 1244517 1243948 1244309
60338 1244309 1244448 1242875 1240251 1239736 1243563 1250263 1256632 1261369 1265206 1268448 1270513 1271581 1272563 1273216 1272003
60323 1272003 1268358 1263757 1259933 1256992 1253775 1249279 1243278 1236149 1228493 1220710 1212821 1204988 1197923 1192351
60309 1192351 1188384 1186074 1186125 1189062 1193787 1198023 1200483 1201888 1203614 1206083 1208845 1211556 1214287 1217032
60295 1217032 1219435 1221134 1222258 1223453 1225372 1228214 1231846 1236198 1241195 1246444 1251530 1256693 1262728 1270080
60281 1270080 1278429 1287165 1295748 1303712 1311139 1319156 1328961 1340057 1350337 1358256 1364030 1368472 1371932
$$ packed form
60374B030215o7263o1626n7700n4156n0885m8837m7035m2925l6386l0605k7918
60363A504879k7077k5701k3470k1454j9871j7963j5400j2744j0843j0131j0122
60352A310103r667q324p150p191p682p037n214l647l051k793k285j545n69L61
60338A244309J39j573k624n15L827O700O369M737L837L242K065J068R82O53j213
60323A272003l645m601l824k941l217m496o001p129p656p783p889p833p065n572
60309A192351l967k310N1K937M725M236K460J405J726K469K762K711K731K745
60295A217032K403J699J124J195J919K842L632M352M997N249N086N163O035P352
60281A270080Q349Q736Q583P964P427Q017R805J1096J0280P919N774M442L460
$$ plain form
60268 1371932 1374996 1378901 1384189 1389966 1395544 1401930 1410522 1421097 1432275 1443204 1453433 1461776 1467012
60255 1467012 1469557 1470999 1471832 1470828 1466680 1459197 1448988 1437318 1426541 1419205 1415800 1413999 1410923
60242 1410923 1406007 1401339 1399395 1400744 1403919 1407305 1410776 1415240 1421050 1427855 1435914 1446162 1458274
60229 1458274 1469953 1479321 1487164 1495510 1504719 1513448 1521150 1528935 1537793 1547204 1555848 1562917 1568707 1574669
60215 1574669 1582710 1593418 1604999 1614907 1622675 1630439 1640895 1655658 1675267 1699371 1726646 1755658
60203 1755658 1786244 1819271 1855060 1893074 1933291 1976711 2024115 2075373 2130373 2189711 2254084
60192 2254084 2323993 2400455 2484928 2577851 2678106 2784604 2897667 3018235 3146567 3282549
60182 3282549 3426541 3578801 3738464 3903901 4073946 4247804 4423654 4597956 4766466
$$ packed form
60268A371932L064L905N288N777N578O386Q592J0575J1178J0929J0229Q343N236
60255A467012K545J442Q33j004m148p483j0209j1670j0777p336l405j801l076
60242A410923m916m668j944J349L175L386L471M464N810O805Q059J0248J2112
60229A458274J1679R368P843Q346R209Q729P702P785Q858R411Q644P069N790N962
60215A574669Q041J0708J1581R908P768P764J0456J4763J9609K4104K7275K9012
60203A755658L0586L3027L5789L8014M0217M3420M7404N1258N5000N9338O4373
60192B254084O9909P6462Q4473R2923J00255J06498J13063J20568J28332J35982
60182C282549J43992J52260J59663J65437J70045J73858J75850J74302J68510
$$ plain form
60173 4766466 4925837 5074382 5211494 5336254 5446606 5540073 5615225 5672021 5710915 5732501
60163 5732501 5738253 5730690 5712089 5683685 5646839 5604417 5560191 5517220 5477665 5443942 5419056 5405590
60151 5405590 5405050 5418303 5446107 5489115 5547975 5623513 5716201 5825151 5948198 6083214 6228904
60140 6228904 6383904 6545613 6710255 6873704 7031795 7180406 7316090 7436568 7540020
60131 7540020 7624016 7685842 7723893 7738128 7729254 7698376 7647652 7580324 7499509 7407571 7307190
60120 7307190 7202319 7097472 6996806 6904551 6825259 6762125 6715550 6684913 6671670 6679137 6708985
60109 6708985 6759519 6827945 6912818 7013290 7127211 7251243 7382040 7515907 7647584 7770647
60099 7770647 7879504 7970757 8043110 8096716 8132518 8151678 8155616 8146678 8128223 8103633 8075887
$$ packed form
60173D766466J59371J48545J37112J24760J10352R3467P5152N6796L8894K1586
60163E732501N752p563j8601k8404l6846m2422m4226m2971l9555l3723k4886j3466
60151E405590n40J3253K7804M3008N8860P5538R2688J08950J23047J35016J45690
60140F228904J55000J61709J64642J63449J58091J48611J35684J20478J03452
60131G540020Q3996O1826L8051J4235q874l0878n0724o7328q0815r1938j00381
60120G307190j04871j04847j00666r2255p9292o3134m6575l0637j3243P467K9848
60109F708985N0534O8426Q4873J00472J13921J24032J30797J33867J31677J23063
60099G770647J08857R1253P2353N3606L5802J9160L938q938j8455k4590k7746
$$ plain form
60088 8075887 8048631 8026815 8015208 8016668 8032873 8066464 8121303 8200539 8305436 8436397 8594393
60077 8594393 8781133 8998535 9248461 9532571 9851994 10207098 10597450 11021652 11477337
60068 11477337 11961651 12471522 13002825 13549200 14102186 14652518 15190854 15707359 16191613
60059 16191613 16633828 17026133 17362277 17636143 17841090 17971209 18023311 17997408 17895281 17719123
60049 17719123 17472247 17161007 16795315 16387005 15948015 15490024 15024873 14564493 14120223
60040 14120223 13701886 13316700 12968868 12660985 12396215 12178284 12008986 11886689 11808176
60031 11808176 11771220 11774309 11814407 11886199 11983394 12099710 12228556 12362735 12494845 12617541
60021 12617541 12723423 12805461 12858015 12877534 12862497 12813006 12730125 12615169 12469763 12296769
$$ packed form
60088H075887k7256k1816j1607J460J6205L3591N4839P9236J04897J30961J57996
60077H594393J86740K17402K49926K84110L19423L55104L90352M24202M55685
60068A1477337M84314N09871N31303N46375N52986N50332N38336N16505M84254
60059A6191613M42215L92305L36144K73866K04947J30119N2102k5903j02127j76158
60049A7719123k46876l11240l65692m08310m38990m57991m65151m60380m44270
60040A4120223m18337l85186l47832l07883k64770k17931j69298j22297p8513
60031A1808176l6956L089M0098P1792R7195J16316J28846J34179J32110J22696
60021A2617541J05882Q2038N2554J9519j5037m9491q2881j14956j45406j72994
$$ plain form
60011 12296769 12100597 11885933 11656420 11415008 11165077 10910439 10654618 10401110 10154239
60002 10154239 9918691 9697838 9492959 9304238 9132073 8977372 8841068 8723657 8625413
59993 8625413 8547399 8492287 8463349 8461905 8486055 8532400 8598664 8684247 8788842 8911153 9048214
59982 9048214 9194914 9344516 9490607 9628406 9753657 9861098 9945405 10003274 10033360 10034483
59972 10034483 10005462 9946759 9860721 9749738 9615398 9459989 9287802 9104445 8915779 8727802
59962 8727802 8546168 8374701 8215025 8068409 7937447 7825129 7732876 7660447 7607684 7575721
59952 7575721 7566557 7582002 7622965 7689306 7780223 7894986 8033247 8194503 8377237 8578608
59942 8578608 8794799 9021526 9254230 9487848 9716462 9933460 10132299 10307182 10453196
$$ packed form
60011A2296769j96172k14664k29513k41412k49931k54638k55821k53508k46871
60002A0154239k35548k20853k04879j88721j72165j54701j36304j17411r8244
59993H625413p8014n5112k8938j444K4150M6345O6264Q5583J04595J22311J37061
59982I048214J46700J49602J46091J37799J25251J07441Q4307N7869L0086J123
59972A0034483k9021n8703q6038j10983j34340j55409j72187j83357j88666j87977
59962H727802j81634j71467j59676j46616j30962j12318r2253p2429n2763l1963
59952G575721r164J5445M0963O6341R0917J14763J38261J61256J82734K01371
59942H578608K16191K26727K32704K33618K28614K16998J98839J74883J46014
$$ plain form
59933 10453196 10566400 10644311 10686153 10692186 10662835 10598828 10502151 10376622 10227620 10061296
59923 10061296 9883632 9699896 9515187 9335607 9168167 9018688 8889902 8781995 8694892
59914 8694892 8629666 8588190 8572082 8581793 8616136 8672757 8749410 8844618 8956928 9084096 9223524
59903 9223524 9372898 9529726 9690672 9852144 10011311 10165897 10313288 10450512 10575098
59894 10575098 10685682 10782385 10867107 10942864 11012202 11076834 11139348 11204412 11277525 11363423 11466569
59883 11466569 11592130 11745146 11929465 12148676 12406961 12707403 13050198 13434335 13860066
59874 13860066 14327220 14831234 15363047 15912708 16470438 17023590 17555053 18045869 18477891
59865 18477891 18833502 19095575 19250362 19290458 19214950 19028486 18741338 18368752 17928131 17436463
$$ packed form
59933A0453196J13204P7911M1842O033k9351o4007r6677j25529j49002j66324
59923A0061296j77664j83736j84709j79580j67440j49479j28786j07907q7103
59914H694892o5226m1476j6108R711L4343N6621P6653R5208J12310J27168J39428
59903I223524J49374J56828J60946J61472J59167J54586J47391J37224J24586
59894A0575098J10584R6703Q4722P5757O9338O4632O2514O5064P3113Q5898J03146
59883A1466569J25561J53016J84319K19211K58285L00442L42795L84137M25731
59874A3860066M67154N04014N31813N49661N57730N53152N31463M90816M32022
59865A8477891L55611K62073J54787M0096p5508j86464k87148l72586m40621m91668
$$ plain form
59855 17436463 16910102 16365138 15816501 15277171 14758619 14270673 13819995 13409868 13042552
59846 13042552 12720994 12447483 12221940 12043020 11910072 11822827 11779992 11779579 11820053 11899671
59836 11899671 12014716 12159372 12327148 12511502 12705265 12900216 13086927 13254290 13389760
59827 13389760 13481405 13520199 13500221 13417666 13271068 13062571 12797833 12484174 12129183 11741119
59817 11741119 11329732 10905759 10479129 10057395 9645779 9248690 8870886 8516802 8188999
59808 8188999 7888025 7613719 7365788 7143026 6943217 6764504 6606042 6466555 6343051
59799 6343051 6231930 6130793 6038164 5951869 5868986 5787637 5708011 5631374 5558691 5490520 5427709
59788 5427709 5371556 5323167 5282760 5249604 5222393 5199395 5178258 5156128 5130470 5099694 5062788
$$ packed form
59855A7436463n26361n44964n48637n39330n18552m87946m50678m10127l67316
59846A3042552l21558k73511k25543j78920j32948q7245m2835m13M0474P9618
59836A1899671J15045J44656J67776J84354J93763J94951J86711J67363J35470
59827A3389760R1645L8794j9978q2555j46598k08497k64738l13659l54991l88064
59817A1741119m11387m23973m26630m21734m11616l97089l77804l54084l27803
59808H188999l00974k74306k47931k22762j99809j78713j58462j39487j23504
59799F343051j11121j01137r2629q6295q2883q1349p9626p6637p2683o8171o2811
59788E427709n6153m8389m0407l3156k7211k2998k1137k2130k5658l0776l6906
$$ plain form
59777 5062788 5018717 4966847 4907950 4844274 4778461 4712626 4648308 4586899 4530041 4479632 4437014
59766 4437014 4402021 4373680 4352455 4340929 4341206 4352451 4372346 4400456 4438537 4487726 4547198 4615865
59754 4615865 4693864 4781780 4879441 4985775 5098795 5215560 5333167 5449786 5563469 5670167
59744 5670167 5764750 5844521 5910363 5964303 6007787 6042928 6073479 6103205 6134190 6167226 6202535
59733 6202535 6239733 6279025 6323594 6379387 6451574 6542531 6654015 6789318 6951763 7142683
59723 7142683 7362593 7613172 7896464 8213270 8563930 8949470 9369870 9821397 10296616
59714 10296616 10785509 11274036 11741380 12160345 12501778 12740386 12860244 12858777 12746654 12543100
59704 12543100 12270834 11953965 11616440 11278258 10952618 10647751 10370370 10125616 9915224
$$ packed form
59777E062788m4071n1870n8897o3676o5813o5835o4318o1409n6858n0409m2618
59766D437014l4993k8341k1225j1526K77J1245J9895K8110L8081M9189N9472O8667
59754D615865P7999Q7916R7661J06334J13020J16765J17607J16619J13683J06698
59744E670167R4583P9771O5842N3940M3484L5141L0551K9726L0985L3036L5309
59733F202535L7198L9292M4569N5793P2187R0957J11484J35303J62445J90920
59723G142683K19910K50579K83292L16806L50660L85540M20400M51527M75219
59714A0296616M88893M88527M67344M18965L41433K38608J19858j467j12123k03554
59704A2543100k72266l16869l37525l38182l25640l04867k77381k44754k10392
$$ plain form
59695 9915224 9738919 9597631 9493019 9424119 9387322 9380253 9403363 9456955 9538940 9646932 9780932
59684 9780932 9942563 10132733 10351316 10598385 10874721 11181527 11520386 11893176 12301483
59675 12301483 12746389 13228974 13750635 14312920 14917714 15567657 16265388 17011912 17806233
59666 17806233 18646815 19532537 20461360 21428147 22424068 23437889 24457573 25471006 26466191
59657 26466191 27432068 28360541 29248607 30098819 30917935 31715283 32501680 33288186 34084637
59648 34084637 34899028 35737441 36602636 37491575 38394861 39298798 40186709 41037893 41827753
59639 41827753 42531875 43130591 43609744 43959510 44175722 44262822 44233987 44108068 43907104 43655537
59629 43655537 43378783 43100909 42843823 42628043 42472520 42393201 42402760 42511849 42729543 43062597
$$ packed form
59695I915224j76305j41288j04612o8900l6797p069K3110N3592Q1985J07992J34000
59684I780932J61631J90170K18583K47069K76336L06806L38859L72790M08307
59675A2301483M44906M82585N21661N62285O04794O49943O97731P46524P94321
59666A7806233Q40582Q85722R28823R66787R95921J013821J019684J013433R95185
59657B6466191R65877R28473Q88066Q50212Q19116P97348P86397P86506P96451
59648C4084637Q14391Q38413Q65195Q88939R03286R03937Q87911Q51184P89860
59639D1827753P04122N98716M79153L49766K16212Q7100k8835j25919k00964k51567
59629D3655537k76754k77874k57086k15780j55523p9319R559J09089K17694L33054
$$ plain form
59619 43062597 43515434 44090896 44789525 45607730 46537614 47568311 48685265 49866692 51081136
59610 51081136 52288503 53442071 54489147 55372462 56035173 56428033 56515075 56276785 55712101
59601 55712101 54839533 53695858 52331472 50803385 49168269 47477571 45775453 44098516
59593 44098516 42475699 40927607 39465436 38089940 36791117 35549557 34339679 33134152
59585 33134152 31908898 30648300 29348953 28019522 26676607 25339694 24027787 22757330
59577 22757330 21540657 20385971 19299075 18284479 17344227 16476528 15676851 14940446 14263611
59568 14263611 13643368 13076950 12561334 12092484 11665437 11275833 10921115 10599698 10309418
59559 10309418 10047306 9810329 9595781 9401375 9225264 9065209 8917406 8777151 8640974
$$ packed form
59619D3062597M52837N75462O98629Q18205R29884J030697J116954J181427J214444
59610E1081136J207367J153568J047076Q83315O62711L92860Q7042k38290n64684
59601E5712101q72568j143675j364386j528087j635116j690698j702118j676937
59593D4098516j622817j548092j462171j375496j298823j241560j209878j205527
59585C3134152j225254j260598j299347j329431j342915j336913j311907j270457
59577B2757330j216673j154686j086896j014596r40252q67699p99677p36405o76835
59568A4263611o20243n66418n15616m68850m27047l89604l54718l21417k90280
59559A0309418k62112k36977k14548j94406j76111j60055j47803j40255j36177
$$ plain form
59550 8640974 8506943 8372552 8234276 8090261 7941625 7789679 7633675 7473129 7310599
59541 7310599 7149796 6992265 6838457 6690857 6552994 6425692 6307171 6196863 6096607
59532 6096607 6007912 5930625 5864759 5811274 5770374 5741028 5722790 5716180 5720662 5734103 5755026 5783697
59520 5783697 5820154 5862680 5909071 5958232 6009868 6063799 6120136 6179046 6239946 6302117 6366534
59509 6366534 6436000 6513090 6598868 6693579 6797459 6910946 7035465 7173947 7329178 7501672
59499 7501672 7690649 7896872 8122686 8369342 8636462 8924393 9234887 9568764 9924690
59490 9924690 10300860 10696012 11108121 11533894 11970227 12414319 12861599 13305358 13739347
59481 13739347 14159238 14561073 14940454 15294385 15622155 15923404 16197096 16443522 16665390
$$ packed form
59550H640974j34031j34391j38276j44015j48636j51946j56004j60546j62530
59541G310599j60803j57531j53808j47600j37863j27302j18521j10308j00256
59532F096607q8695p7287o5866n3485m0900k9346j8238o610M482J3441K0923K8671
59520E783697L6457M2526M6391M9161N1636N3931N6337N8910O0900O2171O4417
59509F366534O9466P7090Q5778R4711J03880J13487J24519J38482J55231J72494
59499G501672J88977K06223K25814K46656K67120K87931L10494L33877L55926
59490I924690L76170L95152M12109M25773M36333M44092M47280M43759M33989
59481A3739347M19891M01835L79381L53931L27770L01249K73692K46426K21868
$$ plain form
59472 16665390 16865294 17043418 17199028 17333168 17449017 17551256 17646334 17741835 17843819 17955312
59462 17955312 18077650 18211132 18352668 18493913 18623016 18727211 18793261 18807964 18760934 18646371
59452 18646371 18460967 18201641 17867367 17462318 16995289 16476487 15916205 15325622 14716807
59443 14716807 14101749 13492120 12898959 12330986 11793477 11289666 10822486 10393923 10003728
59434 10003728 9650435 9333121 9051051 8802506 8585565 8399514 8244050 8117539 8017474
59425 8017474 7942302 7891472 7864135 7859345 7877546 7920493 7989440 8084109 8203369 8346263 8512550
59414 8512550 8702778 8917519 9156030 9416113 9695518 9992577 10304722 10627151 10953499
59405 10953499 11276841 11589300 11881649 12144176 12367166 12540229 12653028 12698379 12674078 12581110
$$ packed form
59472A6665390J99904J78124J55610J34140J15849J02239R5078R5501J01984J11493
59462A7955312J22338J33482J41536J41245J29103J04195O6050J4703m7030j14563
59452A8646371j85404k59326l34274m05049m67029n18802n60282n90583o08815
59443A4716807o15058o09629n93161n67973n37509n03811m67180m28563l90195
59434A0003728l53293l17314k82070k48545k16941j86051j55464j26511j00065
59425H017474p5172n0830k7337m790J8201M2947O8947R4669J19260J42894J66287
59414H512550J90228K14741K38511K60083K79405K97059L12145L22429L26348
59405A0953499L23342L12459K92349K62527K22990J73063J12799M5351k4301r2968
$$ plain form
59395 12581110 12421734 12200596 11925995 11607832 11254931 10875592 10479191 10074847 9669212
59386 9669212 9267549 8876108 8500961 8144811 7807323 7488780 7191384 6916889 6665092
59377 6665092 6435151 6226490 6037718 5866236 5709931 5568375 5441933 5330594 5233978 5151463
59367 5151463 5081857 5023774 4976685 4941017 4916977 4903731 4899682 4903146 4913084 4929734 4954016 4985703
59355 4985703 5022955 5064629 5112164 5167967 5232781 5306169 5388487 5479807 5576922 5673957 5767093
59344 5767093 5857574 5949987 6049349 6160155 6285995 6428472 6587500 6763675 6959266 7175656
59334 7175656 7410807 7660846 7924330 8204399 8507204 8839056 9204771 9607525 10049530
59325 10049530 10532895 11060069 11633534 12254956 12924348 13639694 14397132 15190906 16012389
$$ packed form
59395A2581110j59376k21138k74601l18163l52901l79339l96401m04344m05635
59386I669212m01663l91441l75147l56150l37488l18543k97396k74495k51797
59377F665092k29941k08661j88772j71482j56305j41556j26442j11339r6616q2515
59367E151463o9606n8083m7089l5668k4040j3246m049L464R938J6650K4282L1687
59355D985703L7252M1674M7535N5803O4814P3388Q2318R1320R7115R7035R3136
59344E767093R0481R2413R9362J10806J25840J42477J59028J76175J95591K16390
59334G175656K35151K50039K63484K80069L02805L31852L65715M02754M42005
59325A0049530M83365N27174N73465O21422O69392P15346P57438P93774Q21483
$$ plain form
59316 16012389 16849103 17685809 18507556 19301650 20056753 20761571 21406137 21984515 22495470
59307 22495470 22940740 23323386 23647269 23916273 24132938 24297735 24409455 24465852 24464241 24402287
59297 24402287 24278358 24091099 23839720 23526136 23156803 22741460 22290002 21811214 21313799
59288 21313799 20806465 20295727 19784072 19270745 18753838 18231300 17700847 17160284 16608863
59279 16608863 16048812 15485672 14926746 14378621 13845900 13332046 12840651 12375370 11939041
59270 11939041 11533552 11160392 10820633 10514234 10239738 9994841 9777535 9587096 9423926
59261 9423926 9287796 9176311 9086168 9016233 8968102 8942833 8938202 8950202 8976184 9015020 9064841
59250 9064841 9122339 9184361 9248792 9313594 9375802 9431719 9477582 9510225 9527863 9530229 9517589
$$ packed form
59316A6012389Q36714Q36706Q21747P94094P55103P04818O44566N78378N10955
59307B2495470M45270L82646L23883K69004K16665J64797J11720N6397j611o1954
59297B4402287j23929j87259k51379l13584l69333m15343m51458m78788m97415
59288B1313799n07334n10738n11655n13327n16907n22538n30453n40563n51421
59279A6608863n60051n63140n58926n48125n32721n13854m91395m65281m36329
59270A1939041m05489l73160l39759l06399k74496k44897k17306j90439j63170
59261I423926j36130j11485r0143o9935m8131k5269m631J2000K5982L8836M9821
59250I064841N7498O2022O4431O4802O2208N5917M5863L2643J7638K366j2640
$$ plain form
59239 9517589 9490061 9448435 9395032 9332833 9264353 9192321 9120859 9054603 8996789 8949292 8914258
59228 8914258 8894413 8891752 8907262 8942128 8998081 9076208 9176280 9297494 9438922 9598949 9775214
59217 9775214 9965793 10169875 10386510 10612594 10842239 11068232 11284253 11485872 11669434
59208 11669434 11830428 11963827 12066292 12137419 12178745 12192505 12181632 12149622 12099420 12033284
59198 12033284 11954491 11867964 11777943 11685891 11591638 11495095 11394870 11286072 11162212 11020189
59188 11020189 10862586 10695395 10524805 10355892 10192560 10037915 9895219 9768342 9660597
59179 9660597 9573767 9509515 9471209 9462868 9486688 9543334 9634564 9763624 9932858 10142710 10393559
59168 10393559 10686631 11022050 11397223 11807965 12249826 12716746 13198780 13682086 14150951
$$ packed form
59239I517589k7528m1626n3403o2199o8480p2032p1462o6256n7814m7497l5034
59228H914258j9845k661J5510L4866N5953P8127J00072J21214J41428J60027J76265
59217I775214J90579K04082K16635K26084K29645K25993K16021K01619J83562
59208A1669434J60994J33399J02465P1127M1326J3760j0873l2010n0202o6136
59198A2033284p8793q6527r0021r2052r4253r6543j00225j08798j23860j42023
59188A1020189j57603j67191j70590j68913j63332j54645j42696j26877j07745
59179I660597q6830o4252l8306q341K3820N6646R1230J29060J69234K09852K50849
59168A0393559K93072L35419L75173M10742M41861M66920M82034M83306M68865
$$ plain form
59159 14150951 14589263 14980630 15308509 15557404 15714764 15772284 15725713 15573862 15318662 14966676
59149 14966676 14530023 14024994 13469612 12881986 12279170 11675645 11082496 10508331 9960401
59140 9960401 9444114 8962231 8515673 8104762 7728998 7386505 7075197 6794172 6542737
59131 6542737 6318327 6116782 5934740 5770914 5625204 5497435 5386739 5291192 5208292 5136526
59121 5136526 5076108 5027473 4989745 4961430 4941648 4929620 4924228 4925706 4936664 4959256 4991842 5030390
59109 5030390 5072782 5119793 5172394 5230609 5295147 5367730 5449052 5538178 5634452 5738358 5849979
59098 5849979 5968161 6091825 6220736 6354395 6491104 6628363 6763188 6892194 7012667
59089 7012667 7123481 7223665 7310508 7380860 7434162 7472183 7495681 7503441 7495020 7472320 7437765
$$ packed form
59159A4150951M38312L91367L27879K48895J57360N7520m6571j51851k55200l51986
59149A4966676m36653n05029n55382n87626o02816o03525n93149n74165n47930
59140I960401n16287m81883m46558m10911l75764l42493l11308k81025k51435
59131F542737k24410k01545j82042j63826j45710j27769j10696r5547q2900p1766
59121E136526o0418m8635l7728k8315j9782j2028n392J478J0958K2592L2586L8548
59109E030390M2392M7011N2601N8215O4538P2583Q1322Q9126R6274J03906J11621
59098E849979J18182J23664J28911J33659J36709J37259J34825J29006J20473
59089G012667J10814J00184Q6843P0352N3302L8021K3498P760q421k2700l4555
$$ plain form
59078 7437765 7392919 7339929 7282825 7226192 7173465 7127053 7088928 7060495 7042775 7037072 7044643 7066018
59066 7066018 7102097 7155752 7230415 7326862 7443074 7577580 7731195 7905289 8100357 8316742
59056 8316742 8554656 8812684 9088109 9379678 9688420 10014904 10357152 10711724 11074844
59047 11074844 11441340 11804004 12154906 12485925 12787294 13047593 13256467 13406196 13490236
59038 13490236 13502676 13441076 13308596 13111845 12857589 12552581 12204898 11823455 11416495 10991487
59028 10991487 10555686 10115558 9676011 9240911 8813968 8398826 7998928 7617383 7255914
59019 7255914 6913923 6589850 6283629 5996534 5728823 5479321 5247361 5032908 4834397
59010 4834397 4648849 4475028 4314270 4167175 4031663 3905493 3788503 3680780 3580605
$$ packed form
59078G437765m4846n2990n7104n6633n2727m6412l8125k8433j7720n703P571K1375
59066G066018L6079N3655P4663R6447J16212J34506J53615J74094J95068K16385
59056H316742K37914K58028K75425K91569L08742L26484L42248L54572L63120
59047A1074844L66496L62664L50902L31019L01369K60299K08874J49729Q4040
59038A3490236J2440o1600j32480j96751k54256l05008l47683l81443m06960m25008
59028A0991487m35801m40128m39547m35100m26943m15142l99898l81545l61469
59019G255914l41991l24073l06221k87095k67711k49502k31960k14453j98511
59010D834397j85548j73821j60758j47095j35512j26170j16990j07723j00175
$$ plain form
59001 3580605 3486017 3396918 3314016 3237075 3165624 3099945 3039855 2983897 2931167 2882545 2838651
58990 2838651 2797932 2758281 2719297 2681672 2645741 2611982 2581412 2554077 2528721 2505343 2486179
58979 2486179 2472402 2461768 2451705 2442930 2437570 2435239 2433867 2433413 2435855 2442062 2451309 2463549 2479422
58966 2479422 2497925 2516409 2533268 2548773 2563064 2575130 2584166 2590415 2594371 2596249 2596423 2595404 2593527
58953 2593527 2591613 2591523 2594876 2601614 2610998 2623371 2639412 2658079 2677014 2694919 2711949 2727560 2739523
58940 2739523 2745599 2745392 2740380 2733005 2725695 2719748 2714747 2709524 2703766 2698359 2694410 2692424 2692394 2694356 2699046
58925 2699046 2707894 2721673 2739169 2758235 2778440 2801475 2828640 2859371 2892810 2929153 2968359
58914 2968359 3009042 3050057 3092141 3136744 3184285 3234735 3288693 3346455 3407073 3469860 3535845
$$ packed form
59001C580605r4588q9099q2902p6941p1451o5679o0090n5958n2730m8622m3894
58990B838651m0719l9651l8984l7625l5931l3759l0570k7335k5356k3378j9164
58979B486179j3777j0634j0063q775n360k331j372m54K442O207R247J2240J5873
58966B479422J8503J8484J6859J5505J4291J2066R036O249L956J878J74j019j877
58953B593527j914r0L353O738R384J2373J6041J8667J8935J7905J7030J5611J1963
58940B739523O076k07n012p375p310n947n001n223n758n407l949j986l0J962M690
58925B699046Q848J3779J7496J9066K0205K3035K7165L0731L3439L6343L9206
58914B968359M0683M1015M2084M4603M7541N0450N3958N7762O0618O2787O5985
$$ plain form
58903 3535845 3606164 3679870 3755008 3831276 3910097 3992453 4077980 4165808 4255200 4345875 4438765
58892 4438765 4535877 4638632 4747152 4861902 4984594 5116200 5255458 5401084 5554446 5718359
58882 5718359 5894131 6081612 6281420 6495215 6724047 6967986 7227196 7502281 7794151
58873 7794151 8104652 8436613 8792129 9171753 9576652 10010555 10478006 10981481 11521777
58864 11521777 12100438 12720360 13384735 14096767 14859335 15673157 16535833 17443861 18394403
58855 18394403 19383387 20402895 21441878 22487776 23524970 24532492 25485458 26358056
58847 26358056 27123619 27754118 28224141 28516731 28624225 28544801 28281626 27845651 27256112
58838 27256112 26536656 25711681 24805602 23842492 22844684 21832178 20823007 19832382 18871119
$$ packed form
58903C535845P0319P3706P5138P6268P8821Q2356Q5527Q7828Q9392R0675R2890
58892D438765R7112J02755J08520J14750J22692J31606J39258J45626J53362J63913
58882E718359J75772J87481J99808K13795K28832K43939K59210K75085K91870
58873G794151L10501L31961L55516L79624M04899M33903M67451N03475N40296
58864A1521777N78661O19922O64375P12032P62568Q13822Q62676R08028R50542
58855A8394403R88984J019508J038983J045898J037194J007522R52966Q72598
58847B6358056P65563O30499M70023K92590J07494p9424k63175m35975n89539
58838B7256112p19456q24975r06079r63110r97808j012506j009171r90625r61263
$$ plain form
58829 18871119 17946191 17062967 16225926 15437697 14699083 14010002 13369141 12773164 12218004
58820 12218004 11701014 11220624 10774275 10358207 9969135 9604989 9264505 8947267 8653331
58811 8653331 8381394 8128277 7891754 7672707 7472525 7289561 7120588 6964741 6823175
58802 6823175 6695342 6578713 6472319 6377820 6296499 6227424 6169062 6120665 6081745 6052159 6033154
58791 6033154 6026592 6032783 6050561 6079441 6120026 6172487 6236562 6312877 6402286 6504021 6616632
58780 6616632 6740758 6878839 7032008 7199370 7380525 7576594 7788413 8015816 8259310
58771 8259310 8520804 8802348 9105681 9432991 9786303 10166031 10572032 11006203 11472392
58762 11472392 11973917 12513133 13093249 13718155 14389964 15108487 15873246 16684246 17540620
$$ packed form
58829A8871119r24928q83224q37041p88229p38614o89081o40861n95977n55160
58820A2218004n16990m80390m46349m16068l89072l64146l40484l17238k93936
58811H653331k71937k53117k36523k19047k00182j82964j68973j55847j41566
58802F823175j27833j16629j06394r4499q1321o9075n8362m8397l8920k9586j9005
58791F033154o562O191J7778K8880M0585N2461O4075P6315Q9409J01735J12611
58780F616632J24126J38081J53169J67362J81155J96069K11819K27403K43494
58771H259310K61494K81544L03333L27310L53312L79728M06001M34171M66189
58762A1472392N01525N39216N80116O24906O71809P18523P64759Q11000Q56374
$$ plain form
58753 17540620 18440027 19378635 20349264 21339519 22333605 23315291 24266470 25163409 25977837
58744 25977837 26682410 27253211 27668217 27908307 27962077 27827929 27511463 27024019 26384309
58735 26384309 25617395 24749295 23803683 22803730 21773331 20734083 19702656 18691954 17712384
58726 17712384 16770639 15869867 15012910 14203686 13444292 12733130 12067491 11446010 10867040
58717 10867040 10326865 9821704 9350146 8911837 8504725 8124816 7767718 7429704 7108785
58708 7108785 6805593 6521803 6256927 6008214 5774092 5555598 5353547 5166443 4992289
58699 4992289 4830445 4680502 4541327 4412630 4295585 4190532 4095724 4009522 3931995 3862995
58689 3862995 3800609 3743092 3690802 3644616 3603871 3567238 3534177 3504135 3475660 3447621 3419941
$$ packed form
58753A7540620Q99407R38608R70629R90255R94086R81686R51179Q96939Q14428
58744B5977837P04573N70801M15006K40090N3770j34148l16466m87444o39710
58735B6384309p66914q68100r45612r99953j030399j039248j031427j010702r79570
58726A7712384r41745r00772q56957q09224p59394p11162o65639o21481n78970
58717A0867040n40175n05161m71558m38309m07112l79909l57098l38014l20919
58708G108785l03192k83790k64876k48713k34122k18494k02051j87104j74154
58699D992289j61844j49943j39175j28697j17045j05053r4808q6202p7527o9000
58689C862995o2386n7517n2290m6186m0745l6633l3061l0042k8475k8039k7680
$$ plain form
58678 3419941 3391846 3360903 3325280 3285717 3243907 3200196 3154236 3106766 3059183 3012076 2965194
58667 2965194 2918104 2870196 2820971 2770858 2720571 2669358 2615489 2559015 2502306 2447117 2392916
58656 2392916 2338873 2285644 2234162 2184515 2137090 2093061 2052605 2014252 1977105 1942066 1909895
58645 1909895 1879840 1851290 1824945 1801103 1778536 1756364 1735388 1716449 1699141 1683271 1669654
58634 1669654 1658088 1646458 1633468 1620569 1609642 1600364 1591473 1583098 1576100 1570274 1564730 1559038 1552909
58621 1552909 1545972 1538855 1533123 1529207 1525913 1522816 1521341 1522481 1525395 1529361 1534963 1541993 1548453 1553463
58607 1553463 1559193 1567880 1578564 1588731 1597780 1606937 1617010 1627913 1639296 1650126 1658796 1664994
58595 1664994 1670284 1675759 1680721 1684889 1690201 1698968 1711743 1728318 1749028 1773563 1800226 1827985
$$ packed form
58678C419941k8095l0943l5623l9563m1810m3711m5960m7470m7583m7107m6882
58667B965194m7090m7908m9225n0113n0287n1213n3869n6474n6709n5189n4201
58656B392916n4043n3229n1482m9647m7425m4029m0456l8353l7147l5039l2171
58645A909895l0055k8550k6345k3842k2567k2172k0976j8939j7308j5870j3617
58634A669654j1566j1630j2990j2899j0927r278q891q375o998n826n544n692o129
58621A552909o937p117n732l916l294l097j475J140K914L966N602P030O460N010
58607A553463N730Q687J0684J0167R049R157J0073J0903J1383J0830Q670O198
58595A664994N290N475M962M168N312Q767J2775J6575K0710K4535K6663K7759
$$ plain form
58583 1827985 1857746 1890388 1925467 1963298 2006054 2054834 2107553 2161885 2218708 2280661 2348877
58572 2348877 2423098 2503519 2590477 2683656 2783593 2892812 3013853 3147465 3294192 3455958
58562 3455958 3634264 3828461 4037740 4263350 4506945 4768121 5045275 5337185 5641657
58553 5641657 5953743 6266858 6574176 6867341 7135577 7367880 7554819 7687326 7756711 7758740
58543 7758740 7696328 7576384 7405774 7192104 6945802 6678180 6398386 6113979 5832353 5559009
58533 5559009 5295953 5044231 4806607 4585704 4381389 4192386 4018767 3860590 3716115
58524 3716115 3584021 3465623 3362211 3271910 3191775 3121129 3060072 3006571 2958191 2915059 2877978
58513 2877978 2845120 2813627 2783051 2754114 2725728 2696684 2668920 2645382 2625517 2606140 2585747
$$ packed form
58583A827985K9761L2642L5079L7831M2756M8780N2719N4332N6823O1953O8216
58572B348877P4221Q0421Q6958R3179R9937J09219J21041J33612J46727J61766
58562C455958J78306J94197K09279K25610K43595K61176K77154K91910L04472
58553E641657L12086L13115L07318K93165K68236K32303J86939J32507O9385K029
58543G758740o2412j19944j70610k13670k46302k67622k79794k84407k81626k73344
58533E559009k63056k51722k37624k20903k04315j89003j73619j58177j44475
58524C716115j32094j18398j03412r0301q0135p0646o1057n3501m8380m3132l7081
58513B877978l2858l1493l0576k8937k8386k9044k7764k3538j9865j9377k0393
$$ plain form
58502 2585747 2564460 2540665 2511511 2476543 2437493 2394791 2347544 2296891 2246247 2198011 2152472
58491 2152472 2109735 2070083 2032628 1996088 1960813 1927906 1896746 1865496 1833557 1801605 1770065
58480 1770065 1739465 1711026 1684583 1657370 1627467 1597083 1569638 1545028 1520900 1497289 1476413
58469 1476413 1458728 1442702 1427986 1415388 1403971 1391460 1377481 1363606 1350386 1337058 1323874
58458 1323874 1311957 1301124 1290418 1280411 1272431 1266001 1259562 1253230 1248503 1245976 1245628 1248176 1253483
58445 1253483 1258895 1262099 1264522 1269039 1275796 1283577 1293649 1308104 1325356 1341659 1356860 1374582
58433 1374582 1396603 1420796 1444850 1468407 1491139 1512017 1531083 1549137 1565318 1577481 1584899
58422 1584899 1588158 1586854 1580111 1568858 1554753 1537444 1515853 1491473 1467227 1443619 1419297 1394836
$$ packed form
58502B585747k1287k3795k9154l4968l9050m2702m7247n0653n0644m8236m5539
58491B152472m2737l9652l7455l6540l5275l2907l1160l1250l1939l1952l1540
58480A770065l0600k8439k6443k7213k9903l0384k7445k4610k4128k3611k0876
58469A476413j7685j6026j4716j2598j1417j2511j3979j3875j3220j3328j3184
58458A323874j1917j0833j0706j0007p980o430o439o332m727k527l48K548N307
58445A253483N412L204K423M517O757P781J0072J4455J7252J6303J5201J7722
58433A374582K2021K4193K4054K3557K2732K0878J9066J8054J6181J2163P418
58422A584899L259j304o743j1253j4105j7309k1591k4380k4246k3608k4322k4461
$$ plain form
58410 1394836 1372567 1352879 1333965 1315088 1297184 1280622 1265295 1252276 1242349 1233652 1223900 1213993
58398 1213993 1206177 1199840 1192951 1186550 1183620 1184119 1185280 1186411 1189244 1193875 1198553 1203387 1210207 1218832
58384 1218832 1227475 1236776 1249369 1265435 1282644 1300530 1320982 1344229 1368213 1391944 1415700 1437827
58372 1437827 1455249 1467366 1476040 1481979 1484652 1485167 1485292 1484103 1479618 1473140 1467804 1463541 1457949 1451361
58358 1451361 1446274 1442346 1437105 1431397 1428954 1430475 1433064 1435562 1439583 1445451 1452183 1461283 1475113 1491438
58344 1491438 1504920 1514075 1521307 1526450 1526496 1521926 1516729 1511370 1502286 1489499 1478115 1470541 1463446 1454483
58330 1454483 1446068 1440458 1436746 1434812 1436675 1441793 1446392 1449298 1453012 1457286 1457648 1452585 1446417 1442457
58316 1442457 1438908 1434171 1430708 1430622 1432377 1434769 1439517 1447343 1456146 1465343 1477353 1492625 1508023 1522176
$$ packed form
58410A394836k2269j9688j8914j8877j7904j6562j5327j3019r927q697r752r907
58398A213993p816o337o889o401k930M99J161J131K833M631M678M834O820Q625
58384A218832Q643R301J2593J6066J7209J7886K0452K3247K3984K3731K3756K2127
58372A437827J7422J2117Q674N939K673N15J25j189m485o478n336m263n592o588
58358A451361n087l928n241n708k443J521K589K498M021N868O732R100J3830J6325
58344A491438J3482R155P232N143M6m570n197n359r084j2787j1384p574p095q963
58330A454483q415n610l712j934J863N118M599K906L714M274L62n063o168l960
58316A442457l549m737l463q6J755K392M748P826Q803R197J2010J5272J5398J4153
$$ plain form
58302 1522176 1537418 1554532 1570893 1585958 1603149 1623936 1645457 1666313 1689048 1714272 1737996
58291 1737996 1757778 1776129 1794877 1811452 1823752 1833498 1841734 1846229 1846450 1846124 1847841 1849802 1850621
58278 1850621 1852429 1856654 1861813 1867960 1878099 1892693 1908169 1923282 1941345 1963614 1986271 2006881
58266 2006881 2028142 2052459 2078441 2105453 2135742 2169281 2202396 2234175 2268203 2305471 2341992
58255 2341992 2376060 2411067 2448302 2484012 2516635 2549630 2583654 2613462 2636471 2657136 2678752
58244 2678752 2698226 2713390 2728391 2747188 2768318 2790281 2815317 2843946 2872809 2901940 2936830
58233 2936830 2979308 3023949 3067467 3113663 3164946 3217516 3269669 3326254 3389746 3455400 3520534
58222 3520534 3590070 3667517 3749168 3832740 3922701 4021207 4122743 4223822 4328949 4440904
$$ packed form
58302A522176J5242J7114J6361J5065J7191K0787K1521K0856K2735K5224K3724
58291A737996J9782J8351J8748J6575J2300R746Q236M495K21l26J717J961Q19
58278A850621J808M225N159O147J0139J4594J5476J5113J8063K2269K2657K0610
58266B006881K1261K4317K5982K7012L0289L3539L3115L1779L4028L7268L6521
58255B341992L4068L5007L7235L5710L2623L2995L4024K9808K3009K0665K1616
58244B678752J9474J5164J5001J8797K1130K1963K5036K8629K8863K9131L4890
58233B936830M2478M4641M3518M6196N1283N2570N2153N6585O3492O5654O5134
58222C520534O9536P7447Q1651Q3572Q9961R8506J01536J01079J05127J11955
$$ plain form
58212 4440904 4554451 4665888 4779177 4896218 5011119 5120988 5232047 5347774 5461683
58203 5461683 5569956 5680780 5802790 5934587 6074016 6226889 6397139 6578737 6766804
58194 6766804 6966696 7183242 7411917 7649874 7904239 8179658 8469276 8768350 9084831
58185 9084831 9425745 9785395 10158460 10552409 10974999 11422062 11890185 12388968 12927870
58176 12927870 13503411 14111978 14761604 15457318 16188747 16946911 17739913 18577763 19456193
58167 19456193 20370373 21329236 22340415 23396944 24495488 25651125 26876852 28166200
58159 28166200 29514434 30937994 32452989 34054025 35735596 37514147 39407015 41412312
58151 41412312 43535051 45811069 48279666 50957575 53868344 57070887 60628160 64577309
$$ packed form
58212D440904J13547J11437J13289J17041J14901J09869J11059J15727J13909
58203E461683J08273J10824J22010J31797J39429J52873J70250J81598J88067
58194F766804J99892K16546K28675K37957K54365K75419K89618K99074L16481
58185I084831L40914L59650L73065L93949M22590M47063M68123M98783N38902
58176A2927870N75541O08567O49626O95714P31429P58164P93002Q37850Q78430
58167A9456193R14180R58863J011179J056529J098544J155637J225727J289348
58159B8166200J348234J423560J514995J601036J681571J778551J892868K005297
58151D1412312K122739K276018K468597K677909K910769L202543L557273L949149
$$ plain form
58143 64577309 68968216 73906018 79523111 85945441 93328118 101883337 111815337 123250243
58135 123250243 136264503 150932053 167305001 185448320 205617202 228370939 254428059
58128 254428059 284427382 318727099 356878386 396559886 432900005 459602872 471770917
58121 471770917 468286891 451783009 426573804 396597844 364665191 332634910 301681125
58114 301681125 272452544 245289525 220422659 197990868 177978318 160247443 144625289
58107 144625289 130920325 118906929 108363957 99119386 91027247 83930335 77681145
58100 77681145 72174640 67328335 63051836 59263317 55914745 52975712 50411481 48197922
58092 48197922 46337710 44839720 43697362 42902672 42464443 42396935 42704149 43384624 44436948
$$ packed form
58143F4577309M390907M937802N617093O422330P382677Q555219R932000J1434906
58135A23250243J3014260J4667550J6372948J8143319K0168882K2753737K6057120
58128B54428059K9999323L4299717L8151287L9681500L6340119K6702867J2168045
58121D71770917l484026j6503882k5209205k9975960l1932653l2030281l0953785
58114C01681125k9228581k7163019k4866866k2431791k0012550j7730875j5622154
58107A44625289j3704964j2013396j0542972r244571q092139p096912o249190
58100G7681145n506505m846305m276499l788519l348572k939033k564231k213559
58092D8197922j860212j497990j142358p94690m38229o7508L07214O80475J052324
$$ plain form
58083 44436948 45855749 47642663 49835302 52526294 55860477 59985774 64885272 70112320
58075 70112320 74687741 77428204 77564357 75132050 70816766 65481917 59821705 54283560
58067 54283560 49109886 44385088 40104191 36251189 32820416 29787231 27102957 24724964
58059 24724964 22625052 20769319 19118314 17649021 16352386 15207716 14181229 13249902
58051 13249902 12406041 11638814 10931673 10278076 9680392 9132455 8620424 8140725 7700498
58042 7700498 7300519 6933350 6597403 6297099 6029556 5785589 5562633 5362170 5176058
58033 5176058 4990478 4802809 4620655 4445302 4270293 4095565 3928758 3772327 3622288
58024 3622288 3479462 3349130 3229578 3113338 2999775 2894702 2797996 2703489 2610918 2526135
$$ packed form
58083D4436948J418801J786914K192639K690992L334183M125297M899498N227048
58075G0112320M575421K740463J36153k432307m315284n334849n660212n538145
58067E4283560n173674m724798m280897l853002l430773l033185k684274k377993
58059B4724964k099912j855733j651005j469293j296635j144670j026487r31327
58051A3249902q43861p67227p07141o53597n97684n47937n12031m79699m40227
58042G700498l99979l67169l35947l00304k67543k43967k22956k00463j86112
58033E176058j85580j87669j82154j75353j75009j74728j66807j56431j50039
58024C622288j42826j30332j19552j16240j13563j05073r6706r4507r2571q4783
$$ plain form
58014 2526135 2449468 2375214 2302730 2236928 2177772 2120256 2064774 2016555 1974546 1931619 1886327
58003 1886327 1844041 1806038 1767768 1728616 1693174 1661912 1630329 1598335 1570971 1548687 1526054
57992 1526054 1501216 1477937 1457389 1436580 1415717 1398580 1384631 1368980 1350985 1334904 1321623
57981 1321623 1307982 1294711 1286553 1283753 1281600 1279116 1279965 1284023 1286493 1286420 1287826 1291152 1291762 1288461
57967 1288461 1285499 1284503 1282206 1277999 1275962 1277220 1277541 1274834 1272278 1271781 1270787 1267730 1264593 1262182 1258623
57952 1258623 1254142 1251671 1251479 1250720 1249029 1248619 1248358 1244282 1236800 1230680 1226826 1220934 1211688 1203377 1198392
57937 1198392 1193598 1186208 1177109 1166338 1151351 1132103 1112313 1093744 1074587 1054990 1038332 1025166
57925 1025166 1011774 996933 984593 977724 974787 974227 977048 982845 988547 993260 999443 1007445 1014019
$$ packed form
58014B526135p6667p4254p2484o5802n9156n7516n5482m8219m2009m2927m5292
58003A886327m2286l8003l8270l9152l5442l1262l1583l1994k7364k2284k2633
57992A526054k4838k3279k0548k0809k0863j7137j3949j5651j7995j6081j3281
57981A321623j3641j3271q158k800k153k484Q49M058K470p3J406L326O10l301
57967A288461k962r96k297m207k037J258L21k707k556m97r94l057l137k411l559
57952A258623m481k471j92p59j691m10k61m076p482o120l854n892r246q311m985
57937A198392m794p390r099j0771j4987j9248j9790j8569j9157j9597j6658j3166
57925A025166j3392j4841j2340o869k937n60K821N797N702M713O183Q002O574
$$ plain form
57912 1014019 1018041 1022465 1028691 1034153 1037379 1040114 1042395 1041027 1035437 1029812 1026885 1024551 1021194 1019132
57898 1019132 1019666 1019285 1014235 1005268 995196 985265 976082 968370 960695 950121 937008 925567 918149
57885 918149 912908 908402 906028 906214 906699 906507 907388 909676 911195 911904 914858 920783 926563 931041 937023
57870 937023 945062 950511 949852 945169 939343 931603 921138 910386 900859 889858 875199 859613 846794
57857 846794 836520 827300 820468 817813 817934 818400 819048 820191 820439 819235 818714 820159 821579 821801 823802
57842 823802 830484 839723 847131 851639 855221 859102 863284 868121 873650 878794 883213 888112 893626 897814
57828 897814 899939 902008 905138 907306 906879 905410 904566 903051 899074 893097 885820 876366 865142 855580
57814 855580 850025 846273 840922 833870 826972 820839 815758 813373 814516 817349 820208 824182 830608 838380
$$ packed form
57912A014019M022M424O226N462L226K735K281j368n590n625k927k334l357k062
57898A019132N34l81n050q967j0072r931r183p712p675j0574j3113j1441p418
57885I18149n241m506k374J86M85j92Q81K288J519P09K954N925N780M478N982
57870I37023Q039N449o59m683n826p740j0465j0752r527j1001j4659j5586j2819
57857H46794j0274r220o832k655J21M66O48J143K48j204n21J445J420K22K001
57842H23802O682R239P408M508L582L881M182M837N529N144M419M899N514M188
57828H97814K125K069L130K168m27j469q44j515l977n977p277r454j1224r562
57814H55580n555l752n351p052o898o133n081k385J143K833K859L974O426P772
$$ plain form
57800 838380 846159 854758 864774 874342 881926 888901 896758 904265 910149 915949 923172 930021 934091 936059
57786 936059 937626 938144 936481 933929 931818 928302 921052 911249 901393 891067 878657 865625 854951
57773 854951 846378 837139 826853 818003 811704 806255 799972 792814 785250 777873 771932 768219 765662 762598
57759 762598 758736 754322 748621 740981 732153 722772 712124 700365 690134 683445 678441 671840 663327
57746 663327 655091 648313 642674 638135 634573 630750 626100 622454 621585 622288 622436 622568 624651 628423 632057
57731 632057 635567 640566 647241 654562 663027 674222 687786 701642 715350 730697 748577 767426
57719 767426 785022 800071 811780 819583 823656 824797 823853 821915 820177 818695 816298 812652 809084 806310
57705 806310 803122 798718 794427 791331 788200 784062 780902 781152 783952 786505 787903 789031 790002 790603 792220
$$ packed form
57800H38380P779Q599J0016R568P584O975P857P507N884N800P223O849M070J968
57786I36059J567N18j663k552k111l516p250r803r856j0326j2410j3032j0674
57773H54951q573r239j0286q850o299n449o283p158p564p377n941l713k557l064
57759G62598l862m414n701p640q828r381j0648j1759j0231o689n004o601q513
57746F63327q236o778n639m539l562l823m650l646q69P03J48J32K083L772L634
57731F32057L510M999O675P321Q465J1195J3564J3856J3708J5347J7880J8849
57719G67426J7596J5049J1709P803M073J141r44j938j738j482k397l646l568k774
57705H06310l188m404m291l096l131m138l160K50K800K553J398J128R71O01J617
$$ plain form
57690 792220 796397 802061 806765 810121 813695 818288 823732 830451 838687 846884 853401 859108 865956 874038
57676 874038 882682 893202 907207 922885 936520 947678 959673 974729 991598 1008401 1024964 1041806
57664 1041806 1059316 1078535 1100616 1124990 1150023 1175662 1203471 1233908 1265699 1298112 1331832
57653 1331832 1367235 1403751 1441297 1480658 1522142 1565378 1610512 1658114 1707987 1759696 1814171
57642 1814171 1873315 1938227 2009298 2087525 2173885 2267773 2367945 2474765 2589808 2713664
57632 2713664 2845997 2987341 3138851 3300682 3472637 3656140 3853469 4065149 4289901
57623 4289901 4526653 4774347 5029725 5287060 5539628 5779513 5996681 6180976 6325521
57614 6325521 6426907 6483154 6494307 6464911 6403427 6318934 6219960 6115553 6014243 5921190 5837554
$$ packed form
57690G92220M177N664M704L356L574M593N444O719Q236Q197O517N707O848Q082
57676H74038Q644J0520J4005J5678J3635J1158J1995J5056J6869J6803J6563J6842
57664A041806J7510J9219K2081K4374K5033K5639K7809L0437L1791L2413L3720
57653A331832L5403L6516L7546L9361M1484M3236M5134M7602M9873N1709N4475
57642A814171N9144O4912P1071P8227Q6360R3888J00172J06820J15043J23856
57632B713664J32333J41344J51510J61831J71955J83503J97329K11680K24752
57623D289901K36752K47694K55378K57335K52568K39885K17168J84295J44545
57614F325521J01386N6247J1153k9396o1484q4493r8974j04407j01310r3053q3636
$$ plain form
57603 5837554 5761097 5684154 5592034 5468704 5306979 5112214 4896388 4671332 4447320 4233361
57593 4233361 4035409 3855472 3693906 3551340 3427705 3321333 3230289 3153343 3089113 3035890
57583 3035890 2993036 2961139 2940326 2929949 2930084 2941424 2963204 2993289 3031087 3078617 3138050 3209896
57571 3209896 3294309 3392354 3505033 3632409 3774306 3930452 4099354 4278565 4466583 4663002
57561 4663002 4866221 5072170 5275256 5468718 5643818 5790829 5901825 5971495 5995575 5971008
57551 5971008 5898569 5783466 5632597 5452670 5251064 5035813 4813281 4587452 4362319 4142999
57541 4142999 3933360 3734406 3546309 3370357 3207489 3056488 2915443 2784053 2663058
57532 2663058 2552143 2449799 2354835 2267082 2186890 2114485 2049367 1990001 1934649 1882701 1834620
$$ packed form
57603E837554p6457p6943r2120j23330j61725j94765k15826k25056k24012k13959
57593D233361j97952j79937j61566j42566j23635j06372r1044p6946o4230n3223
57583C035890m2854l1897k0813j0377J35J1340K1780L0085L7798M7530N9433P1846
57571C209896Q4413R8045J12679J27376J41897J56146J68902J79211J88018J96419
57561D663002K03219K05949K03086J93462J75100J47011J10996O9670K4080k4567
57551E971008p2439j15103j50869j79927k01606k15251k22532k25829k25133k19320
57541D142999k09639j98954j88097j75952j62868j51001j41045j31390j20995
57532B663058j10915j02344r4964q7753q0192p2405o5118n9366n5352n1948m8081
$$ plain form
57521 1834620 1790693 1750734 1714794 1682938 1654323 1627745 1603098 1581118 1561886 1544915 1530480
57510 1530480 1519155 1510177 1502075 1494967 1490436 1489036 1489839 1492384 1497008 1503069 1509236 1515942 1525247 1537621
57496 1537621 1551167 1564820 1579999 1598161 1618952 1641902 1667712 1696538 1727098 1758948 1793779
57485 1793779 1833002 1875913 1921751 1971763 2027443 2088319 2153462 2223959 2302029 2388543 2482996
57474 2482996 2585071 2694727 2811593 2935799 3068736 3211596 3363386 3521086 3680947
57465 3680947 3838742 3989652 4128914 4252004 4353588 4427453 4468636 4475074 4446768 4384716
57455 4384716 4291787 4173743 4038033 3891660 3740246 3587954 3437477 3290880 3150846 3020142
57445 3020142 2899637 2788309 2685662 2592608 2509457 2434928 2368170 2309974 2260659 2218380 2181071
$$ packed form
57521A834620m3927l9959l5940l1856k8615k6578k4647k1980j9232j6971j4435
57510A530480j1325q978q102p108m531j400Q03K545M624O061O167O706R305J2374
57496A537621J3546J3653J5179J8162K0791K2950K5810K8826L0560L1850L4831
57485A793779L9223M2911M5838N0012N5680O0876O5143P0497P8070Q6514R4453
57474B482996J02075J09656J16866J24206J32937J42860J51790J57700J59861
57465C680947J57795J50910J39262J23090J01584P3865M1183O438k8306o2052
57455D384716r2929j18044j35710j46373j51414j52292j50477j46597j40034j30704
57445C020142j20505j11328j02647r3054q3151p4529o6758n8196m9315m2279l7309
$$ plain form
57434 2181071 2148806 2122716 2102742 2088072 2078726 2074994 2075931 2080108 2087612 2100021 2118478 2142584
57422 2142584 2171027 2202801 2238325 2279798 2329739 2388782 2455562 2528989 2609538 2698132 2795161
57411 2795161 2901163 3016884 3141795 3273782 3411015 3552682 3697027 3840033 3976874
57402 3976874 4103024 4212859 4299010 4354972 4377634 4366298 4320833 4242472 4135456 4006174
57392 4006174 3860906 3705053 3543316 3379216 3215242 3054414 2900601 2756169 2620575
57383 2620575 2492684 2373462 2264868 2166976 2077780 1995356 1918953 1848520 1784375 1726891 1675418
57372 1675418 1627942 1582547 1538806 1497331 1458932 1424664 1395354 1370202 1347005 1324634 1304047
57361 1304047 1286155 1270170 1255200 1241883 1231092 1222312 1214622 1208060 1202805 1198375 1194803 1193082 1193084
$$ packed form
57434B181071l2265k6090j9974j4670r346l732R37M177P504J2409J8457K4106
57422B142584K8443L1774L5524M1473M9941N9043O6780P3427Q0549Q8594R7029
57411B795161J06002J15721J24911J31987J37233J41667J44345J43006J36841
57402C976874J26150J09835Q6151N5962K2662j1336m5465p8361j07016j29282
57392D006174j45268j55853j61737j64100j63974j60828j53813j44432j35594
57383B620575j27891j19222j08594r7892q9196q2424p6403p0433o4145n7484n1473
57372A675418m7476m5395m3741m1475l8399l4268k9310k5152k3197k2371k0587
57361A304047j7892j5985j4970j3317j0791q780p690o562n255m430l572j721K
$$ plain form
57348 1193084 1192662 1190454 1188015 1187412 1188320 1189463 1191298 1194808 1198843 1201276 1202237 1203856 1207175 1211308 1215329
57333 1215329 1219284 1223802 1230098 1239441 1251018 1261473 1268480 1273671 1279975 1287397 1294026 1300084 1307880
57320 1307880 1318140 1329422 1341116 1354145 1368357 1381913 1393903 1405308 1416812 1427780 1437990
57309 1437990 1448472 1460011 1472476 1485916 1500493 1515110 1528105 1539788 1552382 1566947 1582259
57298 1582259 1597221 1612308 1627851 1642945 1657175 1671661 1687114 1702466 1716764 1731167 1747635
57287 1747635 1766552 1786879 1807879 1829548 1851967 1875334 1900222 1926980 1955202 1984388 2014597
57276 2014597 2045817 2077280 2108206 2138872 2170206 2202575 2235734 2269785 2305332 2342448 2380136
57265 2380136 2417383 2454450 2492464 2531667 2570866 2609180 2647673 2688185 2730754 2773363 2814417
$$ packed form
57348A193084m22k208k439o03R08J143J835L510M035K433R61J619L319M133M021
57333A215329L955M518O296R343J1577J0455P007N191O304P422O629O058P796
57320A307880J0260J1282J1694J3029J4212J3556J1990J1405J1504J0968J0210
57309A437990J0482J1539J2465J3440J4577J4617J2995J1683J2594J4565J5312
57298A582259J4962J5087J5543J5094J4230J4486J5453J5352J4298J4403J6468
57287A747635J8917K0327K1000K1669K2419K3367K4888K6758K8222K9186L0209
57276B014597L1220L1463L0926L0666L1334L2369L3159L4051L5547L7116L7688
57265B380136L7247L7067L8014L9203L9199L8314L8493M0512M2569M2609M1054
$$ plain form
57254 2814417 2854299 2894136 2934266 2974667 3015932 3059013 3104689 3153845 3207430 3265563 3327499
57243 3327499 3392881 3461918 3533839 3606660 3679235 3752021 3824899 3896058 3964459 4031704 4099704
57232 4099704 4168189 4236728 4307733 4384701 4468174 4556089 4647830 4745364 4850253 4961738 5078030
57221 5078030 5197384 5317371 5434750 5546601 5650532 5743991 5824968 5893391 5950284 5995612
57211 5995612 6028693 6050896 6066306 6079485 6094043 6113361 6140676 6177707 6224634 6282085 6351857
57200 6351857 6435008 6530197 6634349 6744085 6856226 6967936 7076969 7181329 7278700 7366795
57190 7366795 7443906 7508265 7557428 7589703 7606288 7610974 7607806 7599932 7590439 7582996 7581504 7589732 7610810
57177 7610810 7646090 7695062 7757416 7834513 7927625 8035646 8156081 8287282 8427709 8573767
$$ packed form
57254B814417L9882L9837M0130M0401M1265M3081M5676M9156N3585N8133O1936
57243C327499O5382O9037P1921P2821P2575P2786P2878P1159O8401O7245O8000
57232D099704O8485O8539P1005P6968Q3473Q7915R1741R7534J04889J11485J16292
57221E078030J19354J19987J17379J11851J03931R3459Q0977O8423N6893M5328
57211E995612L3081K2203J5410J3179J4558J9318K7315L7031M6927N7451O9772
57200F351857Q3151R5189J04152J09736J12141J11710J09033J04360R7371Q8095
57190G366795P7111O4359M9163L2275J6585M686l168p874r493p443j492Q228K1078
57177G610810L5280M8972O2354P7097R3112J08021J20435J31201J40427J46058
$$ plain form
57167 8573767 8720967 8867285 9013255 9158757 9301999 9441960 9579507 9715278 9848241
57158 9848241 9977111 10101592 10221500 10336119 10445154 10548988 10647333 10738834 10822725 10900002
57148 10900002 10972453 11041440 11107898 11172622 11236176 11299118 11362212 11425649 11488415 11549492 11609273
57137 11609273 11668577 11726723 11782191 11835043 11887185 11940260 11994642 12050344 12107445 12165715 12225314
57126 12225314 12287748 12354533 12424898 12496271 12566975 12636920 12705686 12771437 12831853 12884875 12928757
57115 12928757 12962933 12988726 13007904 13020713 13026583 13026114 13020905 13012208 13001573 12991836 12984923 12978984 12969896
57102 12969896 12955175 12934002 12904134 12862210 12807665 12743549 12672658 12595257 12511389 12422949 12332063
57091 12332063 12238746 12140759 12034426 11915477 11780974 11631075 11467727 11291670 11102012 10898110
$$ packed form
57167H573767J47200J46318J45970J45502J43242J39961J37547J35771J32963
57158I848241J28870J24481J19908J14619J09035J03834R8345R1501Q3891P7277
57148A0900002P2451O8987O6458O4724O3554O2942O3094O3437O2766O1077N9781
57137A1609273N9304N8146N5468N2852N2142N3075N4382N5702N7101N8270N9599
57126A2225314O2434O6785P0365P1373P0704O9945O8766O5751O0416N3022M3882
57115A2928757L4176K5793J9178J2809N870m69n209q697j0635r737o913n939r088
57102A2969896j4721k1173k9868m1924n4545o4116p0891p7401q3868q8440r0886
57091A2332063r3317r7987j06333j18949j34503j49899j63348j76057j89658k03902
$$ plain form
57081 10898110 10679701 10445303 10192460 9919555 9625726 9309701 8971123 8612565 8237553
57072 8237553 7846260 7434901 6998662 6532660 6030471 5484559 4888353 4235922 3520437
57063 3520437 2735856 1879933 952891 -46809 -1123560 -2282856 -3531653 -4879586 -6337031
57054 -6337031 -7913150 -9619071 -11471797 -13491895 -15699261 -18115021 -20765675 -23680929
57046 -23680929 -26889618 -30423192 -34322363 -38636494 -43419455 -48731710 -54643763 -61232288
57038 -61232288 -68578411 -76780279 -85966867 -96293211 -107925170 -121030364 -135760617
57031 -135760617 -152207591 -170365410 -190151778 -211464412 -234186240 -258110741 -282861305
57024 -282861305 -307880784 -332492052 -356000548 -377817984 -397543086 -414903327 -429580475
$$ packed form
57081A0898110k18409k34398k52843k72905k93829l16025l38578l58558l75012
57072H237553l91293m11359m36239m66002n02189n45912n96206o52431p15485
57063C520437p84581q55923r27042d6809j076751j159296j248797j347933j457445
57054f337031j576119j705921j852726k020098k207366k415760k650654k915254
57046b3680929l208689l533574l899171m314131m782961n312255n912053o588525
57038f1232288p346123q201868r186588j0326344j1631959j3105194j4730253
57031a35760617j6446974j8157819j9786368k1312634k2721828k3924501k4750564
57024b82861305k5019479k4611268k3508496k1817436j9725102j7360241j4677148
$$ plain form
57017 -429580475 -441114542 -449028649 -453038630 -453076899 -449090493 -440874594 -428168950 -410932946
57009 -410932946 -389536000 -364731704 -337497473 -308871691 -279840475 -251266902 -223851860
57002 -223851860 -198117746 -174404893 -152881488 -133573551 -116407443 -101247578 -87924177
56995 -87924177 -76256445 -66069227 -57197079 -49481483 -42772703 -36935675 -31851592 -27415917
56987 -27415917 -23539385 -20149821 -17187971 -14600293 -12336887 -10353894 -8613705 -7083355
56979 -7083355 -5735673 -4550993 -3514286 -2610347 -1823177 -1138334 -543188 -25935 423274
56969 811356 1144729 1431554 1679418 1892400 2072747 2223764 2348414 2446547 2516635 2559387
56959 2559387 2577298 2571904 2544366 2497790 2435969 2360076 2269001 2162452 2041430 1906295 1756963
$$ packed form
57017d29580475j1534067p914107m009981l8269L986406Q215899J2705644J7236004
57009d10932946K1396946K4804296K7234231K8625782K9031216K8573573K7415042
57002b23851860K5734114K3712853K1523405J9307937J7166108J5159865J3323401
56995h7924177J1667732J0187218Q872148P715596O708780N837028N084083M435675
56987b7415917L876532L389564K961850K587678K263406J982993J740189J530350
56979g083355J347682J184680J036707R03939P87170O84843e43188b5935D23274
56969H11356L33373K86825K47864K12982J80347J51017J24650R8133P0088M2752
56959B559387J7911n394k7538m6576o1821p5893r1075j06549j21022j35135j49332
$$ plain form
56948 1756963 1594957 1423187 1243963 1059179 872289 688225 511393 345238 193300
56939 193300 58897 -56313 -152293 -229288 -287428 -326726 -346380 -345036 -322998 -282758 -225557 -148532
56927 -148532 -47267 80100 234051 417844 635737 883302 1139108 1366947 1528136 1595870
56917 1595870 1563623 1444137 1261444 1041836 808093 576967 358731 158753 -19730 -174417
56907 -174417 -304964 -413332 -501903 -572035 -624983 -662814 -687294 -699004 -698657 -688228 -669762
56896 -669762 -644426 -614321 -584364 -560700 -547389 -545269 -552972 -567787 -586368 -606170 -626208 -645948
56884 -645948 -664271 -680236 -693809 -704834 -712099 -714360 -711420 -703464 -690436 -672939 -652435 -629266
56872 -629266 -601611 -567846 -529233 -489278 -451441 -418474 -392709 -375272 -365628 -362928 -366914 -376419
$$ packed form
56948A756963j62006j71770j79224j84784j86890j84064j76832j66155j51938
56939A93300E8897e6313r5980p6995n8140l9298j9654J344K2038M0240N7201P7025
56927a48532d7267H0100J53951J83793K17893K47565K55806K27839J61189O7734
56917A595870l2247j19486j82693k19608k33743k31126k18236A58753a9730j54687
56907a74417j30547j08368q8571p0132n2948l7831k4480j1710L47J0429J8466
56896f69762K5336L0105K9957K3664J3311K120p703j4815j8581j9802k0038j9740
56884f45948j8323j5965j3573j1025p265k261K940P956J3028J7497K0504K3169
56872f29266K7655L3765L8613L9955L7837L2967K5765J7437R644K700l986r505
$$ plain form
56860 -376419 -388329 -399669 -409951 -420144 -430411 -440310 -450208 -460642 -471002 -480527 -489962 -500544
56848 -500544 -511833 -522110 -530528 -537229 -541681 -542669 -540125 -535782 -531823 -529399 -528012 -525646 -520209 -511751
56834 -511751 -502610 -494578 -486815 -477461 -466091 -453368 -439588 -425218 -411849 -400805 -391526 -382979 -375863
56821 -375863 -371570 -369673 -368426 -367256 -366654 -365815 -362514 -355608 -346000 -334959 -322969 -310180 -296318 -279896
56807 -279896 -259123 -234070 -206594 -177790 -146804 -112555 -75258 -35537 6888 52419 99430 143348
56795 143348 178122 199373 206855 204009 195084 183142 170549 159636 151515 145205 139534 135664 136638
56782 136638 144757 160371 182754 210933 243888 281130 323228 371328 426529 489990 562098 639571
56770 639571 713516 771941 805193 809712 788291 748091 697383 642162 585258 528720 475776 429407
$$ packed form
56860c76419j1910j1340j0282j0193j0267r899r898j0434j0360r525r435j0582
56848e00544j1289j0277q418o701m452r88K544M343L959K424J387K366N437Q458
56834e11751R141Q032P763R354J1370J2723J3780J4370J3369J1044R279Q547P116
56821c75863M293J897J247J170O02Q39L301O906R608J1041J1990J2789J3862J6422
56807b79896K0773K5053K7476K8804L0986L4249L7297c5537F888M5531M7011M3918
56795A43348L4774K1251P482k846q925j1942j2593j0913q121o310n671l870R74
56782A36638Q119J5614K2383K8179L2955L7242M2098M8100N5201O3461P2108P7473
56770F39571P3945N8425L3252M519k1421m0200n0708n5221n6904n6538n2944m6369
$$ plain form
56758 429407 390255 357707 332251 314929 305073 300777 301723 309723 326111 350248 381128 419083
56746 419083 464720 516230 567716 610095 634691 637547 620855 590110 550280 504782 456556 408396
56734 408396 362489 320584 284196 253746 228232 206818 190101 178818 172334 169774 171742 179311
56722 179311 192058 208642 228424 250367 270783 284463 288318 282465 268099 246342 219289 189964
56710 189964 160336 130662 101289 73911 50506 31860 17385 5627 -4970 -14894 -23235 -29316
56698 -29316 -34207 -39449 -44747 -48362 -49679 -49940 -50463 -51472 -52774 -54298 -55792 -57022 -58357 -60227 -62191
56683 -62191 -63511 -64419 -65708 -67339 -68622 -69489 -70423 -71393 -72083 -72919 -74629 -76998 -79184 -80956 -82514 -83607
56667 -83607 -84078 -84837 -86912 -89913 -92667 -94704 -95833 -95241 -92817 -90590 -90729 -92557 -93542 -92800 -91523 -90402
$$ packed form
56758D29407l9152l2548k5456j7322r856m296R46Q000J6388K4137L0880L7955
56746D19083M5637N1510N1486M2379K4596K856j6692l0745l9830m5498m8226m8160
56734D08396m5907m1905l6388l0450k5514k1414j6717j1283o484k560J968P569
56722A79311J2747J6584J9782K1943K0416J3680L855n853j4366k1757k7053k9325
56710A89964k9628k9674k9373k7378k3405j8646j4475E627d970r924q341o081
56698b9316m891n242n298l615j317k61n23j009j302j524j494j230j335j870j964
56683f2191j320r08j289j631j283q67r34r70o90q36j710k369k186j772j558j093
56667h3607m71p59k075l001k754k037j129N92K424K227j39j828r85P42J277J121
$$ plain form
56651 -90402 -89136 -88409 -89820 -93411 -97312 -100177 -102101 -103112 -102928 -102325 -102525 -102942 -101853 -99585 -98586 -99695
56635 -99695 -100844 -100382 -99374 -99322 -99661 -98978 -97130 -94873 -92592 -90364 -88222 -85752 -82699 -80224 -79889 -81075
56619 -81075 -81441 -80425 -80067 -81398 -82344 -80731 -77441 -74929 -74109 -74338 -75113 -76059 -76194 -74771 -72229 -69313
56603 -69313 -66110 -62870 -60626 -59825 -59274 -57632 -55234 -53387 -52624 -52607 -53033 -53803 -54906 -56828 -60288 -64929
56587 -64929 -69138 -71909 -74027 -76732 -80071 -83255 -85735 -87166 -87106 -85628 -83675 -82165 -81198 -80389 -79303
56572 -79303 -77406 -74501 -71415 -69222 -67624 -65287 -61992 -59062 -57235 -55517 -52821 -49406 -46052 -43036
56558 -43036 -40552 -38948 -37881 -36406 -34480 -33125 -32489 -31077 -27705 -23048 -18485 -14529 -11099 -8225 -5694
56543 -5694 -2985 -101 2469 4833 7489 9821 10549 10222 11410 15475 20800 25189 28374 31037 32987
$$ packed form
56651i0402J266P27j411l591l901k865j924j011J84O03k00m17J089K268R99j109
56635i9695j149M62J008N2l39O83J848K257K281K228K142K470L053K475L35j186
56619h1075l66J016L58j331r46J613L290K512Q20k29p75r46j35J423K542K916
56603f9313L203L240K244Q01N51J642K398J847P63J7m26p70j103j922l460m641
56587f4929m209k771k118k705l339l184k480j431O0J478J953J510R67Q09J086
56572g9303J897K905L086K193J598K337L295K930J827J718K696L415L354L016
56558d3036K484J604J067J475J926J355O36J412L372M657M563L956L430K874K531
56543e694K709a01B469K364K656K332P28l27J188M065N325M389L185K663J950
$$ plain form
56528 32987 33842 34269 35110 36220 37348 39102 41883 44859 47323 50129 54527 60219 65624 69544 71818
56513 71818 73041 74311 76502 79192 81166 82390 84383 88162 93146 98717 105348 113367 121981 130497
56499 130497 139189 148100 156349 163768 171887 182092 193888 205999 217923 229323 239172 246937 253649
56486 253649 260582 267690 274296 280320 285769 289977 292447 293648 294144 293800 292519 290666 288064 283860 278196
56471 278196 272711 268448 264504 259646 253936 247858 241174 233666 225737 217434 208306 199073 191709 186769
56457 186769 182291 176545 170198 164396 158500 151423 143761 136938 131430 127295 125013 124246 123030 119888
56443 119888 115683 112024 109097 106381 104083 102362 100509 98460 97575 98336 98796 97196 94692 93532 93850
56428 93850 94364 95097 97145 100500 104104 107445 110503 112842 114357 116151 119302 123569 128390 133868 139530
$$ packed form
56528C2987Q55M27Q41J110J128J754K781K976K464K806M398N692N405L920K274
56513G1818J223J270K191K690J974J224J993L779M984N571O631Q019Q614Q516
56499A30497Q692Q911Q249P419Q119J0205J1796J2111J1924J1400R849P765O712
56486B53649O933P108O606O024N449M208K470J201M96l44j281j853k602m204n664
56471B78196n485m263l944m858n710o078o684p508p929q303r128r233p364m940
56457A86769m478n746o347n802n896p077p662o823n508m135k282p67j216l142
56443A19888m205l659k927k716k298j721j853k049q85P61M60j600k504j160L18
56428I3850N14P33K048L355L604L341L058K339J515J794L151M267M821N478N662
$$ plain form
56413 139530 143826 146605 150426 157400 166028 173134 177689 180838 183614 186754 191379 197537 203157 206596
56399 206596 209111 212756 217232 221218 225410 231443 238631 244553 248347 251074 253390 255167 256860 259066
56385 259066 261280 263016 265358 269437 274365 278784 283232 288639 293815 297201 299982 304520 310460 315350
56371 315350 318444 320917 322887 323382 322973 323325 324103 323218 320204 316631 313083 308461 302546 296643 291362
56356 291362 285966 280149 274390 268774 263539 260263 259868 259882 256634 250048 243447 238734 234957 231804 231002
56341 231002 233123 235909 237092 236602 235041 232270 228767 226402 226420 227957 229420 230302 231105 232532 234952
56326 234952 237755 239506 239806 240318 242611 245969 249067 252471 257097 261275 262383 260814 259381 259114 258712
56311 258712 257998 258615 260951 263380 265184 267552 271127 275126 279331 284388 289627 293160 294802 296561 299743
$$ packed form
56413A39530M296K779L821O974Q628P106M555L149K776L140M625O158N620L439
56399B06596K515L645M476L986M192O033P188N922L794K727K316J777J693K206
56385B59066K214J736K342M079M928M419M448N407N176L386K781M538N940M890
56371C15350L094K473J970M95m09L52P78q85l014l573l548m622n915n903n281
56356B91362n396n817n759n616n235l276l95J4l248o586o601m713l777l153q02
56341B31002K121K786J183m90j561k771l503k365J8J537J463Q82Q03J427K420
56326B34952K803J751L00N12K293L358L098L404M626M178J108j569j433k67m02
56311B58712p14O17K336K429J804K368L575L999M205N057N239L533J642J759L182
$$ plain form
56296 299743 303797 308285 313470 318578 321963 323563 324984 326887 328649 330691 334372 339260 343307 346220
56282 346220 349904 355054 360142 364425 369145 374953 380929 387095 395185 405779 417076 427450 436960
56269 436960 445635 452829 459252 467240 477920 490107 502564 515169 527472 538810 550458 564985
56257 564985 582573 600444 616602 631535 645663 658031 668481 678323 687732 695107 699983 704051
56245 704051 708406 712426 716071 720373 724838 727533 728836 731793 737358 742624 745537 748267 753787 761880
56231 761880 770738 780103 790658 802302 815052 829880 847061 865379 884230 904690 927451 951808
56219 951808 977553 1005417 1034710 1063318 1091475 1122823 1160116 1202304 1247334 1295282 1347017
56208 1347017 1402257 1460899 1524305 1593662 1668837 1749992 1838284 1934112 2036985 2147952 2269487
$$ packed form
56296B99743M054M488N185N108L385J600J421J903J762K042L681M888M047K913
56282C46220L684N150N088M283M720N808N976O166Q090J0594J1297J0374R510
56269D36960Q675P194O423P988J0680J2187J2457J2605J2303J1338J1648J4527
56257E64985J7588J7871J6158J4933J4128J2368J0450R842R409P375M876M068
56245G04051M355M020L645M302M465K695J303K957N565N266K913K730N520Q093
56231G61880Q858R365J0555J1644J2750J4828J7181J8318J8851K0460K2761K4357
56219I51808K5745K7864K9293K8608K8157L1348L7293M2188M5030M7948N1735
56208A347017N5240N8642O3406O9357P5175Q1155Q8292R5828J02873J10967J21535
$$ plain form
56197 2269487 2402150 2544297 2695937 2859426 3035008 3219208 3409239 3605497 3807747
56188 3807747 4012377 4215629 4416047 4611159 4795050 4962078 5110131 5237576 5340220
56179 5340220 5414713 5462434 5486782 5488706 5467997 5426920 5369393 5298143 5215415 5124794 5029463
56168 5029463 4929909 4825709 4718270 4609764 4500852 4391416 4281876 4171890 4059382 3942727
56158 3942727 3822363 3698949 3572102 3442409 3312377 3183702 3055959 2929420 2806339
56149 2806339 2687774 2572183 2459221 2351726 2251556 2156718 2065400 1979775 1902595 1832705
56139 1832705 1767161 1705463 1648518 1595701 1546212 1501329 1462143 1426766 1392733 1360555 1332300
56128 1332300 1308376 1288094 1271328 1257166 1243198 1229008 1218255 1214336 1215688 1218052 1219576 1221182
$$ packed form
56197B269487J32663J42147J51640J63489J75582J84200J90031J96258K02250
56188C807747K04630K03252K00418J95112J83891J67028J48053J27445J02644
56179E340220P4493M7721K4348J924k0709m1077n7527p1250q2728r0621r5331
56168E029463r9554j04200j07439j08506j08912j09436j09540j09986j12508j16655
56158C942727j20364j23414j26847j29693j30032j28675j27743j26539j23081
56149B806339j18565j15591j12962j07495j00170r4838r1318q5625p7180o9890
56139A832705o5544o1698n6945n2817m9489m4883l9186l5377l4033l2178k8255
56128A332300k3924k0282j6766j4162j3968j4190j0753l919J352K364J524J606
$$ plain form
56116 1221182 1223891 1228479 1236076 1246670 1258554 1271048 1285580 1302317 1318436 1331857 1343885 1355964
56104 1355964 1366886 1375707 1384204 1393552 1401695 1407059 1411895 1418817 1427017 1435130 1444882 1458504 1475310
56091 1475310 1494073 1515836 1541096 1567285 1592604 1619387 1650140 1683395 1717165 1753259 1794093
56080 1794093 1838255 1883491 1931342 1984866 2044633 2111073 2187698 2277554 2379395 2491852 2618517
56069 2618517 2764289 2929408 3111532 3310478 3525507 3750375 3976394 4198451 4413590
56060 4413590 4616492 4802009 4970354 5124690 5265065 5388772 5493978 5577948 5634188 5657087
56050 5657087 5648188 5613807 5558874 5487439 5405614 5317641 5220754 5109324 4982255 4841430 4685843
56039 4685843 4513738 4329064 4139974 3952128 3768400 3593100 3430665 3281439 3143863
$$ packed form
56116A221182K709M588P597J0594J1884J2494J4532J6737J6119J3421J2028J2079
56104A355964J0922Q821Q497R348Q143N364M836O922Q200Q113R752J3622J6806
56091A475310J8763K1763K5260K6189K5319K6783L0753L3255L3770L6094M0834
56080A794093M4162M5236M7851N3524N9767O6440P6625Q9856J01841J12457J26665
56069B618517J45772J65119J82124J98946K15029K24868K26019K22057K15139
56060D413590K02902J85517J68345J54336J40375J23707J05206Q3970N6240K2899
56050E657087q899l4381n4933p1435q1825q7973r6887j11430j27069j40825j55587
56039D685843j72105j84674j89090j87846j83728j75300j62435j49226j37576
$$ plain form
56030 3143863 3019334 2910211 2814988 2730367 2655910 2591966 2535818 2485107 2442108 2409072 2382467
56019 2382467 2357669 2336057 2321164 2311171 2302048 2294971 2293324 2295177 2296269 2297973 2304724 2315809 2327284
56006 2327284 2339812 2356816 2376908 2395996 2415186 2438812 2466331 2493732 2521125 2551296 2582893
55995 2582893 2613005 2644338 2681543 2722549 2761991 2801054 2845020 2893131 2940328 2987467 3040201
55984 3040201 3098789 3158391 3218602 3283495 3353078 3423804 3496574 3575258 3658490 3742096 3828148
55973 3828148 3922102 4022604 4123971 4227066 4337403 4454162 4571878 4691626 4819387 4954561
55963 4954561 5091477 5231377 5381470 5542921 5711214 5887354 6076784 6278108 6485120
55954 6485120 6699294 6927988 7171165 7422667 7683751 7962300 8259369 8569776 8894877
$$ packed form
56030C143863j24529j09123r5223q4621p4457o3944n6148n0711m2999l3036k6605
56019B382467k4798k1612j4893r993r123p077j647J853J092J704O751J1085J1475
56006B327284J2528J7004K0092J9088J9190K3626K7519K7401K7393L0171L1597
55995B582893L0112L1333L7205M1006L9442L9063M3966M8111M7197M7139N2734
55984C040201N8588N9602O0211O4893O9583P0726P2770P8684Q3232Q3606Q6052
55973C828148R3954J00502J01367J03095J10337J16759J17716J19748J27761J35174
55963D954561J36916J39900J50093J61451J68293J76140J89430K01324K07012
55954F485120K14174K28694K43177K51502K61084K78549K97069L10407L25101
$$ plain form
55945 8894877 9240871 9605756 9982776 10376070 10797684 11249823 11725804 12227922 12767709
55936 12767709 13348429 13963943 14614927 15309076 16045076 16813768 17615493 18459074 19344581
55927 19344581 20265675 21227644 22243194 23311947 24425482 25590870 26826090 28133915
55919 28133915 29505673 30949687 32488585 34128535 35859930 37689277 39640472 41724375
55911 41724375 43940520 46311433 48881412 51679866 54723656 58058791 61759651 65883797
55903 65883797 70473440 75610942 81431678 88081652 95715564 104538088 114778001 126600062
55895 126600062 140096201 155369189 172561103 191815693 213330241 237467282 264698391
55888 264698391 295414303 329890236 368252274 409792250 451676587 488461758 513723180
$$ packed form
55945H894877L45994L64885L77020L93294M21614M52139M75981N02118N39787
55936A2767709N80720O15514O50984O94149P36000P68692Q01725Q43581Q85507
55927A9344581R21094R61969J015550J068753J113535J165388J235220J307825
55919B8133915J371758J444014J538898J639950J731395J829347J951195K083903
55911D1724375K216145K370913K569979K798454L043790L335135L700860M124146
55903F5883797M589643N137502N820736O649974P633912Q822524J0239913J1822061
55895A26600062J3496139J5272988J7191914J9254590K1514548K4137041K7231109
55888B64698391L0715912L4475933L8362038M1539976M1884337L6785171K5261422
$$ plain form
55881 513723180 523022974 515828134 494991443 464764277 429172106 391426169 353860571
55874 353860571 317952517 284482446 253839600 226225371 201663380 180002287 161009977
55867 161009977 144439884 130012466 117419071 106388198 96712118 88200278 80658025
55860 80658025 73927853 67907557 62511170 57648393 53252243 49286825 45711666 42468716
55852 42468716 39514017 36829909 34394879 32170638 30128815 28261848 26556940 24985369
55844 24985369 23527181 22181314 20941667 19786837 18702830 17693190 16757270 15879770
55836 15879770 15050724 14275258 13554444 12875879 12231994 11628966 11068605 10538956 10031281
55827 10031281 9549498 9094818 8657891 8234793 7834875 7463855 7113610 6776884 6457886
$$ packed form
55881E13723180R299794p194840k0836691l0227166l5592171l7745937l7565598
55874C53860571l5908054l3470071l0642846k7614229k4561991k1661093j8992310
55867A61009977j6570093j4427418j2593395j1030873r676080q511840p542253
55860H0658025o730172o020296n396387m862777m396150l965418l575159l242950
55852D2468716k954699k684108k435030k224241k041823j866967j704908j571571
55844B4985369j458188j345867j239647j154830j084007j009640r35920q77500
55836A5879770q29046p75466p20814o78565o43885o03028n60361n29649n07675
55827A0031281m81783m54680m36927m23098l99918l71020l50245l36726l18998
$$ plain form
55818 6457886 6160207 5878049 5607738 5355136 5123349 4905005 4694388 4495916 4313493
55809 4313493 4142775 3981085 3834086 3705471 3589980 3482941 3386596 3300875 3218000 3132549
55799 3132549 3047566 2965218 2881143 2793605 2708391 2628950 2551257 2473982 2403748 2344131 2289084
55788 2289084 2233750 2182653 2140613 2104401 2070353 2042079 2023611 2012282 2004749 2002659 2005641 2005510
55776 2005510 1994053 1970861 1938150 1894462 1839327 1777995 1715729 1652721 1589355 1530383 1478758
55765 1478758 1431127 1384250 1340161 1300398 1261261 1219838 1179143 1142486 1108260 1074853 1045122
55754 1045122 1021276 1000641 980885 964029 951036 938199 923520 911107 904489 900841 896406 892384
55742 892384 890794 889716 887411 886158 887341 887441 883430 877374 871337 862723 849322 834202 820780 807483
$$ packed form
55818F457886k97679k82158k70311k52602k31787k18344k10617j98472j82423
55809D313493j70718j61690j46999j28615j15491j07039r6345q5721q2875q5451
55799C132549q4983q2348q4075q7538q5214p9441p7693p7275p0234n9617n5047
55788B289084n5334n1097m2040l6212l4048k8274j8468j1329p533k090K982j31
55776B005510j1457k3192l2711m3688n5135o1332o2266o3008o3366n8972n1625
55765A478758m7631m6877m4089l9763l9137m1423m0695l6657l4226l3407k9731
55754A045122k3846k0635j9756j6856j2993j2837j4679j2413o618l648m435m022
55742H92384j590j078k305j253J183J00m011o056o037q614j3401j5120j3422j3297
$$ plain form
55728 807483 791808 775188 759349 742313 722692 703789 688866 676281 663429 651355 641324
55717 641324 631198 619666 609956 604957 602510 599446 596063 592647 586184 574929 561946 549767 535988
55704 535988 518611 501152 487618 476773 466300 458055 453732 449503 440789 428855 417104 404313
55692 404313 387371 367727 349380 332871 316534 301169 288349 276611 264364 254121 248796 246198
55680 246198 242256 237298 234058 231804 227827 222934 220124 219341 218437 217908 219819 223243 225291 225445 224849
55665 224849 222837 218437 213611 210605 207698 201966 194710 189491 186200 181790 175909 171216 168786 167406
55651 167406 166725 167163 167478 166338 165577 168139 173638 179652 186278 195368 206068 215269 222076 228083 233558
55636 233558 237019 238287 238681 238558 237736 237774 240551 245084 248664 250603 251980 252689 251813 250040 248540 246357
$$ packed form
55728H07483j5675j6620j5839j7036j9621j8903j4923j2585j2852j2074j0031
55717F41324j0126j1532r710m999k447l064l383l416o463j1255j2983j2179j3779
55704E35988j7377j7459j3534j0845j0473q245m323m229q714j1934j1751j2791
55692D04313j6942j9644j8347j6509j6337j5365j2820j1738j2247j0243n325k598
55680B46198l942m958l240k254l977m893k810p83r04n29J911L424K048J54n96
55665B24849k012m400m826l006k907n732p256n219l291m410n881m693k430j380
55651A67406o81M38L15j140p61K562N499O014O626R090J0700R201O807O007N475
55636B33558L461J268L94j23q22L8K777M533L580J939J377P09q76j773j500k183
$$ plain form
55620 246357 242111 237339 234865 234669 234648 234603 235988 238307 239335 238642 237607 236231 233198 229095 226526 226750
55604 226750 228641 230773 232305 232265 230311 227797 226044 224419 222115 220429 220759 221809 221658 221186 222304
55589 222304 223979 223435 220433 217058 213988 210247 205992 202144 197699 190665 181409 172114 163334 154128
55575 154128 145083 137920 132252 125902 118474 111778 106736 102514 98573 94961 90797 85085 78875 74206
55561 74206 71299 69076 67647 67583 67565 65788 63020 61272 60063 57319 53459 51112 50928 51026 50629 50806 51335
55544 51335 50222 47070 44068 42928 43319 44648 46887 49279 50642 51212 52010 52552 51668 50236 50255 51362
55528 51362 51296 49897 49524 51240 53790 56885 62213 70051 77743 82981 86485 90358 95688 102594 110862
55513 110862 119790 128993 139632 153222 169220 185715 202393 220586 240438 260563 280837 303045
$$ packed form
55620B46357m246m772k474j96k1m5J385K319J028o93j035j376l033m103k569K24
55604B26750J891K132J532m0j954k514j753j625k304j686L30J050j51m72J118
55589B22304J675n44l002l375l070l741m255l848m445p034r256r295q780r206
55575A54128r045p163n668o350p428o696n042m222l941l612m164n712o210m669
55561G4206k907k223j429o4j8j777k768j748j209k744l860k347j84R8l97J77N29
55544E1335j113l152l002j140L91J329K239K392J363N70P98N42q84j432J9J107
55528E1362o6j399l73J716K550L095N328P838P692N238L504L873N330O906Q268
55513A10862Q928R203J0639J3590J5998J6495J6678J8193J9852K0125K0274K2208
$$ plain form
55501 303045 328037 354131 378719 399610 414676 422366 422935 417363 405221 385832 361512 336934
55489 336934 314789 294236 273940 254230 235751 218383 202373 188635 177217 167151 158091 150361
55477 150361 143321 135770 128123 122101 117922 113935 109340 105228 102600 101301 101229 102548 104400 105245 104665
55462 104665 103051 99708 93546 85608 78518 73203 68382 63276 58325 53137 46567 39372 34115 31658
55448 31658 30107 27840 25192 22453 18700 13633 8483 4142 156 -3851 -7568 -11142 -15008 -18339 -19878
55433 -19878 -20519 -22691 -26790 -30568 -32383 -32683 -32033 -30439 -29094 -29966 -32925 -35892 -38360 -41856 -46328
55418 -46328 -49391 -50228 -50917 -52509 -53079 -51545 -50286 -51645 -54373 -55880 -55807 -55134 -53871 -52020 -51039 -51975
55402 -51975 -53491 -53856 -53690 -54883 -57845 -61465 -64666 -66607 -66619 -65241 -64053 -63335 -61476 -57958 -55121 -55283
$$ packed form
55501C03045K4992K6094K4588K0891J5066P690N69n572j2142j9389k4320k4578
55489C36934k2145k0553k0296j9710j8479j7368j6010j3738j1418j0066r060p730
55477A50361p040p551p647o022m179l987m595m112k628j299p2J319J852Q45n80
55462A04665j614l343o162p938p090n315m821n106m951n188o570p195n257k457
55448C1658j551k267k648k739l753n067n150D142A56c851l717l574l866l331j539
55433a9878o41k172m099l778j815l00O50J594J345q72k959k967k468l496m472
55418d6328l063q37o89j592n70J534J259j359k728j507P3O73J263J851R81r36
55402e1975j516l65J66j193k962l620l201j941j2J378J188P18J859L518K837j62
$$ plain form
55386 -55283 -57649 -59716 -60369 -60031 -59246 -58908 -60592 -64728 -69300 -71889 -72206 -71393 -69996 -68025 -65922 -63990
55370 -63990 -61691 -58757 -56052 -54257 -52771 -51002 -49603 -49324 -49785 -50389 -51176 -51759 -50962 -48789 -47264 -47856
55354 -47856 -49460 -50308 -50434 -50606 -50353 -48952 -47135 -45808 -44087 -40628 -36105 -32324 -29461 -26266 -22682
55339 -22682 -20265 -19876 -20609 -21269 -21613 -21786 -21587 -20882 -20292 -20996 -23617 -27100 -29169 -28702 -27380 -27767 -29964
55322 -29964 -31701 -31774 -31349 -31387 -30942 -29175 -27130 -26046 -25435 -24323 -23114 -22774 -23366 -24699 -27145 -30352 -32431
55305 -32431 -32100 -30645 -30208 -31051 -32112 -33405 -36126 -40779 -46547 -52114 -56054 -57137 -55484 -52910 -51152
55290 -51152 -50349 -49970 -50183 -51206 -52392 -53146 -53881 -54944 -55606 -55352 -55145 -56075 -57698 -59048 -60275 -61835 -63016
55273 -63016 -62824 -61629 -60444 -59321 -57858 -56534 -56037 -55971 -55727 -55871 -57120 -58583 -58722 -57567 -56412 -55752
$$ packed form
55386e5283k366k067o53L38P85L38j684m136m572k589l17Q13J397J971K103J932
55370f3990K299K934K705J795J486J769J399K79m61o04p87n83P97K173J525n92
55354d7856j604q48j26j72K53J401J817J327J721L459M523L781K863L195L584
55339b2682K417L89p33o60l44j73J99P05N90p04k621l483k069M67J322l87k197
55322b9964j737p3M25l8M45J767K045J084O11J112J209L40n92j333k446l207k079
55305c2431L31J455M37q43j061j293k721m653n768n567l940j083J653K574J758
55290e1152Q03L79k13j023j186p54p35j063o62K54K07r30j623j350j227j560j181
55273f3016J92J195J185J123J463J324M97O6K44j44j249j463j39J155J155O60
$$ plain form
55257 -55752 -55045 -54130 -53328 -52428 -51034 -49629 -48887 -48310 -47050 -45708 -45674 -46772 -47153 -45733 -43383 -41566 -40958
55240 -40958 -41572 -43085 -44741 -45705 -45755 -45228 -44589 -44576 -46078 -48880 -51089 -51071 -49704 -49473 -51404 -53985 -55089
55223 -55089 -53965 -51290 -48219 -45708 -44155 -43387 -43076 -43027 -43046 -43088 -43705 -45526 -47917 -49097 -48166 -46118 -44256
55206 -44256 -42679 -41167 -40341 -40635 -41054 -40314 -38676 -37450 -37215 -37662 -38589 -39928 -41231 -42264 -43652 -45876
55190 -45876 -48118 -49058 -48398 -46712 -44520 -42464 -41578 -42162 -43022 -43036 -42698 -42872 -42909 -41647 -39679 -38769 -39284 -39925
55172 -39925 -39894 -39711 -39796 -39867 -39972 -40683 -41898 -42641 -42481 -42021 -41609 -40565 -38378 -35843 -34317 -34133 -34243 -33390
55154 -33390 -31358 -29025 -27198 -25655 -23584 -20655 -17196 -13710 -11073 -10714 -13127 -16304 -17431 -16438 -16017
55139 -16017 -17595 -19483 -20062 -20509 -22492 -25058 -26091 -25573 -25098 -25047 -24567 -23802 -23882 -24943 -26078 -27122 -28715
$$ packed form
55257e5752P07R15Q02R00J394J405P42N77J260J342L4j098l81J420K350J817O08
55240d0958o14j513j656r64n0N27O39J3j502k802k209J8J367K31j931k581j104
55223e5089J124K675L071K511J553P68L11M9j9m2o17j821k391j180R31K048J862
55206d4256J577J512Q26k94m19P40J638J226K35m47r27j339j303j033j388k224
55190d5876k242r40O60J686K192K056Q86n84q60j4L38j74l7J262J968R10n15o41
55172c9925L1J83q5p1j05p11j215p43J60M60M12J044K187K535J526J84j10Q53
55154c3390K032K333J827J543K071K929L459L486K637L59k413l177j127R93M21
55139a6017j578j888n79m47j983k566j033N18M75N1M80P65q0j061j135j044j593
$$ plain form
55122 -28715 -30767 -32506 -33855 -35129 -35598 -34102 -31044 -28160 -26417 -25663 -26140 -28423 -31636 -33509 -32849
55107 -32849 -30777 -29147 -28764 -29296 -29757 -28884 -26171 -22821 -20793 -20744 -21669 -22473 -23014 -23589 -24320 -25138 -25752 -25799
55089 -25799 -25485 -25652 -26515 -26971 -25901 -23495 -20602 -17712 -15643 -15935 -18979 -22560 -23990 -23113 -21746 -20933
55073 -20933 -20574 -21040 -22895 -25154 -25852 -24536 -22581 -21044 -19788 -18554 -17295 -15409 -12365 -9059 -7008
55058 -7008 -6147 -4996 -2909 -552 1738 4197 6173 6235 4098 963 -2169 -5045 -7105 -7687 -7432 -7764 -8725
55041 -8725 -8936 -7822 -6197 -4558 -2706 -1201 -1127 -1975 -1807 -196 985 483 -517 -523 123 403 495 1311 3209
55022 3209 6157 10140 14566 18159 20175 20903 20718 19798 19094 20088 22935 26188 28973 32025 35754 38743
55006 38743 39288 37460 34721 32431 31442 32094 33683 34789 34968 35325 36808 38767 39899 39726 38427 36131
$$ packed form
55122b8715k052j739j349j274m69J496L058K884J743P54m77k283l213j873O60
55107c2849K072J630L83n32m61Q73K713L350K028M9r25q04n41n75p31q18o14m7
55089b5799L14j67q63m56J070K406K893K890K069k92l044l581j430Q77J367Q13
55073b0933L59m66j855k259o98J316J955J537J256J234J259J886L044L306K051
55058g008Q61J151K087e52A738K459J976O2k137I63b169k876k060n82K55l32r61
55041h725k11J114J625J639J852a201P4q48J68a96I85D83e17oA23K80R2Q16J898
55022C209K948L983M426L593K016P28j85r20p04R94K847L253K785L052L729K989
55006C8743N45j828k739k290r89O52J589J106J79L57J483J959J132j73j299k296
$$ plain form
54990 36131 33185 30526 28949 28429 28441 28447 27922 26737 25720 25934 27151 27958 27590 26619 25662 24642 23668 23366
54972 23366 23743 23893 23339 22669 22326 21961 21531 21871 23472 25672 27758 29885 32247 34323 35642 36511 37296
54955 37296 37739 37565 37105 36868 37069 37841 39217 40759 41982 43104 44469 45469 45264 44317 43671 42799 40101
54938 40101 35716 31777 29384 27498 25577 25038 26727 28965 29904 30266 31934 34998 37944 39899 41040
54923 41040 41502 41417 41560 42630 44277 45869 47581 49693 51530 52367 52808 53992 55763 56822 56554 55646
54907 55646 55028 55067 55928 58073 62154 68452 76315 84503 92643 101945 113342 125236 134724 141411 148281
54892 148281 158181 171081 185554 201055 217288 232922 246834 259830 273441 287522 300363 310569
54880 310569 317391 319702 316282 307261 294320 279332 263472 247501 232221 218519 207011 197324
$$ packed form
54990C6131k946k659j577n20J2On25j185j017K14J217Q07l68r71r57j020r74l02
54972B3366L77J50n54o70l43l65m30L40J601K200K086K127K362K076J319Q69P85
54955C7296M43j74m60k37K01P72J376J542J223J122J365J000k05r47o46q72k698
54938D0101m385l939k393j886j921n39J689K238R39L62J668L064K946J955J141
54923D1040M62q5J43J070J647J592J712K112J837Q37M41J184J771J059k68r08
54907E5646o18L9Q61K145M081O298P863Q188Q140R302J1397J1894R488O687O870
54892A48281R900J2900J4473J5501J6233J5634J3912J2996J3611J4081J2841J0206
54880C10569O822K311l420r021j2941j4988j5860j5971j5280j3702j1508r687
$$ plain form
54868 197324 187816 176953 165243 154812 146688 139628 132113 124265 117080 111012 106307 103685 103587 105495
54854 105495 108778 113370 118972 124696 130285 136517 143588 150564 157527 166749 180076 196280 212641
54841 212641 228091 243027 256928 268203 276028 280500 281116 276855 267923 256060 242869 228770 213600
54828 213600 197389 180696 164839 151397 140689 131279 121887 113203 106696 102257 98265 93654 88750
54815 88750 84377 81212 79711 79501 78922 76302 71741 67053 64029 63160 63494 63144 60708 56888 53984 53027
54799 53027 52439 50469 47759 46069 45591 45346 45409 46607 48291 48605 47250 46144 46807 48570 50002 50876
54783 50876 51914 53409 54822 55350 54461 52102 48637 44482 39967 35676 32520 31105 31335 32821 35076
54768 35076 37129 37860 37315 36882 37549 38847 40136 41868 44713 48370 52128 55663 58347 58957 57313 55194
$$ packed form
54868A97324r508j0863j1710j0431q124p060p515p848p185o068m705k622r8J908
54854A05495L283M592N602N724N589O232P071O976O963R222J3327J6204J6361
54841B12641J5450J4936J3901J1275P825M472O16m261q932j1863j3191j4099j5170
54828B13600j6211j6693j5857j3442j0708r410r392q684o507m439l992m611m904
54815H8750m373l165j501k10n79k620m561m688l024q69L34l50k436l820k904r57
54799E3027n88j970k710j690m78k45O3J198J684L14j355j106O63J763J432Q74
54783E0876J038J495J413N28q89k359l465m155m515m291l156j415K30J486K255
54768C5076K053P31n45m33O67J298J289J732K845L657L758L535K684O10j644k119
$$ plain form
54752 55194 54323 54506 55091 57006 61493 67694 73549 78567 83869 89914 96153 102615 109939 117927 125931
54737 125931 134703 146086 160662 177248 194695 212534 229878 245622 260233 275602 292172 307374
54725 307374 317649 321381 319538 314279 307212 298469 287410 274553 262098 251642 242063 231048 218240
54712 218240 205510 194570 185870 179554 175707 173536 171775 170057 168785 167903 167302 168119 171831 178072
54698 178072 185100 192594 202215 214997 229882 245379 261253 278066 296276 316143 337374 358618
54686 358618 378410 396573 413400 427622 436841 439948 437403 429270 415120 396171 375198 353495
54674 353495 329993 304380 279121 257063 238596 222386 207485 193457 179786 166628 155248
54663 155248 146419 139143 131987 124930 118991 114768 112139 110671 109452 107310 104011 100699 98525 97470
$$ packed form
54752E5194q71J83N85J915M487O201N855N018N302O045O239O462P324P988Q004
54737A25931Q772J1383J4576J6586J7447J7839J7344J5744J4611J5369J6570J5202
54725C07374J0275L732j843n259p067q743j1059j2857j2455j0456r579j1015j2808
54712B18240j2730j0940q700o316l847k171j761j718j272q82o01Q17L712O241
54698A78072P028P494R621J2782J4885J5497J5874J6813J8210J9867K1231K1244
54686C58618J9792J8163J6827J4222R219L107k545q133j4150j8949k0973k1703
54674C53495k3502k5613k5259k2058j8467j6210j4901j4028j3671j3158j1380
54663A55248q829p276p156p057n939m223k629j468j219k142l299l312k174j055
$$ plain form
54649 97470 96880 96289 95341 93819 92257 91495 91184 89887 87186 84457 82914 82251 82004 82871 85401 88521
54633 88521 90702 91886 93083 94702 96305 97434 97766 97129 96271 96984 100348 105236 109385 111579 112217 112428
54617 112428 113357 115718 119197 122733 125946 129622 134208 138788 142452 145836 150227 155753 161605 167606
54603 167606 174390 182196 190468 198577 206178 213061 219337 225649 232506 239475 245560 250297 254126 257884
54589 257884 262295 267702 273947 280673 287849 295689 304083 312748 322022 332682 344747 357310 369825
54576 369825 382460 394659 404447 410115 411792 410394 405649 396299 382121 364849 347027 330271 314536
54563 314536 298795 282552 266666 252294 239378 227020 215204 204950 196730 190135 185492 184131
54551 184131 186209 189640 192313 194243 196480 199052 201349 203569 206187 208491 209045 207424 204463 201067
$$ packed form
54649I7470n90n91r48j522j562p62l11j297k701k729j543o63k47Q67K530L120
54633H8521K181J184J197J619J603J129L32o37q58P13L364M888M149K194O38K11
54617A12428R29K361L479L536L213L676M586M580L664L384M391N526N852O001
54603A67606O784P806Q272Q109P601O883O276O312O857O969O085M737L829L758
54589B57884M411N407O245O726P176P840Q394Q665R274J0660J2065J2563J2515
54576C69825J2635J2199R788N668J677j398m745r350j4178j7272j7822j6756j5735
54563C14536j5741j6243j5886j4372j2916j2358j1816j0254q220o595m643j361
54551A84131K078L431K673J930K237K572K297K220K618K304N54j621k961l396
$$ plain form
54537 201067 197684 194527 191457 188043 184452 181553 179384 176398 171407 165349 159751 154227 147260 138999
54523 138999 131375 125451 120393 115417 111122 108298 106589 105048 103129 100578 97113 92860 88602 85153
54509 85153 82743 81211 80395 80109 80053 79931 79549 78943 78633 79431 81598 84428 87113 89600 92098 94192 95307
54492 95307 95719 96222 96865 96962 96459 96418 97848 100622 103848 106855 109616 112517 115867 119526 123087 126620
54476 126620 130887 136292 141920 146358 149462 152716 157672 164473 171984 178848 184197 187752 189782 191072
54462 191072 192557 194481 195619 193798 187878 179187 170346 162625 155202 147068 138635 130970 124452 118984
54448 118984 114774 111937 109857 107885 106316 105782 105933 105628 104325 102463 100532 98553 96620 95358 95574
54433 95574 97603 100931 104376 106975 108892 110929 113017 113966 113217 111920 111505 111908 112272 112773 114564 118144
$$ packed form
54537B01067l383l157l070l414l591k899k169k986m991o058n598n524o967q261
54523A38999p624n924n058m976m295k824j709j541j919k551l465m253m258l449
54509H5153k410j532q16k86n6j22l82o06l10P98K167K830K685K487K498K094J115
54492I5307M12N03O43R7n03m1J430K774L226L007K761K901L350L659L561L533
54476A26620M267N405N628M438L104L254M956O801P511O864N349L555K030J290
54462A91072J485J924J138j821n920q691q841p721p423q134q433p665o518n468
54448A18984m210k837k080j972j569n34J51l05j303j862j931j979j933j262K16
54433I5574K029L328L445K599J917K037K088R49p49j297m15M03L64N01J791L580
$$ plain form
54417 118144 122923 128219 133596 138271 141309 142688 143394 144358 145959 148530 152338 156826 160612 162604 162757
54402 162757 161787 160649 160190 160568 161073 161161 161532 163272 165923 167479 166707 164548 162664 161367 159711 157131
54386 157131 154131 151426 149141 147014 144913 142859 140722 138237 135451 132969 131567 131552 132519 133574 133712
54371 133712 132325 129779 127359 126042 125363 123991 121422 118490 116298 115391 116006 118064 120580 122106 122291
54356 122291 122172 122484 122724 122558 123052 125401 129341 133886 138931 144846 151049 156340 160378 163650 166353
54341 166353 168573 171288 175768 181967 188786 195971 204348 213826 222618 229180 233911 238119 242120 245312
54327 245312 247605 249570 251111 250963 248130 243370 238483 234107 229025 222094 214027 206377 199412 192327
54313 192327 185279 179511 175296 171514 167782 165148 163804 162118 159333 157292 157476 157977 155955 152027 149466
$$ packed form
54417A18144M779N296N377M675L038J379P06R64J601K571L808M488L786J992J53
54402A62757r70j138m59L78N05Q8L71J740K651J556p72k159j884j297j656k580
54386A57131l000k705k285k127k101k054k137k485k786k482j402j5R67J055J38
54371A33712j387k546k420j317o79j372k569k932k192r07O15K058K516J526J85
54356A22291j19L12K40j66M94K349L940M545N045N915O203N291M038L272K703
54341A66353K220K715M480O199O819P185Q377R478Q792O562M731M208M001L192
54327B45312K293J965J541j48k833m760m887m376n082o931q067p650o965p085
54313A92327p048n768m215l782l732k634j344j686k785k041J84N01k022l928k561
$$ plain form
54298 149466 149530 150371 150591 151083 152722 154713 156262 157917 160165 162370 164191 166610 170411 174801 178529
54283 178529 181410 183937 186516 189951 195526 203413 211722 218202 222386 225435 228473 231732 234603 235742
54269 235742 233848 229170 223730 219390 216148 212923 209258 205395 201216 196111 189796 182643 175245 168033
54255 168033 161134 154314 147346 140544 134546 129518 125151 121424 118517 115782 111858 106319 100288 94861
54241 94861 89808 84529 79367 75015 71406 68261 66223 66226 67941 69768 70391 69662 68145 66498 65175 64024
54225 64024 62217 59164 55433 52256 50225 49016 48223 47822 47866 48374 49537 51489 53745 55339 55723 55235
54209 55235 54609 54395 54922 56392 58643 60955 62434 62810 62874 64024 67164 71919 76953 81037 83783 85542
54193 85542 86936 88481 90259 91729 92175 91544 90627 90128 89695 88261 85414 82160 80048 79595 79928 80100
$$ packed form
54298A49466O4Q41K20M92J639J991J549J655K248K205J821K419L801M390L728
54283A78529K881K527K579L435N575P887Q309O480M184L049L038L259K871J139
54269B35742j894m678n440m340l242l225l665l863m179n105o315p153p398p212
54255A68033o899o820o968o802n998n028m367l727k907k735l924n539o031n427
54241I4861n053n279n162m352l609l145k038LJ715J827O23p29j517j647j323j151
54225F4024j807l053l731l177k031j209p93m01M4N08J163J952K256J594L84m88
54209E5235o26k14N27J470K251K312J479L76O4J150L140M755N034M084K746J759
54193H5542J394J545J778J470M46o31r17m99m33j434k847l254k112m53L33J72
$$ plain form
54177 80100 80300 81209 82451 82624 81101 78906 77272 76130 74813 73486 72763 72276 70969 68808 67000 66162
54161 66162 65403 63815 62044 61509 62429 63424 63144 61805 60805 60941 61388 60804 59204 57951 57769 57711 56722
54144 56722 55336 54867 55506 56321 56665 56448 55360 53196 50850 49689 49850 50308 50668 51600 53322 54955 55709
54127 55709 55565 54561 52680 50794 50220 50729 50316 47764 44272 41694 40274 39073 37597 36018 34634
54112 34634 34162 35721 39381 43322 45513 45861 45795 46237 46964 47525 47752 47557 47075 46919 47564 48651 49446 49657
54094 49657 49242 47877 45433 42778 41296 41587 43104 44910 46347 47229 47752 48053 47628 45692 42505 39780
54078 39780 39147 40619 42999 45278 47029 48039 48406 48662 48986 48585 46634 43732 41702 41794 43535 45336
54062 45336 45963 45582 45578 47100 49614 51317 51216 50323 50370 51788 53346 53411 51372 48290 46375 47089 49440
$$ packed form
54177H0100K00R09J242J73j523k195j634j142j317j327p23m87j307k161j808q38
54161F6162p59j588j771n35R20R95k80j339j000J36M47n84j600j253j82n8r89
54144E6722j386m69O39Q15L44k17j088k164k346j161J61M58L60R32J722J633P54
54127E5709j44j004j881j886n74N09m13k552l492k578j420j201j476j579j384
54112C4634m72J559L660L941K191L48o6M42P27N61K27j95m82j56O45J087P95K11
54094D9657m15j365k444k655j482K91J517J806J437Q82N23L01m25j936l187k725
54078C9780o33J472K380K279J751J010L67K56L24m01j951k902k030R2J741J801
54062D5336O27l81mJ522K514J703j01q93M7J418J558O5k039l082j915P14K351
$$ plain form
54045 49440 50780 49596 46768 43977 42099 41644 43196 46205 48543 48766 48082 48660 50600 52122 52253 51767
54029 51767 51565 51662 51894 52295 52539 52100 51206 50663 50609 50341 49493 48400 47156 45310 42798 40434 39166 39388
54011 39388 40985 43348 45366 46253 46432 46936 48032 49266 50712 52932 55650 57712 58861 60340 63070
53996 63070 66202 68378 69717 71636 74991 79150 82775 85006 85885 85984 85782 85476 85441 86460 88855 91584
53980 91584 93065 93076 93021 94026 95595 96779 98002 100909 106649 114894 124265 133117 140153 145219 149811
53965 149811 156128 164993 174892 183494 190134 196389 204049 213032 221636 228504 233723 238177 242639 247591
53951 247591 253129 258568 262779 265362 266954 267891 267269 264157 259207 254152 249987 246483 243138 239432 234263
53936 234263 226536 216865 207771 201465 197902 195486 193160 191161 190048 189680 189299 188281 186578 184493 182180
$$ packed form
54045D9440J340j184k828k791j878m55J552L009K338K23o84N78J940J522J31m86
54029E1767k02R7K32M01K44m39q94n43n4k68q48j093j244j846k512k364j268K22
54011C9388J597K363K018Q87J79N04J096J234J446K220K718K062J149J479K730
53996F3070L132K176J339J919L355M159L625K231Q79R9k02l06l5J019K395K729
53980I1584J481J1n5J005J569J184J223K907N740Q245R371Q852P036N066M592
53965A49811O317Q865R899Q602O640O255P660Q983Q604O868N219M454M462M952
53951B47591N538N439M211K583J592R37o22l112m950n055m165l504l345l706n169
53936B34263p727r671r094o306l563k416k326j999j113l68l81j018j703k085k313
$$ plain form
53921 182180 179509 176486 173578 171380 170117 169665 169895 170700 171750 172571 172920 172907 172886 173326 174541 176259 177669
53904 177669 178270 178592 179698 182025 184922 187214 188004 187107 185060 182775 181074 180561 181641 184136 186961
53889 186961 188877 189839 190879 192348 193142 192284 190463 189141 188716 188627 188824 190026 192661 196523 201458 207485
53873 207485 214165 220722 226978 233495 240520 247372 253086 257308 260381 262801 264646 265501 265074 264018 263658
53858 263658 264788 267198 270547 274854 279742 284218 287998 292116 297335 302912 308115 313917 321608 330452
53844 330452 338546 345613 353015 361053 368310 374020 379357 385718 393174 401150 409131 415929 419550 418894
53830 418894 414950 409794 405059 401573 399278 396984 393138 387458 381016 374524 367613 360090 352567 345250
53816 345250 337335 328318 318814 309393 299782 289898 280446 271658 262754 253603 245636 239846 235065 229604
$$ packed form
53921A82180k671l023k908k198j263m52K30Q05J050Q21L49j3k1M40J215J718J410
53904A77669O01L22J106K327K897K292P90q97k047k285j701n13J080K495K825
53889A86961J916R62J040J469P94q58j821j322m25q9J97J202K635L862M935O027
53873B07485O680O557O256O517P025O852N714M222L073K420J845Q55m27j056l60
53858B63658J130K410L349M307M888M476L780M118N219N577N203N802P691Q844
53844C30452Q094P067P402Q038P257N710N337O361P456P976P981O798L621o56
53830D18894l944n156m735l486k295k294l846n680o442o492o911p523p523p317
53816C45250p915r017r504r421r611r884r452q788q904r151p967n790m781n461
$$ plain form
53802 229604 223584 218158 213353 208357 203292 198939 195081 190766 185946 181180 175950 169157 161482 155505
53788 155505 152807 152365 152376 152287 152224 151707 150133 147883 145798 143837 141155 137388 133285 130053 128497 128600
53772 128600 129492 129874 128973 127223 125750 125057 124443 122910 120552 118776 119056 121472 124689 127265 128808 129842
53756 129842 130859 131727 132012 131643 131260 131844 133951 137327 141249 145078 148441 151190 153527 155918 158489
53741 158489 160775 162517 164367 167037 170052 172394 174357 177553 182702 188549 193676 198457 204232 211263
53727 211263 218559 225425 232179 239294 246614 253565 259737 265179 270292 275312 279767 282831 284438 285587
53713 285587 287278 289637 292395 295469 298504 300498 300757 299768 298355 296423 293454 289891 286908 284890 282998
53698 282998 280339 276800 272868 269395 267401 267033 266707 264437 260288 256487 254652 254041 253152 251919 251197
$$ packed form
53802B29604o020n426m805m996n065m353l858m315m820m766n230o793p675n977
53788A55505k698m42J1q9o3n17j574k250k085j961k682l767m103l232j556J03
53772A28600Q92L82r01j750j473o93o14j533k358j776K80K416L217K576J543J034
53756A29842J017Q68K85l69l83N84K107L376L922L829L363K749K337K391K571
53741A58489K286J742J850K670L015K342J963L196N149N847N127M781N775P031
53727B11263P296O866O754P115P320O951O172N442N113N020M455L064J607J149
53713B85587J691K359K758L074L035J994K59r89j413j932k969l563k983k018j892
53698B82998k659l539l932l473j994l68l26k270m149l801j835o11q89j233p22
$$ plain form
53683 251197 250893 250009 248373 246989 246382 245626 243509 239989 235976 232232 229065 226626 224766 222795 220121
53668 220121 217206 215222 214599 214477 213814 212482 210940 209393 207802 206238 204665 202665 199987 197169 195061
53653 195061 193961 193758 194471 195879 196974 196898 196466 197752 201915 208153 214781 220495 224643 227480 230500
53638 230500 235412 242259 249389 255553 260973 266023 270311 273880 277960 283407 289449 295146 301109 308395
53624 308395 316454 323612 329052 332969 335358 336299 337130 339662 344031 348643 352228 354715 356197 356568 356496
53609 356496 357277 359229 361429 363389 365714 368471 370236 369677 367246 364471 362353 361172 361131 362125 363234
53594 363234 363255 361712 358986 355805 352900 350752 349240 347869 346568 345839 345883 346138 345944 345168 344012 342865
53578 342865 342498 343475 345075 345770 345293 345143 346305 347655 347729 347061 347275 348601 349927 350946 352394 354140
$$ packed form
53683B51197l04q84j636j384o07p56k117l520m013l744l167k439j860j971k674
53668B20121k915j984o23j22o63j332j542j547j591j564j573k000k678k818k108
53653A95061j100k03P13J408J095p6m32J286M163O238O628N714M148K837L020
53638B30500M912O847P130O164N420N050M288L569M080N447O042N697N963P286
53624C08395Q059P158N440L917K389R41Q31K532M369M612L585K487J482L71p2
53609C56496P81J952K200J960K325K757J765n59k431k775k118j181m1R94J109
53594C63234K1j543k726l181k905k148j512j371j301p29M4K55j94p76j156j147
53578C42865l67R77J600O95m77j50J162J350P4o68K14J326J326J019J448J746
$$ plain form
53562 354140 354849 354101 353354 354042 355990 358496 361837 366528 371974 377146 382183 388090 395025 401958 408106
53547 408106 413755 419492 425420 431434 437610 443929 450116 456210 462985 471467 482122 494554 507654
53534 507654 519933 530238 538595 546127 553800 561513 568763 575921 584238 594502 606178 618002 629091
53521 629091 639304 648852 657996 667025 676127 685029 693011 699692 705763 712460 720028 727167 732553 736523
53507 736523 740494 744911 748837 751675 754079 756559 758436 759279 760401 763470 768050 772027 774362 775909
53493 775909 777480 778672 779147 779629 780659 781434 780877 779238 777760 777273 777769 778816 779702 779781 779341 779576 781087
53476 781087 783120 785041 787720 792235 797905 803049 807441 812558 819372 827220 835131 842974 850906 858824
53462 858824 866962 876213 887214 899872 914243 930931 949865 969499 988343 1006982 1027535 1051188
$$ packed form
53562C54140P09p48p47O88J948K506L341M691N446N172N037N907O935O933O148
53547D08106N649N737N928O014O176O319O187O094O775Q482J0655J2432J3100
53534E07654J2279J0305Q357P532P673P713P250P158Q317J0264J1676J1824J1089
53521F29091J0213R548R144R029R102Q902P982O681O071O697P568P139N386L970
53507G36523L971M417L926K838K404K480J877Q43J122L069M580L977K335J547
53493G75909J571J192M75M82J030P75n57j639j478m87M96J047Q86P9m40K35J511
53476G81087K033J921K679M515N670N144M392N117O814P848P911P843P932P918
53462H58824Q138R251J1001J2658J4371J6688J8934J9634J8844J8639K0553K3653
$$ plain form
53450 1051188 1077083 1103782 1131002 1159610 1190548 1224316 1261042 1300291 1340752 1380898 1420429
53439 1420429 1460791 1503744 1549586 1597321 1646417 1697526 1751146 1806423 1862008 1917581 1973741
53428 1973741 2030771 2088449 2146913 2206632 2267336 2327812 2387083 2445105 2502048 2557756 2612423
53417 2612423 2667105 2722794 2779380 2836167 2893007 2950131 3006991 3062152 3114587 3164587 3213088
53406 3213088 3260449 3306151 3349466 3389959 3427234 3460507 3488940 3512714 3533559 3553607 3573448
53395 3573448 3591563 3605959 3616104 3622999 3627714 3630417 3630713 3628105 3621878 3611175 3595725 3576178 3553222
53382 3553222 3526716 3496266 3462397 3426242 3388074 3347028 3302680 3256001 3208143 3159056 3108283
53371 3108283 3056579 3005457 2955144 2904206 2851604 2798299 2746333 2697006 2650337 2605690 2562460
$$ packed form
53450A051188K5895K6699K7220K8608L0938L3768L6726L9249M0461M0146L9531
53439A420429M0362M2953M5842M7735M9096N1109N3620N5277N5585N5573N6160
53428A973741N7030N7678N8464N9719O0704O0476N9271N8022N6943N5708N4667
53417B612423N4682N5689N6586N6787N6840N7124N6860N5161N2435N0000M8501
53406C213088M7361M5702M3315M0493L7275L3273K8433K3774K0845K0048J9841
53395C573448J8115J4396J0145O895M715K703K96k608o227j0703j5450j9547k2956
53382C553222k6506l0450l3869l6155l8168m1046m4348m6679m7858m9087n0773
53371C108283n1704n1122n0313n0938n2602n3305n1966m9327m6669m4647m3230
$$ plain form
53360 2562460 2520654 2481195 2445145 2412354 2381616 2352629 2326962 2306283 2290355 2277739 2267936
53349 2267936 2261694 2259484 2261003 2266330 2276454 2292159 2313067 2338144 2366757 2398941 2435143 2475880
53337 2475880 2521284 2570851 2623878 2680096 2739440 2801389 2865279 2931367 3001018 3075603 3155584
53326 3155584 3240600 3329823 3422184 3516977 3614509 3715581 3820156 3927166 4035986 4147339
53316 4147339 4262295 4380922 4502444 4626235 4752004 4879332 5007621 5136256 5264245
53307 5264245 5389818 5511056 5627069 5738254 5845401 5948753 6047697 6140818 6226297 6302894
53297 6302894 6370871 6431643 6486193 6534067 6574188 6606328 6631157 6648804 6658067 6657459 6646626 6626303
53285 6626303 6597240 6559829 6514430 6461016 6398234 6323920 6237243 6139733 6033630 5920044 5799667
$$ packed form
53360B562460m1806l9459l6050l2791l0738k8987k5667k0679j5928j2616r803
53349B267936o242k210J519N327J0124J5705K0908K5077K8613L2184L6202M0737
53337B475880M5404M9567N3027N6218N9344O1949O3890O6088O9651P4585P9981
53326C155584Q5016Q9223R2361R4793R7532J01072J04575J07010J08820J11353
53316D147339J14956J18627J21522J23791J25769J27328J28289J28635J27989
53307E264245J25573J21238J16013J11185J07147J03352R8944R3121Q5479P6597
53297F302894O7977O0772N4550M7874M0121L2140K4829J7647R263o08j0833k0323
53285F626303k9063l7411m5399n3414o2782p4314q6677r7510j06103j13586j20377
$$ plain form
53274 5799667 5674539 5547495 5419822 5290816 5160082 5029123 4899938 4772906 4647065
53265 4647065 4522056 4398844 4278606 4161642 4047617 3936388 3828272 3723670 3622759
53256 3622759 3525657 3432802 3344883 3262202 3184294 3110449 3040625 2975597 2916346 2863519 2817325
53245 2817325 2777367 2742377 2710626 2681099 2654271 2631641 2614490 2602992 2596238 2592978 2592473 2594726
53233 2594726 2599778 2606933 2614964 2623187 2632076 2642678 2655612 2670808 2688168 2708261 2732099 2760181
53221 2760181 2791946 2826368 2862985 2901962 2943384 2987124 3033470 3083043 3135587 3189388 3242463
53210 3242463 3293966 3344042 3392959 3441106 3489153 3537167 3583866 3627706 3668568 3707411 3744453
53199 3744453 3778884 3810457 3840085 3868327 3894295 3916599 3934559 3947837 3955715 3957732 3954685 3948075
$$ packed form
53274E799667j25128j27044j27673j29006j30734j30959j29185j27032j25841
53265D647065j25009j23212j20238j16964j14025j11229j08116j04602j00911
53256C622759r7102r2855q7919q2681p7908p3845o9824o5028n9251n2827m6194
53245B817325l9958l4990l1751k9527k6828k2630j7151j1498o754l260n05K253
53233B594726N052P155Q031Q223Q889J0602J2934J5196J7360K0093K3838K8082
53221B760181L1765L4422L6617L8977M1422M3740M6346M9573N2544N3801N3075
53210C242463N1503N0076M8917M8147M8047M8014M6699M3840M0862L8843L7042
53199C744453L4431L1573K9628K8242K5968K2304J7960J3278P878K017l047o610
$$ plain form
53187 3948075 3938398 3924517 3904842 3878809 3847000 3809944 3767203 3717967 3662583 3602975 3541114
53176 3541114 3477324 3410551 3340131 3266890 3192750 3119763 3049318 2981597 2915717 2850752 2786547
53165 2786547 2723278 2660736 2598647 2537282 2476964 2417307 2357738 2298530 2240477 2183826 2128393
53154 2128393 2074220 2021102 1968016 1914626 1863069 1816417 1775048 1736217 1697603 1659663 1623899
53143 1623899 1590520 1558786 1528098 1497521 1465422 1430960 1395248 1360121 1326458 1294418 1264201
53132 1264201 1235604 1207737 1180250 1153863 1128609 1102708 1074656 1045631 1018272 993590 970480
53121 970480 947701 924791 901414 877466 853789 831395 810101 789221 769312 751627 735767
53110 735767 719597 701908 683651 665936 648287 629850 611309 594423 580174 568209 557684
$$ packed form
53187C948075r677j3881j9675k6033l1809l7056m2741m9236n5384n9608o1861
53176C541114o3790o6773p0420p3241p4140p2987p0445o7721o5880o4965o4205
53165B786547o3269o2542o2089o1365o0318n9657n9569n9208n8053n6651n5433
53154B128393n4173n3118n3086n3390n1557m6652m1369l8831l8614l7940l5764
53143A623899l3379l1734l0688l0577l2099l4462l5712l5127l3663l2040l0217
53132A264201k8597k7867k7487k6387k5254k5901k8052k9025k7359k4682k3110
53121I70480k2779k2910k3377k3948k3677k2394k1294k0880j9909j7685j5860
53110G35767j6170j7689j8257j7715j7649j8437j8541j6886j4249j1965j0525
$$ plain form
53099 557684 547857 538009 527541 516355 504914 493883 483746 474613 466223 458186 450320 442815 436182
53086 436182 431000 427313 424147 419999 414165 407335 400736 395101 390689 387624 385544 383417 380503 377392
53072 377392 375516 375790 378014 381128 383526 383757 381819 379432 378293 378461 379192 380724 383972 388810 394045
53057 394045 399062 404144 409021 412623 414795 417043 420694 425065 428167 428623 426324 421876 416147 410045
53043 410045 404137 398588 393621 389496 385748 381043 374435 366429 358300 350673 343363 336288 329730 323511
53029 323511 316578 307954 298015 288419 280739 275343 271625 268831 266230 262943 258521 253716 249770 246620
53015 246620 242729 237289 231635 227614 225294 223439 221731 221135 222095 223642 224485 224111 222715 220956 219811
53000 219811 219678 219549 218102 215756 214355 214427 214089 211491 207274 203609 201595 200757 200572 201209 202724 204456
$$ packed form
53099E57684r827r848j0468j1186j1441j1031j0137r133q390q037p866p505o633
53086D36182n182l687l166m148n834o830o599n635m412l065k080k127k914l111
53072C77392j876K74K224L114K398K31j938k387j139J68P31J532L248M838N235
53057C94045N017N082M877L602K172K248L651M371L102M56k299m448n729o102
53043D10045n908n549m967m125l748m705o608q006q129p627p310p075o558o219
53029C23511o933q624r939r596p680n396l718k794k601l287m422m805l946l150
53015B46620l891n440n654m021k320j855j708n96R60J547Q43l74j396j759j145
53000B19811j33j29j447k346j401P2l38k598m217l665k014q38j85O37J515J732
$$ plain form
52984 204456 205497 205361 204242 203050 203025 204700 207194 208975 209418 209211 209220 209312 208580 206367 202798 198426 193753
52967 193753 189256 185589 183307 182225 181353 179756 177446 175285 174086 173836 173699 172678 170541 168168 166751
52952 166751 166616 167100 167486 167441 166573 164617 162511 162259 164772 168464 170893 171201 170129 168482 166899 166461
52936 166461 167792 169657 170111 169192 168951 170480 172531 173630 174106 175178 177297 180365 184459 189153 193011
52921 193011 195038 196213 198456 202340 206755 210702 214523 219220 225137 231515 237133 241446 245168 249598
52907 249598 255390 262272 269678 276936 282886 286351 287350 287117 286665 286057 285157 283956 281791 277605 271773
52892 271773 266457 263106 260697 257569 253948 251083 248624 244761 238884 232516 227318 223507 220608 218561
52878 218561 217423 216698 215730 214410 213142 212225 211443 210230 208371 206568 205898 206408 206841 206252 205272 204983 205100
$$ packed form
52984B04456J041j36j119j192k5J675K494J781M43k07RR2p32k213l569m372m673
52967A93753m497l667k282j082q72j597k310k161j199k50j37j021k137k373j417
52952A66751j35M84L86m5q68j956k106k52K513L692K429L08j072j647j583m38
52936A66461J331J865M54r19k41J529K051J099M76J072K119L068M094M694L858
52921A93011K027J175K243L884M415L947L821M697N917O378N618M313L722M430
52907B49598N792O882P406P258N950L465R99k33m52o08r00j201k165m186n832
52892B71773n316l351k409l128l621k865k459l863n877o368n198l811k899k047
52878B18561j138p25r68j320j268r17p82j213j859j803o70N10M33n89r80k89J17
$$ plain form
52861 205100 204384 202551 200647 199544 199181 199413 200475 202172 203553 203897 203382 202450 201230 200102 200057 201679
52845 201679 204033 205303 204562 202558 200791 200054 199949 199651 199011 198753 199568 201361 203595 205983 208432 210591
52829 210591 212080 212981 213551 213667 213280 213262 214820 217908 221025 222870 223378 222901 221425 219294 217820 218155
52813 218155 219858 221517 222583 223643 224964 225768 225501 225214 226916 231442 237293 241889 243974 244601 245635
52798 245635 247489 248883 248810 248136 248760 251612 256025 260867 265620 270284 274806 279110 283457 288411 294277
52783 294277 300585 306232 310331 313081 315595 318653 321762 323730 324053 323267 321954 320062 317513 314830 312450
52768 312450 309653 305094 298598 291776 286488 283020 280164 276709 272428 267846 263655 260390 258226 256863
52754 256863 255728 254319 252226 249086 244990 240870 237853 235898 233543 229453 223996 218762 214681 211243
$$ packed form
52861B05100p16j833j904j103l63K32J062J697J381L44n15r32j220j128m5J622
52845B01679K354J270p41k004j767p37j05k98o40k58Q15J793K234K388K449K159
52829B10591J489R01N70J16l87j8J558L088L117J845N08m77j476k131j474L35
52813B18155J703J659J066J060J321Q04k67k87J702M526N851M596K085O27J034
52798B45635J854J394p3o74O24K852M413M842M753M664M522M304M347M954N866
52783B94277O308N647M099K750K514L058L109J968L23p86j313j892k549k683k380
52768C12450k797m559o496o822n288l468k856l455m281m582m191l265k164j363
52754B56863j135j409k093l140m096m120l017j955k355m090n457n234m081l438
$$ plain form
52740 211243 207730 204640 203286 204075 205764 206630 206006 204316 201990 199025 195586 192246 189260 186245 183032
52725 183032 180251 178355 176597 173909 170542 167767 166005 164401 162542 161315 161371 161748 161051 159351 157791
52710 157791 156655 155045 152553 150224 149369 150044 151142 151623 151254 150316 148953 146885 143764 139865 136243
52695 136243 133918 132784 131649 129446 126283 123163 120840 119229 117813 116359 115027 113960 113104 112383 111730
52680 111730 110844 109268 106961 104385 101773 98796 95462 92825 91914 92234 92299 91634 91161 91553 92446 93681
52664 93681 96017 99671 103173 104852 104899 104915 105792 107065 108069 108734 109301 110091 111483 113480 115486 117229
52648 117229 119452 122791 126408 129009 130944 133816 137843 141232 142835 144033 146970 151841 157002 161122
52634 161122 164222 166943 169693 172281 173708 172670 169011 164437 161020 159131 157520 155256 152691 150509
$$ packed form
52740B11243l513l090j354P89J689Q66o24j690k326k965l439l340k986l015l213
52725A83032k781j896j758k688l367k775j762j604j859j227N6L77o97j700j560
52710A57791j136j610k492k329q55O75J098M81l69r38j363k068l121l899l622
52695A36243k325j134j135k203l163l120k323j611j416j454j332j067q56p21o53
52680A11730q86j576k307k576k612k977l334k637r11L20O5o65m73L92Q93J235
52664I3681K336L654L502J679M7J6Q77J273J004O65N67P90J392J997K006J743
52648A17229K223L339L617K601J935K872M027L389J603J198K937M871N161M120
52634A61122L100K721K750K588J427j038l659m574l417j889j611k264k565k182
$$ plain form
52620 150509 148689 146724 144279 141310 137996 134762 131917 129068 125331 120469 115459 111592 109282 107941
52606 107941 106630 104513 101242 97515 94950 94660 95960 97069 97029 96269 95247 93462 90399 86764 83930
52591 83930 82358 81315 80087 78758 77625 76495 74951 72979 70923 69000 67257 65984 65819 67215 69889
52576 69889 72943 75657 78020 80321 82302 83146 82410 80562 78393 76366 74956 75076 77283 80606 82980
52561 82980 83070 81275 78921 77121 76442 76926 77927 78397 77887 77080 77041 78158 80021 82138 84418 87017 89792
52544 89792 92068 93241 93767 94990 97448 99917 100997 101174 101937 103076 102576 99688 96505 95510 96804 98820
52528 98820 100603 102045 102832 102860 103226 105120 107814 109245 108831 108357 109720 112849 116338 119183 121322 123145
52512 123145 125166 127841 131126 134208 135994 136094 135453 135861 138378 142054 144815 145857 146437 147786 149187
$$ packed form
52620A50509j820j965k445k969l314l234k845k849l737m862n010l867k310j341
52606A07941j311k117l271l727k565k90J300J109m0p60j022j785l063l635k834
52591H3930j572j043j228j329j133j130j544j972k056j923j743j273j65J396K674
52576F9889L054K714K363K301J981Q44p36j848k169k027j410J20K207L323K374
52561H2980R0j795k354j800o79M84J001M70n10q07l9J117J863K117K280K599K775
52544H9792K276J173N26J223K458K469J080J77P63J139n00k888l183r95J294K016
52528I8820J783J442P87K8L66J894K694J431m14m74J363L129L489K845K139J823
52512A23145K021K675L285L082J786J00o41M08K517L676K761J042N80J349J401
$$ plain form
52497 149187 149093 147459 145680 144638 144277 144958 147636 152096 156287 158164 157647 156303 155663 156146 157019 157091 155888
52480 155888 154413 154246 155754 157690 158685 158667 158694 159845 162277 164883 165992 164942 162848 161287 160538 159879
52464 159879 159153 158875 158947 158648 158045 158152 159409 161139 162719 164135 165137 165241 164905 165293 166331 166528 165443
52447 165443 164734 165658 166986 166710 164659 162058 159674 157952 158018 160638 164647 168041 170285 172134 173625
52432 173625 174026 173584 173555 174345 175112 175404 175785 176672 177929 179818 182795 185937 187203 186056 184465 184442 185793
52415 185793 187334 189025 191440 193970 195314 195482 195780 196657 197011 196166 195302 196005 198023 199630 200112 200843
52399 200843 203403 207281 210385 211718 212613 214901 218560 221939 223929 225006 226219 228036 230449 233367
52385 233367 236339 238362 238623 237361 235653 234326 233203 231314 227873 223284 219131 216777 215957 215248 213974
$$ packed form
52497A49187r4j634j779j042l61O81K678M460M191J877n17j344o40M83Q73P2j203
52480A55888j475j67J508J936R95j8K7J151K432K606J109j050k094j561p49o59
52464A59879p26k78P2k99o03J07J257J730J580J416J002J04l36L88J038J97j085
52447A65443p09R24J328k76k051k601k384j722O6K620M009L394K244J849J491
52432A73625M01m42k9P90P67K92L81Q87J257J889K977L142J266j147j591k3J351
52415A85793J541J691K415K530J344J68K98Q77L54q45q64P03K018J607M82P31
52399B00843K560L878L104J333Q95K288L659L379J990J077J213J817K413K918
52385B33367K972K023K61j262j708j327j123j889l441m589m153k354q20p09j274
$$ plain form
52370 213974 212879 212577 212237 210660 208099 205901 204481 202774 199974 196891 194991 194658 195025 195166 194825 194133
52354 194133 193292 192634 192578 193268 194444 195732 196874 197689 198022 197784 196903 195299 193241 191657 191585 193056 194935
52337 194935 196273 197435 199356 201870 203613 203837 203654 204865 207761 210735 212148 212105 212107 213264 215387 217830
52321 217830 220617 224185 228216 231452 233074 233902 235723 239432 244222 248625 252005 254876 258038 261661
52307 261661 265162 267863 269763 271698 274624 278668 283015 286780 289831 292563 294994 296560 297071 297618 299946
52292 299946 304726 310718 315898 319159 320719 321352 321854 323027 325349 328484 331688 334783 338137 341710 345011
52277 345011 348245 352304 356971 360323 361063 360731 362174 366287 371580 376716 381891 387498 392926 397337 400709
52262 400709 403463 405787 407818 409924 412416 415438 419275 424040 428895 432492 434522 436094 438324 441601
$$ packed form
52370B13974j095l02l40j577k561k198j420j707k800l083j900l33L67J41l41o92
52354A94133q41o58n6O90J176J288J142Q15L33k38q81j604k058j584p2J471J879
52337A94935J338J162J921K514J743K24j83J211K896K974J413m3KJ157K123K443
52321B17830K787L568M031L236J622Q28J821L709M790M403L380K871L162L623
52307B61661L501K701J900J935K926M044M347L765L051K732K431J566N11N47K328
52292B99946M780N992N180L261J560O33N02J173K322L135L204L095L354L573L301
52277C45011L234M059M667L352P40l32J443M113N293N136N175N607N428M411L372
52262D00709K754K324K031K106K492L022L837M765M855L597K030J572K230L277
$$ plain form
52248 441601 446506 454061 464072 474315 482601 489030 495195 501915 509093 517324 527948 541284 555971
52235 555971 570451 584221 597299 609379 620242 630601 641850 654887 669320 683845 697448
52224 697448 710311 723506 737822 753098 768656 783903 798271 811131 822320 832501 842604
52213 842604 853225 864831 878009 892810 908130 922437 935037 946332 957170 968439 980880
52202 980880 994501 1008373 1021669 1034650 1047888 1060803 1071930 1080714 1088149 1095598 1103825 1113283
52190 1113283 1124141 1135426 1144976 1151191 1154542 1156784 1158954 1160782 1161869 1162669 1163956 1165761 1167389 1168488
52176 1168488 1169686 1171807 1174692 1177232 1178598 1179004 1179243 1180105 1182408 1186759 1192632 1198389 1203046 1207625 1213903
52161 1213903 1222286 1231911 1242357 1253800 1265435 1275542 1283950 1293121 1305572 1320842 1336144 1349498
$$ packed form
52248D41601M905P555J0011J0243Q286O429O165O720P178Q231J0624J3336J4687
52235E55971J4480J3770J3078J2080J0863J0359J1249J3037J4433J4525J3603
52224F97448J2863J3195J4316J5276J5558J5247J4368J2860J1189J0181J0103
52213H42604J0621J1606J3178J4801J5320J4307J2600J1295J0838J1269J2441
52202I80880J3621J3872J3296J2981J3238J2915J1127Q784P435P449Q227R458
52190A113283J0858J1285R550O215L351K242K170J828J087Q00J287J805J628J099
52176A168488J198K121K885K540J366M06K39Q62K303M351N873N757M657M579O278
52161A213903Q383R625J0446J1443J1635J0107Q408R171J2451J5270J5302J3354
$$ plain form
52149 1349498 1361071 1371716 1381618 1390812 1399853 1409065 1417588 1424052 1428256 1431581 1435605 1440664 1445911
52136 1445911 1450275 1452975 1453413 1451205 1446500 1439980 1432505 1424924 1418017 1412056 1406366 1399927 1392579 1385175
52122 1385175 1378323 1371691 1364921 1358414 1352569 1346850 1340606 1334369 1329254 1325195 1320886 1315721 1310710 1307025
52108 1307025 1304360 1301328 1296973 1291245 1284346 1276315 1267355 1258151 1249645 1242514 1236914 1232604 1229125 1225761
52094 1225761 1221603 1216175 1210060 1204353 1199173 1193330 1186071 1178590 1172936 1169673 1167529 1165210 1162385 1158736
52080 1158736 1153315 1145760 1137412 1130190 1124488 1119030 1112855 1106742 1102238 1099657 1097539 1094098 1088826 1082538
52066 1082538 1076220 1070267 1064675 1059287 1053704 1047516 1040944 1034759 1029273 1023954 1018493 1013562 1009839 1006777
52052 1006777 1003222 998936 994665 990890 987372 983864 980472 977273 974397 972478 972315 973939 976659 979963
$$ packed form
52149A349498J1573J0645R902R194R041R212Q523O464M204L325M024N059N247
52136A445911M364K700M38k208m705o520p475p581o907n961n690o439p348p404
52122A385175o852o632o770o507n845n719o244o237n115m059m309n165n011l685
52108A307025k665l032m355n728o899q031q960r204q506p131n600m310l479l364
52094A225761m158n428o115n707n180n843p259p481n654l263k144k319k825l649
52080A158736n421p555q348p222n702n458o175o113m504k581k118l441n272o288
52066A082538o318n953n592n388n583o188o572o185n486n319n461m931l723l062
52052A006777l555m286m271l775l518l508l392l199k876j919j63J624K720L304
$$ plain form
52038 979963 983705 987558 991186 994939 999464 1004620 1009749 1015012 1021249 1028403 1035525 1042806 1052121 1064698
52024 1064698 1079477 1094859 1110926 1128570 1147305 1165708 1183722 1202926 1224311 1247016 1269605
52013 1269605 1291439 1312326 1331860 1349961 1367596 1386131 1405971 1426274 1446008 1464844 1482887
52002 1482887 1499787 1514596 1526625 1536288 1544867 1553446 1562247 1570853 1578733 1585458 1590745 1594571 1597170
51989 1597170 1598820 1599595 1599238 1597192 1592955 1586643 1579054 1570978 1562652 1554231 1546449 1540175 1535350 1530842
51975 1530842 1525399 1518378 1509809 1500359 1491208 1483399 1477289 1472937 1470502 1469493 1468209 1465306 1461884 1460584
51961 1460584 1462368 1465447 1467793 1469253 1470569 1471838 1473203 1475924 1481295 1488888 1496922 1503905 1509010 1511594
51947 1511594 1511608 1510164 1508507 1506567 1503481 1499245 1494675 1489821 1483623 1475343 1465316 1453910 1440606 1424664
$$ packed form
52038I79963L742L853L628L753M525N156N129N263O237P154P122P281R315J2577
52024A064698J4779J5382J6067J7644J8735J8403J8014J9204K1385K2705K2589
52013A269605K1834K0887J9534J8101J7635J8535J9840K0303J9734J8836J8043
52002A482887J6900J4809J2029R663Q579Q579Q801Q606P880O725N287L826K599
51989A597170J650P75l57k046m237o312p589q076q326q421p782o274m825m508
51975A530842n443p021q569r450r151p809o110m352k435j009j284k903l422j300
51961A460584J784L079K346J460J316J269J365K721N371P593Q034O983N105K584
51947A511594J4j444j657j940l086m236m570m854o198q280j0027j1406j3304j5942
$$ plain form
51933 1424664 1406277 1386549 1366522 1346407 1325668 1303701 1280462 1256398 1231857 1206844 1181266
51922 1181266 1154873 1127021 1097326 1066806 1037344 1009438 981490 952228 922852 895511 870356
51911 870356 845467 819408 792450 765464 739087 714183 691805 672181 654541 638086 622304
51900 622304 606416 589762 573026 557954 545419 534645 524629 515235 506427 497600 488477 479829
51888 479829 472481 466279 460770 456258 453297 451599 450214 448398 445644 441297 435059 427699 420563 414477
51874 414477 409604 405922 403064 400027 396011 391526 387727 384604 380815 375642 370171 365906 362882 359978
51860 359978 356628 353328 350494 347697 344237 339940 335189 330683 327392 326134 326676 327601 327657 326953 326262 325460
51844 325460 323515 319994 315691 311553 307877 304936 303437 303560 304130 303740 302410 301325 301034 300739 299421
$$ packed form
51933A424664j8387j9728k0027k0115k0739k1967k3239k4064k4541k5013k5578
51922A181266k6393k7852k9695l0520k9462k7906k7948k9262k9376k7341k5155
51911H70356k4889k6059k6958k6986k6377k4904k2378j9624j7640j6455j5782
51900F22304j5888j6654j6736j5072j2535j0774j0016r394q808q827r123q648
51888D79829p348o202n509m512k961j698j385j816k754m347o238p360p136o086
51874D14477m873l682k858l037m016m485l799l123l789n173n471m265l024k904
51860C59978l350l300k834k797l460m297m751m506l291j258N42R25N6p04o91q02
51844C25460j945l521m303m138l676k941j499J23N70l90j330j085k91k95j318
$$ plain form
51829 299421 296970 294001 291117 288656 286810 285684 285277 285437 285807 286012 286064 286296 286659 286453 285189 283409
51813 283409 282137 281730 281773 281867 281865 281476 280313 278442 276475 275225 275530 277911 281669 284783 285765 285568 286626
51796 286626 289987 294434 298525 302177 305714 308712 310871 313204 317011 321959 326291 328991 330901 333410
51782 333410 336663 339492 340834 340691 339707 338245 336399 334788 334539 336001 337984 339082 339414 340172 341592
51767 341592 342444 341866 340764 340955 343487 348119 353681 358548 361471 362612 363333 364600 366120 367359 368588
51752 368588 370179 371526 371631 370558 369464 369157 369116 367982 364784 359979 355512 353499 354510 357413 360900
51737 360900 364373 367175 368332 368046 368383 371016 374901 377729 379308 381711 385969 390531 393631 395521 397297
51722 397297 398957 400107 401718 405360 410755 415573 417940 418184 417769 417587 417937 419357 422397 426635 430684
$$ packed form
51829B99421k451k969k884k461j846j126m07J60L70K05N2K32L63k06j264j780
51813B83409j272m07M3R4kl89j163j871j967j250L05K381L758L114R82j97J058
51796B86626L361M447M091L652L537K998K159K333L807M948M332K700J910K509
51782C33410L253K829J342j43r84j462j846j611k49J462J983J098L32P58J420
51767C41592Q52n78j102J91K532M632N562M867K923J141P21J267J520J239J229
51752C68588J591J347J05j073j094l07m1j134l198m805m467k013J011K903L487
51737C60900L473K802J157k86L37K633L885K828J579K403M258M562L100J890J776
51722C97297J660J150J611L642N395M818K367K44m15j82L50J420L040M238M049
$$ plain form
51707 430684 433360 434517 434773 434937 435728 437523 440001 442482 444991 448582 454077 460821 467434 473605 480168
51692 480168 487264 493478 497510 499909 502237 504925 506906 507250 506190 504292 501378 496860 490867 484609
51678 484609 479629 476712 475493 475107 475214 476083 477524 478224 476730 472951 468169 463708 460208 457966 457038
51663 457038 456728 455792 453673 451009 448530 445997 442671 438300 433110 427311 421315 416004 411949 408537 404722
51648 404722 400507 396806 393822 390609 386648 382876 380458 379194 377946 376224 374508 373258 372458 372084 372161
51633 372161 372227 371469 369710 367753 366566 366698 368537 372323 377393 382227 385982 389563 394467 400981 408331
51618 408331 416173 424748 433564 441198 446872 451268 455194 458250 459624 459683 459768 460480 460938 459912 457207 453754
51602 453754 450587 447835 444526 439421 432242 423942 415602 407273 398397 389203 381020 374806 369705 363584
$$ packed form
51707D30684K676J157K56J64P91J795K478K481K509L591N495O744O613O171O563
51692D80168P096O214M032K399K328K688J981L44j060j898k914m518n993o258
51678D84609m980k917j219l86J07Q69J441P00j494l779m782m461l500k242r28
51663D57038l10r36k119k664k479k533l326m371n190n799n996n311m055l412l815
51648D04722m215l701k984l213l961l772k418j264j248j722j716j250q00l74P7
51633C72161O6p58j759j957j187J32J839L786N070M834L755L581M904O514P350
51618D08331P842Q575Q816P634N674M396L926L056J374N9Q5P12M58j026k705l453
51602D53754l167k752l309n105p179q300q340q329q876r194q183o214n101o121
$$ plain form
51588 363584 355107 345113 335913 329422 326003 324835 324868 325257 325262 324294 322184 319174 315637 312006 308829 306472
51572 306472 304782 303477 302910 303875 306420 309354 311258 311622 310735 308992 306798 304672 302862 301154 299544
51557 299544 298658 298843 299302 299011 298286 298472 300152 302647 305344 308399 311780 314745 316928 319058 321809 324609
51541 324609 326536 327854 329765 332911 337017 341670 346452 350496 353238 355874 360874 369367 379810 389950
51527 389950 399313 408859 418738 427779 435264 442142 449873 458737 467808 476181 483608 490051 495129 498110
51513 498110 498387 496167 492815 490185 489089 488559 487112 484691 482836 482902 484716 487249 489987 493091 496636
51498 496636 500386 504271 508572 513584 519378 525830 532533 538805 544306 549624 555718 562701 569683 575908
51484 575908 581389 586220 589953 592206 593329 593813 593508 592209 590766 590642 592192 594228 595531 596085 596394
$$ packed form
51588C63584q477r994r200o491l419j168L3L89Nr68k110l010l537l631l177k357
51572C06472j690j305n67R65K545K934J904L64q87j743k194k126j810j708j610
51557B99544q86J85M59k91p25J86J680K495K697L055L381K965K183K130K751K800
51541C24609J927J318J911L146M106M653M782M044K742K636N000Q493J0443J0140
51527C89950R363R546R879R041P485O878P731Q864R071Q373P427O443N078K981
51513D98110K77k220l352k630j096n30j447k421j855O6J814K533K738L104L545
51498D96636L750L885M301N012N794O452O703O272N501N318O094O983O982O225
51484E75908N481M831L733K253J123M84l05j299j443j24J550K036J303N54L09
$$ plain form
51469 596394 596264 595056 592845 590628 589251 588524 587494 585407 582337 578955 575629 571844 566814 560770 555109
51454 555109 550837 547268 542867 537104 530781 524681 518761 512790 506962 501510 496418 491937 488742 486960
51440 486960 485631 483879 482212 481745 482368 482622 481464 479292 477012 474867 472615 470325 468561 468134 469794
51425 469794 473551 477995 481001 481808 481960 483577 487096 491303 495067 498128 500528 502534 505208 509772 515941
51410 515941 521909 526775 532096 540107 550868 562210 572255 580948 589135 597089 604359 610517 615735
51397 615735 620886 626971 633916 640000 643259 643690 643346 643967 645246 645771 644820 642497 638860 634036 628884
51382 628884 624477 620861 617091 612537 607407 601874 595479 587664 578316 567547 555525 542779 530169
51369 530169 518142 506560 495612 486341 479619 474860 470399 465310 460478 457588 457031 457033 455303 451725
$$ packed form
51469E96394j30j208k211k217j377p27j030k087l070l382l326l785n030o044n661
51454E55109m272l569m401n763o323o100n920n971n828n452n092m481l195j782
51440D86960j329j752j667m67O23K54j158k172k280k145k252k290j764m27J660
51425D69794L757M444L006Q07J52J617L519M207L764L061K400K006K674M564O169
51410E15941N968M866N321Q011J0761J1342J0045Q693Q187P954P270O158N218
51397F15735N151O085O945O084L259M31l44O21J279N25r51k323l637m824n152
51382F28884m407l616l770m554n130n533o395p815r348j0769j2022j2746j2610
51369E30169j2027j1582j0948r271o722m759m461n089m832k890n57Kj730l578
$$ plain form
51355 451725 448932 449637 453698 458601 462596 466312 471130 477191 483636 489844 495508 500040 502840 503905
51341 503905 503577 501900 498711 493923 487306 478409 467300 454943 442318 429765 417688 407046 398021
51328 398021 388960 378000 365510 353670 343859 335808 329173 324230 320537 316395 310482 303140 295416
51315 295416 287821 280695 274808 270576 267230 263571 259153 254148 248681 243160 238767 236525 235832 234711
51301 234711 231753 227412 223345 220837 219875 219461 218729 217805 217491 218091 218903 219061 218512 217886 217729 218271 219743
51284 219743 222349 225810 229274 231985 234109 236729 240760 245774 250256 253279 255628 258862 263611 269350
51270 269350 275558 282217 289232 296249 303212 310320 317234 323236 328412 333731 339448 344297 347065 348288
51256 348288 349509 351151 351894 349948 344495 336126 326521 317498 309895 303211 296411 288892 280751 272708
$$ packed form
51355D51725k793P05M061M903L995L716M818O061O445O208N664M532K800J065
51341E03905l28j677l189m788o617q897j1109j2357j2625j2553j2077j0642r025
51328C98021r061j0960j2490j1840r811q051o635m943l693m142n913p342p724
51315B95416p595p126n887m232l346l659m418n005n467n521m393k242o93j121
51301B34711k958m341m067k508r62m14p32r24l14O00Q12J58n49o26j57N42J472
51284B19743K606L461L464K711K124K620M031N014M482L023K349L234M749N739
51270B69350O208O659P015P017O963P108O914O002N176N319N717M849K768J223
51256C48288J221J642P43j946n453q369r605r023p603o684o800p519q141q043
$$ plain form
51242 272708 265853 260876 257180 253281 248225 242084 235103 227387 219765 213724 209752 206720 203662 201179
51228 201179 200005 199247 197482 195011 193535 193820 195011 196201 197392 198756 200068 201199 202325 203295 203373
51213 203373 201963 199251 196172 193923 193195 193450 193399 192585 191867 191796 191521 190314 189258 189782 191068 190771 188282
51196 188282 185608 184748 185813 187981 190575 192480 192139 189283 185541 182284 178847 174071 168741 164952 163282
51181 163282 162056 159749 157076 155978 156994 158519 158880 158502 159138 161176 162895 162955 162344 162748 163896 164261
51165 164261 163914 164715 167492 170764 172836 173518 173088 171244 168280 165905 165463 166135 166304 166018 166663 168573
51149 168573 170414 171031 170744 170526 170743 171127 171422 171672 172010 172414 172718 172865 173015 173249 173410 173669 174932 177914
51131 177914 181890 185259 187447 189295 191353 192900 193128 192322 191285 190546 190708 192534 195775 198833 200506
$$ packed form
51242B72708o855m977l696l899n056o141o981p716p622o041l972l032l058k483
51228B01179j174p58j765k471j476K85J191J190J191J364J312J131J126R70P8
51213B03373j410k712l079k249p28K55n1q14p18p1k75j207j056N24J286k97k489
51196A88282k674q60J065K168K594J905l41k856l742l257l437m776n330l789j670
51181A63282j226k307k673j098J016J525L61l78O36K038J719O0o11M04J148L65
51165A64261l47Q01K777L272K072O82m30j844k964k375m42O72J69k86O45J910
51149A68573J841O17k87k18K17L84K95K50L38M04L04J47J50K34J61K59J263K982
51131A77914L976L369K188J848K058J547K28q06j037p39J62J826L241L058J673
$$ plain form
51116 200506 201359 202495 203871 204796 205238 205333 204359 201646 198238 196220 196434 197857 199055 199286 198492 197254
51100 197254 196552 196463 195471 192243 187709 184086 182079 180590 178998 177942 177650 177289 176591 176464 177214 177715 177422
51083 177422 177832 180640 185405 190288 194289 197432 199423 199710 198714 197602 196688 195226 193017 191123 190457
51068 190457 190430 189683 187779 185561 183924 182686 180814 177543 173109 168457 164477 161610 159936 159302 159330 159604
51052 159604 159991 160575 161301 161936 162466 163216 164422 165807 166711 166577 165423 164002 163318 163605 163979 163539 162706
51035 162706 162790 164367 166885 169983 174149 179490 184759 188484 190567 191948 193057 193553 193409 193267 193520 193789
51019 193789 193544 192780 191882 191341 191756 193521 196137 198214 198631 197626 196595 196947 199212 202828 206576 209421
51003 209421 211335 213162 215631 218670 221906 225407 229385 233294 235857 236266 235065 233713 233491 234908 237668
$$ packed form
51116B00506Q53J136J376R25M42R5r74k713l408k018K14J423J198K31p94j238
51100A97254p02q9r92l228m534l623k007j489j592j056k92l61o98j27P50N01k93
51083A77422M10K808M765M883M001L143J991K87r96j112r14j462k209j894o66
51068A90457k7p47j904k218j637j238j872l271m434m652l980k867j674o34K8K74
51052A59604L87N84P26O35N30P50J206J385R04j34j154j421o84K87L74m40q33
51035A62706Q4J577K518L098M166N341N269L725K083J381J109M96j44j42K53K69
51019A93789k45p64q98n41M15J765K616K077M17j005j031L52K265L616L748K845
51003B09421J914J827K469L039L236L501L978L909K563M09j201j352k22J417K760
$$ plain form
50988 237668 240784 242929 243313 242413 241523 241422 241718 241580 240842 240056 239627 239420 239303 239654 240943 242992 245102
50971 245102 246888 248485 249722 249604 247352 243879 241480 241717 244072 247011 249806 252715 255899 259106 262416
50956 262416 266255 270213 272656 272263 269621 266652 264635 263354 262120 261066 261177 263208 266801 270759 274332
50941 274332 278214 283890 291798 300466 307896 313511 318302 323295 328558 333835 339549 346593 355233 364605
50927 364605 373592 382163 391492 402477 414420 425800 436397 447912 462071 478770 496696 515180
50915 515180 534648 555597 578099 602187 627777 654248 681053 709014 740188 776120 816857
50904 816857 861754 910280 961669 1014821 1069384 1126222 1185925 1247338 1308343 1367737 1425507
50893 1425507 1481605 1535432 1586465 1634487 1679065 1719598 1756053 1788990 1818518 1843725 1863471
$$ packed form
50988B37668L116K145L84r00q90j01K96j38p38p86m29k07j17L51J289K049K110
50971B45102J786J597J237j18k252l473k399K37K355K939K795K909L184L207L310
50956B62416L839L958K443l93k642k969k017j281j234j054J11K031L593L958L573
50941B74332L882N676P908Q668P430N615M791M993N263N277N714P044Q640R372
50927C64605Q987Q571R329J0985J1943J1380J0597J1515J4159J6699J7926J8484
50915E15180J9468K0949K2502K4088K5590K6471K6805K7961L1174L5932M0737
50904H16857M4897M8526N1389N3152N4563N6838N9703O1413O1005N9394N7770
50893A425507N6098N3827N1033M8022M4578M0533L6455L2937K9528K5207J9746
$$ plain form
50882 1863471 1877443 1886291 1891196 1893527 1894550 1895046 1895238 1895131 1894718 1893890 1892452 1890184 1886486 1879984 1869163
50867 1869163 1853635 1834295 1811940 1786279 1756674 1723262 1686648 1646808 1603199 1555986 1506564
50856 1506564 1456586 1406853 1357198 1307202 1257001 1207766 1161471 1119768 1082868 1049669 1018999
50845 1018999 990475 964185 940078 918030 898189 880934 866538 854970 845943 839039 833896 830327
50833 830327 828173 827102 826793 827263 828701 830923 833468 836333 840177 845541 852187 859423 866725 873833 880649
50818 880649 887349 894251 901374 908537 916110 924972 935268 945924 956078 966415 978189 991449 1005213
50805 1005213 1019096 1033705 1049654 1067339 1087632 1111523 1138905 1168839 1201239 1237232 1277646
50794 1277646 1322498 1372367 1428814 1492548 1562481 1637644 1718943 1807777 1903839 2005628 2112441
$$ packed form
50882A863471J3972Q848M905K331J023M96J92j07m13q28j438k268l698o502j0821
50867A869163j5528j9340k2355k5661k9605l3412l6614l9840m3609m7213m9422
50856A506564m9978m9733m9655m9996n0201m9235m6295m1703l6900l3199l0670
50845A018999k8524k6290k4107k2048j9841j7255j4396j1568r027o904n143l569
50833H30327k154j071l09M70J438K222K545K865L844N364O646P236P302P108O816
50818H80649O700O902P123P163P573Q862J0296J0656J0154J0337J1774J3260J3764
50805A005213J3883J4609J5949J7685K0293K3891K7382K9934L2400L5993M0414
50794A277646M4852M9869N6447O3734O9933P5163Q1299Q8834R6062J01789J06813
$$ plain form
50783 2112441 2224444 2341310 2462270 2587220 2716247 2848108 2980471 3111454 3239410
50774 3239410 3361212 3472719 3571649 3658572 3734354 3798018 3848198 3885454 3911732 3928368 3936159
50763 3936159 3937069 3934270 3930117 3925112 3919280 3913817 3910676 3910774 3913074 3915468 3916176 3913954 3906919 3891751 3864902
50748 3864902 3824835 3772608 3710032 3637819 3555901 3464875 3366349 3262249 3154713 3046610 2941132
50737 2941132 2840305 2744478 2653716 2569262 2493083 2426314 2368902 2320763 2282610 2255307 2238854
50726 2238854 2232462 2235354 2247047 2267084 2294965 2330185 2371683 2417243 2464167 2510855 2557087 2602313
50714 2602313 2644344 2680535 2709783 2732465 2748646 2757505 2758705 2753253 2742339 2725939 2703370 2674891
50702 2674891 2642078 2606555 2568835 2528472 2484960 2438328 2389125 2338263 2286929 2236344 2187180
$$ packed form
50783B112441J12003J16866J20960J24950J29027J31861J32363J30983J27956
50774C239410J21802J11507R8930Q6923P5782O3664N0180L7256K6278J6636P791
50763C936159R10k799m153n005n832n463l141R8K300K394P08k222p035j5168k6849
50748C864902m0067n2227o2576p2213q1918r1026r8526j04100j07536j08103j05478
50737B941132j00827r5827r0762q4454p6179o6769n7412m8139l8153k7303j6453
50726B238854o392K892J1693K0037K7881L5220M1498M5560M6924M6688M6232M5226
50714B602313M2031L6191K9248K2682J6181Q859J200n452j0914j6400k2569k8479
50702B674891l2813l5523l7720m0363m3512m6632m9203n0862n1334n0585m9164
$$ plain form
50691 2187180 2139249 2092191 2046694 2004654 1967765 1936187 1908926 1885252 1865379 1850067 1840189
50680 1840189 1836511 1839262 1847979 1862364 1883094 1911011 1945637 1985573 2030586 2082160 2141434 2207559
50668 2207559 2278857 2354809 2435803 2521393 2609837 2699233 2788260 2875830 2960698 3041330 3115554
50657 3115554 3180597 3234411 3276999 3309586 3332306 3343724 3343005 3331532 3311657 3284807 3251988 3215627
50645 3215627 3179361 3145703 3115130 3087967 3065935 3050569 3040772 3033408 3026437 3020202 3015216 3009793
50633 3009793 3000811 2986105 2965105 2937638 2903502 2863411 2819361 2773473 2726967 2680625 2635804
50622 2635804 2594524 2558662 2529193 2505972 2488157 2475181 2467593 2466944 2475047 2493516 2523540 2565210
50610 2565210 2617113 2677567 2746558 2825806 2916579 3018294 3129641 3250006 3378706 3513339
$$ packed form
50691B187180m7931m7058m5497m2040l6889l1578k7261k3674j9873j5312r878
50680A840189l678K751Q717J4385K0730K7917L4626L9936M5013N1574N9274O6125
50668B207559P1298P5952Q0994Q5590Q8444Q9396Q9027Q7570Q4868Q0632P4224
50657C115554O5043N3814M2588L2587K2720J1418p19j1473j9875k6850l2819l6361
50645C215627l6266l3658l0573k7163k2032j5366r797p364o971o235m986n423
50633C009793q982j4706k1000k7467l4136m0091m4050m5888m6506m6342m4821
50622B635804m1280l5862k9469k3221j7815j2976p588o49Q103J8469L0024M1670
50610B565210N1903O0454O8991P9248R0773J01715J11347J20365J28700J34633
$$ plain form
50600 3513339 3650032 3785179 3916197 4040844 4156975 4263200 4358962 4443538 4515574 4574088
50590 4574088 4619568 4653592 4677354 4690748 4692914 4683693 4664642 4638477 4607363 4571902 4532065 4488965
50578 4488965 4445284 4404036 4367325 4336216 4311121 4291906 4277941 4268583 4263684 4263513 4268095 4276637
50566 4276637 4287448 4298442 4307838 4314494 4317631 4316541 4310904 4301400 4289591 4276783 4263019 4247374
50554 4247374 4229392 4210182 4192075 4177280 4166927 4161265 4160313 4163965 4171672 4182364 4194623 4206592
50542 4206592 4215992 4220962 4221026 4216436 4206143 4187024 4155776 4111249 4054531 3987300 3910828 3826161
50530 3826161 3734137 3635122 3529519 3418797 3305394 3191424 3078126 2966852 2859812 2759239
50520 2759239 2666113 2580086 2500307 2426055 2357041 2293775 2237470 2189054 2148294 2114251 2086333
$$ packed form
50600C513339J36693J35147J31018J24647J16131J06225R5762Q4576P2036N8514
50590D574088M5480L4024K3762J3394K166r221j9051k6165l1114l5461l9837m3100
50578D488965m3681m1248l6711l1109k5095j9215j3965r358m899j71M582Q542
50566D276637J0811J0994R396O656L137j090n637r504j1809j2808j3764j5645
50554D247374j7982j9210j8107j4795j0353n662r52L652P707J0692J2259J1969
50542D206592R400M970O4m590j0293j9119l1248m4527n6718o7231p6472q4667
50530C826161r2024r9015j05603j10722j13403j13970j13298j11274j07040j00573
50520B759239r3126q6027p9779p4252o9014o3266n6305m8416m0760l4043k7918
$$ plain form
50509 2086333 2064456 2048298 2037104 2030309 2027868 2029828 2036152 2047228 2063990 2086955 2115479 2148453
50497 2148453 2185636 2227769 2275510 2328761 2387212 2451142 2521545 2599638 2686229 2781237 2883808
50486 2883808 2993148 3109074 3231295 3358301 3487713 3617700 3747176 3874364 3996298
50477 3996298 4110553 4216739 4315391 4406158 4488379 4563236 4634014 4703918 4774383 4845504 4917150
50466 4917150 4989429 5062954 5138983 5218675 5302040 5388397 5478075 5572806 5673987 5781189 5892591
50455 5892591 6006044 6119293 6229990 6336171 6436155 6527465 6606391 6669152 6713134 6736816
50445 6736816 6739298 6720414 6680543 6619712 6537652 6435534 6317064 6187145 6050012 5909331
50435 5909331 5769368 5634887 5509978 5397595 5299781 5217600 5151171 5100463 5065633 5046026
$$ packed form
50509B086333k1877j6158j1194o795k441J960O324J1076J6762K2965K8524L2974
50497B148453L7183M2133M7741N3251N8451O3930P0403P8093Q6591R5008J02571
50486B883808J09340J15926J22221J27006J29412J29987J29476J27188J21934
50477C996298J14255J06186R8652R0767Q2221P4857P0778O9904P0465P1121P1646
50466D917150P2279P3525P6029P9692Q3365Q6357Q9678R4731J01181J07202J11402
50455E892591J13453J13249J10697J06181R9984R1310P8926O2761M3982K3682
50445F736816K482j8884l9871o0831q2060j02118j18470j29919j37133j40681
50435E909331j39963j34481j24909j12383r7814q2181o6429n0708l4830j9607
$$ plain form
50425 5046026 5039394 5042691 5052925 5066425 5078200 5083198 5077651 5058103 5020128 4959765 4875975 4770357
50413 4770357 4644953 4502034 4345587 4180808 4011723 3840867 3671270 3506625 3348861
50404 3348861 3197575 3052847 2916896 2791759 2676892 2570499 2472144 2382683 2302481 2231043
50394 2231043 2167726 2111568 2061043 2015163 1974510 1940254 1912666 1891366 1876181 1866598 1861013 1858030
50382 1858030 1858283 1863677 1874835 1890345 1908506 1928789 1951618 1977680 2007648 2041716 2079284 2119627
50370 2119627 2162736 2208793 2257072 2306348 2356359 2408005 2462137 2519040 2579043 2642372 2708089
50359 2708089 2774169 2839159 2903026 2966102 3028131 3088924 3149149 3209793 3271253 3333334 3395685
50348 3395685 3457961 3520375 3584503 3652507 3724535 3797506 3867563 3933502 3996808 4058617 4117787
$$ packed form
50425E046026o632L297J0234J3500J1775M998n547j9548l7975o0363q3790j05618
50413D770357j25404j42919j56447j64779j69085j70856j69597j64645j57764
50404C348861j51286j44728j35951j25137j14867j06393r8355q9461q0202p1438
50394B231043o3317n6158n0525m5880m0653l4256k7588k1300j5185r583n585k983
50382A858030K53N394J1158J5510J8161K0283K2829K6062K9968L4068L7568M0343
50370B119627M3109M6057M8279M9276N0011N1646N4132N6903O0003O3329O5717
50359B708089O6080O4990O3867O3076O2029O0793O0225O0644O1460O2081O2351
50348C395685O2276O2414O4128O8004P2028P2971P0057O5939O3306O1809N9170
$$ plain form
50337 4117787 4172006 4219610 4259879 4292375 4316533 4331288 4334721 4324694 4300306 4262186 4210983
50326 4210983 4146347 4068114 3977809 3877846 3769801 3654855 3535883 3417563 3303860 3196546
50316 3196546 3096785 3006865 2929049 2863536 2808978 2764812 2731687 2709549 2696544 2690348 2689653 2693642
50304 2693642 2700410 2706584 2708526 2703900 2692200 2673734 2647987 2613384 2569022 2516052 2456507 2391358
50292 2391358 2320998 2247432 2174200 2103551 2035098 1968096 1903726 1843873 1788633 1736509 1686706
50281 1686706 1639956 1597217 1558627 1523702 1491700 1461960 1434730 1411535 1393648 1380278 1369264
50270 1369264 1359693 1352778 1349869 1350530 1353120 1356547 1360988 1367471 1377216 1390854 1407677 1425883 1444072
50257 1444072 1462341 1481707 1502779 1525391 1549299 1574693 1601815 1630266 1659034 1687496 1716381
$$ packed form
50337D117787N4219M7604M0269L2496K4158J4755L433j0027k4388l8120n1203
50326D210983o4636p8233r0305r9963j08045j14946j18972j18320j13703j07314
50316C196546r9761q9920p7816o5513n4558m4166l3125k2138j3005o196o95L989
50304B693642O768O174J942m626j1700j8466k5747l4603m4362n2970n9545o5149
50292B391358p0360p3566p3232p0649o8453o7002o4370n9853n5240n2124m9803
50281A686706m6750m2739l8590l4925l2002k9740k7230k3195j7887j3370j1014
50270A369264r571o915k909O61K590L427M441O483R745J3638J6823J8206J8189
50257A444072J8269J9366K1072K2612K3908K5394K7122K8451K8768K8462K8885
$$ plain form
50246 1716381 1747353 1781213 1816684 1851350 1883677 1913702 1941984 1968560 1992961 2014575 2032669
50235 2032669 2046364 2054944 2058113 2056121 2049915 2040952 2030235 2017588 2002386 1984740 1965129 1943056
50223 1943056 1917339 1888106 1857146 1825517 1792012 1755283 1716632 1679058 1643763 1609255 1574183
50212 1574183 1539647 1507849 1479375 1452713 1425955 1398193 1369623 1341157 1313906 1288370 1263981
50201 1263981 1239880 1216295 1194683 1176262 1160762 1146921 1133955 1122104 1111748 1102526 1093596 1084661
50189 1084661 1076352 1069451 1063872 1058668 1053229 1048360 1045773 1046281 1048690 1050783 1051399 1051320 1052255 1055263 1060035
50174 1060035 1065145 1068903 1070555 1070973 1071758 1073410 1074905 1075393 1075503 1076161 1076747 1075549 1071847 1066505 1060535
50159 1060535 1054331 1048509 1044147 1041337 1038560 1034418 1029380 1024828 1020975 1016800 1011802 1006672 1002216 998531
$$ packed form
50246A716381L0972L3860L5471L4666L2327L0025K8282K6576K4401K1614J8094
50235B032669J3695Q580L169j992o206q963j0717j2647j5202j7646j9611k2073
50223A943056k5717k9233l0960l1629l3505l6729l8651l7574l5295l4508l5072
50212A574183l4536l1798k8474k6662k6758k7762k8570k8466k7251k5536k4389
50201A263981k4101k3585k1612j8421j5500j3841j2966j1851j0356r222q930q935
50189A084661q309o901n579n204n439m869k587N08K409K093O16p9R35L008M772
50174A060035N110L758J652M18P85J652J495M88J10O58N86j198l702n342n970
50159A060535o204n822m362k810k777m142n038m552l853m175m998n130m456l685
$$ plain form
50145 998531 995333 992239 988636 984254 980141 978106 978601 979936 980327 980132 981164 984209 988316 992438 996686
50130 996686 1001519 1006573 1011093 1015151 1019635 1024981 1030502 1035207 1038828 1041704 1043843 1044611 1043473 1040654
50116 1040654 1036729 1031656 1024678 1015513 1005428 996578 989968 984411 977967 970314 963159 958145 954963 952026
50102 952026 948526 945049 942239 939749 936854 933590 930791 929288 929398 930768 932253 932317 930259 927084 924613
50087 924613 923675 923532 923087 922071 920999 920558 921353 923669 927009 930165 932304 933883 936104 939662 944340
50072 944340 949567 954739 959141 962346 965058 968925 975086 983140 991908 1000816 1010047 1019682 1029458 1039353
50058 1039353 1049520 1059222 1066594 1070382 1071808 1073867 1078369 1084109 1088298 1089580 1089159 1089115 1090195 1091511
50044 1091511 1091979 1091499 1090702 1090055 1089640 1089586 1090203 1091520 1093096 1094727 1097111 1101312 1107538 1115045 1123363 1133041
$$ packed form
50145I98531l198l094l603m382m113k035M95J335L91j95J032L045M107M122M248
50130I96686M833N054M520M058M484N346N521M705L621K876K139P68j138k819
50116A040654l925n073o978r165j0085q850o610n557o444p653p155n014l182k937
50102I52026l500l477k810k490k895l264k799j503J10J370J485O4k058l175k471
50087I24613r38j43m45j016j072m41P95K316L340L156K139J579K221L558M678
50072I44340N227N172M402L205K712L867O161Q054Q768Q908R231R635R776R895
50058A039353J0167R702P372L788J426K059M502N740M189J282m21m4J080J316
50044A091511M68m80p97o47m15n4O17J317J576J631K384M201O226P507Q318R678
$$ plain form
50028 1133041 1144691 1157800 1171241 1184788 1199167 1214560 1229990 1244761 1259834 1277048 1297352
50017 1297352 1320464 1345942 1373693 1403414 1434413 1466330 1499507 1534362 1570802 1608406 1646722
50006 1646722 1685154 1723107 1760647 1798628 1837811 1878230 1919777 1962843 2007796 2054335 2102242
49995 2102242 2152683 2207898 2269471 2337433 2411040 2489801 2573682 2663225 2759728 2864623 2978052
49984 2978052 3098377 3223174 3349862 3474883 3593217 3700106 3793332 3873110 3939922 3993556
49974 3993556 4034511 4065409 4090148 4111715 4131020 4147302 4159005 4164145 4160209 4143995 4111844 4060571
49962 4060571 3988610 3896546 3786711 3662540 3528139 3387827 3245485 3104271 2966961 2836081
49952 2836081 2713242 2598569 2491305 2391095 2298440 2214045 2138125 2070328 2009789 1955166
$$ packed form
50028A133041J1650J3109J3441J3547J4379J5393J5430J4771J5073J7214K0304
50017A297352K3112K5478K7751K9721L0999L1917L3177L4855L6440L7604L8316
50006A646722L8432L7953L7540L7981L9183M0419M1547M3066M4953M6539M7907
49995B102242N0441N5215O1573O7962P3607P8761Q3881Q9543R6503J04895J13429
49984B978052J20325J24797J26688J25021J18334J06889R3226P9778O6812N3634
49974C993556M0955L0898K4739K1567J9305J6282J1703N140l936j6214l2151n1273
49962D060571p1961r2064j09835j24171j34401j40312j42342j41214j37310j30880
49952B836081j22839j14673j07264j00210r2655q4395p5920o7797o0539n4623
$$ plain form
49942 1955166 1905123 1859024 1816948 1778950 1744732 1714104 1687115 1663365 1641790 1621678 1603424
49931 1603424 1587580 1573535 1559961 1546355 1533341 1521566 1511198 1502443 1495412 1489160 1481898 1472765
49919 1472765 1462606 1452532 1442584 1432571 1423380 1416348 1411707 1408600 1406327 1404728 1403751 1403713 1405790 1411130
49905 1411130 1419340 1428746 1438168 1447625 1457499 1468251 1481119 1497643 1517829 1539811 1562113 1585343
49893 1585343 1610869 1638744 1668054 1698665 1731379 1766508 1803517 1842262 1883708 1929114 1979153
49882 1979153 2034090 2094287 2160169 2231962 2309855 2394487 2487138 2589423 2702695 2827701 2964844
49871 2964844 3114698 3277928 3454622 3643889 3844000 4052290 4264643 4475503 4678964
49862 4678964 4870033 5045284 5203297 5345012 5472921 5589149 5694418 5789044 5874153 5950973
$$ packed form
49942A955166n0043m6099m2076l7998l4218l0628k6989k3750k1575k0112j8254
49931A603424j5844j4045j3574j3606j3014j1775j0368q755p031o252p262r133
49919A472765j0159j0074r948j0013r191p032m641l107k273j599r77l8K077N340
49905A411130Q210R406R422R457R874J0752J2868J6524K0186K1982K2302K3230
49893A585343K5526K7875K9310L0611L2714L5129L7009L8745M1446M5406N0039
49882A979153N4937O0197O5882P1793P7893Q4632R2651J02285J13272J25006J37143
49871B964844J49854J63230J76694J89267K00111K08290K12353K10860K03461
49862D678964J91069J75251J58013J41715J27909J16228J05269R4626Q5109P6820
$$ plain form
49852 5950973 6019092 6076020 6118054 6140747 6138945 6107857 6044917 5950507 5827062 5678160 5508368
$$ packed form
49852E950973O8119N6928M2034K2693j802l1088o2940r4410j23445j48902j69792
$$ [...]
##END NTUPLES=NMR SPECTRUM
##END=
