##TITLE=coffee_type TORI01-ROVE100C_85-15%
COFFEE_meoh_noesyp64 COFFEE_meoh {C:\Bruker\TOPSPIN} Administrator 6
##JCAMPDX= 6.0         $$ Bruker NMR JCAMP-DX V2.0
##DATA TYPE= NMR SPECTRUM
##DATA CLASS= NTUPLES
##ORIGIN= Bruker BioSpin GmbH
##OWNER= Administrator
$$ 1.72 TOPSPIN		Version 2.1
$$ 2012-05-18 15:40:26.245 -0700  Administrator@X
$$ Compression mode = diff/dup
##.OBSERVE FREQUENCY= 400.13188235
##.OBSERVE NUCLEUS= ^1H
##.ACQUISITION MODE= SIMULTANEOUS (DQD)
##.ACQUISITION SCHEME= undefined
##.AVERAGES= 64
##.DIGITISER RES= 22
##SPECTROMETER/DATA SYSTEM= spect
##.PULSE SEQUENCE= noesygpps1d.comp
##.SOLVENT NAME= COFFEE_meoh
##.SHIFT REFERENCE= INTERNAL, COFFEE_meoh, 1, 14.98061
##AUDIT TRAIL= $$ (NUMBER, WHEN, WHO, WHERE, PROCESS, VERSION, WHAT)
$$ ##TITLE= Audit trail, TOPSPIN		Version 2.1
$$ ##JCAMPDX= 5.01
$$ ##ORIGIN= Bruker BioSpin GmbH
$$ ##OWNER= Administrator
$$ $$ C:\Bruker\TOPSPIN/data/Administrator/nmr/12-COFFEE-2002/62/pdata/1/auditp.txt
$$ ##AUDIT TRAIL=  $$ (NUMBER, WHEN, WHO, WHERE, PROCESS, VERSION, WHAT)
(   1,<2012-02-20 22:27:59.141 -0500>,<Administrator>,<TOPSPIN>,<go>,<TOPSPIN 2.1>,
      <created by zg
	started at 2012-02-20 22:16:28.875 -0500,
	POWCHK enabled, PULCHK disabled,
       configuration hash MD5:
       B0 76 FB 9C 50 81 44 7D 18 B3 26 32 4E 60 AD 96
       data hash MD5: 64K
       C6 3B 82 8E EB 7D 16 DC 25 FD 4A 8E 27 2D 68 30>)
(   2,<2012-02-20 22:28:01.906 -0500>,<Administrator>,<TOPSPIN>,<proc1d>,<TOPSPIN 2.1>,
      <Start of raw data processing
       efp LB = 0.3 FT_mod = 6 PKNL = 1 PHC0 = 0 PHC1 = 0 SI = 128K 
       data hash MD5: 128K
       D8 D8 4E 3A 87 9B 69 F9 D5 D5 3C 1B AC F2 1A 2C>)
(   3,<2012-02-20 22:28:03.219 -0500>,<Administrator>,<TOPSPIN>,<proc1d>,<TOPSPIN 2.1>,
      <pk PHC0 = 18.05054 PHC1 = 0 
       data hash MD5: 128K
       35 23 E4 BF CE A6 D1 BF 9D EA BC 47 6B 82 73 F5>)
(   4,<2012-02-20 22:28:03.719 -0500>,<Administrator>,<TOPSPIN>,<proc1d>,<TOPSPIN 2.1>,
      <abs ABSG = 1 
       data hash MD5: 128K
       C0 1A D5 31 97 E3 A3 FF 1C F2 3B A3 EC 32 0E 24>)
(   5,<2012-02-20 22:28:03.797 -0500>,<Administrator>,<TOPSPIN>,<proc1d>,<TOPSPIN 2.1>,
      <abs ABSG = 2 
       data hash MD5: 128K
       F4 D1 B2 6C 3E F8 23 C7 37 4C 19 AA CB CE 2C 9F>)
(   6,<2012-02-20 22:28:03.859 -0500>,<Administrator>,<TOPSPIN>,<proc1d>,<TOPSPIN 2.1>,
      <abs ABSG = 3 
       data hash MD5: 128K
       3B 10 D5 44 88 2E 69 91 10 5E 16 41 FB 0E B6 9F>)
(   7,<2012-02-20 22:28:03.922 -0500>,<Administrator>,<TOPSPIN>,<proc1d>,<TOPSPIN 2.1>,
      <abs ABSG = 4 
       data hash MD5: 128K
       3E 21 05 25 11 48 36 D6 64 05 2F 0C 5D 78 38 94>)
(   8,<2012-02-20 22:28:03.969 -0500>,<Administrator>,<TOPSPIN>,<proc1d>,<TOPSPIN 2.1>,
      <abs ABSG = 5 
       data hash MD5: 128K
       1E B5 AC 75 80 92 79 B2 09 47 1E F9 DD FF 99 55>)
(   9,<2012-02-20 22:28:04.094 -0500>,<Administrator>,<TOPSPIN>,<audit>,<TOPSPIN 2.1>,
      <user comment:
       ICON-NMR User ID: Administrator
$$ [...]
150 150 150 150 150 150 150 150
##$TP07= 0
##$TPNAME0= <>
##$TPNAME1= <>
##$TPNAME2= <>
##$TPNAME3= <>
##$TPNAME4= <>
##$TPNAME5= <>
##$TPNAME6= <>
##$TPNAME7= <>
##$TPOAL= (0..7)
0.5 0.5 0.5 0.5 0.5 0.5 0.5 0.5
##$TPOFFS= (0..7)
0 0 0 0 0 0 0 0
##$TUNHIN= 0
##$TUNHOUT= 0
##$TUNXOUT= 0
##$USERA1= <user>
##$USERA2= <user>
##$USERA3= <user>
##$USERA4= <user>
##$USERA5= <user>
##$V9= 5
##$VALIST= <valist>
##$VCLIST= <CCCCCCCCCCCCCCC>
##$VD= 0
##$VDLIST= <DDDDDDDDDDDDDDD>
##$VPLIST= <PPPPPPPPPPPPPPP>
##$VTLIST= <TTTTTTTTTTTTTTT>
##$WBST= 1024
##$WBSW= 4
##$XGAIN= (0..3)
0 0 0 0
##$XL= 0
##$YL= 0
##$YMAX_a= 16532199
##$YMIN_a= -7595202
##$ZGOPTNS= <>
##$ZL1= 120
##$ZL2= 120
##$ZL3= 120
##$ZL4= 120
##$ABSF1= 14.98061
##$ABSF2= -5.57192
##$ABSG= 5
##$ABSL= 3
##$ALPHA= 0
##$AQORDER= 0
##$ASSFAC= 0
##$ASSFACI= 0
##$ASSFACX= 0
##$ASSWID= 0
##$AUNMP= <proc_prof1d_extract>
##$AXLEFT= 0
##$AXNAME= <>
##$AXNUC= <1H>
##$AXRIGHT= 0
##$AXTYPE= 0
##$AXUNIT= <>
##$AZFE= 0.1
##$AZFW= 0.1
##$BCFW= 0
##$BC_mod= 0
##$BYTORDP= 0
##$COROFFS= 0
##$CY= 15
##$DATMOD= 1
##$DC= 0
##$DFILT= <>
##$DTYPP= 0
##$F1P= 0
##$F2P= 0
##$FCOR= 0.5
##$FTSIZE= 131072
##$FT_mod= 6
##$GAMMA= 0
##$GB= 0
##$INTBC= 1
##$INTSCL= 1
##$ISEN= 128
##$LB= 0.3
##$LEV0= 0
##$LPBIN= 0
##$MAXI= 10000
##$MC2= 0
##$MEAN= 0
##$ME_mod= 0
##$MI= 0
##$NCOEF= 0
##$NC_proc= -3
##$NLEV= 6
##$NOISF1= 0
##$NOISF2= 0
##$NSP= 0
##$NTH_PI= 0
##$NZP= 0
##$OFFSET= 14.98061
##$PC= 1
##$PHC0= 18.05054
##$PHC1= 0
##$PH_mod= 1
##$PKNL= yes
##$PPARMOD= 0
##$PPDIAG= 0
##$PPIPTYP= 0
##$PPMPNUM= 2147483647
##$PPRESOL= 1
##$PSCAL= 4
##$PSIGN= 0
##$PYNMP= <proc.py>
##$REVERSE= no
##$SF= 400.13
##$SI= 131072
##$SIGF1= 0
##$SIGF2= 0
##$SINO= 400
##$SIOLD= 131072
##$SPECTYP= <>
##$SREGLST= <1H.CDCl3>
##$SSB= 0
##$STSI= 131072
##$STSR= 0
##$SW_p= 8223.68421052632
##$SYMM= 0
##$S_DEV= 0
##$TDeff= 65536
##$TDoff= 0
##$TI= <>
##$TILT= no
##$TM1= 0
##$TM2= 0
##$TOPLEV= 0
##$USERP1= <user>
##$USERP2= <user>
##$USERP3= <user>
##$USERP4= <user>
##$USERP5= <user>
##$WDW= 1
##$XDIM= 131072
##$YMAX_p= 320862779
##$YMIN_p= -97164771
##$CURPLOT= <Network HP LaserJet P1505>
##$CURPRIN= <$Network HP LaserJet P1505>
##$DFORMAT= <normdp>
##$LAYOUT= <+/1D_H.xwp>
##$LFORMAT= <normlp>
##$PFORMAT= <normpl>
##$SURQMSG= 1
$$ End of Bruker specific parameters
$$ ---------------------------------
##NTUPLES= NMR SPECTRUM
##VAR_NAME=  FREQUENCY,     SPECTRUM/REAL,   SPECTRUM/IMAG
##SYMBOL=    X,             R,               I
##VAR_TYPE=  INDEPENDENT,   DEPENDENT,       DEPENDENT
##VAR_FORM=  AFFN,          ASDF,            ASDF
##VAR_DIM=   131072,        131072,          131072
##UNITS=     HZ,            ARBITRARY UNITS, ARBITRARY UNITS
##FACTOR=    0.0627417313425165, 1,          1
##FIRST=     8223.62146879498, 1240,         -98357
##LAST=      0,             2612,            -98378
##MIN=       0,             -97164771,       0
##MAX=       8223.62146879498, 320862779,    0
$$ Real data points
##PAGE= N=1
##DATA TABLE= (X++(R..R)), XYDATA
$$ [...]
$$ plain form
62979 2225569 2269474 2313696 2357539 2400483 2442975 2486234 2530696 2575032 2617232 2656488 2693414
62968 2693414 2728601 2761581 2791324 2817182 2838971 2856371 2868633 2874918 2874881 2868976 2858189 2843402
62956 2843402 2824986 2803171 2778776 2753129 2727069 2700497 2673517 2647752 2625551 2607670 2592646
62945 2592646 2579100 2567801 2560431 2556835 2555015 2554001 2555378 2561316 2572159 2586775 2604318 2624392
62933 2624392 2646005 2667732 2689097 2710837 2733506 2756469 2778476 2798658 2816835 2833385 2848984
62922 2848984 2863930 2877462 2888109 2894828 2897382 2895638 2889179 2877860 2862117 2842176 2817392 2786877
62910 2786877 2750641 2709757 2665612 2619353 2571913 2524163 2476910 2430763 2385866 2341845 2298382
62899 2298382 2255914 2215400 2177289 2141186 2106760 2074374 2044395 2016434 1989801 1964270 1939767
$$ packed form
62979B225569M3905M4222M3843M2944M2492M3259M4462M4336M2200L9256L6926
62968B693414L5187L2980K9743K5858K1789J7400J2262O285l7n905j0787j4787
62956B843402j8416k1815k4395k5647k6060k6572k6980k5765k2201j7881j5024
62945B592646j3546j1299p370l596j820j014J377N938J0843J4616J7543K0074
62933B624392K1613K1727K1365K1740K2669K2963K2007K0182J8177J6550J5599
62922B848984J4946J3532J0647O719K554j744o459j1319j5743j9941k4784l0515
62910B786877l6236m0884m4145m6259m7440m7750m7253m6147m4897m4021m3463
62899B298382m2468m0514l8111l6103l4426l2386k9979k7961k6633k5531k4503
$$ plain form
62888 1939767 1915773 1891923 1868918 1847798 1828271 1808851 1788955 1769852 1752786 1736868 1719699
62877 1719699 1699821 1677942 1656033 1635836 1617999 1601882 1586195 1570371 1555286 1541998 1529877
62866 1529877 1516863 1501880 1486125 1471368 1457615 1443383 1428071 1413093 1400327 1390045 1380729
62855 1380729 1370632 1359204 1347146 1335499 1324717 1314439 1303957 1292861 1281303 1269834 1259076
62844 1259076 1249466 1241130 1233856 1227264 1221084 1215324 1210118 1205287 1200148 1194084 1187481 1181662 1177357 1173463
62830 1173463 1168061 1160715 1152968 1146365 1140821 1135426 1129921 1124496 1118780 1112220 1105218 1098909 1093970 1090598
62816 1090598 1089338 1090541 1092820 1093469 1091063 1086752 1082512 1079075 1076166 1073689 1071741 1070136 1068788 1068004
62802 1068004 1067698 1067058 1065872 1065456 1067110 1070102 1072342 1072699 1071518 1069174 1065632 1061652 1059070 1059167 1061336
$$ packed form
62888A939767k3994k3850k3005k1120j9527j9420j9896j9103j7066j5918j7169
62877A719699j9878k1879k1909k0197j7837j6117j5687j5824j5085j3288j2121
62866A529877j3014j4983j5755j4757j3753j4232j5312j4978j2766j0282r316
62855A380729j0097j1428j2058j1647j0782j0278j0482j1096j1558j1469j0758
62844A259076r610q336p274o592o180n760n206m831n139o064o603n819m305l894
62830A173463n402p346p747o603n544n395n505n425n716o560p002o309m939l372
62816A090598j260J203K279O49k406m311m240l437k909k477j948j605j348p84
62802A068004l06o40j186m16J654K992K240L57j181k344l542l980k582R7K169
$$ plain form
62787 1061336 1063809 1065194 1065208 1064528 1064161 1064469 1064719 1064083 1062960 1062615 1063527 1064905 1065838 1066082 1065632 1064491 1063143
62770 1063143 1062326 1061966 1061227 1059903 1058730 1057855 1056242 1053533 1051453 1051991 1054611 1056514 1055607 1052233 1047989
62755 1047989 1043769 1039328 1034274 1029097 1025157 1023381 1022989 1022128 1020089 1018183 1017847 1018723 1019601 1020552 1022768
62740 1022768 1026507 1030612 1034172 1037373 1040487 1043467 1047172 1053599 1063766 1076190 1088700 1101227 1115584
62727 1115584 1132779 1151791 1171091 1190285 1209981 1231035 1254399 1280886 1310414 1342086 1375688
62716 1375688 1412564 1454172 1500166 1548799 1599069 1651407 1706218 1762918 1820895 1880338 1941205
62705 1941205 2001945 2060107 2113876 2162200 2203911 2237861 2263881 2282538 2293706 2296314 2289905 2275652
62693 2275652 2255358 2229986 2199614 2164380 2125041 2083032 2040219 1998056 1956581 1914633 1871405
$$ packed form
62787A061336K473J385J4o80l67L08K50o36j123l45R12J378R33K44m50j141j348
62770A063143q17l60p39j324j173q75j613k709k080N38K620J903r07l374m244
62755A047989m220m441n054n177l940j776l92q61k039j906l36Q76Q78R51K216
62740A022768L739M105L560L201L114K980L705O427J0167J2424J2510J2527J4357
62727A115584J7195J9012J9300J9194J9696K1054K3364K6487K9528L1672L3602
62716A375688L6876M1608M5994M8633N0270N2338N4811N6700N7977N9443O0867
62705A941205O0740N8162N3769M8324M1711L3950K6020J8657J1168K608o409j4253
62693B275652k0294k5372l0372l5234l9339m2009m2813m2163m1475m1948m3228
$$ plain form
62682 1871405 1827455 1784107 1742495 1703429 1667211 1633014 1599298 1565696 1533785 1504958 1478187
62671 1478187 1451140 1423145 1395694 1370115 1346193 1323384 1301943 1282121 1263273 1244766 1227174
62660 1227174 1211668 1198488 1186710 1175507 1165102 1156398 1149935 1145225 1141062 1136688 1132665 1130451 1131047
62647 1131047 1134310 1139423 1145584 1152211 1159135 1166964 1176968 1190332 1207657 1229081 1254305 1282371
62635 1282371 1312117 1343260 1376589 1412796 1451677 1492833 1536347 1581992 1628325 1673631 1717565
62624 1717565 1760922 1803725 1844473 1881499 1914185 1942308 1964846 1980187 1987396 1986797 1979389 1966081
62612 1966081 1947416 1923579 1894536 1860470 1822389 1782229 1742037 1702744 1663729 1623786 1582691
62601 1582691 1541759 1502879 1467100 1434230 1403406 1373687 1344298 1314974 1286215 1258809 1232900
$$ packed form
62682A871405m3950m3348m1612l9066l6218l4197l3716l3602l1911k8827k6771
62671A478187k7047k7995k7451k5579k3922k2809k1441j9822j8848j8507j7592
62660A227174j5506j3180j1778j1203j0405q704o463m710m163m374m023k214N96
62647A131047L263N113O161O627O924P829J0004J3364J7325K1424K5224K8066
62635A282371K9746L1143L3329L6207L8881M1156M3514M5645M6333M5306M3934
62624A717565M3357M2803M0748L7026L2686K8123K2538J5341P209n99p408j3308
62612A966081j8665k3837k9043l4066l8081m0160m0192l9293l9015l9943m1095
62601A582691m0932l8880l5779l2870l0824k9719k9389k9324k8759k7406k5909
$$ plain form
62590 1232900 1207941 1183680 1160533 1138529 1116617 1093993 1071761 1052033 1035194 1019281 1002614
62579 1002614 985874 970572 956525 942439 928529 916622 907265 898431 888017 876395 865304 855119
62567 855119 844731 833721 823170 814142 806521 799706 793556 788251 783880 780555 778376 776943 775448
62554 775448 773695 772578 773078 774980 776966 777899 777850 778001 779676 783305 788246 793714 799775 807101 815923
62539 815923 825760 836259 847781 860987 876161 893021 910837 928884 947387 967900 991910 1018865
62527 1018865 1046478 1073335 1100284 1128758 1158667 1188689 1217723 1244963 1269234 1289610 1306464
62516 1306464 1320678 1331802 1338198 1339256 1336374 1331248 1324035 1313821 1300260 1284046 1266079 1246897
62504 1246897 1226912 1206660 1186559 1166627 1146742 1127250 1109036 1092692 1077629 1062461 1046325
$$ packed form
62590A232900k4959k4261k3147k2004k1912k2624k2232j9728j6839j5913j6667
62579A002614j6740j5302j4047j4086j3910j1907r357q834j0414j1622j1091j0185
62567H55119j0388j1010j0551r028p621o815o150n305m371l325k179j433j495
62554G75448j753j117N00J902J986R33m9J51J675L629M941N468O061P326Q822
62539H15923R837J0499J1522J3206J5174J6860J7816J8047J8503K0513K4010K6955
62527A018865K7613K6857K6949K8474K9909L0022K9034K7240K4271K0376J6854
62516A306464J4214J1124O396J058k882n126p213j0214j3561j6214j7967j9182
62504A246897j9985k0252k0101j9932j9885j9492j8214j6344j5063j5168j6136
$$ plain form
62493 1046325 1029468 1012469 995647 979570 965281 953094 941576 928734 914042 898423 882554
62482 882554 866430 850725 837194 826961 819211 812301 805616 799602 794471 789729 784941 780307 776360
62469 776360 773428 771552 770743 771146 772785 775109 777098 778281 779511 782236 786894 792541 798179 803964 810856
62454 810856 819550 830076 842187 855805 871265 889219 910144 933854 959680 987001 1015380 1044414
62442 1044414 1073878 1103625 1132578 1158277 1178723 1194751 1209233 1223474 1235597 1243058 1245418 1243706
62430 1243706 1238450 1229855 1219038 1207269 1194217 1178565 1160490 1142158 1125470 1110407 1096006 1081999
62418 1081999 1068971 1057491 1047476 1038051 1028026 1017099 1006546 998044 991801 986522 981086 975241
62406 975241 968732 961133 953105 946627 943016 941464 940385 939574 940064 942238 945170 947777 949803 951559 953304
$$ packed form
62493A046325j6857j6999j6822j6077j4289j2187j1518j2842j4692j5619j5869
62482H82554j6124j5705j3531j0233p750o910o685o014n131m742m788m634l947
62469G76360k932j876q09M03J639K324J989J183J230K725M658N647N638N785O892
62454H10856Q694J0526J2111J3618J5460J7954K0925K3710K5826K7321K8379K9034
62442A044414K9464K9747K8953K5699K0446J6028J4482J4241J2123P461K360j712
62430A243706n256q595j0817j1769j3052j5652j8075j8332j6688j5063j4401j4007
62418A081999j3028j1480j0015r425j0025j0927j0553q502o243n279n436n845
62406I75241o509p599q028o478l611j552j079q11M90K174K932K607K026J756J745
$$ plain form
62391 953304 955147 957205 959747 963269 968218 974284 980166 984471 986785 987581 987313 986044 983771 980401 975447
62376 975447 968415 959795 951021 942987 934981 925707 915157 904816 895946 888284 880805 873304 866564 861060
62362 861060 856223 851292 846415 842370 839415 836972 834625 832983 833237 835910 840314 845292 850433 856361
62348 856361 863730 872117 880291 887610 894748 902803 911959 921376 930125 937872 944790 951159 956945 961544
62334 961544 964260 965451 966755 969429 972518 973500 970984 966225 961829 959503 959235 960003 960861 961696 963386
62319 963386 967066 973060 980662 988951 997500 1006500 1016872 1030331 1048479 1071333 1097307 1125138 1155358
62306 1155358 1189454 1228101 1270791 1316682 1365038 1415044 1465965 1517508 1569583 1621790 1673532
62295 1673532 1724338 1773423 1819026 1858943 1891963 1918330 1938706 1953160 1961321 1963042 1958512 1948096
$$ packed form
62391I53304J843K058K542L522M949O066N882M305K314P96k68j269k273l370m954
62376I75447p032q620q774q034q006r274j0550j0341q870p662p479p501o740n504
62362H61060m837m931m877m045k955k443k347j642K54K673M404M978N141N928
62348H56361P369Q387Q174P319P138Q055R156R417Q749P747O918O369N786M599
62334I61544K716J191J304K674L089R82k516m759m396k326k68P68Q58Q35J690
62319I63386L680N994P602Q289Q549R000J0372J3459J8148K2854K5974K7831L0220
62306A155358L4096L8647M2690M5891M8356N0006N0921N1543N2075N2207N1742
62295A673532N0806M9085M5603L9917L3020K6367K0376J4454Q161J721m530j0416
$$ plain form
62283 1948096 1932501 1912952 1890837 1867052 1841941 1815812 1789158 1762178 1734436 1705535 1676104
62272 1676104 1647598 1620951 1595890 1571849 1548880 1527076 1505649 1483599 1461145 1439574 1419672
62261 1419672 1401196 1383993 1368482 1354679 1341795 1329477 1318524 1309492 1301330 1292379 1282375 1272503
62249 1272503 1263694 1255677 1247710 1239472 1231202 1223332 1216062 1209054 1201747 1194122 1186711 1179613 1172165 1164057
62235 1164057 1156101 1149231 1143381 1138198 1134227 1132287 1132030 1132319 1132900 1134598 1137837 1141996 1146393 1150999 1155948
62220 1155948 1161250 1167311 1175040 1185036 1197019 1210112 1223289 1235744 1247566 1260102 1274949 1292538
62208 1292538 1312283 1333996 1358264 1385346 1414634 1445504 1478070 1512939 1550837 1592546 1638389
62197 1638389 1687507 1738245 1789383 1840419 1890662 1938795 1983426 2023375 2057490 2085041 2106139
$$ packed form
62283A948096j5595j9549k2115k3785k5111k6129k6654k6980k7742k8901k9431
62272A676104k8506k6647k5061k4041k2969k1804k1427k2050k2454k1571j9902
62261A419672j8476j7203j5511j3803j2884j2318j0953r032q162q951j0004r872
62249A272503q809q017p967q238q270p870p270p008p307p625p411p098p448q108
62235A164057p956o870n850n183l971j940k57K89N81J698L239M159M397M606M949
62220A155948N302O061P729R996J1983J3093J3177J2455J1822J2536J4847J7589
62208A292538J9745K1713K4268K7082K9288L0870L2566L4869L7898M1709M5843
62197A638389M9118N0738N1138N1036N0243M8133M4631L9949L4115K7551K1098
$$ plain form
62186 2106139 2120769 2127594 2125137 2114342 2098422 2079581 2057286 2030400 1999567 1966590 1932845 1899543
62174 1899543 1868370 1840182 1813761 1787366 1761191 1737062 1716020 1697485 1680638 1665332 1651520
62163 1651520 1638778 1626644 1614781 1602819 1590746 1579457 1570179 1563196 1557557 1551984 1545688 1538576
62151 1538576 1531340 1525213 1521041 1518562 1517007 1516179 1516459 1517954 1520261 1523028 1526284 1530361 1535955 1544113
62137 1544113 1555546 1569889 1585901 1602379 1618864 1635855 1654529 1675709 1698892 1722914 1747731
62126 1747731 1774468 1803109 1831359 1857060 1880856 1905082 1930512 1955660 1978940 1999920 2018586
62115 2018586 2035057 2050529 2067177 2086584 2109116 2134960 2164488 2197144 2231214 2265528 2300500
62104 2300500 2336658 2372841 2406794 2437207 2464419 2489220 2511583 2530670 2545709 2556699 2564235
$$ packed form
62186B106139J4630O825k457j0795j5920j8841k2295k6886l0833l2977l3745l3302
62174A899543l1173k8188k6421k6395k6175k4129k1042j8535j6847j5306j3812
62163A651520j2742j2134j1863j1962j2073j1289r278o983n639n573o296p112
62151A538576p236o127m172k479j555q28K80J495K307K767L256M077N594Q158
62137A544113J1433J4343J6012J6478J6485J6991J8674K1180K3183K4022K4817
62126A747731K6737K8641K8250K5701K3796K4226K5430K5148K3280K0980J8666
62115B018586J6471J5472J6648J9407K2532K5844K9528L2656L4070L4314L4972
62104B300500L6158L6183L3953L0413K7212K4801K2363J9087J5039J0990P536
$$ plain form
62093 2564235 2568823 2570658 2570022 2567277 2562211 2554245 2544009 2533904 2525938 2519543 2512842 2505650 2499602 2495379
62079 2495379 2491754 2487901 2484927 2484067 2484728 2485504 2486171 2487519 2489905 2493123 2497313 2502972 2510340 2519571 2531226
62064 2531226 2545785 2562824 2581318 2600636 2620813 2642110 2664909 2689749 2716856 2745733 2775661
62053 2775661 2806514 2838713 2872487 2907504 2943126 2978907 3014975 3051968 3090272 3129432 3168909
62042 3168909 3209444 3252856 3300204 3350921 3404064 3459446 3516972 3575872 3635583 3696739 3760289
62031 3760289 3826005 3892850 3960640 4030536 4103931 4181307 4261803 4343320 4423497 4501431 4578249
62020 4578249 4655420 4732899 4809653 4885525 4961493 5038311 5115904 5194085 5272891 5352052 5430959
62009 5430959 5509329 5587183 5664040 5738926 5811522 5882645 5953202 6023120 6091702 6158631 6224181
$$ packed form
62093B564235M588J835o36k745n066p966j0236j0105p966o395o701p192o048m223
62079B495379l625l853k974q60O61P76O67J348K386L218M190N659P368R231J1655
62064B531226J4559J7039J8494J9318K0177K1297K2799K4840K7107K8877K9928
62053B775661L0853L2199L3774L5017L5622L5781L6068L6993L8304L9160L9477
62042C168909M0535M3412M7348N0717N3143N5382N7526N8900N9711O1156O3550
62031C760289O5716O6845O7790O9896P3395P7376Q0496Q1517Q0177P7934P6818
62020D578249P7171P7479P6754P5872P5968P6818P7593P8181P8806P9161P8907
62009E430959P8370P7854P6857P4886P2596P1123P0557O9918O8582O6929O5550
$$ plain form
61998 6224181 6288527 6351145 6411120 6468035 6522332 6574413 6623594 6668700 6709774 6748121 6784161
61987 6784161 6816400 6843656 6867440 6890634 6914182 6936585 6956503 6974282 6990706 7005823 7019609
61976 7019609 7032449 7044148 7053489 7059716 7063732 7067034 7070005 7071917 7072085 7070320 7066830 7062405 7058274 7054955
61962 7054955 7051447 7046253 7039063 7030976 7023323 7016875 7011952 7008636 7006865 7006756 7008753 7013162 7019708 7028056
61948 7028056 7038495 7051566 7067092 7084257 7102719 7122971 7145207 7168229 7189957 7209004 7225489
61937 7225489 7240254 7253485 7264186 7270865 7272492 7268706 7259398 7244528 7224351 7199506 7170703 7138491
61925 7138491 7103368 7065860 7026400 6985397 6943490 6901420 6859395 6816874 6773250 6728617 6683606
61914 6683606 6638598 6593340 6547287 6500183 6452307 6404345 6357004 6310664 6265303 6220727 6176862
$$ packed form
61998F224181O4346O2618N9975N6915N4297N2081M9181M5106M1074L8347L6040
61987F784161L2239K7256K3784K3194K3548K2403J9918J7779J6424J5117J3786
61976G019609J2840J1699R341O227M016L302K971J912J68j765l490m425m131l319
61962G054955l508n194p190q087p653o448m923l316j771j09J997M409O546Q348
61948G028056J0439J3071J5526J7165J8462K0252K2236K3022K1728J9047J6485
61937G225489J4765J3231J0701O679J627l786r308j4870k0177k4845k8803l2212
61925G138491l5123l7508l9460m1003m1907m2070m2025m2521m3624m4633m5011
61914F683606m5008m5258m6053m7104m7876m7962m7341m6340m5361m4576m3865
$$ plain form
61903 6176862 6134027 6093010 6054643 6019034 5985377 5952787 5921110 5890599 5861176 5832729 5806009
61892 5806009 5782373 5762473 5745843 5731916 5720656 5712038 5705867 5702641 5703676 5709520 5718906 5730189
61880 5730189 5743294 5759268 5778308 5799384 5821691 5845360 5870608 5897306 5925712 5956663 5990382
61869 5990382 6025770 6061558 6097847 6136036 6177503 6222849 6272254 6326173 6385778 6452934 6529674
61858 6529674 6617560 6717685 6831294 6960035 7105524 7269239 7453185 7660142 7892591 8151623
61848 8151623 8437516 8751300 9095123 9471156 9880786 10324888 10803705 11315482 11855375
61839 11855375 12416049 12988512 13560906 14116132 14631816 15083926 15451269 15717842 15873344
61830 15873344 15913757 15842058 15667684 15404768 15070393 14682965 14259937 13815794 13362247 12909952
$$ packed form
61903F176862m2835m1017l8367l5609l3657l2590l1677l0511k9423k8447k6720
61892E806009k3636j9900j6630j3927j1260q618o171l226J035N844R386J1283
61880E730189J3105J5974J9040K1076K2307K3669K5248K6698K8406L0951L3719
61869E990382L5388L5788L6289L8189M1467M5346M9405N3919N9605O7156P6740
61858F529674Q7886J00125J13609J28741J45489J63715J83946K06957K32449K59032
61848H151623K85893L13784L43823L76033M09630M44102M78817N11777N39893
61839A1855375N60674N72463N72394N55226N15684M52110L67343K66573J55502
61830A5873344M0413p1699j74374k62916l34375l87428m23028m44143m53547m52295
$$ plain form
61820 12909952 12468636 12044821 11640480 11255094 10888697 10542299 10216106 9908725 9618100
61811 9618100 9342297 9079474 8828175 8588019 8359344 8142031 7935454 7739730 7556046
61802 7556046 7385220 7226576 7078634 6940330 6811317 6691922 6583228 6486311 6400546 6323336
61792 6323336 6252309 6187202 6128636 6075608 6025453 5976070 5926913 5877720 5827550 5775677 5722504
61781 5722504 5668937 5615420 5562130 5509649 5458902 5410717 5365828 5324963 5288574 5256695 5229332
61770 5229332 5206535 5187737 5171434 5155953 5140283 5123885 5106269 5087289 5067301 5046229 5022804
61759 5022804 4995699 4965409 4934206 4904181 4876106 4850249 4827217 4807541 4791364 4779285 4772880
61748 4772880 4773560 4781308 4795368 4815932 4844245 4881096 4925997 4978057 5036994 5103100 5176880 5259075
$$ packed form
61820A2909952m41316m23815m04341l85386l66397l46398l26193l07381k90625
61811I618100k75803k62823k51299k40156k28675k17313k06577j95724j83684
61802G556046j70826j58644j47942j38304j29013j19395j08694r6917q5765p7210
61792F323336p1027o5107n8566n3028n0155m9383m9157m9193n0170n1873n3173
61781E722504n3567n3517n3290n2481n0747m8185m4889m0865l6389l1879k7363
61770E229332k2797j8798j6303j5481j5670j6398j7616j8980j9988k1072k3425
61759E022804k7105l0290l1203l0025k8075k5857k3032j9676j6177j2079o405
61748D772880O80P748J4060K0564K8313L6851M4901N2060N8937O6106P3780Q2195
$$ plain form
61736 5259075 5350516 5451526 5561900 5681957 5813355 5958433 6118889 6295562 6489399 6702178
61726 6702178 6936143 7193339 7475616 7785314 8125851 8501527 8916537 9374184 9877309
61717 9877309 10429593 11036052 11701915 12431089 13225722 14086505 15012369 15999491 17040458
61708 17040458 18123465 19230643 20336086 21405697 22399781 23277160 23999481 24535680 24866262
61699 24866262 24985801 24902307 24634279 24207122 23649919 22992918 22266155 21498614 20716333
61690 20716333 19939501 19181106 18448874 17748208 17082832 16453599 15858704 15295881 14763715
61681 14763715 14260578 13783446 13328741 12893933 12477661 12078830 11696430 11330090 10980046
61672 10980046 10646518 10329697 10030346 9749499 9486945 9240170 9005369 8779827 8563252
$$ packed form
61736E259075R1441J01010J10374J20057J31398J45078J60456J76673J93837K12779
61726F702178K33965K57196K82277L09698L40537L75676M15010M57647N03125
61717I877309N52284O06459O65863P29174P94633Q60783R25864R87122J040967
61708A7040458J083007J107178J105443J069611R94084Q77379P22321N36199L30582
61699B4866262J19539q3494k68028m27157n57203o57001p26763p67541p82281
61690B0716333p76832p58395p32232p00666o65376o29233n94895n62823n32166
61681A4763715n03137m77132m54705m34808m16272l98831l82400l66340l50044
61672A0980046l33528l16821k99351k80847k62554k46775k34801k25542k16575
$$ plain form
61663 8563252 8356637 8159931 7971120 7787616 7608021 7432173 7260038 7091497 6927018
61654 6927018 6767426 6612700 6461895 6314695 6172031 6034637 5901981 5773454 5649604
61645 5649604 5530947 5416451 5304795 5196603 5093524 4995072 4898528 4802725 4710093 4623551
61635 4623551 4542580 4463962 4385672 4308399 4233416 4160647 4089394 4019855 3953065 3889679 3829333
61624 3829333 3771079 3714107 3658162 3603534 3550710 3499903 3450706 3402247 3353961 3306452 3261283
61613 3261283 3219454 3180234 3142120 3104893 3069922 3038197 3008842 2980009 2950515 2920040 2888473
61602 2888473 2855993 2823420 2791539 2760171 2728650 2697038 2666145 2636500 2608136 2581336 2556673
61591 2556673 2534144 2513057 2493021 2474313 2456927 2439969 2422479 2404367 2386104 2367978 2350123
$$ packed form
61663H563252k06615j96706j88811j83504j79595j75848j72135j68541j64479
61654F927018j59592j54726j50805j47200j42664j37394j32656j28527j23850
61645E649604j18657j14496j11656j08192j03079r8452r6544r5803r2632q6542
61635D623551q0971p8618p8290p7273p4983p2769p1253o9539o6790o3386o0346
61624C829333n8254n6972n5945n4628n2824n0807m9197m8459m8286m7509m5169
61613C261283m1829l9220l8114l7227l4971l1725k9355k8833k9494l0475l1567
61602B888473l2480l2573l1881l1368l1521l1612l0893k9645k8364k6800k4663
61591B556673k2529k1087k0036j8708j7386j6958j7490j8112j8263j8126j7855
$$ plain form
61580 2350123 2332905 2316728 2301637 2287570 2274774 2263502 2253453 2244087 2235639 2229363 2226467 2226825
61568 2226825 2228815 2230317 2229920 2227453 2223740 2219932 2216744 2213895 2210107 2203850 2194336 2181903 2167572 2152450
61554 2152450 2137338 2122246 2106108 2087670 2067209 2046806 2028170 2010644 1992369 1973109 1954645
61543 1954645 1938177 1922662 1906412 1889243 1872141 1855653 1839848 1825398 1813236 1803044 1793192
61532 1793192 1782631 1771949 1762134 1753178 1744669 1737095 1731460 1727778 1725053 1723037 1723081 1726528 1732897 1740551
61518 1740551 1748884 1758825 1771088 1785013 1799754 1815861 1834731 1856763 1880890 1905931 1931738 1958994
61506 1958994 1988541 2021078 2056777 2094767 2133317 2170883 2206804 2240967 2273308 2303967 2333464
61495 2333464 2362154 2389577 2414740 2437225 2457902 2478478 2500154 2522492 2543671 2562074 2577526
$$ packed form
61580B350123j7218j6177j5091j4067j2796j1272j0049r366q448o276k896L58
61568B226825J990J502l97k467l713l808l188k849l788o257r514j2433j4331j5122
61554B152450j5112j5092j6138j8438k0461k0403j8636j7526j8275j9260j8464
61543A954645j6468j5515j6250j7169j7102j6488j5805j4450j2162j0192r852
61532A793192j0561j0682r815q956q509p574n635l682k725k016M4L447O369P654
61518A740551Q333R941J2263J3925J4741J6107J8870K2032K4127K5041K5807K7256
61506A958994K9547L2537L5699L7990L8550L7566L5921L4163L2341L0659K9497
61495B333464K8690K7423K5163K2485K0677K0576K1676K2338K1179J8403J5452
$$ plain form
61484 2577526 2590709 2601716 2609954 2615459 2619402 2622755 2625085 2625276 2623117 2619651 2616264 2613899 2612841 2612665
61470 2612665 2612487 2611843 2611405 2612543 2616292 2623007 2632873 2646263 2663598 2685171 2711188 2741820 2777261
61457 2777261 2817805 2863675 2914772 2971033 3033230 3102896 3181131 3268082 3364122 3470847 3590026
61446 3590026 3722019 3866266 4023061 4193555 4377923 4574725 4782396 5000126 5226476
61437 5226476 5457896 5689291 5915357 6130594 6328794 6503816 6651047 6767756 6852524 6905293
61427 6905293 6927877 6923499 6895550 6847196 6782018 6704094 6617114 6524016 6427849 6332403 6241385
61416 6241385 6157052 6079822 6008980 5943654 5883630 5829795 5783655 5746117 5716808 5694825 5679899
61405 5679899 5672447 5672675 5680146 5694199 5714313 5739947 5770407 5805079 5843556 5885442 5930223 5977379
$$ packed form
61484B577526J3183J1007Q238N505L943L353K330J91k159l466l387k365j058j76
61470B612665j78o44m38J138L749O715R866J3390J7335K1573K6017L0632L5441
61457B777261M0544M5870N1097N6261O2197O9666P8235Q6951R6040J06725J19179
61446C590026J31993J44247J56795J70494J84368J96802K07671K17730K26350
61437E226476K31420K31395K26066K15237J98200J75022J47231J16709Q4768N2769
61427F905293K2584m378k7949m8354o5178p7924q6980r3098r6167r5446r1018
61416F241385q4333p7230p0842o5326o0024n3835m6140l7538k9309k1983j4926
61405E679899p452K28P471J4053K0114K5634L0460L4672L8477M1886M4781M7156
$$ plain form
61393 5977379 6026347 6076322 6126457 6176451 6226652 6277505 6329234 6382089 6436345 6491658 6546970
61382 6546970 6601561 6655811 6710350 6764861 6818470 6870946 6922452 6972117 7017990 7058863 7095224
61371 7095224 7127757 7155613 7177068 7191563 7200316 7204910 7205889 7202717 7194638 7181511 7164211 7144377
61359 7144377 7123572 7102625 7081815 7061498 7042378 7025334 7011176 7000366 6992801 6988093 6986236 6987478
61347 6987478 6991200 6995457 6998359 6999554 6999605 6998264 6994554 6988715 6982738 6978281 6974840 6970989 6966983 6965201
61333 6965201 6968164 6977071 6992551 7016042 7049808 7095868 7155416 7229165 7317747 7421561 7540624
61322 7540624 7674972 7825144 7991808 8174766 8372563 8583272 8805181 9036200 9272561
61313 9272561 9508584 9737742 9953632 10150091 10321374 10463079 10572887 10650063 10694414 10706125
$$ packed form
61393E977379M8968M9975N0135M9994N0201N0853N1729N2855N4256N5313N5312
61382F546970N4591N4250N4539N4511N3609N2476N1506M9665M5873M0873L6361
61371G095224L2533K7856K1455J4495Q753M594R79l172q079j3127j7300j9834
61359G144377k0805k0947k0810k0317j9120j7044j4158j0810p565m708j857J242
61347F987478L722M257K902J195N1j341l710n839n977m457l441l851m006j782
61333F965201K963Q907J5480K3491L3766M6060N9548P3749Q8582J03814J19063
61322G540624J34348J50172J66664J82958J97797K10709K21909K31019K36361
61313I272561K36023K29158K15890J96459J71283J41705J09808P7176M4351J1711
$$ plain form
61303 10706125 10686372 10637450 10562142 10463371 10344518 10209324 10060886 9900898 9730462 9551703
61293 9551703 9368213 9183842 9001355 8822269 8647460 8477448 8312308 8151889 7996288
61284 7996288 7846042 7701901 7564723 7435487 7314995 7203400 7100268 7005390 6919373 6843280
61274 6843280 6777760 6722575 6676792 6639240 6608918 6585171 6567504 6555301 6547839 6544539 6544883 6548082
61262 6548082 6553273 6560231 6569365 6580526 6592177 6602406 6610665 6617937 6625194 6632270 6638442 6643511 6647903
61249 6647903 6651924 6655152 6656394 6654201 6647797 6637812 6625755 6612357 6596533 6576224 6550092 6518160
61237 6518160 6481167 6440004 6395736 6349384 6301165 6250293 6196142 6139576 6082775 6027676 5974896
61226 5974896 5924152 5875320 5828805 5785120 5744477 5706857 5672348 5641373 5614526 5591939 5572706
$$ packed form
61303A0706125j9753m8922p5308r8771j18853j35194j48438j59988j70436j78759
61293I551703j83490j84371j82487j79086j74809j70012j65140j60419j55601
61284G996288j50246j44141j37178j29236j20492j11595j03132r4878q6017p6093
61274F843280o5520n5185m5783l7552l0322k3747j7667j2203p462l300L44L199
61262F548082N191O958R134J1161J1651J0229Q259P272P257P076O172N069M392
61249F647903M021L228J242k193o404r985j2057j3398j5824k0309k6132l1932
61237F518160l6993m1163m4268m6352m8219n0872n4151n6566n6801n5099n2780
61226E974896n0744m8832m6515m3685m0643l7620l4509l0975k6847k2587j9233
$$ plain form
61215 5572706 5555090 5537441 5518817 5498878 5477858 5456961 5438008 5421718 5406583 5390453 5373274
61204 5373274 5357330 5344548 5334571 5325908 5317925 5310932 5305282 5301653 5301849 5308040 5321206 5341221 5368428
61191 5368428 5404005 5448553 5501331 5561382 5628627 5703170 5783971 5868592 5953658 6035018 6107986
61180 6107986 6168298 6212894 6239520 6245986 6230594 6193276 6135723 6060356 5969665 5866624 5754977
61169 5754977 5638515 5520037 5401133 5282762 5165960 5052213 4943306 4840492 4743579 4651194
61159 4651194 4562439 4478114 4399751 4327440 4259275 4193195 4128853 4067329 4009554 3955659 3905547
61148 3905547 3859342 3817270 3779649 3746970 3719341 3695866 3675190 3656819 3641279 3628938 3619415
61137 3619415 3612405 3608014 3605635 3603284 3599002 3592536 3584856 3576419 3566805 3555786 3543534 3529554 3512365
$$ packed form
61215E572706j7616j7649j8624j9939k1020k0897j8953j6290j5135j6130j7179
61204E373274j5944j2782r977q663p983o993n650l629J96O191J3166K0015K7207
61191E368428L5577M4548N2778O0051O7245P4543Q0801Q4621Q5066Q1360P2968
61180F107986O0312M4596K6626O466j5392l7318n7553p5367r0691j03041j11647
61169E754977j16462j18478j18904j18371j16802j13747j08907j02814r6913r2385
61159D651194q8755q4325p8363p2311o8165o6080o4342o1524n7775n3895n0112
61148C905547m6205m2072l7621l2679k7629k3475k0676j8371j5540j2341r523
61137C619415p010m391k379k351m282o466p680q437r614j1019j2252j3980j7189
$$ plain form
61124 3512365 3490832 3465457 3437997 3410033 3382012 3353342 3323169 3291049 3256920 3220685 3182384
61113 3182384 3143018 3104366 3067161 3029790 2989757 2946387 2901380 2856821 2813513 2771298 2729958
61102 2729958 2689379 2649525 2610762 2573735 2538537 2504338 2470113 2435497 2400905 2367160 2334909
61091 2334909 2303810 2272365 2239283 2205118 2171900 2140970 2111816 2083109 2053985 2024193 1994085
61080 1994085 1964984 1938585 1915212 1893422 1872038 1851787 1834066 1818824 1804722 1790943 1777718
61069 1777718 1765369 1753996 1744136 1736670 1731823 1728982 1727578 1727366 1727688 1727440 1726321 1725498 1726397 1729211 1733224
61054 1733224 1738208 1744563 1751903 1758451 1762671 1765200 1768168 1772458 1776589 1778864 1779697 1780663 1781798 1781332 1778168
61039 1778168 1773122 1767262 1760492 1752785 1745579 1740359 1736287 1730679 1721922 1710853 1699156 1687315 1674582
$$ packed form
61124C512365k1533k5375k7460k7964k8021k8670l0173l2120l4129l6235l8301
61113C182384l9366l8652l7205l7371m0033m3370m5007m4559m3308m2215m1340
61102B729958m0579l9854l8763l7027l5198l4199l4225l4616l4592l3745l2251
61091B334909l1099l1445l3082l4165l3218l0930k9154k8707k9124k9792l0108
61080A994085k9101k6399k3373k1790k1384k0251j7721j5242j4102j3779j3225
61069A777718j2349j1373r860p466m847k841j404k12L22k48j119q23Q99K814M013
61054A733224M984O355P340O548M220K529K968M290M131K275Q33R66J135m66l164
61039A778168n046n860o770p707p206n220m072n608q757j1069j1697j1841j2733
$$ plain form
61026 1674582 1660326 1644873 1629161 1613794 1598613 1583323 1568386 1554658 1542065 1529427 1516050
61015 1516050 1502761 1490728 1480038 1470350 1462125 1455915 1450850 1445265 1438846 1432838 1427993 1423623 1419084
61002 1419084 1414942 1412049 1410431 1409865 1410697 1413129 1416170 1418260 1418876 1418999 1420013 1422529 1426082 1429622 1432312
60987 1432312 1434053 1435326 1436726 1438975 1443168 1450229 1459853 1470508 1480862 1490888 1501398 1513112 1526524
60974 1526524 1542086 1559881 1579362 1599873 1621305 1643983 1668217 1694239 1722192 1751761 1782165
60963 1782165 1812886 1844052 1875708 1907354 1938949 1971982 2008541 2049302 2093293 2139604 2188295
60952 2188295 2239350 2291956 2345700 2401825 2462351 2528307 2599817 2677672 2763546 2858245 2960575
60941 2960575 3068601 3181548 3300081 3425276 3558094 3699627 3851071 4013175 4185922
$$ packed form
61026A674582j4256j5453j5712j5367j5181j5290j4937j3728j2593j2638j3377
61015A516050j3289j2033j0690r688q225o210n065n585o419o008m845m370m539
61002A419084m142k893j618n66Q32K432L041K090O16J23J014K516L553L540K690
60987A432312J741J273J400K249M193P061R624J0655J0354J0026J0510J1714J3412
60974A526524J5562J7795J9481K0511K1432K2678K4234K6022K7953K9569L0404
60963A782165L0721L1166L1656L1646L1595L3033L6559M0761M3991M6311M8691
60952B188295N1055N2606N3744N6125O0526O5956P1510P7855Q5874R4699J02330
60941B960575J08026J12947J18533J25195J32818J41533J51444J62104J72747
$$ plain form
60932 4185922 4368839 4561713 4765575 4983255 5218344 5473026 5747523 6042321 6360035
60923 6360035 6703927 7075658 7476991 7914130 8398510 8942993 9559471 10260827 11062037
60914 11062037 11976675 13014087 14182622 15494503 16966334 18619750 20487430 22611114
60906 22611114 25010061 27628262 30309050 32837856 35031836 36806974 38178361 39217911
60898 39217911 40022365 40704060 41370060 42069698 42747393 43256090 43433905 43183862 42498725
60889 42498725 41432128 40060120 38463184 36722456 34914311 33103162 31339852 29664014
60881 29664014 28103358 26670487 25363737 24173210 23086673 22092012 21177926 20334458
60873 20334458 19552729 18824092 18140147 17493346 16876610 16282597 15704936 15141125 14593786
$$ packed form
60932D185922J82917J92874K03862K17680K35089K54682K74497K94798L17714
60923F360035L43892L71731M01333M37139M84380N44483O16478P01356Q01210
60914A1062037R14638J037412J168535J311881J471831J653416J867680K123684
60906B2611114K398947K618201K680788K528806K193980J775138J371387J039550
60898C9217911Q04454O81695O66000O99638O77695N08697J77815k50043o85137
60889D2498725j066597j372008j596936j740728j808145j811149j763310j675838
60881B9664014j560656j432871j306750j190527j086537r94661r14086q43468
60873B0334458p81729p28637o83945o46801o16736n94013n77661n63811n47339
$$ plain form
60864 14593786 14068659 13571362 13105399 12671510 12267550 11888903 11529719 11184481 10849154
60855 10849154 10521652 10201717 9890581 9590639 9304719 9034356 8778012 8531482 8290728
60846 8290728 8054240 7822569 7596575 7377099 7165653 6963917 6772313 6589982 6416336
60837 6416336 6251757 6096567 5950133 5811327 5679135 5552536 5430534 5312893 5200374
60828 5200374 5093749 4992810 4896476 4803480 4712758 4623814 4537127 4453711 4373766 4296127 4219506
60817 4219506 4143907 4070138 3998086 3926212 3853033 3778739 3705071 3633672 3564749 3497330 3430691
60806 3430691 3365226 3301794 3240537 3180806 3122224 3065238 3010382 2957520 2906285 2856932 2810146
60795 2810146 2766090 2724189 2683936 2645461 2609183 2575375 2544357 2516659 2492353 2470376 2449158
$$ packed form
60864A4593786n25127m97297m65963m33889m03960l78647l59184l45238l35327
60855A0849154l27502l19935l11136k99942k85920k70363k56344k46530k40754
60846H290728k36488k31671k25994k19476k11446k01736j91604j82331j73646
60837F416336j64579j55190j46434j38806j32192j26599j22002j17641j12519
60828E200374j06625j00939r6334r2996r0722q8944q6687q3416p9945p7639p6621
60817D219506p5599p3769p2052p1874p3179p4294p3668p1399o8923o7419o6639
60806C430691o5465o3432o1257n9731n8582n6986n4856n2862n1235m9353m6786
60795B810146m4056m1901m0253l8475l6278l3808l1018k7698k4306k1977k1218
$$ plain form
60784 2449158 2428150 2408254 2390515 2374894 2360797 2348255 2337663 2328473 2319125 2308669 2297728 2287379
60772 2287379 2277664 2267773 2257176 2245820 2233585 2220367 2206724 2193696 2181764 2170404 2158724 2146145
60760 2146145 2132520 2118054 2103183 2088155 2072684 2056394 2039495 2022536 2005453 1987428 1967783
60749 1967783 1946616 1924498 1902063 1879965 1858751 1838537 1819115 1800354 1782093 1763840 1745348
60738 1745348 1727472 1711591 1697962 1685473 1673255 1661603 1650929 1640925 1631529 1623714 1618282 1614584
60726 1614584 1611544 1609378 1609031 1610327 1612055 1613842 1616569 1620756 1625760 1630993 1636754 1643185 1649226 1653441
60712 1653441 1655460 1656115 1656616 1657993 1660880 1665287 1670742 1676811 1683039 1688389 1691719 1693413 1695743 1700693
60698 1700693 1707762 1714661 1719846 1723556 1726589 1729081 1730733 1731518 1731750 1731773 1731801 1731949 1732406 1733555 1735616 1737958
$$ packed form
60784B449158k1008j9896j7739j5621j4097j2542j0592r190r348j0456j0941j0349
60772B287379r715r891j0597j1356j2235j3218j3643j3028j1932j1360j1680j2579
60760B146145j3625j4466j4871j5028j5471j6290j6899j6959j7083j8025j9645
60749A967783k1167k2118k2435k2098k1214k0214j9422j8761j8261j8253j8492
60738A745348j7876j5881j3629j2489j2218j1652j0674j0004r396p815n432l698
60726A614584l040k166l47J296J728J787K727M187N004N233N761O431O041M215
60712A653441K019O55N01J377K887M407N455O069O228N350L330J694K330M950
60698A700693P069O899N185L710L033K492J652P85K32K3K8J48M57J149K061K342
$$ plain form
60682 1737958 1739251 1738764 1737081 1735018 1732293 1728158 1722966 1717931 1713364 1708337 1702404 1696501 1691560 1687179
60668 1687179 1682423 1677172 1671834 1666283 1659987 1652857 1645161 1636842 1627806 1618719 1610651 1603807 1597208 1589775
60654 1589775 1581309 1572434 1564088 1557004 1551166 1545695 1539725 1533325 1527151 1521371 1515680 1510284 1505972 1502971
60640 1502971 1500473 1497623 1494317 1490720 1486787 1482780 1479547 1477514 1475782 1472954 1468580 1463208 1457258 1450471
60626 1450471 1442228 1431857 1418964 1404226 1389635 1376931 1365760 1354315 1341947 1330106 1320204 1311649
60614 1311649 1302884 1293738 1285508 1278952 1273315 1267592 1261917 1257265 1254281 1252804 1252212 1251918 1251777 1252239 1253863
60599 1253863 1256415 1258738 1259824 1259782 1259532 1259820 1260862 1262685 1265305 1268626 1272539 1277003 1281636 1285449 1287710
60584 1287710 1289204 1291967 1297353 1304695 1312178 1318711 1324664 1331101 1338772 1347727 1357532 1367744 1378267
$$ packed form
60682A737958J293m87j683k063k725m135n192n035m567n027n933n903m941m381
60668A687179m756n251n338n551o296p130p696q319r036r087q068o844o599p433
60654A589775q466q875q346p084n838n471n970o400o174n780n691n396m312l001
60640A502971k498k850l306l597l933m007l233k033j732k828m374n372n950o787
60626A450471q243j0371j2893j4738j4591j2704j1171j1445j2368j1841r902q555
60614A311649q765r146q230o556n637n723n675m652k984j477n92k94j41M62J624
60599A253863K552K323J086m2k50K88J042J823K620L321L913M464M633L813K261
60584A287710J494K763N386P342P483O533N953O437P671Q955R805J0212J0523
$$ plain form
60571 1378267 1389253 1400782 1412883 1425794 1439737 1454388 1469087 1483757 1499045 1515271 1531686
60560 1531686 1547035 1560224 1570183 1576060 1578400 1579399 1580861 1582244 1581823 1579397 1576563 1574414 1572404 1569759
60546 1569759 1566666 1563471 1559927 1556072 1552928 1551348 1550812 1550221 1549344 1548522 1547404 1545158 1541909 1539001 1537561
60531 1537561 1537407 1537524 1537079 1535798 1533860 1531840 1530499 1530268 1530838 1531341 1531043 1529999 1529059 1529111 1530370 1532523
60515 1532523 1535422 1539152 1543447 1547651 1551541 1555662 1560435 1565312 1569279 1571872 1573208 1573308 1571913 1568912
60501 1568912 1564557 1559348 1553974 1549122 1544919 1540645 1535427 1529222 1523054 1518461 1516751 1518262 1521988 1526427
60487 1526427 1531294 1537964 1547684 1559889 1573214 1587710 1604927 1625777 1649533 1675399 1704097 1737211
60475 1737211 1775441 1818083 1863780 1911083 1958481 2004509 2048068 2088332 2124139 2153558 2174409
$$ packed form
60571A378267J0986J1529J2101J2911J3943J4651J4699J4670J5288J6226J6415
60560A531686J5349J3189R959N877K340R99J462J383m21k426k834k149k010k645
60546A569759l093l195l544l855l144j580n36n91q77q22j118k246l249k908j440
60531A537561j54J17m45j281j938k020j341k31N70N03k98j044r40N2J259K153
60515A532523K899L730M295M204L890M121M773M877L967K593J336J00j395l001
60501A568912m355n209n374m852m203m274n218o205o168m593j710J511L726M439
60487A526427M867O670R720J2205J3325J4496J7217K0850K3756K5866K8698L3114
60475A737211L8230M2642M5697M7303M7398M6028M3559M0264L5807K9419K0851
$$ plain form
60464 2174409 2185713 2188961 2187755 2185655 2184186 2183073 2182198 2182790 2186559 2194194 2205087 2218492 2234616
60451 2234616 2254478 2278562 2305641 2333216 2359481 2384718 2410486 2437750 2466385 2496449 2529130
60440 2529130 2566214 2609181 2659146 2717065 2783499 2858611 2943012 3038396 3146787 3269318 3406305
60429 3406305 3558404 3726984 3913235 4117585 4340352 4582526 4845436 5130029 5436816
60420 5436816 5765663 6113929 6473830 6832044 7172604 7480317 7741615 7943566 8074284
60411 8074284 8125909 8097681 7996244 7833050 7621019 7372667 7100220 6816279 6532956 6259263
60401 6259263 5999292 5753563 5522253 5306691 5107950 4925069 4755329 4596006 4445728
60392 4445728 4304536 4172858 4049980 3933466 3820653 3710829 3605264 3505026 3409658 3318239
$$ packed form
60464B174409J1304L248j206k100j469j113q75N92L769P635J0893J3405J6124
60451B234616J9862K4084K7079K7575K6265K5237K5768K7264K8635L0064L2681
60440B529130L7084M2967M9965N7919O6434P5112Q4401R5384J08391J22531J36987
60429C406305J52099J68580J86251K04350K22767K42174K62910K84593L06787
60420E436816L28847L48266L59901L58214L40560L07713K61298K01951J30718
60411H074284N1625k8228j01437j63194k12031k48352k72447k83941k83323k73693
60401F259263k59971k45729k31310k15562j98741j82881j69740j59323j50278
60392D445728j41192j31678j22878j16514j12813j09824j05565j00238r5368r1419
$$ plain form
60382 3318239 3230572 3146727 3066422 2989800 2917958 2851689 2790256 2732246 2676896 2623633 2571138
60371 2571138 2518316 2465839 2415465 2368141 2323829 2282601 2244310 2207457 2170170 2132544 2096535
60360 2096535 2063240 2031807 2001425 1972802 1946848 1923182 1900912 1879953 1860555 1842255 1824214
60349 1824214 1806230 1788807 1772488 1757411 1743005 1728024 1711734 1695324 1681221 1670481 1661725
60338 1661725 1653119 1644299 1635639 1626854 1617671 1609241 1603378 1600256 1597842 1593769 1587279 1579349 1571429 1564153
60324 1564153 1557030 1549365 1541333 1533658 1526245 1517974 1508285 1498257 1489436 1482092 1475183 1467619 1459017 1449635
60310 1449635 1440193 1431530 1424004 1417457 1411886 1407539 1404048 1400282 1395716 1391344 1388559 1387539 1387288 1386722
60296 1386722 1385215 1382726 1380192 1379254 1380753 1383718 1386331 1387543 1387463 1386946 1387390 1390016 1394407 1398480 1400843
$$ packed form
60382C318239q7667q3845q0305p6622p1842o6269o1433n8010n5350n3263n2495
60371B571138n2822n2477n0374m7324m4312m1228l8291l6853l7287l7626l6009
60360B096535l3295l1433l0382k8623k5954k3666k2270k0959j9398j8300j8041
60349A824214j7984j7423j6319j5077j4406j4981j6290j6410j4103j0740q756
60338A661725q606q820q660q785r183q430n863l122k414m073o490p930p920p276
60324A564153p123p665q032p675p413q271r689j0028q821p344o909p564q602r382
60310A449635r442q663p526o547n571m347l491l766m566m372k785j020k51n66
60296A386722j507k489k534r38J499K965K613J212q0n17M44K626M391M073K363
$$ plain form
60281 1400843 1402448 1404965 1408412 1411732 1414915 1418795 1423024 1425951 1426570 1425294 1422855 1419980 1418181 1419201
60267 1419201 1423169 1428580 1434472 1441187 1448463 1454362 1457266 1457943 1458464 1459690 1460782 1460730 1459386 1457241 1454975
60252 1454975 1453171 1451850 1450244 1447393 1443056 1437916 1433077 1429411 1427190 1426096 1425672 1425708 1426145 1426904 1428192
60237 1428192 1430667 1434683 1439423 1443395 1445830 1447234 1448817 1451976 1457961 1467011 1477655 1487568 1495292 1500701
60223 1500701 1504311 1507216 1511376 1518424 1527734 1536921 1544627 1551672 1559100 1566615 1573840 1581807 1591841 1603777
60209 1603777 1616478 1629560 1643488 1658499 1674637 1692563 1713205 1736687 1762485 1790418 1820660
60198 1820660 1852957 1886834 1922482 1960598 2001517 2045484 2093680 2147807 2208395 2274568 2345825
60187 2345825 2423005 2506836 2596467 2690417 2788573 2892282 3002569 3118913 3239835 3364017
$$ packed form
60281A400843J605K517L447L320L183L880M229K927O19j276k439k875j799J020
60267A419201L968N411N892O715P276N899K904O77N21J226J092n2j344k145k266
60252A454975j804j321j606k851m337n140m839l666k221j094m24L6M37P59J288
60237A428192K475M016M740L972K435J404J583L159N985R050J0644R913P724N409
60223A500701L610K905M160P048R310R187P706P045P428P515P225P967J0034J1936
60209A603777J2701J3082J3928J5011J6138J7926K0642K3482K5798K7933L0242
60198A820660L2297L3877L5648L8116M0919M3967M8196N4127O0588O6173P1257
60187B345825P7180Q3831Q9631R3950R8156J03709J10287J16344J20922J24182
$$ plain form
60177 3364017 3490634 3619031 3748386 3877470 4004503 4127416 4244523 4354866 4457741
60168 4457741 4552063 4636524 4710350 4773621 4826779 4870141 4903972 4928694 4944988 4954157 4958636 4961530
60156 4961530 4965115 4970192 4977370 4988501 5006021 5031123 5063482 5102641 5148911 5202996 5265735 5338233
60144 5338233 5421183 5513790 5614279 5721681 5835980 5956135 6079202 6202159 6323496 6441984
60134 6441984 6554966 6659159 6752550 6834235 6902912 6957007 6996207 7021540 7033847 7033301 7020656
60123 7020656 6997915 6967365 6930799 6890083 6847771 6806651 6769134 6737345 6713266 6698320 6693070
60112 6693070 6697566 6711852 6736275 6771633 6818801 6877443 6945081 7018254 7094869 7174640 7256851
60101 7256851 7338534 7415647 7485665 7548375 7604429 7653804 7695542 7728398 7751780 7766615 7775475
$$ packed form
60177C364017J26617J28397J29355J29084J27033J22913J17107J10343J02875
60168D457741R4322Q4461P3826O3271N3158M3362L3831K4722J6294R169M479K894
60156D961530L585N077P178J1131J7520K5102L2359L9159M6270N4085O2739P2498
60144E338233Q2950R2607J00489J07402J14299J20155J23067J22957J21337J18488
60134F441984J12982J04193R3391Q1685O8677N4095L9200K5333J2307n46j2645
60123G020656k2741l0550l6566m0716m2312m1120l7517l1789k4079j4946n250
60112F693070M496J4286K4423L5358M7168N8642O7638P3173P6615P9771Q2211
60101G256851Q1683P7113P0018O2710N6054M9375M1738L2856K3382J4835Q860
$$ plain form
60090 7775475 7781554 7787368 7794502 7804321 7818470 7838740 7867003 7905415 7956161 8020658 8099422 8193215
60078 8193215 8304050 8434391 8585403 8756728 8948304 9161674 9398867 9660380 9945071
60069 9945071 10251700 10579520 10927089 11291402 11668628 12054914 12445769 12835355 13217288
60060 13217288 13585970 13936418 14263223 14560820 14825005 15053315 15243395 15391686 15494412
60051 15494412 15549809 15558987 15524781 15450244 15338560 15194048 15022582 14830587 14623949 14408483
60041 14408483 14191168 13979627 13779575 13593373 13421819 13266889 13131861 13019311 12930280
60032 12930280 12865347 12824990 12808181 12811549 12830859 12863024 12906185 12958250 13015866 13074565 13129405
60021 13129405 13175712 13209793 13229200 13232472 13218888 13188441 13141477 13078109 12998352 12903067 12794219
$$ packed form
60090G775475O079N814P134R819J4149K0270K8263L8412N0746O4497P8764R3793
60078H193215J10835J30341J51012J71325J91576K13370K37193K61513K84691
60069I945071L06629L27820L47569L64313L77226L86286L90855L89586L81933
60060A3217288L68682L50448L26805K97597K64185K28310J90080J48291J02726
60051A5494412N5397R178l4206p4537j11684j44512j71466j91995k06638k15466
60041A4408483k17315k11541k00052j86202j71554j54930j35028j12550q9031
60032A2930280o4933m0357j6809L368J9310L2165M3161N2065N7616N8699N4840
60021A3129405M6307L4081J9407L272j3584l0447m6964o3368p9757r5285j08848
$$ plain form
60010 12794219 12673883 12543393 12403745 12256138 12101523 11940305 11773615 11604733 11438219
60001 11438219 11277285 11122606 10973880 10831811 10698145 10574432 10461636 10360885 10273847
59992 10273847 10201924 10145321 10103393 10075955 10063954 10068533 10089430 10124506 10170693 10225107 10285255
59981 10285255 10348702 10412939 10475433 10533515 10584310 10624877 10652325 10663849 10657285 10632060 10589314
59970 10589314 10530582 10456546 10367541 10265070 10152133 10032153 9908283 9783771 9661850 9544508
59960 9544508 9431959 9324353 9223893 9134376 9058339 8995277 8943116 8901052 8870529 8853759 8852092
59949 8852092 8865894 8895322 8940596 9001766 9078635 9170818 9277344 9396143 9524346 9659209
59939 9659209 9798255 9938298 10074825 10202957 10318827 10419679 10502993 10566397 10608656 10630104
$$ packed form
60010A2794219j20336j30490j39648j47607j54615j61218j66690j68882j66514
60001A1438219j60934j54679j48726j42069j33666j23713j12796j00751q7038
59992A0273847p1923n6603m1928k7438j2001M579K0897L5076M6187N4414O0148
59981A0285255O3447O4237O2494N8082N0795M0567K7448J1524o564k5225m2746
59970A0589314n8732p4036q9005j02471j12937j19980j23870j24512j21921j17342
59960I544508j12549j07606j00460q9517p6037o3062n2161m2064l0523j6770j667
59949H852092J3802K9428M5274O1170P6869R2183J06526J18799J28203J34863
59939I659209J39046J40043J36527J28132J15870J00852Q3314O3404M2259K1448
$$ plain form
59929 10630104 10631691 10613862 10576682 10520940 10448811 10363576 10268924 10168462 10065620 9963737 9865929
59918 9865929 9774547 9690818 9615476 9549935 9496445 9456790 9431299 9419728 9422795 9441814 9476560
59907 9476560 9524352 9582050 9648681 9725309 9812240 9906884 10004568 10101130 10194719 10285633 10374837
59896 10374837 10462302 10546261 10624099 10694290 10757427 10815171 10868527 10917872 10964699 11012590 11065912
59885 11065912 11127922 11200646 11286293 11387967 11508778 11650836 11815759 12006028 12225168 12475954
59875 12475954 12758299 13069168 13404760 13762397 14139759 14532416 14932690 15330887 15716665
59866 15716665 16078854 16405242 16684188 16906771 17067028 17160955 17187000 17147871 17050458 16903106
59856 16903106 16713533 16489565 16240333 15975146 15701600 15425875 15154387 14893654 14648359
$$ packed form
59929A0630104J587j7829l7180n5742p2129q5235r4652j00462j02842j01883r7808
59918I865929r1382q3729p5342o5541n3490l9655k5491j1571L067J9019L4746
59907I476560M7792N7698O6631P6628Q6931R4644R7684R6562R3589R0914Q9204
59896A0374837Q7465Q3959P7838P0191O3137N7744N3356M9345M6827M7891N3322
59885A1065912O2010P2724Q5647J01674J20811J42058J64923J90269K19140K50786
59875A2475954K82345L10869L35592L57637L77362L92657M00274L98197L85778
59866A5716665L62189L26388K78946K22583J60257R3927K6045l9129r7413j47352
59856A6903106j89573k23968k49232k65187k73546k75725k71488k60733k45295
$$ plain form
59847 14648359 14420766 14212404 14025394 13861698 13721968 13605882 13513215 13444146 13398926 13377600
59837 13377600 13379552 13402904 13444835 13502991 13575978 13661683 13755360 13850144 13939359 14017521 14079121
59826 14079121 14117537 14126039 14099806 14036711 13936611 13800610 13631136 13432139 13208539 12965212
59816 12965212 12706521 12436683 12160248 11882046 11606759 11338523 11080371 10833579 10597794
59807 10597794 10372479 10158297 9956603 9767584 9589620 9420787 9260400 9108661 8965404
59798 8965404 8829745 8700528 8576448 8456011 8338072 8222443 8109645 8000325 7895266
59789 7895266 7795378 7700833 7610573 7523693 7441171 7364973 7295085 7228478 7161582 7092962 7022963
59778 7022963 6951621 6877955 6801018 6720768 6637962 6553909 6470257 6388429 6309160 6232923 6160705
$$ packed form
59847A4648359k27593k08362j87010j63696j39730j16086r2667o9069m5220k1326
59837A3377600J952K3352M1931N8156P2987Q5705R3677R4784Q9215P8162O1600
59826A4079121L8416Q502k6233o3095j00100j36001j69474j98997k23600k43327
59816A2965212k58691k69838k76435k78202k75287k68236k58152k46792k35785
59807A0597794k25315k14182k01694j89019j77964j68833j60387j51739j43257
59798H965404j35659j29217j24080j20437j17939j15629j12798j09320j05059
59789G895266r9888r4545r0260q6880q2522p6198o9888o6607o6896o8620o9999
59778G022963p1342p3666p6937q0250q2806q4053q3652q1828p9269p6237p2218
$$ plain form
59767 6160705 6093836 6033135 5978833 5931293 5891184 5858740 5833439 5814832 5803306 5799582 5803751 5815244
59755 5815244 5833536 5858295 5888802 5923790 5962211 6003803 6048415 6094905 6141173 6185431 6226989
59744 6226989 6265558 6300189 6329509 6352968 6371316 6385684 6396675 6404821 6411720 6420169 6432947 6451640
59732 6451640 6476789 6509091 6550270 6602708 6668307 6747848 6841650 6950815 7077671 7224885 7394276
59721 7394276 7586511 7801689 8039892 8301256 8585850 8893240 9220953 9562004 9903615
59712 9903615 10229081 10521913 10769009 10961188 11092736 11162013 11172424 11131709 11049690 10936581
59702 10936581 10802605 10657499 10509399 10364507 10228124 10105318 10000071 9914239 9847942 9800576
59692 9800576 9771109 9758236 9761200 9780188 9815235 9865253 9929219 10008026 10103994 10218480 10351048
$$ packed form
59767F160705o6869o0701n4302m7540m0109l2444k5301j8607j1526l724M169J1493
59755E815244J8292K4759L0507L4988L8421M1592M4612M6490M6268M4258M1558
59744F226989L8569L4631K9320K3459J8348J4368J0991Q146O899Q449J2778J8693
59732F451640K5149L2302M1179N2438O5599P9541R3802J09165J26856J47214J69391
59721G394276J92235K15178K38203K61364K84594L07390L27713L41051L41611
59712I903615L25466K92832K47096J92179J31548O9277J0411m0715q2019j13109
59702A0936581j33976j45106j48100j44892j36383j22806j05247q5832o6297m7366
59692I800576k9467j2873K964J8988L5047N0018O3966P8807R5968J14486J32568
$$ plain form
59681 10351048 10501222 10670124 10860050 11073279 11311655 11576572 11868876 12189368 12539627
59672 12539627 12921807 13337503 13787555 14273022 14795144 15353822 15947119 16572941 17230223
59663 17230223 17917390 18630300 19362633 20107828 20859713 21611843 22357704 23092056 23811946
59654 23811946 24517086 25210327 25897486 26585598 27280791 27987898 28711208 29454022 30216979
59645 30216979 30997307 31789501 32585720 33375370 34145551 34882960 35575485 36212322 36783829
59636 36783829 37282497 37704338 38049436 38321782 38529108 38682554 38795540 38882009 38955089 39026966
59626 39026966 39109735 39215957 39357840 39545528 39786332 40085714 40448641 40879754 41382697
59617 41382697 41959649 42610828 43333445 44120881 44963043 45846818 46755222 47666062 48552148
$$ packed form
59681A0351048J50174J68902J89926K13229K38376K64917K92304L20492L50259
59672A2539627L82180M15696M50052M85467N22122N58678N93297O25822O57282
59663A7230223O87167P12910P32333P45195P51885P52130P45861P34352P19890
59654B3811946P05140O93241O87159O88112O95193P07107P23310P42814P62957
59645C0216979P80328P92194P96219P89650P70181P37409O92525O36837N71507
59636C6783829M98668M21841L45098K72346K07326J53446J12986Q6469P3080P1877
59626C9026966Q2769J06222J41883J87688K40804K99382L62927M31113N02943
59617D1382697N76952O51179P22617P87436Q42162Q83775R08404R10840Q86086
$$ plain form
59608 48552148 49382999 50126489 50750401 51225330 51528502 51646317 51574992 51320625 50898731
59599 50898731 50331777 49645305 48865569 48019519 47134254 46234091 45337654 44457604 43601585
59590 43601585 42771550 41962158 41161548 40355225 39530371 38678084 37793741 36876656 35929704
59581 35929704 34958974 33973488 32984425 32003342 31040040 30101691 29193695 28320819 27486879
59572 27486879 26693290 25938531 25219836 24535589 23885739 23269850 22685433 22128746 21596844
59563 21596844 21088111 20601102 20133959 19685343 19255199 18843969 18451298 18075805 17715732
59554 17715732 17369507 17035945 16714149 16402918 16100043 15802675 15508828 15218240 14931438
59545 14931438 14648388 14368568 14092038 13819626 13552021 13289243 13031222 12778571 12532632
$$ packed form
59608D8552148Q30851P43490O23912M74929L03172J17815p1325k54367m21894
59599E0898731n66954o86472p79736q46050q85265r00163q96437q80050q56019
59590D3601585q30035q09392q00610q06323q24854q52287q84343r17085r46952
59581C5929704r70730r85486r89063r81083r63302r38349r07996q72876q33940
59572B7486879p93589p54759p18695o84247o49850o15889n84417n56687n31902
59563B1596844n08733m87009m67143m48616m30144m11230l92671l75493l60073
59554A7715732l46225l33562l21796l11231l02875k97368k93847k90588k86802
59545A4931438k83050k79820k76530k72412k67605k62778k58021k52651k45939
$$ plain form
59536 12532632 12294974 12066919 11849273 11642286 11445903 11260051 11084651 10919468 10764185
59527 10764185 10618609 10482605 10355798 10237553 10127366 10025088 9930581 9843265 9762348 9687538
59517 9687538 9619216 9557524 9501386 9448917 9399059 9352560 9311061 9275480 9245683 9221614 9204273
59506 9204273 9195351 9196169 9207149 9228271 9259957 9303527 9360704 9432655 9519621 9621512 9738503
59495 9738503 9870921 10018972 10183055 10364005 10562390 10777746 11009063 11255922 11518254
59486 11518254 11794675 12081598 12374422 12669362 12963990 13256445 13544636 13826240 14099259
59477 14099259 14362300 14613865 14851334 15071390 15272311 15455744 15625517 15784840 15935304
59468 15935304 16078216 16215574 16349501 16482042 16616111 16755463 16902473 17056153 17212739
$$ packed form
59536A2532632k37658k28055k17646k06987j96383j85852j75400j65183j55283
59527A0764185j45576j36004j26807j18245j10187j02278r4507q7316q0917p4810
59517I687538o8322o1692n6138n2469m9858m6499m1499l5581k9797k4069j7341
59506I204273q922Q18J0980K1122L1686M3570N7177P1951Q6966J01891J16991
59495I738503J32418J48051J64083J80950J98385K15356K31317K46859K62332
59486A1518254K76421K86923K92824K94940K94628K92455K88191K81604K73019
59477A4099259K63041K51565K37469K20056K00921J83433J69773J59323J50464
59468A5935304J42912J37358J33927J32541J34069J39352J47010J53680J56586
$$ plain form
59459 17212739 17367517 17515323 17650017 17764771 17853028 17908696 17925788 17898846 17823956 17699251
59449 17699251 17525023 17304290 17042973 16748390 16427043 16084102 15724865 15355847 14984108
59440 14984108 14615983 14256646 13910197 13579415 13265386 12967838 12686233 12420756 12172311
59431 12172311 11941559 11728147 11530989 11349163 11182192 11029736 10891823 10769535 10664519
59422 10664519 10577249 10506490 10451318 10413135 10394678 10397238 10419824 10460959 10520232 10597860 10693823
59411 10693823 10808028 10940518 11090534 11255430 11431036 11613005 11797351 11979736 12154745
59402 12154745 12316206 12458104 12575056 12662068 12714385 12728105 12701313 12634681 12530993 12393963
59392 12393963 12227211 12034065 11818367 11585445 11341740 11092808 10841756 10590247 10340777
$$ packed form
59459A7212739J54778J47806J34694J14754Q8257N5668J7092k6942p4890j24705
59449A7699251j74228k20733k61317k94583l21347l42941l59237l69018l71739
59440A4984108l68125l59337l46449l30782l14029k97548k81605k65477k48445
59431A2172311k30752k13412j97158j81826j66971j52456j37913j22288j05016
59422A0664519q7270p0759n5172l8183j8457K560K2586M1135N9273P7628R5963
59411A0693823J14205J32490J50016J64896J75606J81969J84346J82385J75009
59402A2154745J61461J41898J16952Q7012N2317J3720k6792o6632j03688j37030
59392A2393963j66752j93146k15698k32922k43705k48932k51052k51509k49470
$$ plain form
59383 10340777 10096988 9861503 9634584 9415496 9204273 9001496 8807359 8622101 8446645
59374 8446645 8281472 8125265 7976142 7834165 7701225 7578240 7463794 7356038 7254688
59365 7254688 7160449 7073639 6994425 6923627 6861992 6808856 6762547 6722112 6687860 6660050 6637901
59354 6637901 6620448 6607982 6601961 6603236 6610614 6621549 6634426 6649936 6669912 6695000 6724033 6755960
59342 6755960 6792108 6836244 6892438 6962818 7046973 7143137 7249897 7367037 7495148 7634994
59332 7634994 7787755 7955717 8142068 8349714 8580595 8836398 9119503 9432745 9778338
59323 9778338 10157392 10570371 11017523 11498578 12012102 12555138 13123227 13710498 14309795
59314 14309795 14913073 15512064 16098994 16667141 17211154 17727039 18211765 18662786 19078176
$$ packed form
59383A0340777k43789k35485k26919k19088k11223k02777j94137j85258j75456
59374H446645j65173j56207j49123j41977j32940j22985j14446j07756j01350
59365G254688r4239q6810p9214p0798o1635n3136m6309m0435l4252k7810k2149
59354F637901j7453j2466o021J275P378J0935J2877J5510J9976K5088K9033L1927
59342F755960L6148M4136N6194P0380Q4155R6164J06760J17140J28111J39846
59332G634994J52761J67962J86351K07646K30881K55803K83105L13242L45593
59323I778338L79054M12979M47152M81055N13524N43036N68089N87271N99297
59314A4309795O03278N98991N86930N68147N44013N15885M84726M51021M15390
$$ plain form
59305 19078176 19457364 19801369 20111612 20388249 20629899 20834890 21002102 21130242 21217047
59296 21217047 21260112 21258529 21213385 21126965 21002304 20843599 20656142 20444994 20213659 19964234
59286 19964234 19698583 19418780 19126173 18820487 18500587 18166488 17820311 17464927 17102052
59277 17102052 16732441 16357894 15982091 15609011 15241321 14881028 14531029 14194791 13874378
59268 13874378 13569660 13279753 13004772 12745814 12503631 12277762 12067037 11870730 11689002
59259 11689002 11522027 11369010 11228723 11101023 10986968 10886929 10799404 10722636 10656853 10603832
59249 10603832 10564324 10536937 10519546 10510696 10509307 10513941 10522970 10535008 10548711 10562442 10574374 10582700
59237 10582700 10585770 10582570 10573267 10558831 10539992 10517030 10490636 10462354 10433873 10406427 10381230 10360051
$$ packed form
59305A9078176L79188L44005L10243K76637K41650K04991J67212J28140Q6805
59296B1217047M3065j583m5144q6420j24661j58705j87457k11148k31335k49425
59286A9964234k65651k79803k92607l05686l19900l34099l46177l55384l62875
59277A7102052l69611l74547l75803l73080l67690l60293l49999l36238l20413
59268A3874378l04718k89907k74981k58958k42183k25869k10725j96307j81728
59259A1689002j66975j53017j40287j27700j14055j00039q7525p6768o5783n3021
59249A0603832l9508k7387j7391q850j389M634R029J2038J3703J3731J1932Q326
59237A0582700L070l200r303j4436j8839k2962k6394k8282k8481k7446k5197k1179
$$ plain form
59225 10360051 10344957 10337872 10340710 10355496 10383806 10425996 10481168 10547815 10624653 10711153 10807293
59214 10807293 10912267 11023227 11135612 11244944 11348190 11443519 11529276 11603386 11663517 11707881
59204 11707881 11736383 11750954 11754174 11747298 11729964 11701781 11663696 11618001 11567872 11516980 11468388
59193 11468388 11423092 11380072 11338202 11297604 11258961 11222318 11187071 11152422 11117285 11080444 11041601
59182 11041601 11001922 10963091 10926422 10893412 10866388 10847756 10839179 10842353 10860041 10895303 10950096
59171 10950096 11025632 11123807 11247097 11397064 11573958 11777641 12007687 12262283 12537867 12829817
59161 12829817 13132222 13436654 13732386 14008667 14256202 14466213 14629504 14737883 14786193
59152 14786193 14772228 14695396 14556921 14361428 14117030 13833100 13518193 13180158 12827337 12468587
$$ packed form
59225A0360051j5094p085K838J4786K8310M2190N5172O6647P6838Q6500R6140
59214A0807293J04974J10960J12385J09332J03246R5329Q5757P4110O0131M4364
59204A1707881K8502J4571L220o876j7334k8183l8085m5695n0129n0892m8592
59193A1468388m5296m3020m1870m0598l8643l6643l5247l4649l5137l6841l8843
59182A1041601l9679l8831l6669l3010k7024j8632q577L174J7688L5262N4793
59171A0950096P5536R8175J23290J49967J76894K03683K30046K54596K75584K91950
59161A2829817L02405L04432K95732K76281K47535K10011J63291J08379M8310
59152A4786193j3965p6832j38475j95493k44398k83930l14907l38035l52821l58750
$$ plain form
59142 12468587 12111745 11761977 11421620 11091730 10774007 10471103 10184911 9914982 9659285
59133 9659285 9416385 9186016 8967473 8758811 8558634 8367864 8188366 8020027 7860540
59124 7860540 7708148 7563154 7426279 7297035 7174848 7060581 6955281 6857899 6765967 6678609
59114 6678609 6597506 6524522 6459591 6401320 6348541 6300607 6257280 6219244 6188039 6164532 6147866
59103 6147866 6136646 6130706 6130970 6138037 6151711 6171550 6197102 6227999 6264775 6309220 6362651 6423822
59091 6423822 6489775 6558987 6632440 6711059 6793293 6876241 6958241 7039006 7117462 7190865 7256452
59080 7256452 7313070 7360727 7399276 7428323 7448149 7459973 7465207 7464960 7460543 7453990 7447591 7442873 7440409
59067 7440409 7440760 7445436 7456704 7476508 7505839 7545206 7595493 7658036 7733845 7823075 7925466 8041188
$$ packed form
59142A2468587l56842l49768l40357l29890l17723l02904k86192k69929k55697
59133I659285k42900k30369k18543k08662k00177j90770j79498j68339j59487
59124G860540j52392j44994j36875j29244j22187j14267j05300r7382r1932q7358
59114F678609q1103p2984o4931n8271n2779m7934m3327l8036l1205k3507j6666
59103F147866j1220n940K64P067J3674J9839K5552L0897L6776M4445N3431O1171
59091F423822O5953O9212P3453P8619Q2234Q2948Q2000Q0765P8456P3403O5587
59080G256452N6618M7657L8549K9047J9826J1824N234k47m417o553o399m718k464
59067G440409L51M676J1268J9804K9331L9367N0287O2543P5809Q9230J02391J15722
$$ plain form
59055 8041188 8171107 8316358 8477719 8654959 8846254 9048552 9259346 9478175 9705540
59046 9705540 9939967 10176801 10410177 10635177 10847287 11040788 11209305 11348019 11454430
59037 11454430 11527265 11565926 11571172 11545082 11489799 11407100 11299458 11170534 11024047 10862826
59027 10862826 10689165 10505028 10311286 10107921 9896015 9678889 9460211 9241512 9022555
59018 9022555 8803667 8586559 8373035 8164075 7960229 7761840 7568497 7379152 7193422
59009 7193422 7012448 6838215 6672168 6514501 6364266 6219931 6080181 5944584 5813620
59000 5813620 5688145 5568856 5455906 5348559 5245307 5144767 5046598 4951346 4859420 4770591
58990 4770591 4684496 4601194 4520917 4443442 4368055 4294266 4222448 4153575 4088304 4026508 3967798
$$ packed form
59055H041188J29919J45251J61361J77240J91295K02298K10794K18829K27365
59046I705540K34427K36834K33376K25000K12110J93501J68517J38714J06411
59037A1454430P2835L8661N246k6090n5283q2699j07642j28924j46487j61221
59027A0862826j73661j84137j93742k03365k11906k17126k18678k18699k18957
59018I022555k18888k17108k13524k08960k03846j98389j93343j89345j85730
59009G193422j80974j74233j66047j57667j50235j44335j39750j35597j30964
59000E813620j25475j19289j12950j07347j03252j00540r8169r5252r1926q8829
58990D770591q6095q3302q0277p7475p5387p3789p1818o8873o5271o1796n8710
$$ plain form
58979 3967798 3912163 3859808 3810744 3764953 3722655 3683688 3646952 3611411 3577632 3547197 3520371
58968 3520371 3495564 3471647 3449514 3430435 3413904 3398405 3383471 3369471 3355690 3340267 3322270
58957 3322270 3302661 3282863 3263398 3244383 3226509 3210866 3198104 3188061 3179846 3172228 3164449 3156884
58945 3156884 3150553 3145882 3142238 3138661 3134558 3129617 3123580 3116302 3107689 3097458 3085408 3072025 3058516
58932 3058516 3046064 3035203 3025786 3017282 3009261 3002060 2996834 2994492 2994729 2996684 3000373 3006639 3015588 3025953
58918 3025953 3036469 3047210 3059202 3073283 3089967 3109920 3133744 3161197 3191126 3222309 3254191
58907 3254191 3286906 3320952 3357104 3396394 3439787 3487551 3538938 3592660 3647762 3704004 3761561
58896 3761561 3820801 3882502 3947765 4017155 4090063 4165420 4243168 4324667 4411555 4504455 4603036
$$ packed form
58979C967798n5635n2355m9064m5791m2298l8967l6736l5541l3779l0435k6826
58968C520371k4807k3917k2133j9079j6531j5499j4934j4000j3781j5423j7997
58957C322270j9609j9798j9465j9015j7874j5643j2762j0043q215p618p779p565
58945C156884o331m671l644l577m103m941o037p278q613j0231j2050j3383j3509
58932C058516j2452j0861r417q504q021p201n226k342K37J955L689O266Q949J0365
58918C025953J0516J0741J1992J4081J6684J9953K3824K7453K9929L1183L1882
58907C254191L2715L4046L6152L9290M3393M7764N1387N3722N5102N6242N7557
58896C761561N9240O1701O5263O9390P2908P5357P7748Q1499Q6888R2900R8581
$$ plain form
58885 4603036 4707208 4817880 4936328 5063023 5197713 5340830 5494009 5658445 5833329
58876 5833329 6017215 6210809 6417017 6638009 6873810 7124561 7392641 7681224 7991844
58867 7991844 8324850 8681459 9063710 9472966 9910274 10378139 10880126 11418385 11992873
58858 11992873 12603199 13249614 13931513 14646211 15389884 16158427 16946052 17743371 18537592
58849 18537592 19314279 20058556 20755237 21388796 21943763 22405740 22763167 23009127 23141910
58840 23141910 23164319 23082845 22906990 22648011 22317517 21927351 21490300 21019590 20526941 20021408
58830 20021408 19510113 18999233 18494030 17998730 17516891 17051265 16602887 16171032 15754692
58821 15754692 15353720 14968094 14596728 14237759 13889934 13553350 13229027 12918007 12620562
$$ packed form
58885D603036J04172J10672J18448J26695J34690J43117J53179J64436J74884
58876E833329J83886J93594K06208K20992K35801K50751K68080K88583L10620
58867G991844L33006L56609L82251M09256M37308M67865N01987N38259N74488
58858A1992873O10326O46415O81899P14698P43673P68543P87625P97319P94221
58849A8537592P76687P44277O96681O33559N54967M61977L57427K45960J32783
58840B3141910K2409q1474j75855k58979l30494l90166m37051m70710m92649n05533
58830B0021408n11295n10880n05203m95300m81839m65626m48378m31855m16340
58821A5754692m00972l85626l71366l58969l47825l36584l24323l11020k97445
$$ plain form
58812 12620562 12335942 12063035 11801354 11551220 11312982 11086462 10871013 10665556 10468656
58803 10468656 10279434 10098658 9928094 9768268 9617469 9473523 9336133 9207019 9088012
58794 9088012 8979431 8880169 8788937 8705373 8630016 8563381 8505556 8456957 8418660 8391174 8373531
58783 8373531 8364849 8366499 8381101 8409210 8448600 8497466 8556858 8628934 8714064 8811064 8919681
58772 8919681 9041399 9177861 9329486 9495916 9677441 9875864 10094010 10334171 10597018
58763 10597018 10882593 11192284 11529038 11895552 12293269 12723442 13187858 13687686 14222569
58754 14222569 14791752 15395205 16032437 16700671 17394960 18109097 18834763 19559884 20269224
58745 20269224 20946971 21578125 22147715 22640345 23041773 23341107 23531701 23610825 23579486 23442939
$$ packed form
58812A2620562k84620k72907k61681k50134k38238k26520k15449k05457j96900
58803A0468656j89222j80776j70564j59826j50799j43946j37390j29114j19007
58794I088012j08581r9262r1232q3564p5357o6635n7825m8599l8297k7486j7643
58783H373531q682J650J4602K8109L9390M8866N9392P2076Q5130R7000J08617
58772H919681J21718J36462J51625J66430J81525J98423K18146K40161K62847
58763A0597018K85575L09691L36754L66514L97717M30173M64416M99828N34883
58754A4222569N69183O03453O37232O68234O94289P14137P25666P25121P09340
58745B0269224O77747O31154N69590M92630M01428K99334J90594P9124l1339j36547
$$ plain form
58735 23442939 23211026 22897020 22514909 22077141 21594813 21079234 20541953 19992882 19439364
58726 19439364 18887516 18343344 17811680 17294907 16793808 16309090 15841003 15388099 14948027
58717 14948027 14519883 14104868 13704404 13318373 12945526 12584918 12236319 11899457 11573408
58708 11573408 11257117 10950598 10655289 10372715 10102823 9844094 9595203 9355864 9125949
58699 9125949 8904790 8691855 8487360 8291532 8103800 7923273 7749515 7582380 7421707
58690 7421707 7267770 7121386 6982787 6850789 6723795 6601300 6483864 6372024 6265772
58681 6265772 6164628 6067527 5972954 5879716 5787260 5695057 5602474 5509792 5418512 5329839 5243429
58670 5243429 5158257 5073941 4990470 4907583 4825464 4745222 4667397 4590555 4512605 4433139 4353340
$$ packed form
58735B3442939k31913l14006l82111m37768m82328n15579n37281n49071n53518
58726A9439364n51848n44172n31664n16773n01099m84718m68087m52904m40072
58717A4948027m28144m15015m00464l86031l72847l60608l48599l36862l26049
58708A1573408l16291l06519k95309k82574k69892k58729k48891k39339k29915
58699I125949k21159k12935k04495j95828j87732j80527j73758j67135j60673
58690G421707j53937j46384j38599j31998j26994j22495j17436j11840j06252
58681F265772j01144r7101r4573r3238r2456r2203r2583r2682r1280q8673q6410
58670E243429q5172q4316q3471q2887q2119q0242p7825p6842p7950p9466p9799
$$ plain form
58659 4353340 4274176 4196002 4119507 4045434 3973303 3901713 3829962 3758453 3687761 3618502 3551770
58648 3551770 3488236 3426848 3365908 3305532 3247561 3192852 3140262 3088772 3038958 2991467 2945435
58637 2945435 2899556 2853801 2808985 2765331 2722566 2681008 2641501 2604372 2569190 2535506 2503226
58626 2503226 2472339 2442750 2414465 2387458 2361145 2334326 2306020 2276517 2247493 2220760 2196840
58615 2196840 2174859 2153821 2133645 2115002 2098577 2084600 2072529 2061018 2048907 2036672 2026128
58604 2026128 2018170 2011484 2004190 1996023 1988003 1980634 1973472 1966020 1957990 1949135 1940019 1932607 1928653 1927522
58590 1927522 1926857 1925552 1924949 1926949 1932174 1940372 1951436 1965256 1981252 1998788 2017857 2039135 2063552
58577 2063552 2091714 2123278 2157028 2192177 2229533 2270809 2316977 2368120 2424712 2487942 2558509
$$ packed form
58659D353340p9164p8174p6495p4073p2131p1590p1751p1509p0692o9259o6732
58648C551770o3534o1388o0940o0376n7971n4709n2590n1490m9814m7491m6032
58637B945435m5879m5755m4816m3654m2765m1558l9507l7129l5182l3684l2280
58626B503226l0887k9589k8285k7007k6313k6819k8306k9503k9024k6733k3920
58615B196840k1981k1038k0176j8643j6425j3977j2071j1511j2111j2235j0544
58604B026128p958o686p294q167q020p369p162p452q030q855r116p412l954j131
58590A927522o65j305o03K000N225Q198J1064J3820J5996J7536J9069K1278K4417
58577B063552K8162L1564L3750L5149L7356M1276M6168N1143N6592O3230P0567
$$ plain form
58566 2558509 2636086 2720500 2812766 2914353 3025851 3146984 3277993 3420627 3577337 3749136
58556 3749136 3934362 4130021 4334351 4547209 4767700 4992280 5215459 5431141 5632532
58547 5632532 5812270 5964307 6085236 6172849 6224578 6239110 6218827 6168742 6093250 5995644 5880390
58536 5880390 5753570 5620454 5484189 5347147 5211871 5080057 4951970 4827666 4707819
58527 4707819 4593047 4483559 4379878 4282814 4192280 4107086 4026261 3949612 3876764 3806837 3739634
58516 3739634 3676256 3618024 3565306 3517396 3472787 3429732 3387539 3347259 3310058 3275132 3240430
58505 3240430 3205188 3170253 3135956 3101237 3065082 3027310 2987745 2946080 2902787 2858765 2813926
58494 2813926 2767689 2720937 2675756 2632990 2591836 2552029 2514457 2479259 2445502 2413337 2384199
$$ packed form
58566B558509P7577Q4414R2266J01587J11498J21133J31009J42634J56710J71799
58556C749136J85226J95659K04330K12858K20491K24580K23179K15682K01391
58547E632532J79738J52037J20929Q7613N1729J4532k0283n0085p5492r7606j15254
58536E880390j26820j33116j36265j37042j35276j31814j28087j24304j19847
58527D707819j14772j09488j03681r7064r0534q5194q0825p6649p2848o9927o7203
58516C739634o3378n8232n2718m7910m4609m3055m2193m0280l7201l4926l4702
58505C240430l5242l4935l4297l4719l6155l7772l9565m1665m3293m4022m4839
58494B813926m6237m6752m5181m2766m1154l9807l7572l5198l3757l2165k9138
$$ plain form
58483 2384199 2357993 2332406 2306198 2280854 2257361 2233457 2206240 2176093 2146066 2118331 2092900
58472 2092900 2068846 2045063 2020483 1994930 1969342 1944337 1919499 1894684 1870695 1847636 1824152
58461 1824152 1799516 1774969 1751623 1728648 1705273 1682967 1663506 1646069 1628548 1610946 1595108
58450 1595108 1581517 1568604 1555284 1542247 1530513 1520125 1510574 1501486 1492911 1485603 1480591 1477693
58438 1477693 1475283 1472544 1470925 1472038 1475154 1478452 1481844 1486485 1492050 1496738 1499943 1503014 1507147 1512232
58424 1512232 1517901 1523972 1529563 1533430 1535650 1537551 1539387 1539460 1536245 1530288 1523202 1515590 1506780 1496122
58410 1496122 1483872 1470944 1458069 1445157 1431486 1416749 1401713 1387516 1374549 1362404 1350721
58399 1350721 1339587 1329278 1319972 1311510 1303251 1294587 1285902 1278544 1273463 1270318 1268155 1266323 1264451
$$ packed form
58483B384199k6206k5587k6208k5344k3493k3904k7217l0147l0027k7735k5431
58472B092900k4054k3783k4580k5553k5588k5005k4838k4815k3989k3059k3484
58461A824152k4636k4547k3346k2975k3375k2306j9461j7437j7521j7602j5838
58450A595108j3591j2913j3320j3037j1734j0388r551r088q575p308n012k898
58438A477693k410k739j619J113L116L298L392M641N565M688L205L071M133N085
58424A512232N669O071N591L867K220J901J836P3l215n957p086p612q810j0658
58410A496122j2250j2928j2875j2912j3671j4737j5036j4197j2967j2145j1683
58399A350721j1134j0309r306q462q259q664q685p358n081l145k163j832j872
$$ plain form
58386 1264451 1262380 1260670 1260440 1262148 1265132 1268712 1272985 1278168 1284106 1290824 1298549 1306837 1314870 1322941
58372 1322941 1332017 1341209 1347581 1349734 1349871 1350784 1352363 1352843 1352099 1351642 1352347 1354213 1357610 1362704 1368160
58357 1368160 1372367 1375658 1379618 1384532 1389178 1392822 1395807 1398495 1401299 1405576 1412809 1422772 1433632 1443691
58343 1443691 1451975 1457661 1460310 1460334 1458032 1452737 1444270 1434594 1426318 1419887 1413709 1406646 1398880 1390861
58329 1390861 1383232 1377525 1375005 1374681 1373987 1371628 1368522 1366081 1364852 1364777 1365404 1365829 1365520 1365108 1365441 1366322
58313 1366322 1367346 1369461 1374198 1381529 1389715 1397218 1403801 1410149 1417364 1426325 1436663 1446977 1456819
58300 1456819 1467401 1479384 1491353 1501801 1511219 1520645 1529747 1538285 1548018 1560660 1575015 1588534
58288 1588534 1600693 1612323 1622612 1629768 1634335 1638887 1644334 1649067 1651980 1654104 1656939 1661061 1666518
$$ packed form
58386A264451k071j710k30J708K984L580M273N183N938O718P725Q288Q033Q071
58372A322941R076R192O372K153J37R13J579M80p44m57P05J866L397N094N456
58357A368160M207L291L960M914M646L644K985K688K804M277P233R963J0860J0059
58343A443691Q284N686K649K4k302n295q467r676q276o431o178p063p766q019
58329A390861p629n707k520l24o94k359l106k441j229p5O27M25l09m12L33Q81
58313A366322J024K115M737P331Q186P503O583O348P215Q961J0338J0314R842
58300A456819J0582J1983J1969J0448R418R426R102Q538R733J2642J4355J3519
58288A588534J2159J1630J0289P156M567M552N447M733K913K124K835M122N457
$$ plain form
58275 1666518 1673008 1679705 1686345 1694009 1703462 1713738 1724118 1736126 1751226 1767832 1783397 1798493
58263 1798493 1815768 1835710 1856605 1878123 1901461 1926188 1950383 1974080 1999284 2026206 2052581
58252 2052581 2077209 2101329 2125932 2150331 2173675 2195375 2213985 2228584 2241454 2256556 2275003
58241 2275003 2294672 2314303 2334946 2357224 2380399 2404660 2431283 2459918 2488656 2517358 2548048
58230 2548048 2581420 2615829 2650430 2686596 2725491 2766715 2809855 2855057 2901818 2949513 2999025
58219 2999025 3051467 3105852 3160748 3217491 3278537 3343443 3410087 3479077 3552762 3630275 3707945
58208 3707945 3784509 3861645 3939521 4016539 4093648 4174155 4258866 4346141 4437075 4535694 4643413
58197 4643413 4758209 4879927 5011343 5153363 5304521 5466204 5643041 5836977 6046122
$$ packed form
58275A666518O490O697O640P664R453J0276J0380J2008J5100J6606J5565J5096
58263A798493J7275J9942K0895K1518K3338K4727K4195K3697K5204K6922K6375
58252B052581K4628K4120K4603K4399K3344K1700J8610J4599J2870J5102J8447
58241B275003J9669J9631K0643K2278K3175K4261K6623K8635K8738K8702L0690
58230B548048L3372L4409L4601L6166L8895M1224M3140M5202M6761M7695M9512
58219B999025N2442N4385N4896N6743O1046O4906O6644O8990P3685P7513P7670
58208C707945P6564P7136P7876P7018P7109Q0507Q4711Q7275R0934R8619J07719
58197D643413J14796J21718J31416J42020J51158J61683J76837J93936K09145
$$ plain form
58188 6046122 6270139 6511029 6767563 7035101 7312459 7603001 7907463 8222104 8545955
58179 8545955 8883636 9238716 9610523 9999878 10411761 10849519 11312208 11799969 12316233
58170 12316233 12862760 13439119 14049518 14703916 15410137 16170728 16988023 17863741 18791402
58161 18791402 19757696 20754668 21783738 22847099 23945227 25085420 26282512 27547728
58153 27547728 28886522 30310141 31838724 33490502 35280036 37230132 39372405 41732535
58145 41732535 44329187 47191799 50365423 53896865 57836918 62263877 67287114 73022261
58137 73022261 79582225 87092559 95684530 105467068 116543794 129076064 143307296 159541787
58129 159541787 178157086 199559091 223800732 249887725 275408205 297142566 312419341
$$ packed form
58188F046122K24017K40890K56534K67538K77358K90542L04462L14641L23851
58179H545955L37681L55080L71807L89355M11883M37758M62689M87761N16264
58170A2316233N46527N76359O10399O54398P06221P60591Q17295Q75718R27661
58161A8791402R66294R96972J029070J063361J098128J140193J197092J265216
58153B7547728J338794J423619J528583J651778J789534J950096K142273K360130
58145D1732535K596652K862612L173624L531442L940053M426959N023237N735147
58137G3022261O559964P510334Q591971R782538J1076726J2532270J4231232J6234491
58129A59541787J8615299K1402005K4241641K6086993K5520480K1734361J5276775
$$ plain form
58122 312419341 320161251 320862779 315799793 306319809 293630923 278867730 263112735 247324919
58114 247324919 232261600 218418587 205994290 194923875 184991710 175951723 167597896
58107 167597896 159796949 152503673 145745744 139577561 134036721 129120962 124771993 120869611
58099 120869611 117262887 113830971 110522965 107350292 104358846 101611268 99175818 97112404
58091 97112404 95464784 94265925 93545550 93324344 93585330 94225128 95019718 95660745 95866861
58082 95866861 95483203 94480956 92883204 90720803 88055497 85005996 81724202 78351202
58074 78351202 74998782 71749578 68652078 65720785 62957762 60376806 58003604 55858548
58066 55858548 53944634 52244055 50717805 49313585 47983522 46695672 45429343 44168346
$$ packed form
58122C12419341P741910P01528n062986r479984j2688886j4763193j5754995j5787816
58114B47324919j5063319j3843013j2424297j1070415r932165r039987q353827
58107A67597896p800947p293276o757929o168183n540840m915759m348969l902382
58099A20869611l606724l431916l308006l172673k991446k747578k435450k063414
58091I7112404j647620j198859p20375k21206K60986O39798P94590O41027K06116
58082I5866861l83658j002247j597752k162401k665306l049501l281794l373000
58074G8351202l352420l249204l097500k931293k763023k580956k373202k145056
58066E5858548j913914j700579j526250j404220j330063j287850j266329j260997
$$ plain form
58058 44168346 42905149 41645841 40404236 39193957 38029025 36924931 35891577 34927565
58050 34927565 34025339 33177861 32376481 31607746 30858687 30123141 29399757 28687883 27989055
58041 27989055 27307505 26643787 25991056 25342042 24696427 24057505 23425733 22800725 22186375
58032 22186375 21588479 21009094 20447634 19905596 19385903 18889063 18413629 17958973 17524315
58023 17524315 17106643 16702624 16311217 15931925 15562441 15200508 14846065 14499081 14157434
58014 14157434 13819517 13486882 13161940 12845134 12536531 12237540 11948479 11666787 11390214
58005 11390214 11119607 10856375 10599770 10349081 10105695 9870240 9640231 9413419 9190968
57996 9190968 8974545 8762866 8554310 8350561 8154199 7964685 7780041 7600799 7428938
$$ packed form
58058D4168346j263197j259308j241605j210279j164932j104094j033354r64012
58050C4927565r02226q47478q01380p68735p49059p35546p23384p11874o98828
58041B7989055o81550o63718o52731o49014o45615o38922o31772o25008o14350
58032B2186375n97896n79385n61460n42038n19693m96840m75434m54656m34658
58023A7524315m17672m04019l91407l79292l69484l61933l54443l46984l41647
58014A4157434l37917l32635l24942l16806l08603k98991k89061k81692k76573
58005A1390214k70607k63232k56605k50689k43386k35455k30009k26812k22451
57996I190968k16423k11679k08556k03749j96362j89514j84644j79242j71861
$$ plain form
57987 7428938 7264295 7105019 6950418 6800682 6655139 6513281 6376129 6244166 6115459
57978 6115459 5988178 5863264 5742055 5623065 5503835 5384427 5266362 5149561 5033187
57969 5033187 4918236 4806619 4698712 4594265 4494428 4400310 4310603 4223013 4136909 4052360
57959 4052360 3967982 3882507 3797354 3714971 3635359 3556662 3478467 3402220 3328970 3258709 3191284
57948 3191284 3126188 3062116 2998343 2935630 2874600 2814641 2755832 2700001 2647912 2597181 2545192
57937 2545192 2492521 2441332 2392054 2343849 2296639 2250111 2202300 2151896 2100756 2051700 2005162
57926 2005162 1960436 1918496 1880487 1844712 1808463 1772127 1738443 1708196 1679557 1651263 1623550
57915 1623550 1596086 1567676 1538250 1509028 1480722 1453369 1427533 1403695 1380849 1357527 1333819
$$ packed form
57987G428938j64643j59276j54601j49736j45543j41858j37152j31963j28707
57978F115459j27281j24914j21209j18990j19230j19408j18065j16801j16374
57969E033187j14951j11617j07907j04447r9837r4118q9707q7590q6104q4549
57959D052360q4378q5475q5153q2383p9612p8697p8195p6247p3250p0261o7425
57948C191284o5096o4072o3773o2713o1030n9959n8809n5831n2089n0731n1989
57937B545192n2671n1189m9278m8205m7210m6528m7811n0404n1140m9056m6538
57926B005162m4726m1940l8009l5775l6249l6336l3684l0247k8639k8294k7713
57915A623550k7464k8410k9426k9222k8306k7353k5836k3838k2846k3322k3708
$$ plain form
57904 1333819 1310681 1288039 1265475 1243993 1224991 1208076 1191716 1175257 1158505 1140493 1120923
57893 1120923 1101799 1085197 1070266 1054819 1038929 1024207 1010298 995142 978562 962859 949787
57882 949787 939308 931257 925763 921906 918116 914077 910364 906461 901290 895380 890174 885205 878268 868601
57868 868601 857710 846782 835334 822890 810176 798137 787086 777055 767866 758947 750221 742844
57856 742844 737842 734577 731682 728735 725734 722162 718277 716125 717152 719846 721819 723017 724534 725568
57842 725568 724608 722791 722918 725441 728368 730868 733870 737183 739195 739793 740645 742148 742878 742545 742645 743489
57826 743489 743238 740788 737117 732885 727039 718865 709425 700052 691227 683585 678049 674257 670733 667263
57812 667263 665209 664937 664964 664356 663941 664445 665465 667032 670157 674800 679220 682390 685416 689532 694346 699022
$$ packed form
57904A333819k3138k2642k2564k1482j9002j6915j6360j6459j6752j8012j9570
57893A120923j9124j6602j4931j5447j5890j4722j3909j5156j6580j5703j3072
57882I49787j0479q051n494l857l790m039l713l903n171n910n206m969o937r667
57868H68601j0891j0928j1448j2444j2714j2039j1051j0031r189q919q726p377
57856G42844n002l265k895k947l001l572l885k152J027K694J973J198J517J034
57842G25568r60j817J27K523K927K500L002L313K012N98Q52J503P30l33J00Q44
57826G43489k51k450l671m232n846q174r440r373q825p642n536l792l524l470
57812F67263k054k72K7o08m15N04J020J567L125M643M420L170L026M116M814M676
$$ plain form
57796 699022 703588 707989 711287 712986 714073 715800 718249 720583 721739 720625 716923 712064 708105 705353
57782 705353 702335 698133 693233 687989 682112 675938 670386 665272 659482 653237 648276 645242 642810 639967
57768 639967 637167 634497 630727 625172 618653 611663 603502 594378 586419 580990 576431 570155 561986 553956
57754 553956 547520 542271 536979 530961 524636 519142 515067 511628 507759 503613 499877 496098 491419 486810
57740 486810 484459 484617 485008 483934 482070 480665 480014 480670 484170 491184 500235 509272 517309 523800 527942
57725 527942 529727 530501 531526 532851 534112 535145 535423 534403 533005 533023 534255 533919 530120 524450 519884
57710 519884 517231 514893 511336 506791 502994 501686 502660 503335 501448 498206 497201 499987 504386 507574 509035
57695 509035 509957 511505 514461 518897 523501 526689 528896 532117 536887 541760 546120 551086 556915 562115
$$ packed form
57796F99022M566M401L298J699J087J727K449K334J156j114l702m859l959k752
57782G05353l018m202m900n244n877o174n552n114n790o245m961l034k432k843
57768F39967k800k670l770n555o519o990q161r124p959n429m559o276q169q030
57754E53956o436n249n292o018o325n494m075l439l869m146l736l779m679m609
57740D86810k351J58L91j074j864j405o51O56L500P014R051R037Q037O491M142
57725E27942J785P74J025J325J261J033K78j020j398J8J232l36l799n670m566
57710E19884k653k338l557m545l797j308R74O75j887l242j005K786M399L188J461
57695E09035R22J548K956M436M604L188K207L221M770M873M360M966N829N200
$$ plain form
57681 562115 566360 571664 579099 586665 592300 596942 602689 609858 617951 627715 639831 652847 664652
57668 664652 675188 685875 697363 709615 723243 738846 755713 772746 790052 808347 827699
57657 827699 848101 870276 894575 920097 946139 973338 1002106 1031373 1060459 1090772 1123787
57646 1123787 1158602 1193557 1229315 1268299 1311736 1359253 1410803 1467019 1527960 1593172 1662879
57635 1662879 1737758 1817955 1903492 1995125 2093670 2199204 2312195 2434582 2568387 2714043
57625 2714043 2871300 3040549 3221434 3410953 3604943 3801008 3998113 4193458 4381345
57616 4381345 4555048 4708732 4838178 4941483 5019218 5073008 5104295 5115493 5111449 5097914 5078187
57605 5078187 5051753 5015512 4965484 4898456 4813900 4714530 4604408 4486935 4365102 4242281
$$ packed form
57681E62115M245N304P435P566N635M642N747P169Q093R764J2116J3016J1805
57668F64652J0536J0687J1488J2252J3628J5603J6867J7033J7306J8295J9352
57657H27699K0402K2175K4299K5522K6042K7199K8768K9267K9086L0313L3015
57646A123787L4815L4955L5758L8984M3437M7517N1550N6216O0941O5212O9707
57635A662879P4879Q0197Q5537R1633R8545J05534J12991J22387J33805J45656
57625B714043J57257J69249J80885J89519J93990J96065J97105J95345J87887
57616D381345J73703J53684J29446J03305P7735N3790L1287J1198m044j3535j9727
57605E078187k6434l6241n0028o7028q4556r9370j10122j17473j21833j22821
$$ plain form
57595 4242281 4121326 4003747 3890943 3785315 3688916 3602097 3524818 3457996 3401798 3353776
57585 3353776 3310834 3272282 3238990 3210443 3185107 3163381 3147755 3139849 3139268 3145435 3158596 3178696
57573 3178696 3205190 3238514 3280264 3331418 3391706 3461065 3540368 3630158 3729797 3838530 3956357
57562 3956357 4083029 4216542 4353132 4488654 4619896 4744575 4859837 4960804 5041272 5096279
57552 5096279 5123587 5122739 5093865 5038110 4958445 4859355 4746283 4625163 4500852 4375147 4247634
57541 4247634 4119176 3993061 3871981 3755775 3643533 3536106 3434737 3338666 3246133 3156714
57531 3156714 3070909 2988466 2908880 2832646 2760327 2691332 2625199 2562843 2504797 2449485 2395261
57520 2395261 2342884 2293674 2246542 2199563 2153677 2111843 2074772 2040282 2006893 1975441 1946714
$$ packed form
57595D242281j20955j17579j12804j05628r6399q6819p7279o6822n6198m8022
57585C353776m2942l8552l3292k8547k5336k1726j5626p906n81O167J3161K0100
57573C178696K6494L3324M1750N1154O0288O9359P9303Q9790R9639J08733J17827
57562C956357J26672J33513J36590J35522J31242J24679J15262J00967Q0468N5007
57552E096279K7308q48k8874n5755p9665r9090j13072j21120j24311j25705j27513
57541D247634j28458j26115j21080j16206j12242j07427j01369r6071r2533q9419
57531C156714q5805q2443p9586p6234p2319o8995o6133o2356n8046n5312n4224
57520B395261n2377m9210m7132m6979m5886m1834l7071l4490l3389l1452k8727
$$ plain form
57509 1946714 1919812 1893556 1867884 1843394 1820813 1800988 1784130 1769166 1754965 1741792 1730342
57498 1730342 1720157 1710532 1702251 1696565 1693186 1691101 1690579 1692405 1696017 1700669 1707644 1718750 1733189
57485 1733189 1748573 1764703 1783771 1807122 1834631 1867101 1906183 1951485 2000526 2052270 2108354
57474 2108354 2170343 2238235 2312297 2393929 2483805 2581090 2685026 2795111 2909102 3022953
57464 3022953 3133522 3239399 3338473 3426695 3500039 3555942 3592346 3607431 3601138 3575362 3532142
57453 3532142 3473392 3402544 3324237 3241708 3156372 3070143 2985803 2904511 2825523 2749271 2678270
57442 2678270 2613820 2554215 2497657 2444856 2397234 2354395 2314960 2278381 2244551 2213065 2184168
57431 2184168 2159059 2138058 2119784 2103191 2088978 2077973 2069755 2064191 2062863 2067425 2077677 2092596
$$ packed form
57509A946714k6902k6256k5672k4490k2581j9825j6858j4964j4201j3173j1450
57498A730342j0185r625q281n686l379k085n22J826L612M652O975J1106J4439
57485A733189J5384J6130J9068K3351K7509L2470L9082M5302M9041N1744N6084
57474B108354O1989O7892P4062Q1632Q9876R7285J03936J10085J13991J13851
57464C022953J10569J05877R9074Q8222P3344N5903L6404J5085o293k5776m3220
57453C532142n8750p0848p8307q2529q5336q6229q4340q1292p8988p6252p1001
57442B678270o4450n9605n6558n2801m7622m2839l9435l6579l3830l1486k8897
57431B184168k5109k1001j8274j6593j4213j1005q218n564j328M562J0252J4919
$$ plain form
57419 2092596 2112260 2137394 2167822 2202647 2241495 2284816 2333524 2388861 2451866 2522467 2599775
57408 2599775 2683320 2772823 2866692 2962208 3057508 3151769 3242892 3326430 3397408 3451951 3487057
57397 3487057 3500800 3493600 3467768 3424996 3365777 3291666 3206196 3112751 3013339 2910318 2807338
57386 2807338 2707233 2610532 2517144 2427950 2343511 2262846 2185015 2110769 2041321 1976535 1915461
57375 1915461 1857563 1802391 1749033 1696940 1646323 1597026 1548158 1499709 1453280 1410291 1370512
57364 1370512 1333055 1297647 1264179 1232282 1202064 1174067 1147867 1122198 1097090 1074177 1054006
57353 1054006 1034721 1014465 993509 972832 952240 931330 910982 892362 875330 858874 842203
57342 842203 824749 806459 788910 774608 764035 754757 744417 733208 722460 712616 703962 697532
$$ packed form
57419B092596J9664K5134L0428L4825L8848M3321M8708N5337O3005P0601P7308
57408B599775Q3545Q9503R3869R5516R5300R4261R1123Q3538P0978N4543L5106
57397C487057J3743p200k5832m2772n9219p4111q5470r3445r9412j03021j02980
57386B807338j00105r6701r3388q9194q4439q0665p7831p4246o9448o4786o1074
57375A915461n7898n5172n3358n2093n0617m9297m8868m8449m6429m2989l9779
57364A370512l7457l5408l3468l1897l0218k7997k6200k5669k5108k2913k0171
57353A054006j9285k0256k0956k0677k0592k0910k0348j8620j7032j6456j6671
57342H42203j7454j8290j7549j4302j0573r278j0340j1209j0748r844q654o430
$$ plain form
57330 697532 693433 689578 683939 677088 670955 666045 661622 657770 655433 654718 654722 654951 655829 657822 660779 664070
57314 664070 667099 669985 673667 678612 683690 687586 691137 696515 703924 711083 716431 720800 725130 728574
57300 728574 730071 730049 729473 728795 728872 731183 735921 741376 746277 751230 756958 762966 769045 776117 784273 791891
57284 791891 798218 804922 813447 822556 830393 837338 844889 853122 861264 869676 879337 890271 902179 915784
57270 915784 931836 949434 966561 981702 994151 1003928 1012490 1022364 1034845 1048949 1063244 1077357
57258 1077357 1091042 1103646 1115676 1129071 1144516 1160085 1173883 1186575 1200078 1215297 1232234
57247 1232234 1250509 1268539 1284116 1297258 1310824 1327110 1345758 1366159 1389410 1416221 1445286
57236 1445286 1475781 1509308 1547169 1587748 1628813 1670539 1713927 1758135 1801889 1846001 1892014
$$ packed form
57330F97532m099l855n639o851o133m910m423l852k337p15MK29Q78J993K957L291
57314F64070L029K886L682M945N078L896L551N378P409P159N348M369M330L444
57300G28574J497k2n76o78P7K311M738N455M901M953N728O008O079P072Q156P618
57284G91891O327O704Q525R109P837O945P551Q233Q142Q412R661J0934J1908J3605
57270I15784J6052J7598J7127J5141J2449R777Q562R874J2481J4104J4295J4113
57258A077357J3685J2604J2030J3395J5445J5569J3798J2692J3503J5219J6937
57247A232234J8275J8030J5577J3142J3566J6286J8648K0401K3251K6811K9065
57236A445286L0495L3527L7861M0579M1065M1726M3388M4208M3754M4112M6013
$$ plain form
57225 1892014 1939652 1987751 2036339 2085651 2134506 2181773 2228105 2274243 2319001 2360724 2399016
57214 2399016 2433245 2461472 2483262 2501595 2519366 2535568 2547376 2554299 2557688 2557780 2554128 2547854 2540955
57201 2540955 2534405 2528929 2526222 2527224 2530715 2535544 2542351 2551090 2559183 2564708 2569124 2574054 2577903 2578991
57187 2578991 2579861 2584795 2594822 2608710 2626903 2650446 2677463 2704938 2733173 2764730 2799856 2836701
57175 2836701 2875208 2916824 2960757 3004197 3045974 3086735 3126011 3162780 3198781 3237791 3281267
57164 3281267 3327530 3374975 3423016 3469772 3511830 3546888 3574805 3596368 3613159 3628204 3644588
57153 3644588 3663720 3686329 3713875 3746934 3783604 3821764 3861687 3904430 3949272 3994883 4041177
57142 4041177 4087784 4132832 4175719 4218695 4263028 4306150 4345621 4383212 4421816 4461287 4501034
$$ packed form
57225A892014M7638M8099M8588M9312M8855M7267M6332M6138M4758M1723L8292
57214B399016L4229K8227K1790J8333J7771J6202J1808O923L389R2l652o274o899
57201B540955o550n476k707J002L491M829O807Q739Q093N525M416M930L849J088
57187B578991Q70M934J0027J3888J8193K3543K7017K7475K8235L1557L5126L6845
57175B836701L8507M1616M3933M3440M1777M0761L9276L6769L6001L9010M3476
57164C281267M6263M7445M8041M6756M2058L5058K7917K1563J6791J5045J6384
57153C644588J9132K2609K7546L3059L6670L8160L9923M2743M4842M5611M6294
57142D041177M6607M5048M2887M2976M4333M3122L9471L7591L8604L9471L9747
$$ plain form
57131 4501034 4543592 4591090 4640701 4688209 4733769 4779442 4823361 4861482 4893357 4921357 4945989
57120 4945989 4966866 4986515 5008147 5031096 5052978 5074364 5096546 5117152 5133447 5147702 5163421
57109 5163421 5178442 5188126 5193649 5200478 5209871 5218402 5225037 5232423 5242008 5254029 5271380 5297211 5329480
57096 5329480 5363816 5400536 5442618 5488250 5532112 5572786 5612121 5648994 5681406 5713864 5754813
57085 5754813 5806899 5866510 5931487 6001327 6070612 6130496 6176521 6207560 6218206 6200753 6154233
57074 6154233 6083202 5988339 5866745 5720389 5554770 5369431 5158721 4921172 4658901 4369008
57064 4369008 4045765 3690308 3307527 2894075 2439983 1940608 1395099 794460 124341
57054 -620274 -1435718 -2324040 -3293586 -4346312 -5478951 -6696404 -8009729 -9422768 -10936873
$$ packed form
57131D501034M2558M7498M9611M7508M5560M5673M3919L8121L1875K8000K4632
57120D945989K0877J9649K1632K2949K1882K1386K2182K0606J6295J4255J5719
57109E163421J5021R684N523O829R393Q531O635P386R585J2021J7351K5831L2269
57096E329480L4336L6720M2082M5632M3862M0674L9335L6873L2412L2458M0949
57085E754813N2086N9611O4977O9840O9285N9884M6025L1039J0646j7453m6520
57074F154233p1031r4863j21594j46356j65619j85339k10710k37549k62271k89893
57064D369008l23243l55457l82781m13452m54092m99375n45509o00639A24341
57054f20274q15444q88322r69546j052726j132639j217453j313325j413039j514105
$$ plain form
57045 -10936873 -12567036 -14335538 -16251222 -18313713 -20535438 -22938370 -25531861 -28317000
57037 -28317000 -31308603 -34525970 -37967726 -41628498 -45531222 -49692914 -54048209 -58442993
57029 -58442993 -62700312 -66650431 -70134959 -73111280 -75795399 -78572860 -81654433 -84885084
57021 -84885084 -87987461 -90892891 -93639271 -95954230 -97164771 -96659786 -94372143 -90742622
57013 -90742622 -86320434 -81521511 -76708653 -72329990 -68898688 -66853952 -66404049 -67396773
57005 -67396773 -69295464 -71344905 -72855234 -73400170 -72825349 -71153385 -68506050 -65065720
56997 -65065720 -61048914 -56686311 -52205590 -47802666 -43614957 -39729333 -36212980 -33117884
56989 -33117884 -30452651 -28169261 -26185542 -24408734 -22737475 -21065927 -19306593 -17407512
$$ packed form
57045a0936873j630163j768502j915684k062491k221725k402932k593491k785139
57037b8317000k991603l217367l441756l660772l902724m161692m355295m394784
57029e8442993m257319l950119l484528k976321k684119k777461l081573l230651
57021h4885084l102377k905430k746380k314959j210541N04985K287643L629521
57013i0742622M422188M798923M812858M378663L431302K044736M49903r92724
57005f7396773j898691k049441j510329n44936N74821J671964K647335L440330
56997f5065720M016806M362603M480721M402924M187709L885624L516353L095096
56989c3117884K665233K283390J983719J776808J671259J671548J759334J899081
$$ plain form
56981 -17407512 -15343683 -13100309 -10668615 -8047298 -5239507 -2254273 881246 4111004
56973 4111004 7352167 10507818 13487786 16236670 18753079 21079142 23267522 25357308
56965 25357308 27372725 29329348 31235652 33096303 34919843 36720156 38509057 40291769
56957 40291769 42069252 43837682 45583173 47282908 48915117 50466125 51929502 53305099
56949 53305099 54600046 55824502 56984189 58081107 59121546 60117012 61075376 61996049
56941 61996049 62875553 63713271 64510931 65272007 66003682 66714678 67408809 68083889 68737260
56932 68737260 69367126 69966680 70521695 71016546 71439859 71784259 72046374 72230505 72349020
56923 72349020 72416441 72444752 72444723 72427732 72403992 72381296 72366600 72366086 72382158 72411950 72448683 72481767
$$ packed form
56981a7407512K063829K243374K431694K621317K807791b254273H81246L229758
56973D111004L241163L155651K979968K748884K516409K326063K188380K089786
56965B5357308K015417J956623J906304J860651J823540J800313J788901J782712
56957D0291769J777483J768430J745491J699735J632209J551008J463377J375597
56949E3305099J294947J224456J159687J096918J040439R95466R58364R20673
56941F1996049Q79504Q37718P97660P61076P31675P10996O94131O75080O53371
56932F8737260O29866N99554N55015M94851M23313L44400K62115J84131J18515
56923G2349020O7421K8311k9j6991k3740k2696j4696n14J6072K9792L6733L3084
$$ plain form
56911 72481767 72495602 72471988 72395716 72257418 72053521 71788376 71477019 71141625 70802756 70474119
56901 70474119 70162807 69869153 69585860 69301941 69009434 68704227 68381445 68035070 67663268
56892 67663268 67270095 66860723 66438559 66007992 65575783 65147321 64723790 64303874 63885473
56883 63885473 63465053 63038956 62607344 62174961 61747230 61327321 60916075 60510774 60103558
56874 60103558 59685298 59252745 58809025 58356362 57891577 57409437 56906482 56380284 55829209
56865 55829209 55255851 54668493 54077391 53491479 52918728 52365124 51830122 51305196 50778927
56856 50778927 50242074 49687539 49109695 48507152 47884687 47250667 46614058 45984381 45370566
56847 45370566 44776058 44195746 43619490 43038078 42445728 41840115 41222844 40598986 39974471
$$ packed form
56911G2481767J3835k3614p6272j38298k03897k65145l11357l35394l38869l28637
56901G0474119l11312k93654k83293k83919k92507l05207l22782l46375l71802
56892F7663268l93173m09372m22164m30567m32209m28462m23531m19916m18401
56883F3885473m20420m26097m31612m32383m27731m19909m11246m05301m07216
56874F0103558m18260m32553m43720m52663m64785m82140n02955n26198n51075
56865E5829209n73358n87358n91102n85912n72751n53604n35002n24926n26269
56856E0778927n36853n54535n77844o02543o22465o34020o36609o29677o13815
56847D5370566n94508n80312n76256n81412n92350o05613o17271o23858o24515
$$ plain form
56838 39974471 39354487 38744560 38150596 37575573 37016550 36465368 35911189 35342905 34752578
56829 34752578 34138957 33506674 32860923 32203821 31535656 30857153 30169843 29476838 28784638
56820 28784638 28102039 27435729 26788165 26159588 25548691 24949745 24352497 23748405 23136421
56811 23136421 22521201 21907026 21294846 20683450 20071304 19458074 18845924 18238691 17638844
56802 17638844 17046303 16461250 15887038 15329620 14795499 14290829 13820154 13383466 12974562
56793 12974562 12583137 12198501 11812312 11420685 11025443 10632131 10245657 9868447 9502597
56784 9502597 9151302 8816842 8498603 8194206 7901271 7617563 7341536 7074338 6820049
56775 6820049 6582682 6363598 6161877 5975269 5800045 5631957 5468556 5309145 5151878
$$ packed form
56838C9974471o19984o09927n93964n75023n59023n51182n54179n68284n90327
56829C4752578o13621o32283o45751o57102o68165o78503o87310o93005o92200
56820B8784638o82599o66310o47564o28577o10897n98946n97248o04092o11984
56811B3136421o15220o14175o12180o11396o12146o13230o12150o07233n99847
56802A7638844n92541n85053n74212n57418n34121n04670m70675m36688m08904
56793A2974562l91425l84636l86189l91627l95242l93312l86474l77210l65850
56784I502597l51295l34460l18239l04397k92935k83708k76027k67198k54289
56775F820049k37367k19084k01721j86608j75224j68088j63401j59411j57267
$$ plain form
56766 5151878 4993102 4830588 4665369 4499309 4333334 4169641 4013173 3868470 3736519
56757 3736519 3616514 3508868 3414083 3330050 3253181 3181731 3115969 3055643 2999261 2945578 2893915
56746 2893915 2842842 2789733 2731828 2667354 2596352 2521061 2444766 2369591 2296138 2225429 2159610
56735 2159610 2099956 2045713 1995861 1950400 1908705 1868397 1827585 1787015 1748533 1712736 1679782
56724 1679782 1651155 1628459 1611133 1597091 1584956 1573962 1562336 1547729 1529189 1507345 1482887
56713 1482887 1456131 1427766 1398788 1369844 1341576 1315211 1291737 1270720 1250741 1230766 1210554
56702 1210554 1190346 1170824 1152810 1136384 1120970 1106516 1093480 1081191 1067740 1052459 1037128
56691 1037128 1023639 1011780 1000453 989529 979075 968179 956431 945481 937243 931265 925480 918714
$$ packed form
56766E151878j58776j62514j65219j66060j65975j63693j56468j44703j31951
56757C736519j20005j07646r4785q4033p6869p1450o5762o0326n6382n3683n1663
56746B893915n1073n3109n7905o4474p1002p5291p6295p5175p3453p0709o5819
56735B159610n9654n4243m9852m5461m1695m0308m0812m0570l8482l5797l2954
56724A679782k8627k2696j7326j4042j2135j0994j1626j4607j8540k1844k4458
56713A482887k6756k8365k8978k8944k8268k6365k3474k1017j9979j9975k0212
56702A210554k0208j9522j8014j6426j5414j4454j3036j2289j3451j5281j5331
56691A037128j3489j1859j1327j0924j0454j0896j1748j0950q238n978n785o766
$$ plain form
56679 918714 910735 900790 888216 874180 860977 849748 840306 832561 826345 820325 813161 805583 799418
56666 799418 794541 788721 780723 771795 763605 756349 749495 742965 736755 730394 723512 716315 709136 702136
56652 702136 695621 689830 684252 678029 671368 665660 661660 658169 653111 645710 637278 629995 625024 621636
56638 621636 618071 613267 607612 602050 596922 591817 586088 579273 571525 563868 557477 552431 547830 543310
56624 543310 539468 536441 533355 530016 527957 528450 530392 531561 531325 530573 529476 527162 523590 519979 516849
56609 516849 513136 508028 502606 498590 496129 493848 490916 488027 485998 484068 480434 474511 467927 462758
56595 462758 459263 456138 452627 449267 446561 444132 441600 439163 436666 433172 428345 423486 420152 418276
56581 418276 416511 413993 410904 407721 404799 402530 401150 400441 400118 400220 400656 400729 399706 397600 394933 392075
$$ packed form
56679I18714p979r945j2574j4036j3203j1229r442p745o216o020p164p578o165
56666G99418m877n820p998q928q190p256o854o530o210o361o882p197p179p000
56652G02136o515n791n578o223o661n708m000l491n058p401q432p283m971l388
56638F21636l565m804n655n562n128n105n729o815p748p657o391n046m601m520
56624E43310l842l027l086l339k059M93J942J169k36p52j097k314l572l611l130
56609E16849l713n108n422m016k461k281k932k889k029j930l634n923o584n169
56595D62758l495l125l511l360k706k429k532k437k497l494m827m859l334j876
56581D18276j765k518l089l183k922k269j380p09l23J02M36P3j023k106k667k858
$$ plain form
56565 392075 389285 386970 385331 384118 383280 383415 384906 386938 388072 387664 386281 384935 384395 385024 386715
56550 386715 389009 391499 394054 396539 398599 399847 400076 399418 398711 399285 401516 403776 404004 402416 401389
56535 401389 402338 404077 404872 404733 404648 404687 404122 402787 401215 399837 398871 398502 398463 397972 396937 396710 398728 402591
56517 402591 406151 407396 406018 403542 402215 403302 406165 409405 412787 417170 422565 427566 431041 433127
56503 433127 434158 434021 433282 433524 435543 438356 440954 443957 448516 454593 461284 467839 473447 477189 479326
56488 479326 481630 485374 489981 494503 499131 504106 508557 511777 514379 516713 517571 516173 514101 513216 512820
56473 512820 511101 508391 506492 505325 502912 498691 494485 491912 490818 490545 490797 490800 489345 486317 482920
56458 482920 480064 477711 475903 474945 474326 472779 469798 466028 462116 458378 455482 453969 453027 451293 449010
$$ packed form
56565C92075k790k315j639j213q38J35J491K032J134m08j383j346n40O29J691
56550C86715K294K490K555K485K060J248K29o58p07N74K231K260K28j588j027
56535D01389R49J739P95j39q5L9n65j335j572j378r66l69l9m91j035k27K018L863
56517D02591L560J245j378k476j327J087K863L240L382M383N395N001L475K086
56503D33127J031j37p39K42K019K813K598L003M559O077O691O555N608L742K137
56488D79326K304L744M607M522M628M975M451L220K602K334Q58j398k072q85l96
56473E12820j719k710j899j167k413m221m206k573j094k73K52Lj455l028l397
56458D82920k856k353j808r58o19j547k981l770l912l738k896j513r42j734k283
$$ plain form
56443 449010 447773 447836 447478 445708 443788 442933 441897 438420 432332 425850 421052 418141 416251 415081 415246
56428 415246 417070 419354 419937 417746 413877 410189 407388 405261 404192 405048 407561 410060 411245 411418 411651
56413 411651 412519 414041 416054 418069 419164 418711 417307 416715 418647 423369 429492 435331 440348 444847 448664
56398 448664 451275 453298 456352 460648 464053 464755 463871 464071 466357 469628 472739 475450 477669 479347 481126
56383 481126 483717 486604 488562 489545 490931 493791 497862 502328 506653 510518 513627 515667 516103 514424 511195
56368 511195 508150 506314 504653 501728 497949 494782 492238 488903 484343 479826 476389 473582 470529 467119
56354 467119 463763 460834 458600 456991 455386 453288 451037 449202 447682 446222 445240 445053 444840 443678 442168
56339 442168 441622 441997 442099 441538 440895 440157 438668 436582 434642 432532 429223 425214 422607 422498 423898 425667
$$ packed form
56443D49010j237O3l58j770j920q55j036l477o088o482m798k911j890j170J65
56428D15246J824K284N83k191l869l688k801k127j069Q56K513K499J185J73K33
56413D11651Q68J522K013K015J095m53j404n92J932M722O123N839N017M499L817
56398D48664K611K023L054M296L405P02q84K00K286L271L111K711K219J678J779
56383D81126K591K887J958R83J386K860M071M466M325L865L109K040M36j679l229
56368E11195l045j836j661k925l779l167k544l335m560m517l437k807l053l410
56354D67119l356k929k234j609j605k098k251j835j520j460r82j87k13j162j510
56339D42168n46L75J02n61o43p38j489k086j940k110l309m009k607j09J400J769
$$ plain form
56323 425667 427836 430386 432414 433533 434784 437073 439689 441324 441851 442325 443810 446764 450955 455556 459807
56308 459807 463819 468052 472031 474567 475493 476215 478126 481142 484045 485623 485481 484572 484901 487690 491746
56293 491746 494633 495549 496036 497748 500759 504319 508059 511886 515568 518899 521739 523782 524971 526086 528045
56278 528045 530717 533354 536025 539555 544204 549653 556060 563674 571459 577749 582585 587860 594747 602509
56264 602509 610271 618408 627430 636868 646121 655346 664782 674233 683888 694634 706765 719233 730811
56251 730811 741316 751147 760384 768771 775950 781425 785144 788251 792424 798219 804902 811896 819254 826661
56237 826661 833333 839262 845364 852037 858725 865197 872012 879456 887411 896665 908765 923885 940248
56224 940248 956477 973136 991093 1009778 1028314 1047356 1068415 1091970 1117410 1144502 1173867
$$ packed form
56323D25667K169K550K028J119J251K289K616J635N27M74J485K954M191M601M251
56308D59807M012M233L979K536R26P22J911L016K903J578j42r09L29K789M056
56293D91746K887R16M87J712L011L560L740L827L682L331K840K043J189J115J959
56278E28045K672K637K671L530M649N449O407P614P785O290M836N275O887P762
56264F02509P762Q137R022R438R253R225R436R451R655J0746J2131J2468J1578
56251G30811J0505R831R237Q387P179N475L719L107M173N795O683O994P358P407
56237H26661O672N929O102O673O688O472O815P444P955R254J2100J5120J6363
56224I40248J6229J6659J7957J8685J8536J9042K1059K3555K5440K7092K9365
$$ plain form
56213 1173867 1206092 1241011 1277960 1316625 1357784 1403009 1453092 1507072 1563621 1623063 1687000
56202 1687000 1756233 1830510 1910457 1998177 2095362 2201816 2316198 2437281 2564364 2697585
56192 2697585 2837907 2985490 3137847 3290927 3442136 3590820 3735695 3873699 4001947
56183 4001947 4119121 4224194 4315469 4391888 4453861 4501808 4535201 4554026 4560019 4555466 4541831
56172 4541831 4520383 4492923 4460857 4424570 4384565 4342245 4298590 4252951 4203951 4150728 4092725
56161 4092725 4029404 3961023 3888768 3813393 3734738 3653219 3570540 3488022 3405349 3321994 3238881
56150 3238881 3157577 3078717 3002241 2928410 2857541 2789387 2723722 2661104 2602249 2547001 2494424
56139 2494424 2443571 2393896 2345538 2299441 2256548 2216667 2178821 2142600 2108112 2074771 2041582
$$ packed form
56213A173867L2225L4919L6949L8665M1159M5225N0083N3980N6549N9442O3937
56202A687000O9233P4277P9947Q7720R7185J06454J14382J21083J27083J33221
56192B697585J40322J47583J52357J53080J51209J48684J44875J38004J28248
56183D001947J17174J05073R1275P6419O1973M7947L3393J8825N993m553j3635
56172D541831k1448k7460l2066l6287m0005m2320m3655m5639m9000n3223n8003
56161D092725o3321o8381p2255p5375p8655q1519q2679q2518q2673q3355q3113
56150C238881q1304p8860p6476p3831p0869o8154o5665o2618n8855n5248n2577
56139B494424n0853m9675m8358m6097m2893l9881l7846l6221l4488l3341l3189
$$ plain form
56128 2041582 2008986 1978956 1952684 1929292 1907264 1886072 1866070 1847946 1832624 1820531 1810667
56117 1810667 1801468 1792516 1784154 1775744 1766330 1757056 1750727 1748415 1748459 1749244 1750727 1752536 1752992 1751307 1748887
56102 1748887 1747232 1746258 1745660 1746034 1747385 1748317 1748049 1747705 1748503 1750252 1752644 1756276 1761279 1766807 1773072 1782020
56086 1782020 1794681 1809740 1826141 1845243 1868877 1897041 1929079 1965410 2006526 2052108 2102904
56075 2102904 2161803 2231247 2311064 2400324 2499423 2608407 2724880 2845540 2968168 3090358
56065 3090358 3208350 3319738 3425929 3529409 3629692 3724172 3811621 3892045 3963807 4023577
56055 4023577 4069032 4099832 4116623 4121024 4115974 4103951 4084889 4057218 4020341 3974678 3920249 3857168
56043 3857168 3787164 3713049 3637071 3560921 3486397 3414625 3345373 3278487 3215040 3155745 3099360
$$ packed form
56128B041582l2596l0030k6272k3392k2028k1192k0002j8124j5322j2093r864
56117A810667r199q952q362q410r414r274o329k312M4P85J483J809M56j685k420
56102A748887j655r74n98L74J351R32k68l44P98J749K392L632N003N528O265Q948
56086A782020J2661J5059J6401J9102K3634K8164L2038L6331M1116M5582N0796
56075B102904N8899O9444P9817Q9260R9099J08984J16473J20660J22628J22190
56065C090358J17992J11388J06191J03480J00283R4480Q7449Q0424P1762N9770
56055D023577M5455L0800J6791M401n050j2023j9062k7671l6877m5663n4429o3081
56043C857168p0004p4115p5978p6150p4524p1772o9252o6886o3447n9295n6385
$$ plain form
56032 3099360 3044314 2990930 2940480 2893060 2848121 2806161 2768087 2733510 2701275 2671098 2643359
56021 2643359 2617966 2594633 2573555 2554810 2538076 2523774 2512984 2505123 2497382 2487950 2478242 2470512
56009 2470512 2465065 2461515 2460791 2463556 2468067 2472051 2475676 2480567 2486886 2493576 2500593 2508849 2518452 2528826
55995 2528826 2539986 2552366 2566114 2581691 2600115 2621422 2644056 2666853 2690254 2714670 2739573
55984 2739573 2765436 2794409 2827361 2862229 2897001 2932380 2969733 3008528 3047859 3088697 3132519
55973 3132519 3179291 3228590 3281065 3337267 3396827 3460104 3528479 3601725 3677679 3755882 3838592
55962 3838592 3926665 4017800 4110923 4208888 4314446 4426863 4545085 4670870 4806109 4950269
55952 4950269 5103249 5267446 5444470 5633435 5835078 6053328 6289633 6539924 6800384
$$ packed form
56032C099360n5046n3384n0450m7420m4939m1960l8074l4577l2235l0177k7739
56021B643359k5393k3333k1078j8745j6734j4302j0790p861p741r432r708p730
56009B470512n447l550p24K765M511L984L625M891O319O690P017Q256R603J0374
55995B528826J1160J2380J3748J5577J8424K1307K2634K2797K3401K4416K4903
55984B739573K5863K8973L2952L4868L4772L5379L7353L8795L9331M0838M3822
55973C132519M6772M9299N2475N6202N9560O3277O8375P3246P5954P8203Q2710
55962C838592Q8073R1135R3123R7965J05558J12417J18222J25785J35239J44160
55952D950269J52980J64197J77024J88965K01643K18250K36305K50291K60460
$$ plain form
55943 6800384 7071816 7354973 7646863 7946125 8257255 8584876 8928663 9288774 9670889
55934 9670889 10079888 10513102 10965850 11439300 11937214 12460170 13009916 13594842 14224035
55925 14224035 14899807 15622251 16395515 17221506 18092111 18996182 19930618 20897665 21897213
55916 21897213 22931304 24011728 25153524 26364627 27650617 29025256 30507752 32115134
55908 32115134 33866567 35788755 37906493 40234231 42788011 45599567 48709920 52162036
55900 52162036 56017132 60371527 65344085 71057191 77642212 85244209 93998477 104019675
55892 104019675 115440508 128447655 143269077 160175473 179508599 201524948 225882184
55885 225882184 251085672 274552409 293501518 306038409 311603137 310644906 304071160
$$ packed form
55943F800384K71432K83157K91890K99262L11130L27621L43787L60111L82115
55934I670889M08999M33214M52748M73450M97914N22956N49746N84926O29193
55925A4224035O75772P22444P73264Q25991Q70605R04071R34436R67047R99548
55916B1897213J034091J080424J141796J211103J285990J374639J482496J607382
55908C2115134J751433J922188K117738K327738K553780K811556L110353L452116
55900E2162036L855096M354395M972558N713106O585021P601997Q754268J0021198
55892A04019675J1420833J3007147J4821422J6906396J9333126K2016349K4357236
55885B25882184K5203488K3466737J8949109J2536891N564728r58231o573746
$$ plain form
55878 304071160 292948671 278434954 261719539 243931230 226083095 209040395 193454795
55871 193454795 179701196 167892185 157956396 149709055 142893876 137222255 132411460 128204635
55863 128204635 124380582 120767024 117242627 113716846 110115055 106393290 102558802 98662717
55855 98662717 94774213 90964257 87297947 83821767 80555844 77505213 74674618 72065706
55847 72065706 69666954 67457876 65421849 63548526 61827401 60244460 58778381 57391172
55839 57391172 56028028 54638548 53200823 51723069 50228004 48742061 47292026 45897897
55831 45897897 44565420 43290124 42067860 40897347 39776071 38700693 37670471 36684907
55823 36684907 35739584 34829250 33953129 33112241 32303674 31522857 30769681 30047092 29355135
$$ packed form
55878C04071160j1122489j4513717j6715415j7788309j7848135j7042700j5585600
55871A93454795j3753599j1809011r935789q247341o815179n671621m810795m206825
55863A28204635l824053l613558l524397l525781l601791l721765l834488l896085
55855I8662717l888504l809956l666310l476180l265923l050631k830595k608912
55847G2065706k398752k209078k036027j873323j721125j582941j466079j387209
55839E7391172j363144j389480j437725j477754j495065j485943j450035j394129
55831D5897897j332477j275296j222264j170513j121276j075378j030222r85564
55823C6684907r45323r10334q76121q40888q08567p80817p53176p22589o91957
$$ plain form
55814 29355135 28691444 28056024 27450180 26871490 26314547 25775743 25252869 24741000 24233602
55805 24233602 23727550 23223293 22720764 22218914 21718589 21222141 20730582 20244244 19765349
55796 19765349 19296651 18838427 18389912 17952605 17528965 17119085 16722050 16339558 15974658
55787 15974658 15627662 15296444 14979786 14677020 14385091 14099423 13817653 13539868 13265750
55778 13265750 12994080 12724274 12455619 12185617 11911767 11634422 11355721 11076813 10798705
55769 10798705 10524760 10259350 10004410 9759435 9523859 9296947 9076494 8860454 8649269
55760 8649269 8444411 8245620 8051849 7863595 7681636 7504700 7331203 7162265 7000171
55751 7000171 6844751 6694067 6547627 6405927 6267788 6131467 5997894 5869644 5746913
$$ packed form
55814B9355135o63691o35420o05844n78690n56943n38804n22874n11869n07398
55805B4233602n06052n04257n02529n01850n00325m96448m91559m86338m78895
55796A9765349m68698m58224m48515m37307m23640m09880l97035l82492l64900
55787A5974658l46996l31218l16658l02766k91929k85668k81770k77785k74118
55778A3265750k71670k69806k68655k70002k73850k77345k78701k78908k78108
55769A0798705k73945k65410k54940k44975k35576k26912k20453k16040k11185
55760H649269k04858j98791j93771j88254j81959j76936j73497j68938j62094
55751G000171j55420j50684j46440j41700j38139j36321j33573j28250j22731
$$ plain form
55742 5746913 5627353 5509640 5394406 5281833 5171124 5062323 4956038 4851313 4746177
55733 4746177 4640297 4534852 4430020 4324981 4220332 4118141 4019570 3924444 3832899 3745305
55723 3745305 3660723 3577529 3495370 3414598 3334314 3253353 3172768 3094942 3020388 2947704 2876348
55712 2876348 2806991 2739254 2671745 2604522 2539069 2475478 2412015 2348071 2285555 2226783 2172497
55701 2172497 2122144 2074345 2026937 1978263 1928746 1879781 1831239 1781635 1730510 1678898 1627655
55690 1627655 1577172 1528467 1482500 1438458 1394782 1351946 1312105 1275825 1241291 1207125 1173962
55679 1173962 1142601 1112449 1082534 1052588 1022509 992097 961953 933464 907327 882972 859714
55668 859714 837547 816606 796605 776892 756585 735132 713362 693115 674798 656319 635806
$$ packed form
55742E746913j19560j17713j15234j12573j10709j08801j06285j04725j05136
55733D746177j05880j05445j04832j05039j04649j02191r8571r5126r1545q7594
55723C745305q4582q3194q2159q0772q0284q0961q0585p7826p4554p2684p1356
55712B876348o9357o7737o7509o7223o5453o3591o3463o3944o2516n8772n4286
55701B172497n0353m7799m7408m8674m9517m8965m8542m9604n1125n1612n1243
55690A627655n0483m8705m5967m4042m3676m2836l9841l6280l4534l4166l3163
55679A173962l1361l0152k9915k9946l0079l0412l0144k8489k6137k4355k3258
55668H59714k2167k0941k0001j9713k0307k1453k1770k0247j8317j8479k0513
$$ plain form
55657 635806 614377 594664 577577 562365 548818 537121 526198 514696 503308 493887 486392 478968
55645 478968 470985 463707 457878 452836 448193 444268 440663 436468 432046 428607 425899 422517 418737 416728
55631 416728 417429 419298 420673 421306 421011 419030 415594 412158 409179 405473 400587 395970 392830 390538 388180
55616 388180 386213 385461 385741 386297 386452 385224 381708 376623 372118 369282 367091 364496 362162 361299 362014 363635
55600 363635 365519 366796 366527 364968 363643 363352 363078 361561 359057 356874 356017 356719 358303 359019 357100 352594
55584 352594 347372 342900 338885 334335 328833 322403 315272 308244 302297 297434 292778 287879 282898 277508
55570 277508 271028 263816 257058 251046 245204 239941 236534 234772 232688 229410 226330 224490 222718 219653
55556 219653 215874 212553 209565 206484 204099 203104 202336 200119 196730 193875 192138 190538 188332 185882 183825
$$ packed form
55657F35806k1429j9713j7087j5212j3547j1697j0923j1502j1388r421p495p424
55645D78968p983p278n829n042m643l925l605m195m422l439k708l382l780k009
55631D16728P01J869J375O33k95j981l436l436k979l706m886m617l140k292k358
55616C88180j967p52K80N56J55j228l516n085m505k836k191k595k334q63P15J621
55600C63635J884J277k69j559j325k91k74j517k504k183q57P02J584P16j919m506
55584C52594n222m472m015m550n502o430p131p028n947m863m656m899m981n390
55570B77508o480p212o758o012n842n263l407j762k084l278l080j840j772l065
55556B19653l779l321k988l081k385r95p68k217l389k855j737j600k206k450k057
$$ plain form
55541 183825 182583 182619 184058 185839 186185 184248 180969 178157 176970 177157 177610 177622 177511 177763 177941 177142 175395
55524 175395 173718 172836 172729 173449 175307 178031 180792 183370 186389 190195 194481 199202 204725 210846 216762
55509 216762 222301 227970 233716 239074 244805 252671 262929 273641 283190 291849 299919 306034 308737 308458
55495 308458 306590 303704 299913 295810 291605 286263 278924 270339 261663 252771 243293 234360 227643 223103
55481 223103 219302 215516 212051 208942 206049 204260 204788 206960 208197 206700 203127 199237 195970 193457
55467 193457 192060 192496 194971 198571 201647 202952 202553 201452 200277 198736 196458 193754 191117 188578 186026
55452 186026 183606 181183 177937 173208 167399 161465 155847 150406 145054 139861 134843 130110 125878 121968
55438 121968 117811 113398 109624 107186 105685 104500 103932 104673 106462 108048 108377 107389 105855 104643 103736
$$ packed form
55541A83825j242L6J439J781L46j937l279k812j187J87M53J2j11K52J78p99j747
55524A75395j677q82j07P20J858K724K761K578L019L806M286M721N523O121N916
55509B16762N539N669N746N358N731P866J0258J0712R549Q659Q070O115K703k79
55495C08458j868k886l791m103m205n342p339q585q676q892r478q933o717m540
55481B23103l801l786l465l109k893j789N28K172J237j497l573l890l267k513
55467A93457j397M36K475L600L076J305l99j101j175j541k278k704k637k539k552
55452A86026k420k423l246m729n809n934n618n441n352n193n018m733m232l910
55438A21968m157m413l774k438j501j185n68P41J789J586L29r88j534j212r07
$$ plain form
55423 103736 101946 98333 93997 91366 91344 92405 93035 93559 94538 95017 94011 92440 91619 90638 87481 82388
55407 82388 77948 75734 74786 73649 72061 70182 67956 65987 65447 66214 66393 64639 61773 59240 57279
55392 57279 55782 55674 57671 60386 61581 61195 61317 62778 63494 61238 56909 53723 53597 55560 57560 58526
55376 58526 58308 56824 54314 51911 50800 50785 50551 49615 49298 51237 55313 59485 61609 61223 59747 59148
55360 59148 60356 62760 65054 66357 66482 65662 64598 64351 65396 66748 66901 65796 65088 66081 68190 69873
55344 69873 70417 70174 69602 68951 68733 69646 71708 73791 74335 72620 69416 66256 64051 62609 61642 61663 63200
55327 63200 65464 66864 66922 66675 66888 66776 65137 62109 59201 57852 58290 59480 59919 58896 57105 55724
55311 55724 54986 54232 53168 52151 51250 50082 48770 47917 47339 45992 43731 42039 42355 44606 47823 51058
$$ packed form
55423A03736j790l613m336k631k2J061O30N24R79M79j006j571q21r81l157n093
55407H2388m440k214r48j137j588j879k226j969n40P67J79j754k866k533j961
55392E7279j497j08J997K715J195l86J22J461P16k256m329l186j26J963K000R66
55376E8526k18j484k510k403j111j5k34r36l17J939M076M172K124l86j476n99
55360E9148J208K404K294J303J25q20j064k47J045J352J53j105p08R93K109J683
55344F9873N44k43n72o51k18R13K062K083N44j715l204l160k205j442r67K1J537
55327F3200K264J400N8k47K13j12j639l028k908j349M38J190M39j023j791j381
55311E5724p38p54j064j017r01j168j312q53n78j347k261j692L16K251L217L235
$$ plain form
55295 51058 53069 52488 49427 45870 43434 41749 40030 38968 39520 40904 41593 41713 42665 44650 46362 47094
55279 47094 47598 48635 49994 51229 52313 53356 54517 56185 58344 59959 59962 58709 57367 56077 54027
55264 54027 51301 49166 48254 47807 47186 46892 47470 48370 48572 47645 45738 43231 40800 39102 38032 37056 36536
55247 36536 37764 41095 44888 47082 47349 47011 47329 48508 50050 51314 51803 51390 50408 49408 48845 48923 49432
55230 49432 49781 49634 49537 50372 52091 53654 54359 54641 55150 55665 55434 54187 52227 49772 46769 43310 39881
55213 39881 37117 35507 35229 36176 38161 41072 44627 47981 50024 50277 49280 47963 46889 46222 46039 46285
55197 46285 46624 46674 46385 45961 45473 44758 43692 42426 41375 41024 41607 42759 43498 42837 40717 38325 37251
55180 37251 38183 40462 43017 45437 47841 49980 51108 50959 50264 49987 50391 51216 52361 53808 54972 54763
$$ packed form
55295E1058K011n81l061l557k436j685j719j062N52J384O89J20R52J985J712P32
55279D7094N04J037J359J235J084J043J161J668K159J615Lj253j342j290k050
55264E4027k726k135r12m47o21k94N78R00K02r27j907k507k431j698j070r76n20
55247C6536J228L331L793K194K67l38L18J179J542J264M89m13r82j000n63P8N09
55230D9432L49j47r7Q35J719J563P05K82N09N15k31j247j960k455l003l459l429
55213C9881k764j610k78R47J985K911L555L354K043K53r97j317j074o67j83K46
55197D6285L39N0k89m24m88p15j066j266j051l51N83J152P39o61k120k392j074
55180C7251R32K279K555K420K404K139J128j49o95k77M04Q25J145J447J164k09
$$ plain form
55164 54763 52555 48960 45516 43643 43762 45222 46979 48267 48660 47863 45945 43744 42484 42782 44367
55149 44367 46773 49719 52705 54983 56391 57623 59085 60023 59423 57464 55494 54786 55772 58112 60840
55134 60840 62654 62787 61637 60160 58851 57725 56896 56468 56028 55039 53797 53294 53900 54705 54461 52919 51059
55117 51059 50168 50803 52521 54497 56284 57750 58456 57703 55491 52987 51588 51757 52928 54141 54500 53634
55101 53634 52255 51824 53080 55184 56724 57176 56909 56284 55473 54789 54398 53891 52759 51184 49777 48765
55085 48765 48006 47586 47764 48504 49570 50862 52212 53193 53678 54188 55081 55845 55921 55742 56086 56825 57350 57903
55067 57903 59358 61820 64528 67030 69401 71288 72021 71810 71726 72119 72104 70980 69214 67547 66128 65127
55051 65127 65299 67046 69363 70530 69752 67787 66110 65756 66778 68542 70588 73021 75836 78160 78898
$$ packed form
55164E4763k208l595l444j873J19J460J757J288L93p97j918k201j260K98J585
55149D4367K406K946K986K278J408J232J462R38o00j959j970p08R86K340K728
55134F0840J814J33j150j477j309j126q29m28m40r89j242n03O06Q05k44j542j860
55117E1059q91O35J718J976J787J466P06p53k212k504j399J69J171J213L59q66
55101E3634j379m31J256K104J540M52k67o25q11o84l91n07j132j575j407j012
55085D8765p59m20J78P40J066J292J350R81M85N10Q93P64P6j79L44P39N25N53
55067E7903J455K462K708K502K371J887P33k11q4L93j5j124j766j667j419j001
55051F5127J72J747K317J167p78j965j677l54J022J764K046K433K815K324P38
$$ plain form
55036 78898 78155 77362 77683 78834 79684 79593 78930 78641 79553 81710 84199 85838 86240 86034 86080 86722 87708 88510
55018 88510 88682 88205 87592 87507 88321 89969 91920 93314 93759 94143 95831 98554 100130 99162 97125 96586 97958
55001 97958 99446 99783 99440 99125 98681 97913 97258 97106 97354 98021 99448 101570 103805 105899 108038 110026 111272
54984 111272 111814 112239 112334 111001 108152 105506 104669 105208 105567 105278 105208 105843 106304 105332 102868 100366 99473 100472
54966 100472 102283 104067 106143 108895 111491 112747 112833 112924 113313 113163 112202 111368 111406 111997 112728 113861 115515
54949 115515 116897 116955 115304 112339 109037 106701 106018 106280 106380 106517 107748 109888 111332 111278 110614 110050 108967
54932 108967 107002 105328 105142 105911 106349 106399 107143 109245 112284 115121 116445 115709 114087 113568 114583 115656
54916 115656 115976 116845 119503 122949 125420 126894 128530 130589 132753 135769 140594 145980 148953 148229 145855
$$ packed form
55036G8898p43p93L21J151Q50r1o63k89R12K157K489J639M02k06M6O42R86Q02
55018H8510J72m77o13q5Q14J648J951J394M45L84J688K723J576r68k037n39J372
55001I7958J488L37l43l15m44p68o55j52K48O67J427K122K235K094K139J988J246
54984A11272N42M25R5j333k849k646q37N39L59k89p0O35M61r72k464k502q93R99
54966A00472J811J784K076K752K596J256Q6R1L89j50r61q34L8N91P31J133J654
54949A15515J382N8j651k965l302k336o83K62J00J37J231K140J444n4o64n64j083
54932A08967j965j674j86P69M38N0P44K102L039K837J324p36j622n19J015J073
54916A15656L20Q69K658L446K471J474J636K059K164L016M825N386K973p24k374
$$ plain form
54901 145855 144957 146882 150882 155481 159578 162923 166211 170616 177028 185621 195759 206054 215141 222987
54887 222987 230986 240126 249581 257850 264717 271121 277421 282810 286320 287549 286503 283499 279124 273728
54873 273728 267276 260265 254061 249291 244525 237963 230111 223303 218587 214695 210410 206370 203751 202381
54859 202381 201245 200055 199240 198815 198203 197086 195784 194802 194500 195326 197973 202965 210029 218037 225843 233315
54843 233315 241363 250629 260335 268776 274988 279660 284324 289650 294485 296506 294031 287317 278091 267974
54829 267974 257761 247975 239258 231955 225987 221484 218776 217301 215343 211565 206174 199977 193160 186024
54815 186024 180050 176741 175511 174062 170965 166854 163070 160264 158497 157615 157022 155932 154289 152764 151535
54800 151535 149945 147824 146251 146079 146328 145175 142432 139924 139123 139354 139012 137910 137308 137756 138138 137347
$$ packed form
54901A45855q98J925M000M599M097L345L288M405O412Q593J0138J0295R087P846
54887B22987P999R140R455Q269O867O404O300N389L510J229j046l004m375n396
54873B73728o452p011o204m770m766o562p852o808m716l892m285m040k619j370
54859B02381j136j190q15m25o12j117j302r82l02Q26K647M992P064Q008P806P472
54843B33315Q048R266R706Q441O212M672M664N326M835K021k475o714r226j0117
54829B67974j0213r786q717p303n968m503k708j475j958l778n391o197o817p136
54815A86024n974l309j230j449l097m111l784k806j767q82n93j090j643j525j229
54800A51535j590k121j573j72K49j153k743k508q01K31l42j102o02M48L82p91
$$ plain form
54784 137347 135888 134973 134722 134359 133666 132948 131775 129315 126106 124043 124128 125466 126964 128503 129749 129477
54768 129477 127431 125509 125496 126600 126885 126310 126516 128107 130093 131856 133649 134955 134261 131257 127844 126086
54752 126086 126181 127167 128750 131487 135572 140055 143318 144346 143898 144339 147692 153849 161103 168227 175262
54737 175262 182528 189910 197347 205102 213204 221283 229251 237665 247177 257952 269471 280287 288225
54724 288225 291789 291642 290110 289018 288443 287462 285349 282015 278004 274232 271193 268383 264980 260867 256453
54709 256453 251951 247765 245107 244855 245892 246020 244796 244086 245394 248046 250694 253406 257268 262755 269437
54694 269437 276871 285013 294099 304531 316389 328697 339860 349339 358307 367997 377852 385922 390731
54681 390731 392324 391760 389977 386860 381263 372399 361331 350423 341002 332234 322724 312473 302565 293532
$$ packed form
54784A37347j459r15k51l63o93p18j173k460l209k063Q5J338J498J539J246k72
54768A29477k046j922j3J104K85n75K06J591J986J763J793J306o94l004l413j758
54752A26086R5R86J583K737M085M483L263J028m48M41L353O157P254P124P035
54737A75262P266P382P437P755Q102Q079P968Q414R512J0775J1519J0816P938
54724B88225L564j47j532j092n75r81k113l334m011l772l039k810l403m113m414
54709B56453m502m186k658k52J037J28j224p10J308K652K648K712L862N487O682
54694B69437P434Q142R086J0432J1858J2308J1163R479Q968R690R855Q070M809
54681C90731J593n64j783l117n597q864j1068j0908r421q768r510j0251r908r033
$$ plain form
54667 293532 284892 276166 267732 260608 255560 252260 249195 244825 239008 232927 227655 223402 220198 218222
54653 218222 216930 214806 210987 206634 203702 202628 202109 201070 199902 199440 199505 199038 197541 195873 195351 196154
54637 196154 197018 196764 195822 195671 196838 198129 198097 196706 195190 194724 195567 197179 198688 199430 199355 198844 198056
54620 198056 196805 195274 194387 194988 196833 198905 200696 202774 205831 209459 212243 213153 212598 211958 212425 214677
54604 214677 219229 225985 233321 238722 241178 242261 244128 247085 249930 252031 253967 256530 260178 265149
54590 265149 270977 276124 279360 281448 284405 289202 295299 302205 310032 318497 326827 334856 342746 349509
54576 349509 353482 354791 355721 357918 360754 363159 365275 367122 367257 364408 359412 353947 348165 341121 332893
54561 332893 324661 317085 310076 304102 300203 298536 297903 296992 295345 293121 290662 288366 286343 284163 281425
$$ packed form
54667B93532q640q726q434p124n048l300l065m370n817o081n272m253l204j976
54653B18222j292k124l819m353k932j074n19j039j168m62O5m67j497j668n22Q03
54637A96154Q64k54r42j51J167J291l2j391j516m66Q43J612J509P42p5n11p88
54620A98056j251j531q87O01J845K072J791K078L057L628K784R10n55o40M67K252
54604B14677M552O756P336N401K456J083J867K957K845K101J936K563L648M971
54590B65149N828N147L236K088K957M797O097O906P827Q465Q330Q029P890O763
54576C49509L973J309R30K197K836K405K116J847J35k849m996n465n782p044q228
54561C32893q232p576p009n974l899j667o33r11j647k224k459k296k023k180k738
$$ plain form
54546 281425 278468 276021 274276 272857 271506 270280 269092 267564 265316 262269 258783 255560 253113 251227
54532 251227 249408 247779 246739 245694 243290 239314 235216 232086 229310 226169 223510 222452 222263 221135
54518 221135 218614 215811 213395 210886 207896 204716 201480 197937 194311 191392 189415 187752 186050 184866
54504 184866 184742 185215 185251 184423 183397 183267 184344 185577 185488 183927 182369 182173 183079 183838 183592 181906 178315
54487 178315 173001 167477 163375 160767 158699 157074 156688 157538 158580 159510 161472 165379 170472 175178 178790
54472 178790 181783 185015 188935 193146 196461 197950 198206 199065 201780 205892 210027 213225 215143 215586 214548
54457 214548 212624 210829 209748 208918 207225 204096 200267 197160 195436 194523 193563 192138 189907 186364 181705
54442 181705 177302 174476 173130 172313 171629 171200 170680 169456 167726 166355 165654 165261 165272 166467 169117 172215
$$ packed form
54546B81425k957k447j745j419j351j226j188j528k248l047l486l223k447j886
54532B51227j819j629j040j045k404l976m098l130k776l141k659j058j89j128
54518B21135k521k803k416k509k990l180l236l543l626k919j977j663j702j184
54504A84866j24M73L6q28j026j30J077J233q9j561j558j96R06P59k46j686l591
54487A78315n314n524m102k608k068j625l86Q50J042R30J962L907N093M706L612
54472A78790K993L232L920M211L315J489K56Q59K715M112M135L198J918M43j038
54457B14548j924j795j081q30j693l129l829l107j724r13r60j425k231l543m659
54442A81705m403k826j346q17o84m29n20j224j730j371p01l93J1J195K650L098
$$ plain form
54426 172215 174131 173685 170881 167332 165612 167107 170556 173629 175720 177976 180709 182411 181892 180114 179189
54411 179189 180501 184318 190083 196216 200569 202183 202230 202584 203899 205581 206888 207387 206956 206149 206059 207030
54395 207030 207981 207836 207164 207316 208190 208050 205779 202418 199957 199170 199103 198313 196199 193244 190439 188494 187343
54378 187343 186272 184605 182299 179845 177556 175254 172886 171182 171115 172593 174184 174484 173465 172230 171880
54363 171880 172910 175199 178033 180538 182678 185479 189623 194117 197131 197982 197581 197144 197145 197459 197640 197043
54347 197043 195393 193325 191869 191511 192361 194782 198905 203745 207981 211598 215654 220421 225051 229266 233971
54332 233971 239695 245676 251052 255775 259680 261905 262124 261370 260687 259939 258892 258332 258798 259056 257470 254414
54316 254414 251719 249777 246829 241537 234962 229305 225502 222836 220395 218139 216576 216018 216443 217825 220050
$$ packed form
54426A72215J916m46k804l549j720J495L449L073K091K256K733J702n19j778r25
54411A79189J312L817N765O133M353J614M7L54J315J682J307M99m31q07r0R71
54395B07030R51j45o72J52Q74j40k271l361k461p87o7p90k114k955k805j945j151
54378A87343j071j667k306k454k289k302k368j704o7J478J591L00j019j235l50
54363A71880J030K289K834K505K140K801M144M494L014Q51m01m37JL14J81n97
54347A97043j650k068j456l58Q50K421M123M840M236L617M056M767M630M215M705
54332B33971N724N981N376M723L905K225K19p54o83p48j047n60M66K58j586l056
54316B54414k695j942k948n292o575n657l803k666k441k256j563n58M25J382K225
$$ plain form
54301 220050 222277 222970 221346 218631 216969 216954 217136 216286 215012 214505 214720 214872 214919 215322 215818 215802 215740 216827
54283 216827 219187 221673 223784 226553 230868 235756 239207 240283 239804 239217 239354 240195 241400 242836 244561
54268 244561 246322 247336 246978 245602 244238 243363 242345 240195 236489 231445 225550 219368 213373 207649 202078
54253 202078 197070 193677 192389 192019 190504 187019 182823 179649 177688 175729 173069 170434 168698 167452
54239 167452 165576 162971 160770 159754 159299 158287 156481 154483 152732 151205 149904 148996 148324 147317 145674
54224 145674 143895 142810 142628 142588 141640 139474 136921 135382 135862 138528 142908 148124 152888 155767 156049 154465
54208 154465 152781 152435 153489 154864 155410 154705 153026 150983 149275 148392 148084 147330 145495 143512 143167 144932
54192 144932 147164 148026 147504 146842 146572 146183 145449 144876 144619 143931 142079 139176 135881 132952 131281 131585 133608
$$ packed form
54301B20050K227O93j624k715j662j5J82q50j274n07K15J52M7M03M96j6o2J087
54283B16827K360K486K111K769M315M888L451J076m79n87J37Q41J205J436J725
54268B44561J761J014l58j376j364q75j018k150l706n044n895o182n995n724n571
54253B02078n008l393j288l70j515l485m196l174j961j959k660k635j736j246
54239A67452j876k605k201j016m55j012j806j998j751j527j301r08o72j007j643
54224A45674j779j085j82m0r48k166k553j539M80K666M380N216M764K879K82j584
54208A54465j684l46J054J375N46p05j679k043j708q83l08p54j835j983l45J765
54192A44932K232Q62n22o62k70l89p34n73k57o88j852k903l295k929j671L04K023
$$ plain form
54175 133608 136087 137810 138338 137798 136644 135670 135377 135152 134065 132680 132796 134818 136665 136331 134519 133419
54159 133419 133671 134066 133894 133915 134750 135629 135340 133707 131660 130294 130088 130680 131232 131309 131380 132134 133454 134492
54141 134492 134691 134211 133409 132423 131368 130474 129967 130014 130694 131699 132299 132061 131336 130538 129262 126876 123799
54124 123799 121216 119458 117657 115375 113668 113898 115946 118282 119441 118875 116692 113339 109741 107097 106053
54109 106053 106200 106706 107403 108865 111194 113216 113540 112373 111557 112452 114425 115905 116328 116199 115654 114030
54093 114030 111070 107729 105409 104861 106135 109013 113036 117247 120326 121151 119497 116598 114875 116302 120629
54078 120629 125574 129097 131034 132156 132259 130196 125738 120510 116604 114756 114254 114127 113817 113103 112247 112217
54062 112217 113942 116972 119613 120703 120614 120092 119038 117259 115551 114732 114174 112826 111404 111711 113592 114562
$$ packed form
54175A33608K479J723N28n40j154r74k93k25j087j385J16K022J847l34j812j100
54159A33419K52L95j72K1Q35Q79k89j633k047j366k06N92N52P7P1P54J320J038
54141A34492J99m80q02r86j055q94n07M7O80J005O00k38p25p98j276k386l077
54124A23799k583j758j801k282j707K30K048K336J159n66k183l353l598k644j044
54109A06053J47N06O97J462K329K022L24j167q16Q95J973J480M23j29n45j624
54093A14030k960l341k320n48J274K878M023M211L079Q25j654k899j723J427M327
54078A20629M945L523J937J122J03k063m458n228l906j848n02j27l10p14q56l0
54062A12217J725L030K641J090q9n22j054j779j708q19n58j348j422L07J881R70
$$ plain form
54046 114562 113269 111481 111348 112298 112391 111565 111461 112571 113580 113519 112786 111905 110885 110124 110322 110917 110044 106896
54028 106896 103084 100827 100617 101454 102515 103646 104783 105873 107184 108971 110911 112305 112770 112503 112111
54013 112111 112288 113181 113808 112675 109448 105713 103652 104277 107042 110615 113543 114827 114612 114144 114497 115564
53997 115564 116690 117815 119218 120378 120141 118265 116172 115759 117759 121470 125675 129428 132258 134161 135584
53982 135584 137160 139214 141568 143985 146673 150040 153912 157523 160657 164350 169740 176320 182148 185979
53968 185979 188497 191166 194600 198638 203347 208997 215297 221550 227618 233938 240378 245861 249698 252866
53954 252866 257191 263302 269888 275148 278604 281214 284046 287277 290432 293068 295003 296178 296645 296498 295596
53939 295596 293544 290275 286444 282765 279087 274700 269667 265212 262485 261330 260666 259702 258387 256961 255695
$$ packed form
54046A14562j293j788j33R50R3q26j04J110J009o1p33q81j020p61J98N95q73l148
54028A06896l812k257k10Q37J061J131J137J090J311J787J940J394M65k67l92
54013A12111J77Q93O27j133l227l735k061O25K765L573K928J284k15m68L53J067
53997A15564J126J125J403J160k37j876k093m13K000L711M205L753K830J903J423
53982A35584J576K054K354K417K688L367L872L611L134L693N390O580N828L831
53968A85979K518K669L434M038M709N650O300O253O068O320O440N483L837L168
53954B52866M325O111O586N260L456K610K832L231L155K636J935J175M67j47r02
53939B95596k052l269l831l679l678m387n033m455k727j155o64r64j315j426j266
$$ plain form
53924 255695 254996 255090 255329 254307 251220 247096 244222 244022 245603 246634 245576 242805 239582 236550 233692
53909 233692 231282 230039 230202 231219 232733 235213 238992 243109 245975 247224 248160 250072 252689 254664 255056
53894 255056 253857 251501 248738 246867 247036 248907 250707 251248 251400 252956 256429 260651 264185 266236 266458
53879 266458 265154 263953 265089 269247 274792 279720 283613 287079 290149 292344 293863 295479 297341 298859
53865 298859 299811 300684 301807 303076 304700 307347 311087 314844 317516 319337 321678 325620 330866 335947 339497
53850 339497 341536 343427 346395 350360 354647 359372 365280 372295 379227 385184 390430 395447 399904 403194
53836 403194 405433 407257 408908 410201 411285 412840 415266 417876 419194 418262 415630 412764 410361 407767
53822 407767 404436 401259 399529 398908 397598 394567 390527 386512 382629 378564 374162 368898 361994 353943
$$ packed form
53924B55695o99R4K39j022l087m124k874k00J581J031j058k771l223l032k858
53909B33692k410j243J63J017J514K480L779M117K866J249R36J912K617J975L92
53894B55056j199k356k763j871J69J871J800N41J52J556L473M222L534K051K22
53879B66458j304j201J136M158N545M928L893L466L070K195J519J616J862J518
53865B98859R52Q73J123J269J624K647L740L757K672J821K341L942N246N081L550
53850C39497K039J891K968L965M287M725N908P015O932N957N246N017M457L290
53836D03194K239J824J651J293J084J555K426K610J318r32k632k866k403k594
53822D07767l331l177j730o21j310l031m040m015l883m065m402n264o904q051
$$ plain form
53808 353943 346823 341874 337636 331936 325207 320097 317777 316252 312910 307496 301763 297122 293699 291161
53794 291161 289229 287190 283883 278855 273258 268974 266742 265550 264032 261950 259902 257992 255600 252411
53780 252411 248868 245361 241645 237482 233278 229602 226476 223618 221142 219583 219353 220321 221600 221736 219798
53765 219798 216644 214388 214093 214702 214830 214642 214926 215092 213675 210649 207675 205801 204284 202246 200406 200264
53749 200264 202272 205549 208937 211772 214010 216195 219017 222440 225609 227954 229941 232255 234806 237310
53735 237310 240479 245543 252456 259426 264628 267908 270554 273888 278424 283855 289267 293582 296349 298205
53721 298205 300280 303192 306828 310857 314953 318578 321174 322825 324257 325863 327136 327424 326914 326344 325882
53706 325882 324885 322882 320380 318501 317984 318590 319307 319125 317778 315824 314059 313034 313033 313940 314836 314329 311892
$$ packed form
53808C53943p120m949m238n700o729n110k320j525l342n414n733m641l423k538
53794B91161j932k039l307n028n597m284k232j192j518k082k048j910k392l189
53780B52411l543l507l716m163m204l676l126k858k476j559k30R68J279J36j938
53765B19798l154k256k95O09J28j88K84J66j417l026k974j874j517k038j840j42
53749B00264K008L277L388K835K238K185K822L423L169K345J987K314K551K504
53735B37310L169N064O913O970N202L280K646L334M536N431N412M315K767J856
53721B98205K075K912L636M029M096L625K596J651J432J606J273K88n10n70m62
53706C25882r97k003k502j879n17O06P17j82j347j954j765j025jR07Q96n07k437
$$ plain form
53689 311892 308568 305746 303699 302085 301346 302302 304336 305359 304034 300980 297328 293316 289162 286276 286211
53674 286211 288656 291441 292472 291113 287982 284262 281145 279193 278038 276874 275204 272915 270150 267516
53660 267516 265933 265777 266521 267739 269853 273144 276542 278413 278398 277568 276932 276788 277417 279224 281793 283783
53644 283783 284400 284542 285974 289589 294611 299239 302039 303120 304039 306247 309740 313644 317737 322484 327669
53629 327669 332110 335235 338055 341935 346958 352086 356392 359476 361132 361565 361915 363813 368040 373904 380036
53614 380036 385547 390289 394296 397414 399630 401554 404213 408101 412480 415819 416989 416096 414269 412699
53600 412699 411713 410659 408753 406103 403580 401721 400221 398728 397537 397031 396919 396684 396407 396395 396293 395447
53584 395447 394095 393360 393969 395660 397865 400162 402034 403068 403633 404522 405655 406035 405394 404952 405873 407671
$$ packed form
53689C11892l324k822k047j614p39R56K034J023j325l054l652m012m154k886o5
53674B86211K445K785J031j359l131l720l117j952j155j164j670k289k765k634
53660B67516j583j56P44J218K114L291L398J871j5q30o36j44O29J807K569J990
53644B83783O17J42J432L615N022M628K800J081R19K208L493L904M093M747N185
53629C27669M441L125K820L880N023N128M306L084J656M33L50J898M227N864O132
53614C80036N511M742M007L118K216J924K659L888M379L339J170q93j827j570
53600D12699r86j054j906k650k523j859j500j493j191n06j12k35k77j2j02q46
53584C95447j352p35O09J691K205K297J872J034N65Q89J133L80o41m42R21J798
$$ plain form
53568 407671 408933 409075 408586 407965 407302 406825 407101 408520 410974 414015 417114 419891 422412 425161 428449 432022
53552 432022 435476 438884 442812 447810 453973 460727 466975 471910 475898 480164 485433 491389 497615 504239
53538 504239 511137 517243 521609 524855 528811 534815 542772 551449 559076 564310 567666 571785 579153 589436
53524 589436 599990 608941 616744 624572 632449 639645 645923 651523 656490 660893 665360 670630 676721 683135
53510 683135 689655 696370 703047 709147 714481 719401 724311 729411 734863 740699 746487 751616 756057 760410
53496 760410 764918 768858 771363 772654 774085 776925 781273 786153 790431 793545 795492 796393 796395 796058 796499 798654
53480 798654 802258 805957 808692 810848 813836 818643 824900 831168 835990 839001 841404 845261 851828 860458
53466 860458 869313 877096 883887 890539 897839 906324 916226 927172 938276 949053 960136 972848 988121
$$ packed form
53568D07671J262J42m89o21o63m77K76J419K454L041L099K777K521K749L288L573
53552D32022L454L408L928M998O163O754O248M935L988M266N269N956O226O624
53538E04239O898O106M366L246L956O004P957Q677P627N234L356M119P368J0283
53524E89436J0554Q951P803P828P877P196O278N600M967M403M467N270O091O414
53510F83135O520O715O677O100N334M920M910N100N452N836N788N129M441M353
53496G60410M508L940K505J291J431K840M348M880M278L114J947R01Kl37M41K155
53480G98654L604L699K735K156K988M807O257O268M822L011K403L857O567Q630
53466H60458Q855P783O791O652P300Q485R902J0946J1104J0777J1083J2712J5273
$$ plain form
53453 988121 1005969 1025730 1046440 1067094 1087043 1106336 1125645 1145808 1167524 1191286 1217267
53442 1217267 1245106 1274014 1303409 1333626 1365820 1400826 1438054 1476035 1514359 1554434 1597580
53431 1597580 1642810 1687632 1730994 1774167 1818363 1862885 1906514 1949610 1993470 2038278 2083055
53420 2083055 2127375 2171829 2216845 2262280 2308298 2355523 2404013 2452938 2501548 2549637 2596850
53409 2596850 2642502 2686446 2729284 2771244 2811576 2849472 2885018 2918849 2951465 2983217 3014247
53398 3014247 3044079 3071918 3097675 3121873 3144203 3163149 3177817 3189269 3199204 3207928 3214512 3218258
53386 3218258 3219038 3216692 3211229 3203371 3193903 3182623 3168809 3152462 3134179 3114050 3091809 3067946
53374 3067946 3043443 3018279 2991426 2962722 2933723 2906082 2879807 2853629 2826449 2798040 2769052
$$ packed form
53453I88121J7848J9761K0710K0654J9949J9293J9309K0163K1716K3762K5981
53442A217267K7839K8908K9395L0217L2194L5006L7228L7981L8324M0075M3146
53431A597580M5230M4822M3362M3173M4196M4522M3629M3096M3860M4808M4777
53420B083055M4320M4454M5016M5435M6018M7225M8490M8925M8610M8089M7213
53409B596850M5652M3944M2838M1960M0332L7896L5546L3831L2616L1752L1030
53398C014247K9832K7839K5757K4198K2330J8946J4668J1452R935Q724O584L746
53386C218258P80k346n463p858r468j1280j3814j6347j8283k0129k2241k3863
53374C067946k4503k5164k6853k8704k8999k7641k6275k6178k7180k8409k8988
$$ plain form
53363 2769052 2740898 2714931 2691025 2667446 2642785 2617727 2594349 2574072 2556932 2542536 2530847
53352 2530847 2521900 2515318 2510392 2506553 2503888 2503339 2506078 2512339 2521290 2532474 2546874 2565619 2587902
53339 2587902 2611249 2634119 2657398 2683089 2712460 2745917 2783612 2825124 2869172 2914796 2962508
53328 2962508 3013341 3067083 3122702 3180359 3241454 3306380 3373750 3442681 3514499 3590903 3671367
53317 3671367 3753745 3836822 3920878 4006139 4092276 4179442 4268243 4358396 4448693 4538601 4628565
53306 4628565 4718232 4805793 4889915 4971044 5049847 5125465 5196557 5263101 5325750 5384069 5436966
53295 5436966 5484559 5528089 5567986 5603455 5634050 5660167 5681503 5696372 5703501 5703689 5698786 5689450
53283 5689450 5674498 5652169 5621550 5583141 5538492 5489141 5435650 5377881 5316328 5252595 5188133
$$ packed form
53363B769052k8154k5967k3906k3579k4661k5058k3378k0277j7140j4396j1689
53352B530847q947o582m926l839k665n49K739O261Q951J1184J4400J8745K2283
53339B587902K3347K2870K3279K5691K9371L3457L7695M1512M4048M5624M7712
53328B962508N0833N3742N5619N7657O1095O4926O7370O8931P1818P6404Q0464
53317C671367Q2378Q3077Q4056Q5261Q6137Q7166Q8801R0153R0297Q9908Q9964
53306D628565Q9667Q7561Q4122Q1129P8803P5618P1092O6544O2649N8319N2897
53295E436966M7593M3530L9897L5469L0595K6117K1336J4869P129J88m903r336
53283E689450j4952k2329l0619l8409m4649m9351n3491n7769o1553o3733o4462
$$ plain form
53272 5188133 5122921 5055897 4986503 4915392 4843753 4772339 4701097 4629420 4556715 4482998 4409017
53261 4409017 4335740 4263755 4193227 4124224 4056980 3991878 3929333 3869688 3813202 3760030 3709925
53250 3709925 3661818 3614204 3566543 3520151 3476968 3437408 3400210 3364649 3332011 3304143 3281096
53239 3281096 3261000 3241964 3223335 3205341 3188458 3173326 3160452 3149589 3139909 3131166 3124229 3120024
53227 3120024 3118370 3118459 3120236 3124566 3131902 3141508 3152488 3165276 3181439 3201780 3224916 3248080 3269450
53214 3269450 3289697 3311309 3336377 3364896 3394958 3424364 3452051 3478367 3504477 3531564 3560050
53203 3560050 3589048 3616625 3641016 3661779 3679729 3695942 3711071 3725241 3737965 3748118 3754673
53192 3754673 3757754 3758521 3757728 3754878 3748998 3739687 3726915 3710508 3690603 3668171 3644083 3617757 3587733
$$ packed form
53272E188133o5212o7024o9394p1111p1639p1414p1242p1677p2705p3717p3981
53261D409017p3277p1985p0528o9003o7244o5102o2545n9645n6486n3172n0105
53250C709925m8107m7614m7661m6392m3183l9560l7198l5561l2638k7868k3047
53239C281096k0096j9036j8629j7994j6883j5132j2874j0863r680q743o937m205
53227C120024j654Q9J777M330P336R606J0980J2788J6163K0341K3136K3164K1370
53214C269450K0247K1612K5068K8519L0062K9406K7687K6316K6110K7087K8486
53203C560050K8998K7577K4391K0763J7950J6213J5129J4170J2724J0153O555
53192C754673L081P67p93k850n880r311j2772j6407j9905k2432k4088k6326l0024
$$ plain form
53179 3587733 3553741 3517371 3480412 3443268 3405301 3365933 3324901 3282180 3238513 3195585 3154739
53168 3154739 3115417 3075509 3033411 2989451 2945351 2902780 2862430 2823841 2785611 2746100 2704521
53157 2704521 2661533 2618575 2576612 2535660 2495444 2456108 2417955 2380753 2343818 2306864 2270492
53146 2270492 2235629 2202700 2171467 2141304 2111313 2080451 2048082 2014574 1981107 1948760 1917792
53135 1917792 1887698 1857771 1827654 1797485 1767477 1737459 1707211 1677389 1649489 1624212 1600125
53124 1600125 1574750 1547064 1518324 1490365 1463671 1437385 1410579 1383034 1355082 1327189 1299811
53113 1299811 1273473 1248724 1225673 1203444 1180617 1156770 1133256 1111747 1092293 1073696 1055475
53102 1055475 1038097 1021160 1003002 983024 963093 945382 929650 914033 897900 882357 868094
$$ packed form
53179C587733l3992l6370l6959l7144l7967l9368m1032m2721m3667m2928m0846
53168C154739l9322l9908m2098m3960m4100m2571m0350l8589l8230l9511m1579
53157B704521m2988m2958m1963m0952m0216l9336l8153l7202l6935l6954l6372
53146B270492l4863l2929l1233l0163k9991l0862l2369l3508l3467l2347l0968
53135A917792l0094k9927l0117l0169l0008l0018l0248k9822k7900k5277k4087
53124A600125k5375k7686k8740k7959k6694k6286k6806k7545k7952k7893k7378
53113A299811k6338k4749k3051k2229k2827k3847k3514k1509j9454j8597j8221
53102A055475j7378j6937j8158j9978j9931j7711j5732j5617j6133j5543j4263
$$ plain form
53091 868094 854309 840070 825495 811114 797049 783434 770793 759352 748512 737637 726997
53080 726997 717360 708950 701221 693445 685113 676074 666651 657456 648802 640384 631834 623322 615369 608287
53066 608287 602116 596793 592008 587096 581701 576599 573393 572965 574299 575074 573622 570363 567192 565410 564471
53051 564471 562949 560337 557253 553989 549901 544702 539523 535741 533039 529529 523846 516450 508799 501861
53037 501861 495635 489495 482725 475188 467732 461525 456732 452273 447201 441752 436511 431077 424488 416876
53023 416876 409801 404658 401290 398538 395632 392447 388700 383665 377042 369726 363266 358505 355006 351900
53009 351900 348977 346584 344640 342371 339355 336293 334163 332839 331262 328944 326416 323908 320488 315291
52995 315291 309173 304126 301149 299410 297548 295002 291962 288932 286781 286427 287721 289181 289602 289511 290158
$$ packed form
53091H68094j3785j4239j4575j4381j4065j3615j2641j1441j0840j0875j0640
53080G26997r637q410p729p776q332r039r423r195q654q418q550q512p953p082
53066F08287o171n323m785m912n395n102l206m28J334P75j452l259l171j782r39
53051E64471j522k612l084l264m088n199n179l782k702l510n683p396p651o938
53037E01861o226o140o770p537p456o207m793m459n072n449n241n434o589p612
53023D16876p075n143l368k752k906l185l747n035o623p316o460m761l499l106
53009C51900k923k393j944k269l016l062k130j324j577k318k528k508l420n197
52995C15291o118n047k977j739j862k546l040l030k151l54J294J460M21r1O47
$$ plain form
52980 290158 291393 291706 290335 288133 285954 283416 280062 276820 275089 274823 274621 273548 271831 269860 267642
52965 267642 265493 264184 263865 263591 262443 260517 258400 256426 254944 254436 254514 253633 250979 248119 247356 248561
52949 248561 249078 247079 243691 241237 240539 240776 240997 240605 238915 235575 231565 228885 228910 231407 235110 238719
52933 238719 241286 242222 241412 239303 236867 235262 235113 235810 235971 235163 234836 236788 240775 244436 245809 245152
52917 245152 244045 243497 243591 244383 246215 249250 253403 258697 265030 271505 276703 280015 282337 285098 288855
52902 288855 292997 296522 298819 300039 301078 302842 305110 306470 305941 304349 303297 303067 302568 301454 300974
52887 300974 302093 303852 304569 303926 302759 301388 299455 297229 295696 295094 294426 292858 290757 288946 287661
52872 287661 286681 285881 285200 284472 283578 282440 280853 278788 276759 275252 273943 272446 271539 272191 273244 272024
$$ packed form
52980B90158J235L13j371k202k179k538l354l242j731k66k02j073j717j971k218
52965B67642k149j309l19k74j148j926k117j974j482n08P8q81k654k860p63J205
52949B48561N17j999l388k454o98K37K21l92j690l340m010k680K5K497L703L609
52933B38719K567R36q10k109k436j605j49O97J61q08l27J952L987L661J373o57
52917B45152j107n48R4P92J832L035M153N294O333O475N198L312K322K761L757
52902B88855M142L525K297J220J039J764K268J360n29j592j052k30m99j114m80
52887C00974J119J759P17o43j167j371j933k226j533o02o68j568k101j811j285
52872B87661r80q00o81p28q94j138j587k065k029j507j309j497r07O52J053j220
$$ plain form
52856 272024 268151 265015 265884 269714 272500 272079 269864 268251 268123 269007 270119 270752 270610 270154 270045 270283
52840 270283 270492 270750 271296 271781 271853 272208 273789 276065 277367 277005 275936 275219 274979 274950 274876 274271 272934 271746
52822 271746 271686 272097 271444 269956 269672 271448 273815 275553 277469 280401 283250 284574 284766 284962 284999 284220 283298
52805 283298 283289 283609 282953 281766 281725 282976 284055 284753 286936 291706 297561 302436 306271 310323 314842 318730
52789 318730 321189 322712 324365 326634 329099 331072 332519 334171 336529 339068 340986 342535 344826 348318
52775 348318 352294 355987 359318 362156 363731 363479 361984 360340 358865 357024 354430 351295 347899 344248
52761 344248 340541 337594 336275 336392 336471 335011 331942 328514 325650 322894 319272 314790 310497 307224 304865
52746 304865 302893 301121 299783 299163 299186 299249 298504 296677 294498 292968 292188 291265 289365 286466 283074 279613
$$ packed form
52856B72024l873l136Q69L830K786m21k215j613j28Q84J112O33j42m56j09K38
52840B70283K09K58N46M85P2L55J581K276J302l62j069p17k40k9p4o05j337j188
52822B71746o0M11o53j488k84J776K367J738J916K932K849J324J92J96L7p79r22
52805B83298rL20o56j187m1J251J079O98K183M770N855M875L835M052M519L888
52789C18730K459J523J653K269K465J973J447J652K358K539J918J549K291L492
52775C48318L976L693L331K838J575k52j495j644j475j841k594l135l396l651
52761C44248l707k947j319J17P9j460l069l428k864k756l622m482m293l273k359
52746C04865j972j772j338o20K3O3p45j827k179j530p80r23j900k899l392l461
$$ plain form
52730 279613 276299 273350 271029 269439 268279 266826 264398 261036 257574 254823 252811 250967 248871 246602
52716 246602 244583 243202 242301 241003 238577 235691 234064 234356 235121 234578 232743 230874 229514 228335 227523
52701 227523 227756 228668 228735 227188 224960 223298 222420 222083 222366 223087 223210 221802 219195 216478 214186 212155
52685 212155 210382 209253 208924 208907 208332 206452 203088 198789 194379 190245 186332 182874 180543 179586 179220 178267
52669 178267 176173 173269 170482 168890 168961 169851 169943 168513 166530 165483 165918 167428 169475 171545 172957 173345
52653 173345 173238 173545 174513 175616 176375 176836 177222 177483 177346 176753 176298 177007 179144 181270 181331 179108 176855
52636 176855 176900 179260 182302 185019 187492 189586 190654 190769 191083 192426 194339 195913 196913 197549 197749 197271
52620 197271 196251 195036 193598 191616 189058 186291 183557 180633 177203 173420 169967 167509 166212 165847
$$ packed form
52730B79613l314k949k321j590j160j453k428l362l462k751k012j844k096k269
52716B46602k019j381r01j298k426k886j627K92P65n43j835j869j360j179q12
52701B27523K33R12O7j547k228j662q78l37K83P21J23j408k607k717k292k031
52685B12155j773j129l29j7n75j880l364m299m410m134l913l458k331r57l66r53
52669A78267k094k904k787j592P1Q90R2j430j983j047M35J510K047K070J412L88
52653A73345j07L07R68J103P59M61L86K61j37n93m55P09K137K126O1k223k253
52636A76855M5K360L042K717K473K094J068J15L14J343J913J574J000O36K00m78
52620A97271j020j215j438j982k558k767k734k924l430l783l453k458j297l65
$$ plain form
52606 165847 166248 167347 168680 169211 168161 165952 163961 163151 163113 162623 161033 159023 157949 158457 159804 160564
52590 160564 159886 157880 154938 151299 147629 145371 145720 148208 150858 151954 151335 149937 148559 147386 146349
52575 146349 145405 144470 143360 142018 140685 139755 139375 139245 138845 137827 136255 134560 133360 133161 133942 135065
52559 135065 135830 136115 136178 135861 134468 131717 128429 125894 124811 125169 126775 129251 131580 132383 130999 128081
52543 128081 125000 122879 122221 123035 124961 127431 129987 132503 135050 137624 140105 142390 144418 146015 146797
52528 146797 146365 144673 142266 140108 139133 139849 142151 145292 148076 149496 149377 148334 146995 145528 144110
52513 144110 143493 144550 147261 150682 154120 157817 161973 165550 167009 166530 166518 169061 173307 176509 177591
52498 177591 178486 181362 185703 189123 190339 190131 189805 190027 191150 193342 196022 198088 199074 199305 198830 197250
$$ packed form
52606A65847M01J099J333N31j050k209j991q10l8m90j590k010j074N08J347P60
52590A60564o78k006k942l639l670k258L49K488K650J096o19j398j378j173j037
52575A46349r44r35j110j342j333r30l80j30m00j018j572j695j200j99P81J123
52559A35065P65K85O3l17j393k751l288k535j083L58J606K476K329Q03j384k918
52543A28081l081k121o58Q14J926K470K556K516K547K574K481K285K028J597P82
52528A46797m32j692k407k158r75P16K302L141K784J420j19j043j339j467j418
52513A44110o17J057K711L421L438L697M156L577J459m79j2K543M246L202J082
52498A77591Q95K876M341L420J216k08l26K22J123K192K680K066R86K31m75j580
$$ plain form
52482 197250 194906 193075 192447 192465 192792 194198 197036 199867 200956 200493 200160 200927 202336 203568 204118 203827
$$ packed form
52482A97250k344j831o28J8L27J406K838K831J089m63l33P67J409J232N50k91
$$ [...]
##END NTUPLES=NMR SPECTRUM
##END=
