##TITLE=coffee_type TORI01-ROVE100C_90-10%
COFFEE_meoh_noesyp64 COFFEE_meoh {C:\Bruker\TOPSPIN} Administrator 15
##JCAMPDX= 6.0         $$ Bruker NMR JCAMP-DX V2.0
##DATA TYPE= NMR SPECTRUM
##DATA CLASS= NTUPLES
##ORIGIN= Bruker BioSpin GmbH
##OWNER= Administrator
$$ 1.72 TOPSPIN		Version 2.1
$$ 2012-05-18 15:42:22.870 -0700  Administrator@X
$$ Compression mode = diff/dup
##.OBSERVE FREQUENCY= 400.13188235
##.OBSERVE NUCLEUS= ^1H
##.ACQUISITION MODE= SIMULTANEOUS (DQD)
##.ACQUISITION SCHEME= undefined
##.AVERAGES= 64
##.DIGITISER RES= 22
##SPECTROMETER/DATA SYSTEM= spect
##.PULSE SEQUENCE= noesygpps1d.comp
##.SOLVENT NAME= COFFEE_meoh
##.SHIFT REFERENCE= INTERNAL, COFFEE_meoh, 1, 14.98061
##AUDIT TRAIL= $$ (NUMBER, WHEN, WHO, WHERE, PROCESS, VERSION, WHAT)
$$ ##TITLE= Audit trail, TOPSPIN		Version 2.1
$$ ##JCAMPDX= 5.01
$$ ##ORIGIN= Bruker BioSpin GmbH
$$ ##OWNER= Administrator
$$ $$ C:\Bruker\TOPSPIN/data/Administrator/nmr/12-COFFEE-2002/152/pdata/1/auditp.txt
$$ ##AUDIT TRAIL=  $$ (NUMBER, WHEN, WHO, WHERE, PROCESS, VERSION, WHAT)
(   1,<2012-02-21 01:57:26.344 -0500>,<Administrator>,<TOPSPIN>,<go>,<TOPSPIN 2.1>,
      <created by zg
	started at 2012-02-21 01:45:56.125 -0500,
	POWCHK enabled, PULCHK disabled,
       configuration hash MD5:
       B0 76 FB 9C 50 81 44 7D 18 B3 26 32 4E 60 AD 96
       data hash MD5: 64K
       B8 AB 17 6A 1C FE D8 8F F7 14 20 90 9C 4E 99 C4>)
(   2,<2012-02-21 01:57:29.031 -0500>,<Administrator>,<TOPSPIN>,<proc1d>,<TOPSPIN 2.1>,
      <Start of raw data processing
       efp LB = 0.3 FT_mod = 6 PKNL = 1 PHC0 = 0 PHC1 = 0 SI = 128K 
       data hash MD5: 128K
       7B 64 FD 1F 8B 0E 20 EC 22 60 3A CF 41 07 EB 64>)
(   3,<2012-02-21 01:57:30.641 -0500>,<Administrator>,<TOPSPIN>,<proc1d>,<TOPSPIN 2.1>,
      <pk PHC0 = 25.04883 PHC1 = 0 
       data hash MD5: 128K
       E8 CF 4C C2 43 AA BF B1 69 F6 7A C3 97 90 9F 9E>)
(   4,<2012-02-21 01:57:30.891 -0500>,<Administrator>,<TOPSPIN>,<proc1d>,<TOPSPIN 2.1>,
      <abs ABSG = 1 
       data hash MD5: 128K
       09 8C 2A F5 6E 49 97 C9 BF 0D 84 1A 54 74 A0 7F>)
(   5,<2012-02-21 01:57:30.969 -0500>,<Administrator>,<TOPSPIN>,<proc1d>,<TOPSPIN 2.1>,
      <abs ABSG = 2 
       data hash MD5: 128K
       E1 79 86 EE 77 5F 80 63 3B B0 FA 71 2F 8C A2 A2>)
(   6,<2012-02-21 01:57:31.031 -0500>,<Administrator>,<TOPSPIN>,<proc1d>,<TOPSPIN 2.1>,
      <abs ABSG = 3 
       data hash MD5: 128K
       59 32 A5 A0 54 64 10 9D AD 58 60 FD B5 56 18 D6>)
(   7,<2012-02-21 01:57:31.281 -0500>,<Administrator>,<TOPSPIN>,<proc1d>,<TOPSPIN 2.1>,
      <abs ABSG = 4 
       data hash MD5: 128K
       58 74 38 26 DD B6 58 6D 50 25 D1 1B 7E F0 D4 DE>)
(   8,<2012-02-21 01:57:31.344 -0500>,<Administrator>,<TOPSPIN>,<proc1d>,<TOPSPIN 2.1>,
      <abs ABSG = 5 
       data hash MD5: 128K
       BD AB 83 AC FE 59 48 6F CE 98 32 52 37 D9 67 1B>)
(   9,<2012-02-21 01:57:31.484 -0500>,<Administrator>,<TOPSPIN>,<audit>,<TOPSPIN 2.1>,
      <user comment:
       ICON-NMR User ID: Administrator
$$ [...]
150 150 150 150 150 150 150 150
##$TP07= 0
##$TPNAME0= <>
##$TPNAME1= <>
##$TPNAME2= <>
##$TPNAME3= <>
##$TPNAME4= <>
##$TPNAME5= <>
##$TPNAME6= <>
##$TPNAME7= <>
##$TPOAL= (0..7)
0.5 0.5 0.5 0.5 0.5 0.5 0.5 0.5
##$TPOFFS= (0..7)
0 0 0 0 0 0 0 0
##$TUNHIN= 0
##$TUNHOUT= 0
##$TUNXOUT= 0
##$USERA1= <user>
##$USERA2= <user>
##$USERA3= <user>
##$USERA4= <user>
##$USERA5= <user>
##$V9= 5
##$VALIST= <valist>
##$VCLIST= <CCCCCCCCCCCCCCC>
##$VD= 0
##$VDLIST= <DDDDDDDDDDDDDDD>
##$VPLIST= <PPPPPPPPPPPPPPP>
##$VTLIST= <TTTTTTTTTTTTTTT>
##$WBST= 1024
##$WBSW= 4
##$XGAIN= (0..3)
0 0 0 0
##$XL= 0
##$YL= 0
##$YMAX_a= 15080079
##$YMIN_a= -6955223
##$ZGOPTNS= <>
##$ZL1= 120
##$ZL2= 120
##$ZL3= 120
##$ZL4= 120
##$ABSF1= 14.98061
##$ABSF2= -5.57192
##$ABSG= 5
##$ABSL= 3
##$ALPHA= 0
##$AQORDER= 0
##$ASSFAC= 0
##$ASSFACI= 0
##$ASSFACX= 0
##$ASSWID= 0
##$AUNMP= <proc_prof1d_extract>
##$AXLEFT= 0
##$AXNAME= <>
##$AXNUC= <1H>
##$AXRIGHT= 0
##$AXTYPE= 0
##$AXUNIT= <>
##$AZFE= 0.1
##$AZFW= 0.1
##$BCFW= 0
##$BC_mod= 0
##$BYTORDP= 0
##$COROFFS= 0
##$CY= 15
##$DATMOD= 1
##$DC= 0
##$DFILT= <>
##$DTYPP= 0
##$F1P= 0
##$F2P= 0
##$FCOR= 0.5
##$FTSIZE= 131072
##$FT_mod= 6
##$GAMMA= 0
##$GB= 0
##$INTBC= 1
##$INTSCL= 1
##$ISEN= 128
##$LB= 0.3
##$LEV0= 0
##$LPBIN= 0
##$MAXI= 10000
##$MC2= 0
##$MEAN= 0
##$ME_mod= 0
##$MI= 0
##$NCOEF= 0
##$NC_proc= -3
##$NLEV= 6
##$NOISF1= 0
##$NOISF2= 0
##$NSP= 0
##$NTH_PI= 0
##$NZP= 0
##$OFFSET= 14.98061
##$PC= 1
##$PHC0= 25.04883
##$PHC1= 0
##$PH_mod= 1
##$PKNL= yes
##$PPARMOD= 0
##$PPDIAG= 0
##$PPIPTYP= 0
##$PPMPNUM= 2147483647
##$PPRESOL= 1
##$PSCAL= 4
##$PSIGN= 0
##$PYNMP= <proc.py>
##$REVERSE= no
##$SF= 400.13
##$SI= 131072
##$SIGF1= 0
##$SIGF2= 0
##$SINO= 400
##$SIOLD= 131072
##$SPECTYP= <>
##$SREGLST= <1H.CDCl3>
##$SSB= 0
##$STSI= 131072
##$STSR= 0
##$SW_p= 8223.68421052632
##$SYMM= 0
##$S_DEV= 0
##$TDeff= 65536
##$TDoff= 0
##$TI= <>
##$TILT= no
##$TM1= 0
##$TM2= 0
##$TOPLEV= 0
##$USERP1= <user>
##$USERP2= <user>
##$USERP3= <user>
##$USERP4= <user>
##$USERP5= <user>
##$WDW= 1
##$XDIM= 131072
##$YMAX_p= 525712330
##$YMIN_p= -301343426
##$CURPLOT= <Network HP LaserJet P1505>
##$CURPRIN= <$Network HP LaserJet P1505>
##$DFORMAT= <normdp>
##$LAYOUT= <+/1D_H.xwp>
##$LFORMAT= <normlp>
##$PFORMAT= <normpl>
##$SURQMSG= 1
$$ End of Bruker specific parameters
$$ ---------------------------------
##NTUPLES= NMR SPECTRUM
##VAR_NAME=  FREQUENCY,     SPECTRUM/REAL,   SPECTRUM/IMAG
##SYMBOL=    X,             R,               I
##VAR_TYPE=  INDEPENDENT,   DEPENDENT,       DEPENDENT
##VAR_FORM=  AFFN,          ASDF,            ASDF
##VAR_DIM=   131072,        131072,          131072
##UNITS=     HZ,            ARBITRARY UNITS, ARBITRARY UNITS
##FACTOR=    0.0627417313425165, 1,          1
##FIRST=     8223.62146879498, -942,         -97473
##LAST=      0,             3273,            -98438
##MIN=       0,             -301343426,      0
##MAX=       8223.62146879498, 525712330,    0
$$ Real data points
##PAGE= N=1
##DATA TABLE= (X++(R..R)), XYDATA
$$ [...]
$$ plain form
62925 3055928 3088147 3117438 3143212 3164489 3179985 3188692 3190233 3184605 3171869 3152061 3124925 3089467
62913 3089467 3044270 2988698 2923738 2851579 2774616 2694780 2613234 2530358 2446456 2362834 2281757
62902 2281757 2204945 2132582 2064366 2001040 1943868 1892693 1845580 1800778 1758294 1719113 1683606
62891 1683606 1651480 1622749 1597638 1575473 1554627 1534089 1514648 1497915 1484288 1472253 1459709
62880 1459709 1445738 1431065 1417059 1404364 1392316 1379487 1364869 1348802 1332873 1318731 1306638
62869 1306638 1295080 1282068 1267130 1251938 1238730 1228201 1219173 1210172 1200751 1191182 1181611 1172120
62857 1172120 1163205 1155332 1148025 1140048 1130741 1120718 1111052 1102288 1094488 1087700 1081788 1076080 1069864 1063270
62843 1063270 1057203 1052256 1048036 1043795 1039555 1036407 1035569 1037090 1039449 1040556 1039226 1035589 1030198 1023344
$$ packed form
62925C055928L2219K9291K5774K1277J5496Q707J541n628j2736j9808k7136l5458
62913C089467m5197n5572o4960p2159p6963p9836q1546q2876q3902q3622q1077
62902B281757p6812p2363o8216o3326n7172n1175m7113m4802m2484l9181l5507
62891A683606l2126k8731k5111k2165k0846k0538j9441j6733j3627j2035j2544
62880A459709j3971j4673j4006j2695j2048j2829j4618j6067j5929j4142j2093
62869A306638j1558j3012j4938j5192j3208j0529r028r001r421r569r571r491
62857A172120q915p873p307p977r307j0023r666q764p800o788n912n708o216o594
62843A063270o067m947m220m241m240l148q38J521K359J107j330l637n391o854
$$ plain form
62829 1023344 1015525 1007910 1001542 996249 991157 986337 983105 982403 983544 984956 985584 985166 983729 981578 979455
62814 979455 978053 977465 977564 978660 981079 984237 986810 987988 988106 988048 988539 989919 992006 994085 995676 997388
62798 997388 1000301 1004234 1007390 1008262 1007337 1006361 1006340 1007004 1007936 1009442 1012067 1015720 1019579 1022816 1025330 1027637
62782 1027637 1029814 1030862 1029761 1027181 1025230 1025071 1025634 1025401 1024556 1024259 1024447 1023831 1021995 1020062 1019032 1018674
62766 1018674 1018390 1017949 1016826 1014056 1009568 1004633 1000083 994997 988260 980662 974087 969187 965270 962156
62752 962156 960527 960298 960220 959664 959541 960800 963068 965564 968411 972100 976450 981159 986902 994764 1004833
62737 1004833 1016389 1029276 1044060 1060738 1078430 1096702 1116380 1138561 1163405 1190274 1218501
62726 1218501 1247672 1277766 1309557 1344412 1383167 1425594 1471449 1521484 1576678 1636920 1701399
$$ packed form
62829A023344p819p615o368n293n092m820l232p02J141J412O28m18j437k151k123
62814I79455j402n88R9J096K419L158K573J178J18n8M91J380K087K079J591J712
62798I97388K913L933L156Q72r25r76k1O64R32J506K625L653L859L237K514K307
62782A027637K177J048j101k580j951j59N63k33q45k97J88o16j836j933j030l58
62766A018674k84m41j123k770m488m935m550n086o737p598o575m900l917l114
62752I62156j629k29p8n56j23J259K268K496K847L689M350M709N743P862J0069
62737A004833J1556J2887J4784J6678J7692J8272J9678K2181K4844K6869K8227
62726A218501K9171L0094L1791L4855L8755M2427M5855N0035N5194O0242O4479
$$ plain form
62715 1701399 1770065 1843584 1921772 2003274 2087241 2174339 2265185 2358399 2451039 2540533 2625376
62704 2625376 2704198 2775205 2836575 2886581 2923135 2944113 2948658 2937615 2912321 2873429 2821360
62693 2821360 2757364 2683440 2601499 2513247 2420746 2326349 2231936 2138678 2047591 1959745 1875736
62682 1875736 1795390 1718397 1645008 1575883 1511488 1451870 1396901 1346480 1300548 1258963 1221292
62671 1221292 1186693 1154228 1123423 1094478 1067983 1044633 1025008 1009076 995817 983956 973279
62660 973279 964697 958623 953988 949481 945268 942682 942525 944509 948201 953634 961027 970744 983580 1000087
62646 1000087 1019461 1040112 1061749 1085968 1114269 1146387 1181219 1218497 1258654 1301862 1348276
62635 1348276 1398673 1453700 1512832 1575237 1641351 1712226 1787235 1863708 1939203 2013126 2085720
$$ packed form
62715A701399O8666P3519P8188Q1502Q3967Q7098R0846R3214R2640Q9494Q4843
62704B625376P8822P1007O1370N0006L6554K0978M545j1043k5294l8892n2069
62693B821360o3996p3924q1941q8252r2501r4397r4413r3258r1087q7846q4009
62682A875736q0346p6993p3389o9125o4395n9618n4969n0421m5932m1585l7671
62671A221292l4599l2465l0805k8945k6495k3350j9625j5932j3259j1861j0677
62660I73279q582o074m635m507m213k586j57J984L692N433P393R717J2836J6507
62646A000087J9374K0651K1637K4219K8301L2118L4832L7278M0157M3208M6414
62635A348276N0397N5027N9132O2405O6114P0875P5009P6473P5495P3923P2594
$$ plain form
62624 2085720 2156395 2223454 2284531 2336713 2377101 2404081 2417709 2418405 2405895 2379933 2341440 2292254
62612 2292254 2234168 2168744 2097572 2022019 1943085 1862136 1781392 1703035 1628059 1556480 1488176
62601 1488176 1422884 1359967 1299265 1241953 1189508 1141840 1097472 1055681 1017432 983801 954269
62590 954269 927041 900483 873905 847652 823008 801517 783664 768203 753126 737190 720483
62579 720483 703916 688465 674632 662352 651608 643086 637547 634127 630053 623025 613777 605409 600093
62566 600093 597164 594639 591719 589108 587468 586548 585876 585518 585868 587221 589928 594434 600639 607431 613485
62551 613485 618498 623288 628886 636113 645763 658255 672831 687963 702994 718710 735775 753432
62539 753432 770658 788074 807632 830468 855998 883166 911802 942525 975951 1012366 1051864
$$ packed form
62624B085720P0675O7059O1077N2182M0388K6980J3628O96j2510k5962l8493m9186
62612B292254n8086o5424p1172p5553p8934q0949q0744p8357p4976p1579o8304
62601A488176o5292o2917o0702n7312n2445m7668m4368m1791l8249l3631k9532
62590I54269k7228k6558k6578k6253k4644k1491j7853j5461j5077j5936j6707
62579G20483j6567j5451j3833j2280j0744q522n539l420m074p028r248q368n316
62566F00093k929k525k920k611j640r20o72l58L50J353K707M506O205O792O054
62551F13485N013M790N598P227R650J2492J4576J5132J5031J5716J7065J7657
62539G53432J7226J7416J9558K2836K5530K7168K8636L0723L3426L6415L9498
$$ plain form
62528 1051864 1094583 1140777 1190277 1241463 1291403 1338043 1382112 1425752 1469053 1508941 1541765
62517 1541765 1565949 1581660 1589125 1588402 1580015 1564558 1541867 1511730 1475470 1435887 1395279 1354055
62505 1354055 1311599 1267966 1224348 1182147 1142015 1103805 1067300 1032868 1001365 973341 948338
62494 948338 925072 902460 880502 860035 841390 823458 804628 784868 766160 750184 736069
62483 736069 721469 705819 691364 680539 673245 667262 660629 652986 645181 638454 633759 631205 630197
62470 630197 630466 632667 637463 644446 652543 661306 671166 682472 694891 707771 720732 733920 747970
62457 747970 763613 781077 800124 820937 844467 871422 901362 933455 967716 1004603 1043688
62446 1043688 1083754 1124271 1165773 1208534 1251731 1294203 1335176 1373667 1407886 1435996 1457179
$$ packed form
62528A051864M2719M6194M9500N1186M9940M6640M4069M3640M3301L9888L2824
62517A541765K4184J5711P465p23q387j5457k2691l0137l6260l9583m0608m1224
62505A354055m2456m3633m3618m2201m0132l8210l6505l4432l1503k8024k5003
62494I48338k3266k2612k1958k0467j8645j7932j8830j9760j8708j5976j4115
62483G36069j4600j5650j4455j0825p294n983o633p643p805o727m695k554j008
62470F30197K69K201M796O983Q097Q763R860J1306J2419J2880J2961J3188J4050
62457G47970J5643J7464J9047K0813K3530K6955K9940L2093L4261L6887L9085
62446A043688M0066M0517M1502M2761M3197M2472M0973L8491L4219K8110K1183
$$ plain form
62435 1457179 1471433 1478599 1478166 1470040 1455067 1434684 1410048 1381401 1348389 1311396 1272625 1235251
62423 1235251 1201025 1169070 1137509 1105981 1075985 1048888 1024447 1001650 980422 961817 946532
62412 946532 933882 922484 911587 901298 891812 883149 875712 870378 867627 867065 868236 871209 875652
62399 875652 879970 882722 884871 889303 897524 907879 917743 926643 936229 947752 960747 974051 986877
62386 986877 998487 1007677 1013349 1015374 1014542 1011783 1007605 1001958 994342 984154 971206 955906 938855
62373 938855 920444 900983 881062 861497 842961 825837 810414 796995 785800 776907 770334 765996
62361 765996 763543 762448 762412 763579 766199 770146 774970 780428 786847 794904 805064 817130 830246 843391
62347 843391 856042 868325 880493 892367 903499 913769 923482 932801 941335 948501 954172 958787 962734
$$ packed form
62435A457179J4254P166m33q126j4973k0383k4636k8647l3012l6993l8771l7374
62423A235251l4226l1955l1561l1528k9996k7097k4441k2797k1228j8605j5285
62412I46532j2650j1398j0897j0289r486q663p437n334k751n62J171K973M443
62399H75652M318K752K149M432Q221J0355R864Q900R586J1523J2995J3304J2826
62386I86877J1610R190N672K025q32k759m178n647p616j0188j2948j5300j7051
62373I38855j8411j9461j9921j9565j8536j7124j5423j3419j1195q893o573m338
62361G65996k453j095l6J167K620L947M824N458O419Q057J0160J2066J3116J3145
62347H43391J2651J2283J2168J1874J1132J0270R713R319Q534P166N671M615L947
$$ plain form
62334 962734 965710 966753 965164 961455 957135 953362 949993 946205 941777 937369 933832 931912 932516 936406
62320 936406 943360 952229 962211 973651 987462 1004406 1025241 1050734 1080821 1114234 1149775 1187821
62308 1187821 1229967 1277316 1329633 1386042 1445962 1509333 1576302 1646764 1720038 1795108 1871136
62297 1871136 1947257 2021634 2091334 2153588 2206673 2249222 2279566 2296764 2301829 2297021 2284122 2264002
62285 2264002 2237080 2203104 2161024 2110596 2054017 1994673 1934403 1873358 1812332 1753297 1697200
62274 1697200 1643194 1591021 1542532 1499502 1461151 1425219 1390611 1357605 1326251 1296189 1267775
62263 1267775 1241993 1219294 1199545 1182864 1169360 1158113 1147552 1137001 1126901 1117554 1108638 1100164
62251 1100164 1092836 1087046 1082194 1077314 1071703 1064791 1056197 1046445 1036997 1029056 1022636 1017007 1011573 1006094
$$ packed form
62334I62734K976J043j589l709m320l773l369l788m428m408l537j920O04L890
62320I36406O954Q869R982J1440J3811J6944K0835K5493L0087L3413L5541L8046
62308A187821M2146M7349N2317N6409N9920O3371O6969P0462P3274P5070P6028
62297A871136P6121P4377O9700O2254N3085M2549L0344J7198N065m808j2899k0120
62285B264002k6922l3976m2080n0428n6579n9344o0270o1045o1026n9035n6097
62274A697200n4006n2173m8489m3030l8351l5932l4608l3006l1354l0062k8414
62263A267775k5782k2699j9749j6681j3504j1247j0561j0551j0100r347q916q474
62251A100164p328n790m852m880n611o912q594r752r448p941o420n629n434n479
$$ plain form
62237 1006094 1000687 996085 993321 992594 992786 992706 992659 994239 998668 1005859 1015016 1025602 1037402 1050064 1063061
62222 1063061 1076177 1089680 1103792 1118183 1132442 1147200 1164274 1185092 1209024 1233754 1257494
62211 1257494 1280564 1304856 1332209 1363467 1398542 1436795 1477444 1520113 1565243 1613874 1666908
62200 1666908 1724583 1786532 1852149 1920796 1991690 2063729 2135465 2205058 2269998 2327042 2373019
62189 2373019 2406127 2426278 2433971 2429330 2412677 2385538 2349987 2306953 2256227 2198530 2136616 2073540
62177 2073540 2010468 1947146 1884059 1822978 1765486 1712220 1663907 1621845 1586353 1555459 1526446
62166 1526446 1498650 1473727 1453064 1435974 1420989 1407995 1398068 1391485 1387008 1383257 1379911 1377053
62154 1377053 1374091 1370195 1365676 1362084 1360661 1361144 1362430 1364120 1366965 1371959 1379488 1389465 1401869 1416747
$$ packed form
62237A006094n407m602k764p27J92q0m7J580M429P191R157J0586J1800J2662J2997
62222A063061J3116J3503J4112J4391J4259J4758J7074K0818K3932K4730K3740
62211A257494K3070K4292K7353L1258L5075L8253M0649M2669M5130M8631N3034
62200A666908N7675O1949O5617O8647P0894P2039P1736O9593O4940N7044M5977
62189B373019L3108K0151P693m641j6653k7139l5551m3034n0726n7697o1914o3076
62177B073540o3072o3322o3087o1081n7492n3266m8313m2062l5492l0894k9013
62166A526446k7796k4923k0663j7090j4985j2994r927o583m477l751l346k858
62154A377053k962l896m519l592j423M83J286J690K845M994P529R977J2404J4878
$$ plain form
62140 1416747 1433840 1452657 1473025 1495279 1519702 1545935 1573269 1601550 1631629 1664817 1701844
62129 1701844 1742236 1784622 1827581 1870235 1912035 1952292 1990387 2026465 2061261 2094700 2125071
62118 2125071 2150399 2170753 2188611 2206760 2226334 2247113 2269104 2293202 2320463 2351247 2385168
62107 2385168 2421619 2460270 2501097 2543778 2587032 2628764 2666973 2700296 2727603 2747697 2760057
62096 2760057 2765680 2766562 2764112 2758289 2748284 2733694 2714938 2692876 2668370 2642282 2615718 2590061
62084 2590061 2566502 2545460 2526615 2509584 2494403 2481342 2470555 2462112 2456091 2452371 2450586 2450570 2452631
62071 2452631 2457029 2463430 2471272 2480473 2491348 2504085 2518994 2537173 2560010 2587580 2618082 2649339
62059 2649339 2680648 2712941 2747540 2785150 2825727 2868710 2913390 2959485 3007443 3057834 3110328
$$ packed form
62140A416747J7093J8817K0368K2254K4423K6233K7334K8281L0079L3188L7027
62129A701844M0392M2386M2959M2654M1800M0257L8095L6078L4796L3439L0371
62118B125071K5328K0354J7858J8149J9574K0779K1991K4098K7261L0784L3921
62107B385168L6451L8651M0827M2681M3254M1732L8209L3323K7307K0094J2360
62096B760057N623Q82k450n823j0005j4590j8756k2062k4506k6088k6564k5657
62084B590061k3559k1042j8845j7031j5181j3061j0787q443o021l720j785j6K061
62071B452631M398O401P842R201J0875J2737J4909J8179K2837K7570L0502L1257
62059B649339L1309L2293L4599L7610M0577M2983M4680M6095M7958N0391N2494
$$ plain form
62048 3110328 3163594 3216531 3269549 3324403 3382621 3444148 3507655 3572110 3637813 3705700 3775909
62037 3775909 3847446 3919411 3992293 4067874 4147936 4233057 4322433 4414666 4508911 4605447 4705099
62026 4705099 4807915 4912411 5016235 5117527 5215626 5310767 5403616 5495205 5586844 5679545
62016 5679545 5773335 5867184 5959507 6048776 6134062 6215597 6294764 6372917 6449973 6524748 6597126
62005 6597126 6669207 6743343 6819156 6893523 6963702 7029529 7092122 7151501 7206554 7256878 7303451
61994 7303451 7347366 7388643 7426507 7460187 7489353 7514308 7535967 7555096 7571352 7583634 7591701
61983 7591701 7596901 7600811 7603587 7604290 7602594 7599385 7595608 7591201 7585499 7578137 7568969 7557419 7542768 7525355
61969 7525355 7506818 7488568 7470358 7451006 7430244 7408953 7387513 7365017 7340790 7315863 7292016
$$ packed form
62048C110328N3266N2937N3018N4854N8218O1527O3507O4455O5703O7887P0209
62037C775909P1537P1965P2882P5581Q0062Q5121Q9376R2233R4245R6536R9652
62026D705099J02816J04496J03824J01292R8099R5141R2849R1589R1639R2701
62016E679545R3790R3849R2323Q9269Q5286Q1535P9167P8153P7056P4775P2378
62005F597126P2081P4136P5813P4367P0179O5827O2593N9379N5053N0324M6573
61994G303451M3915M1277L7864L3680K9166K4955K1659J9129J6256J2282Q067
61983G591701N200L910K776P03j696l209l777m407n702p362r168j1550j4651j7413
61969G525355j8537j8250j8210j9352k0762k1291k1440k2496k4227k4927k3847
$$ plain form
61958 7292016 7269919 7249266 7230453 7214867 7203426 7195926 7192165 7192654 7197750 7206986 7219860 7236527
61946 7236527 7257054 7280834 7307440 7337252 7370114 7404024 7436473 7466759 7495527 7522073 7543624
61935 7543624 7557620 7563274 7560204 7547016 7522567 7487865 7445386 7396872 7342924 7284401 7222806 7159103
61923 7159103 7093355 7025817 6957402 6888592 6818891 6748016 6676817 6606203 6535841 6464898 6393654
61912 6393654 6323301 6254360 6186427 6119525 6054591 5992329 5932658 5875698 5822226 5772314 5724503
61901 5724503 5677552 5632523 5591869 5556497 5524886 5495257 5467629 5443374 5423697 5409132 5399740
61890 5399740 5395043 5394053 5396022 5401096 5410078 5423894 5443454 5469257 5500507 5535190 5571937 5611444
61878 5611444 5655207 5703101 5753363 5804963 5858758 5915859 5975969 6038162 6102397 6169125 6237884
$$ packed form
61958G292016k2097k0653j8813j5586j1441p500l761M89N096R236J2874J6667
61946G236527K0527K3780K6606K9812L2862L3910L2449L0286K8768K6546K1551
61935G543624J3996N654l070j3188k4449l4702m2479m8514n3948n8523o1595o3703
61923G159103o5748o7538o8415o8810o9701p0875p1199p0614p0362p0943p1244
61912F393654p0353o8941o7933o6902o4934o2262n9671n6960n3472m9912m7811
61901E724503m6951m5029m0654l5372l1611k9629k7628k4255j9677j4565r392
61890E399740m697r90J969N074Q982J3816J9560K5803L1250L4683L6747L9507
61878E611444M3763M7894N0262N1600N3795N7101O0110O2193O4235O6728O8759
$$ plain form
61867 6237884 6307657 6378801 6453682 6535083 6624726 6723762 6834004 6957994 7098078 7255977
61857 7255977 7433239 7631839 7854333 8103565 8382118 8692035 9035354 9415007 9834616
61848 9834616 10296915 10802823 11352914 11949753 12598074 13302264 14063822 14880617 15746752
61839 15746752 16651196 17575477 18492111 19364455 20148015 20793901 21255245 21495371 21494594 21253105
61829 21253105 20789587 20136720 19335086 18427104 17452564 16446342 15437616 14449628 13499755
61820 13499755 12600112 11758489 10979063 10262720 9607570 9010109 8466666 7974208 7529950
61811 7529950 7130459 6771360 6448109 6157018 5895451 5661072 5451116 5262673 5093681
61802 5093681 4943405 4811650 4697546 4599337 4515329 4444723 4387310 4342575 4309358 4286278 4272206
$$ packed form
61867F237884O9773P1144P4881Q1401Q9643R9036J10242J23990J40084J57899
61857G255977J77262J98600K22494K49232K78553L09917L43319L79653M19609
61848I834616M62299N05908N50091N96839O48321P04190P61558Q16795Q66135
61839A5746752R04444R24281R16634Q72344P83560O45886M61344K40126p77k41489
61829B1253105m63518o52867q01634r07982r74540j006222j008726r87988r49873
61820A3499755q99643q41623p79426p16343o55150n97461n43443m92458m44258
61811G529950l99491l59099l23251k91091k61567k34379k09956j88443j68992
61802E093681j50276j31755j14104r8209q4008p0606n7413m4735l3217k3080j4072
$$ plain form
61791 4272206 4266363 4268033 4276043 4288284 4301902 4314257 4323735 4329528 4330965 4327365 4318353 4303911 4284426
61778 4284426 4261330 4237474 4216042 4198889 4186477 4179309 4178448 4184311 4195889 4211624 4230251 4250090
61766 4250090 4268366 4282310 4290594 4292977 4289036 4278305 4261492 4240527 4217276 4192927 4168596 4145682
61754 4145682 4125508 4109361 4099113 4097071 4104902 4123184 4152141 4192206 4243655 4306351 4380261 4465851
61742 4465851 4563784 4674689 4799365 4938613 5092501 5260417 5442368 5639915 5855389 6090441
61732 6090441 6345697 6621592 6919153 7240231 7587388 7963571 8371803 8815246 9297341
61723 9297341 9821443 10390460 11007801 11679007 12411706 13213402 14090033 15047372 16092995
61714 16092995 17235440 18481171 19832720 21288907 22844651 24488702 26200326 27946110
$$ packed form
61791D272206n843J670Q010J2241J3618J2355R478N793J437l600r012j4442j9485
61778D284426k3096k3856k1432j7153j2412p168q61N863J1578J5735J8627J9839
61766D250090J8276J3944Q284K383l941j0731j6813k0965k3251k4349k4331k2914
61754D145682k0174j6147j0248k042P831J8282K8957M0065N1449O2696P3910Q5590
61742D465851R7933J10905J24676J39248J53888J67916J81951J97547K15474K35052
61732F090441K55256K75895K97561L21078L47157L76183M08232M43443M82095
61723I297341N24102N69017O17341O71206P32699Q01696Q76631R57339J045623
61714A6092995J142445J245731J351549J456187J555744J644051J711624J745784
$$ plain form
61706 27946110 29676957 31326381 32813258 34050562 34957441 35470417 35551936 35196292 34431498
61697 34431498 33314455 31919701 30326497 28609457 26833922 25053914 23311145 21635569
61689 21635569 20047614 18560525 17181530 15912557 14751655 13694605 12735484 11866690
61681 11866690 11079848 10367309 9722489 9138840 8609469 8128302 7691010 7294179 6933979
61672 6933979 6606308 6307863 6036204 5788823 5562968 5356536 5168259 4996458 4838125
61663 4838125 4689918 4549799 4417069 4290905 4169714 4052265 3938869 3830868 3729134
61654 3729134 3633503 3543395 3458281 3377491 3300232 3226201 3155763 3089266 3026502 2967067 2910714
61643 2910714 2856906 2804549 2752876 2702396 2654254 2608683 2564661 2521087 2477729 2434947 2393063
$$ packed form
61706B7946110J730847J649424J486877J237304R06879N12976Q1519l55644p64794
61697C4431498j117043j394754j593204j717040j775535j780008j742769j675576
61689B1635569j587955j487089j378995j268973j160902j057050r59121q68794
61681A1866690p86842p12539o44820n83649n29371m81167m37292l96831l60200
61672F933979l27671k98445k71659k47381k25855k06432j88277j71801j58333
61663D838125j48207j40119j32730j26164j21191j17449j13396j08001j01734
61654C729134r5631r0108q5114q0790p7259p4031p0438o6497o2764n9435n6353
61643B910714n3808n2357n1673n0480m8142m5571m4022m3574m3358m2782m1884
$$ plain form
61632 2393063 2352235 2312667 2274840 2239604 2207667 2178507 2150192 2121088 2091660 2063901 2039141
61621 2039141 2017219 1997610 1980199 1964808 1951080 1939174 1929568 1921866 1915014 1909170 1906027 1906388 1908653
61608 1908653 1910854 1913004 1915877 1918317 1917748 1913249 1906360 1898592 1889723 1879229 1868051 1857756 1848595
61595 1848595 1839432 1829552 1819831 1811817 1805966 1801164 1796162 1791234 1787853 1786733 1786892 1787043 1787088 1787526 1788024
61580 1788024 1787663 1786457 1785708 1786824 1790474 1796695 1804990 1814432 1824585 1836347 1850978 1868249 1886515
61567 1886515 1904801 1923737 1943890 1963946 1981149 1993189 1999337 2000213 1996863 1989853 1979178 1965231
61555 1965231 1949490 1933439 1916976 1898877 1878962 1858740 1839539 1820945 1801644 1781145 1760224
61544 1760224 1740302 1722650 1707346 1692668 1676484 1658749 1641719 1627175 1614529 1602417 1590929
$$ packed form
61632B393063m0828l9568l7827l5236l1937k9160k8315k9104k9428k7759k4760
61621B039141k1922j9609j7411j5391j3728j1906r606p702o852n844l143L61K265
61608A908653K201K150K873K440n69m499o889p768q869j0494j1178j0295r161
61595A848595r163r880r721q014n851m802n002m928l381j120J59J51M5M38M98
61580A788024l61j206p49J116L650O221Q295R442J0153J1762J4631J7271J8266
61567A886515J8286J8936K0153K0056J7203J2040O148Q76l350p010j0675j3947
61555A965231j5741j6051j6463j8099j9915k0222j9201j8594j9301k0499k0921
61544A760224j9922j7652j5304j4678j6184j7735j7030j4544j2646j2112j1488
$$ plain form
61533 1590929 1581116 1573308 1567312 1563500 1562175 1562348 1562828 1564386 1569235 1578273 1590261 1603935 1619476 1637386
61519 1637386 1657247 1678372 1700896 1725585 1753205 1784471 1819752 1858407 1899186 1941792 1987210
61508 1987210 2035997 2087215 2139832 2194219 2251153 2309916 2368501 2425358 2479798 2530958 2577708
61497 2577708 2619885 2658698 2695515 2730922 2765079 2798072 2829403 2857868 2882672 2904338 2923947
61486 2923947 2941731 2956921 2968708 2976677 2980287 2978632 2971177 2958539 2942243 2923722 2903730 2882687
61474 2882687 2861341 2840922 2822620 2807023 2794169 2784086 2777212 2774287 2776089 2783391 2796929 2817041
61462 2817041 2843309 2874934 2911810 2955130 3006741 3067899 3138806 3219238 3309230 3409048 3519029
61451 3519029 3639946 3773463 3921712 4086132 4266873 4463479 4676136 4906256 5155980
$$ packed form
61533A590929r813p808n996l812j325J73M80J558M849R038J1988J3674J5541J7910
61519A637386J9861K1125K2524K4689K7620L1266L5281L8655M0779M2606M5418
61508A987210M8787N1218N2617N4387N6934N8763N8585N6857N4440N1160M6750
61497B577708M2177L8813L6817L5407L4157L2993L1331K8465K4804K1666J9609
61486B923947J7784J5190J1787P969L610j655p455j2638j6296j8521j9992k1043
61474B882687k1346k0419j8302j5597j2854j0083o874k925J802P302J3538K0112
61462B817041K6268L1625L6876M3320N1611O1158P0907Q0432Q9992R9818J09981
61451C519029J20917J33517J48249J64420J80741J96606K12657K30120K49724
$$ plain form
61442 5155980 5427048 5719815 6032992 6364081 6709819 7065872 7425976 7781417 8121251
61433 8121251 8432866 8702920 8919256 9073427 9162075 9186056 9148711 9055223 8912928 8730950
61423 8730950 8518920 8286084 8041138 7791758 7543670 7300858 7067274 6847923 6647609
61414 6647609 6468843 6311526 6174485 6056799 5957863 5877154 5814289 5768903 5740281 5727480
61404 5727480 5729951 5747536 5779534 5824068 5878730 5941664 6011788 6088115 6169161 6253005 6337836
61393 6337836 6422550 6506906 6590984 6674418 6756314 6836034 6913860 6990792 7067802 7145274 7222879
61382 7222879 7299842 7375502 7449663 7522234 7592603 7659765 7723081 7782353 7836986 7885568 7926587
61371 7926587 7958977 7981668 7993403 7993806 7984051 7965502 7937991 7900490 7853414 7799160 7740270 7678231
$$ packed form
61442E155980K71068K92767L13177L31089L45738L56053L60104L55441L39834
61433H121251L11615K70054K16336J54171Q8648K3981l7345r3488j42295j81978
61423H730950k12030k32836k44946k49380k48088k42812k33584k19351k00314
61414F647609j78766j57317j37041j17686r8936q0709o2865m5386k8622j2801
61404E727480K471J7585L1998M4534N4662O2934P0124P6327Q1046Q3844Q4831
61393F337836Q4714Q4356Q4078Q3434Q1896P9720P7826P6932P7010P7472P7605
61382G222879P6963P5660P4161P2571P0369O7162O3316N9272N4633M8582M1019
61371G926587L2390K2691J1735M03r755j8549k7511l7501m7076n4254n8890o2039
$$ plain form
61359 7678231 7614449 7551142 7490410 7433331 7380894 7334957 7296944 7266045 7240161 7218718 7203283
61348 7203283 7195123 7193453 7196583 7203450 7212872 7222225 7228540 7230964 7231032 7230283 7228603 7225185 7220284 7215545 7213429
61333 7213429 7216981 7229624 7254302 7292823 7346414 7416658 7505553 7615091 7747435 7905059 8089798
61322 8089798 8301835 8540386 8805265 9096676 9413206 9751088 10105914 10474016 10851036
61313 10851036 11229515 11598718 11946556 12260946 12529925 12742318 12889764 12968465 12979072 12925257
61303 12925257 12812356 12646511 12433995 12180615 11891632 11572455 11229672 10871291 10505379
61294 10505379 10138004 9772629 9411687 9058459 8717043 8390731 8080962 7787928 7511850
61285 7511850 7253590 7014308 6794679 6594445 6412903 6249962 6106535 5983613 5880999
$$ packed form
61359G678231o3782o3307o0732n7079n2437m5937l8013l0899k5884k1443j5435
61348G203283q160j670L130O867R422R353O315K424O8p49j680l418m901m739k116
61333G213429L552J2643K4678L8521N3591P0244Q8895J09538J32344J57624J84739
61322H089798K12037K38551K64879K91411L16530L37882L54826L68102L77020
61313A0851036L78479L69203L47838L14390K68979K12393J47446P8701J0607n3815
61303A2925257j12901j65845k12516k53380k88983l19177l42783l58381l65912
61294A0505379l67375l65375l60942l53228l41416l26312l09769k93034k76078
61285G511850k58260k39282k19629k00234j81542j62941j43427j22922j02614
$$ plain form
61276 5880999 5797151 5730166 5678813 5642863 5622585 5617590 5625863 5644424 5671377 5706879 5751466 5803822
61264 5803822 5861072 5921056 5983250 6047328 6111831 6174750 6234701 6290957 6342840 6389707 6431413
61253 6431413 6468388 6501390 6531230 6558376 6582604 6603264 6619862 6631865 6637832 6635539 6623618 6602760
61241 6602760 6574745 6540500 6499567 6451318 6396111 6335116 6269275 6198616 6122677 6041705 5957414
61230 5957414 5872324 5788387 5706605 5627887 5553567 5484687 5421391 5363675 5312502 5269504 5235454
61219 5235454 5209404 5189411 5173869 5162113 5153973 5148963 5146005 5143928 5141988 5139644 5136052 5130379 5122723
61206 5122723 5114281 5106362 5099569 5093933 5089281 5085245 5081640 5079207 5079563 5084072 5093408 5108805 5133028 5169288
61192 5169288 5219488 5284257 5364245 5460324 5572475 5699260 5838399 5987148 6142036 6298786
$$ packed form
61276E880999q3848o6985n1353l5950k0278m995Q273J8561K6953L5502M4587N2356
61264E803822N7250N9984O2194O4078O4503O2919N9951N6256N1883M6867M1706
61253F431413L6975L3002K9840K7146K4228K0660J6598J2003N967k293j1921k0858
61241F602760k8015l4245m0933m8249n5207o0995o5841p0659p5939q0972q4291
61230E957414q5090q3937q1782p8718p4320o8880o3296n7716n1173m2998l4050
61219E235454k6050j9993j5542j1756q140n010k958k077j940k344l592n673p656
61206E122723q442p919o793n636m652m036l605k433L56M509R336J5397K4223L6260
61192E169288N0200O4769P9988R6079J12151J26785J39139J48749J54888J56750
$$ plain form
61182 6298786 6452362 6596299 6722070 6820212 6882722 6904205 6881367 6813037 6701416 6552346
61172 6552346 6373353 6171726 5954557 5729125 5501655 5276002 5054666 4840844 4638296
61163 4638296 4449370 4274548 4114237 3969586 3840726 3725398 3620624 3525296 3440004 3364633
61153 3364633 3297523 3237248 3183964 3138282 3099624 3066664 3039049 3017751 3003743 2997038 2997050 3003151
61141 3003151 3014545 3030169 3049165 3071105 3095341 3120335 3144077 3165039 3182388 3195499 3203818
61130 3203818 3207384 3206984 3203414 3196633 3185891 3170711 3151564 3129440 3104810 3077192 3045834 3010678
61118 3010678 2972352 2931289 2887262 2840057 2790297 2739198 2687514 2635134 2581831 2528080 2474929
61107 2474929 2423277 2373559 2325984 2280577 2236825 2193702 2150438 2107093 2063978 2020855 1977511
$$ packed form
61182F298786J53576J43937J25771R8142O2510K1483k2838o8330j11621j49070
61172F552346j78993k01627k17169k25432k27470k25653k21336k13822k02548
61163D638296j88926j74822j60311j44651j28860j15328j04774r5328q5292p5371
61153C364633o7110o0275n3284m5682l8658l2960k7615k1298j4008o705J2O101
61141C003151J1394J5624J8996K1940K4236K4994K3742K0962J7349J3111Q319
61130C203818L566m00l570o781j0742j5180j9147k2124k4630k7618l1358l5156
61118C010678l8326m1063m4027m7205m9760n1099n1684n2380n3303n3751n3151
61107B474929n1652m9718m7575m5407m3752m3123m3264m3345m3115m3123m3344
$$ plain form
61096 1977511 1935124 1896025 1861466 1830346 1800886 1772778 1746467 1720785 1693070 1662047 1629285
61085 1629285 1597093 1566095 1535696 1505911 1477589 1451466 1428214 1408942 1394346 1383495 1374672
61074 1374672 1367473 1362884 1361191 1361113 1361619 1363566 1368616 1377077 1387567 1398450 1408948 1419136 1429518
61061 1429518 1440690 1453080 1466914 1482398 1499560 1517842 1536303 1554518 1572911 1591925 1611409
61050 1611409 1631108 1651106 1671030 1689322 1704193 1715103 1722424 1725907 1724716 1719259 1711716 1703890
61038 1703890 1695266 1684101 1669991 1654413 1638964 1624058 1609351 1594290 1577847 1558793 1537206
61027 1537206 1515241 1495374 1477913 1460954 1442744 1423305 1403621 1384236 1365326 1347515 1331734
61016 1331734 1318398 1307310 1298267 1291109 1285218 1279687 1274313 1269959 1267567 1267027 1267285 1267449 1267665 1268945
$$ packed form
61096A977511m2387l9099l4559l1120k9460k8108k6311k5682k7715l1023l2762
61085A629285l2192l0998l0399k9785k8322k6123k3252j9272j4596j0851q823
61074A374672p199m589j693p8N06J947N050Q461J0490J0883J0498J0188J0382
61061A429518J1172J2390J3834J5484J7162J8282J8461J8215J8393J9014J9484
61050A611409J9699J9998J9924J8292J4871J0910P321L483j191n457p543p826
61038A703890q624j1165j4110j5578j5449j4906j4707j5061j6443j9054k1587
61027A537206k1965j9867j7461j6959j8210j9439j9684j9385j8910j7811j5781
61016A331734j3336j1088r043p158n891n531n374m354k392n40K58J64K16J280
$$ plain form
61002 1268945 1272119 1276692 1280922 1283499 1285103 1287719 1292344 1298220 1304601 1312140 1321440 1331033 1338378 1342904
60988 1342904 1346658 1351580 1357494 1363689 1371326 1382765 1398750 1417470 1436559 1455170 1474017 1494361
60976 1494361 1517411 1543869 1573231 1603799 1634106 1664327 1695916 1729854 1765701 1802392 1839549
60965 1839549 1877781 1918022 1960820 2006045 2052875 2100198 2147608 2196168 2247691 2302782 2359951
60954 2359951 2417243 2474608 2534091 2597959 2667558 2743918 2828154 2920586 3020579 3128287 3245745
60943 3245745 3375053 3516153 3667818 3830499 4006573 4197764 4403861 4624308 4859599
60934 4859599 5110741 5378971 5666862 5978371 6316765 6683442 7079600 7507878 7971476
60925 7971476 8472934 9015095 9602325 10239825 10933297 11691300 12527514 13459612 14506958
$$ packed form
61002A268945L174M573M230K577J604K616M625N876O381P539R300R593P345M526
60988A342904L754M922N914O195P637J1439J5985J8720J9089J8611J8847K0344
60976A494361K3050K6458K9362L0568L0307L0221L1589L3938L5847L6691L7157
60965A839549L8232M0241M2798M5225M6830M7323M7410M8560N1523N5091N7169
60954B359951N7292N7365N9483O3868O9599P6360Q4236R2432R9993J07708J17458
60943C245745J29308J41100J51665J62681J76074J91191K06097K20447K35291
60934D859599K51142K68230K87891L11509L38394L66677L96158M28278M63598
60925G971476N01458N42161N87230O37500O93472P58003Q36214R32098J047346
$$ plain form
60916 14506958 15690406 17032659 18557430 20290707 22264800 24517630 27085274 30001094
60908 30001094 33305104 37029843 41126057 45364453 49324958 52542353 54726953 55888118
60900 55888118 56276737 56233128 56077396 56067819 56348318 56853927 57266677 57124699 56047081 53912979
60890 53912979 50874862 47236827 43317734 39376659 35593834 32073289 28856341 25946674
60882 25946674 23335288 21010889 18958206 17156745 15583643 14215361 13026902 11992433
60874 11992433 11087699 10290893 9582185 8944873 8367225 7841446 7360593 6917781 6508238
60865 6508238 6130254 5783461 5466948 5178772 4915712 4673190 4446662 4233465 4032465
60856 4032465 3842090 3660249 3486532 3323039 3172079 3033716 2906060 2787166 2676110
$$ packed form
60916A4506958J183448J342253J524771J733277J974093K252830K567644K915820
60908C0001094L304010L724739M096214M238396L960505L217395K184600J161165
60900E5888118L88619m3609j55732r577K80499N05609M12750j41978j077618k134102
60890E3912979l038117l638035l919093l941075l782825l520545l216948k909667
60882B5946674k611386k324399k052683j801461j573102j368282j188459j034469
60874A1992433r04734p96806p08708o37312n77648n25779m80853m42812m09543
60865F508238l77984l46793l16513k88176k63060k42522k26528k13197k01000
60856D032465j90375j81841j73717j63493j50960j38363j27656j18894j11056
$$ plain form
60847 2676110 2572838 2477637 2390491 2310597 2236669 2167722 2103339 2043345 1987723 1936683 1890169
60836 1890169 1847489 1808085 1772461 1741487 1714810 1690805 1668176 1646943 1627904 1611882 1599392
60825 1599392 1590068 1582258 1574015 1564609 1554438 1543585 1531478 1518033 1504043 1490150 1476312 1462385
60813 1462385 1448223 1432995 1415526 1395801 1375196 1354880 1334982 1315692 1297967 1282356 1268055
60802 1268055 1254027 1240382 1227958 1217285 1208744 1203064 1200708 1201149 1203464 1207329 1212743 1219210 1225978
60789 1225978 1233051 1241444 1252534 1267337 1286006 1307641 1330919 1355200 1380629 1407091 1433764 1460080
60777 1460080 1486254 1512262 1536978 1559153 1578701 1596267 1611910 1625051 1635526 1643987 1651428 1658810
60765 1658810 1666828 1675330 1683069 1688567 1691160 1690893 1687827 1682077 1674261 1665292 1655764 1645845 1635427 1623891
$$ packed form
60847B676110j03272r5201q7146p9894p3928o8947o4383n9994n5622n1040m6514
60836A890169m2680l9404l5624l0974k6677k4005k2629k1233j9039j6022j2490
60825A599392r324p810q243r406j0171j0853j2107j3445j3990j3893j3838j3927
60813A462385j4162j5228j7469j9725k0605k0316j9898j9290j7725j5611j4301
60802A268055j4028j3645j2424j0673q541n680k356M41K315L865N414O467O768
60789A225978P073Q393J1090J4803J8669K1635K3278K4281K5429K6462K6673K6316
60777A460080K6174K6008K4716K2175J9548J7566J5643J3141J0475Q461P441P382
60765A658810Q018Q502P739N498K593k67l066n750p816q969r528r919j0418j1536
$$ plain form
60751 1623891 1610252 1594264 1577007 1559634 1541797 1522285 1501104 1479823 1459739 1440718 1422376
60740 1422376 1405495 1391372 1380105 1370394 1361098 1352390 1345205 1340118 1337290 1337228 1340827 1348345 1358832
60727 1358832 1370976 1384241 1398730 1414283 1430372 1446784 1463677 1480835 1497442 1512821 1526921
60716 1526921 1539950 1551933 1562751 1572268 1580556 1588436 1597500 1608716 1621170 1633216 1644805 1657373
60704 1657373 1671291 1684930 1696901 1707750 1718439 1728452 1736741 1743649 1750482 1757807 1765421 1773389
60692 1773389 1781648 1788953 1793727 1795959 1797062 1798016 1798871 1799950 1801961 1804557 1806113 1805545 1803425 1800754 1797510
60677 1797510 1793009 1787046 1780067 1772618 1765021 1757239 1748726 1738786 1727360 1715194 1703056 1691142 1679342
60664 1679342 1667743 1656678 1646487 1637209 1628292 1618798 1608311 1597480 1587120 1576985 1566044 1553828
$$ packed form
60751A623891j3639j5988j7257j7373j7837j9512k1181k1281k0084j9021j8342
60740A422376j6881j4123j1267r711r296q708p185n087k828o2L599P518J0487
60727A358832J2144J3265J4489J5553J6089J6412J6893J7158J6607J5379J4100
60716A526921J3029J1983J0818R517Q288P880R064J1216J2454J2046J1589J2568
60704A657373J3918J3639J1971J0849J0689J0013Q289O908O833P325P614P968
60692A773389Q259P305M774K232J103R54Q55J079K011K596J556n68k120k671l244
60677A797510m501n963o979p449p597p782q513r940j1426j2166j2138j1914j1800
60664A679342j1599j1065j0191r278q917r494j0487j0831j0360j0135j0941j2216
$$ plain form
60652 1553828 1540800 1527470 1513991 1500706 1488234 1476802 1466198 1456705 1449322 1444634 1441963 1440003
60640 1440003 1437940 1435847 1434486 1434787 1436869 1439490 1441244 1442351 1444153 1446523 1447103 1443936 1437628 1429610
60626 1429610 1419345 1405061 1386883 1367205 1347688 1327675 1306372 1284969 1265200 1246812 1228186
60615 1228186 1209233 1192106 1178774 1169042 1161506 1155490 1151337 1149454 1149940 1152808 1157773 1163887 1169997
60602 1169997 1175530 1180461 1184809 1188863 1193622 1199998 1207424 1214125 1219149 1223405 1228318 1234251 1240834 1248136
60588 1248136 1256499 1265549 1274275 1282158 1289577 1297021 1304435 1311510 1318179 1324673 1331348 1338711 1347516 1358571
60574 1358571 1372264 1388239 1405813 1424951 1446506 1470918 1496910 1522285 1546084 1569098 1592051
60563 1592051 1614316 1634927 1653803 1671211 1686881 1700560 1712629 1722998 1730168 1732739 1731412 1727960
$$ packed form
60652A553828j3028j3330j3479j3285j2472j1432j0604r493p383m688k671j960
60640A440003k063k093j361L01K082K621J754J107J802K370N80l167o308q018
60626A429610j0265j4284j8178j9678j9517k0013k1303k1403j9769j8388j8626
60615A228186j8953j7127j3332r732p536o016m153j883M86K868M965O114O110
60602A169997N533M931M348M054M759O376P426O701N024M256M913N933O583P302
60588A248136Q363R050Q726P883P419P444P414P075O669O494O675P363Q805J1055
60574A358571J3693J5975J7574J9138K1555K4412K5992K5375K3799K3014K2953
60563A592051K2265K0611J8876J7408J5670J3679J2069J0369P170K571j327l452
$$ plain form
60551 1727960 1722484 1713396 1700355 1685565 1671439 1658254 1645044 1631775 1619621 1609603 1601902 1596156
60539 1596156 1591671 1587384 1582316 1576131 1569115 1561696 1554161 1546603 1538957 1531350 1524510 1519435 1516373 1514510
60525 1514510 1512984 1511960 1512392 1514976 1519633 1525734 1532257 1537725 1540581 1540226 1537833 1535842 1536300 1539509 1544293
60510 1544293 1549412 1554426 1559266 1563553 1566683 1568235 1568047 1566134 1562791 1558354 1552669 1545330 1536861 1528986
60496 1528986 1523027 1518494 1514038 1509414 1505726 1504112 1505107 1509023 1515912 1525248 1536615 1550647 1568302
60483 1568302 1589325 1612648 1638454 1668509 1704041 1744530 1789234 1838808 1894426 1955991 2022094
60472 2022094 2091103 2161245 2229728 2292605 2345726 2385763 2410748 2420244 2415293 2398249 2372742 2343254
60460 2343254 2313803 2286746 2263309 2245197 2234838 2233910 2242463 2259628 2284181 2314163 2347233 2382272
$$ packed form
60551A727960n476r088j3041j4790j4126j3185j3210j3269j2154j0018p701n746
60539A596156m485m287n068o185p016p419p535p558p646p607o840n075l062j863
60525A514510j526j024M32K584M657O101O523N468K856l55k393j991M58L209M784
60510A544293N119N014M840M287L130J552j88j913l343m437n685p339q469p875
60496A528986n959m533m456m624l688j614R95L916O889R336J1367J4032J7655
60483A568302K1023K3323K5806L0055L5532M0489M4704M9574N5618O1565O6103
60472B022094O9009P0142O8483O2877N3121M0037K4985R496m951j7044k5507k9488
60460B343254k9451k7057k3437j8112j0359r28Q553J7165K4553K9982L3070L5039
$$ plain form
60448 2382272 2419706 2459550 2500257 2540725 2582513 2628622 2680530 2737952 2801354 2873041 2955378
60437 2955378 3049303 3155282 3274779 3409963 3562499 3733469 3924251 4136709 4372344 4631682
60427 4631682 4914914 5223248 5559303 5925744 6323528 6752099 7211222 7700841 8216465
60418 8216465 8743186 9254314 9716317 10095694 10363236 10496078 10480374 10314692 10011285 9593659
60408 9593659 9091907 8537850 7960703 7383738 6823305 6290403 5792776 5335295 4919306
60399 4919306 4543248 4204661 3901337 3630705 3389354 3174023 2982517 2812902 2662240
60390 2662240 2527040 2404815 2294505 2195546 2107234 2028734 1958730 1894918 1834770 1777107 1722324
60379 1722324 1671009 1623182 1578988 1538943 1502749 1468772 1435706 1404340 1376711 1353578 1333556
$$ packed form
60448B382272L7434L9844M0707M0468M1788M6109N1908N7422O3402P1687Q2337
60437B955378R3925J05979J19497J35184J52536J70970J90782K12458K35635K59338
60427D631682K83232L08334L36055L66441L97784M28571M59123M89619N15624
60418H216465N26721N11128M62003L79377K67542J32842j5704j65682l03407m17626
60408I593659n01752n54057n77147n76965n60433n32902m97627m57481m15989
60399D919306l76058l38587l03324k70632k41351k15331j91506j69615j50662
60390B662240j35200j22225j10310r8959q8312p8500p0004o3812o0148n7663n4783
60379A722324n1315m7827m4194m0045l6194l3977l3066l1366k7629k3133k0022
$$ plain form
60368 1333556 1314769 1296648 1279857 1264996 1251907 1240126 1229572 1220520 1213042 1206738 1201118 1195988
60356 1195988 1191252 1186624 1181945 1177663 1174567 1173042 1172916 1173944 1176022 1178866 1181912 1184704 1187082 1188993
60342 1188993 1190498 1192025 1194301 1197875 1202826 1208752 1214754 1219716 1223202 1226087 1229829 1235102 1241497 1248366
60328 1248366 1255377 1262296 1268902 1275104 1280595 1284454 1285743 1284563 1281861 1278148 1273103 1266614 1259552 1253275
60314 1253275 1248823 1246485 1245550 1244483 1242178 1239133 1236753 1235529 1234786 1234176 1234353 1235937 1238877 1243117 1248836
60299 1248836 1255485 1261585 1266108 1269378 1272188 1274930 1278074 1282527 1288734 1296076 1303801 1311924 1320692 1329875
60285 1329875 1339138 1348447 1357653 1366449 1375224 1384966 1395544 1404899 1410917 1413583 1414669 1415853 1417755 1420151
60271 1420151 1422432 1424302 1426425 1429821 1434450 1439415 1444802 1451792 1460260 1467925 1473097 1476797 1480603 1483744
$$ packed form
60368A333556j8787j8121j6791j4861j3089j1781j0554r052p478o304n620n130
60356A195988m736m628m679m282l096j525j26J028K078K844L046K792K378J911
60342A188993J505J527K276L574M951N926O002M962L486K885L742N273O395O869
60328A248366P011O919O606O202N491L859J289j180k702l713n045o489p062o277
60314A253275m452k338r35j067k305l045k380j224p43o10J77J584K940M240N719
60299A248836O649O100M523L270K810K742L144M453O207P342P725Q123Q768R183
60285A329875R263R309R206Q796Q775R742J0578R355O018K666J086J184J902K396
60271A420151K281J870K123L396M629M965N387O990Q468P665N172L700L806L141
$$ plain form
60257 1483744 1484237 1481913 1478158 1473211 1465982 1456533 1446760 1438294 1431356 1425932 1422511 1421098 1420820 1421161 1422661
60242 1422661 1425872 1430334 1434889 1438492 1440729 1442262 1444700 1449290 1455807 1463344 1471688 1480866 1489819 1497147
60228 1497147 1503187 1509891 1518337 1527583 1536347 1544537 1552630 1560696 1568754 1577251 1586584 1596763 1607852
60215 1607852 1620068 1633145 1646429 1659975 1674741 1691274 1708998 1727456 1747598 1771151 1798954
60204 1798954 1830371 1864194 1899919 1938247 1980373 2026732 2076730 2130024 2187520 2250436 2318937
60193 2318937 2392590 2471791 2557577 2650279 2749619 2856002 2970419 3093102 3223720 3362973
60183 3362973 3512199 3670961 3836799 4008293 4186620 4372672 4563861 4755359 4943653
60174 4943653 5127201 5304073 5470884 5624384 5762849 5885272 5990058 6075256 6139900 6184775
$$ packed form
60257A483744M93k324l755m947p229r449r773q466o938n424l421j413k78L41J500
60242A422661L211M462M555L603K237J533K438M590O517P537Q344R178Q953P328
60228A497147O040O704Q446R246Q764Q190Q093Q066Q058Q497R333J0179J1089
60215A607852J2216J3077J3284J3546J4766J6533J7724J8458K0142K3553K7803
60204A798954L1417L3823L5725L8328M2126M6359M9998N3294N7496O2916O8501
60193B318937P3653P9201Q5786R2702R9340J06383J14417J22683J30618J39253
60183C362973J49226J58762J65838J71494J78327J86052J91189J91498J88294
60174D943653J83548J76872J66811J53500J38465J22423J04786Q5198O4644M4875
$$ plain form
60164 6184775 6211714 6222127 6216357 6194819 6159864 6116077 6068429 6020368 5973851 5930755 5893802
60153 5893802 5866314 5851326 5850677 5864742 5893302 5936891 5997138 6075771 6173612 6290470 6425320
60142 6425320 6576154 6740005 6913444 7092907 7274681 7455157 7631258 7799905 7956705
60133 7956705 8095971 8212863 8305313 8373296 8416432 8432947 8421208 8381934 8318633 8235812 8136891
60122 8136891 8024178 7900909 7772617 7645716 7524931 7412882 7312068 7226138 7158769 7112073
60112 7112073 7086784 7083473 7102862 7145046 7208868 7292136 7392313 7506960 7633334 7767328 7903113
60101 7903113 8034506 8156848 8267291 8363690 8444123 8507560 8553960 8583276 8595140 8590267 8571971
60090 8571971 8545974 8518861 8496457 8482825 8480358 8491171 8518479 8566138 8636996 8732619 8854704
$$ packed form
60164F184775K6939J0413n770k1538l4955m3787m7648m8061m6517m3096l6953
60153E893802k7488j4988o49J4065K8560M3589O0247P8633R7841J16858J34850
60142F425320J50834J63851J73439J79463J81774J80476J76101J68647J56800
60133G956705J39266J16892R2450O7983M3136J6515j1739l9274o3301q2821r8921
60122H136891j12713j23269j28292j26901j20785j12049j00814q5930o7369m6696
60112G112073k5289l311J9389M2184O3822Q3268J00177J14647J26374J33994J35785
60101G903113J31393J22342J10443R6399Q0433O3437M6400K9316J1864m873j8296
60090H571971k5997k7113k2404j3632k467J0813K7308M7659P0858R5623J22085
$$ plain form
60079 8854704 9005593 9186880 9398671 9641217 9916494 10227126 10574125 10956704 11374005
60070 11374005 11825891 12311843 12829785 13376115 13946015 14533068 15128728 15722795 16304850
60061 16304850 16865330 17395037 17883814 18320642 18696063 19004485 19243301 19409644 19498759
60052 19498759 19505861 19428954 19269691 19032525 18724011 18352678 17928858 17464401 16972416 16466635
60042 16466635 15960333 15465567 14993038 14551904 14149271 13790035 13477379 13213340 12999281
60033 12999281 12836399 12725523 12665527 12652138 12679432 12742681 12838458 12961332 13101693 13247788
60023 13247788 13389272 13518231 13627882 13711907 13765145 13784288 13767991 13716798 13632566 13517232
60013 13517232 13372142 13198862 13000239 12780228 12543079 12293033 12034154 11769633 11501425
$$ packed form
60079H854704J50889J81287K11791K42546K75277L10632L46999L82579M17301
60070A1374005M51886M85952N17942N46330N69900N87053N95660N94067N82055
60061A6304850N60480N29707M88777M36828L75421L08422K38816J66343Q9115
60052A9498759P102p6907j59263k37166l08514l71333m23820m64457m91985n05781
60042A6466635n06302m94766m72529m41134m02633l59236l12656k64039k14059
60033A2999281j62882j10876n9996j3389K7294O3249R5777J22874J40361J46095
60023A3247788J41484J28959J09651Q4025N3238J9143j6297n1193q4232j15334
60013A3517232j45090j73280j98623k20011k37149k50046k58879k64521k68208
$$ plain form
60004 11501425 11231284 10962232 10698814 10446135 10208741 9989827 9790965 9612848 9456589
59995 9456589 9324028 9216715 9135339 9080432 9052809 9052723 9079385 9131874 9209711 9311681 9434827
59984 9434827 9575431 9730105 9894761 10063173 10228097 10383645 10525279 10647698 10744465 10810400
59974 10810400 10843451 10843671 10811210 10745878 10648115 10519787 10364363 10186726 9992587 9787710
59964 9787710 9577645 9367976 9164147 8970720 8791001 8627624 8483214 8360190 8260024
59955 8260024 8183086 8129427 8099647 8094856 8115942 8163274 8237311 8338891 8468272 8624079 8803921
59944 8803921 9005964 9229099 9471398 9729024 9996425 10266463 10530173 10777982 11002377
59935 11002377 11198925 11364232 11494033 11584365 11633817 11643205 11613353 11544487 11437918 11297404
$$ packed form
60004A1501425k70141k69052k63418k52679k37394k18914j98862j78117j56259
59995I456589j32561j07313q1376n4907k7623q6K6662N2489P7837J01970J23146
59984I434827J40604J54674J64656J68412J64924J55548J41634J22419R6767O5935
59974A0810400L3051K20l2461o5332r7763j28328j55424j77637j94139k04877
59964I787710k10065k09669k03829j93427j79719j63377j44410j23024j00166
59955H260024p6938n3659k9780m791K1086M7332P4037J01580J29381J55807J79842
59944H803921K02043K23135K42299K57626K67401K70038K63710K47809K24395
59935A1002377J96548J65307J29801R0332M9452R388k9852o8866j06569j40514
$$ plain form
59925 11297404 11128759 10938788 10734472 10522377 10308609 10099510 9901750 9720789 9559588
59916 9559588 9419907 9304752 9218216 9162636 9137041 9139100 9167829 9223707 9306687 9414965 9545427
59905 9545427 9694454 9858102 10032165 10212717 10396575 10580890 10762193 10936212 11099071
59896 11099071 11248615 11384362 11506299 11614085 11707376 11786638 11853930 11913437 11970974 12032072
59886 12032072 12100390 12178642 12271074 12384149 12524569 12697457 12906707 13155986 13448698 13787537
59876 13787537 14174490 14610411 15093939 15621383 16187878 16787488 17411179 18045125 18671396
59867 18671396 19269592 19817723 20293418 20676290 20949624 21100487 21120675 21009549 20775206
59858 20775206 20431492 19994383 19481836 18914816 18315155 17701817 17090292 16494564 15927094
$$ packed form
59925A1297404j68645j89971k04316k12095k13768k09099j97760j80961j61201
59916I559588j39681j15155q6536n5580k5595K059K8729N5878Q2980J08278J30462
59905I545427J49027J63648J74063J80552J83858J84315J81303J74019J62859
59896A1099071J49544J35747J21937J07786R3291P9262O7292N9507N7537O1098
59886A2032072O8318P8252R2432J13075J40420J72888K09250K49279K92712L38839
59876A3787537L86953M35921M83528N27444N66495N99610O23691O33946O26271
59867A8671396N98196N48131M75695L82872K73334J50863K0188j11126k34343
59858B0775206l43714m37109n12547n67020n99661o13338o11525n95728n67470
$$ plain form
59849 15927094 15396680 14908493 14466782 14075935 13738580 13454616 13223187 13044363 12918122
59840 12918122 12842904 12816161 12835499 12898485 13001901 13141766 13313382 13510762 13726360 13951553
59830 13951553 14176623 14389951 14578041 14727085 14824619 14860247 14826366 14719195 14538941 14288854
59820 14288854 13974701 13605154 13191541 12746177 12280706 11805576 11330044 10862140 10408980
59811 10408980 9976997 9571133 9193767 8845377 8526471 8238009 7979809 7749785 7545419
59802 7545419 7365039 7206852 7067570 6942950 6829280 6723474 6622210 6522257 6422127 6322937
59792 6322937 6227325 6137484 6054151 5977147 5906625 5843633 5789399 5744252 5707320 5676904 5650683
59781 5650683 5625631 5598200 5564869 5522881 5471181 5411019 5345032 5275150 5201896 5126296 5051714
$$ packed form
59849A5927094n30414m88187m41711l90847l37355k83964k31429j78824j26241
59840A2918122p5218k6743J9338O2986J03416J39865J71616J97380K15598K25193
59830A3951553K25070K13328J88090J49044R7534L5628l3881j07171j80254k50087
59820A4288854l14153l69547m13613m45364m65471m75130m75532m67904m53160
59811A0408980m31983m05864l77366l48390l18906k88462k58200k30024k04366
59802G545419j80380j58187j39282j24620j13670j05806j01264r9953j00130r9190
59792F322937r5612q9841q3333p7004p0522o2992n4234m5147l6932l0416k6221
59781E650683k5052k7431l3331m1988n1700o0162o5987o9882p3254p5600p4582
$$ plain form
59770 5051714 4982602 4921756 4869782 4826862 4793665 4770555 4757272 4753811 4760675 4778147 4806417 4846650
59758 4846650 4900649 4968787 5049098 5138842 5236034 5338935 5445066 5551818 5657822 5763135
59748 5763135 5868274 5973129 6076165 6174149 6262954 6339096 6400599 6446882 6478834 6499349 6513151
59737 6513151 6525469 6540756 6562259 6592080 6631732 6683353 6750343 6836137 6942467 7069708 7218884
59726 7218884 7392366 7592611 7821414 8080734 8373305 8702040 9069534 9478088 9928816
59717 9928816 10419822 10945319 11495716 12056302 12604647 13110460 13539953 13862211 14054698
59708 14054698 14107516 14025753 13827682 13539025 13187425 12799834 12400842 12010138 11641104 11302420
59698 11302420 11000298 10738522 10517679 10336435 10193989 10090763 10027073 10001911 10012881 10056870
$$ packed form
59770E051714o9112o0846n1974m2920l3197k3110j3283l461O864J7472K8270M0233
59758D846650N3999O8138Q0311Q9744R7192J02901J06131J06752J06004J05313
59748E763135J05139J04855J03036R7984Q8805P6142O1503M6283L1952K0515J3802
59737F513151J2318J5287K1503K9821L9652N1621O6990Q5794J06330J27241J49176
59726G218884J73482K00245K28803K59320K92571L28735L67494M08554M50728
59717I928816M91006N25497N50397N60586N48345N05813M29493L22258J92487
59708A4054698N2818q1763j98071k88657l51600l87591l98992l90704l69034l38684
59698A1302420l02122k61776k20843j81244j42446j03226o3690k5162J0970M3989
$$ plain form
59688 10056870 10131293 10235370 10369956 10535768 10732408 10959523 11218068 11509491 11834192
59679 11834192 12191713 12582271 13007487 13469910 13972331 14517284 15106712 15742286 16426187
59670 16426187 17161069 17949120 18791633 19689282 20641432 21644591 22692479 23777803 24892322
59661 24892322 26024238 27157159 28273496 29358782 30402565 31397581 32341019 33236791
59653 33236791 34094917 34928359 35750983 36577294 37421366 38294418 39203039 40148572 41126406
59644 41126406 42125557 43129718 44118587 45067737 45948836 46733307 47397899 47927300 48312910
59635 48312910 48551927 48649111 48618432 48481644 48264805 47995397 47700768 47407217 47139408 46919869
59625 46919869 46768335 46701340 46732689 46874168 47135549 47524404 48046598 48706550 49505941 50441902
$$ packed form
59688A0056870P4423J04077J34586J65812J96640K27115K58545K91423L24701
59679A1834192L57521L90558M25216M62423N02421N44953N89428O35574O83901
59670A6426187P34882P88051Q42513Q97649R52150J003159J047888J085324J114519
59661B4892322J131916J132921J116337J085286J043783R95016R43438Q95772
59653C3236791Q58126Q33442Q22624Q26311Q44072Q73052R08621R45533R77834
59644D1126406R99151J004161R88869R49150Q81099P84471O64592N29401L85610
59635D8312910K39017R7184l0679j36788k16839k69408k94629k93551k67809k19539
59625D6919869j51534o6995L1349J41479K61381L88855N22194O59952P99391R35961
$$ plain form
59615 50441902 51506645 52687895 53967773 55320144 56708891 58087887 59401412 60585200
59607 60585200 61570222 62289677 62686744 62721122 62374125 61651554 60582511 59214235 57605710
59598 57605710 55822055 53929283 51988983 50054144 48167049 46358559 44647897 43042817
59590 43042817 41539486 40121581 38760670 37421201 36069752 34683385 33252869 31781693
59582 31781693 30283732 28780065 27294157 25846912 24454332 23127989 21876129 20704019
59574 20704019 19614117 18606565 17679539 16829397 16051309 15340277 14691495 14099779 13559403
59565 13559403 13065169 12613549 12202283 11828862 11489950 11182398 10904172 10653606 10427865
59556 10427865 10222704 10033850 9858238 9693675 9537628 9386717 9237516 9087582 8935421
$$ packed form
59615E0441902J064743J181250J279878J352371J388747J378996J313525J183788
59607F0585200R85022P19455L97067L4378l46997p22571j069043j368276j608525
59598E7605710j783655j892772j940300j934839j887095j808490j710662j605080
59590D3042817j503331j417905j360911j339469j351449j386367j430516j471176
59582C1781693j497961j503667j485908j447245j392580j326343j251860j172110
59574B0704019j089902j007552r27026q50142p78088p11032o48782n91716n40376
59565A3559403m94234m51620m11266l73421l38912l07552k78226k50566k25741
59556A0427865k05161j88854j75612j64563j56047j50911j49201j49934j52161
$$ plain form
59547 8935421 8779366 8617024 8446640 8269165 8088197 7907352 7728228 7551450 7378840
59538 7378840 7213320 7056969 6910435 6774353 6650134 6539073 6441616 6357790 6287363 6229333
59528 6229333 6182418 6146573 6123057 6112521 6113955 6125893 6147360 6177050 6213121 6254874 6303226
59517 6303226 6357965 6415691 6472345 6527377 6583876 6645007 6711916 6784752 6863961 6950409 7045689
59506 7045689 7152402 7272744 7406719 7553196 7712891 7888759 8083124 8296129 8527747
59497 8527747 8779754 9054512 9352913 9674683 10020007 10389672 10784086 11202942 11645191
59488 11645191 12108279 12587761 13078689 13577130 14079363 14579785 15070800 15545208 15998197
59479 15998197 16426977 16829373 17203318 17547111 17859343 18138532 18383349 18593638 18771368
$$ packed form
59547H935421j56055j62342j70384j77475j80968j80845j79124j76778j72610
59538G378840j65520j56351j46534j36082j24219j11061r7457q3826p0427n8030
59528F229333m6915l5845k3516j0536J434J1938K1467K9690L6071M1753M8352
59517F303226N4739N7726N6654N5032N6499O1131O6909P2836P9209Q6448R5280
59506G045689J06713J20342J33975J46477J59695J75868J94365K13005K31618
59497H527747K52007K74758K98401L21770L45324L69665L94414M18856M42249
59488A1645191M63088M79482M90928M98441N02233N00422M91015M74408M52989
59479A5998197M28780M02396L73945L43793L12232K79189K44817K10289J77730
$$ plain form
59470 18771368 18920779 19047787 19159101 19261424 19360934 19463183 19573208 19695272 19831799
59461 19831799 19981966 20140867 20299607 20446052 20565946 20644412 20667351 20622250 20498662 20289300
59451 20289300 19991480 19607536 19143673 18608529 18012678 17368749 16691068 15994673 15294185
59442 15294185 14602878 13932154 13291505 12688477 12128065 11612227 11140732 10712897 10328298
59433 10328298 9986046 9684320 9421019 9194258 9002000 8841990 8712542 8612725 8541417 8496996
59423 8496996 8478542 8486449 8521111 8581820 8667817 8779485 8917292 9080278 9267011 9477638
59413 9477638 9713517 9974917 10260456 10568702 10898599 11247490 11609617 11977034 12341076
59404 12341076 12692375 13020259 13313102 13559322 13748240 13870834 13920439 13892898 13786580 13603261
$$ packed form
59470A8771368J49411J27008J11314J02323R9510J02249J10025J22064J36527
59461A9831799J50167J58901J58740J46445J19894P8466K2939m5101j23588k09362
59451B0289300k97820l83944m63863n35144n95851o43929o77681o96395p00488
59442A5294185o91307o70724o40649o03028n60412n15838m71495m27835l84599
59433A0328298l42252l01726k63301k26761j92258j60010j29448r9817p1308m4421
59423H496996j8454P907L4662O0709Q5997J11668J37807J62986J86733K10627
59413I477638K35879K61400K85539L08246L29897L48891L62127L67417L64042
59404A2341076L51299L27884K92843K46220J88918J22594M9605k7541j06318j83319
$$ plain form
59394 13603261 13349265 13034787 12671110 12268329 11835582 11382543 10919727 10457144 10002850
59385 10002850 9562680 9140998 8741415 8366470 8016733 7690938 7387737 7107302 6850774
59376 6850774 6618370 6408773 6220332 6051949 5902428 5769837 5652416 5549841 5462652 5390249
59366 5390249 5330136 5279739 5238648 5208399 5190046 5182661 5184450 5194529 5212863 5239099 5272547 5313140
59354 5313140 5361515 5418224 5483793 5559093 5643916 5734799 5825927 5913413 5998142 6084167 6175723
59343 6175723 6276506 6390261 6520312 6668911 6837777 7028131 7238990 7466535 7707010
59334 7707010 7960012 8228050 8514116 8821730 9156809 9526873 9937495 10390652 10886883
59325 10886883 11427944 12017048 12657548 13351688 14099565 14898624 15744145 16629591 17545532
$$ packed form
59394A3603261k53996l14478l63677m02781m32747m53039m62816m62583m54294
59385A0002850m40170m21682l99583l74945l49737l25795l03201k80435k56528
59376F850774k32404k09597j88441j68383j49521j32591j17421j02575q7189p2403
59366E390249o0113n0397m1091l0249j8353p385J789J0079J8334K6236L3448M0593
59354E313140M8375N6709O5569P5300Q4823R0883R1128Q7486Q4729Q6025R1556
59343F175723J00783J13755J30051J48599J68866J90354K10859K27545K40475
59334G707010K53002K68038K86066L07614L35079L70064M10622M53157M96231
59325A0886883N41061N89104O40500O94140P47877P99059Q45521Q85446R15941
$$ plain form
59316 17545532 18478523 19412140 20329250 21213107 22047794 22820186 23522268 24150781 24704760
59307 24704760 25184500 25592418 25932751 26209488 26425190 26581523 26679098 26716063 26688006 26590136
59297 26590136 26419265 26174155 25855693 25467770 25017572 24514855 23971472 23400922 22816177
59288 22816177 22226444 21635982 21045709 20454852 19861250 19261832 18653924 18035978 17407624
59279 17407624 16770657 16130403 15494656 14870521 14262890 13675810 13113620 12580028 12077365
59270 12077365 11607579 11172904 10774746 10412728 10085500 9791741 9529937 9298186 9094838
59261 9094838 8918561 8767463 8639300 8533144 8449657 8388925 8348950 8327130 8322336 8334763 8364548
59250 8364548 8411311 8474082 8550723 8638147 8734146 8838433 8950901 9069274 9189348 9307074
$$ packed form
59316A7545532R32991R33617R17110Q83857Q34687P72392P02082O28513N53979
59307B4704760M79740M07918L40333K76737K15702J56333R7575L6965k8057r7870
59297B6590136j70871k45110l18462l87923m50198n02717n43383n70550n84745
59288B2816177n89733n90462n90273n90857n93602n99418o07908o17946o28354
59279A7407624o36967o40254o35747o24135o07631n87080n62190n33592n02663
59270A2077365m69786m34675l98158l62018l27228k93759k61804k31751k03348
59261I094838j76277j51098j28163j06156q3487o0732l9975k1820m794J2427K9785
59250H364548M6763O2771P6641Q7424R5999J04287J12468J18373J20074J17726
$$ plain form
59240 9307074 9419369 9523189 9615123 9692368 9753573 9798462 9827194 9840677 9841543 9834140 9822816
59229 9822816 9810100 9797167 9786233 9781655 9788234 9809383 9847575 9905250 9983845 10082831 10201358
59218 10201358 10340151 10499855 10677894 10868974 11068430 11272851 11477387 11674958 11858898
59209 11858898 12024394 12166695 12280334 12361692 12410939 12430279 12421423 12385468 12323720 12237759 12130319
59198 12130319 12007258 11877379 11749151 11628382 11519052 11424052 11343826 11276076 11218398 11169952
59188 11169952 11129723 11095063 11063414 11033774 11005006 10974747 10942143 10910173 10883181 10863479 10852631
59177 10852631 10854697 10875419 10918841 10987240 11083972 11213857 11380720 11586736 11834234 12125972
59167 12125972 12463070 12844142 13266528 13726565 14217805 14729639 15247426 15752826 16224645
$$ packed form
59240I307074J12295J03820R1934P7245O1205M4889K8732J3483Q66p403j1324
59229I822816j2716j2933j0934m578O579K1149L8192N7675P8595R8986J18527
59218A0201358J38793J59704J78039J91080J99456K04421K04536J97571J83940
59209A1858898J65496J42301J13639Q1358M9247J9340q856l5955o1748q5961j07440
59198A2130319j23061j29879j28228j20769j09330r5000q0226o7750n7678m8446
59188A1169952m0229l4660l1649k9640k8768l0259l2604l1970k6992j9702j0848
59177A0852631K066K0722M3422O8399R6732J29885J66863K06016K47498K91738
59167A2125972L37098L81072M22386M60037M91240N11834N17787N05400M71819
$$ plain form
59158 16224645 16641481 16984644 17238394 17388573 17423345 17336086 17126751 16800729 16367796 15842200
59148 15842200 15241942 14586758 13896552 13190636 12486391 11797662 11134682 10505062 9913866
59139 9913866 9363262 8853678 8385502 7958759 7571626 7220904 6903937 6618556 6361282
59130 6361282 6127662 5915114 5723779 5553649 5402171 5265769 5142480 5031761 4932556 4843202
59120 4843202 4763183 4693618 4635501 4588147 4549757 4519034 4495692 4479729 4471065 4470196 4478338 4496022
59108 4496022 4521757 4553052 4588864 4630405 4679575 4737508 4804578 4880471 4963833 5053098 5148362
59097 5148362 5251316 5362601 5480487 5603304 5732019 5868912 6014320 6166010 6321327
59088 6321327 6478677 6637110 6795433 6951487 7101586 7241184 7367048 7478373 7575071 7655672
$$ packed form
59158A6224645M16836L43163K53750J50179L4772q7259k09335l26022m32933n25596
59148A5842200o00258o55184o90206p05916p04245o88729o62980o29620n91196
59139I913866n50604n09584m68176m26743l87133l50722l16967k85381k57274
59130F361282k33620k12548j91335j70130j51478j36402j23289j10719r9205q9354
59120D843202q0019o9565n8117m7354l8390l0723k3342j5963q664q69Q142J7684
59108D496022K5735L1295L5812M1541M9170N7933O7070P5893Q3362Q9265R5264
59097E148362J02954J11285J17886J22817J28715J36893J45408J51690J55317
59088F321327J57350J58433J58323J56054J50099J39598J25864J11325R6698Q0601
$$ plain form
59078 7655672 7717875 7760549 7784295 7790858 7783139 7765108 7740417 7711468 7680731 7652085 7629672 7616240
59066 7616240 7613873 7625429 7653564 7699235 7763077 7847737 7956739 8091186 8249509 8430512 8634633
59055 8634633 8861931 9110876 9380038 9669531 9979775 10309558 10655837 11014620 11381326
59046 11381326 11750373 12114347 12463486 12786691 13073838 13316593 13506616 13634696 13693905
59037 13693905 13683447 13608031 13474028 13287912 13057573 12792113 12499024 12182757 11846420 11493512
59027 11493512 11127563 10751480 10368071 9980462 9591686 9204537 8821979 8446914 8081567
59018 8081567 7727677 7386875 7060009 6746719 6446934 6162281 5894632 5643751 5407881
59009 5407881 5186179 4978826 4785212 4604079 4435325 4279569 4135795 4001472 3875406
$$ packed form
59078G655672O2203M2674K3746O563p719j8031k4691k8949l0737k8646k2413j3432
59066G616240k367J1556K8135M5671O3842Q4660J09002J34447J58323J81003K04121
59055H634633K27298K48945K69162K89493L10244L29783L46279L58783L66706
59046A1381326L69047L63974L49139L23205K87147K42755J90023J28080N9209
59037A3693905j0458p5416j34003j86116k30339k65460k93089l16267l36337l52908
59027A1493512l65949l76083l83409l87609l88776l87149l82558l75065l65347
59018H081567l53890l40802l26866l13290k99785k84653k67649k50881k35870
59009E407881k21702k07353j93614j81133j68754j55756j43774j34323j26066
$$ plain form
59000 3875406 3758420 3650776 3550927 3457595 3371267 3292565 3220475 3153023 3088666 3026578 2966742
58989 2966742 2910102 2857280 2806953 2757014 2707707 2661955 2622085 2587783 2557694 2531217 2507965
58978 2507965 2487197 2468825 2453639 2441721 2431984 2424026 2419055 2418201 2421242 2427669 2437482 2450165 2464374
58965 2464374 2479513 2496107 2513709 2530078 2543499 2554363 2563204 2568849 2570215 2568703 2567079 2566829 2568130
58952 2568130 2571489 2577543 2585676 2594527 2603982 2615497 2630308 2648109 2667351 2686089 2702514 2715277
58940 2715277 2723716 2728057 2729637 2730387 2731183 2730956 2728485 2724746 2722085 2721270 2721201 2721699 2724520 2730942 2740336 2752022
58924 2752022 2766632 2784399 2803937 2824294 2846729 2872732 2901481 2931018 2961104 2993271 3028751
58913 3028751 3067916 3111171 3158884 3210578 3265280 3322400 3381541 3442179 3504572 3570327 3640991
$$ packed form
59000C875406j16986j07644r9849r3332q6328p8702p2090o7452o4357o2088n9836
58989B966742n6640n2822n0327m9939m9307m5752l9870l4302l0089k6477k3252
58978B507965k0768j8372j5186j1918r737p958m971q54L041O427R813J2683J4209
58965B464374J5139J6594J7602J6369J3421J0864Q841N645J366j512j624k50J301
58952B568130L359O054Q133Q851R455J1515J4811J7801J9242J8738J6425J2763
58940B715277Q439M341J580P50P96k27k471l739k661q15o9M98K821O422R394J1686
58924B752022J4610J7767J9538K0357K2435K6003K8749K9537L0086L2167L5480
58913C028751L9165M3255M7713N1694N4702N7120N9141O0638O2393O5755P0664
$$ plain form
58902 3640991 3716473 3795618 3877676 3962328 4049052 4137562 4228445 4322530 4420203 4521999 4629060
58891 4629060 4742225 4861510 4987300 5121031 5263731 5415034 5574864 5745068 5928036
58882 5928036 6124545 6334486 6558886 6799502 7056859 7330458 7620781 7929610 8258378
58873 8258378 8607729 8979059 9375342 9799980 10255537 10743827 11266566 11825603 12422874
58864 12422874 13060499 13741146 14468311 15245665 16075187 16956005 17886082 18864914 19892956
58855 19892956 20967724 22081515 23223047 24379139 25533259 26663498 27743264 28743206
58847 28743206 29632073 30378162 30953006 31334726 31508515 31466656 31210721 30753263 30115424
58838 30115424 29322482 28401573 27381345 26290741 25157208 24005929 22858799 21732187
$$ packed form
58902C640991P5482P9145Q2058Q4652Q6724Q8510R0883R4085R7673J01796J07061
58891D629060J13165J19285J25790J33731J42700J51303J59830J70204J82968
58882E928036J96509K09941K24400K40616K57357K73599K90323L08829L28768
58873H258378L49351L71330L96283M24638M55557M88290N22739N59037N97271
58864A2422874O37625O80647P27165P77354Q29522Q80818R30077R78832J028042
58855A9892956J074768J113791J141532J156092J154120J130239J079766R99942
58847B8743206Q88867P46089N74844L81720J73789m1859k55935m57458o37839
58838C0115424p92942r20909j020228j090604j133533j151279j147130j126612
$$ plain form
58830 21732187 20636703 19580895 18574219 17624565 16734265 15901378 15124581 14404308 13739416
58821 13739416 13125726 12558508 12034111 11548552 11096887 10675274 10282103 9916036 9574329
58812 9574329 9254105 8954165 8674532 8415133 8175668 7955765 7754370 7569641 7400154
58803 7400154 7245533 7105332 6978108 6862396 6758054 6665908 6586503 6519848 6465965 6424783
58793 6424783 6395510 6376858 6368319 6370987 6386794 6416815 6460488 6516658 6585160 6667006 6763128 6873587
58781 6873587 6998255 7137732 7293095 7465003 7653217 7856834 8075105 8308649 8559902
58772 8559902 8831648 9125078 9440150 9777705 10139862 10528034 10942261 11383501 11855241
58763 11855241 12361704 12905523 13488417 14113009 14782460 15498904 16263725 17078760 17945798
$$ packed form
58830B1732187j095484j055808j006676r49654q90300q32887p76797p20273o64892
58821A3739416o13690n67218n24397m85559m51665m21613l93171l66067l41707
58812I574329l20224k99940k79633k59399k39465k19903k01395j84729j69487
58803G400154j54621j40201j27224j15712j04342r2146p9405o6655n3883m1182
58793F424783k9273j8652q539K668J5807L0021M3673N6170O8502Q1846R6122J10459
58781F873587J24668J39477J55363J71908J88214K03617K18271K33544K51253
58772H559902K71746K93430L15072L37555L62157L88172M14227M41240M71740
58763A1855241N06463N43819N82894O24592O69451P16444P64821Q15035Q67038
$$ plain form
58754 17945798 18865040 19834945 20852561 21911972 23002154 24107286 25208837 26285957
58746 26285957 27313868 28263362 29102828 29801221 30330684 30668840 30800432 30718046 30422957
58737 30422957 29926422 29249214 28418093 27461783 26409272 25289374 24129183 22952449 21779691
58728 21779691 20628739 19513576 18443122 17422553 16455601 15544777 14690334 13890741 13144059
58719 13144059 12447930 11799112 11194648 10633051 10112835 9630286 9180253 8758834 8363852
58710 8363852 7993204 7644603 7316752 7009051 6720142 6448282 6192930 5954198 5730896
58701 5730896 5521033 5324304 5142028 4974234 4818779 4674000 4540326 4418333 4306818
58692 4306818 4204027 4109646 4024298 3947614 3877718 3812378 3750392 3692240 3639369 3592219 3548996
$$ packed form
58754A7945798R19242R69905J017616J059411J090182J105132J101551J077120
58746B6285957J027911R49494Q39466O98393N29463L38156J31592q2386k95089
58737C0422957m96535o77208q31121r56310j052511j119898j160191j176734j172758
58728B1779691j150952j115163j070454j020569r66952r10824q54443p99593p46682
58719A3144059o96129o48818o04464n61597n20216m82549m50033m21419l94982
58710H363852l70648l48601l27851l07701k88909k71860k55352k38732k23302
58701E730896k09863j96729j82276j67794j55455j44779j33674j21993j11515
58692D306818j02791r4381q5348p6684o9896o5340o1986n8152n2871m7150m3223
$$ plain form
58681 3548996 3507187 3465959 3425941 3386729 3346153 3302406 3255741 3207613 3159112 3110569 3061699
58670 3061699 3011672 2959916 2907295 2855737 2806298 2758219 2709982 2660529 2609311 2556131 2501488
58659 2501488 2446560 2392476 2339733 2288116 2236802 2184974 2133074 2083055 2036644 1993863 1954113
58648 1954113 1917825 1885509 1855733 1825958 1795477 1765850 1738308 1712438 1687822 1665218 1645217
58637 1645217 1627013 1609389 1592039 1575202 1558878 1543149 1528689 1516341 1506529 1499197 1493772 1489065
58625 1489065 1483998 1478570 1473427 1468368 1462110 1453795 1444037 1434277 1425744 1419124 1414559 1411680 1410051 1409670
58611 1409670 1410814 1413734 1418789 1426141 1434744 1442483 1448491 1454612 1463274 1474425 1485946 1496639 1507079
58598 1507079 1517625 1527312 1535102 1541094 1546284 1552106 1560079 1570827 1583554 1597604 1614149 1634894
$$ packed form
58681C548996m1809m1228m0018l9212m0576m3747m6665m8128m8501m8543m8870
58670C061699n0027n1756n2621n1558m9439m8079m8237m9453n1218n3180n4643
58659B501488n4928n4084n2743n1617n1314n1828n1900n0019m6411m2781l9750
58648A954113l6288l2316k9776k9775l0481k9627k7542k5870k4616k2604k0001
58637A645217j8204j7624j7350j6837j6324j5729j4460j2348r812p332n425m707
58625A489065n067n428n143n059o258q315r758r760q533o620m565k879j629l81
58611A409670J144K920N055P352Q603P739O008O121Q662J1151J1521J0693J0440
58598A507079J0546R687P790N992N190N822P973J0748J2727J4050J6545K0745
$$ plain form
58586 1634894 1659521 1686223 1714826 1747488 1785802 1828881 1875001 1923758 1975848 2031943 2092693
58575 2092693 2159091 2231972 2311388 2396746 2487450 2583652 2686791 2798986 2921422 3053989
58565 3053989 3197166 3353168 3524091 3710052 3910723 4127688 4363254 4617669 4889679
58556 4889679 5179353 5487806 5813853 6152858 6498785 6844888 7181775 7496830 7776538
58547 7776538 8008368 8180867 8284690 8315218 8273546 8164774 7996524 7778746 7522716 7239093
58537 7239093 6937483 6627192 6316458 6010791 5713712 5428993 5160297 4908888 4674059
58528 4674059 4456043 4256218 4074217 3907406 3754070 3614904 3490500 3379382 3279558 3190195
58518 3190195 3110829 3040493 2978394 2923973 2875780 2831779 2791025 2753351 2717381 2681112 2644797
$$ packed form
58586A634894K4627K6702K8603L2662L8314M3079M6120M8757N2090N6095O0750
58575B092693O6398P2881P9416Q5358R0704R6202J03139J12195J22436J32567
58565C053989J43177J56002J70923J85961K00671K16965K35566K54415K72010
58556D889679K89674L08453L26047L39005L45927L46103L36887L15055K79708
58547G776538K31830J72499J03823L0528m1672j08772j68250k17778k56030k83623
58537G239093l01610l10291l10734l05667k97079k84719k68696k51409k34829
58528D674059k18016j99825j82001j66811j53336j39166j24404j11118r9824q9363
58518C190195p9366p0336o2099n4421m8193m4001m0754l7674l5970l6269l6315
$$ plain form
58507 2644797 2610859 2580329 2551610 2523322 2495784 2468752 2440295 2409108 2375592 2339377 2298196
58496 2298196 2250967 2200073 2149034 2099607 2052450 2008641 1968836 1932412 1898976 1869468 1844647
58485 1844647 1823773 1805616 1789249 1773247 1756048 1737960 1720726 1704255 1686039 1664818 1642328
58474 1642328 1620072 1596942 1571792 1545996 1521343 1497399 1472971 1448414 1424634 1401505 1379027
58463 1379027 1358132 1338497 1317561 1293925 1269989 1248930 1230814 1214047 1198978 1187101 1177617
58452 1177617 1167710 1156229 1145083 1136990 1133136 1132688 1133436 1133478 1133123 1134510 1138860 1145388 1153267 1162697 1173225
58437 1173225 1183248 1192485 1202768 1214991 1227660 1240187 1255001 1273835 1294059 1311401 1324854
58426 1324854 1336334 1347046 1356880 1366155 1375188 1382860 1387996 1391333 1394007 1395000 1392375 1386306 1378694 1370338
$$ packed form
58507B644797l3938l0530k8719k8288k7538k7032k8457l1187l3516l6215m1181
58496B298196m7229n0894n1039m9427m7157m3809l9805l6424l3436k9508k4821
58485A844647k0874j8157j6367j6002j7199j8088j7234j6471j8216k1221k2490
58474A642328k2256k3130k5150k5796k4653k3944k4428k4557k3780k3129k2478
58463A379027k0895j9635k0936k3636k3936k1059j8116j6767j5069j1877r484
58452A177617r907j1481j1146q093l854m48P48M2l55J387M350O528P879R430J0528
58437A173225J0023R237J0283J2223J2669J2527J4814J8834K0224J7342J3453
58426A324854J1480J0712R834R275R033P672N136L337K674R93k625o069p612q356
$$ plain form
58412 1370338 1360359 1347783 1332047 1312870 1291274 1269730 1249600 1229575 1208259 1186816 1167165
58401 1167165 1149222 1132254 1117474 1106554 1098551 1091018 1083499 1077479 1073538 1070968 1069749 1070488 1072670
58388 1072670 1075023 1077407 1080579 1084650 1089559 1096421 1106475 1119153 1132976 1147834 1164656 1183375
58376 1183375 1202830 1222109 1240522 1256998 1270947 1282852 1292717 1299126 1301379 1301272 1301088 1301129 1300944 1301407
58362 1301407 1303423 1305970 1307732 1309656 1313658 1319816 1326865 1334374 1342275 1349397 1354792 1359709 1366059 1373760
58348 1373760 1381461 1388825 1396029 1402163 1406273 1409096 1411749 1413574 1412997 1409357 1402340 1391370 1377522 1364174
58334 1364174 1353379 1343269 1331405 1318843 1308155 1299270 1290344 1281310 1273467 1266674 1259965 1254000 1250166
58321 1250166 1248139 1246715 1245907 1245909 1245557 1244352 1244286 1246946 1250683 1253654 1257737 1266098 1278566 1292812 1308309
$$ packed form
58412A370338r979j2576j5736j9177k1596k1544k0130k0025k1316k1443j9651
58401A167165j7943j6968j4780j0920q003p533p519o020l941k570j219P39K182
58388A072670K353K384L172M071M909O862J0054J2678J3823J4858J6822J8719
58376A183375J9455J9279J8413J6476J3949J1905R865O409K253j07j84M1j85M63
58362A301407K016K547J762J924M002O158P049P509P901P122N395M917O350P701
58348A373760P701P364P204O134M110K823K653J825n77l640p017j0970j3848j3348
58334A364174j0795j0110j1864j2562j0688q885q926r034p843o793o709n965l834
58321A250166k027j424q08Kl52j205o6K660L737K971M083Q361J2468J4246J5497
$$ plain form
58306 1308309 1325544 1343028 1359120 1375412 1394309 1414488 1432717 1449028 1465982 1483866 1500872
58295 1500872 1517281 1535168 1554440 1573171 1591401 1610588 1629622 1645293 1656607 1665087 1671111 1673491
58283 1673491 1672352 1669152 1664425 1658608 1654033 1652573 1652457 1651111 1649859 1651953 1657332 1663699 1671432 1682763
58269 1682763 1697072 1711832 1727503 1746708 1769164 1792157 1815477 1841082 1868309 1894312 1919058
58258 1919058 1945308 1974004 2004141 2036427 2072167 2109065 2143116 2174062 2204057 2231884 2254097
58247 2254097 2271324 2287677 2304273 2319115 2333093 2349971 2370247 2390835 2411005 2432893 2456239
58236 2456239 2478845 2502404 2531492 2566254 2602329 2638515 2677994 2721320 2764884 2807651 2853140
58225 2853140 2903381 2956717 3012511 3072109 3134506 3197362 3262981 3336743 3418827 3504172 3591326
$$ packed form
58306A308309J7235J7484J6092J6292J8897K0179J8229J6311J6954J7884J7006
58295A500872J6409J7887J9272J8731J8230J9187J9034J5671J1314Q480O024K380
58283A673491j139l200m727n817m575j460j16j346j252K094N379O367P733J1331
58269A682763J4309J4760J5671J9205K2456K2993K3320K5605K7227K6003K4746
58258A919058K6250K8696L0137L2286L5740L6898L4051L0946K9995K7827K2213
58247B254097J7227J6353J6596J4842J3978J6878K0276K0588K0170K1888K3346
58236B456239K2606K3559K9088L4762L6075L6186L9479M3326M3564M2767M5489
58225B853140N0241N3336N5794N9598O2397O2856O5619P3762Q2084Q5345Q7154
$$ plain form
58214 3591326 3684093 3783253 3884012 3983330 4082854 4183030 4281299 4377881 4476595 4578485 4681311
58203 4681311 4786418 4898982 5020419 5147913 5282194 5427950 5585757 5752147 5928641
58194 5928641 6121803 6332973 6557173 6793605 7047408 7319126 7602598 7895847 8203919
58185 8203919 8528209 8863363 9208111 9569072 9950701 10351719 10774264 11225417 11706044
58176 11706044 12209250 12733542 13286422 13871946 14487327 15135813 15829811 16576479 17373317
58167 17373317 18222893 19138334 20128674 21192293 22329964 23549736 24853430 26234118
58159 26234118 27693699 29247590 30906485 32671787 34556801 36593648 38809753 41215175
58151 41215175 43820712 46647381 49708337 53004601 56552080 60392563 64568374 69112142
$$ packed form
58214C591326R2767R9160J00759R9318R9524J00176R8269R6582R8714J01890J02826
58203D681311J05107J12564J21437J27494J34281J45756J57807J66390J76494
58194E928641J93162K11170K24200K36432K53803K71718K83472K93249L08072
58185H203919L24290L35154L44748L60961L81629M01018M22545M51153M80627
58176A1706044N03206N24292N52880N85524O15381O48486O93998P46668P96838
58167A7373317Q49576R15441R90340J063619J137671J219772J303694J380688
58159B6234118J459581J553891J658895J765302J885014K036847K216105K405422
58151D1215175K605537K826669L060956L296264L547479L840483M175811M543768
$$ plain form
58143 69112142 74075130 79539708 85592122 92316558 99835514 108323943 117964017 128920087
58135 128920087 141373931 155536951 171608223 189797767 210468611 234242248 261931045
58128 261931045 294336149 331857615 373683176 416748218 455499918 483422885 495771029
58121 495771029 491560588 473404670 445693280 412741266 377884533 343346041 310379728
58114 310379728 279534730 251008649 224916045 201348562 180331628 161816241 145691477
58107 145691477 131770665 119798996 109517205 100711657 93196851 86787026 81313783
58100 81313783 76649784 72693126 69349289 66548856 64263035 62481998 61197727 60428939
58092 60428939 60242015 60716861 61893687 63757453 66234872 69146593 72141536 74707972
$$ packed form
58143F9112142M962988N464578O052414O724436P518956Q488429R640074J0956070
58135A28920087J2453844J4163020J6071272J8189544K0670844K3773637K7688797
58128B61931045L2405104L7521466M1825561M3065042L8751700K7922967J2348144
58121D95771029m210441j8155918k7711390l2952014l4856733l4538492l2966313
58114C10379728l0844998k8526081k6092604k3567483k1016934j8515387j6124764
58107A45691477j3920812j1971669j0281791q805548p514806o409825n473243
58100H1313783m663999l956658l343837k800433k285821j781037j284271p68788
58092F0428939j86924M74846J176826J863766K477419K911721K994943K566436
$$ plain form
58084 74707972 76299113 76506236 75179723 72444313 68618620 64093712 59233797 54327522
58076 54327522 49576414 45101252 40963147 37191900 33801163 30785535 28120181 25773618
58068 25773618 23717006 21919394 20344457 18959472 17741333 16668361 15712975 14848466
58060 14848466 14057128 13326233 12641930 11993131 11376498 10792038 10237698 9712218 9217893
58051 9217893 8755468 8320463 7908602 7520526 7157523 6817432 6498363 6201204 5924312
58042 5924312 5660618 5404234 5155603 4916718 4686521 4465090 4257084 4066077 3889541
58033 3889541 3723615 3568658 3425899 3292851 3166454 3047010 2934971 2827653 2723155
58024 2723155 2623808 2531699 2444353 2358661 2275462 2196422 2120102 2045109 1973733 1908405 1847690
$$ packed form
58084G4707972J591141K07123j326513k735410l825693m524908m859915m906275
58076E4327522m751108m475162m138105l771247l390737l015628k665354k346563
58068B5773618k056612j797612j574937j384985j218139j072972r55386q64509
58060A4848466p91338p30895o84303o48799o16633n84460n54340n25480m94325
58051I217893m62425m35005m11861l88076l63003l40091l19069k97159k76892
58042E924312k63694k56384k48631k38885k30197k21431k08006j91007j76536
58033C889541j65926j54957j42759j33048j26397j19444j12039j07318j04498
58024B723155r9347r2109q7346q5692q3199p9040p6320p4993p1376o5328o0715
$$ plain form
58013 1847690 1789513 1734961 1685237 1638248 1592166 1549068 1511038 1475811 1440437 1406266 1376126
58002 1376126 1349181 1322733 1296731 1272575 1249741 1227374 1207009 1190026 1174472 1157845 1140935
57991 1140935 1125556 1110739 1094616 1077894 1062045 1046116 1028832 1011899 997910 986710 976862
57980 976862 968683 962796 957762 952261 947564 944884 942632 939433 937368 938623 941167 941475 939540 937429
57966 937429 934955 930995 927446 927474 930670 933873 936153 939192 943237 946351 947789 948956 950732 952258 952482
57951 952482 951077 948079 944137 940420 937019 932582 926623 920322 913861 905718 896572 890708 890455 891846
57937 891846 889437 883179 876680 870651 862502 851379 839277 827421 815335 803541 793818 786595 780824
57924 780824 776399 774204 773966 774562 776193 779948 785528 791551 797537 803481 808296 810986 812541 814294 815350
$$ packed form
58013A847690n8177n4552m9724m6989m6082m3098l8030l5227l5374l4171l0140
58002A376126k6945k6448k6002k4156k2834k2367k0365j6983j5554j6627j6910
57991A140935j5379j4817j6123j6722j5849j5929j7284j6933j3989j1200r848
57980I76862q179n887n034n501m697k680k252l199k065J255K544L08j935k111
57966I37429k474l960l549K8L196L203K280L039M045L114J438J167J776J526K24
57951I52482j405k998l942l717l401m437n959o301o461q143r146n864k53J391
57937H91846k409o258o499o029q149j1123j2102j1856j2086j1794r723p223n771
57924G80824m425k195k38N96J631L755N580O023N986N944M815K690J555J753J056
$$ plain form
57909 815350 814157 811691 810351 810386 810037 808496 806068 802151 795838 788014 780284 772445 763640 755115 748856
57894 748856 744067 738111 730438 722580 714726 705742 696517 689808 686323 684018 681789 680909 682156 684291
57880 684291 686257 688425 690787 692058 691324 688701 683996 676870 668654 661689 656128 649421 639626 627379
57866 627379 614153 600632 587530 576004 566220 556909 547223 537983 530736 526580 525936 528206 531775
57853 531775 535669 540924 548886 558612 567772 575745 583813 592462 600699 608150 615758 624050 632453 640481
57839 640481 648076 654938 661209 668305 676906 684627 688213 687887 686775 686030 683563 678034 670913 663534 655044
57824 655044 644817 634410 625336 616874 607734 598247 589413 581410 574570 570353 569639 571016 572231 572623
57810 572623 573153 574818 578025 582750 588479 594484 600507 606528 611974 616477 621409 628910 638883 648610
$$ packed form
57909H15350j193k466j340L5l49j541k428l917o313p824p730p839q805q525o259
57894G48856m789n956p673p858p854q984r225o709l485k305k229q80J247K135
57880F84291J966K168K362J271p34k623m705p126q216o965n561o707r795j2247
57866F27379j3226j3521j3102j1526r784r311r686r240p247m156o44K270L569
57853E31775L894N255P962R726R160P973Q068Q649Q237P451P608Q292Q403Q028
57839F40481P595O862O271P096Q601P721L586l26j112p45k467n529p121p379q490
57824F55044j0227j0407r074q462r140r487q834q003o840m217p14J377J215L92
57810E72623N30J665L207M725N729O005O023O021N446M503M932P501R973R727
$$ plain form
57796 648610 655891 660841 663935 664362 661754 657990 655477 654368 652722 648832 642511 634694 626558 618528
57782 618528 609823 599732 589464 581429 576234 571794 566088 559409 553068 547190 540907 533646 525152 515112
57768 515112 503726 491994 480678 469760 459438 450557 443150 435576 426173 415159 404081 393927
57756 393927 384341 374146 362270 348989 336608 327775 322606 318599 313961 309673 307419 306876 306385 305295
57742 305295 304260 303815 303979 304972 307281 311129 316434 323014 330533 338840 348665 361068 375712 390623
57728 390623 404176 416240 426805 434928 440127 443554 446366 447921 447083 444535 442061 439971 436914 432090
57714 432090 426033 419132 410986 401811 393239 386833 382448 378697 374616 370350 366414 362811 359084 355107
57700 355107 351663 350019 350852 353727 357642 361943 366693 372414 379446 387350 394988 401510 407114 412524
$$ packed form
57796F48610P281M950L094M27k608l764k513j109j646l890o321p817q136q030
57782F18528q705j0091j0268q035n195m440n706o679o341n878o283p261q494j0040
57768E15112j1386j1732j1316j0918j0322q881p407p574r403j1014j1078j0154
57756C93927r586j0195j1876j3281j2381q833n169m007m638m288k254n43m91j090
57742C05295j035m45J64R93K309L848N305O580P519Q307R825J2403J4644J4911
57728C90623J3553J2064J0565Q123N199L427K812J555q38k548k474k090l057m824
57714D32090o057o901q146r175q572o406m385l751m081m266l936l603l727l977
57700C55107l444j644Q33K875L915M301M750N721P032P904P638O522N604N410
$$ plain form
57686 412524 417975 423262 428577 434527 441395 449099 457788 467614 477900 487458 495923 504039 512542 521626
57672 521626 531546 542714 554971 567774 581417 597103 615471 635957 657840 680906 704836 729193
57660 729193 754480 782071 812503 844905 878539 913685 950391 987773 1025568 1065213 1108335
57649 1108335 1155117 1205170 1258912 1316835 1378226 1442041 1508610 1579455 1655717 1737686 1825431
57638 1825431 1919152 2019451 2127858 2246338 2375456 2513842 2660501 2816963 2986335 3171089
57628 3171089 3372780 3592819 3831757 4088147 4359526 4644159 4940490 5244881 5550720
57619 5550720 5849177 6129609 6379885 6588427 6746940 6851244 6900635 6898202 6851468 6770797
57609 6770797 6666440 6547679 6423839 6302935 6186978 6068752 5934417 5770467 5570171
$$ packed form
57686D12524N451N287N315N950O868P704Q689R826J0286R558Q465Q116Q503R084
57672E21626R920J1168J2257J2803J3643J5686J8368K0486K1883K3066K3930K4357
57660G29193K5287K7591L0432L2402L3634L5146L6706L7382L7795L9645M3122
57649A108335M6782N0053N3742N7923O1391O3815O6569P0845P6262Q1969Q7745
57638A825431R3721J00299J08407J18480J29118J38386J46659J56462J69372J84754
57628C171089K01691K20039K38938K56390K71379K84633K96331L04391L05839
57619E550720K98457K80432K50276K08542J58513J04304M9391k433m6734q0671
57609F770797j04357j18761j23840j20904j15957j18226j34335j63950k00296
$$ plain form
57600 5570171 5336149 5078614 4810930 4545440 4291749 4056679 3843979 3653985 3484892
57591 3484892 3335204 3204766 3093728 3001308 2925629 2864084 2813920 2773478 2743242 2724964 2719408
57580 2719408 2725432 2741351 2766477 2801084 2845614 2900468 2966133 3043061 3131593 3232225 3345799
57569 3345799 3473341 3615895 3774320 3948792 4138381 4341444 4556314 4781074 5012512
57560 5012512 5245500 5473189 5687249 5877928 6034725 6147741 6209039 6213725 6160946 6054205
57550 6054205 5900188 5706863 5482495 5235764 4975571 4710009 4445514 4186882 3937597
57541 3937597 3699988 3475518 3265274 3070121 2890316 2725163 2573196 2432776 2302692
57532 2302692 2182401 2071680 1970036 1876680 1790985 1712576 1640860 1575007 1514603 1459785 1410329
$$ packed form
57600E570171k34022k57535k67684k65490k53691k35070k12700j89994j69093
57591C484892j49688j30438j11038r2420p5679o1545n0164m0442l0236j8278n556
57580B719408O024J5919K5126L4607M4530N4854O5665P6928Q8532J00632J13574
57569C345799J27542J42554J58425J74472J89589K03063K14870K24760K31438
57560E012512K32988K27689K14060J90679J56797J13016O1298M686n2779j06741
57550F054205j54017j93325k24368k46731k60193k65562k64495k58632k49285
57541C937597k37609k24470k10244j95153j79805j65153j51967j40420j30084
57532B302692j20291j10721j01644r3356q5695p8409p1716o5853o0404n4818m9456
$$ plain form
57521 1410329 1365094 1322818 1282986 1245582 1210647 1178611 1150257 1125482 1102687 1080407 1059126
57510 1059126 1040545 1025420 1013258 1003805 997478 994208 993075 993470 995716 1000192 1006713 1015141 1025877
57497 1025877 1039261 1055014 1072722 1092546 1115245 1141697 1172404 1206981 1244239 1283332 1324845
57486 1324845 1370225 1420189 1474242 1531719 1592631 1657519 1727178 1802571 1884396 1972770 2067981
57475 2067981 2171447 2285004 2409181 2543061 2686026 2838635 3001387 3173373 3352428
57466 3352428 3535646 3719008 3896886 4062303 4207396 4323878 4404358 4444314 4442803 4401358
57456 4401358 4322936 4212066 4074930 3918273 3748369 3571094 3392130 3216261 3046689 2885286
57446 2885286 2733189 2591034 2459424 2339561 2232736 2138702 2055249 1980048 1912414 1852799
$$ packed form
57521A410329m5235m2276l9832l7404l4935l2036k8354k4775k2795k2280k1281
57510A059126j8581j5125j2162r453o327l270j133L95K246M476O521Q428J0736
57497A025877J3384J5753J7708J9824K2699K6452L0707L4577L7258L9093M1513
57486A324845M5380M9964N4053N7477O0912O4888O9659P5393Q1825Q8374R5211
57475B067981J03466J13557J24177J33880J42965J52609J62752J71986J79055
57466C352428J83218J83362J77878J65417J45093J16482Q0480L9956j511m1445
57456D401358p8422j10870j37136j56657j69904j77275j78964j75869j69572j61403
57446B885286j52097j42155j31610j19863j06825r4034q3453p5201o7634n9615
$$ plain form
57436 1852799 1801280 1757408 1720947 1691800 1669353 1652731 1641659 1636361 1636569 1641292 1649761 1662325
57424 1662325 1680316 1705112 1737114 1775422 1818718 1866661 1920273 1980951 2049563 2126599 2212582
57413 2212582 2307918 2412790 2527585 2652846 2788345 2932659 3084003 3240680 3399910 3556641
57403 3556641 3704378 3836883 3948387 4032623 4082926 4093749 4061976 3987486 3873700 3727628
57393 3727628 3558105 3373066 3178375 2978788 2778955 2583066 2394190 2214375 2044935
57384 2044935 1886312 1738171 1600271 1473163 1357776 1254324 1161675 1077626 999852 927067
57374 927067 859535 798157 742798 691769 643194 596526 552356 510993 471969 434998 400577
57363 400577 369076 339762 311611 284967 261214 240403 220271 198740 176752 157304 141799
$$ packed form
57436A852799n1519m3872l6461k9147k2447j6622j1072n298K08M723Q469J2564
57424A662325J7991K4796L2002L8308M3296M7943N3612O0678O8612P7036Q5983
57413B212582R5336J04872J14795J25261J35499J44314J51344J56677J59230J56731
57403C556641J47737J32505J11504Q4236N0303J0823l1773p4490j13786j46072
57393C727628j69523j85039j94691j99587j99833j95889j88876j79815j69440
57384B044935j58623j48141j37900j27108j15387j03452r2649q4049p7774p2785
57374I27067o7532o1378n5359n1029m8575m6668m4170m1363l9024l6971l4421
57363D00577l1501k9314k8151k6644k3753k0811k0132k1531k1988j9448j5505
$$ plain form
57352 141799 128795 116642 105811 97567 91395 85125 77346 68533 59824 51622 43571 35190 26226
57339 26226 16838 7696 -263 -6284 -10131 -12374 -14538 -18234 -23570 -28848 -32595 -35408 -38889 -43131 -46604
57324 -46604 -48670 -50892 -55120 -61052 -66522 -69802 -71084 -72008 -74329 -78914 -85455 -92903 -100286 -107117 -113238
57309 -113238 -118638 -123579 -128550 -133883 -139521 -145157 -150369 -154623 -157582 -159618 -161729 -164744 -168701 -173062
57295 -173062 -177269 -181160 -185114 -189841 -195690 -202166 -208454 -214271 -219710 -224424 -227888 -230675 -234422 -239827
57281 -239827 -245405 -249023 -250270 -250522 -251137 -252528 -254771 -257921 -261472 -264392 -266166 -267255 -268225 -268959 -269025 -268237
57265 -268237 -266499 -263728 -260478 -257989 -256718 -255131 -250867 -243214 -233707 -224263 -215527 -207193 -198985 -190682
57251 -190682 -181827 -172226 -162365 -152549 -141808 -128525 -112283 -94467 -76840 -59976 -43199 -25556
$$ packed form
57352A41799j3004j2153j0831q244o172o270p779q813q709q202q051q381q964
57339B6226r388G696b63o021l847k243k164l696n336n278l747k813l481m242l473
57324d6604k066k222m228n932n470l280j282r24k321m585o541p448p383o831o121
57309a13238n400m941m971n333n638n636n212m254k959k036k111l015l957m361
57295a73062m207l891l954m727n849o476o288n817n439m714l464k787l747n405
57281b39827n578l618j247k52o15j391k243l150l551k920j774j089r70p34o6P88
57265b68237J738K771L250K489J271J587M264P653R507R444Q736Q334Q208Q303
57251a90682Q855R601R861R816J0741J3283J6242J7816J7627J6864J6777J7643
$$ plain form
57239 -25556 -6546 13738 34926 56908 80146 105153 131771 159461 188261 218930 251969 287149
57227 287149 324173 363110 403772 445310 487089 529398 572569 615680 656848 694745 729309
57216 729309 760996 789848 815307 836572 853063 864611 871086 871950 866674 855636 839948 820112
57204 820112 795691 766840 735318 703131 670859 638270 605986 575376 547150 521114 497126
57193 497126 475374 456079 440047 429078 424369 424607 427053 430528 435939 443833 453131 462631 472127
57180 472127 481317 489138 495194 500576 506354 512361 518526 526397 538108 554467 575061 599593 628162
57167 628162 660751 697268 737619 780909 825094 868114 908871 946597 980213 1009231 1034531
57156 1034531 1057343 1078252 1098253 1120153 1147771 1184226 1231789 1292387 1366837 1454185 1553181
$$ packed form
57239b5556f546A3738K1188K1982K3238K5007K6618K7690K8800L0669L3039L5180
57227B87149L7024L8937M0662M1538M1779M2309M3171M3111M1168L7897L4564
57216G29309L1687K8852K5459K1265J6491J1548O475Q64n276j1038j5688j9836
57204H20112k4421k8851l1522l2187l2272l2589l2284l0610k8226k6036k3988
57193D97126k1752j9295j6032j0969m709K38K446L475N411P894R298R500R496
57180D72127R190P821O056N382N778O007O165P871J1711J6359K0594K4532K8569
57167F28162L2589L6517M0351M3290M4185M3020M0757L7726L3616K9018K5300
57156A034531K2812K0909K0001K1900K7618L6455M7563O0598P4450Q7348R8996
$$ plain form
57145 1553181 1663720 1785233 1914155 2045025 2174280 2301383 2425943 2545434 2656530
57136 2656530 2757606 2849226 2933063 3010997 3084702 3155517 3224872 3294747 3367080 3442498 3520144
57125 3520144 3598878 3678322 3758735 3840242 3922113 4002598 4079624 4151745 4217881 4276257 4324898
57114 4324898 4363741 4394971 4420325 4439419 4451878 4459535 4464697 4467625 4468091 4468336 4471550 4477616 4483228
57101 4483228 4486494 4488660 4490616 4490379 4485526 4476206 4464328 4451172 4436985 4421765 4405283 4387139 4367507
57088 4367507 4346997 4325290 4300661 4270689 4232044 4179346 4106015 4007156 3881101 3728514 3551575
57077 3551575 3353646 3137408 2902703 2647772 2372563 2078772 1766693 1434736 1082443
57068 1082443 711149 320627 -92341 -530969 -996291 -1489015 -2011161 -2565169 -3154137 -3784052
$$ packed form
57145A553181J10539J21513J28922J30870J29255J27103J24560J19491J11096
57136B656530J01076R1620Q3837P7934P3705P0815O9355O9875P2333P5418P7646
57125C520144P8734P9444Q0413Q1507Q1871Q0485P7026P2121O6136N8376M8641
57114D324898L8843L1230K5354J9094J2459P657N162K928M66K45L214O066N612
57101D483228L266K166J956k37m853r320j1878j3156j4187j5220j6482j8144j9632
57088D367507k0510k1707k4629k9972l8645n2698p3331r8859j26055j52587j76939
57077C551575j97929k16238k34705k54931k75209k93791l12079l31957l52293
57068A082443l71294C20627i2341m38628m65322m92724n22146n54008n88968o29915
$$ plain form
57058 -3784052 -4463117 -5197933 -5993407 -6857540 -7802976 -8842540 -9986963 -11249031 -12646644
57049 -12646644 -14200263 -15931416 -17865865 -20034052 -22465873 -25189109 -28235080 -31640568
57041 -31640568 -35441014 -39667173 -44352188 -49537349 -55270026 -61606403 -68622176 -76408601
57033 -76408601 -85042331 -94554933 -104927801 -116105840 -128023709 -140651907 -154012320
57026 -154012320 -168047050 -182345952 -196017973 -208045781 -218039638 -226772242 -235891252
57019 -235891252 -246881361 -260024515 -274105441 -286982604 -296530273 -301343426 -300924390
57012 -300924390 -295465308 -285520012 -271786983 -255041345 -236126922 -215921497 -195261404
57005 -195261404 -174860728 -155259085 -136812525 -119724325 -104093631 -89952757 -77282976
$$ packed form
57058c784052o79065p34816p95474q64133r45436j039564j144423j262068j397613
57049a2646644j553619j731153j934449k168187k431821k723236l045971l405488
57041c1640568l800446m226159m685015n185161n732677o336377p015773p786425
57033g6408601q633730r512602j0372868j1178039j1917869j2628198j3360413
57026a54012320j4034730j4298902j3672021j2027808r993857q732604r119010
57019b35891252j0990109j3143154j4080926j2877163r547669m813153M19036
57012c00924390N459082R945296J3733029J6745638J8914423K0205425K0660093
57005a95261404K0400676J9601643J8446560J7088200J5630694J4140874J2669781
$$ plain form
56998 -77282976 -66023123 -56083323 -47357816 -39729630 -33074520 -27272003 -22216163 -17816113
56990 -17816113 -13990483 -10666090 -7780040 -5278203 -3110856 -1231539 400979 1822035
56982 1822035 3061636 4144119 5088724 5913104 6635901 7274611 7842289 8348160 8800180
56973 8800180 9204933 9566035 9884828 10162278 10399010 10594955 10751483 10873853 10970170 11048125
56963 11048125 11113472 11170390 11221701 11269351 11315973 11365240 11419468 11477604 11536591 11593491 11644851
56952 11644851 11685217 11708316 11709490 11685798 11634411 11552293 11436945 11286262 11098230 10872023
56942 10872023 10609225 10313562 9990377 9646920 9291869 8933722 8580896 8243688 7933439
56933 7933439 7657798 7418205 7212538 7036017 6875551 6706126 6499607 6240260 5931308
$$ packed form
56998g7282976J1259853R939800Q725507P628186O655110N802517N055840M400050
56990a7816113L825630L324393K886050K501837K167347a231539D00979J421056
56982A822035J239601J082483R44605Q24380P22797O38710N67678N05871M52020
56973H800180M04753L61102L18793K77450K36732J95945J56528J22370R6317P7955
56963A1048125O5347N6918N1311M7650M6622M9267N4228N8136N8987N6900N1360
56952A1644851M0366K3099J174k3692n1387q2118j15348j50683j88032k26207
56942A0872023k62798k95663l23185l43457l55051l58147l52826l37208l10249
56933G933439k75641k39593k05667j76521j60466j69425k06519k59347l08952
$$ plain form
56924 5931308 5588240 5229261 4870825 4525718 4200697 3896572 3612058 3346985 3102054
56915 3102054 2878004 2676196 2498234 2343778 2209994 2093842 1993497 1906968 1831289 1764408
56905 1764408 1706341 1657090 1614615 1576326 1541721 1512180 1488825 1471853 1461432 1457575 1458626 1460463
56893 1460463 1457658 1445836 1423649 1392942 1357009 1318732 1280430 1244424 1212291 1183666 1157142
56882 1157142 1132594 1111391 1094142 1079713 1067021 1056553 1049417 1046038 1046487 1050876 1058600 1068093 1078204
56869 1078204 1088777 1098966 1105896 1106117 1097851 1081178 1057087 1027583 995928 965247 936853 910659
56857 910659 886752 865585 847087 830749 816536 804789 795312 787348 780292 773636 766566 758633 750734
56844 750734 744258 739018 733105 725303 716776 709629 704329 699353 693242 686222 679596 674082 669347 665038
$$ packed form
56924E931308l43068l58979l58436l45107l25021l04125k84514k65073k44931
56915C102054k24050k01808j77962j54456j33784j16152j00345q6529p5679o6881
56905A764408n8067m9251m2475l8289l4605k9541k3355j6972j0421l857J051J837
56893A460463k805j1822k2187l0707l5933l8277l8302l6006l2133k8625k6524
56882A157142k4548k1203j7249j4429j2692j0468p136l379M49M389P724R493J0111
56869A078204J0573J0189O930K21q266j6673k4091k9504l1655l0681k8394k6194
56857I10659k3907k1167j8498j6338j4213j1747r477p964p056o656p070p933p899
56844G50734o476n240n913p802q527p147n300m976o111p020o626n514m735m309
$$ plain form
56830 665038 661605 659682 659098 659227 660333 663866 671022 681302 692742 703337 712088 719101 725150 731204
56816 731204 738177 746910 758077 771797 787499 804534 822863 842827 864408 887112 910470 934262
56804 934262 958630 984557 1013929 1048270 1087604 1131123 1178162 1226815 1271679 1305043 1321504
56793 1321504 1320741 1305722 1279926 1247190 1212363 1179853 1151590 1127491 1107654 1093156 1085156 1084203
56781 1084203 1090368 1103487 1123613 1151694 1189289 1237237 1295470 1364654 1446316 1539133 1634956
56770 1634956 1719904 1780138 1807268 1800272 1764601 1709502 1644301 1575752 1508182 1444760 1387372
56759 1387372 1336048 1290373 1251571 1221896 1201939 1190090 1185046 1187592 1199402 1221243 1253046 1294780
56747 1294780 1346127 1405037 1466420 1521890 1561486 1577485 1567858 1536279 1489204 1433253 1374231
$$ packed form
56830F65038l433j923n84J29J106L533P156J0280J1440J0595Q751P013O049O054
56816G31204O973Q733J1167J3720J5702J7035J8329J9964K1581K2704K3358K3792
56804I34262K4368K5927K9372L4341L9334M3519M7039M8653M4864L3364J6461
56793A321504p63j5019k5796l2736l4827l2510k8263k4099j9837j4498q000r53
56781A084203O165J3119K0126K8081L7595M7948N8233O9184Q1662R2817R5823
56770A634956Q4948O0234K7130o996l5671n5099o5201o8549o7570o3422n7388
56759A387372n1324m5675l8802k9675j9957j1849n044K546J1810K1841L1803M1734
56747A294780N1347N8910O1383N5470L9596J5999r627l1579m7075n5951n9022
$$ plain form
56736 1374231 1316302 1261160 1208978 1160650 1118166 1082494 1052447 1026561 1005160 989755 981234
56725 981234 979582 984609 995782 1011766 1031226 1053710 1078486 1102359 1119785 1125844 1118874 1100319
56713 1100319 1072978 1039996 1004758 970273 937939 907364 877897 850078 825088 803176 783577
56702 783577 765962 750800 737842 725441 712472 700127 690577 684230 679511 675034 670648 666352 661550
56689 661550 655838 649531 642971 636145 629325 623351 618824 615516 612780 610067 606959 603293 599256 594851
56675 594851 589538 583132 576672 571221 566091 559693 552184 545757 541965 540228 539341 538945 538822 538262 536949
56660 536949 535252 532864 528582 522406 516380 512141 508917 505324 501813 499647 498540 497343 496465 497503
56646 497503 500499 503352 504293 503647 502825 502704 503230 503694 503107 500965 497856 494949 493101 492710 493739 495172
$$ packed form
56736A374231n7929n5142n2182m8328m2484l5672l0047k5886k1401j5405q521
56725I81234j652N027J1173J5984J9460K2484K4776K3873J7426O059o970j8555
56713A100319k7341l2982l5238l4485l2334l0575k9467k7819k4990k1912j9599
56702G83577j7615j5162j2958j2401j2969j2345r550o347m719m477m386m296m802
56689F61550n712o307o560o826o820n974m527l308k736k713l108l666m037m405
56675E94851n313o406o460n451n130o398p509o427l792j737q87l96j23n60j313
56660E36949j697k388m282o176o026m239l224l593l511k166j107j197q78J038
56646D97503K996K853R41o46q22j21N26M64n87k142l109k907j848l91J029J433
$$ plain form
56630 495172 495321 493736 492128 492132 492927 492646 491583 492034 494944 498699 501715 504460 508125 512677 517144 520781
56614 520781 523213 524410 525282 527282 530545 533137 533159 531044 528981 528519 529580 531377 533321 535054 536381
56599 536381 537426 538465 539614 540984 543066 546521 551469 557259 563147 569011 575055 580852 585134 587034
56585 587034 587325 587738 588942 589927 589601 588134 586177 583612 580015 575691 571103 565668 558322 549199 539645
56570 539645 530589 521954 513609 505691 497813 489280 480591 473673 469915 468708 468501 468562 469084 470156 471280
56555 471280 471688 470877 469183 467862 467906 468691 468682 467704 467462 469282 472400 475179 477006 478008 477807 476036 473669
56538 473669 472436 472785 473455 473168 471823 469943 468026 466836 467263 469087 470487 469799 467586 466138 466856 468902
56522 468902 470709 472010 473703 476220 479026 481664 484345 487195 489822 492136 494914 498765 503091 506860
$$ packed form
56630D95172J49j585j608MP95k81j063M51K910L755L016K745L665M552M467L637
56614E20781K432J197Q72K000L263K592K2k115k063m62J061J797J944J733J327
56599E36381J045J039J149J370K082L455M948N790N888N864O044N797M282J900
56585E87034K91M13J204R85l26j467j957k565l597m324m588n435p346r123r554
56570E39645r056q635q345p918p878q533q689o918l758j207k07O1N22J072J124
56555D71280M08q11j694j321M4P85rr78k42J820L118K779J827J002k01j771k367
56538D73669j233L49O70k87j345j880j917j190M27J824J400o88k213j448P18K046
56522D68902J807J301J693K517K806K638K681K850K627K314K778L851M326L769
$$ plain form
56508 506860 510008 513229 516774 520509 524984 531194 538996 546799 553244 558446 563192 567818 572460 577640
56494 577640 583804 590644 597538 604432 611731 619559 627627 635634 643180 649310 652816 653332 651853 649793
56480 649793 647562 644360 639465 633417 627577 622723 618605 614819 611392 608255 604911 601151 597481 594201
56466 594201 590638 586020 580665 575580 571324 567914 565210 562422 557971 551222 543893 538217 533953 528940
56452 528940 522539 516589 512505 509390 505979 502761 500795 499640 497981 495656 493814 493393 494320 495778 496528
56437 496528 495588 493391 491705 491577 492006 491571 490686 490958 492645 494194 494509 494491 495828 498984 502874 506136
56421 506136 508244 509557 510708 512118 514015 516663 520249 524571 529098 533313 536767 539035 540153 541111
56407 541111 543338 547534 553332 559926 566475 572127 576512 580269 584316 588634 592606 596404 600817 605593
$$ packed form
56508E06860L148L221L545L735M475O210P802P803O445N202M746M626M642N180
56494E77640O164O840O894O894P299P828Q068Q007P546O130L506N16j479k060
56480F49793k231l202m895o048n840m854m118l786l427l137l344l760l670l280
56466E94201l563m618n355n085m256l410k704k788m451o749p329n676m264n013
56452E28940o401n950m084l115l411l218j966j155j659k325j842m21R27J458P50
56437D96528r40k197j686j28M29m35q85K72J687J549L15j8J337L156L890L262
56421E06136K108J313J151J410J897K648L586M322M527M215L454K268J118R58
56407E41111K227M196N798O594O549N652M385L757M047M318L972L798M413M776
$$ plain form
56393 605593 609354 611614 613513 615938 618184 619313 619617 619751 619623 619306 619929 622259 625173 627013 627862 628958
56377 628958 630356 630838 630093 629392 629796 630992 632273 633515 634512 634219 631508 626491 620495 614708 609071 602729
56361 602729 595587 589043 584552 581587 577986 572627 566825 562411 559318 556096 552209 548657 546499 545805
56347 545805 546010 546400 546112 544432 541380 537642 533904 530609 528231 527254 527811 529542 531729 533336 533334 531553
56331 531553 529129 527741 528328 530557 533202 534886 534904 533806 533027 533750 536218 539957 544158 547953 551137
56316 551137 554762 560229 567590 575438 582526 588472 592838 594977 595437 596146 598287 601085 603544 606130 609509
56301 609509 612766 614462 614805 615254 616376 617523 618425 619722 621883 624671 627781 631215 634941 638803 642683
56286 642683 646297 649158 651171 652871 654691 656625 659044 662943 668600 674889 680805 686829 693773 701242
$$ packed form
56393F05593L761K260J899K425K246J129L04J34j28l17O23K330K914J840Q49J096
56377F28958J398M82p45p01M04J196J281J242R97k93k711n017n996n787n637o342
56361F02729p142o544m491k965l601n359n802m414l093l222l887l552k158o94
56347E45805K05L90k88j680l052l738l738l295k378r77N57J731K187J607kj781
56331E31553k424j388N87K229K645J684J8j098p79P23K468L739M201L795L184
56316E51137L625N467P361P848P088N946M366K139M60P09K141K798K459K586L379
56301F09509L257J696L43M49J122J147R02J297K161K788L110L434L726L862L880
56286F42683L614K861K013J700J820J934K419L899N657O289N916O024O944P469
$$ plain form
56272 701242 708463 715869 724432 734135 744604 756710 771744 789066 806199 821513 835581 849656
56260 849656 864021 878284 892374 906647 921353 936220 950508 963661 975941 987864 998873
56249 998873 1007583 1013828 1019347 1025627 1032189 1037926 1042882 1047348 1050438 1051483 1052188 1055421 1061985 1070168
56235 1070168 1078417 1086952 1096700 1107991 1120585 1134016 1147790 1161988 1177505 1195128 1214882 1236921
56223 1236921 1262206 1291214 1322815 1355734 1390447 1428226 1468923 1511323 1555406 1602876 1655547
56212 1655547 1714309 1779322 1850111 1925794 2006166 2092111 2184294 2282535 2387553 2501999 2628228
56201 2628228 2766173 2915022 3075675 3249521 3435846 3632632 3839060 4055020 4279059
56192 4279059 4509157 4744663 4984716 5225150 5459474 5682500 5890476 6078299 6239968
$$ packed form
56272G01242P221P406Q563R703J0469J2106J5034J7322J7133J5314J4068J4075
56260H49656J4365J4263J4090J4273J4706J4867J4288J3153J2280J1923J1009
56249I98873Q710O245N519O280O562N737M956M466L090J045P05L233O564Q183
56235A070168Q249Q535R748J1291J2594J3431J3774J4198J5517J7623J9754K2039
56223A236921K5285K9008L1601L2919L4713L7779M0697M2400M4083M7470N2671
56212A655547N8762O5013P0789P5683Q0372Q5945R2183R8241J05018J14446J26229
56201B628228J37945J48849J60653J73846J86325J96786K06428K15960K24039
56192D279059K30098K35506K40053K40434K34324K23026K07976J87823J61669
$$ plain form
56183 6239968 6372059 6473979 6544610 6581901 6586579 6563342 6517041 6449774 6362713 6258723 6141945
56172 6141945 6016337 5885378 5751676 5616156 5478776 5340089 5200707 5059642 4915358
56163 4915358 4768342 4620320 4470939 4317923 4160989 4002986 3846492 3691815 3539290
56154 3539290 3390926 3248274 3110546 2976309 2845709 2720145 2601142 2490253 2388605
56145 2388605 2295846 2210640 2132371 2060937 1995197 1933624 1876457 1825034 1778937 1736117 1695904
56134 1695904 1659429 1626830 1596725 1568819 1544319 1523214 1503884 1486091 1471565 1460796 1451993
56123 1451993 1444127 1438227 1434754 1432473 1431098 1432211 1436309 1441660 1447384 1454944 1465239 1477001 1489567
56110 1489567 1504366 1521842 1539588 1555411 1569890 1584098 1597221 1608338 1618363 1628341 1637825 1646441
$$ packed form
56183F239968J32091J01920P0631L7291M678k3237m6301o7267q7061j03990j16778
56172F141945j25608j30959j33702j35520j37380j38687j39382j41065j44284
56163D915358j47016j48022j49381j53016j56934j58003j56494j54677j52525
56154C539290j48364j42652j37728j34237j30600j25564j19003j10889j01648
56145B388605r2759q5206p8269p1434o5740o1573n7167n1423m6097m2820m0213
56134A695904l6475l2599l0105k7906k4500k1105j9330j7793j4526j0769q803
56123A451993p866n900l473k281j375J113M098N351N724P560J0295J1762J2566
56110A489567J4799J7476J7746J5823J4479J4208J3123J1117J0025R978R484Q616
$$ plain form
56098 1646441 1654934 1663379 1670944 1678965 1691364 1709994 1732172 1754981 1779391 1807707 1839538 1873176
56086 1873176 1909094 1949321 1994761 2045382 2101691 2164071 2232183 2306995 2391802 2489352 2599472
56075 2599472 2721206 2855732 3005420 3171387 3353011 3547615 3748995 3948162 4137287
56066 4137287 4311660 4467830 4603395 4720339 4825157 4922848 5012558 5090271 5152500 5195369
56056 5195369 5214022 5206763 5177991 5134440 5080295 5017458 4946983 4866794 4770511 4652199 4511422
56045 4511422 4352181 4179778 4001043 3824309 3655373 3495203 3344099 3205451 3082426
56036 3082426 2973593 2875273 2786177 2706581 2635230 2570434 2512373 2461243 2415122 2372574 2335103
56025 2335103 2304022 2277266 2252504 2230938 2214487 2201508 2189040 2177438 2169254 2165250 2164755 2168053
$$ packed form
56098A646441Q493Q445P565Q021J2399J8630K2178K2809K4410K8316L1831L3638
56086A873176L5918M0227M5440N0621N6309O2380O8112P4812Q4807R7550J10120
56075B599472J21734J34526J49688J65967J81624J94604K01380J99167J89125
56066D137287J74373J56170J35565J16944J04818R7691Q9710P7713O2229M2869
56056E195369J8653p259k8772m3551n4145o2837p0475q0189r6283j18312j40777
56045D511422j59241j72403j78735j76734j68936j60170j51104j38648j23025
56036C082426j08833r8320q9096p9596p1351o4796n8061n1130m6121m2548l7471
56025B335103l1081k6756k4762k1566j6451j2979j2468j1602q184m004m95L298
$$ plain form
56013 2168053 2175193 2184299 2194189 2206605 2222917 2240997 2258451 2276349 2296389 2317190 2337110 2358064
56001 2358064 2382549 2409320 2435869 2462785 2491732 2521623 2550808 2580682 2613174 2647133 2681108
55990 2681108 2716978 2756628 2797787 2837533 2877345 2920378 2966465 3014208 3065040 3120587 3178910
55979 3178910 3238149 3300927 3370290 3444399 3520269 3599425 3684394 3772867 3861222 3950910 4045541
55968 4045541 4144592 4245945 4351754 4465601 4586682 4712838 4846416 4990757 5143757 5301244
55958 5301244 5463857 5634494 5812541 5997400 6194023 6407482 6635337 6872830 7122214
55949 7122214 7389148 7673122 7969374 8277020 8597354 8927860 9266620 9619356 9993467
55940 9993467 10388542 10801326 11235770 11698442 12187985 12699261 13234368 13799660 14396332
$$ packed form
56013B168053P140R106R890J2416J6312J8080J7454J7898K0040K0801J9920K0954
56001B358064K4485K6771K6549K6916K8947K9891K9185K9874L2492L3959L3975
55990B681108L5870L9650M1159L9746L9812M3033M6087M7743N0832N5547N8323
55979C178910N9239O2778O9363P4109P5870P9156Q4969Q8473Q8355Q9688R4631
55968D045541R9051J01353J05809J13847J21081J26156J33578J44341J53000J57487
55958E301244J62613J70637J78047J84859J96623K13459K27855K37493K49384
55949G122214K66934K83974K96252L07646L20334L30506L38760L52736L74111
55940I993467L95075M12784M34444M62672M89543N11276N35107N65292N96672
$$ plain form
55931 14396332 15024877 15694520 16416563 17192322 18019231 18904327 19859274 20886604 21983883
55922 21983883 23156479 24412307 25749272 27163294 28664309 30269425 31986403 33821353
55914 33821353 35797179 37945450 40284026 42820445 45570959 48556156 51785452 55270295
55906 55270295 59048552 63173909 67689626 72639428 78096126 84150572 90883573 98386598
55898 98386598 106806552 116337236 127179606 139555376 153751547 170105742 188962034
55891 188962034 210691914 235723002 264454256 297146181 333915247 374553384 417738425
55884 417738425 459995824 495692631 518841669 525712330 516265517 493517808 461764975
55877 461764975 425104684 386783373 349051816 313229689 279945868 249464755 221897916
$$ packed form
55931A4396332O28545O69643P22043P75759Q26909Q85096R54947J027330J097279
55922B1983883J172596J255828J336965J414022J501015J605116J716978J834950
55914C3821353J975826K148271K338576K536419K750514K985197L229296L484843
55906E5270295L778257M125357M515717M949802N456698O054446O733001P503025
55898I8386598Q419954R530684J0842370J2375770J4196171J6354195J8856292
55891A88962034K1729880K5031088K8731254L2691925L6769066M0638137M3185041
55884D17738425M2257399L5696807K3149038O870661r446813k2747709l1752833
55877D61764975l6660291l8321311l7731557l5822127l3283821l0481113k7566839
$$ plain form
55870 221897916 197253287 175447495 156341691 139749324 125417179 113049161 102367530
55863 102367530 93134728 85128619 78137227 71984051 66532083 61661883 57270432 53289815
55855 53289815 49679274 46394379 43383281 40610964 38063031 35722978 33565570 31573432
55847 31573432 29739697 28051169 26486213 25031373 23683774 22435541 21271700 20184958
55839 20184958 19176899 18242302 17366383 16539288 15759514 15021559 14314389 13634877 12990089
55830 12990089 12383371 11809482 11265246 10753327 10273152 9818978 9389197 8987278 8611596
55821 8611596 8254410 7912747 7590469 7287942 6999577 6723524 6463998 6221388 5989051
55812 5989051 5762481 5543431 5332856 5127900 4927989 4736106 4552095 4372124 4196352
$$ packed form
55870B21897916k4644629k1805792j9105804j6592367j4332145j2368018j0681631
55863A02367530r232802q006109o991392o153176n451968m870200m391451l980617
55855E3289815l610541l284895l011098k772317k547933k340053k157408j992138
55847C1573432j833735j688528j564956j454840j347599j248233j163841j086742
55839B0184958j008059r34597q75919q27095p79774p37955p07170o79512o44788
55830A2990089o06718n73889n44236n11919m80175m54174m29781m01919l75682
55821H611596l57186l41663l22278l02527k88365k76053k59526k42610k32337
55812E989051k26570k19050k10575k04956j99911j91883j84011j79971j75772
$$ plain form
55803 4196352 4029464 3872072 3719172 3568894 3425390 3291347 3164969 3046127 2938230
55794 2938230 2842006 2754302 2674796 2607025 2551008 2501861 2457517 2420684 2390726 2360405 2323525
55783 2323525 2279946 2230899 2175754 2116144 2057228 2001560 1946543 1890312 1835132 1782754 1731458
55772 1731458 1680222 1631265 1586275 1544338 1505172 1469863 1436959 1402671 1366613 1332641 1302407
55761 1302407 1272870 1241856 1211244 1182791 1155605 1129798 1108142 1091868 1078813 1067443 1058701
55750 1058701 1052401 1046054 1038897 1033012 1029033 1025028 1020958 1019600 1021337 1022537 1021063 1019011 1017984 1015862
55736 1015862 1010470 1002499 992668 979769 963563 945966 927493 906180 881766 857310 834991 814037
55724 814037 794349 778041 765449 753600 740885 729552 721501 715253 709282 704670 701964 698652 692169
$$ packed form
55803D196352j66888j57392j52900j50278j43504j34043j26378j18842j07897
55794B938230r6224q7704p9506o7771n6017m9147m4344l6833k9958l0321l6880
55783B323525m3579m9047n5145n9610n8916n5668n5017n6231n5180n2378n1296
55772A731458n1236m8957m4990m1937l9166l5309l2904l4288l6058l3972l0234
55761A302407k9537l1014l0612k8453k7186k5807k1656j6274j3055j1370q742
55750A058701o300o347p157n885l979m005m070j358J737J200j474k052j027k122
55736A015862n392p971r831j2899j6206j7597j8473k1313k4414k4456k2319k0954
55724H14037j9688j6308j2592j1849j2715j1333q051o248n971m612k706l312o483
$$ plain form
55711 692169 682677 671090 657452 642985 630427 620503 611197 602089 595830 593511 592267 589622 586556
55698 586556 583996 579871 572476 563617 555673 548189 539660 529928 518638 504359 487712 472514 461314
55685 461314 452382 443365 435068 429007 423909 417523 409918 402584 396238 391537 389757 390659 391702 391188 390022
55670 390022 388936 386871 383964 382872 384457 384922 380308 371710 363297 357059 352136 347566 343026 338202
55656 338202 333688 331179 330972 330934 329673 328938 330939 335092 339313 342754 345569 347949 351220 357905 368553
55641 368553 380173 389594 396594 402128 405718 406803 406765 407308 408266 408778 409063 409303 408495 406079 403039 399961
55625 399961 396051 391541 388768 388980 390308 390790 391122 392388 393425 392856 391624 391071 390468 388917 387842 389036
55609 389036 391759 394132 395917 397656 398755 398709 398740 399981 401580 402636 404277 407501 410759 412166 412574
$$ packed form
55711F92169r492j1587j3638j4467j2558r924r306r108o259k319j244k645l066
55698E86556k560m125p395q859p944p484q529r732j1290j4279j6647j5198j1200
55685D61314q932r017q297o061n098o386p605p334o346m701j780R02J043n14j166
55670C90022j086k065k907j092J585M65m614q598q413o238m923m570m540m824
55656C38202m514k509k07l8j261p35K001M153M221L441K815K380L271O685J0648
55641C68553J1620R421P000N534L590J085l8N43R58N12K85K40q08k416l040l078
55625C99961l910m510k773K12J328M82L32J266J037n69j232n53o03j551j075J194
55609C89036K723K373J785J739J099m6L1J241J599J056J641L224L258J407M08
$$ plain form
55594 412574 413982 416346 418403 420115 421734 421719 418250 411878 404455 396555 387925 379044 370008 359405
55580 359405 346695 334226 324359 315970 306429 295707 285727 276842 267912 259042 251374 244623 237405
55567 237405 229600 222174 215266 208672 203514 201072 200429 199337 196946 193811 190086 185854 182482 181379
55553 181379 181907 182416 182636 183214 183710 183147 181776 180439 178999 177148 175699 175164 174301 172149 170189 170083
55537 170083 170540 169050 165777 163072 161883 161247 160697 160623 160813 161036 162394 165781 169803 172556 174436 176627
55521 176627 178101 177369 176284 178340 183360 187453 188624 189101 191508 195702 200246 204383 207658 209987 212925
55506 212925 218830 228034 238662 249534 261168 273402 284248 291902 296181 297470 295973 292426 287830
55493 287830 281943 273633 263065 252011 241728 232118 223168 215564 209545 204646 200737 197921 195486
$$ packed form
55594D12574J408K364K057J712J619j5l469o372p423p900q630q881r036j0603
55580C59405j2710j2469r867q389r541j0722r980q885q930q870p668o751p218
55567B37405p805p426o908o594n158k442o43j092k391l135l725m232l372j103
55553A81379N28N09K20N78M96n63j371j337j440j851j449n35q63k152j960j06
55537A70083M57j490l273k705j189o36n50p4J90K23J358L387M022K753J880K191
55521A76627J474p32j085K056N020M093J171M77K407M194M544M137L275K329K938
55506B12925N905R204J0628J0872J1634J2234J0846P654M279J289j497l547m596
55493B87830n887q310j0568j1054j0283r610q950p604o019m899l909k816k435
$$ plain form
55480 195486 192553 189614 187801 186819 185547 184437 185080 187319 189138 189802 190812 193130 195694 197512 199163
55465 199163 201074 202085 201062 198641 196148 193731 190586 186289 181104 175504 169992 165057 160987 157874
55451 157874 155501 152821 148215 141192 133378 126889 122220 118589 115452 112514 109193 105613 103284 103090
55437 103090 103468 102410 100441 99484 99486 98596 96235 93489 90658 87044 83339 81518 81700 81357 78488 73823
55421 73823 69285 66006 64359 64243 64708 64606 63950 63436 62868 61726 60926 61921 64124 65367 65036 64538 64469
55404 64469 63745 61996 60397 59387 57824 55273 53130 52515 52884 53589 54981 57199 59597 62115 65479
55389 65479 69383 72386 74296 76576 79464 80790 78957 75335 72397 70992 70541 70458 70303 69942 70500 73545
55373 73545 78312 81473 81048 79140 79353 82668 87093 90310 91367 90686 89640 89594 90597 91485 91419 90358
$$ packed form
55480A95486k933k939j813r82j272j110O43K239J819O64J010K318K564J818J651
55465A99163J911J011j023k421k493k417l145m297n185n600n512m935m070l113
55451A57874k373k680m606p023p814o489m669l631l137k938l321l580k329j94
55437A03090L78j058j969r57Kq90k361k746k831l614l705j821J82l43k869m665
55421G3823m538l279j647j16M65j02o56n14n68j142q00R95K203J243l31m98o9
55404F4469p24j749j599j010j563k551k143o15L69P05J392K218K398K518L364
55389F5479L904L003J910K280K888J326j833l622k938j405m51q3j55l61N58L045
55373G3545M767L161m25j908K13L315M425L217J057o81j046m6J003Q88o6j061
$$ plain form
55357 90358 88114 84627 81410 80707 82521 84295 84467 84364 85571 87469 88919 90568 93558 97191 99697
55342 99697 100446 99928 98323 95590 92417 89862 88424 88173 89066 90571 91854 92861 94060 94753 93327 90017
55326 90017 87565 87808 89157 89019 87284 85678 84807 83866 82611 81855 82143 83172 84288 84732 83973 82522
55310 82522 81615 81328 80049 76830 73100 70843 70234 70469 71791 74861 78810 81815 83467 84974 86969
55295 86969 88353 87483 83761 78135 72669 69324 68462 68714 68621 67846 66662 65397 64945 66500 69751 72506
55279 72506 73206 72793 72927 73556 73686 73372 73179 72533 70639 68493 67866 68365 67545 64346 60713 59149 59966
55262 59966 61614 62764 63284 63779 64810 66323 67559 67678 66596 65035 63828 63269 62917 61887 59686 56893
55246 56893 54512 52611 50437 48148 47360 49156 52442 55259 57098 58851 61019 63164 64986 66762 68530
$$ packed form
55357I0358k244l487l217p03J814J774J72j03J207J898J450J649K990L633K506
55342I9697P49n18j605k733l173k555j438k51Q93J505J283J007J199O93j426l310
55326I0017k452K43J349j38j735j606q71r41j255p56K88J029J116M44p59j451
55310H2522r07k87j279l219l730k257o09K35J322L070L949L005J652J507J995
55295H6969J384q70l722n626n466l345q62K52r3p75j184j265m52J555L251K755
55279G2506P00m13J34O29J30l14j93o46j894k146o27M99q20l199l633j564Q17
55262E9966J648J150N20M95J031J513J236J19j082j561j207n59l52j030k201k793
55246E6893k381j901k174k289p88J796L286K817J839J753K168K145J822J776J768
$$ plain form
55231 68530 69692 69763 69015 68200 67949 68511 69781 71397 72835 73531 73141 71837 70121 68138 65617 62864
55215 62864 61110 61073 61862 62395 63160 65014 66849 66599 64523 63188 63745 64458 63760 62528 62105 62165 62153 63026
55197 63026 65610 68568 69895 69467 68427 67109 65444 64568 65983 69454 73419 77205 81274 85516 88802
55182 88802 90271 90026 88660 86916 85354 83588 80573 76470 73305 72588 73316 73739 74010 75296 77120 77753
55166 77753 76893 75917 75546 75183 74734 75247 77246 79868 82067 83477 83885 83075 81469 79870 78435 77011
55150 77011 76436 77996 81288 84004 84489 83418 82396 81907 81398 80561 79796 79757 80841 82676 83901 83037 79937
55133 79937 76077 73236 72266 73090 75234 77943 80225 81252 80772 79173 77169 75355 73966 73154 73389 75049
55117 75049 77569 79608 80340 80039 79209 77975 76690 76266 77177 78739 79957 80409 79860 78028 75510 73952
$$ packed form
55231F8530J162P1p48q15k51N62J270J616J438O96l90j304j716j983k521k753
55215F2864j754l7P89N33P65J854J835k50k076j335N57P13o98j232m23O0j2Q73
55197F3026K584K958J327m28j040j318j665q76J415L471L965L786M069M242L286
55182H8802J469k45j366j744j562j766l015m103l165p17P28M23K71J286J824O33
55166G7753q60r76l71l63m49N13J999K622K199J410M08q10j606j599j435j424
55150G7011n75J560L292K716M85j071j022m89n09q37p65l9J084J835J225q64l100
55133G9937l860k841r70Q24K144K709K282J027m80j599k004j814j389q12K35J660
55117G5049K520K039P32l01q30j234j285m24R11J562J218M52n49j832k518j558
$$ plain form
55101 73952 74187 75020 74935 74228 74192 74806 74680 73120 71006 69628 69555 70523 71619 71818 71049 70396 70631 71178 71275
55082 71275 71378 72303 73641 74204 73597 72299 70749 69495 69582 71432 73783 74976 74894 74554 74563 75405 78287 83634
55064 83634 89281 92445 93412 95041 98370 101117 101339 100446 101169 103972 106952 108427 108310 107403 106394 105504
55048 105504 104586 103534 102617 102142 101940 101766 102040 103461 105899 108370 110069 110729 110118 108155 105671 104190
55032 104190 104624 106606 109136 111427 113211 114712 116209 117284 117088 115944 115840 118219 121841 124095 124078
55017 124078 123061 122295 121942 122170 123643 126355 129140 130941 131882 132760 134112 135939 137711 138663 138572 138057
55001 138057 137591 136747 135152 133517 132648 132000 130430 127929 125375 123157 121452 121274 123479 126980 129704
54986 129704 131192 132568 134134 134907 134568 133843 132698 130182 126633 124153 124180 126138 128997 132369 135352
$$ packed form
55101G3952K35Q33q5p07l6O14j26j560k114j378p3R68J096J99p69o53K35N47R7
55082G1275J03R25J338N63o07j298j550j254Q7J850K351J193q2l40RQ42K882N347
55064H3634N647L164R67J629L329K747K22q93P23K803K980J475j17r07j009q90
55048A05504r18j052r17m75k02j74K74J421K438K471J699O60o11j963k484j481
55032A04190M34J982K530K291J784J501J497J075j96j144j04K379L622K254j7
55017A24078j017p66l53K28J473K712K785J801R41Q78J352J827J772R52r1n15
55001A38057m66q44j595j635q69o48j570k501k554k218j705j78K205L501K724
54986A29704J488J376J566P73l39p25j145k516l549k480K7J958K859L372K983
$$ plain form
54971 135352 136233 134481 131664 129451 128027 127280 127926 130199 132772 134250 134744 134927 134665 133829 133431 134384
54955 134384 135736 135528 133314 130780 129841 130724 131878 131449 129164 126811 126450 128117 129966 130637 130542 130719
54939 130719 131554 132920 134458 135313 134664 132985 131698 131216 130471 128850 127339 127013 127623 128508 129781 131626
54923 131626 133409 134605 135973 138729 142918 147333 150731 152680 153671 154803 156911 159760 162545 165136
54909 165136 168077 171481 174985 178705 183004 187295 190604 193480 197615 203200 208547 213016 218413 226402
54895 226402 236254 246437 256869 268210 280375 293268 307702 324038 340932 356908 372023 386389
54883 386389 398176 405068 406985 405432 400649 391515 378172 362840 347550 332377 316441 299781
54871 299781 283772 270073 259223 250066 240849 231041 221612 213475 206729 201711 199332 199529 200671 201574
$$ packed form
54971A35352Q81j752k817k213j424p47O46K273K573J478M94J83k62q36l98R53
54955A34384J352k08k214k534r39Q83J154m29k285k353l61J667J849O71r5J77
54939A30719Q35J366J538Q55o49j679j287m82p45j621j511l26O10Q85J273J845
54923A31626J783J196J368K756M189M415L398J949R91J132K108K849K785K591
54909A65136K941L404L504L720M299M291L309K876M135N585N347M469N397P989
54895B26402R852J0183J0432J1341J2165J2893J4434J6336J6894J5976J5115J4366
54883C86389J1787O892J917j553m783r134j3343j5332j5290j5173j5936j6660
54871B99781j6009j3699j0850r157r217r808r429q137o746n018k379J97J142R03
$$ plain form
54857 201574 202784 204808 206567 207360 209046 214116 222251 230875 238743 247072 257348 269944 284858 301882
54843 301882 319694 336280 350542 362314 370889 375075 374813 371139 364262 353304 338475 322051 306352
54830 306352 291770 277493 263277 249817 237981 228171 219980 212290 204310 196536 189926 184277 178433
54817 178433 172237 167019 163753 161851 160352 159213 158696 158396 157776 156925 155857 153656 149486 144230 139934
54802 139934 137473 135715 133432 131226 130714 132145 133791 133914 132658 131487 131296 131792 132407 132855 132702 131298
54786 131298 128666 125946 124419 124324 124804 124748 123602 121871 120908 121658 123453 124670 124645 124179 123962 123536 122333
54769 122333 120828 119997 120281 121672 124079 126979 129465 131274 133082 135174 136690 136977 136872 137782 140161
54754 140161 143672 147942 152230 155306 156852 158282 160992 164648 168440 173052 179599 187324 194415 201008
$$ packed form
54857B01574J210K024J759P93J686N070Q135Q624P868Q329J0276J2596J4914J7024
54843C01882J7812J6586J4262J1772Q575M186k62l674o877j0958j4829j6424j5699
54830C06352j4582j4277j4216j3460j1836r810q191p690p980p774o610n649n844
54817A78433o196n218l266j902j499j139n17l00o20q51j068k201m170n256m296
54802A39934k461j758k283k206n12J431J646J23j256j171j91M96O15M48j53j404
54786A31298k632k720j527r5M80n6j146j731r63P50J795J217k5m66k17m26j203
54769A22333j505q31K84J391K407K900K486J809J808K092J516K87j05R10K379
54754A40161L511M270M288L076J546J430K710L656L792M612O547P725P091O593
$$ plain form
54740 201008 209328 220568 233447 246395 259555 273747 288804 304103 319916 337116 355633 373847
54728 373847 389570 401478 409594 414381 415445 411701 403087 391392 378680 365480 351378 336843
54716 336843 323311 311751 302207 294563 288635 283546 278137 272232 266767 262665 260320 259968 261573 264427
54702 264427 267774 271869 277535 284784 292747 300882 309382 318566 328811 340981 355889 373333 392500
54689 392500 412954 434132 454332 471692 485996 497922 506495 509091 504477 494246 480673 464656
54677 464656 446486 427102 407448 387557 367343 347498 328795 311235 294757 280049 267801
54666 267801 257674 248699 240292 232353 224943 218478 213681 210657 208389 205665 202252 198852 196292 194868
54652 194868 193922 191990 188194 183715 180973 180941 182217 183091 183429 183797 183944 183289 182146 181333 180955 180546 179969
$$ packed form
54740B01008Q320J1240J2879J2948J3160J4192J5057J5299J5813J7200J8517J8214
54728C73847J5723J1908Q116M787J064l744q614j1695j2712j3200j4102j4535
54716C36843j3532j1560r544p644n928n089n409n905n465m102k345l52J605K854
54702B64427L347M095N666P249P963Q135Q500R184J0245J2170J4908J7444J9167
54689C92500K0454K1178K0200J7360J4304J1926Q573K596m614j0231j3573j6017
54677D64656j8170j9384j9654j9891k0214j9845j8703j7560j6478j4708j2248
54666B67801j0127q975q407p939p410o465m797l024k268k724l413l400k560j424
54652A94868r46j932l796m479k742l2J276Q74L38L68J47o55j143q13l78m09n77
$$ plain form
54635 179969 179349 178603 178016 178806 181908 186360 189981 191741 192502 193417 194564 195490 196201 197162 198786 201242
54619 201242 204281 207076 208807 209724 211127 213928 217703 221618 225717 230549 235734 239899 242245 243556
54605 243556 245382 248781 254110 261231 269168 276211 281370 285487 289995 294841 298821 301841 305300 309781
54591 309781 313878 316236 317589 319671 323095 327536 333065 339940 347685 355819 364930 375530 386322 395448
54577 395448 403360 412541 423946 435358 443795 448120 448669 445822 439967 431821 421698 409203 394504
54564 394504 379219 365183 352766 341144 329733 318636 308136 298564 290551 284712 280891 277952
54552 277952 274458 269773 264781 261304 260308 260936 261910 263474 266759 271383 275153 276572 276369 275937 275523 274782
54536 274782 273915 272915 270502 265229 257442 249152 242130 236971 233652 231876 230767 229177 226590 223241
$$ packed form
54635A79969o20p46n87P90L102M452L621J760P61R15J147R26P11R61J624K456
54619B01242L039K795J731R17J403K801L775L915M099M832N185M165K346J311
54605B43556J826L399N329P121P937P043N159M117M508M846L980L020L459M481
54591C09781M097K358J353K082L424M441N529O875P745Q134R111J0600J0792R126
54577C95448P912R181J1405J1412Q437M325N49k847n855q146j0123j2495j4699
54564C94504j5285j4036j2417j1622j1411j1097j0500r572q013n839l821k939
54552B77952l494m685m992l477r96O28R74J564L285M624L770J419k03m32m14p41
54536B74782q67j000k413n273p787q290p022n159l319j776j109j590k587l349
$$ plain form
54522 223241 219282 214490 208930 203325 198387 194100 189898 185416 180877 176859 173830 171833 170449 169024
54508 169024 167052 164585 162245 160520 158955 156479 152884 149569 148279 149354 151711 154216 156329 157717
54494 157717 158202 158197 158283 158252 157481 156484 157043 160143 164464 167616 168426 167469 165947 164867 165077 167028 170168 173204
54476 173204 175677 179073 185559 195218 205200 212519 217238 221646 226527 230257 232281 235141 240988 247510
54462 247510 250137 247856 244232 242503 242205 241259 238828 234762 228344 219657 210983 204951 201700 199213 195999
54447 195999 192221 188536 185060 181597 178198 175294 173445 172743 172438 171688 170673 170169 170071 169472 168459 168423
54431 168423 170001 172011 173383 174927 177988 182271 186263 189142 191093 192290 192744 192880 193198 193538 193529 193564
54415 193564 194578 197047 200658 204618 207884 209697 210441 211377 213008 214454 214961 215050 215322 215201 214058 212794
$$ packed form
54522B23241l959m792n560n605m938m287m202m482m539m018l029j997j384j425
54508A69024j972k467k340j725j565k476l595l315j290J075K357K505K113J388
54494A57717M85nQ6l1p71r97N59L100M321L152Q10r57j522j080K10J951L140L036
54476A73204K473L396O486R659R982P319M719M408M881L730K024K860N847O522
54462B47510K627k281l624j729k98r46k431m066o418q687q674o032l251k487l214
54447A95999l778l685l476l463l399k904j849p02l05p50j015n04r8n99j013l6
54431A68423J578K010J372J544L061M283L992K879J951J197M54J36L18L40rL5
54415A93564J014K469L611L960L266J813P44R36J631J446N07Q9K72j21j143j264
$$ plain form
54399 212794 212854 214142 215211 215302 214999 214998 215298 215573 215456 214589 213152 212063 211846 211660 210376 208296 206736 206126
54381 206126 205603 204412 202643 200498 197786 194464 191087 188512 187382 187615 188119 187547 185915 184859 185481
54366 185481 186674 186592 185111 183539 182389 181060 179679 179565 181340 183862 185668 186600 187443 188738 190636
54351 190636 193421 197502 202866 208774 213966 217319 218642 218791 218858 219483 221038 223979 228517 234398 241449
54336 241449 249831 259198 268198 275545 281184 285836 290039 294383 299782 306241 311843 314358 313707 311695
54322 311695 309520 306784 302818 297614 291248 283652 275475 268279 263404 260998 260089 259054 256353 251700
54308 251700 246350 241471 236663 231104 225633 222051 220434 218877 216277 213843 213150 214027 215099 215428 214806
54293 214806 213362 211781 211286 212598 215230 218198 220992 223515 225678 227537 229515 232199 236147 241685
$$ packed form
54399B12794O0J288J069R1l03jL00K75j17q67j437j089k17j86j284k080j560o10
54381B06126n23j191j769k145k712l322l377k575j130K33N04n72j632j056O22
54366A85481J193q2j481j572j150j329j381j14J775K522J806R32Q43J295J898
54351A90636K785M081N364N908N192L353J323J49O7O25J555K941M538N881P051
54336B41449Q382R367R000P347N639M652M203M344N399O459N602K515o51k012
54322C11695k175k736l966n204o366p596q177p196m875k406r09j035k701m653
54308B51700n350m879m808n559n471l582j617j557k600k434o93Q77J072L29o22
54293B14806j444j581m95J312K632K968K794K523K163J859J978K684L948N538
$$ plain form
54279 241685 248220 253960 257372 259168 261804 266576 272085 276068 277866 278453 278808 278976 278368 276300 272551
54264 272551 267773 263034 258681 254031 248441 242164 235913 230066 224580 219181 213392 206945 200502 195342
54250 195342 191885 189041 185589 181683 178413 176100 173731 170109 165183 159992 155482 151620 147902 144488
54236 144488 142207 141286 140732 139547 137876 136326 134807 133132 132170 133023 135162 136814 137327 137851 139272 140768
54220 140768 141042 139969 138351 136895 136078 136265 137202 137884 137531 136325 134819 133165 131370 129844 129168 129570
54204 129570 130897 132811 134878 136810 138668 140434 141578 141630 141067 140914 141621 143144 145782 149646 153345
54189 153345 154750 153543 151819 151603 152883 154502 155739 156307 155984 155099 154517 154412 153951 152764 151645 151119
54173 151119 150531 149508 149086 150232 152217 153709 154542 155152 155136 153959 152485 152191 153052 153518 152480 150185
$$ packed form
54279B41685O535N740L412J796K636M772N509L983J798N87L55J68o08k068l749
54264B72551m778m739m353m650n590o277o251n847n486n399n789o447o443n160
54250A95342l457k844l452l906l270k313k369l622m926n191m510l862l718l414
54236A44488k281r21n54j185j671j550j519j675r62Q53K139J652N13N24J421J496
54220A40768K74j073j618j456q17J87R37O82l53j206j506j654j795j526o76M02
54204A29570J327J914K067J932J858J766J144N2n63j53P07J523K638L864L699
54189A53345J405j207j724k16J280J619J237N68l23q85n82j05m61j187j119n26
54173A51119n88j023m22J146J985J492Q33O10j6j177j474k94Q61M66j038k295
$$ plain form
54157 150185 147498 145396 144910 146242 147935 147996 145914 142836 140148 138853 139802 143002 146761 148910 149030
54142 149030 148325 147434 145896 143898 142786 143119 143640 143055 141673 140341 138945 137166 135843 136102 137458 138170
54126 138170 137455 136228 135497 135116 134550 134015 134135 134805 135046 133904 131174 127374 123452 120549 119586 120739
54110 120739 123291 126122 128343 129586 130007 130144 130581 131478 132452 133040 133162 133045 132908 132906 133164 133553 133619 133026
54092 133026 131934 130772 129912 129859 131166 133469 134954 133808 130323 126888 125755 127313 130363 133251 134709
54077 134709 134601 134170 134868 136657 138164 138620 138641 138788 138446 136953 134922 133571 133209 133185 132985 132704 132735 133481
54059 133481 135017 136575 136786 134904 131463 127511 123812 121106 120213 121100 122563 123613 124616 126302 128227
54044 128227 129189 128721 127299 125481 123758 122886 123296 124280 124604 123961 123093 122645 122570 122618 122737 122963 123322 123676
$$ packed form
54157A50185k687k102m86J332J693O1k082l078k688j295R49L200L759K149J20
54142A49030p05q91j538j998j112L33N21n85j382j332j396j779j323K59J356P12
54126A38170p15j227p31l81n66n35J20O70K41j142k730l800l922k903r63J153
54110A20739K552K831K221J243M21J37M37Q97R74N88J22j17j37kK58L89O6n93
54092A33026j092j162q60n3J307K303J485j146l485l435j133J558L050K888J458
54077A34709j08m31O98J789J507M56K1J47l42j493k031j351l62k4k00k81L1P46
54059A33481J536J558K11j882l441l952l699k706q93Q87J463J050J003J686J925
54044A28227R62m68j422j818j723q72M10R84L24o43q68m48p5M8J19K26L59L54
$$ plain form
54026 123676 123426 121974 119994 119481 121646 125273 128146 129575 130437 131243 131580 131261 130564 129198 126458 122826
54010 122826 120264 120269 122370 124864 126395 126660 126340 126574 127816 129118 129346 129048 129998 132733 135867 138354
53994 138354 141054 145035 149385 152147 153033 153928 156631 160964 165315 168334 169788 170229 170299 170376 170683 171489
53978 171489 173045 175364 178227 181414 184804 188313 191975 196078 201031 207142 214599 223468 233484 244100
53964 244100 254958 265981 276689 285948 293106 299047 305345 312528 319967 327189 334262 340853 346118
53951 346118 349982 353540 357544 361182 363040 362805 361409 359862 358382 356340 352611 346378 338196 330087
53937 330087 324073 320490 317957 314820 310509 305772 301868 299368 297541 295039 291304 287074 283393 280477
53923 280477 277687 274203 269402 263022 255542 248394 243306 241195 241593 242968 243591 242533 240315 238626 239051
$$ packed form
54026A23676k50j452j980n13K165L627K873J429Q62Q06L37l19o97j366k740l632
54010A22826k562NK101K494J531K65l20K34J242J302K28k98R50K735L134K487
53994A38354K700L981M350K762Q86Q95K703M333M351L019J454M41P0P7L07Q06
53978A71489J556K319K863L187L390L509L662M103M953O111P457Q869J0016J0616
53964B44100J0858J1023J0708R259P158N941O298P183P439P222P073O591N265
53951C46118L864L558M004L638J858k35j396j547j480k042l729o233q182q109
53937C30087o014l583k533l137m311m737l904k500j827k502l735m230l681k916
53923B80477k790l484m801o380p480p148n088k111L98J375O23j058k218j689M25
$$ plain form
53908 239051 241815 245602 248604 249955 250365 251352 253573 256015 257183 256998 256981 258396 260793 262840 264118
53893 264118 265297 266682 267496 267145 266527 267289 269841 272971 275621 278174 281380 284772 287336 289445 292762
53878 292762 297932 303638 308549 313122 318547 324836 331035 336789 342413 347751 352189 355715 358863 361481
53864 361481 362564 361563 359101 356269 353949 352874 353489 355596 358770 363121 368816 375012 380411 385008
53850 385008 390113 396363 403028 409860 418156 428798 440332 450424 458694 466695 475292 483405 489609
53837 489609 493838 496891 498915 499126 496994 493245 489405 486375 483616 479832 474302 467392 460085 453428
53823 453428 448064 443510 437922 429511 418485 406987 396815 387918 379382 370954 362980 355616 348842
53810 348842 342749 337109 331159 324561 318113 312743 308248 303871 299656 296115 292735 288040 281383 273758
$$ packed form
53908B39051K764L787L002J351M10R87K221K442J168j85j7J415K397K047J278
53893B64118J179J385Q14l51o18P62K552L130K650K553L206L392K564K109L317
53878B92762N170N706M911M573N425O289O199N754N624N338M438L526L148K618
53864C61481J083j001k462k832k320j075O15K107L174M351N695O196N399M597
53850C85008N105O250O665O832Q296J0642J1534J0092Q270Q001Q597Q113O204
53837D89609M229L053K024K11k132l749l840l030k759l784n530o910p307o657
53823D53428n364m554n588q411j1026j1498j0172q897q536q428p974p364o774
53810C48842o093n640n950o598o448n370m495m377m215l541l380m695o657p625
$$ plain form
53796 273758 266490 259942 253857 248263 243364 238966 234634 230370 226681 223969 222021 220150 217787 214892
53782 214892 211818 208820 205914 203334 201815 202031 203805 206162 208073 208884 208213 205944 202508 198833 195830
53767 195830 193984 193409 194004 195441 197239 198970 200315 200993 200954 200710 201157 202804 205253 207654 209608 211456
53751 211456 213682 216271 218777 220905 222723 224239 225231 225844 227151 230452 235876 242215 248478 255111 263095
53736 263095 272120 280363 286232 289844 292563 295466 298596 301473 303931 306363 309373 313401 318650 325155
53722 325155 332678 340435 347117 351576 353666 354351 354849 355620 356242 356197 355598 355083 355074 355320 355154 354085 352103
53705 352103 349523 346597 343299 339522 335493 331720 328341 324834 320820 316926 314121 312235 310055 307209
53691 307209 304919 304123 303724 301915 298756 296138 295211 295164 294799 294139 293880 294166 294620 294973 294983 294315 293146 292418
$$ packed form
53796B73758p268o548o085n594m899m398m332m264l689k712j948j871k363k895
53782B14892l074k998k906k580j519K16J774K357J911Q11o71k269l436l675l003
53767A95830j846n75N95J437J798J731J345O78l9k44M47J647K449K401J954J848
53751B11456K226K589K506K128J818J516R92O13J307L301N424O339O263O633P984
53736B63095R025Q243N869L612K719K903L130K877K458K432L010M028N249O505
53722C25155P523P757O682M459K090O85M98P71O22m5n99n15rK46j66j069j982
53705C52103k580k926l298l777m029l773l379l507m014l894k805j886k180k846
53691C07209k290p96l99j809l159k618r27m7l65o60k59K86M54L53J0o68j169p28
$$ plain form
53673 292418 292720 293234 292582 290625 288742 288148 288526 288523 287203 284684 281599 278418 275583 273935 274244 275943
53657 275943 276946 275650 273091 272204 274647 278994 282395 283368 282510 281177 280353 280572 282086 284818 288396
53642 288396 292384 296424 300298 304020 307704 311383 315240 319925 326018 332937 339068 343480 347044 351391
53628 351391 357277 364508 372922 382413 392107 400466 406532 410681 414050 417655 422005 427022 432093 436574
53614 436574 440494 444577 449387 454578 459068 461928 463089 463246 463087 462702 461839 460599 459434 458513 457554 456389
53598 456389 455148 453638 451226 447814 444374 441871 440137 438435 436727 435552 434902 434163 433116 432108 431085
53583 431085 429374 426729 423905 421796 420570 420034 420271 421339 422681 423472 423533 423460 423803 424436 424898 425089 425408
53566 425408 426200 427375 428792 430793 433836 437604 441187 444488 448661 454345 460062 463707 465562 468509
$$ packed form
53673B92418L02N14o52j957j883n94L78lj320k519l085l181k835j648L09J699
53657B75943J003j296k559q87K443M347L401R73q58j333q24K19J514K732L578
53642B88396L988M040L874L722L684L679L857M685O093O919O131M412L564M347
53628C51391N886P231Q414R491R694Q359O066M149L369L605M350N017N071M481
53614D36574L920M083M810N191M490K860J161J57j59l85q63j240j165r21r59j165
53598D56389j241j510k412l412l440k503j734j702j708j175o50p39j047j008j023
53583D31085j711k645k824k109j226n36K37J068J342P91O1p3L43O33M62J91L19
53566D25408P92J175J417K001L043L768L583L301M173N684N717L645J855K947
$$ plain form
53552 468509 474628 482660 489625 494176 497397 500996 506004 512988 521959 531596 539835 546124 552380 560784
53538 560784 571180 581613 591068 600435 610691 621327 631109 639493 646718 653359 660597 670075 682244
53525 682244 695084 705728 713549 720637 728983 738133 746177 752267 757375 762900 769148 775231 780175 784126
53511 784126 788423 794256 801334 808236 813975 818659 822710 826268 829590 833155 836899 840079 842473 845070
53497 845070 848808 853079 856322 857898 858822 860712 864380 869154 873223 875114 875280 875736 877677 880070 881311
53482 881311 881502 882030 883395 884888 886313 888637 892474 897053 901294 905167 909390 914408 920225 926829 934229
53467 934229 942310 950991 960250 969686 978448 986150 993718 1002890 1014836 1029501 1046236 1064688 1084931
53454 1084931 1106951 1130457 1155322 1181914 1210639 1241232 1272912 1305297 1338749 1373691 1410089
$$ packed form
53552D68509O119Q032O965M551L221L599N008O984Q971R637Q239O289O256Q404
53538E60784J0396J0433R455R367J0256J0636R782Q384P225O641P238R478J2169
53525F82244J2840J0644P821P088Q346R150Q044O090N108N525O248O083M944L951
53511G84126M297N833P078O902N739M684M051L558L322L565L744L180K394K597
53497H45070L738M271L243J576R24J890L668M774M069J891J66M56J941K393J241
53482H81311J91N28J365J493J425K324L837M579M241L873M223N018N817O604P400
53467I34229Q081Q681R259R436Q762P702P568R172J1946J4665J6735J8452K0243
53454A084931K2020K3506K4865K6592K8725L0593L1680L2385L3452L4942L6398
$$ plain form
53443 1410089 1447816 1487037 1527858 1570094 1613772 1659336 1706726 1754868 1802980 1852036 1903936
53432 1903936 1959307 2017013 2075827 2135450 2195683 2255733 2315036 2373971 2432961 2491333 2547967
53421 2547967 2602870 2657424 2713004 2769826 2827163 2884220 2940611 2996428 3052179 3108359 3164590
53410 3164590 3219221 3270318 3317416 3361922 3405338 3447426 3486711 3522563 3555791 3587001 3615338
53399 3615338 3639536 3659528 3676353 3690901 3703468 3714124 3722718 3728582 3730791 3728635 3721546 3709019
53387 3709019 3691212 3669308 3644693 3618010 3589392 3558835 3525639 3488273 3446111 3400917 3355299
53376 3355299 3309865 3263196 3214413 3164253 3113437 3061632 3008618 2955155 2901943 2848891 2796276
53365 2796276 2745640 2698523 2654925 2613886 2575044 2538798 2505365 2474460 2445719 2418954 2394405
$$ packed form
53443A410089L7727L9221M0821M2236M3678M5564M7390M8142M8112M9056N1900
53432A903936N5371N7706N8814N9623O0233O0050N9303N8935N8990N8372N6634
53421B547967N4903N4554N5580N6822N7337N7057N6391N5817N5751N6180N6231
53410C164590N4631N1097M7098M4506M3416M2088L9285L5852L3228L1210K8337
53399C615338K4198J9992J6825J4548J2567J0656Q594N864K209k156p089j2527
53387C709019j7807k1904k4615k6683k8618l0557l3196l7366m2162m5194m5618
53376C355299m5434m6669m8783n0160n0816n1805n3014n3463n3212n3052n2615
53365B796276n0636m7117m3598m1039l8842l6246l3433l0905k8741k6765k4549
$$ plain form
53354 2394405 2373204 2357079 2346993 2342349 2341876 2344769 2350577 2358759 2369328 2383549 2403099 2428546
53342 2428546 2459200 2494203 2533159 2575849 2622004 2671395 2723732 2778546 2835542 2894957 2957303
53331 2957303 3022963 3092327 3165858 3243527 3324525 3408240 3495379 3587433 3684930 3786717 3891057
53320 3891057 3997105 4105307 4216701 4331742 4449582 4568600 4687957 4808353 4930757
53311 4930757 5054496 5177245 5297027 5413676 5528044 5640202 5748907 5852636 5950616 6042604
53301 6042604 6128003 6205802 6275555 6338041 6394447 6444997 6488755 6524677 6552273 6571255 6581248
53290 6581248 6582142 6574209 6557479 6531542 6496451 6453333 6403266 6345637 6278224 6199142 6108498 6008218
53278 6008218 5900740 5787986 5671191 5551216 5428802 5304651 5179530 5054496 4930799
$$ packed form
53354B394405k1201j6125j0086m644m73K893N808Q182J0569J4221J9550K5447
53342B428546L0654L5003L8956M2690M6155M9391N2337N4814N6996N9415O2346
53331B957303O5660O9364P3531P7669Q0998Q3715Q7139R2054R7497J01787J04340
53320C891057J06048J08202J11394J15041J17840J19018J19357J20396J22404
53311D930757J23739J22749J19782J16649J14368J12158J08705J03729R7980R1988
53301F042604Q5399P7799O9753O2486N6406N0550M3758L5922K7596J8982R993
53290F581248Q94p933j6730k5937l5091m3118n0067n7629o7413p9082r0644j00280
53278F008218j07478j12754j16795j19975j22414j24151j25121j25034j23697
$$ plain form
53269 4930799 4809293 4689996 4572563 4457045 4343815 4232843 4123647 4016049 3910603
53260 3910603 3808259 3710061 3616994 3529387 3446453 3367295 3292468 3223495 3160463 3101322 3044437
53249 3044437 2990817 2942678 2900513 2862901 2828814 2798577 2772592 2750491 2732067 2717951 2708670
53238 2708670 2703664 2701869 2702748 2706159 2711547 2718041 2725398 2734315 2745512 2758788 2773346 2789084 2807127
53225 2807127 2828745 2854030 2882106 2912573 2946066 2983218 3023688 3066607 3111513 3158353 3206926
53214 3206926 3256752 3307185 3357243 3405826 3452724 3499114 3546306 3594071 3640793 3685122 3726764
53203 3726764 3765659 3801155 3832503 3859740 3883642 3904869 3923427 3939041 3951878 3962593 3971337
53192 3971337 3976891 3977297 3971521 3960110 3944015 3923300 3897266 3865370 3827592 3784399 3736806 3685967
$$ packed form
53269D930799j21506j19297j17433j15518j13230j10972j09196j07598j05446
53260C910603j02344r8198r3067q7607q2934p9158p4827o8973o3032n9141n6885
53249C044437n3620m8139m2165l7612l4087l0237k5985k2101j8424j4116r281
53238B708670n006j795Q79L411N388O494P357Q917J1197J3276J4558J5738J8043
53225B807127K1618K5285K8076L0467L3493L7152M0470M2919M4906M6840M8573
53214C206926M9826N0433N0058M8583M6898M6390M7192M7765M6722M4329M1642
53203C726764L8895L5496L1348K7237K3902K1227J8558J5614J2837J0715Q744
53192C971337N554M06n776j1411j6095k0715k6034l1896l7778m3193m7593n0839
$$ plain form
53180 3685967 3632184 3574754 3513407 3449447 3384798 3320328 3255903 3191627 3127987 3064962 3002097
53169 3002097 2939594 2878383 2818891 2760579 2703012 2646609 2591911 2538671 2486101 2433712 2381673
53158 2381673 2330632 2281260 2233561 2186621 2139564 2092910 2048439 2007505 1969911 1934598 1900876
53147 1900876 1868653 1837873 1808124 1778635 1748523 1717304 1685307 1653315 1621752 1590464 1559296
53136 1559296 1528451 1498177 1468511 1439422 1410885 1382783 1355060 1327991 1301797 1275941 1249346
53125 1249346 1221538 1193155 1165157 1137835 1110669 1082785 1053556 1023388 993999 967231 943182
53114 943182 920007 895962 871232 847369 825413 805025 785141 764976 744607 725089 707869
53103 707869 693589 681346 669407 656719 643658 631317 620232 609886 599418 588657 578120
$$ packed form
53180C685967n3783n7430o1347o3960o4649o4470o4425o4276o3640o3025o2865
53169C002097o2503o1211n9492n8312n7567n6403n4698n3240n2570n2389n2039
53158B381673n1041m9372m7699m6940m7057m6654m4471m0934l7594l5313l3722
53147A900876l2223l0780k9749k9489l0112l1219l1997l1992l1563l1288l1168
53136A559296l0845l0274k9666k9089k8537k8102k7723k7069k6194k5856k6595
53125A249346k7808k8383k7998k7322k7166k7884k9229l0168k9389k6768k4049
53114I43182k3175k4045k4730k3863k1956k0388j9884k0165k0369j9518j7220
53103G07869j4280j2243j1939j2688j3061j2341j1085j0346j0468j0761j0537
$$ plain form
53092 578120 567979 557678 547053 537289 529790 524206 518589 511681 504096 496901 490101 483307 477046
53079 477046 472321 469131 466360 463112 459540 456330 453838 451767 449327 445971 442337 440152 440532 442435
53065 442435 443471 442359 440145 438957 440106 443492 448275 453674 459314 465090 470728 475541 478894 480879
53051 480879 482154 483045 483201 482193 480010 476692 471986 465931 459422 453479 447871 441112 432141 421735
53037 421735 411954 404382 398997 394363 388636 380844 371872 364043 359106 356404 353452 348491 342137 336403
53023 336403 332612 330462 328657 326047 322394 318427 315014 312216 309443 306526 304009 302109 300113 297388
53009 297388 294385 291874 289734 287396 285089 283591 282826 281741 279694 277043 274206 271071 267671 264690
52995 264690 262827 262181 262502 263499 264676 265466 265769 265853 265569 264372 262367 260622 260070 260729 262245 264408 266625
$$ packed form
53092E78120j0141j0301j0625r764p499n584n617o908p585p195o800o794o261
53079D77046m725l190k771l248l572l210k492k071k440l356l634k185L80J903
53065D42435J036j112k214j188J149L386M783N399N640N776N638M813L353J985
53051D80879J275Q91J56j008k183l318m706o055o509n943n608o759q971j0406
53037D21735r781p572n385m634n727p792q972p829m937k702k952m961o354n734
53023C36403l791k150j805k610l653l967l413k798k773k917k517j900j996k725
53009B97388l003k511k140k338k307j498p65j085k047k651k837l135l400k981
52995B64690j863o46L21R97J177P90L03Q4k84j197k005j745n52O59J516K163K217
$$ plain form
52978 266625 267735 267074 265189 262885 260115 256514 252518 249108 246752 245278 244528 244357 244150 243066 240849
52963 240849 238057 235578 234250 234577 236230 237988 238775 238605 238195 237859 237369 236640 235927 235309 234523 233364 231986
52946 231986 230868 230716 232083 234679 237272 238748 239077 238865 238292 237092 235433 234164 234087 235280 237050 238381
52930 238381 238729 238631 239144 240457 241716 242606 244194 247382 251435 255199 259005 263839 269046 272665 274171
52915 274171 275390 278426 284065 292339 302837 313800 322643 328543 333287 338465 343111 345504 346109 346939
52901 346939 348640 350046 350394 350218 349909 348975 347226 345408 344012 342378 339591 335541 330673 325472 320712
52886 320712 317397 315628 314038 311167 307146 303391 300883 299476 298765 298752 299409 300173 300371 299932 299324 298913
52870 298913 298670 298459 298263 297973 297198 295577 293266 290925 289210 288467 288814 290100 291632 292492 292471 292261 292175
$$ packed form
52978B66625J110o61j885k304k770l601l996l410k356j474p50j71k07j084k217
52963B40849k792k479j328L27J653J758P87j70m10l36m90p29p13o18p86j159j378
52946B31986j118j52J367K596K593J476L29k12n73j200j659j269p7J193J770J331
52930B38381L48r8N13J313J259Q90J588L188M053L764L806M834N207L619J506
52915B74171J219L036N639Q274J0498J0963Q843N900M744N178M646K393O05Q30
52901C46939J701J406L48j76l09r34j749j818j396j634k787m050m868n201m760
52886C20712l315j769j590k871m021l755k508j407p11j3O57P64J98m39o08m11
52870B98913k43k11j96k90p75j621k311k341j715p43L47J286J532Q60k1k10q6
$$ plain form
52853 292175 291192 288289 284637 283197 285592 290200 294087 295955 296271 295209 292236 287931 284742 284854 287878
52838 287878 291343 293030 292283 289670 286543 284824 286025 289835 294194 297162 298392 298587 298259 297691 297677 299127
52822 299127 301708 303671 303666 302427 302080 303926 307360 310903 313663 315596 316869 317570 317907 318241 318879 320056
52806 320056 322052 324862 327815 330028 331465 333029 335261 337310 337811 336718 335725 336816 340636 346310 352461
52791 352461 358242 363654 369141 374878 380502 385611 390316 394991 399510 403186 405540 406840 407752 408807
52777 408807 410337 412458 414705 415907 414879 411299 405788 399272 392535 386150 380416 375269 370549 366403
52763 366403 363143 360572 357802 354119 349896 346218 343516 340927 337294 332544 327708 323770 320938 318902
52749 318902 317064 314387 309901 304007 298643 295295 293199 290460 286674 283344 281600 280739 279578 278248
$$ packed form
52853B92175r83k903l652j440K395M608L887J868L16j062k973m305l189J12L024
52838B87878L465J687p47k613l127j719J201L810M359K968J230J95l28n68j4J450
52822B99127K581J963nj239l47J846L434L543K760J933J273P01L37L34O38J177
52806C20056J996K810K953K213J437J564K232K049N01j093r93J091L820N674O151
52791C52461N781N412N487N737N624N109M705M675M519L676K354J300R12J055
52777D08807J530K121K247J202j028l580n511o516o737o385n734n147m720m146
52763C66403l260k571k770l683m223l678k702k589l633m750m836l938k832k036
52749C18902j838k677m486n894n364l348k096k739l786l330j744q61j161j330
$$ plain form
52735 278248 277787 278479 279427 279521 278192 275399 271565 267563 264381 262652 262453 263229 263821 263142 261220 259157
52719 259157 257678 256195 253751 250390 246974 244087 241803 240167 239096 238049 236598 235189 234520 234267 233289
52704 233289 231168 228671 226436 223927 220195 215241 210222 206339 203685 201328 198803 197315 198510 201706
52690 201706 203617 202000 198552 196541 196304 195250 192029 188170 185047 181895 178201 175834 176603 179199 180886
52675 180886 181339 182450 184705 186150 185285 182979 180857 179345 178144 177459 177768 179035 180800 182539 183624
52660 183624 183498 182246 180506 178595 176272 173441 170456 167629 165131 163452 163117 163800 164605 165474 167380
52645 167380 170795 175006 179325 183851 188397 191899 193901 195631 198374 201588 203889 205334 207221 209832
52631 209832 211864 212323 211856 211805 212609 213398 212657 209384 204233 199315 196198 194386 192478 190245 188312 186225
$$ packed form
52735B78248m61O92R48R4j329k793l834m002l182j729j99P76N92o79j922k063
52719B59157j479j483k444l361l416k887k284j636j071j047j451j409o69k53r78
52704B33289k121k497k235k509l732m954n019l883k654k357k525j488J195L196
52690B01706J911j617l448k011k37j054l221l859l123l152l694k367P69K596J687
52675A80886M53J111K255J445q65k306k122j512j201o85L09J267J765J739J085
52660A83624j26j252j740j911k323k831k985k827k498j679l35O83Q05Q69J906
52645A67380L415M211M319M526M546L502K002J730K743L214K301J445J887K611
52631B09832K032M59m67n1Q04P89p41l273n151m918l117j812j908k233j933k087
$$ plain form
52615 186225 182661 177804 173689 171499 170046 167940 165754 164671 164109 162419 159421 156573 154713 153067
52601 153067 150696 147802 145247 143631 143141 143600 144404 144948 145288 145861 146474 146210 144582 142286 140592 140299
52585 140299 141269 142536 142858 141723 139862 138293 136998 135322 133661 133561 135637 138376 139872 140089 140360
52570 140360 141176 141745 141852 142815 145780 149792 152493 152517 150456 147522 144245 140924 138448 137656 138108 138580
52554 138580 138838 139899 142172 144425 145375 145402 145529 145486 144307 142653 142786 145706 149665 152311 153338 154207
52538 154207 156079 158965 162186 164547 164471 161279 156461 152840 152081 153489 155182 155852 155348 154290 153600 154029
52522 154029 155726 158330 161557 165465 169974 174333 177431 178727 178828 179038 180277 182450 184877 187244 189914
52507 189914 193336 197436 201673 205473 208470 210524 211685 212116 212007 211621 211292 211202 211248 211362 211665 212031 211926
$$ packed form
52615A86225l564m857m115k190j453k106k186j083n62j690k998k848j860j646
52601A53067k371k894k555j616m90M59Q04N44L40N73O13k64j628k296j694k93
52585A40299R70J267L22j135j861j569j295j676j661j00K076K739J496K17K71
52570A40360Q16N69J07R63K965M012K701K4k061k934l277l321k476p92M52M72
52554A38580K58J061K273K253R50K7J27m3j179j654J33K920L959K646J027Q69
52538A54207J872K886L221K361p6l192m818l621p59J408J693O70n04j058o90M29
52522A54029J697K604L227L908M509M359L098J296J01K10J239K173K427K367K670
52507A89914L422M100M237L800K997K054J161M31j09l86l29r0M6J14L03L66j05
$$ plain form
52490 211926 211466 212363 216609 223866 231166 235750 237532 238348 239716 242013 244882 247349 248160 247118 245800
52475 245800 245826 246705 246593 245028 243594 243620 244438 244575 243744 242932 242997 243893 245082 246217 247421 249051 251109
52458 251109 252878 253355 252134 249803 247534 246457 247081 248886 250528 250837 249634 247520 245322 244039 244610
52443 244610 246861 249013 249213 247470 245260 243401 241414 239100 237551 237991 240276 242968 244552 244454 243456
52428 243456 243133 244274 245849 246378 246191 247158 249967 253008 254592 255056 255850 257509 259539 261497 263161 264272
52412 264272 265169 267158 271008 275371 277779 277201 274911 273019 272867 274479 276581 277252 275533 272503 270109
52397 270109 269056 268669 268669 269953 273342 278415 283925 288681 291794 292971 293070 293827 296410 300456 304689 308111
$$ packed form
52490B11926m60Q97M246P257P300M584J782Q16J368K297K869K467Q11j042j318
52475B45800K6Q79j12j565j434K6Q18J37q31q12O5Q96J189J135J204J630K058
52458B51109J769M77j221k331k269j077O24J805J642L09j203k114k198j283N71
52443B44610K251K152K00j743k210j859j987k314j549M40K285K692J584r8r98
52428B43456l23J141J575N29j87R67K809L041J584M64P94J659K030J958J664J111
52412B64272Q97J989L850M363K408n78k290j892j52J612K102O71j719l030k394
52397B70109j053l87%J284L389N073N510M756L113J177R9P57K583M046M233L422
$$ [...]
##END NTUPLES=NMR SPECTRUM
##END=
