##TITLE=coffee_type TORI01-ROVE100C_95-5%
COFFEE_meoh_noesyp64 COFFEE_meoh {C:\Bruker\TOPSPIN} Administrator 12
##JCAMPDX= 6.0         $$ Bruker NMR JCAMP-DX V2.0
##DATA TYPE= NMR SPECTRUM
##DATA CLASS= NTUPLES
##ORIGIN= Bruker BioSpin GmbH
##OWNER= Administrator
$$ 1.72 TOPSPIN		Version 2.1
$$ 2012-05-18 15:41:38.120 -0700  Administrator@X
$$ Compression mode = diff/dup
##.OBSERVE FREQUENCY= 400.13188235
##.OBSERVE NUCLEUS= ^1H
##.ACQUISITION MODE= SIMULTANEOUS (DQD)
##.ACQUISITION SCHEME= undefined
##.AVERAGES= 64
##.DIGITISER RES= 22
##SPECTROMETER/DATA SYSTEM= spect
##.PULSE SEQUENCE= noesygpps1d.comp
##.SOLVENT NAME= COFFEE_meoh
##.SHIFT REFERENCE= INTERNAL, COFFEE_meoh, 1, 14.98061
##AUDIT TRAIL= $$ (NUMBER, WHEN, WHO, WHERE, PROCESS, VERSION, WHAT)
$$ ##TITLE= Audit trail, TOPSPIN		Version 2.1
$$ ##JCAMPDX= 5.01
$$ ##ORIGIN= Bruker BioSpin GmbH
$$ ##OWNER= Administrator
$$ $$ C:\Bruker\TOPSPIN/data/Administrator/nmr/12-COFFEE-2002/122/pdata/1/auditp.txt
$$ ##AUDIT TRAIL=  $$ (NUMBER, WHEN, WHO, WHERE, PROCESS, VERSION, WHAT)
(   1,<2012-02-21 00:47:32.328 -0500>,<Administrator>,<TOPSPIN>,<go>,<TOPSPIN 2.1>,
      <created by zg
	started at 2012-02-21 00:36:01.813 -0500,
	POWCHK enabled, PULCHK disabled,
       configuration hash MD5:
       B0 76 FB 9C 50 81 44 7D 18 B3 26 32 4E 60 AD 96
       data hash MD5: 64K
       C3 6C 74 BD A7 89 11 B2 3B D2 DA 3E B2 56 0B A7>)
(   2,<2012-02-21 00:47:35.016 -0500>,<Administrator>,<TOPSPIN>,<proc1d>,<TOPSPIN 2.1>,
      <Start of raw data processing
       efp LB = 0.3 FT_mod = 6 PKNL = 1 PHC0 = 0 PHC1 = 0 SI = 128K 
       data hash MD5: 128K
       6E 87 C7 0D 2B 69 FC 36 5F F0 72 19 7E 62 D9 E9>)
(   3,<2012-02-21 00:47:36.344 -0500>,<Administrator>,<TOPSPIN>,<proc1d>,<TOPSPIN 2.1>,
      <pk PHC0 = 23.28552 PHC1 = 0 
       data hash MD5: 128K
       C7 C8 67 E9 D4 A7 A8 F6 4D 05 4B 46 C2 75 B2 16>)
(   4,<2012-02-21 00:47:36.609 -0500>,<Administrator>,<TOPSPIN>,<proc1d>,<TOPSPIN 2.1>,
      <abs ABSG = 1 
       data hash MD5: 128K
       73 C8 15 F7 B5 31 1B 9A 2A 4A 0E BA B2 D8 6B EE>)
(   5,<2012-02-21 00:47:36.688 -0500>,<Administrator>,<TOPSPIN>,<proc1d>,<TOPSPIN 2.1>,
      <abs ABSG = 2 
       data hash MD5: 128K
       B0 06 0E 90 F8 33 B9 89 AE DE 32 0F 6A 03 6E 4E>)
(   6,<2012-02-21 00:47:36.750 -0500>,<Administrator>,<TOPSPIN>,<proc1d>,<TOPSPIN 2.1>,
      <abs ABSG = 3 
       data hash MD5: 128K
       BB 9B D0 6E D8 0B FA 42 EA 01 06 3E B9 11 C4 CD>)
(   7,<2012-02-21 00:47:36.828 -0500>,<Administrator>,<TOPSPIN>,<proc1d>,<TOPSPIN 2.1>,
      <abs ABSG = 4 
       data hash MD5: 128K
       3E 5D A1 1A 9D 8E 2A 70 40 11 1F 7A 44 82 ED 66>)
(   8,<2012-02-21 00:47:36.875 -0500>,<Administrator>,<TOPSPIN>,<proc1d>,<TOPSPIN 2.1>,
      <abs ABSG = 5 
       data hash MD5: 128K
       89 D2 CA C8 E6 2E 47 F8 36 C1 E8 AF CA 74 96 1B>)
(   9,<2012-02-21 00:47:37.234 -0500>,<Administrator>,<TOPSPIN>,<audit>,<TOPSPIN 2.1>,
      <user comment:
       ICON-NMR User ID: Administrator
$$ [...]
150 150 150 150 150 150 150 150
##$TP07= 0
##$TPNAME0= <>
##$TPNAME1= <>
##$TPNAME2= <>
##$TPNAME3= <>
##$TPNAME4= <>
##$TPNAME5= <>
##$TPNAME6= <>
##$TPNAME7= <>
##$TPOAL= (0..7)
0.5 0.5 0.5 0.5 0.5 0.5 0.5 0.5
##$TPOFFS= (0..7)
0 0 0 0 0 0 0 0
##$TUNHIN= 0
##$TUNHOUT= 0
##$TUNXOUT= 0
##$USERA1= <user>
##$USERA2= <user>
##$USERA3= <user>
##$USERA4= <user>
##$USERA5= <user>
##$V9= 5
##$VALIST= <valist>
##$VCLIST= <CCCCCCCCCCCCCCC>
##$VD= 0
##$VDLIST= <DDDDDDDDDDDDDDD>
##$VPLIST= <PPPPPPPPPPPPPPP>
##$VTLIST= <TTTTTTTTTTTTTTT>
##$WBST= 1024
##$WBSW= 4
##$XGAIN= (0..3)
0 0 0 0
##$XL= 0
##$YL= 0
##$YMAX_a= 15013404
##$YMIN_a= -6973382
##$ZGOPTNS= <>
##$ZL1= 120
##$ZL2= 120
##$ZL3= 120
##$ZL4= 120
##$ABSF1= 14.98061
##$ABSF2= -5.57192
##$ABSG= 5
##$ABSL= 3
##$ALPHA= 0
##$AQORDER= 0
##$ASSFAC= 0
##$ASSFACI= 0
##$ASSFACX= 0
##$ASSWID= 0
##$AUNMP= <proc_prof1d_extract>
##$AXLEFT= 0
##$AXNAME= <>
##$AXNUC= <1H>
##$AXRIGHT= 0
##$AXTYPE= 0
##$AXUNIT= <>
##$AZFE= 0.1
##$AZFW= 0.1
##$BCFW= 0
##$BC_mod= 0
##$BYTORDP= 0
##$COROFFS= 0
##$CY= 15
##$DATMOD= 1
##$DC= 0
##$DFILT= <>
##$DTYPP= 0
##$F1P= 0
##$F2P= 0
##$FCOR= 0.5
##$FTSIZE= 131072
##$FT_mod= 6
##$GAMMA= 0
##$GB= 0
##$INTBC= 1
##$INTSCL= 1
##$ISEN= 128
##$LB= 0.3
##$LEV0= 0
##$LPBIN= 0
##$MAXI= 10000
##$MC2= 0
##$MEAN= 0
##$ME_mod= 0
##$MI= 0
##$NCOEF= 0
##$NC_proc= -3
##$NLEV= 6
##$NOISF1= 0
##$NOISF2= 0
##$NSP= 0
##$NTH_PI= 0
##$NZP= 0
##$OFFSET= 14.98061
##$PC= 1
##$PHC0= 23.28552
##$PHC1= 0
##$PH_mod= 1
##$PKNL= yes
##$PPARMOD= 0
##$PPDIAG= 0
##$PPIPTYP= 0
##$PPMPNUM= 2147483647
##$PPRESOL= 1
##$PSCAL= 4
##$PSIGN= 0
##$PYNMP= <proc.py>
##$REVERSE= no
##$SF= 400.13
##$SI= 131072
##$SIGF1= 0
##$SIGF2= 0
##$SINO= 400
##$SIOLD= 131072
##$SPECTYP= <>
##$SREGLST= <1H.CDCl3>
##$SSB= 0
##$STSI= 131072
##$STSR= 0
##$SW_p= 8223.68421052632
##$SYMM= 0
##$S_DEV= 0
##$TDeff= 65536
##$TDoff= 0
##$TI= <>
##$TILT= no
##$TM1= 0
##$TM2= 0
##$TOPLEV= 0
##$USERP1= <user>
##$USERP2= <user>
##$USERP3= <user>
##$USERP4= <user>
##$USERP5= <user>
##$WDW= 1
##$XDIM= 131072
##$YMAX_p= 523743054
##$YMIN_p= -322539135
##$CURPLOT= <Network HP LaserJet P1505>
##$CURPRIN= <$Network HP LaserJet P1505>
##$DFORMAT= <normdp>
##$LAYOUT= <+/1D_H.xwp>
##$LFORMAT= <normlp>
##$PFORMAT= <normpl>
##$SURQMSG= 1
$$ End of Bruker specific parameters
$$ ---------------------------------
##NTUPLES= NMR SPECTRUM
##VAR_NAME=  FREQUENCY,     SPECTRUM/REAL,   SPECTRUM/IMAG
##SYMBOL=    X,             R,               I
##VAR_TYPE=  INDEPENDENT,   DEPENDENT,       DEPENDENT
##VAR_FORM=  AFFN,          ASDF,            ASDF
##VAR_DIM=   131072,        131072,          131072
##UNITS=     HZ,            ARBITRARY UNITS, ARBITRARY UNITS
##FACTOR=    0.0627417313425165, 1,          1
##FIRST=     8223.62146879498, -1009,        -95158
##LAST=      0,             1917,            -96107
##MIN=       0,             -322539135,      0
##MAX=       8223.62146879498, 523743054,    0
$$ Real data points
##PAGE= N=1
##DATA TABLE= (X++(R..R)), XYDATA
$$ [...]
60650A529826j2354j1061j0204r620r426r493r128p822n966m258k755j142L40
60637A436937J135J542K656M719O263N589K805l39k442l693n050o993r412j2190
60623A421527j5205j8026k0214k1842k3132k3648k2586k0038j7247j5297j4206
60612A210086j3456j2593j0940p778l661n01P62J665L957O643P179N412M099N021
60598A195895O617O539M950L806M010M799N438O029O693P148P224P187P350P762
60584A281447Q181Q128P287O131N772O895R098J1446J3184J3845J3535J3422J4950
60571A413321J7991K0721K1974K2617K3773K4825K4561K3323K2364K1775K0709
60560A657954J9207J7873J6052J2494Q017N198M630L565m15o027j0148j1734j2181
$$ plain form
60650 1529826 1517472 1506411 1496207 1486587 1477161 1467668 1458540 1450718 1444752 1440494 1437739 1436597 1436937
60637 1436937 1438072 1439614 1442270 1446989 1453252 1458841 1461646 1461307 1458865 1455172 1450122 1443129 1433717 1421527
60623 1421527 1406322 1388296 1368082 1346240 1323108 1299460 1276874 1256836 1239589 1224292 1210086
60612 1210086 1196630 1184037 1173097 1165319 1161658 1161157 1161919 1163584 1167541 1174184 1181363 1186775 1190874 1195895
60598 1195895 1202512 1209051 1214001 1217807 1221817 1226616 1232054 1238083 1244776 1251924 1259148 1266335 1273685 1281447
60584 1281447 1289628 1297756 1305043 1311174 1316946 1323841 1332939 1344385 1357569 1371414 1384949 1398371 1413321
60571 1413321 1431312 1452033 1474007 1496624 1520397 1545222 1569783 1593106 1615470 1637245 1657954
60560 1657954 1677161 1695034 1711086 1723580 1731597 1736795 1741425 1744990 1744575 1738548 1728400 1716666 1704485
60547A704485j2569j2535j1679j0426r263q274p678p850q571r049q966q776q864
60534A579985r156r695j0716j1759j1547r377o196l620k246j424m31Q03K027L138
60520A509786M105M779M976M632L887L097K635K492K157J210J6n40K9J334K681
60505A547276L688M123L509J351k058n451p428p612o828o197o006n570m149j869
60491A506779L44J791K825M574P832J2172J6287J9253K1402K3856K7279L1413
60479A675807L5763M0316M5222N0217N4751N8492O1100O1628N8788N2142M2702
60468B236928L2036K0989R465k655j4530k4274k9963l0927k8097k3022j6737r700
60456B119513k316N058J2392J9589K5919L0623L3980L6927L9527M0885M0920M1222
$$ plain form
60547 1704485 1691916 1679381 1667702 1657276 1648013 1639739 1632061 1624211 1615640 1606591 1597625 1588849 1579985
60534 1579985 1570829 1561134 1550418 1538659 1527112 1517735 1511539 1507919 1505673 1504249 1503818 1504621 1506648 1509786
60520 1509786 1513891 1518670 1523646 1528278 1532165 1535262 1537897 1540389 1542546 1543756 1543772 1543232 1543261 1544595 1547276
60505 1547276 1550964 1555087 1558596 1559947 1557889 1552438 1545010 1537398 1530570 1524373 1518367 1512797 1508648 1506779
60491 1506779 1507123 1508914 1511739 1516313 1524145 1536317 1552604 1571857 1593259 1617115 1644394 1675807
60479 1675807 1711570 1751886 1797108 1847325 1902076 1960568 2021668 2083296 2142084 2194226 2236928
60468 2236928 2268964 2289953 2299418 2296763 2282233 2257959 2227996 2197069 2168972 2145950 2129213 2119513
60456 2119513 2117197 2122255 2134647 2154236 2180155 2210778 2244758 2281685 2321212 2362097 2403017 2444239
60444B444239M3487M7913N3797O0975O9732P9896R0998J03154J17032J33095J51391
60433C395709J71747J93604K15994K38404K61324K85305L09863L34057L57918
60424E763925L82453M08275M34436M57889M73000M72023M47412L94414L11898
60415I545725K02197P1695o8869k06548l29629m29361n00017n39770n51809n42832
60405F650782n19409m86281m47594m07564l68921l32023k96573k63350k33458
60396C295609k06978j83465j63017j45784j30969j17455j05154r4878q6829p9973
60386A981107p2985o5526n8538n3384n0345m8056m4900m0909l7546l5476l3680
60375A439762l1237k8815k7405k6396k4203k0521j6816j4562j3761j3337j2396
$$ plain form
60444 2444239 2487726 2535639 2589436 2650411 2720143 2800039 2891037 2994191 3111223 3244318 3395709
60433 3395709 3567456 3761060 3977054 4215458 4476782 4762087 5071950 5406007 5763925
60424 5763925 6146378 6554653 6989089 7446978 7919978 8392001 8839413 9233827 9545725
60415 9545725 9747922 9819617 9750748 9544200 9214571 8785210 8285193 7745423 7193614 6650782
60405 6650782 6131373 5645092 5197498 4789934 4421013 4088990 3792417 3529067 3295609
60396 3295609 3088631 2905166 2742149 2596365 2465396 2347941 2242787 2147909 2061080 1981107
60386 1981107 1908122 1842596 1784058 1730674 1680329 1632273 1587373 1546464 1508918 1473442 1439762
60375 1439762 1408525 1379710 1352305 1325909 1301706 1281185 1264369 1249807 1236046 1222709 1210313
60364A210313j0877r302q098p172o227n332m745m206l068j378q1J97J4L07J315
60349A151660K701M150N231N302M283L031K331J906J201O81J431L588O022P530
60335A201048P827P427P158P786R360J0783J0523Q152M916K576J756J606J021
60322A281939k2p10q74j568l547n808o641n924n164n079m565k714n94J03n64r40
60306A237328R6K134M095N208N190M312L338K931L120L620M368N328O138O532
60292A293738O902P887R479J0919J1453J1017J0334J0356J1168J1542J0286Q062
60280A413143O825P194P570O487M599L302K590J610N76N43J554K428K390J845
60266A462656J649K464M619P514R433Q939O409L325M46k232m174m622m225m715
$$ plain form
60364 1210313 1199436 1190134 1182036 1174864 1168637 1163305 1158560 1154354 1151286 1149908 1149827 1150024 1150038 1150345 1151660
60349 1151660 1154361 1158511 1163742 1169044 1173327 1176358 1178689 1180595 1181796 1182477 1183908 1187496 1193518 1201048
60335 1201048 1208875 1216302 1223460 1231246 1240606 1251389 1261912 1270064 1274980 1277556 1279312 1280918 1281939
60322 1281939 1281917 1281207 1280333 1278765 1275218 1269410 1262769 1256845 1251681 1246602 1242037 1239323 1238729 1238832 1238268 1237328
60306 1237328 1237424 1239558 1243653 1248861 1254051 1258363 1261701 1264632 1267752 1271372 1275740 1281068 1287206 1293738
60292 1293738 1300640 1308527 1318006 1328925 1340378 1351395 1361729 1372085 1383253 1394795 1405081 1413143
60280 1413143 1419968 1427162 1434732 1441219 1445818 1449120 1451710 1453320 1453896 1454439 1455993 1458421 1460811 1462656
60266 1462656 1464305 1466769 1471388 1478902 1488335 1497274 1503683 1507008 1507454 1505222 1501048 1496426 1492201 1487486
60252A487486o480p806p235n511m326l996l458k105o79j90n08l73J236L897O181
60237A456133P225P359P048O128M670L765M403O016P266P870Q507R126Q791P396
60223A551703O227O435P844R561J0850J1183J0413R341R324J0835J3036J5014
60211A671766J6695J8341K0005K1821K4081K6578K8655L0293L2491L5975M0183
60200A966884M4096M7660N1805N7247O3567O9423P3670P6607Q0011Q5493R2987
60189B709450J01364J10078J19252J28514J37118J45304J54081J63304J71373
60180C939838J77455J82587J87711J91876J93455J91979J87475J79075J66100
60171E597551J50003J33463J17492J00771Q2082O2072M2266K3492N959r913k3497
$$ plain form
60252 1487486 1481006 1473200 1465965 1460454 1456128 1452132 1448674 1446569 1445890 1445700 1445192 1444819 1446055 1449952 1456133
60237 1456133 1463358 1470717 1477765 1483893 1488563 1492328 1496731 1502747 1510013 1517883 1526390 1535516 1544307 1551703
60223 1551703 1557930 1564365 1572209 1581770 1592620 1603803 1614216 1623557 1632881 1643716 1656752 1671766
60211 1671766 1688461 1706802 1726807 1748628 1772709 1799287 1827942 1858235 1890726 1926701 1966884
60200 1966884 2010980 2058640 2110445 2167692 2231259 2300682 2374352 2450959 2530970 2616463 2709450
60189 2709450 2810814 2920892 3040144 3168658 3305776 3451080 3605161 3768465 3939838
60180 3939838 4117293 4299880 4487591 4679467 4872922 5064901 5252376 5431451 5597551
60171 5597551 5747554 5881017 5998509 6099280 6181362 6243434 6285700 6309192 6315151 6305238 6281741
60160F281741l4462m2786m8402n1015n0022m4712l5091k2611r462L334J6730L2220
60148E995462M9930O8553Q6805J04307J21166J37393J52787J66744J77914J84628
60138G245689J86124J83053J76347J65992J51430J32836J11225Q7540O2411L6675
60128H539322J1090j4572m0946o7034q9855j07054j19057j27541j32435j31834
60118G720084j24807j12954r8807q3419o6081m5889k3210K66K2804M3984O4463
60107G296434Q4357J02264J16357J25922J31295J32717J30044J23256J12559R8176
60097H453381Q0774O1851M3065K5352R241m425j4866k1921k5305k3814j6450m044
60085H562839J1565K9670N0716P4453R9765J26494J55740J87761K21156K54735
$$ plain form
60160 6281741 6247279 6204493 6156091 6105076 6055054 6010342 5975251 5952640 5943178 5946512 5963242 5995462
60148 5995462 6045392 6113945 6200750 6305057 6426223 6563616 6716403 6883147 7061061 7245689
60138 7245689 7431813 7614866 7791213 7957205 8108635 8241471 8352696 8440236 8502647 8539322
60128 8539322 8550412 8535840 8494894 8427860 8338005 8230951 8111894 7984353 7851918 7720084
60118 7720084 7595277 7482323 7383516 7300097 7234016 7188127 7164917 7165183 7187987 7231971 7296434
60107 7296434 7380791 7483055 7599412 7725334 7856629 7989346 8119390 8242646 8355205 8453381
60097 8453381 8534155 8596006 8639071 8664423 8673664 8669239 8654373 8632452 8607147 8583333 8566883 8562839
60085 8562839 8574404 8604074 8654790 8729243 8829008 8955502 9111242 9299003 9520159 9774894
60075I774894K88929L24458L60873L97288M33442M68917N02239N31840N57212
60066A3640092N78039N92791N99242N96143N83481N61386N29527M87564M35647
60057A8603912L74669L06383K32950J55990P6316n156q6872j67139k44352l16220
60047A8930481l79546m31617m71272m98107n11429n10991m98190m75382m44213
60038A4709734m05495l60537l11538k60585k08996j57856j08398o1483j7251K4150
60028A2841745O1639R3355J17723J34082J42075J40932J30083J10630Q5272N6066
60018A3913602K3017j4014n2616q8711j20317j48834j76035k01341k23041k40873
60008A2670837k55814k67941k76078k79440k78399k73482k64658k51995k36393
$$ plain form
60075 9774894 10063823 10388281 10749154 11146442 11579884 12048801 12551040 13082880 13640092
60066 13640092 14218131 14810922 15410164 16006307 16589788 17151174 17680701 18168265 18603912
60057 18603912 18978581 19284964 19517914 19673904 19750220 19745064 19658192 19491053 19246701 18930481
60047 18930481 18550935 18119318 17648046 17149939 16638510 16127519 15629329 15153947 14709734
60038 14709734 14304239 13943702 13632164 13371579 13162583 13004727 12896329 12834846 12817595 12841745
60028 12841745 12903384 12996739 13114462 13248544 13390619 13531551 13661634 13772264 13857536 13913602
60018 13913602 13936619 13922605 13869989 13781278 13660961 13512127 13336092 13134751 12911710 12670837
60008 12670837 12415023 12147082 11871004 11591564 11313165 11039683 10775025 10523030 10286637
59999A0286637k19181k01043j81514j59489j34405j06998p8749n0568k2453N624
59989I137861L3077N9232Q3905J06969J27687J44922J57753J65691J68434J65613
59979A0351144J56560J40623J18154R1037O1417K9932l851l9227p3818j05627
59969A0726344j34499j60799j83552k00758k10980k14103k11023k03178j91848
59960I015604j77476j60094j40399j19454r7267p3062m7278k1815K636K7893N5627
59949H264915Q4647J12376J38035J62786J87298K10758K31885K49540K62506K69745
59939A0174491K70640K64235K49136K25318J95165J61321J24326Q4003M2169J625
59929A1792429l7227p6205j15350j51273j80222k01046k14363k20560k19896k13341
$$ plain form
59999 10286637 10067456 9866413 9684899 9525410 9391005 9284007 9205258 9154690 9132237 9137861
59989 9137861 9170938 9230170 9314075 9421044 9548731 9693653 9851406 10017097 10185531 10351144
59979 10351144 10507704 10648327 10766481 10857518 10918935 10948867 10945016 10905789 10831971 10726344
59969 10726344 10591845 10431046 10247494 10046736 9835756 9621653 9410630 9207452 9015604
59960 9015604 8838128 8678034 8537635 8418181 8320914 8247852 8200574 8178759 8181395 8209288 8264915
59949 8264915 8349562 8461938 8599973 8762759 8950057 9160815 9392700 9642240 9904746 10174491
59939 10174491 10445131 10709366 10958502 11183820 11378985 11540306 11664632 11748635 11790804 11792429
59929 11792429 11755202 11678997 11563647 11412374 11232152 11031106 10816743 10596183 10376287 10162946
59919A0162946k01816j85250j63409j37279j08818p9526m9869j9937R731L8117
59909I264890O4442Q8899J12139J33702J51723J64978J74457J81743J86346J86310
59899A0709629J81167J72451J61274J47414J31418J15622J01826Q9516P7658O7082
59889A1955057N9714N6522N7745O4405P7813R7857J23078J52389J85600K22428
59879A3052608K62426L05864L53223M03302M52798M98524N39310N75154O05060
59870A7048269O26171O34587O26367N98211N48139M76013L83364K72943J48879
59861B1362943J7171j14721k39439l51063m45432n19955n73763o07618o23021
59852A7905102o21446o04797n76147n38959m95443m46544l93739l39565k85644
$$ plain form
59919 10162946 9961130 9775880 9612471 9475192 9366374 9286848 9236979 9217042 9226773 9264890
59909 9264890 9329332 9418231 9530370 9664072 9815795 9980773 10155230 10336973 10523319 10709629
59899 10709629 10890796 11063247 11224521 11371935 11503353 11618975 11720801 11810317 11887975 11955057
59889 11955057 12014771 12071293 12129038 12193443 12271256 12369113 12492191 12644580 12830180 13052608
59879 13052608 13315034 13620898 13974121 14377423 14830221 15328745 15868055 16443209 17048269
59870 17048269 17674440 18309027 18935394 19533605 20081744 20557757 20941121 21214064 21362943
59861 21362943 21380114 21265393 21025954 20674891 20229459 19709504 19135741 18528123 17905102
59852 17905102 17283656 16678859 16102712 15563753 15068310 14621766 14228027 13888462 13602818
59843A3602818k31277j75404j19416o6593j8760K5159O6959J06757J43269J75273
59833A3508785K01641K20368K28906K25686K10790J84740J47221R7429L5887l4441
59823A5027012j08950j83239k54119l19166l75906m21840m55274m75991m85186
59814A1947341m84596m75559m59004m36448m10318l82556l53238l21700k88980
59805H334942k57768k29647k03943j80017j59227j43203j31349j21807j14114
59796F793867j09073j06259j03719j00303r6515r2544q7094p9128o9582o0316
59786E889334n2135m4689l7770l1952k8324k8044l1657l8292m6105n3898o1718
59775E434750o9368p5096p6772p4121o8858o2685n5850m7718l8015k7193j6070
$$ plain form
59843 13602818 13371541 13196137 13076721 13010128 12991368 13016527 13083486 13190243 13333512 13508785
59833 13508785 13710426 13930794 14159700 14385386 14596176 14780916 14928137 15025566 15061453 15027012
59823 15027012 14918062 14734823 14480704 14161538 13785632 13363792 12908518 12432527 11947341
59814 11947341 11462745 10987186 10528182 10091734 9681416 9298860 8945622 8623922 8334942
59805 8334942 8077174 7847527 7643584 7463567 7304340 7161137 7029788 6907981 6793867
59796 6793867 6684794 6578535 6474816 6374513 6277998 6185454 6098360 6019232 5949650 5889334
59786 5889334 5837199 5792510 5754740 5722788 5694464 5666420 5634763 5596471 5550366 5496468 5434750
59775 5434750 5365382 5290286 5213514 5139393 5070535 5007850 4952000 4904282 4866267 4839074 4823004
59764D823004n405M505J4280K5213L8035N1851O4695P5249Q3543Q9884R4061R6367
59752E455282R8629J02638J07604J10601J09897J06352J00855R2125P8700O2076
59742F424759M6103L3480K4446J8495J5720J6226J9695K6090L5713M8283O2950
59731F771960P9631R9210J22049J47216J73711K01576K31190K62264K94242L27131
59721H710180L61207L96234M31494M66318M99775N29341N49658N52625N29448
59712A3026280M73876L84674K66237J28265j4932j47029k54850l32591l81196
59703A3148734m04369m06183l91394l65178l31263k91518k48015k04073j62198
59694A0344543j22207q2640m3433o074K8371O0279R0768J20795J50997J81685
$$ plain form
59764 4823004 4817599 4822104 4836384 4861597 4899632 4951483 5016178 5091427 5174970 5264854 5358915 5455282
59752 5455282 5553911 5656549 5764153 5874754 5984651 6091003 6191858 6283983 6362683 6424759
59742 6424759 6470862 6504342 6528788 6547283 6563003 6579229 6598924 6625014 6660727 6709010 6771960
59731 6771960 6851591 6950801 7072850 7220066 7393777 7595353 7826543 8088807 8383049 8710180
59721 8710180 9071387 9467621 9899115 10365433 10865208 11394549 11944207 12496832 13026280
59712 13026280 13500156 13884830 14151067 14279332 14264400 14117371 13862521 13529930 13148734
59703 13148734 12744365 12338182 11946788 11581610 11250347 10958829 10710814 10506741 10344543
59694 10344543 10222336 10139696 10096263 10090189 10118560 10178839 10269607 10390402 10541399 10723084
59684A0723084K12867K44417K76208L08188L40677L74569M10655M48743M88159
59675A3827567N29211N73207O20709O70641P21585P73205Q25829Q79298R32700
59666B0353952R84526J032545J074058J106848J129431J140084J136595J117705
59658B9075744J084545J040497R90514R40894Q98160Q66669Q47566Q40766Q47049
59649C7432404Q67004Q98220R34880R70131R98072J013618J011620R86923R35531
59640D6048403Q56220P51582O27185M89232L43409J96112N5703o8867j70619k45158
59630D8883202k89631l02960k87203k46968j86253j06530q609J04421K27343L55733
59620D8142545M87695O22429P58069Q91580J019941J139840J245786J329492J381875
$$ plain form
59684 10723084 10935951 11180368 11456576 11764764 12105441 12480010 12890665 13339408 13827567
59675 13827567 14356778 14929985 15550694 16221335 16942920 17716125 18541954 19421252 20353952
59666 20353952 21338478 22371023 23445081 24551929 25681360 26821444 27958039 29075744
59658 29075744 30160289 31200786 32191300 33132194 34030354 34897023 35744589 36585355 37432404
59649 37432404 38299408 39197628 40132508 41102639 42100711 43114329 44125949 45112872 46048403
59640 46048403 46904623 47656205 48283390 48772622 49116031 49312143 49367846 49298979 49128360 48883202
59630 48883202 48593571 48290611 48003408 47756440 47570187 47463657 47455048 47559469 47786812 48142545
59620 48142545 48630240 49252669 50010738 50902318 51922259 53062099 54307885 55637377 57019252
59611E7019252J394913J360858J270756J116104Q93342O06908K68757j03571m88428
59602F3338891q62001j201710j489540j713733j869366j958391j988204j968666
59594E0287280j909897j822433j718180j610095j511086j433206j386155j374175
59586C7522053j393468j432943j478112j515316j534622j531283j505456j460123
59578B5670730j398812j324921j242369j155722j069270r85989r07194q32942
59570A6753511p62963o97507o37209n82179n31658m84795m41263m00931l63525
59561A1851481l28998k97721k69817k44845k22435k02790j86039j71879j60371
59552I766586j52533j49231j49925j53177j58014j64004j70335j75863j80000
$$ plain form
59611 57019252 58414165 59775023 61045779 62161883 63055225 63662133 63930890 63827319 63338891
59602 63338891 62476890 61275180 59785640 58071907 56202541 54244150 52255946 50287280
59594 50287280 48377383 46554950 44836770 43226675 41715589 40282383 38896228 37522053
59586 37522053 36128585 34695642 33217530 31702214 30167592 28636309 27130853 25670730
59578 25670730 24271918 22946997 21704628 20548906 19479636 18493647 17586453 16753511
59570 16753511 15990548 15293041 14655832 14073653 13541995 13057200 12615937 12215006 11851481
59561 11851481 11522483 11224762 10954945 10710100 10487665 10284875 10098836 9926957 9766586
59552 9766586 9614053 9464822 9314897 9161720 9003706 8839702 8669367 8493504 8313504
59543H313504j82829j84249j83611j80396j74739j67192j58108j47322j34401
59534F800657j19506j04021q9766p7291o5451n2965l9843k6910j4684l309O985
59523F213896J6193K4868L3352M0985M6783N0698N3624N6369N9173O1966O4584
59512F722491O7057P0153P5191Q2754R2071J02307J13841J27516J43079J59376
59502G755836J75797J92674K10467K29387K49651K71373K94258L17934L42326
59493A0039703L67218L91870M15736M38901M60980M80240M94822N04432N09648
59484A4103550N10021N04147M91381M72376M48181M20028L89778L59083L28021
59475A8026566K95814K62778K30306J99081J69164J42090J21017J07902J02049
$$ plain form
59543 8313504 8130675 7946426 7762815 7582419 7407680 7240488 7082380 6935058 6800657
59534 6800657 6681151 6577130 6487364 6410073 6344622 6291657 6251814 6224904 6210220 6206911 6213896
59523 6213896 6230089 6254957 6288309 6329294 6376077 6426775 6480399 6536768 6595941 6657907 6722491
59512 6722491 6789548 6859701 6934892 7017646 7109717 7212024 7325865 7453381 7596460 7755836
59502 7755836 7931633 8124307 8334774 8564161 8813812 9085185 9379443 9697377 10039703
59493 10039703 10406921 10798791 11214527 11653428 12114408 12594648 13089470 13593902 14103550
59484 14103550 14613571 15117718 15609099 16081475 16529656 16949684 17339462 17698545 18026566
59475 18026566 18322380 18585158 18815464 19014545 19183709 19325799 19446816 19554718 19656767
59466A9656767J02118J07945J19117J32968J45579J54005J56232J49519J30429
59457B0854679R6689M8293j3193q5613j66541k53120l41673m27483n05627n72806
59447A8633605o27922o70376o98361p09881p05201o87439o60629o27773n90592
59438A2655431n50123n07130m62439m17247l72919l30335k89767k51349k15304
59429I258818j81555j49713j19570r1135o3720l5739o220K3731N1917P7638J02474
59418H866926J28161J54674J81156K07733K35131K62716K88348L10517L29428
59409A0964790L45603L58395L66325L67845L61021L43556L14150K73189K21403
59400A3916277J58814Q6318P556p2357j49692k22526k88910l46496l93959m31018
$$ plain form
59466 19656767 19758885 19866830 19985947 20118915 20264494 20418499 20574731 20724250 20854679
59457 20854679 20951368 20999661 20986468 20900855 20734314 20481194 20139521 19712038 19206411 18633605
59447 18633605 18005683 17335307 16636946 15927065 15221864 14534425 13873796 13246023 12655431
59438 12655431 12105308 11598178 11135739 10718492 10345573 10015238 9725471 9474122 9258818
59429 9258818 9077263 8927550 8807980 8716845 8653125 8617386 8611166 8634897 8686814 8764452 8866926
59418 8866926 8995087 9149761 9330917 9538650 9773781 10036497 10324845 10635362 10964790
59409 10964790 11310393 11668788 12035113 12402958 12763979 13107535 13421685 13694874 13916277
59400 13916277 14075091 14161409 14168965 14096608 13946916 13724390 13435480 13088984 12695025 12264007
59390A2264007m56817m70126m71832m65479m54258m38752m18629l95176l70565
59381H322373l45612l19987k94139k69372k46101k23527k01364j80581j62017
59372F079673j45170j28878j12629r6696q1563o7536n4672m2764l1597k1284j2024
59361E284860l546M794J3327K1822K9878L7141M3412M9317N6698O6947P8422Q6729
59349E769801Q8762Q6018Q3047Q3269Q7401R5160J06613J21460J38562J57026
59339F817119J76804J97598K18003K36547K53015K68360K84266L03447L29094
59330I084253L62480M01559M43110M85982N31137N79099O28994O79976P31911
59321A3928501P83969Q33739Q78185R14522R39674R50134R43292R18654Q77546
$$ plain form
59390 12264007 11807190 11337064 10865232 10399753 9945495 9506743 9088114 8692938 8322373
59381 8322373 7976761 7656774 7362635 7093263 6847162 6623635 6422271 6241690 6079673
59372 6079673 5934503 5805625 5692996 5596300 5514737 5447201 5392529 5349765 5318168 5296884 5284860
59361 5284860 5281314 5286108 5299435 5321257 5351135 5388276 5431688 5481005 5537703 5604650 5683072 5769801
59349 5769801 5858563 5944581 6027628 6110897 6198298 6293458 6400071 6521531 6660093 6817119
59339 6817119 6993923 7191521 7409524 7646071 7899086 8167446 8451712 8755159 9084253
59330 9084253 9446733 9848292 10291402 10777384 11308521 11887620 12516614 13196590 13928501
59321 13928501 14712470 15546209 16424394 17338916 18278590 19228724 20172016 21090670 21968216
59312B1968216Q22321P56108O82488O04887N26615M50969L80053L13320K48686
59303B6753663J85447J24547O5505M900o0769j31839k06089k80985l53778m20767
59293B5679835m78633n26216n63523n89792o04545o10168o11332o11637o12461
59284B0471528o15016o21159o31215o42550o51575o56301o56231o50870o39545
59275A4707066o22185n99370n71770n40144n05623m69513m32900l96674l61562
59266A0207325l27743k94701k61937k29810j99501j72048j47471j24715j02624
59257H346775q1039o0750m2127k4207n657J3494L1697M7533O1090P3564Q5946
59246H446319R8306J09973J20047J27628J31904J32425J29494J24020J16632J07183
$$ plain form
59312 21968216 22790537 23546645 24229133 24834020 25360635 25811604 26191657 26504977 26753663
59303 26753663 26939110 27063657 27129162 27134062 27073293 26941454 26735365 26454380 26100602 25679835
59293 25679835 25201202 24674986 24111463 23521671 22917126 22306958 21695626 21083989 20471528
59284 20471528 19856512 19235353 18604138 17961588 17310013 16653712 15997481 15346611 14707066
59275 14707066 14084881 13485511 12913741 12373597 11867974 11398461 10965561 10568887 10207325
59266 10207325 9879582 9584881 9322944 9093134 8893633 8721585 8574114 8449399 8346775
59257 8346775 8265736 8204986 8162859 8138652 8132995 8146489 8178186 8225719 8286809 8360373 8446319
59246 8446319 8544625 8654598 8774645 8902273 9034177 9166602 9296096 9420116 9536748 9643931
59236I643931R5536Q2454O8998N5295M1134K7664J7192J0912Q135Q257J2047K0110
59224A0091665L1513M5101O0950P9143R8326J17037J35403J53669J69930J81475
59214A1164212J87814J90169J88148J79420J63088J41167J16040Q8380N8343K6933
59204A2503714n123l8178p1695j02456j26247j40947j46963j45306j36633j22165
59194A1468001j04350q5934o8464n1814l5247j9149n505L677Q359J0305J1093
59183A1130972J1033J0198R564J0674J4694K2200L3539M9021O8942R3508J22497
59172A1576842J55164J90849K29497K71040L14471L58044M00048M38566M70688
59163A4405209M92927N02435M97146M74990M34100L73903K95224J99525Q9384
$$ plain form
59236 9643931 9739467 9821921 9890919 9946214 9987348 10015012 10032204 10043116 10051251 10059508 10071555 10091665
59224 10091665 10123178 10168279 10229229 10308372 10406698 10523735 10659138 10812807 10982737 11164212
59214 11164212 11352026 11542195 11730343 11909763 12072851 12214018 12330058 12418438 12476781 12503714
59204 12503714 12498591 12460413 12388718 12286262 12160015 12019068 11872105 11726799 11590166 11468001
59194 11468001 11363651 11277717 11209253 11157439 11122192 11103043 11097538 11101215 11109574 11119879 11130972
59183 11130972 11142005 11152203 11161767 11172441 11187135 11209335 11242874 11291895 11360837 11454345 11576842
59172 11576842 11732006 11922855 12152352 12423392 12737863 13095907 13495955 13934521 14405209
59163 14405209 14898136 15400571 15897717 16372707 16806807 17180710 17475934 17675459 17764843
59154A7764843l0281j52891k72761l85965m88497n75274o42105o87926p14190
59145A3814953p22863p16047o96717o68237o32882n91785n46683n00872m57709
59136H281158m18287l81224l45019l10166k78512k50937k26637k04702j85202
59127E680472j68187j52814j38485j25864j15504j06116r5636q3767p2068o1655
59117D560376n2247m3465l5645k8853k2219j4851o778J305Q812J5718K2712L0727
59105D435592L9793M8703N6418O3268P0069P6795Q3205Q9925R7514J05140J11847
59094E278269J18495J26644J35825J43963J50401J56356J62278J66820J68858
59085F607909J68529J65739J59690J50548J39618J26966J10844R0780O9637N1040
$$ plain form
59154 17764843 17734562 17581671 17308910 16922945 16434448 15859174 15217069 14529143 13814953
59145 13814953 13092090 12376043 11679326 11011089 10378207 9786422 9239739 8738867 8281158
59136 8281158 7862871 7481647 7136628 6826462 6547950 6297013 6070376 5865674 5680472
59127 5680472 5512285 5359471 5220986 5095122 4979618 4873502 4777866 4694099 4622031 4560376
59117 4560376 4508129 4464664 4429019 4400166 4377947 4363096 4356318 4357623 4366435 4382153 4404865 4435592
59105 4435592 4475385 4524088 4580506 4643774 4713843 4790638 4873843 4963768 5061282 5166422 5278269
59094 5278269 5396764 5523408 5659233 5803196 5953597 6109953 6272231 6439051 6607909
59085 6607909 6776438 6942177 7101867 7252415 7392033 7518999 7629843 7720623 7790260 7841300
59075G841300L5713K1637P161o864j7602k2435k1241j6589j0880l586P463K2612
59063G836689M0087N9065Q0462J04263J28507J51928J75438J99800K23960K46966
59053I247165K69512K91984L12788L30290L44782L56669L64179L64703L57144
59044A2239216L41185L15466K78502K30735J74058J10438M2712k4316q5853j39973
59034A3482170j87008k26814k58509k82640l01534l17186l30049l39990l47415
59025A0891025l53172l57923l61516l62724l60294l54758l48353l42470l36127
59016G713688l27711l17091l05055k91794k77230k62031k47021k32260k17807
59007E235688k04456j92543j80842j68050j54808j42914j32999j24096j15095
$$ plain form
59075 7841300 7877013 7898650 7905811 7898947 7881345 7858910 7837669 7821080 7810200 7806614 7814077 7836689
59063 7836689 7876776 7935841 8016303 8120566 8249073 8401001 8576439 8776239 9000199 9247165
59053 9247165 9516677 9808661 10121449 10451739 10796521 11153190 11517369 11882072 12239216
59044 12239216 12580401 12895867 13174369 13405104 13579162 13689600 13732312 13707996 13622143 13482170
59034 13482170 13295162 13068348 12809839 12527199 12225665 11908479 11578430 11238440 10891025
59025 10891025 10537853 10179930 9818414 9455690 9095396 8740638 8392285 8049815 7713688
59016 7713688 7385977 7068886 6763831 6472037 6194807 5932776 5685755 5453495 5235688
59007 5235688 5031232 4838689 4657847 4489797 4334989 4192075 4059076 3934980 3819885
58998C819885j05794r6989r0121q5983q3096p8652p1924o5425o1492n9260n6611
58987B964538n3519n1402n0130m7985m4175l9433l4376k9143k4472k1427j9813
58976B548663j8135j5189j0843n671p97K469M030N488Q159J1263J3250J4155J5111
58963B571953J6137J5947J3728R929N599K015L71O99J557J775J823K656M213O186
58949B654588Q985J2563J5484J6797J7620J9072J9868J7999J3823R352N374J459
58937B812984j975l976m778n038m047j064K294L719L802N154Q131J0459J1311
58924B836976J2678J5940J9768K2581K4701K6894K8756K9838L0943L3149L6594
58913C118818M0914M5631M9747N2229N3446N5071N8116O2123O6315P0293P3625
$$ plain form
58998 3819885 3714091 3617102 3526981 3440998 3357902 3279250 3207326 3141901 3080409 3021149 2964538
58987 2964538 2911019 2859617 2809487 2761502 2717327 2677894 2643518 2614375 2589903 2568476 2548663
58976 2548663 2530528 2515339 2504496 2498825 2498028 2500497 2504527 2510015 2518174 2529437 2542687 2556842 2571953
58963 2571953 2588090 2604037 2617765 2627694 2633293 2635308 2635679 2636378 2637935 2639710 2641533 2644189 2648402 2654588
58949 2654588 2663573 2676136 2691620 2708417 2726037 2745109 2764977 2782976 2796799 2806151 2811525 2812984
58937 2812984 2811009 2807033 2802255 2797217 2793170 2792106 2794400 2798119 2801921 2807075 2815206 2825665 2836976
58924 2836976 2849654 2865594 2885362 2907943 2932644 2959538 2988294 3018132 3049075 3082224 3118818
58913 3118818 3159732 3205363 3255110 3307339 3360785 3415856 3473972 3536095 3602410 3672703 3746328
58902C746328P6140P8740Q2534Q7159R1227R4290R6824R8659R9355J00182J03533
58891D754971J10063J18138J26347J34807J43744J52865J62617J74312J88242
58882F066106K03173K18064K32871K47558K62082K77607K95858L16903L39178
58873H459400L61968L86062M12051M40084M71460N07850N48345N89656O30152
58864A2807028O71512P15748P62994Q13100Q66475R21860R75673J025352J071146
58855B0630888J112701J146086J166355J171228J159502J127304J068661R79486
58847B9562211Q58986P08177N29716L29480J16200j01139l14518n15781o96309
58838C0477023q49082r70877j062154j125078j161865j174638j166394j141298
$$ plain form
58902 3746328 3822468 3901208 3983742 4070901 4162128 4256418 4353242 4451901 4551256 4651438 4754971
58891 4754971 4865034 4983172 5109519 5244326 5388070 5540935 5703552 5877864 6066106
58882 6066106 6269279 6487343 6720214 6967772 7229854 7507461 7803319 8120222 8459400
58873 8459400 8821368 9207430 9619481 10059565 10531025 11038875 11587220 12176876 12807028
58864 12807028 13478540 14194288 14957282 15770382 16636857 17558717 18534390 19559742 20630888
58855 20630888 21743589 22889675 24056030 25227258 26386760 27514064 28582725 29562211
58847 29562211 30421197 31129374 31659090 31988570 32104770 32003631 31689113 31173332 30477023
58838 30477023 29627941 28657064 27594910 26469832 25307967 24133329 22966935 21825637
58830B1825637j103619j056644j003100r45913q87419q28437p69470p12473o59776
58821A3858786o11527n66122n23402m85318m52825m24113l96938l70886l46290
58812I681365l22535k99007k76514k56282k38251k21357k04839j88447j72173
58803G501960j56546j42383j29505j16566j02728q8617p5004o1753m8782l6939
58793F543137k6843j7634p702L915J7311L1964M6615N9908P1920Q4339R8525J14083
58781G019538J29765J44934J59777J74886J91008K08325K25920K42929K60176
58772H757258K79325L00469L22249L44604L69456L98015M29226M61734M95710
58763A2158046N31821N70026O10531O54516P02657P53925Q06656Q59738R12044
$$ plain form
58830 21825637 20722018 19665374 18662274 17716361 16828942 16000505 15231035 14518562 13858786
58821 13858786 13247259 12681137 12157735 11672417 11219592 10795479 10398541 10027655 9681365
58812 9681365 9358830 9059823 8783309 8527027 8288776 8067419 7862580 7674133 7501960
58803 7501960 7345414 7203031 7073526 6956960 6854232 6765615 6690611 6628858 6580076 6543137
58793 6543137 6516294 6498660 6490958 6494873 6512184 6544148 6590763 6650671 6722591 6806930 6905455 7019538
58781 7019538 7149303 7294237 7454014 7628900 7819908 8028233 8254153 8497082 8757258
58772 8757258 9036583 9337052 9659301 10003905 10373361 10771376 11200602 11662336 12158046
58763 12158046 12689867 13259893 13870424 14524940 15227597 15981522 16788178 17647916 18559960
58754A8559960R61969J008201J049663J083981J107261J115804J106431J074841
58746B7068111J016018R27328Q09370O62982M88313K88906P4551j42410l52649
58737C0840520n49958p27940q79744j001090j091544j152944j187924j199633
58729B3049743j191284j165799j126522j077676j023312r66283r08699q52331
58721A4737837p97844p44783o93292o44805o00274n58955n19999m83982m51788
58712I242115m23122l97130l73376l51261l29948l09794k92216k76961k61346
58703F226961k43755k26146k11142j98224j84900j70501j56546j44061j32662
58694D559024j21832j11456j01491r2424q5318q0158p5170o9080o2927n8015n3494
$$ plain form
58754 18559960 19521929 20530130 21579793 22663774 23771035 24886839 25993270 27068111
58746 27068111 28084129 29011457 29820827 30483809 30972122 31261028 31335579 31193169 30840520
58737 30840520 30290562 29562622 28682878 27681788 26590244 25437300 24249376 23049743
58729 23049743 21858459 20692660 19566138 18488462 17465150 16498867 15590168 14737837
58721 14737837 13939993 13195210 12501918 11857113 11256839 10697884 10177885 9693903 9242115
58712 9242115 8818993 8421863 8048487 7697226 7367278 7057484 6765268 6488307 6226961
58703 6226961 5983206 5757060 5545918 5347694 5162794 4992293 4835747 4691686 4559024
58694 4559024 4437192 4325736 4224245 4131821 4046503 3966345 3891175 3822095 3759168 3701153 3647659
58683C647659m7960m2376l9133l8748l9601m0567m1825m3392m4854m6552m9277
58672C173374n2641n5095n5688n4693n2752n0548m8968m8507m8702m9071n0055
58661B606654n2059n4163n4948n4158n2658n1307n0637n0706n0502m8434m4366
58650B042716m0069l6847l4190l1621l0010k9551k8435k5530k2731k2224k2903
58639A718605k1983j9215j6813j5889j5543j5081j4737j4259j2978j1205r754
58628A551148q371o372m365l604m005m662n713p630r280q973p157n836n467m619
58614A465094k652n52R80K230L240L804M697O879R399J0171R096Q305Q978R897
58600A539566R736Q856Q038P022N307L357K363L375O715J1384J5309J7330J8720
$$ plain form
58683 3647659 3599699 3557323 3518190 3479442 3439841 3399274 3357449 3314057 3269203 3222651 3173374
58672 3173374 3120733 3065638 3009950 2955257 2902505 2851957 2802989 2754482 2705780 2656709 2606654
58661 2606654 2554595 2500432 2445484 2391326 2338668 2287361 2236724 2186018 2135516 2087082 2042716
58650 2042716 2002647 1965800 1931610 1899989 1869979 1840428 1811993 1786463 1763732 1741508 1718605
58639 1718605 1696622 1677407 1660594 1644705 1629162 1614081 1599344 1585085 1572107 1560902 1551148
58628 1551148 1542777 1536405 1532040 1528436 1524431 1519769 1514056 1506426 1497146 1488173 1481016 1475180 1469713 1465094
58614 1465094 1462442 1461890 1462870 1465100 1468340 1472144 1476841 1483720 1493119 1503290 1512386 1520691 1529669 1539566
58600 1539566 1549302 1558158 1566196 1573218 1578525 1581882 1584245 1587620 1594335 1605719 1621028 1638358 1657078
58587A657078K1547K5771K9447L1616L3482L6570M1087M6300N1386N5822N9838
58576B089944O4385O9868P5397Q0257Q5410R2172J00265J08638J17607J28298
58566C012241J40522J53159J66370J81472J98625K16479K34113K51658K69009
58557D823648K85651L01803L17981L33001L43829L47666L43066L28983L04017
58548G729645K67020K17862J57882R0251J9229n1773j20545j83739k36062k73736
58538G616034k97778l11829l17902l16389l08965k98435k85920k70922k54051
58529D953843k37156k20661k03365j85181j67767j52030j37236j22996j10043
58520C417408r8423q7036p5677o5834n8642n3490m9229m5465m2240l9519l7435
$$ plain form
58587 1657078 1678625 1704396 1733843 1765459 1798941 1835511 1876598 1922898 1974284 2030106 2089944
58576 2089944 2154329 2224197 2299594 2379851 2465261 2557433 2657698 2766336 2883943 3012241
58566 3012241 3152763 3305922 3472292 3653764 3852389 4068868 4302981 4554639 4823648
58557 4823648 5109299 5411102 5729083 6062084 6405913 6753579 7096645 7425628 7729645
58548 7729645 7996665 8214527 8372409 8462660 8481889 8430116 8309571 8125832 7889770 7616034
58538 7616034 7318256 7006427 6688525 6372136 6063171 5764736 5478816 5207894 4953843
58529 4953843 4716687 4496026 4292661 4107480 3939713 3787683 3650447 3527451 3417408
58520 3417408 3318985 3231949 3156272 3090438 3031796 2978306 2929077 2883612 2841372 2801853 2764418
58509B764418l6188l5635l5632l6259l6892l6059l3699l2365l4341l8374m1410
58498B367564m2710m3899m5598m6575m6172m5018m3278m0395l6674l3222l0244
58487A913779k7214k4342k2076j9678j6518j4062j4059j5346j5285j4018j4186
58476A716995j6559j9145k0888k2970k5670k7066k6086k4352k3769k4297k5107
58465A461086k6020k6878k7134k6720k5911k4219k1132j7873j6340j6295j5727
58454A216837j3978j2216j0873r026o522m350k685q57P23J014O22J151K371K731
58440A164942K653M143P050Q885Q946R389J1360J3143J3310J3004J3736J5174
58428A285735J6156J6082J4723J2445J0715J0442J0160Q201N807N138N003K443
$$ plain form
58509 2764418 2728230 2692595 2656963 2620704 2583812 2547753 2514054 2481689 2447348 2408974 2367564
58498 2367564 2324854 2280955 2235357 2188782 2142610 2097592 2054314 2013919 1977245 1944023 1913779
58487 1913779 1886565 1862223 1840147 1820469 1803951 1789889 1775830 1760484 1745199 1731181 1716995
58476 1716995 1700436 1681291 1660403 1637433 1611763 1584697 1558611 1534259 1510490 1486193 1461086
58465 1461086 1435066 1408188 1381054 1354334 1328423 1304204 1283072 1265199 1248859 1232564 1216837
58454 1216837 1202859 1190643 1179770 1170744 1164222 1159872 1157187 1156330 1157053 1158067 1158689 1159840 1162211 1164942
58440 1164942 1167595 1171738 1178788 1187673 1196619 1206008 1217368 1230511 1243821 1256825 1270561 1285735
58428 1285735 1301891 1317973 1332696 1345141 1355856 1366298 1376458 1384659 1390466 1395604 1400607 1403050
58416A403050j910m370m206m622p200j0015j2245j5844k0860k3689k2291j9273
58404A256525j7584j6870j6165j6365j7472j7039j4092j1412j1246j1789j0553
58393A095938q236o454m545j536J226K289K769M186N740O225O566Q045J0013J1547
58379A133773J3363J5946J7900J8305J8532J9575J9773J7348J3188Q945M656L28
58367A301632k359k318j109m96J27J880M045N635P330R737J1594J1615J0345Q591
58353A366249O196L829L471N304O652N992N297O293P160N567K391k40k371n045
58339A416745p716r500j1231j3835j6226j6979j6512j5796j4613j2714j0803q948
58327A261872o183k914j122p65R81N282R578J1714J2845J4165J4288J2333J0327
$$ plain form
58416 1403050 1401140 1396770 1392564 1387942 1380742 1370727 1358482 1342638 1321778 1298089 1275798 1256525
58404 1256525 1238941 1222071 1205906 1189541 1172069 1155030 1140938 1129526 1118280 1106491 1095938
58393 1095938 1087702 1081248 1076703 1075167 1076393 1078682 1081451 1085637 1091377 1097602 1104168 1112213 1122226 1133773
58379 1133773 1147136 1163082 1180982 1199287 1217819 1237394 1257167 1274515 1287703 1296648 1301304 1301632
58367 1301632 1299273 1296955 1295846 1295350 1295477 1297357 1301402 1307037 1314367 1324104 1335698 1347313 1357658 1366249
58353 1366249 1372445 1376274 1379745 1385049 1391701 1397693 1402990 1409283 1416443 1422010 1424401 1424161 1421790 1416745
58339 1416745 1409029 1399529 1388298 1374463 1358237 1341258 1324746 1308950 1294337 1281623 1270820 1261872
58327 1261872 1255689 1252775 1251653 1250888 1251869 1257151 1266729 1278443 1291288 1305453 1319741 1332074 1342401
58314A342401R845R441Q065P696R720J1910J2079J1594J2104J1986R555O925O996
58301A470317Q961J0157J0084R625Q770Q143J0051J4907J9307K0624K0684K1754
58289A633384K2182J9633J5595J2686J0134O015J611l63k7O27R79J117K90j046
58275A722817k86L275O316O507O415R115J3215J5788J6979J7982J7942J6741J7367
58262A870173K1330K5127K5630K5401K8096L2001L3286L2491L2688L3758L3533
58251B193514L2183L0842K8397K4091K0545J9848J9744J8053J7246J9814K2848
58240B447125K2744K1717K3822K7799K9942L0987L3942L7772L9426L9865M1965
58229B797106M4808M5833M6371M9280N3408N6017N8084O1706O5104O6107O7545
$$ plain form
58314 1342401 1352246 1361687 1369752 1377448 1387168 1399078 1411157 1422751 1434855 1446841 1456396 1463321 1470317
58301 1470317 1479278 1489435 1499519 1509144 1517914 1526057 1536108 1551015 1570322 1590946 1611630 1633384
58289 1633384 1655566 1675199 1690794 1703480 1713614 1719629 1721240 1720877 1720850 1721477 1722456 1723573 1723863 1722817
58275 1722817 1722531 1725806 1732122 1738629 1745044 1754159 1767374 1783162 1800141 1818123 1836065 1852806 1870173
58262 1870173 1891503 1916630 1942260 1967661 1995757 2027758 2061044 2093535 2126223 2159981 2193514
58251 2193514 2225697 2256539 2284936 2309027 2329572 2349420 2369164 2387217 2404463 2424277 2447125
58240 2447125 2469869 2491586 2515408 2543207 2573149 2604136 2638078 2675850 2715276 2755141 2797106
58229 2797106 2841914 2887747 2934118 2983398 3036806 3092823 3150907 3212613 3277717 3343824 3411369
58218C411369P2936P9686Q2921Q3462Q5763R0396R4658R8015J01147J02407J00991
58207D403751J00428J03369J06735J07666J09625J16175J23779J28105J32357
58198E431990J41418J52587J60707J67903J79450J94223K08039K22045K38974
58189G097336K55692K68610K81761L00042L19505L34350L48243L68166L92407
58180I966112M15690M40512M71524N04009N30699N55075N85211O19588O52100
58171A4740520O85752P27399P73958Q18283Q63595R17453R76988J035480J097881
58162B2637309J173527J259354J347185J441339J551041J671766J793158J919040
58154C4793719K059990K213432K372151K544662K744354K966753L201984L461280
$$ plain form
58218 3411369 3484305 3563991 3646912 3730374 3816137 3906533 4001191 4099206 4200353 4302760 4403751
58207 4403751 4504179 4607548 4714283 4821949 4931574 5047749 5171528 5299633 5431990
58198 5431990 5573408 5725995 5886702 6054605 6234055 6428278 6636317 6858362 7097336
58189 7097336 7353028 7621638 7903399 8203441 8522946 8857296 9205539 9573705 9966112
58180 9966112 10381802 10822314 11293838 11797847 12328546 12883621 13468832 14088420 14740520
58171 14740520 15426272 16153671 16927629 17745912 18609507 19526960 20503948 21539428 22637309
58162 22637309 23810836 25070190 26417375 27858714 29409755 31081521 32874679 34793719
58154 34793719 36853709 39067141 41439292 43983954 46728308 49695061 52897045 56358325
58146E6358325L766042M121845M532523N028645N649458O407284P301798Q352050
58138A01517970R572808J0935309J2395987J3944297J5575841J7263296J9048144
58131B00253652K1148435K3876743K7429899L1762983L6456556M0353408M1325432
58124D22607108L6988000K6359008J1062427n299253j9195770k8822906l4199036
58117D09499578l6237980l5952181l4194914l1633277k8719625k5716617k2785594
58110A94259390k0031694j7497130j5185401j3107136j1275227r671952q261487
58103I9229363p026077n958420n032217m212761l485636k847453k279834j754083
58095F6632882j244415p17164j32012N20867J205825J872983K448699K755975
$$ plain form
58146 56358325 60124367 64246212 68778735 73807380 79456838 85864122 93165920 101517970
58138 101517970 111090778 122026087 134422074 148366371 163942212 181205508 200253652
58131 200253652 221402087 245278830 272708729 304471712 340928268 381281676 422607108
58124 422607108 459595108 485954116 497016543 491717290 472521520 443698614 409499578
58117 409499578 373261598 337309417 303114503 271481226 242761601 217044984 194259390
58110 194259390 174227696 156730566 141545165 128438029 117162802 107490850 99229363
58103 99229363 92203286 86244866 81212649 76999888 73514252 70666799 68386965 66632882
58095 66632882 65388467 64671303 64539291 65060158 66265983 68138966 70587665 73343640
58087G3343640K517418J553918L803j714475l181830m202379m788382n024986
58079E8506727m995812m781307m454540m067171l656057l254858k885333k549259
58071B7862390k242934j970713j736064j532391j353315j201741j080159r81867
58063A5763206q99276q31335p76666p29021o85503o49565o20638n90402n54632
58054I426168n19074m88274m57884m23473l88100l55696l24947k94972k69586
58045E904162k51023k36124k22638k12500k05521j96953j84870j73182j64167
58036D057184j54912j43995j34701j28631j22919j16610j12708j11376j08282
58027B923050j02483r8482r7538r4564q7234q0552p8277p6888p2446o6866o2789
$$ plain form
58087 73343640 75861058 77414976 77418779 75704304 72522474 68320095 63531713 58506727
58079 58506727 53510915 48729608 44275068 40207897 36551840 33296982 30411649 27862390
58071 27862390 25619456 23648743 21912679 20380288 19026973 17825232 16745073 15763206
58063 15763206 14863930 14032595 13255929 12526908 11841405 11191840 10571202 9980800 9426168
58054 9426168 8907094 8418820 7960936 7537463 7149363 6793667 6468720 6173748 5904162
58045 5904162 5653139 5417015 5194377 4981877 4776356 4579403 4394533 4221351 4057184
58036 4057184 3902272 3758277 3623576 3494945 3372026 3255416 3142708 3031332 2923050
58027 2923050 2820567 2722085 2624547 2529983 2442749 2362197 2283920 2207032 2134586 2067720 2004931
58016B004931n8471n2465m7808m6791m6607m4396m1752m0248l7474l1811k6478
58005A530630k4497k3829k1543j8778j7633j7013j5497j4660j5851j7055j6460
57994A327814j5717j6423j6881j5638j4608j5247j5161j2257q975q596j0118j0535
57982A167658r566q580p236m766k517j985k041r82N16J152J487K160J798m16k183
57967A134499j253P11M52j976l648k988r54J192K811L185K016L44o43j205k214
57952A130329l549m514n137n838o544o975p315p944r039j0638j2345j3243j3050
57939A024198j2892j3502j3555j1796r823j0084j1588j1029q070n941o114n846
57927I03958k364L428Q828J2409J4006J4046J3966J5010J5741J3337Q189M426
$$ plain form
58016 2004931 1946460 1893995 1846187 1799396 1752789 1708393 1666641 1626393 1588919 1557108 1530630
58005 1530630 1506133 1482304 1460761 1441983 1424350 1407337 1391840 1377180 1361329 1344274 1327814
57994 1327814 1312097 1295674 1278793 1263155 1248547 1233300 1218139 1205882 1196907 1188311 1178193 1167658
57982 1167658 1158092 1149512 1142276 1137510 1134993 1133008 1130967 1129985 1130501 1131653 1133140 1135300 1137098 1136682 1134499
57967 1134499 1133246 1133957 1134409 1132433 1128785 1125797 1124843 1126035 1128846 1132031 1134047 1134391 1133748 1132543 1130329
57952 1130329 1126780 1122266 1117129 1111291 1104747 1097772 1090457 1082513 1073474 1062836 1050491 1037248 1024198
57939 1024198 1011306 997804 984249 972453 962630 952546 940958 929929 921859 915918 909804 903958
57927 903958 901594 905022 913850 926259 940265 954311 968277 983287 999028 1012365 1020554 1024980
57915A024980M573O424O596M603J879p42k847l804l892m347n352n882o102p371
57901A008716r178r181p383p026r553j1914j1150q724p678p972p629o576o234
57888H98518o410n411k807L7J839K348J937J390J490J943J604K30j217k455m352
57873H88684o890q506q465q138q954j0636j2327j3791j4668j4289j2967j1736
57861G57317j0309p429l740j705j815j629K87K221K672K921M380N932O228O368
57847G61699P959J0250J1441J1347J0770R724Q158O932O411N556L917K848L080
57834H60092L022J198j453l446n076o982q323q428q419r135r300p901o410o422
57820G83017o865o097m908m850n282m874m311m502l663L09N622Q327P748O822
$$ plain form
57915 1024980 1029553 1035977 1042573 1047176 1049055 1048313 1045466 1041662 1037770 1033423 1028071 1022189 1016087 1008716
57901 1008716 999538 990357 982974 975948 966395 954481 943331 934607 926929 918957 911328 904752 898518
57888 898518 892108 886697 883890 883927 885766 888114 890051 891441 892931 894874 896478 896708 895491 893036 888684
57873 888684 881794 873288 864823 856685 847731 837095 824768 810977 796309 782020 769053 757317
57861 757317 747008 739579 735839 734134 732319 730690 730977 733198 735870 738791 743171 749103 755331 761699
57847 761699 769658 779908 791349 802696 813466 823190 831348 838280 844691 850247 854164 857012 860092
57834 860092 863114 864312 862859 859413 854337 847355 839032 830604 822185 813050 803750 795849 789439 783017
57820 783017 776152 770055 765147 760297 755015 750141 745830 741328 737665 737974 743596 751923 759671 766493
57806G66493P308P940P620P373Q294R888J1113J1289R775O517L021J081N29j47
57792H58094j350k315l231n131p574q596p455n735n243o162p561q523q600q179
57778G72439q350r466j0321r850q923q868r007p659n207l976m954o698p795q593
57764F62772r862j1357j2437j2955j2993j2546j1889j1434j1137j0635r899r047
57752E26581p900o493n507n185m502k608n46r0j330k695l047k231k00K752N214
57737D92213N922N678O383Q346J0301J1845J3833J6134J7165J6223J4428J2695
57725F31166J0500P470M642L000J977N28j226k432k940l419m382n686o786p186
57711F25226o935o631o688o756o436o055n979n607m203k335j063J11K716O504
$$ plain form
57806 766493 773801 781741 789361 796734 805028 814916 826029 837318 847093 853610 856631 857712 858241 858094
57792 858094 856744 854429 851198 846067 838493 829897 822442 816707 811464 805302 797741 789218 780618 772439
57778 772439 764089 754623 744302 734452 725529 716661 707654 699995 694788 690812 685858 679160 671365 662772
57764 662772 652910 641553 629116 616161 603168 590622 578733 567299 556162 545527 535628 526581
57752 526581 518681 512188 506681 501496 496994 494386 493840 493750 492420 489725 486678 484447 484247 486999 492213
57737 492213 498135 503813 510196 518542 528843 540688 554521 570655 587820 604043 618471 631166
57725 631166 641666 649136 653778 656778 658755 659283 658057 655625 652685 649266 644884 639198 632412 625226
57711 625226 618291 611660 604972 598216 591780 585725 579746 574139 569936 567601 566538 566649 569365 575869
57697E75869Q874P985N133L169L354M648N394M964M113M222N882Q028Q972Q355
57683F58962P495P674Q837J0146J1082J1606J1872J2058J2113J1634J0508R616
57671G83603J0182J2379J5231J7759J9477K0024J9426J8824J9677K1995K4307
57660I82884K5779K7173K9334L1855L3920L5528L7178L9053M1212M3886M6944
57649A374746M9664N1684N3627N6276N9681O3659O8443P4123Q0075Q5824R2017
57638B109819R9692J08913J18874J29145J39959J51465J63600J76652J91111K06674
57628C595904K22211K37013K51475K66174K80579K93049L01687L04643K99906
57619F052641K85476K60140K24015J78422J25679O9235J3647l6306p6971j06618
$$ plain form
57697 575869 584743 592728 597861 601030 604384 609032 614426 619390 623503 627725 633607 641635 650607 658962
57683 658962 666457 674131 682968 693114 704196 715802 727674 739732 751845 763479 773987 783603
57671 783603 793785 806164 821395 839154 858631 878655 898081 916905 936582 958577 982884
57660 982884 1008663 1035836 1065170 1097025 1130945 1166473 1203651 1242704 1283916 1327802 1374746
57649 1374746 1424410 1476094 1529721 1585997 1645678 1709337 1777780 1851903 1931978 2017802 2109819
57638 2109819 2209511 2318424 2437298 2566443 2706402 2857867 3021467 3198119 3389230 3595904
57628 3595904 3818115 4055128 4306603 4572777 4853356 5146405 5448092 5752735 6052641
57619 6052641 6338117 6598257 6822272 7000694 7126373 7195608 7209255 7172949 7095978 6989360
57609F989360j25049j32844j31526j24970j20302j25912j46492j79001k14065
57600E689199k42240k59144k64986k60953k47842k27716k04534j81854j60682
57591C639248j40188j19849j00236q2357o6952n4053m2673l1305j9223o939M785
57580B980258J5760K5894L4901M3271N2636O4134P6909Q9380J01538J14741J29463
57569C728885J44611J59237J73756J88823K03865K17311K27772K34420K36398
57560E515078K32357K20569J99496J68338J27375P7979K2715l4654q9859j39513
57550F299881j81877k16202k41829k58369k66475k67778k63932k56023k44745
57541D102651k30871k15498j99985j85474j72264j59795j47396j34905j22694
$$ plain form
57609 6989360 6864311 6731467 6599941 6474971 6354669 6228757 6082265 5903264 5689199
57600 5689199 5446959 5187815 4922829 4661876 4414034 4186318 3981784 3799930 3639248
57591 3639248 3499060 3379211 3278975 3196618 3129666 3075613 3032940 3001635 2982412 2975473 2980258
57580 2980258 2996018 3021912 3056813 3100084 3152720 3216854 3293763 3383143 3484681 3599422 3728885
57569 3728885 3873496 4032733 4206489 4395312 4599177 4816488 5044260 5278680 5515078
57560 5515078 5747435 5968004 6167500 6335838 6463213 6541192 6563907 6529253 6439394 6299881
57550 6299881 6118004 5901802 5659973 5401604 5135129 4867351 4603419 4347396 4102651
57541 4102651 3871780 3656282 3456297 3270823 3098559 2938764 2791368 2656463 2533769
57532B533769j11461j01953r4276q7487q0470p3303o6978o1849n7365n3453n0653
57521A694521m8439m5043l9968l5090l1876k9055k4935k0772j9251k0077j9868
57510A360147j6797j2893j0757j0028q496n330j662J310L515N666Q521J2284J6085
57497A341565J8467J9051J9322K1180K4902K9059L2232L4344L6445L9552M3780
57486A659899M8373N2536N6271O0238O5018P0828P7803Q6017R5118J04409J13490
57475B490000J22415J31135J39347J47024J54631J62384J69620J75223J78348
57466C870127J78294J73814J63045J44429J17720Q4176M5902N152l5837p4637
57456D672185j08956j37413j59724j75898j85587j88603j85804j79011j69980
$$ plain form
57532 2533769 2422308 2320355 2226079 2138592 2058122 1984819 1917841 1855992 1798627 1745174 1694521
57521 1694521 1646082 1601039 1561071 1525981 1494105 1465050 1440115 1419343 1400092 1380015 1360147
57510 1360147 1343350 1330457 1319700 1309672 1301176 1295846 1294184 1295494 1299009 1304675 1313196 1325480 1341565
57497 1341565 1360032 1379083 1398405 1419585 1444487 1473546 1505778 1540122 1576567 1616119 1659899
57486 1659899 1708272 1760808 1817079 1877317 1942335 2013163 2090966 2176983 2272101 2376510 2490000
57475 2490000 2612415 2743550 2882897 3029921 3184552 3346936 3516556 3691779 3870127
57466 3870127 4048421 4222235 4385280 4529709 4647429 4731605 4777507 4782659 4746822 4672185
57456 4672185 4563229 4425816 4266092 4090194 3904607 3716004 3530200 3351189 3181209
57447C181209j59757j48835j37454j25721j13684j01453q9295p7686o7231n8213
57437B101880n0188m2413l4751k7570k0788j3824o926j464J931M799R342J5885
57425A935913K2831K8831L3874L8524M3333M9178N6867O5903P4508Q1547Q7855
57414B519164R5234J04496J14899J24968J33459J39895J44708J48704J51930J52845
57404C830302J48761J37380J18023R1434N8506J9785k3253o6850j06157j38245
57394D069686j63234j82200j95135k01600k02266j98493j91156j81145j70238
57385B384219j59898j49673j38444j26932j17025j08548r9053q7593p6806o9733
57375A250514o5965o2537n7819n2799m8831m5764m2582l8950l5541l3257l2310
$$ plain form
57447 3181209 3021452 2872617 2735163 2609442 2495758 2394305 2305010 2227324 2160093 2101880
57437 2101880 2051692 2009279 1974528 1946958 1926170 1912346 1905420 1903956 1905887 1910686 1920028 1935913
57425 1935913 1958744 1987575 2021449 2059973 2103306 2152484 2209351 2275254 2349762 2431309 2519164
57414 2519164 2614398 2718894 2833793 2958761 3092220 3232115 3376823 3525527 3677457 3830302
57404 3830302 3979063 4116443 4234466 4325900 4384406 4404191 4380938 4314088 4207931 4069686
57394 4069686 3906452 3724252 3529117 3327517 3125251 2926758 2735602 2554457 2384219
57385 2384219 2224321 2074648 1936204 1809272 1692247 1583699 1484646 1397053 1320247 1250514
57375 1250514 1184549 1122012 1064193 1011394 962563 916799 874217 835267 799726 766469 734159
57364G34159l1861l0677k8404k5964k4375k3407k1926j9405j6638j4862j4583
57353D82057j5183j5484j4507j2076q964o424n408n930p020p416o689n613n200
57340C66143n425n297m315l240l082l660l797k919j829j738k851m233m866m386
57326C14505k920p51J524L018L293K975L077L760M296M398M814O153P677P961
57312C63780O689N212N179O884R063J0164R729Q533P488O819O470O717P599Q158
57298D68484P357N892N798P703R653R565P892O700O645O446N146L631L383M650
57284E58945O399P700Q660R973J1813J3356J3787J3581J4072J5547J6706J6550
57272G07089J5926J6198J7178J7600J7252J7213J7882J8169J7201J5816J5543
$$ plain form
57364 734159 702298 671621 643217 617253 592878 569471 547545 528140 511502 496640 482057
57353 482057 466874 451390 436883 424807 415843 409419 404011 398081 391061 383645 376956 371343 366143
57340 366143 360718 355421 351106 347866 344784 341124 337327 334408 332579 330841 327990 323757 318891 314505
57326 314505 311585 310834 312358 315376 318669 321644 324721 328481 332777 337175 341989 348142 355819 363780
57312 363780 370469 375681 380860 387744 396807 406971 416700 425233 432721 439540 446010 452727 460326 468484
57298 468484 475841 481733 487531 495234 504887 514452 522344 529044 535689 542135 547281 550912 554295 558945
57284 558945 565344 573044 581704 591677 603490 616846 630633 644214 658286 673833 690539 707089
57272 707089 723015 739213 756391 773991 791243 808456 826338 844507 861708 877524 893067
57261H93067J6530J7282J6510J4847J4354J6125J8702J9581J8295J7079J7984
57250A080356K0372K2217K2952K3744K5312K7069K8455K9845L1746L4049L6272
57239A382389L7843L8136L7187L6464L7860M1561M5846M9202N1714N4083N6404
57228A868689N8553O0751O2923O4180O3808O2320O0768N9470N8066N6356N4302
57217B530186N1505M7599M2926L7954L2119K4235J4325M173m459j1504j7915k3951
57205B727193k8882l2057l3338l2607k9819k5734k1752j8515j5286j1076n792
57194B472335J26O420J2785J8625K3847K9309L5605M1978M7347N1695N5398N7977
57182B853447N8974N9366O0263O0571N8067N2821M7411M3405L9948L6407L4010
$$ plain form
57261 893067 909597 926879 943389 958236 972590 988715 1007417 1026998 1045293 1062372 1080356
57250 1080356 1100728 1122945 1145897 1169641 1194953 1222022 1250477 1280322 1312068 1346117 1382389
57239 1382389 1420232 1458368 1495555 1532019 1569879 1611440 1657286 1706488 1758202 1812285 1868689
57228 1868689 1927242 1987993 2050916 2115096 2178904 2241224 2301992 2361462 2419528 2475884 2530186
57217 2530186 2581691 2629290 2672216 2710170 2742289 2766524 2780849 2785022 2780563 2769059 2751144 2727193
57205 2727193 2698311 2666254 2632916 2600309 2570490 2544756 2523004 2504489 2489203 2478127 2472335
57194 2472335 2472461 2478881 2491666 2510291 2534138 2563447 2599052 2641030 2688377 2740072 2795470 2853447
57182 2853447 2912421 2971787 3032050 3092621 3150688 3203509 3250920 3294325 3334273 3370680 3404690
57171C404690L3618L4091L4599L6756M2399N0622N8944O6382P3401P9675Q4228
57160C999405Q7523R1308R6112J00441J02825J03466J03596J04112J05169J06376
57150E000333J07052J06604J04946J02569J00336R8933R7991R6020R2233Q8207
57140E995224Q6426Q7105Q8052Q7951Q7923Q9116R0715R1545R1977R2865R3931
57129F982830R4647R5424R6460R6633R4979R2302Q9827Q7301Q3796P9504P5398
57118G969101P1940O9305O8021O8331O9760P2067P5523P9510Q2287Q2911Q1900
57107H790656P9320P4162O6527N8287N0424M2005L3060K6013K2398K0444J7668
57096I280964J3812R496M492r40n375q664j2390j6192j6988j4088j1701j3600
$$ plain form
57171 3404690 3438308 3472399 3506998 3543754 3586153 3636775 3695719 3762101 3835502 3915177 3999405
57160 3999405 4086928 4178236 4274348 4374789 4477614 4581080 4684676 4788788 4893957 5000333
57150 5000333 5107385 5213989 5318935 5421504 5521840 5620773 5718764 5814784 5907017 5995224
57140 5995224 6081650 6168755 6256807 6344758 6432681 6521797 6612512 6704057 6796034 6888899 6982830
57129 6982830 7077477 7172901 7269361 7365994 7460973 7553275 7643102 7730403 7814199 7893703 7969101
57118 7969101 8041041 8110346 8178367 8246698 8316458 8388525 8464048 8543558 8625845 8708756 8790656
57107 8790656 8869976 8944138 9010665 9068952 9119376 9161381 9194441 9220454 9242852 9263296 9280964
57096 9280964 9294776 9304272 9308764 9307824 9302449 9293785 9281395 9265203 9248215 9234127 9222426 9208826
57084I208826j8804k5347l4564m7934o3273p8269r4630j14514j36059j56883j78868
57073H259681k04684k32591k59726k87719l19754l54710l89703m26108m67591
57064E317095n14577n65923o23438o89157p60595q34445D16610e81038j089875
57055a670913j188486j298432j425093j567458j723215j896312k091982k309114
57047a5171005k546510k811882l114831l455621l831298m247998m716065n238993
57039d5134203n820628o478352p234829q101274r081311j0179705j1383082j2635678
57031a16049062j3859314j5002280j6054531j7015210j7845690j8419074j8491981
57024b32737142j7798774j6295265j4318330j2369512j0638673q797230o358958
$$ plain form
57084 9208826 9190022 9164675 9130111 9082177 9018904 8940635 8846005 8731491 8595432 8438549 8259681
57073 8259681 8054997 7822406 7562680 7274961 6955207 6600497 6210794 5784686 5317095
57064 5317095 4802518 4236595 3613157 2924000 2163405 1328960 416610 -581038 -1670913
57055 -1670913 -2859399 -4157831 -5582924 -7150382 -8873597 -10769909 -12861891 -15171005
57047 -15171005 -17717515 -20529397 -23644228 -27099849 -30931147 -35179145 -39895210 -45134203
57039 -45134203 -50954831 -57433183 -64668012 -72769286 -81850597 -92030302 -103413384 -116049062
57031 -116049062 -129908376 -144910656 -160965187 -177980397 -195826087 -214245161 -232737142
57024 -232737142 -250535916 -266831181 -281149511 -293519023 -304157696 -312954926 -319313884
57017c19313884l225251J99168L395474O131638Q493639J0670188J2791040J4885874
57009b65972114J6867793J8537270J9667630K0126896J9923578J9162584J7990557
57002a33695806J6566864J5034078J3488505J1983493J0557357R243338Q057804
56995d8764367P000298O069164N264703M577820L989830L485273L054606K685482
56987a2637191K363302K080937J837787J629029J445266J282279h56933A64672
56978A080746Q22982P44578O78758O18110N58536N01976M50025M01526L56694
56969F213931L17127K81066K44381K06603J70787J37663J05152P2950M2087J0643
56959G802390k4484o1939r7471j30591j64268j98574k30146k57631k82414l04259
$$ plain form
57017 -319313884 -322539135 -322339967 -318944493 -312812855 -304319216 -293649028 -280857988 -265972114
57009 -265972114 -249104321 -230567051 -210899421 -190772525 -170848947 -151686363 -133695806
57002 -133695806 -117128942 -102094864 -88606359 -76622866 -66065509 -56822171 -48764367
56995 -48764367 -41764069 -35694905 -30430202 -25852382 -21862552 -18377279 -15322673 -12637191
56987 -12637191 -10273889 -8192952 -6355165 -4726136 -3280870 -1998591 -856933 164672
56978 1080746 1903728 2648306 3327064 3945174 4503710 5005686 5455711 5857237 6213931
56969 6213931 6531058 6812124 7056505 7263108 7433895 7571558 7676710 7749660 7791747 7802390
56959 7802390 7777906 7715967 7618496 7487905 7323637 7125063 6894917 6637286 6354872 6050613
56949F050613l21394l34487l45273l51640l49346l38400l22746l04039k80866
56940C102422k53471k23672j90455j51351j08199o5745k4914J5424M8638N9441
56930B208118L6771j5613q2548j47156j96410k23591k30010k22619k07884j89171
56920G29887j69311j51515j36596j22705D0807e5542q4740p2199n8485m5615l4320
56909c50901k3215j2259l600K043O615J1472J5837J9367K3024K6714K9193L1059
56897b24651L4437L8758M0103L6017K8099J8858R135l13p735j2345j4961j5828
56885g0426j4247j0828p343l863R80O485J0029J1372J3285J6914K0220e151B0131
56871E0636L5475L7431L6440L3159K6473J5935M141n784j3279j9073k2729k3540
$$ plain form
56949 6050613 5729219 5394732 5049459 4697819 4348473 4010073 3687327 3383288 3102422
56940 3102422 2848951 2625279 2434824 2283473 2175274 2109529 2084615 2100039 2148677 2208118
56930 2208118 2244889 2229276 2146728 1999572 1803162 1579571 1349561 1126942 919058 729887
56920 729887 560576 409061 272465 149760 40807 -55542 -140282 -212481 -270966 -316581 -350901
56909 -350901 -374116 -386375 -389975 -387932 -381317 -369845 -354008 -334641 -311617 -284903 -255710 -224651
56897 -224651 -190214 -151456 -111353 -75336 -47237 -28379 -19244 -19557 -27292 -39637 -54598 -70426
56885 -70426 -84673 -95501 -102844 -106707 -105727 -99242 -89213 -77841 -64556 -47642 -27422 -5151 20131
56871 50636 86111 123542 159982 193141 219614 235549 239690 233906 220627 201554 178825 155285
56859A55285k2291k0321j8122j6061j5003j4949j4535j2835j0341C278a052j272
56847b324M62g12A582L838M028K740K243L722N605O384O539O537N743M607N130
56832E8698P639R789J0362J1354J4492J8392K1291K3836K6742K8063K5549K0086
56820B76293J4365R602N724L087J777N94j060j552P04M537P594R458J1360J3928
56806C56411J7044K0864K5229K8981L1558L4285L8694M4311M9069N0519M5897
56795G42862L3274J4618m042j7489k5184k9013k9388k5914k0029j4037q316j966
56783F15376M539R800J4030J8918K5132L1904L8866M6741N6316O7802Q0344R0585
56771A100353R2527Q1141N6609K4444q100l5294n4274o5307p0504p1210o7194
$$ plain form
56859 155285 132994 112673 94551 78490 63487 48538 34003 21168 10827 3278 -1052 -2324
56847 -2324 -1862 -712 1582 5420 9448 12188 14431 18153 23758 30142 36681 43218 48961 53568 58698
56832 58698 66337 76126 86488 97842 112334 130726 152017 175853 202595 230658 256207 276293
56820 276293 290658 300260 305984 309071 310848 311442 310382 308830 309534 314071 321665 331123 342483 356411
56806 356411 373455 394319 419548 448529 480087 514372 553066 597377 646446 696965 742862
56795 742862 776136 790754 786712 769223 744039 715026 685638 659724 639695 625658 617342 615376
56783 615376 619915 629715 643745 662663 687795 719699 758565 805306 861622 929424 1009768 1100353
56771 1100353 1192880 1274021 1330630 1355074 1346974 1311680 1257406 1192099 1121595 1050385 983191
56760I83191n8983m9445m1393l4599k6910j7576p854J046Q937J6002K2775L0496
56748H25687M0103N0645N9220O2158N6260M0482J7625o606k7430m3296n4221n9830
56736I60797o0360n7800n4056m9031m2173l4607k7895k1700j4742p342j074L548
56724E93565P394J1156J5055J9506K4358K7752K7053K0904R848m144j7920k8225
56712G06302l4005l6792l7942l6994l3849l0502k8571k6707k2980j8436j5632
56701C83892j4607j3113j0385p930o742o225o045o720p941q251o946n008l790
56688B80189l810m667n157l936j284M44o34l562o006p121p409o831n101l062j829
56673B20224j219p58j278l259m707l366m97M35j342l184l214k481k425k824l026
$$ plain form
56760 983191 924208 874763 833370 798771 771861 754285 746431 747477 756414 772416 795191 825687
56748 825687 865790 916435 975655 1037813 1094073 1134555 1152180 1145574 1118144 1074848 1020627 960797
56736 960797 900437 842637 788581 739550 697377 662770 634875 613175 598433 591091 590017 593565
56724 593565 600959 612115 627170 646676 671034 698786 725839 746743 756591 752447 734527 706302
56712 706302 672297 635505 597563 560569 526720 496218 467647 440940 417960 399524 383892
56701 383892 369285 356172 345787 337857 331115 324890 318845 312125 304184 295933 288987 283979 280189
56688 280189 276379 271712 266555 262619 261335 261779 261145 257583 251577 244456 237047 230216 225115 222053 220224
56673 220224 219005 218247 216969 213710 209003 205637 205140 205575 204233 201049 197835 195354 192929 190105 187079
56658A87079l225l667m183m905n954o447n556m367m566n484m895k815j680k325
56644A27010k569r01J052J160k50j588k371k792k479j244K4N56Q88J758K785L259
56628A24298L383L685M006L941L665L602L760L907L837L228J886L07p35j261j872
56613A59637k508k451j582n63K79J010J092k98k630m224m453m477n241o098n982
56598A21511m914l602k332r72N08J877K669K424J344M55N18J191K005L368N521
56583A31571P431Q133Q347R098R561Q346O340N843P034P671O432M309K491J074
56569B23681K36N37J490J782J268J050J345J335J155J640J985L71k498l383j020
56554B30974J980K990K546K283K194J667J175J120P40l27j047q88q18j077j28
$$ plain form
56658 187079 183854 180187 176004 171099 165145 158698 153142 148775 144209 138725 133830 131015 129335 127010
56644 127010 124441 123540 124592 125752 125502 123914 121543 118751 116272 115028 115052 115608 116496 118254 121039 124298
56628 124298 127681 131366 135372 139313 142978 146580 150340 154247 158084 161312 163198 163505 162770 161509 159637
56613 159637 157129 154678 153096 152533 152812 153822 154914 154616 151986 147762 143309 138832 133591 127493 121511
56598 121511 116597 112995 110663 109691 110199 112076 114745 117169 118513 118968 119486 120677 122682 126050 131571
56583 131571 139002 147135 155482 164580 174141 182487 188827 194670 201704 209375 215807 220116 222607 223681
56569 223681 223917 224454 225944 227726 228994 230044 231389 232724 233879 235519 237504 237875 235377 231994 230974
56554 230974 232954 235944 238490 240773 242967 244634 245809 246929 247669 247342 246295 245407 244589 243512 243384
56539B43384K462M183K814j12j400m54P03O94j8n67m92M33J873K855L002L047
56523B62407L363L151K005R64R13J336J621K202L205L638L187L170M288N193M813
56508C05456M306M897N545M941M134M812O382P160P361Q293R526R469Q183P199
56494C97664O882O282N334M925M945M324L016K044J636J035J16m67o83j162j977
56479D33914k702l438m389m885m284l454l710m709n017m384l874m022m478n150
56465C75418o004o067m395j999j021j965l171l116j958q29q11k335m515n466m442
56450C27324k994k767l145k751k113k642l660l050p57Q90N00q40j656j667r67
56435B99705L30J297Q04o14j265r06r27j646j433O47L099L890K712P13q43j113
$$ plain form
56539 243384 245846 250029 252843 252731 251331 250877 251580 252274 252256 251689 251197 251630 253503 256358 259360 262407
56523 262407 265770 268921 270926 271890 272803 274139 275760 277962 281167 284805 287992 291162 295450 300643 305456
56508 305456 309762 314659 320204 325145 329279 334091 340473 347633 354994 363287 372813 382282 390465 397664
56494 397664 404546 410828 416162 421087 426032 430356 433372 435416 437052 438087 438203 437736 437053 435891 433914
56479 433914 431212 427774 423385 418500 414216 410762 407052 402343 397326 392942 389068 385046 380568 375418
56465 375418 369414 363347 358952 356953 355932 353967 350796 347680 345722 344893 344082 341747 337232 331766 327324
56450 327324 324330 321563 318418 315667 313554 310912 307252 304202 303445 304335 304835 303995 302339 300672 299705
56435 299705 300035 301332 302136 301522 300257 299351 298424 296778 295345 295992 299091 302981 305693 306406 305563 304450
56419C04450q9J116J443J549K967N606P704Q363Q334P958O390L655J538J308K005
56404C64297K220K173K788L764M018L404K893L255M264M933M257K227J93l57N40
56389D04869J541J756J361O49l37j121j080n00k37k24L39J298J656J509K072L254
56373D16805L169J014j372k044j661k105l507m332l903l248l405m092m343l950
56359C83026l783m689o187o689n449l645k766k572j791m56J68j39j42O90J347
56344C46923J195J013J302J088l32j846j987r71kO21J367K058K061J554J450J986
56328C57480K494K612K875L823N081N775N552M894M392M063L571L060L161M067
56314D12900N042N245M462K837N99j393j752j58J852K666K507K542K884K857K564
$$ plain form
56419 304450 304361 305477 306920 308469 311436 317042 324746 333109 341443 349401 355791 359446 360984 362292 364297
56404 364297 366517 368690 371478 375242 379260 382664 385557 388812 393076 398009 402266 404493 404686 404329 404869
56389 404869 406410 408166 409527 410176 409839 408718 407638 407138 406901 406677 407016 408314 409970 411479 413551 416805
56373 416805 419974 420988 419616 417572 415911 413806 410299 405967 402064 398816 395411 391319 386976 383026
56359 383026 379243 374554 368367 361678 356229 352584 349818 347246 345455 344999 345167 345028 344886 345576 346923
56344 346923 348118 349131 350433 351521 351189 349343 347356 346385 346383 347004 348371 350429 352490 354044 355494 357480
56328 357480 359974 362586 365461 369284 374365 380140 385692 390586 394978 399041 402612 405672 408833 412900
56314 412900 417942 423187 427649 430486 431085 429692 427940 427782 429634 432300 434807 437349 440233 443090 445654
56299D45654K568K433J322j50l69R50K402L050L409M071M658M443L014N74j509
56284D76520j091K211N711O756O452P858J0945J2415J0792Q494P910Q326Q291
56271E71590Q388R681J1360J1971J1661J1455J1486J1446J1748J2813J4014J4548
56259G12161J4467J4024J2969J1428J0414J0544J1203J1711J2128J2225J1063
56248H44337Q502N821L940K393R51N80J625K588K216J489K080L941N874P429Q758
56233I02524R627R987J0766J2712J5126J6943J8346K0220K2739K5434K7935K9871
56221A122230L1044L2399L5550M0407M4723M7139M9217N2955N7868O2343O6595
56210A642470P2168P9188Q6222R2506R8678J05523J13429J22846J33872J45619
$$ plain form
56299 445654 448222 450655 451977 451827 451458 452408 454810 457860 461269 465340 469998 474441 477455 478029 476520
56284 476520 475429 477640 483351 490107 496559 504417 515362 527777 538569 547063 554973 563299 571590
56271 571590 579978 589659 601019 612990 624651 636106 647592 659038 670786 683599 697613 712161
56259 712161 726628 740652 753621 765049 775463 786007 797210 808921 821049 833274 844337
56248 844337 852839 858660 862600 864993 865944 866524 868149 870737 872953 874442 876522 880463 886337 893766 902524
56233 902524 912151 922138 932904 945616 960742 977685 996031 1016251 1038990 1064424 1092359 1122230
56221 1122230 1153274 1185673 1221223 1261630 1306353 1353492 1402709 1455664 1513532 1575875 1642470
56210 1642470 1714638 1793826 1880048 1972554 2071232 2176755 2290184 2413030 2546902 2692521
56200B692521J57116J68620J80962J94011K06792K18684K29415K38242K44234
56191D530597K47126K47055K43736K36513K24796K08001J85790J59054J29744
56182F412412R9111O6916L3183l06l1106n7891q0343r8331j12239j23301j32574
56171E975531j40032j45163j47776j48014j46780j46314j48711j53274j57106
56162D642361j58964j60540j63036j64833j64096j61587j58963j56134j52287
56153C201921j47833j43271j37610j30118j22201j15354j08620j00468r1857q4780
56143B019809p8789p1884o4274n8304n4712n1623m7569m3234l9763l7156l4864
56132A437637l2478k9577k6074k2804k0595j8945j6675j3594j0354p091l613n84
$$ plain form
56200 2692521 2849637 3018257 3199219 3393230 3600022 3818706 4048121 4286363 4530597
56191 4530597 4777723 5024778 5268514 5505027 5729823 5937824 6123614 6282668 6412412
56182 6412412 6511523 6578439 6611622 6611316 6580210 6522319 6441976 6343645 6231406 6108105 5975531
56171 5975531 5835499 5690336 5542560 5394546 5247766 5101452 4952741 4799467 4642361
56162 4642361 4483397 4322857 4159821 3994988 3830892 3669305 3510342 3354208 3201921
56153 3201921 3054088 2910817 2773207 2643089 2520888 2405534 2296914 2196446 2104589 2019809
56143 2019809 1941020 1869136 1804862 1746558 1691846 1640223 1592654 1549420 1509657 1472501 1437637
56132 1437637 1405159 1375582 1349508 1326704 1306109 1287164 1270489 1256895 1246541 1239450 1235837 1235253
56120A235253J021J509K333M336P100R753J1525J1921J1339J1150J2317J4204
56108A333761J5421J5225J3695J1391R480R089R849J0140R379Q713Q819Q741P944
56095A471647P697R154J1577J3899J6435J9743K3361K7095L1903L8191M4785N0979
56083A766466N7884O6434P5994Q6115R7453J09473J19993J28820J39045J52365
56073B800042J65857J76021J83299J89331J92185J88121J76547J59985J40778
56064D372166J21057J04178R2306Q3393P3519O1229M6839K9421Q155j4404l3983
56053D943876m9003o0719p0365p9230r0034j04650j21197j36263j48778j58964
56043C924673j65211j65470j60439j52148j40904j26770j12267j00026q9560p9797
$$ plain form
56120 1235253 1236274 1237783 1240116 1244452 1251552 1261305 1272830 1284751 1296090 1307240 1319557 1333761
56108 1333761 1349182 1364407 1378102 1389493 1398973 1408062 1417911 1428051 1437430 1446143 1454962 1463703 1471647
56095 1471647 1479344 1488498 1500075 1513974 1530409 1550152 1573513 1600608 1632511 1670702 1715487 1766466
56083 1766466 1824350 1890784 1966778 2052893 2150346 2259819 2379812 2508632 2647677 2800042
56073 2800042 2965899 3141920 3325219 3514550 3706735 3894856 4071403 4231388 4372166
56064 4372166 4493223 4597401 4689707 4773100 4846619 4907848 4954687 4984108 4992263 4977859 4943876
56053 4943876 4894873 4834154 4763789 4684559 4594525 4489875 4368678 4232415 4083637 3924673
56043 3924673 3759462 3593992 3433553 3281405 3140501 3013731 2901464 2801438 2711878 2632081
56033B632081p2547o9254o6531n9860n0250m2469l8062l4710l1242k8246k4790
56022B114120j9443j3787j0289p809l809M14J899J975M426Q809J1414J2077J3934
56009B113931J7006J8239J7788J9056K2294K4222K4323K5554K8375L0071L0426
55998B371285L2132L4992L5765L4547L5227L8702M1548M2378M3612M5953M7018
55987B803159M6573M7358M9707N1010N1367N3915N8690O2106O3199O4558O6668
55976C418310O7621O8721P3445Q0362Q4312Q5265Q8588R5676J02186J06726J13051
55965D384263J22025J29465J34047J39330J46155J51065J54217J60353J69821
55956E690741J77347J81996J89433K01738K14207K25000K38419K55357K70264
$$ plain form
56033 2632081 2559534 2490280 2423749 2363889 2313639 2271170 2233108 2198398 2167156 2138910 2114120
56022 2114120 2094677 2080890 2070601 2062792 2058983 2059397 2061296 2063271 2067697 2076506 2087920 2099997 2113931
56009 2113931 2130937 2149176 2166964 2186020 2208314 2232536 2256859 2282413 2310788 2340859 2371285
55998 2371285 2403417 2438409 2474174 2508721 2543948 2582650 2624198 2666576 2710188 2756141 2803159
55987 2803159 2849732 2897090 2946797 2997807 3049174 3103089 3161779 3223885 3287084 3351642 3418310
55976 3418310 3485931 3554652 3628097 3708459 3792771 3878036 3966624 4062300 4164486 4271212 4384263
55965 4384263 4506288 4635753 4769800 4909130 5055285 5206350 5360567 5520920 5690741
55956 5690741 5868088 6050084 6239517 6441255 6655462 6880462 7118881 7374238 7644502
55947G644502K81349K94113L10793L26163L38192L53130L75274M01059M27720
55938A0752295M58116M92281N24166N51666N80327O12788O44850O76031P12778
55929A6005298P56573Q00519Q42602Q90232R46672J005917J066329J135724J217132
55920B4666998J303602J393173J493869J607648J725555J845722J979098K130271
55912C8145936K291450K463311K661206K891335L142712L413577L722753M084230
55904F2816510M497694M979054N572165O312105P202140Q240102R432822J0767514
55896A19820106J2211469J3767151J5486466J7404427J9509957K1816272K4403702
55889B44419550K7360244L0745677L4580457L8561892M1483253M1095089L5157980
$$ plain form
55947 7644502 7925851 8219964 8530757 8856920 9195112 9548242 9923516 10324575 10752295
55938 10752295 11210411 11702692 12226858 12778524 13358851 13971639 14616489 15292520 16005298
55929 16005298 16761871 17562390 18404992 19295224 20241896 21247813 22314142 23449866 24666998
55920 24666998 25970600 27363773 28857642 30465290 32190845 34036567 36015665 38145936
55912 38145936 40437386 42900697 45561903 48453238 51595950 55009527 58732280 62816510
55904 62816510 67314204 72293258 77865423 84177528 91379668 99619770 109052592 119820106
55896 119820106 132031575 145798726 161285192 178689619 198199576 220015848 244419550
55889 244419550 271779794 302525471 337105928 375667820 417151073 458246162 493404142
55882D93404142K3170382P168530r299593k3107500l2741768l8170088m0107251
55875C80316854l9485497l7230623l4116688l0670245k7200794k3890596k0836820
55868A66885591j8068555j5591929j3422376j1563139r984100q647855p534848
55861H2072789o623357n869359n229503m686026m230422l840915l494909l187528
55853D4910770k919798k681831k463255k267086k098128j948744j809184j680764
55845B7041980j566491j459472j352826j251269j161714j081313j004777r34313
55837A7229805q72682q15358p58807p07887o66422o29251n91772n58168n31708
55828A1097750n06349m77105m49887m31493m17944m02342l86526l75108l64768
$$ plain form
55882 493404142 516574524 523743054 514443461 491335961 458594193 420424105 380316854
55875 380316854 340831357 303600734 269484046 238813801 211613007 187722411 166885591
55868 166885591 148817036 133225107 119802731 108239592 98255492 89607637 82072789
55861 82072789 75449432 69580073 64350570 59664544 55434122 51593207 48098298 44910770
55853 44910770 41990972 39309141 36845886 34578800 32480672 30531928 28722744 27041980
55845 27041980 25475489 24016017 22663191 21411922 20250208 19168895 18164118 17229805
55837 17229805 16357123 15541765 14782958 14075071 13408649 12779398 12187626 11629458 11097750
55828 11097750 10591401 10114296 9664409 9232916 8814972 8412630 8026104 7650996 7286228
55819G286228l49635l31649l16304l03021k88278k73396k60927k47894k30732
55810D684392k12700j98839j87413j73668j58233j45019j34356j24612j16854
55801C232698j11776j05854r6524q7179q1356p6306o8366n9987n4900n0657m3071
55790B396722l4414l0193l0745l2670l5619m1034m6721m9154m9132m9426m9215
55779A948399m6546m3572m3328m3769m1180l7283l6635l8797l9456l8044l7875
55768A501914l9467l9685l7344l4412l1757k8570k5815k5537k6688k5983k2935
55757A163721k0311j9565j9367j8535j7176j5076j1886q691o865n943m802l761
55745A011743l270k199L9J401Q9k326l542m437p160j1055j3853j5453j7191j8783
$$ plain form
55819 7286228 6936593 6604944 6288640 5985619 5697341 5423945 5163018 4915124 4684392
55810 4684392 4471692 4272853 4085440 3911772 3753539 3608520 3474164 3349552 3232698
55801 3232698 3120922 3015068 2918544 2831365 2750009 2673703 2605337 2545350 2490450 2439793 2396722
55790 2396722 2362308 2332115 2301370 2268700 2233081 2192047 2145326 2096172 2047040 1997614 1948399
55779 1948399 1901853 1858281 1814953 1771184 1730004 1692721 1656086 1617289 1577833 1539789 1501914
55768 1501914 1462447 1422762 1385418 1351006 1319249 1290679 1264864 1239327 1212639 1186656 1163721
55757 1163721 1143410 1123845 1104478 1085943 1068767 1053691 1041805 1033114 1026249 1020306 1015504 1011743
55745 1011743 1008473 1006274 1006313 1007714 1007803 1005477 1001935 997498 990338 979283 965430 949977 932786 914003
55731I14003j9210j9337k0398k1203j9951j7492j5871j4979j3659j2551j2575
55720G26777j2086q954m339j255m93r02k442n704r596j2531j4954j7782j9756
55707F15983j9254j7400j6306j5587j3710j1363j0265j0035r475r552j1648j4190
55695D57198j4670j3812j4091j5213j4856j2979j1451j0061o894k367J041L001
55683C44846N572R031J0950R922P281M630K323O74J93L75K43n4kk34j264j930
55667C92556j473j763m537p804q344o614n577n694n036l599l297l840k860m41
55653C31677N58o73j564n81O79R51J455L214N066N820O022O319O267N681N163
55638C76054M580L038R40j02J96M22l5l71n23j387k478j986J66J841K013J994
$$ plain form
55731 914003 894793 875456 855058 833855 813904 796412 780541 765562 751903 739352 726777
55720 726777 714691 705737 701398 700143 699650 698748 696306 690602 681006 668475 653521 635739 615983
55707 615983 596729 579329 563023 547436 533726 522363 512098 502063 492588 483036 471388 457198
55695 457198 442528 428716 414625 399412 384556 371577 360126 350065 343171 340804 341845 344846
55683 344846 350418 359449 370399 380321 387602 392232 394555 395229 395422 395797 396040 395986 395984 395750 394486 392556
55667 392556 391083 389320 384783 376979 368635 362021 356444 350750 345714 342115 338818 334978 332118 331677
55653 331677 332235 331562 329998 329417 330096 331047 332502 335716 340782 346602 352624 358943 365210 370891 376054
55638 376054 380634 383672 384612 384510 384706 385128 385093 384722 384199 382812 380334 378348 378514 380355 382368 384362
55622C84362K470J952m40k925l376j945q7J512K779L369L066K131O30j498l364
55607C88636l493j741L62J491J505O54n87r02P62L119L488J326r64j303l67P1
55591C92057m76j371k201l010l894m976o179p023p281p599q593r820j0627j1256
55577C07751j1801j1104q558o142o366q618r912r005p322n970m553l180l006m080
55563B08134m982n185n622o280n612l254j170r30j736k121j983j828j550r66m53
55548A64462l10n34j391k897l747k623o38l79k120l377k852k267l056l673k050
55533A32548J084L225L172J424j280m004n094l473k24K393L273K894J891M34r89
55518A37274j270K31K566L735K743R98R24K876M598M423L805N229Q445J0744J0553
$$ plain form
55622 384362 386832 388784 388344 385419 382043 380098 380011 381523 384302 387671 390737 392868 393498 392000 388636
55607 388636 385143 383402 383764 385255 386760 387414 386827 385925 386687 389806 393294 394620 393656 392353 391986 392057
55591 392057 391581 390210 388009 384999 381105 376129 369950 362927 355646 348047 339454 329634 319007 307751
55577 307751 295950 284846 276288 270146 263780 255162 245250 236245 228923 222953 218400 215220 212214 208134
55563 208134 203152 197967 192345 186065 180453 177199 176029 175099 173363 171242 169259 167431 165881 164915 164462
55548 164462 164152 163618 162227 159330 155583 152960 152322 151943 149823 146446 143594 141327 138271 134598 132548
55533 132548 133632 136857 140029 141453 140173 136169 131075 127602 127378 129771 133044 135938 137829 138263 137274
55518 137274 136004 136235 138801 142536 145279 146277 147201 150077 154675 159098 162903 168132 176577 187321 197874
55503A97874Q942P510O624N968N286M147K124n14l237o096r024j0760j0069p798
55489A90977o099n707n498m516k860q37J032J614N52l33P42K448K014k41j039
55474A72249R37L279L758L111K719K227J031m5k78m24j104j476r75p69j848l148
55458A79244l261k898l981o852r750j0850r876q045o849o623o300n067l771l619
55444I1502m067l584k160j177r19m11K16m57k480l907l539k293j240k80N58N79
55428F6341l7j96rq15k396k641j003K06p44k463k908k278j846j763j661j809k188
55411D1790j907q14o0p3K56J333J837J201P85J173O89j581l636l530k301j762
55395C3400j522o59k83j600l038k332k38Q01N38N86R79L21j008r41Q06K127J777
$$ plain form
55503 197874 206816 214326 220950 226918 232204 236351 238475 237961 234724 228628 219604 208844 198775 190977
55489 190977 184878 179171 173673 169157 166297 165460 166492 168106 168658 168325 169067 171515 173529 173288 172249
55474 172249 173186 176465 180223 183334 186053 188280 189311 189266 188988 188564 187460 185984 185009 184240 182392 179244
55458 179244 175983 173085 169104 162252 152502 141652 131776 123731 116882 110259 103959 98892 95121 91502
55444 91502 87435 83851 81691 80514 79595 79184 79400 78943 76463 72556 69017 66724 65484 65204 65762 66341
55428 66341 66304 66108 66099 65284 62888 60247 59244 59450 58706 56243 53335 51057 49211 47448 45787 43978 41790
55411 41790 39883 39069 39009 38936 39192 40525 42362 43563 44348 45521 46210 44629 40993 37463 35162 33400
55395 33400 31878 31219 30936 29336 26298 23966 23728 24529 25067 25653 26632 26953 25945 25004 25810 27937 29714
55378B9714Q63M59o2j443k943l366k548j222l5Q00J424K081K651K720K432K592
55362C4117L404L836K987J356L2o07p09l59M1k17q61n44J080K451K351J808K350
55345E2516L579L961L103J722J96j382k443k558k290k210j933j053q9N31J298
55330E2948K358K685J744N57j58j268l117l973k621p10l09p04k41K98p68k249
55314D4472j457J101J969j24k624l217k644k387k270j635r14p07o98n72p29j234
55298B6330j217j15J319J909J229k85j696k016j191m10n89q86m9J186P90j445
55282B2864l241k732o10J136J456P19q9r1Q63J882J872P13p69j824k110j476k22
55265A8341P71R48P79Q40P49k5r26j001l27K73N20N92L72j20j11R15K171K522
$$ plain form
55378 29714 30577 31036 30974 29531 26588 23222 20674 19452 19417 20217 21641 23722 26373 29093 31525 34117
55362 34117 37521 41357 44344 45700 45732 45125 44416 44057 44098 43881 43020 42476 43556 46007 48358 50166 52516
55345 52516 56095 60056 63159 64881 65077 63695 61252 58694 56404 54194 52261 51208 51119 51650 52948
55330 52948 55306 57991 59735 60292 60134 58866 55749 51776 49155 48445 48136 47432 47191 47489 46721 44472
55314 44472 43015 44116 46085 45961 43337 40120 37476 35089 32819 31184 30270 29563 28865 28293 27564 26330
55298 26330 25113 24998 26317 28226 29455 29170 27474 25458 24267 23857 23268 22382 22333 23519 24309 22864
55282 22864 19623 16891 16281 17417 18873 19592 19503 19412 20275 22157 24029 24742 23973 22149 20039 18563 18341
55265 18341 19112 20060 20839 21679 22428 22403 21477 20476 20149 20422 20942 21534 21906 21786 21675 22590 24761 27283
55247B7283J840L98j977m787o042m370j189R75J544J614J557R96L97M71N98p0
55231A9238n51O15K511K914J785J064J140M56j229k119j481p39p09k54J339K884
55215B6864L247K789J966M40j548k777k854k594k067l77J907K532R16m96K95K031
55199C0274K463J609R69R30P37Q5p22j401j568r54l78j109k479k019P97K876J436
55182C1546j955l399j704P26J545Q92K41M05J133J635J255J03j015j458j170j79
55166B8601J340K418J906K86l48J055K998L478K411J088K33j12J97J119J870J774
55150E0314J164O22Qq67j396j093o68j035j803j788o91P46J864K440K204R72o87
55133E0306j617j074N46J805J262r87k931k731j018J40L47J012K163J560j656
$$ plain form
55247 27283 29123 29521 27544 22757 16715 12345 11156 12131 13675 15289 16846 17842 18239 18710 19308 19238
55231 19238 18687 19302 21813 24727 26512 27576 28716 29172 27943 25824 24343 23604 22895 22641 23980 26864
55215 26864 30111 32900 34866 35306 33758 30981 28127 25533 23466 23089 24996 27528 28444 27948 28243 30274
55199 30274 32737 34346 35315 36245 36982 37067 36345 34944 33376 32422 32044 30935 28456 26437 27234 30110 31546
55182 31546 29591 26192 24488 25214 26759 27651 27892 28297 29430 31065 32320 32423 31408 29950 28780 28601
55166 28601 29941 32359 34265 34551 34203 35258 38256 41734 44145 45233 45466 45354 45551 46670 48540 50314
55150 50314 51478 52100 52108 51241 49845 48752 48084 47049 45246 43458 42767 43513 45377 47817 50021 50993 50306
55133 50306 48689 47615 48161 49966 51228 50241 47310 44579 43561 43701 44048 45060 47223 48783 47127
55118D7127m685m358j331J180J685J290J115J099J203J594J675O29r22j434o56
55103D5211J53K76J88J09l81r82p04J81q4k094l845l242q67R76J250Q37P13Q17
55085C8512P40M36k1n22o18J94J547K252J638L50o09j120j519j417qK288L596
55068D5719K644M02j076q97K87J685L015L872L572K110N23k17j55J0p6k19j27
55051F1072J89L50o8r64j551j144OR81J190O23m76j519j478J66K341L216K310
55034F5244R45M80R54J630J990J875J346Q87R45J025P3j827l005k132Q3J811K274
55017G4598K235K596L200L141J961L51m48qQ40J158R93P65K46q54j608o40J805
55000I0331L717L672K259Q89J50j74l92p78j498k183k241j713j203q36k06N18
$$ plain form
55118 47127 42442 38084 36753 37933 39618 40908 42023 43122 44325 45919 47594 48223 47301 45867 45211
55103 45211 45364 45640 45828 45937 45556 44574 43870 44051 43967 41873 38028 34786 33919 34895 36145 36982 37695 38512
55085 38512 39252 39688 39667 39145 38527 38721 40268 42520 44158 44508 43899 42779 41260 39843 39835 42123 45719
55068 45719 48363 48765 47689 46792 47079 48764 51779 55651 59223 61333 61856 61639 61484 61494 61418 61199 61072
55051 61072 61261 61611 61543 60579 59028 57884 57890 58871 60061 60684 60208 58689 57211 57377 59718 62934 65244
55034 65244 66189 66669 67623 69253 71243 73118 74464 75351 76296 77321 77394 75567 72562 70430 70513 72324 74598
55017 74598 76833 79429 82629 85770 87731 88082 87634 87626 88466 89624 90617 91382 91628 90774 89166 88526 90331
55000 90331 94048 97720 99979 100868 101018 100844 100452 99674 98176 95993 93752 92039 90836 90000 89794 90312
54984I0312M92l78r22k47J018J499O43q32j639j004M59J106K32p72k95R49Q36
54967I1457r42k432k259j086J79J606L002L383K675K197K518K422J100l40p53
54952A02727p41j143j281l54P92R38L93N0m39j746l088l125k065j238j125j225
54936H7330j225r74M0J776K916K577J911K428L483L285J851Q94R82Q32l31j485
54920A06290j331J48J995L206L216K318J647J965K773L308L802M674N243M607
54906A43861L328K722K929L173L545M787O489P362P328P563Q318Q515P979Q243
54892B26142J0385J3449J5843J7164J7786J7777J6961J5351J2810R105M682O06
54880C78061k774o241j0278j4051j6486j7537j7693j6981j5370j3547j2364j1657
$$ plain form
54984 90312 90804 90426 89504 89257 90275 91774 92417 91585 89946 88942 89401 90507 90739 89967 89672 90621 91457
54967 91457 90515 88083 85824 84738 84917 86523 89525 92908 95583 97780 100298 102720 103820 103480 102727
54952 102727 101986 100843 99562 99208 100000 100938 101331 101381 100942 99196 96108 92983 90918 89680 88555 87330
54936 87330 86105 85131 85171 86947 89863 92440 94351 96779 100262 103547 105398 106292 107274 108106 107775 106290
54920 106290 104959 105107 107102 110308 113524 115842 117489 119454 122227 125535 129337 134011 139254 143861
54906 143861 147189 149911 152840 156013 159558 164345 170834 178196 185524 193087 201405 209920 217899 226142
54892 226142 236527 249976 265819 282983 300769 318546 335507 350858 363668 372773 377455 378061
54880 378061 375287 369046 358768 344717 328231 310694 293001 276020 260650 247103 234739 223082
54868B23082j0495q532o466n005m116l405k778k332j893j143j72N47Q07R19J279
54853A80297K084L608O086Q947J0926J1680J2480J4286J5926J5652J3840J2320
54841C08132J1300R138N324J343k024n854j0473j4036j5263j5524j6422j7131
54829B38510j6224j4437j3257j2151r856p369o767p574p145m713k415j909k236
54816A32457j883r74n38r17j720k365k250j185J90J036J153N78r80l287m969n158
54800A09188m852n120m906k697M10J796J101L43K61m82k109k546o91J548J875
54785I3119N30p53j194j065o10j59l53j260k055k178j851j125L72K172K909K227
54769H8726J462J637K030J669J012J091J838K303J946J059L60N36J628K724K979
$$ plain form
54868 223082 212587 204055 197589 192584 188468 185063 182285 179953 178060 176917 176745 177292 178099 179018 180297
54853 180297 182381 185989 192075 201022 211948 223628 236108 250394 266320 281972 295812 308132
54841 308132 319432 328570 333894 335237 333213 327359 316886 302850 287587 272063 255641 238510
54829 238510 222286 207849 194592 182441 172585 165216 158449 150875 143730 139017 136602 134693 132457
54816 132457 130574 129600 129062 128145 126425 124060 121810 120625 120815 121851 123004 123582 122602 119315 114346 109188
54800 109188 104336 99216 94310 91613 92023 93819 94920 95263 95524 95042 92933 90387 89696 91244 93119
54785 93119 93649 92896 91702 90637 90027 89868 89515 88255 86200 84022 82171 81046 81418 83590 86499 88726
54769 88726 90188 91825 93855 95524 96536 97627 99465 101768 103714 104773 105133 105669 107297 110021 113000
54754A13000K805L120L709L687L272L457M002L886L687N210Q240J0169R790R045
54740A87079R760J1075J1664J2192J3535J4568J4077J3304J4118J5813J6003J3919
54728C47107J0665O952K843r18l502n590q275j0784j1388j0411j0078j1216j2233
54715B83172j1804j0607r644q649p070n321m046l105k128j216m03Q72K959N237
54701B28247O800P587Q215R042R939J0918J2400J4594J6899J8317J8502J8162
54689C79622J8062J7987J7179J5546J3457J0504N651q61o954j0935j3448j6150
54677D29660j9175k1143k1316k0554j9935j9458j8342j6063j2943j0110q801r226
54665B32594j0147r995q354o128m430l670l588l748l956m298m616m254k876j373
$$ plain form
54754 113000 115805 118925 122634 126321 129593 133050 137052 140938 144625 149835 158075 168244 178034 187079
54740 187079 196839 207914 219578 231770 245305 259873 273950 287254 301372 317185 333188 347107
54728 347107 357772 364724 367567 366649 363147 357557 349282 338498 327110 316699 306621 295405 283172
54715 283172 271368 260761 251117 242468 235398 230077 226031 222926 220798 219582 219179 220051 223010 228247
54701 228247 235047 242634 250849 259891 269830 280748 293148 307742 324641 342958 361460 379622
54689 379622 397684 415671 432850 448396 461853 472357 478008 477147 470193 459258 445810 429660
54677 429660 410485 389342 368026 347472 327537 308079 289737 273674 260731 250621 241820 232594
54665 232594 222447 212452 204098 197970 193540 189870 186282 182534 178578 174280 169664 165410 162534 161161
54651A61161j009j577j455J2J423J345L34j28J78L95K96L80N17j14j588k834k895
54634A54441j891n68M13O95L95J40M46J070J362J172R39R53J076J121J072J014
54618A63850J110J434J666J321O74Q19K280M161N256N459N317M904M102L567M149
54603B10069N525O503O642O591O788O871O549O135N865N403M438L226K338K225
54589B85168L074M574N891O390O370O440O432N774M893N104O686Q151Q106P060
54575C70113O487O606O249M769K876J082j641o507j2490j6532j6630j3985j1348
54562C19049j0047r577r537j0203j1023j0307p477m470l535m336m491k675N4J905
54548B33330K201J429M96J89P01J396J528J144P35J39j245l073l910l096j905
$$ plain form
54651 161161 160152 158575 157120 157132 158555 159900 160234 160106 160284 160679 160975 161355 161872 161758 160170 157336 154441
54634 154441 152550 151982 152395 153090 153485 153625 154071 155141 156503 157675 158614 159567 160643 161764 162836 163850
54618 163850 164960 166394 168060 169381 170055 170874 173154 177315 182571 188030 193347 198251 202353 205920 210069
54603 210069 215594 222097 228739 235330 242118 248989 255538 261673 267538 272941 277379 280605 282943 285168
54589 285168 288242 292816 298707 305097 311467 317907 324339 330113 335006 340110 346796 354947 363053 370113
54575 370113 376600 383206 389455 394224 397100 398182 396541 390034 377544 361012 344382 330397 319049
54562 319049 309002 299425 289888 279685 268662 258355 250878 246408 242873 238537 234046 231371 231425 233330
54548 233330 235531 236960 237456 237645 238346 239742 241270 242414 243149 243288 242043 238970 235060 231964 230059
54533B30059k132l962o064p416q072q139p092m781k407j590k533l914m714n288
54519A61955o199o914o480n052l658k684j697p77p56j629j900m01J866K702J318
54504A29694q18j745j034J07L52l71j042q70j10N70J016J456J711J429P97K66
54488A31408l19j342k230j761K56K548L946M304L763K339O87N4P30J630J998K443
54472A50454L492M446M622M618N111N429M689L557L341L811L459J756j62j192
54458A97431j465j761k428l174l545l545l732m412m862m257l316l560m723m631
54444A48020k585r25j706l565l854k445j168n16M11J300P31r81j688o30N40O26
54428A31565O86J977L791M576L934K502R04k93m73L47J378K129K928L945M561
$$ plain form
54533 230059 227927 223965 217901 210485 202413 194274 187182 182401 179994 178404 175871 171957 167243 161955
54519 161955 155756 148842 142362 137310 133652 130968 129271 128494 127738 126109 124209 123808 125674 128376 129694
54504 129694 128876 127131 126097 126204 126556 126185 125143 124273 124163 124733 125749 127205 128916 130345 131142 131408
54488 131408 131089 129747 127517 125756 126012 128560 132506 136810 140573 142912 143599 143653 144383 146013 148011 150454
54472 150454 153946 158392 163014 167632 172743 178172 182861 186418 189759 193570 197029 198785 198623 197431
54458 197431 195966 194205 191777 188603 185058 181513 177781 173369 168507 164250 160934 157374 152651 148020
54444 148020 145435 144510 142804 139239 135385 132940 131772 131256 131667 132967 133698 132717 131029 130399 130939 131565
54428 131565 132251 134228 138019 142595 146529 149031 149935 149642 149169 149516 150894 153023 155951 159896 164457
54413A64457M231L251K303J791J875K431K784K264J163L42m9n17r40o12K83O35
54397A85692J73j00K01L6j253k613k829k235j805j502q71n29j563l656n081m809
54381A57256l631k938l052l167k600j665j140j164r71R1J655K831L142K536J076
54366A48259o38j241m3J618J729K88p32j74J022J761K303L090L467K755J651J330
54350A66445J834K467L144M158M988M548K703P66L03J789M317O192O208M829L852
54335B18543M466N868O291N149L667L465M879O523O442L931L90j969k391k147
54321B63107k722m083n139n204m531l787l605m279n344n697m690l000j954k116
54307B06956k844l227l047k861l201l778l648k442j179j266k616l490k504j69
$$ plain form
54413 164457 168688 171939 174242 176033 177908 180339 183123 185387 186550 186892 186843 186326 185386 184774 185057 185692
54397 185692 185865 185765 185966 186002 184749 182136 179307 177072 175267 173765 172894 172365 170802 167146 162065 157256
54381 157256 153625 150687 147635 144468 141868 140203 139063 137899 136928 137019 138674 141505 144647 147183 148259
54366 148259 147621 146380 146337 147955 149684 149972 149240 149066 150088 151849 154152 157242 160709 163464 165115 166445
54350 166445 168279 170746 173890 178048 183036 187584 190287 191053 191356 193145 197462 203654 209862 214691 218543
54335 218543 223009 228877 235168 240317 243984 247449 252328 258851 265293 269224 269614 267645 265254 263107
54321 263107 260385 256302 251163 245959 241428 237641 234036 229757 224413 218716 214026 211026 209072 206956
54307 206956 204112 200885 197838 194977 191776 187998 184350 181908 180729 179463 176847 173357 170853 170684
54293A70684J924K883K935K539J863J093O85J116K494M508O574P978Q079O657
54279B22012M356K588K461L592M498M253L191J753k34k498l731l378l079m604
54265B31180o913p290n333l580l701m257l500k400l111n552p404p158n567m127
54251A61287l384l022k807k919l559m460m903m470l634l113k805k128j347j410
54237A17326k200k201o56J008R93l53r82J99K150L100K398Q61l23q42j451k722
54221A16305l961m027l007j986j071Q73L896N824M695J432j151j405K19K555M576
54206A23767N152L621J011n11kJ143R70o21j805j020J227K886K524N83j444k582
54190A34899k672j854o23o5q26j920j751m43K78k06m14Q12K409K732J874J061
$$ plain form
54293 170684 172608 175491 178426 180965 182828 183921 184606 185722 188216 192724 199298 207276 215355 222012
54279 222012 226368 228956 231417 235009 239507 243760 246951 248704 248470 245972 242241 238863 235784 231180
54265 231180 224267 216977 211644 208064 204363 200106 196606 194206 191095 185543 178139 170981 165414 161287
54251 161287 157903 154881 152074 149155 145596 141136 136233 131763 128129 125016 122211 120083 118736 117326
54237 117326 115126 112925 112269 113277 114270 113917 112935 113134 115284 118384 120782 121643 121320 120478 119027 116305
54221 116305 112344 108317 105310 103324 102253 103126 107022 112846 117541 118973 117822 116417 116636 119191 123767
54206 123767 128919 132540 133551 133040 133038 134181 135151 134530 132725 131705 132932 135818 138342 138925 137481 134899
54190 134899 132227 130373 129750 129685 128859 126939 125188 124745 125023 124817 124403 125215 127624 130356 132230 133291
54174A33291O61K22k66m46m58o60q99j003j447k476l254k999k266j909j513l43
54158A14235Q58O87n72j190n22L52N71M97O18R10J500K479K817J208j581k901
54142A19966j621J22j96k265l792l648k636j781j344j345j798k212j833o70M17
54127I5364P74N87L33K13K88O31R35N36o38j541j177j65j81j500k127l49K487
54110I4470L244J021j543j652K66J685J494R01J086J588J420O47J21K34O42R17
54094A06541R15N93j39j189k055k050r48N56J314P96m05j123o17J003K779L356
54078A09327J871j111l816m762l919k376j153n56l48k21j98n62j194j266k67Q77
54062I0326P08o66j484p02O79J222Q58L00k53q06q70j77N44N85M21Q21J463J559
$$ plain form
54174 133291 133952 134174 133908 133462 133004 132344 131445 130442 128995 126519 123265 120266 118000 116091 114578 114235
54158 114235 115093 115780 115208 114018 113496 113848 114419 114916 115534 116444 117944 120423 123240 124448 122867 119966
54142 119966 118345 118467 118271 116006 112214 108566 105930 104149 102805 101460 99662 97450 95617 94947 95364
54127 95364 96138 96725 97058 97271 97559 98190 99125 99661 99023 97482 96305 96140 95959 94459 92332 91983 94470
54110 94470 97714 98735 97192 95540 95806 97491 98985 99886 100972 102560 103980 104627 104748 104982 105624 106541
54094 106541 107456 108049 107910 106721 104666 102616 101668 102224 103538 104334 103929 102806 102189 103192 105971 109327
54078 109327 111198 110087 106271 101509 97590 95214 94061 93505 93157 92936 92738 92176 90982 89716 89449 90326
54062 90326 91034 90368 88884 88182 88861 90083 90941 91241 90988 90182 89312 89135 89679 90264 90685 91506 92969 94528
54044I4528J168O86k32j749k563j298J035J898N64j074j269l87L24L85k0n92p49
54027I0655r6O19J66j046j100N53J849R46j036j528n9J385J206Po79l66J27o3
54009I1540p70r77J1J681K878L178L146L216L080K471J858J783K018K031J873
53994A19017J991K391K531K003R49r0n49k34M74J049J598K766M611O093O205N182
53978A55987M106L590L402L172K843K570K758M068O684R569J1105J0716R418Q519
53964B38507Q264Q039P354O239N067M461M979O328P179O573N284M825N205M795
53950C23099K826P20O3L73Q3r55j498j186j106j915k909l433m031n410p171q286
53934B89264q260p140n161k896j373j337k649m460n684n421l798k385k716m224
$$ plain form
54044 94528 95696 96382 96150 94401 91838 90540 91575 93473 94037 92963 91694 91307 91631 92016 91996 91404 90655
54027 90655 90559 91178 91344 90298 89198 89751 91600 92546 91510 89982 89923 91308 92514 92521 91842 91476 91603 91540
54009 91540 90770 89793 89804 91485 94363 97541 100687 103903 106983 109454 111312 113095 115113 117144 119017
53994 119017 121008 123399 125930 127933 128882 128792 128243 128009 128483 129532 131130 133896 138507 144600 150805 155987
53978 155987 160093 163683 167085 170257 173100 175670 178428 182496 189180 198749 209854 220570 229988 238507
53964 238507 246771 254810 262164 268403 273470 277931 282910 289238 296417 302990 308274 313099 318304 323099
53950 323099 325925 326645 326708 327081 327164 326209 324711 323525 322419 320504 317595 314162 310131 304721 297550 289264
53934 289264 281004 273864 268703 265807 264434 263097 260448 255988 250304 244883 241085 238700 235984 231760
53920B31760m883m055l181l212l101j906o10m70q54m14O89J342J390J383J175
53905B15053M60%N88J383J106M55J356L936O121O285M715K458L91m67N64K578
53889B46982L710L234J988Q97L95J025K803M057K929K75q41R87L951N900O864
53874B85156P721Q131P157M858K235K37n63j66N22N51L61J204K836L305J754j10
53858C25189j20J879M594P037Q770R410Q979Q195P636P195O717O428O388O373
53844D14670O494P007P477P399P506Q821J0216R112N128R08j549l138n017o039
53830D68995m857k694j901k934m667o537q397r316q657p705q239r960j1092j1015
53816C71024j0558j0193r621q806p908o704n473n685p991j0253r746o958m991
$$ plain form
53920 231760 226877 222822 219641 216429 213328 211422 210812 210342 209488 209074 209763 211105 212495 213878 215053
53905 215053 215513 215513 216101 217484 218590 219045 220401 224337 230458 236743 241458 243916 244307 243840 244404 246982
53889 246982 250692 253926 255914 256811 257206 258231 261034 265091 268020 268295 267454 268441 272392 278292 285156
53874 285156 292877 301008 308165 313023 315258 315495 314932 314766 315288 315839 316200 317404 320240 323545 325299 325189
53858 325189 325069 326948 331542 338579 347349 356759 365738 373933 381569 388764 395481 401909 408297 414670
53844 414670 421164 428171 435648 443047 450553 459374 469590 478702 483830 484738 483189 480051 475034 468995
53830 468995 464138 461444 459543 456609 451942 445405 437008 427692 419035 411330 403091 393131 382039 371024
53816 371024 360466 350273 340652 331846 323938 317234 311761 306076 298085 287832 278086 271128 266137
53803B66137n264o075n575m094k877k393k705l959n667o703o608n969n170l953
53789A99125k561k002k522l009k546j641j285j573j817j422k91R84J208l23k601
53774A77724l740l223k298j864j199M86K383L011K281J496J475J530N98j119k057
53759A75484j062J004J993J041l34k85R85J871J803J701K263L125L834M333M319
53744B02075L490K636L080M538N029L700K362L035N125O372N911M981M868N526
53730B62728O365P301Q490R542R501P718M760K230J284J405J274Q18J260K849
53716C27525L819K671M99l80L76R08K4j229j387o14j20l84j031j861l086m577
53700C21153n741o204o089n493m331k845j778j677k261k867l251l603l918l815
$$ plain form
53803 266137 260873 254798 249223 245129 242252 239859 237154 233195 227528 220825 214217 208248 203078 199125
53789 199125 196564 194562 192040 189031 186485 184844 183559 181986 180169 178747 178456 179440 180648 180325 177724
53774 177724 173984 170761 168463 166599 165400 165886 168269 171280 173561 175057 176532 178062 178660 177541 175484
53759 175484 174422 175426 177419 178460 178126 177841 178826 180697 182500 184201 186464 189589 193423 197756 202075
53744 202075 205565 208201 211281 215819 220848 224548 226910 229945 235070 241442 247353 252334 257202 262728
53730 262728 269093 276394 284884 294426 303927 311645 316405 318635 319919 321324 322598 323416 324676 327525
53716 327525 331344 334015 334514 334134 334510 335418 335442 334213 332826 332212 332092 331708 330677 328816 325730 321153
53700 321153 315412 309208 303119 297626 293295 290450 288672 286995 284734 281867 278616 275013 271095 267280
53686B67280l089k046j172o34k92m5P1Q4J80M51O40L56l25p07j94R05J584J193
53668B64240K7j125j671j444p84m47q76j411r95R3J86j426l182l280k056j009
53652B44840k08J457L777M939M113K557J717J702K230L501N162N811M739L166
53638B89503K705L427M346M916N108M871M519M833N865O452N939N378N866O657
53624C60385O422N523N389O049O177N432N077N960P278P703O737M712K438J033
53610D36315J147K119K533J815O48j30l01p3J37l40j845l799n167n474m836l532
53594D19217k146j643k247k682j689M1O97j86j392k055k498k908k620j351O1P41
53578C97340P67O40N09K93j12r58k185k726j456R49K222J260l12j61J985M412
$$ plain form
53686 267280 264191 262145 260973 260339 260047 260002 260073 260157 260337 260788 261428 261784 261459 260752 260558 261463 263047 264240
53668 264240 264267 263142 261471 260027 259243 258796 257920 256509 255514 255607 255793 254367 251185 247905 245849 244840
53652 244840 244632 246089 249866 254805 258918 261475 263192 264894 267124 270625 275787 281598 286337 289503
53638 289503 292208 295635 299981 304897 310005 314876 319395 324228 330093 336545 342484 347862 353728 360385
53624 360385 366807 372330 377719 383768 389945 395377 400454 406414 413692 421395 428132 432844 435282 436315
53610 436315 437462 439581 442114 443929 444577 444447 444146 444073 444210 443870 442025 438226 433059 427585 422749 419217
53594 419217 417071 415428 413181 410499 408810 408851 409548 409362 407970 405915 403417 400509 397889 396538 396599 397340
53578 397340 398107 398747 399256 399549 399437 398479 396294 393568 392112 393061 395283 396543 396231 396070 398055 402467
53562D02467N662N659M872L551K215J940L319N159N337L497K124L743P403R649
53548D66597R086Q044Q724R801Q779O231N133O529Q364Q749Q199Q067Q597R273
53534E80173R742R780R454R618J1071J2963J3324J1477Q907P425P656R173J0725
53521G11488J0491P855N113N337Q191J0055Q968P042O785P423O722M682L106K717
53507H05975K815L034L518L856L552L231L780M699M718L797L121L210L332K774
53493H55412J599J76r75j001N26K651L810L563K746K117J781J865K675L913M623
53478H85481M273L330K489J831J023O3m45K00J990L936N055N574O676Q928J1600
53463I42004J3751J5186J5981J6025J5627J5784J6979J8377J9090J9609K1064
$$ plain form
53562 402467 408129 413788 418660 422211 424426 426366 429685 434844 440181 443678 445802 449545 456948 466597
53548 466597 475683 483727 492451 502252 511031 517262 522395 528924 537288 546037 554236 562303 570900 580173
53534 580173 589915 599695 609149 618767 629838 642801 656125 667602 676509 683934 691590 700763 711488
53521 711488 721979 729834 734947 740284 748475 758530 767498 774540 781325 788748 795470 800152 803258 805975
53507 805975 808790 811824 815342 819198 822750 825981 829761 834460 839178 842975 846096 849306 852638 855412
53493 855412 857011 857187 856212 855211 855737 858388 862198 865761 868507 870624 872405 874270 876945 880858 885481
53478 885481 889754 893084 895573 897404 898427 898490 898045 898245 900235 904171 909226 914800 921476 930404 942004
53463 942004 955755 970941 986922 1002947 1018574 1034358 1051337 1069714 1088804 1108413 1129477
53452A129477K3579K6263K8397K9728L0186L0367L1735L4946L8265L9137L7508
53441A479588L6253L7914M2092M6551M9806N1933N3543N4951N6151N7015N7481
53430B023278N7775N8261N8988N9547N9594N9304N9074N9013N8976N8957N9092
53419B671859N9198N8790N7874N7342N7916N8822N8368N6111N3494N1768N0238
53408C291780M7672M4505M2146M0486L7982L4244L0774K8567K6576K3428J9464
53397C667624J6080J3975J2856J1960J0145O407J075m298q771j2918j7349k1672
53385C675114k5638k9902l4511l8036l9570m0454m2402m4912m6278m6487m7176
53374C239748m9078n1298n2993n4159n4671n4070n2520n0762m9036m7014m4710
$$ plain form
53452 1129477 1153056 1179319 1207716 1237444 1267630 1297997 1329732 1364678 1402943 1442080 1479588
53441 1479588 1515841 1553755 1595847 1642398 1692204 1744137 1797680 1852631 1908782 1965797 2023278
53430 2023278 2081053 2139314 2198302 2257849 2317443 2376747 2435821 2494834 2553810 2612767 2671859
53419 2671859 2731057 2789847 2847721 2905063 2962979 3021801 3080169 3136280 3189774 3241542 3291780
53408 3291780 3339452 3383957 3426103 3466589 3504571 3538815 3569589 3598156 3624732 3648160 3667624
53397 3667624 3683704 3697679 3710535 3722495 3732640 3739047 3740122 3735824 3727053 3714135 3696786 3675114
53385 3675114 3649476 3619574 3585063 3547027 3507457 3467003 3424601 3379689 3333411 3286924 3239748
53374 3239748 3190670 3139372 3086379 3032220 2977549 2923479 2870959 2820197 2771161 2724147 2679437
53363B679437m2462m0156l7581l5211l3425l1379k8015k3936k0657j8218j5238
53352B353159j1334p568m244k50M803R675J3670J7889K3229K8655L2917L6639
53340B497240M1015M5419M8247M9623N1418N4591N8181O1210O4065O7394P0961
53329C109364P4497P8582Q3485Q7877R0183R1129R3444R8585J04947J10004J13166
53318D135263J15492J17561J19109J20279J21576J22560J22141J20432J18863
53309E213276J18142J17386J15756J13299J09726J04120R6838Q9930Q4330P8251
53299F241054O9986O0743N2764M5944L8529L0231K2180J4379N723l585j2104j9726
53287F546118k7976l7318m6357n4264o2129p1157q1161r1417j01542j10779j17915
$$ plain form
53363 2679437 2636975 2596819 2559238 2524027 2490602 2459223 2431208 2407272 2386615 2368397 2353159
53352 2353159 2341825 2334257 2330013 2329763 2334566 2344241 2357911 2375800 2399029 2427684 2460601 2497240
53340 2497240 2538255 2583674 2631921 2681544 2732962 2787553 2845734 2906944 2971009 3038403 3109364
53329 3109364 3183861 3262443 3345928 3433805 3523988 3615117 3708561 3807146 3912093 4022097 4135263
53318 4135263 4250755 4368316 4487425 4607704 4729280 4851840 4973981 5094413 5213276
53309 5213276 5331418 5448804 5564560 5677859 5787585 5891705 5988543 6078473 6162803 6241054
53299 6241054 6311040 6371783 6424547 6470491 6509020 6539251 6561431 6575810 6581533 6577948 6565844 6546118
53287 6546118 6518142 6480824 6434467 6380203 6318074 6246917 6165756 6074339 5972797 5862018 5744103
53276E744103j22557j25256j26186j25148j23159j22035j21840j20689j17894
53267D639339j15283j14270j13520j11199j07831j05082j02889r9711r4974q9480
53257C585100q3910p8521p3941p0734o8160o4647n9559n3710m8282m3970m0851
53246B898815l8269l5027l0452k5144k0214j6095j2609r665p096m287q12K736
53234B701881N256O388O841P678R617J2652J6097J9250K2169K5200K7806K8972
53222B889807K9071L0053L3164L7499M1617M5286M8642N0875N1267N0704N0603
53211C358588N0922N0627M9588M8519M7388M5500M2964M0583L8295L5335L1867
53200C840176K8939K6558K3462J9241J5114J1876Q426L424k640q195j2601j6362
$$ plain form
53276 5744103 5621546 5496290 5370104 5244956 5121797 4999762 4877922 4757233 4639339
53267 4639339 4524056 4409786 4296266 4185067 4077236 3972154 3869265 3769554 3674580 3585100
53257 3585100 3501190 3422669 3348728 3277994 3209834 3145187 3085628 3031918 2983636 2939666 2898815
53246 2898815 2860546 2825519 2795067 2769923 2749709 2733614 2721005 2711340 2704244 2699957 2699145 2701881
53234 2701881 2707137 2713525 2720366 2728044 2737661 2750313 2766410 2785660 2807829 2833029 2860835 2889807
53222 2889807 2918878 2948931 2982095 3019594 3061211 3106497 3155139 3206014 3257281 3307985 3358588
53211 3358588 3409510 3460137 3509725 3558244 3605632 3651132 3694096 3734679 3772974 3808309 3840176
53200 3840176 3869115 3895673 3919135 3938376 3953490 3965366 3973792 3977216 3974576 3966381 3953780 3937418
53188C937418j9877k3173k6715l1292l6928m2627m7497n1539n5084n8021o0036
53177C484629o1302o2382o3534o4590o5447o6192o6477o5533o3213o0567n8692
53166B786700n7413n5952n4476n3795n3617n2543n0237m8193m7604m7661m6988
53155B218221m5772m5121m5051m4492m2901m0572l7628l4103l0957k9538k9790
53144A792296l0152k9656k9025k9255l0183l1109l1849l2455l2483l1489k9907
53133A454733k8657k7958k7224k6166k5339k5455k6489k7843k9122l0381l1511
53122A148588l1886l1024k9445k8253k7883k7604k6520k4597k2612k1466k1668
53111H55630k2906k3834k3008k0516j8055j6927j6582j5743j4326j3349j3536
$$ plain form
53188 3937418 3917541 3894368 3867653 3836361 3799433 3756806 3709309 3657770 3602686 3544665 3484629
53177 3484629 3423327 3360945 3297411 3232821 3167374 3101182 3034705 2969172 2905959 2845392 2786700
53166 2786700 2729287 2673335 2618859 2565064 2511447 2458904 2408667 2360474 2312870 2265209 2218221
53155 2218221 2172449 2127328 2082277 2037785 1994884 1954312 1916684 1882581 1851624 1822086 1792296
53144 1792296 1762144 1732488 1703463 1674208 1644025 1612916 1581067 1548612 1516129 1484640 1454733
53133 1454733 1426076 1398118 1370894 1344728 1319389 1293934 1267445 1239602 1210480 1180099 1148588
53122 1148588 1116702 1085678 1056233 1027980 1000097 972493 945973 921376 898764 877298 855630
53111 855630 832724 808890 785882 765366 747311 730384 713802 698059 683733 670384 656848
53100F56848j4749j6373j7363j6564j4022j1549j0756j0903r999p846o316o515
53088E13893p319p325o789o764p398q006q053p301n663l619k177j812j948j985
53074D37734k075k312k170j507j321k356l623l553k140o32N75K271M491N763M972
53059D34117K944J404R99J129J253J525K220K997K970J410j431m114n011l927
53045D38485k568k938n233p707q599p769o325n141m327l901m198n251o383o904
53031C61241o964p075p073o291m888m098m725o017o632o269n700n499n460n233
53017B79317m746l983k906j807j226j270j426j250q83p21r36j529k382k980k579
53002B48693j174k5n60k739m911n370l835j488J46L87j94m97kQ49J422J560J234
$$ plain form
53100 656848 642099 625726 608363 591799 577777 566228 555472 544569 534570 526724 520408 513893
53088 513893 506574 499249 492460 485696 478298 470292 462239 454938 449275 445656 443479 441667 439719 437734
53074 437734 435659 433347 431177 429670 428349 425993 422370 418817 416677 416045 416620 418891 423382 429145 434117
53059 434117 437061 438465 439464 440593 441846 443371 445591 448588 451558 452968 451537 447423 442412 438485
53045 438485 435917 432979 427746 420039 411440 403671 397346 392205 387878 383977 379779 374528 368145 361241
53031 361241 354277 347202 340129 333838 328950 324852 320127 314110 307478 301209 295509 290010 284550 279317
53017 279317 274571 270588 267682 265875 264649 263379 261953 260703 259820 259099 258163 256634 254252 251272 248693
53002 248693 247519 247494 246934 244195 239284 233914 230079 228591 228737 229124 228930 228433 228431 229280 230702 232262 233496
52985B33496K16j311k211j452M06J616J236l6j030j208m75R40K065J579n75k807
52969B30449l739l630l271k453p13J111J505K62j262j712p11J321L169L162Q64
52954B24352j634j744L55J991J645N26J03Om99p15K46J578J760P24m07j184k024
52937B25079k841k906k058r53k5P64J199P76m55j724k329j992n66J784M054M855
52921B22662L735J790Q09J950M825P616Q458P328O061O067O632O302N211M765
52907B94211N341N678M736L067K044K362L466L821K058j312l729l254j107j94
52893C17188j266k363k141j664k054k391j456r3k9j273k370k746l028l327k933
52878B88054j859j233j645k187j799o97J11J67r9j02K38M90K28k79r7J275K918
$$ plain form
52985 233496 233712 232401 230190 228738 229144 230760 231996 231960 230930 229722 229247 230187 232252 233831 233256 230449
52969 230449 226710 223080 219809 217356 216643 217754 219259 219521 218259 216547 215836 217157 220326 223488 224352
52954 224352 222718 220974 221329 223320 224965 225491 225594 225600 225101 224386 224632 226210 227970 228694 228287 227103 225079
52937 225079 222238 219332 217274 216321 216296 217060 218259 219035 218580 216856 214527 212535 211969 213753 217807 222662
52921 222662 226397 228187 228996 230946 235771 243387 251845 259173 265234 271301 277933 284235 289446 294211
52907 294211 299552 305230 309966 313033 315077 317439 320905 324726 326784 325472 321743 318489 317382 317188
52893 317188 315922 313559 311418 309754 307700 305309 303853 303760 303731 302458 300088 297342 294314 290987 288054
52878 288054 286195 284962 283317 281130 279331 278634 278745 278912 278813 278711 278949 279439 279667 279388 279291 280566 283484
52861B83484L228J736l10j425j421j178j371j911k350k330j772r78n55p52r54
52846B71141l27R72J767J439R43J535K738K598L11k311k781q33J543K679K726
52831B84140K466J925R50K75P81J932K168R90l45o02j18J21J05M51Q21K15j016
52814B95259r44J253L526L246O81j369j271j58M67R42K190L550L619K491J706
52799C15188J962K376K140J697J834K479K989L117L277M080N713P523Q340P657
52785C70372O251N186M469L451K190J463J522J859K167K468K326J104q25k350
52771D01653l262m295n334n278m208l886n000n756m725l383l822n188m970l204
52757C39342k764n120q133q820o731l754j830j652k595l317l132k974m099n691
$$ plain form
52861 283484 286712 288448 288138 286713 285292 284114 282743 280832 278482 276152 274380 273402 272847 272095 271141
52846 271141 270814 271786 273553 274992 275935 277470 280208 282806 283117 280806 278025 277192 278735 281414 284140
52831 284140 286606 288531 289481 289756 290537 292469 294637 295627 295282 294680 294562 294683 294788 295239 296060 296275 295259
52814 295259 294315 295568 299094 302340 303021 301652 300381 300223 300690 301632 303822 307372 310991 313482 315188
52799 315188 317150 319526 321666 323363 325197 327676 330665 333782 337059 341139 346852 354375 362715 370372
52785 370372 376623 381809 386278 389729 391919 393382 394904 396763 398930 401398 403724 404828 404003 401653
52771 401653 398391 394096 388762 383484 379276 375390 370390 364634 359909 356526 352704 347516 342546 339342
52757 339342 336578 331458 323325 314505 307774 304020 302190 300538 297943 294626 291494 288520 284421 278730
52743B78730n340k375P22J245n70k428k986k599j743m33Q43R42n63k635l792l553
52727B53465k591j774j310r08n44p59j837k975l030k121j665k467l625l791k879
52712B21189j831j281j256j712k485k999k756j941j080l89q5p06k267l560l468
52697A93373k678k854m150m873l883k049q50n89o90q55j101j331j609k384l711
52682A59766m671m278k756j304p70r79j204r13k33Q6m94j356j172L70J960K277
52666A44329J570R02N93L10J91N98J045N88o28j311p57M03J475K600L853M417
52650A60178L524J751N22N18J108J314Q62L40M89J376K291K628K719L278M130
52635A87028M282L451K651K700K816J519j320m117n205m327k618j549j794k819
$$ plain form
52743 278730 273390 271015 271737 272982 272412 269984 266998 264399 262656 262223 263066 264008 263445 260810 257018 253465
52727 253465 250874 249100 247790 246882 246338 245579 243742 240767 237737 235616 233951 231484 227859 224068 221189
52712 221189 219358 218077 216821 215109 212624 209625 206869 204928 203848 203459 203374 202668 200401 196841 193373
52697 193373 190695 187841 183691 178818 174935 172886 172036 171447 170757 169902 168801 167470 165861 163477 159766
52682 159766 155095 150817 148061 146757 145987 145008 143804 142891 142658 142744 142250 140894 139722 140092 142052 144329
52666 144329 145899 146801 147394 147704 147895 148493 149538 150126 149498 148187 147430 147833 149308 151908 155761 160178
52650 160178 163702 165453 165975 166493 167601 168915 169777 170117 170606 171982 174273 176901 179620 182898 187028
52635 187028 191310 194761 197412 200112 202928 204447 203127 199010 193805 189478 186860 185311 183517 180698
52621A80698l476l268k739k567k653k560k425k792l678m402m320l343j789k08
52607A40478P35O40k15j116j685k063k530l125l641l732l140k103j287j000p48
52592A15468j5Q11R24K80l89p38j085j520j591j137o94o35n97k26J24K9k26j44
52574A08639J15J6m27o22j83Q04K064L041K856J220o38r30M95J797J475K24k16
52557A19730N55J401J439Q59K9j023j837j425K85J689J257m61j602j464j002q55
52541A17575l33J135K661L047K524K220K298J911R14L74Q37J202K25j445j911
52526A33234n93J015J493J358J823K588K248Q77M76K101L969L804K126J488K730
52511A60737L965L563K268J546J356R35N39Q72J451J120J1m87L21J613K429K790
$$ plain form
52621 180698 177222 173954 171215 168648 165995 163435 161010 158218 154540 150138 145818 142475 140686 140478
52607 140478 141213 141853 141638 140522 138837 136774 134244 131119 127478 123746 120606 118503 117216 116216 115468
52592 115468 115453 116264 117188 117468 117079 116341 115256 113736 112145 111008 110314 109679 109082 108856 108980 109009 108783 108639
52574 108639 108754 108770 108343 107721 107538 108342 110406 113447 116303 117523 116885 115955 116450 118247 119722 119946 119730
52557 119730 120285 121686 123125 123984 124013 122990 121153 119728 120013 121702 122959 122498 120896 119432 118430 117575
52541 117575 117242 118377 121038 124085 126609 128829 131127 133038 133952 134326 135163 136365 136590 135145 133234
52526 133234 132641 133656 135149 136507 138330 140918 143166 144043 144519 146620 150589 154393 156519 158007 160737
52511 160737 164702 168265 170533 172079 173435 174370 174909 175781 177232 178352 178363 177876 178197 179810 182239 185029
52495A85029L182L709M116M071L238J688K65m1P94J779K013J363K57n64k58J271
52479B11912K729K575R26n45p05o9M09N81P10P12M65J88nk73l26N94K413L665
52461B25956L163J668R14J349J786J156l42j823k650k614j881j047q18j335k071
52446B21411k396k048j055L73J710K185J395k20j618j992j327j55J078K200K908
52431B22449K735J663M63j29k76n18p05k37O89J078O24K93R28K041K586K376J969
52414B38029J697J430J073O91L57L25R96K220L072K818J784P30p4n07K7J676L039
52397B59383K335j20k007j906q53l45k6J406L761N295N067L960L140K632J982
52382B83704J388J227J012m6j493j773k19J832K510J481K7o98q42j290k332l165
$$ plain form
52495 185029 188211 191920 196036 200107 203345 205033 205298 205257 206051 207830 209843 211206 211463 210899 210641 211912
52479 211912 214641 217216 218142 217597 216892 216823 217232 217813 218523 219235 219700 219888 219883 219610 219284 219878 222291 225956
52461 225956 229119 230787 231701 233050 234836 235992 235650 233827 231177 228563 226682 225635 224817 223482 221411
52446 221411 219015 216967 215912 216285 217995 220180 221575 221355 219737 217745 216418 216263 217341 219541 222449
52431 222449 225184 226847 227310 227181 226905 226387 225682 225445 226134 227212 227836 228129 229057 231098 233684 236060 238029
52414 238029 239726 241156 242229 242920 243277 243602 244598 246818 249890 252708 254492 255222 255148 254641 254668 256344 259383
52397 259383 261718 261598 259591 257685 256832 256487 256461 257867 261628 266923 271990 275950 279090 281722 283704
52382 283704 285092 286319 287331 287285 285792 284019 283800 285632 288142 289623 289650 288952 288110 286820 284488 281323
52366B81323k732j088K82n9j743l021l066k917l630m533m364l319k508j944p54
52351B45927O47N25j419k911j918N54J805Q82o64j180o84j26J04L32P78J180J271
52334B45103J258J427J414M84j131j805l94J885K656J415J62O24K214L257L157
52319B61726K460J721J261J380J864J834Q83j54k60N23J630K965M467N373N060
52304B92733M210M007M507M784M461M042L860L761L735M047M648N251N728N879
52290C55653N189L682K564K957M277N031M920M901N318N402M786M052L510K654
52276D14896J459J033K250M491O308O786N901M320L187L401M570N345N101M616
52262D73664M734N196N322N132N169N596O123O411O251N688N268N673O809P838
$$ plain form
52366 281323 278591 277503 277785 277726 275983 272962 269896 266979 263349 258816 254452 251133 248625 246681 245927
52351 245927 246574 247099 245680 242769 240851 241405 243210 244092 243428 242248 241564 241438 241542 241874 242652 243832 245103
52334 245103 246361 247788 249202 249686 248555 246750 246356 248241 250897 252312 252474 253098 255312 258569 261726
52319 261726 264186 265907 267168 268548 270412 272246 273129 272975 272715 273238 274868 277833 282300 287673 292733
52304 292733 296943 300950 305457 310241 314702 318744 322604 326365 330100 334147 338795 344046 349774 355653
52290 355653 360842 364524 367088 370045 374322 379353 384273 389174 394492 399894 404680 408732 412242 414896
52276 414896 416355 417388 419638 424129 430437 437223 443124 447444 450631 454032 458602 463947 469048 473664
52262 473664 478398 483594 488916 494048 499217 504813 510936 517347 523598 529286 534554 540227 547036 554874
52248E54874Q263Q386Q465Q270P960Q489J0333J2421J3270J2884J2645J3524J5154
52235F94938J6707J7926J9002J9933K0463K0619K0986K2184K3966K5123K4714
52224I26561K3303K2505K3195K4604K5325K4846K3943K3842K5046K6724K7271
52213A197165K5953K3867K2633K2296K1422J9316J7081J5997J5818J5440J4508
52202A411496J3426J2342J1058R719Q674P819O795N754N096M445K834K44j821
52189A497881j896l29J074J089K16k05L64J305J797J770J848K678M353O203P161
52174A525309O843O384P532J0474J3290J4289J4214J5079J7223J8880J8645J6998
52162A685160J5030J3086J1358J0653J1326J2222J1831J0228Q838Q443Q421P986
$$ plain form
52248 554874 563137 571523 579988 588258 596218 604707 615040 627461 640731 653615 666260 679784 694938
52235 694938 711645 729571 748573 768506 788969 809588 830574 852758 876724 901847 926561
52224 926561 949864 972369 995564 1020168 1045493 1070339 1094282 1118124 1143170 1169894 1197165
52213 1197165 1223118 1246985 1269618 1291914 1313336 1332652 1349733 1365730 1381548 1396988 1411496
52202 1411496 1424922 1437264 1448322 1458041 1466715 1474534 1481329 1487083 1492179 1496624 1499458 1499702 1497881
52189 1497881 1495985 1495656 1496730 1497819 1498035 1497830 1498194 1499499 1501296 1503066 1504914 1507592 1511945 1518148 1525309
52174 1525309 1532152 1538536 1546068 1556542 1569832 1584121 1598335 1613414 1630637 1649517 1668162 1685160
52162 1685160 1700190 1713276 1724634 1735287 1746613 1758835 1770666 1780894 1789732 1798175 1806596 1814582
52150A814582P195O299M777J796k413o194p937p746p265p644q369q551q748j0341
52136A759441j3233j5448j5480j4011j2751j2359j2314j2107j1647j0839r617
52125A619635q337p449o881o194n278m465m150m607n881p385p972p044n413m536
52111A534043m895n593n464m182k443j379j730l138m335m268l101j955j855k972
52097A486733m572n425m709k909j583j957l863o114p501p344n863m432m673o609
52083A419179q366q372p206o392o163n711n092n288o376p272p575q168r347r800
52069A318051q503o556n844o477o923o271n041l904k952k509l301n108o346n911
52055A242405m652l944l482j976K68J261L50l60J161L874N102M311L587M364N551
$$ plain form
52150 1814582 1821777 1828076 1832853 1834649 1832236 1826042 1818105 1810359 1803094 1795450 1787081 1778530 1769782 1759441
52136 1759441 1746208 1730760 1715280 1701269 1688518 1676159 1663845 1651738 1640091 1629252 1619635
52125 1619635 1611298 1603849 1596968 1590774 1585496 1581031 1576881 1572274 1566393 1559008 1551036 1543992 1538579 1534043
52111 1534043 1529148 1523555 1518091 1513909 1511466 1510087 1508357 1505219 1500884 1496616 1493515 1491560 1489705 1486733
52097 1486733 1482161 1476736 1472027 1469118 1467535 1465578 1461715 1455601 1448100 1440756 1434893 1430461 1425788 1419179
52083 1419179 1410813 1402441 1395235 1388843 1382680 1376969 1371877 1366589 1360213 1352941 1345366 1337198 1327851 1318051
52069 1318051 1309548 1302992 1297148 1290671 1283748 1277477 1272436 1268532 1265580 1263071 1259770 1254662 1248316 1242405
52055 1242405 1237753 1233809 1230327 1228351 1228619 1229880 1230230 1229870 1231031 1234905 1240007 1244318 1247905 1252269 1257820
52040A257820N623N155N954Q410J0977J2213J2483J3346J5694J8781K1163K2386
52028A410005K3358K4920K6516K6956K6182K5369K5422K6170K7074K7726K7578
52017A697276K6301K4611K3702K3457K2485K0369J8516J8026J7965J6862J4783
52006A924353J2728J0839Q525N802L199R49p75j444j259j764l937o318o758n622
51992A938518n369p080r262j0341j0516j0610j0600j0049q960p572o190n399n481
51979A831089n556m513k854k120k324j676N64K761L477L574M348N065M185K147
51965A838167J067J953L768N120N608N524N355N531N784M968K421o22k180k015
51951A880449j899l243n500p313q220q709r364j0589j2673j5429j8004j9633k0560
$$ plain form
52040 1257820 1263443 1268598 1274552 1282962 1293939 1306152 1318635 1331981 1347675 1366456 1387619 1410005
52028 1410005 1433363 1458283 1484799 1511755 1537937 1563306 1588728 1614898 1641972 1669698 1697276
52017 1697276 1723577 1748188 1771890 1795347 1817832 1838201 1856717 1874743 1892708 1909570 1924353
52006 1924353 1937081 1947920 1956445 1962247 1965446 1966395 1965620 1964176 1962917 1961153 1957216 1950898 1944140 1938518
51992 1938518 1933149 1926069 1916807 1906466 1895950 1885340 1874740 1864691 1855731 1848159 1841969 1836570 1831089
51979 1831089 1825533 1821020 1818166 1816046 1813722 1812046 1812610 1815371 1818848 1822422 1826770 1831835 1836020 1838167
51965 1838167 1839234 1841187 1844955 1850075 1855683 1861207 1866562 1872093 1877877 1882845 1885266 1884644 1882464 1880449
51951 1880449 1878550 1875307 1869807 1862494 1854274 1845565 1836201 1825612 1812939 1797510 1779506 1759873 1739313
51938A739313k1821k4045k6729k8788k9772l0345l1356l2607l3077l2500l2083
51927A416190l3042l4898l6009l5711l4969l4809l4912l4256l2561l0513k8862
51916A045648k7892k7606k7851k8271k8513k8546k8422k7652k5361k1453j7396
51905G56685j5260j5639j6822j6438j3952j1241j0470j1721j2960j2324j0009
51894F09849p956p847r502j1026j0492p807m943l958m661m867l332j634k208m911
51880E24705o946o381m288k800k360k124k042k848m281n000m391l157j945q04
51866D75338k99j481m038n914n858n074n192n783n431m259l604l638l242k136
51852D19389j477j990l010l694l896l475k150n68j75j264k250j752m60M0m65q46
$$ plain form
51938 1739313 1717492 1693447 1666718 1637930 1608158 1577813 1546457 1513850 1480773 1448273 1416190
51927 1416190 1383148 1348250 1312241 1276530 1241561 1206752 1171840 1137584 1105023 1074510 1045648
51916 1045648 1017756 990150 962299 934028 905515 876969 848547 820895 795534 774081 756685
51905 756685 741425 725786 708964 692526 678574 667333 656863 645142 632182 619858 609849
51894 609849 601893 594046 584544 573518 563026 555219 550276 546318 541657 536790 533458 531824 529616 524705
51880 524705 517759 511378 507090 504290 501930 499806 497764 494916 490635 485635 481244 478087 476142 475338
51866 475338 475039 473558 469520 463606 457748 452674 447482 441699 436268 432009 428405 424767 421525 419389
51852 419389 417912 415922 412912 409218 405322 401847 399697 399129 398954 397690 395440 393688 393228 393268 392803 391957
51836C91957m79q3o72k344m153m929m293l018k151j804j283l90J08l38j243j729
51820C63156j371r2J887L549L485J586m55j152r77j152j461n96J574L480L683
51805C75144K305M92p88j175q60l51J28Q81K012K774K455J701J932L394M723M743
51789C99510L798K967K746L064L913N243O514O864N717L161N5k165k374r16N28
51774D38625O03m71j544j871j389k09J316K251J718O3j288j389p12j48K66J083
51758D36904K236K925K717K130J801J632J184O27O58J577K818L469K984J448m72
51743D64638j817k046j624j598k350l129k973j831m54N26J127J762K668L583L889
51728D60371L253K123J275Q48L13m88r12m70L37Q06J075J713K562K866K485K078
$$ plain form
51836 391957 391478 391395 390723 388379 384226 379297 375004 371986 369835 368031 366748 366358 366466 366128 364885 363156
51820 363156 361785 361693 363580 367129 370614 372200 371745 370593 369616 368464 367003 366407 367981 371461 375144
51805 375144 377449 377941 377153 375978 375118 374767 374895 375776 377788 380562 383017 384718 386650 390044 394767 399510
51789 399510 403308 406275 409021 412085 415998 421241 427755 434619 440336 443497 443552 441387 439013 438097 438625
51774 438625 439228 438757 437213 435342 433953 433744 435060 437311 439029 439092 437804 436415 435703 435555 435821 436904
51758 436904 439140 442065 444782 446912 448713 450345 451529 452156 452814 454391 457209 460678 463662 465110 464638
51743 464638 462821 460775 459151 457553 455203 452074 449101 447270 446816 447342 448469 450231 452899 456482 460371
51728 460371 463624 465747 467022 467870 468183 467695 466783 466313 466650 467456 468531 470244 472806 475672 478157 480235
51712D80235K002J758P46r62k719l643k900n04K007K631J230j8P98K945M122L407
51696D91135J997J241J200J430J928K671L069K816K766L863N440N647L883J801
51682E30887J265K001K106O45j319k358k511k841l700m209l456j708j02M83K6
51667E15209r08j650j674q11N48J572J648R19M8n00q55j466k695m584o600p656
51651D90545o937n020l688m140n665o583o226n367m790m362l658k832k376k367
51637D26534k366j910r47M9L82j31q43j099j160j651k244j884n10O39R31J372
51621D15162K863M546N271N776P617J0212J0999Q874N743L887L250K460J416J449
51607D89525L213N619O947O384M605L263L621N108N566L501j82l340n121o364
$$ plain form
51712 480235 482237 483995 484741 483779 481060 477417 474517 474013 476020 478651 479881 479863 480661 483606 487728 491135
51696 491135 493132 494373 495573 497003 498931 501602 504671 507487 510253 514116 519556 525203 529086 530887
51682 530887 532152 534153 536259 536904 535585 533227 530716 527875 524175 519966 516510 514802 514700 515183 515209
51667 515209 514301 512651 510977 510166 510714 512286 513934 514853 514901 514401 513546 512080 509385 504801 498201 490545
51651 490545 483608 478588 474900 470760 465095 458512 452286 446919 442129 437767 434109 431277 428901 426534
51637 426534 424168 422258 421311 421360 421742 421611 420768 419669 418509 416858 414614 412730 412220 412859 413790 415162
51621 415162 418025 422571 427842 433618 441235 451447 462446 471320 477063 480950 484200 486660 488076 489525
51607 489525 492738 498357 505304 511688 516293 519556 523177 528285 533851 537352 537170 533830 528709 522345
51593E22345p819r112r750r985j0116r781q720p675p560p961p425n373k980j859
51579D16229k356l653n027o224o748n793l491j567j677l258m107l365k668l634
51565C62661n257n201l123j004k56k09M0Kr18j821j491l58J99l0r2L08N53O13
51547C44616J191K217K570J795P30j8p79j410p57J425L419L858L920N480P847
51532C76104Q463O630M597M554O200P869Q737Q988Q911Q836R283J0349J1245J1213
51518D91979J0599J0479J1334J2471J2678J1187Q271N092K726J196k59j986l432
51505E72335l976l669k937k090j468j477j956j937o02J570L147L251K496K476
51491E65163M314P503J0208J1065J0616J0417J0831J0642R187P720P747Q742Q714
$$ plain form
51593 522345 514526 505414 495664 485679 475563 465782 457062 449387 441827 433866 426441 421068 418088 416229
51579 416229 413873 410220 405193 398969 392221 386428 382937 381370 379693 376435 372328 368963 366295 362661
51565 362661 357404 352203 349080 348076 347820 347611 347651 347653 346735 344914 343423 343065 343264 343234 343142 343450 344003 344616
51547 344616 345807 348024 350594 352389 353119 353101 352322 350912 350155 351580 354999 358857 362777 368257 376104
51532 376104 384567 391197 395794 400348 406548 414417 423154 432142 441053 449889 459172 469521 480766 491979
51518 491979 502578 513057 524391 536862 549540 560727 568998 574090 576816 578012 577753 575767 572335
51505 572335 568359 564690 561753 559663 558195 556718 554762 552825 552223 553793 556940 560191 562687 565163
51491 565163 569477 576980 587188 598253 608869 619286 630117 640759 649946 657666 665413 674155 682869
51478F82869O741L846J414j24q94r07l64J54L56O48J371K118K253J773J160P02
51462G03116N09Q61J870K805K529Q30j309l024m500o077p144o860n813n893q052
51447F63848j0931j2273j1372r604q670q867r124q420o903n560m927m501l702
51434E58994k957l074l776l894l122k464k613l009l143l485m080l591j284J043
51420E19545J083n32r64Q07K888L768M377N828P123O710N067L986M108M672N296
51405E73762O530Q592J0657J1659J1228R819Q372P695P906Q592R465J0357J0582
51392F95216R223O407L506J555L05p55j485j833k409l340l465j872N00J987K254
51377G05794J990J192o89l199n002n684o158p110q186r021r973j1394j2940j4131
$$ plain form
51478 682869 689610 693456 694870 694746 693852 692945 692581 692735 693091 693739 695110 697228 699481 701254 702414 703116
51462 703116 703625 704486 706356 709161 711690 712520 711211 708187 703687 697610 690466 683606 677793 671900 663848
51447 663848 652917 640644 629272 619668 610998 602131 593007 584587 577684 572124 567197 562696 558994
51434 558994 556037 552963 549187 545293 542171 539707 537094 534085 530942 527457 523377 519786 518502 519545
51420 519545 520628 520096 519132 519939 522827 526595 530972 536800 543923 550633 555700 559686 563794 568466 573762
51405 573762 580292 588884 599541 611200 622428 632247 640619 648314 656220 664812 674277 684634 695216
51392 695216 704439 710846 714352 715907 716212 715457 713972 712139 709730 706390 702925 701053 701553 703540 705794
51377 705794 707784 708976 708287 705088 700086 694402 688244 681134 672948 663927 653954 642560 629620 615489
51363F15489j4892j5150j4423j2335r429p033o240o853p528p217o305n812n639
51350D96633m657k748j294r31j50K551O197Q531Q939Q607Q211P318N999N275N568
51335E54049N916N118K840m42l735n900o688p249q640j0368j1568j2960j5768
51322D84605j8974j9880j7688j4481j2199j0640r188q405q633q784q033p388q102
51309C32210r549j0168r589q410o686m215j828q10j151j614j500j297j559k110
51295B71724k427k273j800j531j955k836l138k088k4K097L456L391J555j138k571
51280B60442j498Q41K163J808R10L83N4j43M95K273M175M882M351L797M252N529
51264B94714O688P190P423Q035R090J0009J0234R571Q160O564N730O214P375P993
$$ plain form
51363 615489 600597 585447 571024 558689 549260 542227 535987 529134 521606 514389 508084 502272 496633
51350 496633 491976 489228 487934 487003 486853 489404 495601 504132 513071 521678 529889 537207 543206 548481 554049
51335 554049 559965 565083 567923 567481 563746 557846 551158 543909 535269 524901 513333 500373 484605
51322 484605 465631 445751 428063 413582 401383 390743 381555 373150 364517 355733 347700 340312 332210
51309 332210 322661 312493 302904 294494 287808 283593 281765 280955 279804 278190 276690 275393 273834 271724
51295 271724 269297 267024 265224 263693 261738 258902 255764 253676 253652 255749 259205 262596 264151 263013 260442
51280 260442 258944 259785 261948 263756 264666 265049 265103 264960 265455 267728 271903 276785 281136 284933 289185 294714
51264 294714 301402 308592 316015 324050 333140 343149 353383 362954 371114 377678 383408 389622 396997 404990
51250D04990P671O839N532L238K23k278l782n398p962j0459j1394j0957j0546
51237C65717j0610j0396r585q840q589q358p588o350n033m025l737m244m786m316
51223B69260k877j821k294l919n225n161l950k671k136k143j877j066l98n37j125
51208B32060j088J46K113L714L890K287k77k204k452j441l98m6k65n57l32P98
51192B35948K332K828J381r97k286j755n64Kn9j20j85p45j790k710l162l411l619
51175B21088l246j710M67J820J532L59l68k81J53O71J217J146j89j985k390r15
51159B17369P64J076M92K88N29N07M02J039K304L082K690J424j48j495j985j385
51143B26953n08m39j145j606j165l7J372K727L580L697L454L187K408N92j574
$$ plain form
51250 404990 412661 419500 425032 428270 428493 426215 422433 417035 409073 398614 387220 376263 365717
51237 365717 355107 344711 335126 326286 317697 309339 301751 295401 290368 286343 282606 278362 273576 269260
51223 269260 266383 264562 262268 258349 253124 247963 244013 241342 239206 237063 235186 234120 233722 233185 232060
51208 232060 230972 231118 233231 236945 240835 243122 242845 240641 238189 236748 236350 236304 236039 235482 235150 235948
51192 235948 238280 241108 242489 241492 239206 237451 236887 236889 236830 236710 236525 235780 233990 231280 228118 224707 221088
51175 221088 217842 216132 216599 218419 219951 220310 219942 219661 219814 220485 221702 222848 222659 220674 218284 217369
51159 217369 218133 219209 219701 219989 220518 221025 221427 222466 224770 227852 230542 231966 231818 230323 228338 226953
51143 226953 226445 226006 224861 223255 222090 222053 223425 226152 229732 233429 236883 240070 242478 243070 241496
51128B41496k731k416j214L31J774K100O30j419j862m07R87R90N52R17J545J244
51112B42517K68j75K00N91N35L26J34k85q46r36k41O36P75L7p23p51n19j198k786
51093B37559l636k639j097j104k396k547n16J715J863K61j042j041l58J63K49
51078B25434n0m39m01J25N19N19Q00J764K529K180J478J967L671M994M848L535
51062B53473J583q22k932l433k163p47o64j574k316k722l299l714l045j489m67
51047B25669o97j183p82J27L68j47l74J86Q24Q67O93Q55J009N05l05l61N68J506
51029B29328J637J304J276J622J857J796J675J571J178K73q72j597j402n22L4
51014B39158n88j929k380q72J781L695L853K827J760J227J214J547J924J896J283
$$ plain form
51128 241496 238765 236349 235135 235466 237240 239340 239970 238551 236689 236282 237269 238259 238811 239728 241273 242517
51112 242517 242785 242610 242810 243401 243936 244262 244396 244111 243265 242329 242088 242724 243499 243536 242813 242062 241543 240345 237559
51093 237559 233923 231284 230187 229083 226687 224140 223624 225339 227202 227463 226421 225380 225022 225185 225434
51078 225434 225384 224945 224544 224669 225188 225707 226507 228271 230800 232980 234458 236425 240096 245090 249938 253473
51062 253473 255056 254234 251302 247869 245706 244959 244295 242721 240405 237683 234384 230670 227625 226136 225669
51047 225669 224972 223789 223007 223134 223502 223355 222981 223167 223991 224858 225551 226406 227415 227920 227615 227254 227822 229328
51029 229328 230965 232269 233545 235167 237024 238820 240495 242066 243244 243517 242645 241048 239646 239124 239158
51014 239158 238570 236641 234261 233389 235170 238865 242718 245545 247305 248532 249746 251293 253217 255113 256396
50999B56396N43L52Q78J729K508K986K834J812M55j15M90J340J560J668K585L686
50983B81707L352J518J23M32J292J165N08N97J016K90j348j943q12M30N03L47
50967B89177J242K458K283N81j064j435o54P52K553M423N745O156N790M816L205
50952C26028J212l26n33P41K732M425N396N977O477O525N674M502M305N372O362
50937C84869O088N288N705P719R837J0654J0380J0263J1047J2511J4036J5177
50925E03574J5835J6279J7004J8289J9884K1249K2202K3189K4823K7210K9917
50914G39455L2554L5142L7837M0601M3512M6965N1071N5057N8053O0474O3778
50903A264499O8523P3434P6917P8766P9795Q0365Q0265P9587P8592P6627P2391
$$ plain form
50999 256396 256939 257291 258169 259898 262406 265392 268226 270038 270493 270378 270868 272208 273768 275436 278021 281707
50983 281707 285059 286577 286700 287132 288424 289589 290097 290694 291710 292000 290652 288709 287897 288327 288830 289177
50967 289177 290419 292877 295160 295741 294677 293242 292588 293340 295893 300316 306061 312217 318007 322823 326028
50952 326028 327240 326914 326381 327122 329854 334279 339675 345652 352129 358654 364328 368830 373135 378507 384869
50937 384869 390957 396245 401950 409669 419506 430160 440540 450803 461850 474361 488397 503574
50925 503574 519409 535688 552692 570981 590865 612114 634316 657505 682328 709538 739455
50914 739455 772009 807151 844988 885589 929101 976066 1027137 1082194 1140247 1200721 1264499
50903 1264499 1333022 1406456 1483373 1562139 1641934 1722299 1802564 1882151 1960743 2037370 2109761
50892B109761O5749N8362N1797M5579L8106K9222K0801J4486R722M804o65n278
50880B442446p830q938j0139j1931j3425j3802j3492j3657j4919j6930j9110k1680
50868B276593k5679l1717l8833m5035m9264n2362n5768n9754o3469o6263o8051
50857A720398o8567o7313o4494o1261n8620n6473n3934n0313m5651m0647l6052
50846A117073l1870k7464k2991k0076j9929k1073k0514j7371j3754j1475r620
50835I00936o646l272j455j175l74K011M673N987N938N438M974M707M986N755
50821I32483O165N707N430O954J0278J3457J4800J4642J4594J5622J7503J9741
50809A077376K2008K3723K4338K4574K6379L0869L6757M1757M5094M7767N0746
$$ plain form
50892 2109761 2175510 2233872 2285669 2331248 2369354 2398576 2419377 2433863 2443585 2448389 2447724 2442446
50880 2442446 2434616 2425678 2415539 2403608 2390183 2376381 2362889 2349232 2334313 2317383 2298273 2276593
50868 2276593 2250914 2219197 2180364 2135329 2086065 2033703 1977935 1918181 1854712 1788449 1720398
50857 1720398 1651831 1584518 1520024 1458763 1400143 1343670 1289736 1239423 1193772 1153125 1117073
50846 1117073 1085203 1057739 1034748 1014672 994743 973670 953156 935785 922031 910556 900936
50835 900936 894290 891018 889563 888388 888014 890025 894698 900685 906623 912061 917035 921742 926728 932483
50821 932483 938648 944355 949785 956739 967017 980474 995274 1009916 1024510 1040132 1057635 1077376
50809 1077376 1099384 1123107 1147445 1172019 1198398 1229267 1266024 1307781 1352875 1400642 1451388
50798A451388N4190N8369O3994P1226P9264Q7296R5089J02512J09568J17106J26266
50787B416268J36692J46421J54219J60894J67512J73478J77463J79169J78818
50778C890934J75645J68377J57008J42896J27374J11070R4113P6084N6270L5193
50768E034964J5397n01j2290k1581k9157l4119l5524l3400k8366k1692j5826j3282
50756D804623j4521j7997k2563k8672l7047m7456n9370p2685q7117j01744j15629
50745D199822j28202j38693j46104j50160j51458j50259j46076j38745j29060
50736B921065j18033j06325r4711q3892p3411o2007m9581l7677k7262j7401p144
50725B243621K553J0239J6303K2221K8009L2022L3179L1985K9338K5518K0528
$$ plain form
50798 1451388 1505578 1563947 1627941 1699167 1778431 1865727 1960816 2063328 2172896 2290002 2416268
50787 2416268 2552960 2699381 2853600 3014494 3182006 3355484 3532947 3712116 3890934
50778 3890934 4066579 4234956 4391964 4534860 4662234 4773304 4867417 4943501 4999771 5034964
50768 5034964 5050361 5049860 5037570 5015989 4986832 4952713 4917189 4883789 4855423 4833731 4817905 4804623
50756 4804623 4790102 4772105 4749542 4720870 4683823 4636367 4576997 4504312 4417195 4315451 4199822
50745 4199822 4071620 3932927 3786823 3636663 3485205 3334946 3188870 3050125 2921065
50736 2921065 2803032 2696707 2601996 2518104 2444693 2382686 2333105 2295428 2268166 2250765 2243621
50725 2243621 2246174 2256413 2272716 2294937 2322946 2354968 2388147 2420132 2449470 2474988 2495516
50714B495516J4426P222o94q024j3409j7014k0360k4457k8927l3070l6734l9751
50702B294724m1479m1756m1609m2165m3127m3178m1686l9282l6590l3158k8194
50691A862500k1977j5809j0523n676m16N312J0986J6422K1805K6997L1597L5715
50679A956933L9887M4181M8214N2267N7402O4010P1110P7693Q3916R0333R6770
50668B682716J02761J08357J13380J16470J16168J12685J07512J01393R3732Q3797
50658C738971P1446N6787M0236K3059O813p822k0942l2360m1675m9049n4426n6267
50646C674771n3068m6411m0304l6564l2938k7179k0940j7586j7625j8885k0482
50635C342789k3861k9882l7320m4883n2758o1162o8921p4521p7512p8064p6201
$$ plain form
50714 2495516 2509942 2517164 2516470 2508446 2495037 2478023 2457663 2433206 2404279 2371209 2334475 2294724
50702 2294724 2253245 2211489 2169880 2127715 2084588 2041410 1999724 1960442 1923852 1890694 1862500
50691 1862500 1840523 1824714 1814191 1808515 1808099 1813411 1824397 1840819 1862624 1889621 1921218 1956933
50679 1956933 1996820 2041001 2089215 2141482 2198884 2262894 2334004 2411697 2495613 2585946 2682716
50668 2682716 2785477 2893834 3007214 3123684 3239852 3352537 3460049 3561442 3655174 3738971
50658 3738971 3810417 3867204 3907440 3930499 3937312 3929490 3908548 3876188 3834513 3785464 3731038 3674771
50646 3674771 3621703 3575292 3534988 3498424 3465486 3438307 3417367 3399781 3382156 3363271 3342789
50635 3342789 3318928 3289046 3251726 3206843 3154085 3092923 3024002 2949481 2871969 2793905 2717704
50624B717704p2207o6936o0763n3027m3306l2556k2151j2461l119O036J5229K5235
50612B397678L6421M7701N7615O6317P5472Q6049R7043J06400J12528J15002J14533
50601C312759J12222J08224J01350R0761P7845O5415N5042M6067L7194K7913J8279
50590D053071Q600j13o514j0392j2998j5338j7043j7616j7747j8265j8469j6710
50578C910466j2487o927j380L572P887J1772J5767K0285K4787K7920K8597K6643
50566D056902K2534J7098J1446O482K181k178o873j1209j4166j5255j4664j2912
50554D039386j0455p329l133K244P935J2479J5046J5920J5649J4135J0872N889
50542D118638J13n453j0948j7815k7330l9002n1002o2277p3474q5200r6274j04681
$$ plain form
50624 2717704 2645497 2578561 2517798 2464771 2421465 2388909 2366758 2354297 2351178 2357214 2372443 2397678
50612 2397678 2434099 2481800 2539415 2605732 2681204 2767253 2864296 2970696 3083224 3198226 3312759
50601 3312759 3424981 3533205 3634555 3725316 3803161 3868576 3923618 3969685 4006879 4034792 4053071
50590 4053071 4061671 4061558 4055044 4044652 4031654 4016316 3999273 3981657 3963910 3945645 3927176 3910466
50578 3910466 3897979 3891052 3889672 3893244 3901131 3912903 3928670 3948955 3973742 4001662 4030259 4056902
50566 4056902 4079436 4096534 4107980 4114462 4116643 4114465 4107592 4096383 4082217 4066962 4052298 4039386
50554 4039386 4028931 4021602 4018469 4020713 4028648 4041127 4056173 4072093 4087742 4101877 4112749 4118638
50542 4118638 4118751 4113298 4102350 4084535 4057205 4018203 3967201 3904924 3831450 3746250 3649976 3545295
50530C545295j09895j13020j14878j15173j13592j10438j05848r9597r2360q5992
50520B484502q1513p7552p2045o4957n8090n2293m6193l8282k9348k1960j7583
50509A924686j4827j0886m424L298J0138J5387J9957K4740K9646L4289L8700M2966
50497B113670M6951N0948N5966O2556O9837P6553Q2743Q9357R6323J02241J06311
50486B953456J09415J12672J15646J16870J15609J12219J07123J00399R2552Q4777
50476D020738P8186P3191O9925O8545O8766O9582P0132P0557P1465P2753P3736
50465D807576P4414P5797P8675Q2734Q7339R2546R8452J03849J06554J05524J01980
50454E815440R7767R2880Q5385P3739N8466M1129K2291J509k0850m2872o2655
$$ plain form
50530 3545295 3435400 3322380 3207502 3092329 2978737 2868299 2762451 2662854 2570494 2484502
50520 2484502 2402989 2325437 2253392 2188435 2130345 2078052 2031859 1993577 1964229 1942269 1924686
50509 1924686 1909859 1898973 1894549 1897847 1907985 1923372 1943329 1968069 1997715 2032004 2070704 2113670
50497 2113670 2160621 2211569 2267535 2330091 2399928 2476481 2559224 2648581 2744904 2847145 2953456
50486 2953456 3062871 3175543 3291189 3408059 3523668 3635887 3743010 3843409 3935961 4020738
50476 4020738 4098924 4172115 4242040 4310585 4379351 4448933 4519065 4589622 4661087 4733840 4807576
50465 4807576 4881990 4957787 5036462 5119196 5206535 5299081 5397533 5501382 5607936 5713460 5815440
50454 5815440 5913207 6006087 6091472 6165211 6223677 6264806 6287097 6288606 6267756 6224884 6162229
50443F162229p9898r5283j08899j19938j27555j31160j30140j24250j14391j02167
50433E028548q8637p4130n9048m3856k8428j2779J489J1902J7874K1085K2276
50422D796296J9268R651n794k4150m3942o5656q8979j11561j30927j46115j57112
50411D050979j63878j66530j65520j61382j54976j47823j41102j34309j25993
50402B689466j15953j05433r5288q5340p5670o6866n8508m9250l9195l0620k5108
50391A942235k1489j7804j3888j0415o713j586M390R427J3150J6808K0870K4266
50379A959251K6370K8137L0645L3873L7474M1541M5820M9165N0849N1687N2915
50368B407727N4487N5367N5246N4878N4748N4322N3002N1217M9986M9527M8888
$$ plain form
50443 6162229 6082331 5987048 5878149 5758211 5630656 5499496 5369356 5245106 5130715 5028548
50433 5028548 4939911 4865781 4806733 4762877 4734449 4721670 4723159 4735061 4752935 4774020 4796296
50422 4796296 4815564 4825215 4819421 4795271 4751329 4685673 4596694 4485133 4354206 4208091 4050979
50411 4050979 3887101 3720571 3555051 3393669 3238693 3090870 2949768 2815459 2689466
50402 2689466 2573513 2468080 2372792 2287452 2211782 2144916 2086408 2037158 1997963 1967343 1942235
50391 1942235 1920746 1902942 1889054 1878639 1871926 1870340 1874730 1884157 1897307 1914115 1934985 1959251
50379 1959251 1985621 2013758 2044403 2078276 2115750 2157291 2203111 2252276 2303125 2354812 2407727
50368 2407727 2462214 2517581 2572827 2627705 2682453 2736775 2789777 2840994 2890980 2940507 2989395
50357B989395M7132M4689M3135M3579M5499M7453M8694M9731N1258N3028N4090
50346C517683N4010N3466N3588N4793N6236N6277N3464M7472L9294L0490K1971
50335D038744J3443M067o555j8223l0742m4053n7699p0748q2470r2718j01371
50324C551675j07930j12056j13869j13259j09557j02621r3710q4228p4152o2787
50314B577506n0748l9687l0037k0575j0609j256O129J1478J5025J5979J3350P443
50302B493998n86j0036k0445l0579l9009m5537n1105n6106n9781o1440o1538o1180
50290A996656o1021o0752n9434n6316n1656m6638m2300l8696l5417l2512l0300
50279A481614k8537k6432k3529k0059j6540j3415j0885q571n606j717J948L906
$$ plain form
50357 2989395 3036527 3081216 3124351 3167930 3213429 3260882 3309576 3359307 3410565 3463593 3517683
50346 3517683 3571693 3625159 3678747 3733540 3789776 3846053 3899517 3946989 3986283 4016773 4038744
50335 4038744 4052187 4056254 4049699 4031476 4000734 3956681 3898982 3828234 3745764 3653046 3551675
50324 3551675 3443745 3331689 3217820 3104561 2995004 2892383 2798673 2714445 2640293 2577506
50314 2577506 2526758 2487071 2457034 2436459 2425850 2424594 2430723 2442201 2457226 2473205 2486555 2493998
50302 2493998 2493412 2483376 2462931 2432352 2393343 2347806 2296701 2240595 2180814 2119374 2057836 1996656
50290 1996656 1935635 1874883 1815449 1759133 1707477 1660839 1618539 1579843 1544426 1511914 1481614
50279 1481614 1453077 1426645 1403116 1383057 1366517 1353102 1342217 1333646 1328040 1326323 1328271 1332177
50267A332177M404N537Q864J3538J7326J9094J9650K0330K1512K2788K3969K5224
50255A534413K6428K7214K7861K9317L1764L3834L4189L3416L3198L3748L3432
50244A878814L1194K8055K5646K4257K3030K1191J8285J4081R135M718J407j631
50232B078182n220q825j1601j3902j6541j9241k1196k2743k4901k7528k9337l0009
50220A847138l0845l2897l5547l7408l7842l7112l5691l3933l2162l0818l0462
50209A472421l1281l2281l1694k8857k5196k2535k1016j9644j8188j7141j6259
50198A208329j4769j2849j1386j0198q263n780m190l724k872j052J36n14j635
50185A131233j167Q40K880M371N687O592O390N283M051K723R71n38q39n14j196
$$ plain form
50267 1332177 1336581 1342118 1350982 1364520 1381846 1400940 1420590 1440920 1462432 1485220 1509189 1534413
50255 1534413 1560841 1588055 1615916 1645233 1676997 1710831 1745020 1778436 1811634 1845382 1878814
50244 1878814 1910008 1938063 1963709 1987966 2010996 2032187 2050472 2064553 2073688 2078406 2079813 2078182
50232 2078182 2072962 2064137 2052536 2038634 2022093 2002852 1981656 1958913 1934012 1906484 1877147 1847138
50220 1847138 1816293 1783396 1747849 1710441 1672599 1635487 1599796 1565863 1533701 1502883 1472421
50209 1472421 1441140 1408859 1377165 1348308 1323112 1300577 1279561 1259917 1241729 1224588 1208329
50198 1208329 1193560 1180711 1169325 1159127 1150864 1145084 1140894 1137170 1134298 1133246 1133382 1132868 1131233
50185 1131233 1130066 1130906 1133786 1138157 1143844 1150436 1156826 1162109 1166160 1168883 1169854 1169316 1168477 1167963 1166767
50170A166767l048m497m783m987n817o202n357m738o148q890j0581j0428r619
50157A081672q707o784l854j948k471l895l779k071n50K47J428L139L920L375
50143A059722L270M766O324N934M253L409L523K676L32j411p54J156J682q6k546
50128A092250l697l204k387k619l980n425o199o664p536q855j0139j1120j1668
50115A008757j1447j0372r145q526q331p958p526p479p301n900l307q61M33Q06
50101I21843Q52P87O76L98p48l276o211p724p356o461o065n722m872m039l847
50086H68235l962l817l448k936k049j071q55j361j387n33o0o47q89L98J832J488
50070H48938K82Q56L405N204M669L598M429P001R347J0416J0628J0383R520Q175
$$ plain form
50170 1166767 1163719 1159222 1154439 1149452 1143635 1137433 1132076 1127338 1121190 1112300 1101719 1091291 1081672
50157 1081672 1072965 1066181 1062327 1060379 1057908 1054013 1050234 1048163 1047613 1047860 1049288 1052427 1056347 1059722
50143 1059722 1062992 1067758 1074082 1080016 1084269 1087678 1091201 1093877 1094209 1092798 1092044 1093200 1094882 1094796 1092250
50128 1092250 1088553 1085349 1082962 1080343 1076363 1070938 1064739 1058075 1050539 1041684 1031545 1020425 1008757
50115 1008757 997310 986938 977793 969267 960936 952978 945452 937973 930672 924772 921465 920604 921037 921843
50101 921843 922695 923482 924158 924556 923808 920532 914321 906597 899241 892780 886715 880993 876121 872082 868235
50086 868235 864273 860456 857008 854072 852023 850952 850097 848736 847349 846816 846756 846109 845220 845618 847450 848938
50070 848938 849220 850076 853481 858685 863354 866952 871381 878382 887729 898145 908773 919156 928676 936851
50056I36851P164P157Q002R031R798J0228J0202R418P940O481N705N232M051K023
50042A039283K11o92j303k306l004k294m60J163K122L162M554N416N147M492M526
50027A060017N410O740Q395J0275J1775J2433J2892J4250J6491J8426J9371K0002
50015A216477K1095K2294K2948K3552K5124K7199K7914K6448K4266K3200K3380
50004A483897K3964K4850K6235K7247K6807K5489K4719K4283K2633J9946J8643
49993A748713J9963K2029K2640K2271K2594K3517K3795K3649K4485K6384K7976
49982B008016K8981L0903L4680L9093M2465M4854M7800N2389N8275O4381P0207
49971B522044P6389Q3798R2029R9240J03901J06105J06570J04902R9730R0286
$$ plain form
50056 936851 944015 951172 959174 968205 978003 988231 998433 1007851 1015791 1022272 1027977 1033209 1037260 1039283
50042 1039283 1039494 1038802 1037499 1035193 1032189 1029895 1029435 1030598 1032720 1035882 1040436 1045852 1050999 1055491 1060017
50027 1060017 1065427 1072167 1080562 1090837 1102612 1115045 1127937 1142187 1158678 1177104 1196475 1216477
50015 1216477 1237572 1259866 1282814 1306366 1331490 1358689 1386603 1413051 1437317 1460517 1483897
50004 1483897 1507861 1532711 1558946 1586193 1613000 1638489 1663208 1687491 1710124 1730070 1748713
49993 1748713 1768676 1790705 1813345 1835616 1858210 1881727 1905522 1929171 1953656 1980040 2008016
49982 2008016 2036997 2067900 2102580 2141673 2184138 2228992 2276792 2329181 2387456 2451837 2522044
49971 2522044 2598433 2682231 2774260 2873500 2977401 3083506 3190076 3294978 3394708 3484994
49961C484994P7002O1079M4339K9178J7332Q613J748l562o342o213m702m599q497
49948C690370j7594l0931m5886o0296p4067q7951j01201j11614j17820j20134
49938B922876j19283j15635j10084j04152r8616r3040q7063q1044p5023o8405
49928A970531o1431n5735n2344n0073m7096m3402m0462l8863l7695l6105l4280
49917A473045l2487l0214k7037k3692k1435k0367j9227j7158j4943j3712j2885
49906A239888j0839p570n189n022n633m996l388k411k114j188L89J233J189J838
49892A196187L803N584N933N541N437N507N806P505J0895J3952J4798J4465J5306
49879A310719J7555J9540K0675K2011K3907K5417K6407K8339L2118L6679M0585
$$ plain form
49961 3484994 3561996 3623075 3667414 3696592 3713924 3722537 3724285 3720723 3714381 3708168 3703466 3698867 3690370
49948 3690370 3672776 3641845 3595959 3535663 3461596 3373645 3272444 3160830 3043010 2922876
49938 2922876 2803593 2687958 2577874 2473722 2375106 2282066 2195003 2113959 2038936 1970531
49928 1970531 1909100 1853365 1801021 1750948 1703852 1660450 1619988 1581125 1543430 1507325 1473045
49917 1473045 1440558 1410344 1383307 1359615 1338180 1317813 1298586 1281428 1266485 1252773 1239888
49906 1239888 1229049 1221479 1216290 1211268 1205635 1200639 1197251 1194840 1192726 1191538 1191927 1193160 1194349 1196187
49892 1196187 1199990 1205574 1211507 1217048 1222485 1227992 1233798 1241303 1252198 1266150 1280948 1295413 1310719
49879 1310719 1328274 1347814 1368489 1390500 1414407 1439824 1466231 1494570 1526688 1563367 1603952
49868A603952M3850M7201N0617N3736N7122O1861O8086P4862Q1552Q8592R6704
$$ plain form
49868 1603952 1647802 1695003 1745620 1799356 1856478 1918339 1986425 2061287 2142839 2231431 2328135
$$ [...]
##END NTUPLES=NMR SPECTRUM
##END=
