##TITLE=Coffee green (TORI01 0.1000g + 1.5mL buffer 50/50,  450uL extracto + 50uL (D2O+TMS))
without heating, vortex and centrifuged, temperature 0oC.
##JCAMPDX= 6.0         $$ Bruker NMR JCAMP-DX V2.0
##DATA TYPE= NMR SPECTRUM
##DATA CLASS= NTUPLES
##ORIGIN= Bruker BioSpin GmbH
##OWNER= Administrator
$$ 1.72 TOPSPIN		Version 2.1
$$ 2012-03-17 12:52:24.250 -0800  Administrator@X
$$ Compression mode = diff/dup
##.OBSERVE FREQUENCY= 400.13188173
##.OBSERVE NUCLEUS= ^1H
##.ACQUISITION MODE= SIMULTANEOUS (DQD)
##.ACQUISITION SCHEME= undefined
##.AVERAGES= 64
##.DIGITISER RES= 22
##SPECTROMETER/DATA SYSTEM= spect
##.PULSE SEQUENCE= noesygppr1d
##.SOLVENT NAME= H2O+D2O
##.SHIFT REFERENCE= INTERNAL, H2O+D2O, 1, 14.97906
##AUDIT TRAIL= $$ (NUMBER, WHEN, WHO, WHERE, PROCESS, VERSION, WHAT)
$$ ##TITLE= Audit trail, TOPSPIN		Version 2.1
$$ ##JCAMPDX= 5.01
$$ ##ORIGIN= Bruker BioSpin GmbH
$$ ##OWNER= Administrator
$$ $$ C:\Bruker\TOPSPIN/data/jwist/nmr/11-coffee-green-origin/151/pdata/1/auditp.txt
$$ ##AUDIT TRAIL=  $$ (NUMBER, WHEN, WHO, WHERE, PROCESS, VERSION, WHAT)
(   1,<2011-10-06 19:41:30.925 -0500>,<Administrator>,<TOPSPIN>,<go>,<TOPSPIN 2.1>,
      <created by zg
	started at 2011-10-06 19:32:36.300 -0500,
	POWCHK enabled, PULCHK disabled,
       configuration hash MD5:
       DA 63 81 1B EF 4C B5 72 B4 DF EA D9 B4 DB 4C 08
       data hash MD5: 64K
       84 17 8B 28 71 BA 89 CD 90 39 7C 60 8D A7 13 CA>)
(   2,<2011-10-06 19:42:18.956 -0500>,<Administrator>,<TOPSPIN>,<proc1d>,<TOPSPIN 2.1>,
      <Start of raw data processing
       efp LB = 0 FT_mod = 6 PKNL = 1 PHC0 = 0 PHC1 = 0 SI = 32K 
       data hash MD5: 32K
       50 7E 92 C3 20 EE 84 E1 92 67 7E 77 DD 23 8F 7D>)
(   3,<2011-10-06 19:42:19.690 -0500>,<Administrator>,<TOPSPIN>,<proc1d>,<TOPSPIN 2.1>,
      <pk PHC0 = 26.47156 PHC1 = 0 
       data hash MD5: 32K
       B5 DC 0A D7 C6 77 E8 A4 DC 87 E2 14 EA 6E 8E 0E>)
(   4,<2011-10-06 19:43:17.378 -0500>,<Administrator>,<TOPSPIN>,<audit>,<TOPSPIN 2.1>,
      <user comment:
       TITLE=Coffee green (TORI01 0.1000g + 1.5mL buffer 50/50,  450uL extracto + 50uL (D2O+TMS))
       without heating, vortex and centrifuged, temperature 0oC.TITLE_END
       data hash MD5: 32K
       B5 DC 0A D7 C6 77 E8 A4 DC 87 E2 14 EA 6E 8E 0E>)
$$ ##END=
$$ 
$$ $$ hash MD5
$$ $$ 9A 12 4F D3 10 4F 86 6E CC 60 D0 DC A0 42 1F EA
##$RELAX= 
##$RELAX= 
##$RELAX= 
##$RELAX= 
##$RELAX= 
##$RELAX= 
$$ Bruker specific parameters
$$ --------------------------
##$DU= <Z:>
##$EXPNO= 151
##$NAME= <11-coffee-green-origin>
##$PROCNO= 1
##$TYPE= <nmr>
##$USER= <jwist>
##$ACQT0= -8.14175587560131
##$AMP= (0..31)
100 100 100 100 100 100 100 100 100 100 100 100 100 100 100 100 100 100
100 100 100 100 100 100 100 100 100 100 100 100 100 100
##$ANAVPT= -1
##$AQSEQ= 0
##$AQ_mod= 3
##$AUNM= <au_prof>
##$AUTOPOS= <>
##$BF1= 400.13
##$BF2= 400.13
##$BF3= 400.13
##$BF4= 400.13
##$BF5= 400.13
##$BF6= 400.13
##$BF7= 400.13
##$BF8= 400.13
##$BYTORDA= 0
##$CFDGTYP= 0
##$CFRGTYP= 9
$$ [...]
##$TP= (0..7)
150 150 150 150 150 150 150 150
##$TP07= 0
##$TPNAME0= <>
##$TPNAME1= <>
##$TPNAME2= <>
##$TPNAME3= <>
##$TPNAME4= <>
##$TPNAME5= <>
##$TPNAME6= <>
##$TPNAME7= <>
##$TPOAL= (0..7)
0.5 0.5 0.5 0.5 0.5 0.5 0.5 0.5
##$TPOFFS= (0..7)
0 0 0 0 0 0 0 0
##$TUNHIN= 0
##$TUNHOUT= 0
##$TUNXOUT= 0
##$USERA1= <user>
##$USERA2= <user>
##$USERA3= <user>
##$USERA4= <user>
##$USERA5= <user>
##$V9= 5
##$VALIST= <valist>
##$VCLIST= <CCCCCCCCCCCCCCC>
##$VD= 0
##$VDLIST= <DDDDDDDDDDDDDDD>
##$VPLIST= <PPPPPPPPPPPPPPP>
##$VTLIST= <TTTTTTTTTTTTTTT>
##$WBST= 2048
##$WBSW= 25
##$XGAIN= (0..3)
0 0 0 0
##$XL= 0
##$YL= 0
##$YMAX_a= 5533619
##$YMIN_a= -2361006
##$ZGOPTNS= <>
##$ZL1= 120
##$ZL2= 120
##$ZL3= 120
##$ZL4= 120
##$ABSF1= 0
##$ABSF2= 0
##$ABSG= 0
##$ABSL= 0
##$ALPHA= 0
##$AQORDER= 0
##$ASSFAC= 0
##$ASSFACI= 0
##$ASSFACX= 0
##$ASSWID= 0
##$AUNMP= <proc_prof1d>
##$AXLEFT= 0
##$AXNAME= <>
##$AXNUC= <1H>
##$AXRIGHT= 0
##$AXTYPE= 0
##$AXUNIT= <>
##$AZFE= 0.1
##$AZFW= 0.1
##$BCFW= 0
##$BC_mod= 0
##$BYTORDP= 0
##$COROFFS= 0
##$CY= 15
##$DATMOD= 1
##$DC= 0
##$DFILT= <>
##$DTYPP= 0
##$F1P= 0
##$F2P= 0
##$FCOR= 0.5
##$FTSIZE= 32768
##$FT_mod= 6
##$GAMMA= 0
##$GB= 0
##$INTBC= 1
##$INTSCL= 1
##$ISEN= 128
##$LB= 0
##$LEV0= 0
##$LPBIN= 0
##$MAXI= 10000
##$MC2= 0
##$MEAN= 0
##$ME_mod= 0
##$MI= 0
##$NCOEF= 0
##$NC_proc= -6
##$NLEV= 6
##$NOISF1= 0
##$NOISF2= 0
##$NSP= 0
##$NTH_PI= 0
##$NZP= 0
##$OFFSET= 14.97906
##$PC= 1
##$PHC0= 26.47156
##$PHC1= 0
##$PH_mod= 1
##$PKNL= yes
##$PPARMOD= 0
##$PPDIAG= 0
##$PPIPTYP= 0
##$PPMPNUM= 2147483647
##$PPRESOL= 1
##$PSCAL= 4
##$PSIGN= 0
##$PYNMP= <proc.py>
##$REVERSE= no
##$SF= 400.13
##$SI= 32768
##$SIGF1= 0
##$SIGF2= 0
##$SINO= 400
##$SIOLD= 32768
##$SPECTYP= <>
##$SREGLST= <1H.CDCl3>
##$SSB= 0
##$STSI= 32768
##$STSR= 0
##$SW_p= 8223.68421052629
##$SYMM= 0
##$S_DEV= 0
##$TDeff= 65536
##$TDoff= 0
##$TI= <>
##$TILT= no
##$TM1= 0
##$TM2= 0
##$TOPLEV= 0
##$USERP1= <user>
##$USERP2= <user>
##$USERP3= <user>
##$USERP4= <user>
##$USERP5= <user>
##$WDW= 1
##$XDIM= 32768
##$YMAX_p= 387050594
##$YMIN_p= -862663
##$CURPLOT= <Network HP LaserJet P1505>
##$CURPRIN= <$Network HP LaserJet P1505>
##$DFORMAT= <normdp>
##$LAYOUT= <+/1D_H.xwp>
##$LFORMAT= <normlp>
##$PFORMAT= <normpl>
##$SURQMSG= 1
$$ End of Bruker specific parameters
$$ ---------------------------------
##NTUPLES= NMR SPECTRUM
##VAR_NAME=  FREQUENCY,     SPECTRUM/REAL,   SPECTRUM/IMAG
##SYMBOL=    X,             R,               I
##VAR_TYPE=  INDEPENDENT,   DEPENDENT,       DEPENDENT
##VAR_FORM=  AFFN,          ASDF,            ASDF
##VAR_DIM=   32768,         32768,           32768
##UNITS=     HZ,            ARBITRARY UNITS, ARBITRARY UNITS
##FACTOR=    0.250966925370065, 1,           1
##FIRST=     8223.43324360092, -55833,       -309099
##LAST=      0,             169768,          -193430
##MIN=       0,             -862663,         0
##MAX=       8223.43324360092, 387050594,    0
$$ Real data points
##PAGE= N=1
##DATA TABLE= (X++(R..R)), XYDATA
$$ [...]
19693A987918k64945j5048N5835K38696m83176K99869J9634j29383J28957p7949
$$ 1987918 1722973 1707925 1763760 2002456 1519280 1819149 1838783 1709400 1838357 1760408
19683A760408Q1650l22278P1568j0924L49833k76285J7493L1524p3381j21424
$$ 1760408 1842058 1519780 1591348 1580424 1930257 1653972 1671465 1702989 1629608 1508184
19673A508184K28375K0246O6784J8785k1537k2517k25379O1875k3696r0663M42738
$$ 1508184 1736559 1756805 1823589 1842374 1820837 1798320 1572941 1634816 1611120 1520457 1963195
19662A963195j91128k10448n3802K75876k5952J3917J80383j25220O1777N3243
$$ 1963195 1772067 1561619 1507817 1783693 1757741 1771658 1952041 1826821 1888598 1941841
19652A941841q3560j69293j24467M7116L464Q7178K17324k54943O9900j2121p5450
$$ 1941841 1858281 1688988 1564521 1611637 1615101 1702279 1919603 1664660 1734560 1722439 1646989
19641A646989j6327J71597N6627R9912j85815j121p2673j38540L8383p4947J22076
$$ 1646989 1630662 1802259 1858886 1958798 1772983 1771862 1699189 1560649 1599032 1524085 1646161
19630A646161N0529q890p8323J09130j64913J65542Q5444l14338J51622k6631
$$ 1646161 1696690 1687800 1609477 1718607 1553694 1719236 1804680 1490342 1641964 1615333
19620A615333J86968m0995l69960L08229l28313L8681M1461K23676q7131j62093
$$ 1615333 1802301 1761306 1391346 1699575 1371262 1409943 1451404 1675080 1587949 1425856
19610A425856p910r0843R5402j939m1045j5397j31217r2170P0325J313J50972
$$ 1425856 1417946 1327103 1422505 1420566 1379521 1364124 1232907 1140737 1211062 1212375 1363347
19599A363347r8550K15079l24471J15000j20422K27351J57607j92423j13142J42260
$$ 1363347 1264797 1479876 1155405 1270405 1149983 1377334 1534941 1342518 1229376 1371636
19589A371636r155R5741k26978L1416q9735J30964J82499l77451P4332L01320
$$ 1371636 1362481 1458222 1231244 1262660 1172925 1303889 1486388 1108937 1183269 1484589
19579A484589j86898L2706n5007J55525l9221k26942K2564L6263J26887k21862
$$ 1484589 1297691 1330397 1275390 1430915 1391694 1164752 1187316 1223579 1350466 1128604
19569A128604J38212J02297j0658r4709j41218M20911k00136n2398j67079J62832
$$ 1128604 1266816 1369113 1358455 1263746 1122528 1543439 1343303 1290905 1123826 1286658
19559A286658l20259K95267p6542J28348n6945k52361J44763M9498k47380L29254
$$ 1286658 966399 1261666 1185124 1313472 1256527 1004166 1148929 1198427 951047 1280301
19549A280301j32299R5224O6339q8652j32927K14999r7549Q7256L7143k3395j87886
$$ 1280301 1148002 1243226 1309565 1220913 1087986 1302985 1205436 1292692 1329835 1306440 1118554
19538A118554J97228j37647J03189j76262J97493q8575K6260J63359p0053j29878
$$ 1118554 1315782 1178135 1281324 1105062 1302555 1213980 1240240 1403599 1333546 1203668
19528A203668m442l7358K1314K2600m4033o6246K41343q4066J13615k15583J07351
$$ 1203668 1199226 1161868 1183182 1205782 1161749 1095503 1336846 1252780 1366395 1150812 1258163
19517A258163J00124k28765J07577k34247J70124O6476k11061M3508J53997j59248
$$ 1258163 1358287 1129522 1237099 1002852 1172976 1239452 1028391 1071899 1225896 1066648
19507A066648L09482j90924r4264J30799L1712j60998P4249j47117J22132k8899
$$ 1066648 1376130 1185206 1090942 1221741 1253453 1092455 1166704 1019587 1141719 1112820
19497A112820k52775L04272q6900J99442j56743k5844j2877J00493r1063J61792
$$ 1112820 860045 1164317 1077417 1276859 1120116 1094272 1081395 1181888 1090825 1252617
19487A252617M4348M1675j62617o8834K7140J05134j25760P4187n848k97511N5108
$$ 1252617 1296965 1338640 1176023 1107189 1134329 1239463 1113703 1187890 1182042 884531 939639
19476I39639K881k6064k86561K59373P7242j4594q1471L8217J7569j36457J10746
$$ 939639 942520 916456 629895 889268 966510 951916 870445 908662 926231 789774 900520
19465I00520J18892j58385j75449L41163k82537O4209n7368J89477j61154o0668
$$ 900520 1019412 861027 685578 1026741 744204 808413 751045 940522 779368 718700
19455G18700p6596M48295k85052j9827R7692N1813j50266q533m0262k1617P6413
$$ 718700 642104 1090399 805347 785520 883212 935025 784759 776226 735964 714347 790760
19444G90760M57473m17665K4799K39195l62689J15733K21307k52925J51511M8864
$$ 790760 1248233 830568 855367 1094562 731873 847606 1068913 815988 967499 1016363
19434A016363j89028p3961J46654m07027K33171j1953L7583J78562j76307j98392
$$ 1016363 827335 753374 900028 493001 726172 714219 751802 930364 754057 555665
19424E55665K61914J13804l14737J42895N8906j4110m6086k31394K72946M2111
$$ 555665 817579 931383 616646 759541 818447 804337 758251 526857 799803 841914
19414H41914l0257m4725l8037j0165J50560j89640o7579K15686j19042O4918J46508
$$ 841914 811657 766932 728895 718730 869290 679650 612071 827757 708715 773633 920141
19403I20141D20873L73701K9184j28911N7777O7512Q2761j29763r3615J12579
$$ 920141 420873 794574 823758 694847 752624 820136 902897 773134 679519 792098
19393G92098p3494P3251J85434q7352J12252l0717k82676J83788j79061K96985
$$ 792098 718604 791855 977289 889937 1002189 971472 688796 872584 693523 990508
19383I90508o312j38787k12010K26389j3141K73024j35521j06486R1211k03868
$$ 990508 984196 845409 633399 859788 846647 1119671 984150 877664 968875 765007
19373G65007J21950P5977j46493j13757k49786J16745K0214K34779k14661K44247
$$ 765007 886957 962934 816441 702684 452898 569643 589857 824636 609975 854222
19363H54222j18253R8965m2685P6155l6350K23859m03045o3149K83777n757p2175
$$ 854222 735969 834934 792249 868404 832054 1055913 652868 589719 873496 867739 795564
19352G95564O3352j18025p4630K25878j88065M78783n11037J69044J29510j16185
$$ 795564 858916 740891 666261 892139 704074 1182857 671820 840864 970374 854189
19342H54189N2834r1220K96666K5211j53082j80329K53077n7768l6778Q9552j06663
$$ 854189 907023 815803 1112469 1137680 984598 804269 1057346 999578 962800 1052352 945689
19331I45689j1897L6088J62071k67778J7946j2581R1528m8529L1903j68578K64125
$$ 945689 933792 969880 1131951 864173 882119 869538 961066 912537 944440 775862 1039987
19320A039987k28637J52005j64324r864J5417k7483J46401J55122l30031K1747
$$ 1039987 811350 963355 799031 789167 804584 777101 923502 1078624 748593 770340
19310G70340P989j24049J79288k605r7906k14120L48632k00978j48109K12397
$$ 770340 778329 654280 833568 830963 733057 518937 867569 666591 518482 730879
19300G30879j90823K56210j59251Q6304K7287L5418j18755J25949q1477J5593
$$ 730879 540056 796266 637015 723319 750606 786024 667269 793218 711741 727334
19290G27334L5298J47131D29878J61591K05375k40726J55680J44803q0694j75431
$$ 727334 762632 909763 429878 591469 796844 556118 711798 856601 775907 600476
19280F00476K0924j56513K88447K73415j82708j4944k69144K65405o136l58904
$$ 600476 621400 464887 753334 1026749 844041 829097 559953 825358 819222 460318
19270D60318K57473J1207N2275j1553O9643K6969l24262J23698j02093N5542j03969
$$ 460318 717791 728998 781273 769720 839363 866332 542070 665768 563675 619217 515248
19259E15248K87150r9027L668l0722L07627j90395K2095K8495n2052j74429M18187
$$ 515248 802398 703371 707039 676317 983944 793549 815644 844139 792087 617658 1035845
19248A035845m11460J33847P2404J26905j36372J65837J34055J48755N4319J88047
$$ 1035845 624385 758232 830636 957541 821169 987006 1121061 1269816 1324135 1512182
19238A512182j2188j84331o9270O9408K9549m2165k98978n028k88027J70934k02863
$$ 1512182 1499994 1315663 1246393 1315801 1345350 1303185 1004207 999179 711152 882086 679223
19227F79223L0153J79644m8394p8422J2275k4416K25284p1787k27955j7310o8650
$$ 679223 709376 889020 840626 762204 774479 750063 975347 903560 675605 658295 589645
19216E89645K74315l53825J46013J00760j27615J70957r600j60096k23234J90828
$$ 589645 863960 510135 656148 756908 629293 800250 790650 630554 407320 598148
19206E98148J21458o5719j99186K52853M0325j3412L52488k18466j09360m3458
$$ 598148 719606 653887 454701 707554 747879 734467 1086955 868489 759129 715671
19196G15671O3797k57374K13951P353M418m5132j86878L51768l30368K28536R3600
$$ 715671 779468 522094 736045 743398 747816 702684 515806 867574 537206 765742 859342
19185H59342L8061n0283M0925j22599J84675n6160j26119K68537j18129j19735
$$ 859342 897403 847120 888045 765446 950121 893961 767842 1036379 918250 798515
19175G98515N7759L000k8753j20105J23093j60039J83241O9974P8635j01554Q7495
$$ 798515 856274 859274 830521 710416 833509 673470 856711 926685 1005320 903766 991261
19164I91261O8497k6715R2455k45502L03832j68335M6215P912j3332j05830p9710
$$ 991261 1059758 1033043 1125498 879996 1183828 1015493 1061708 1069620 1056288 950458 870748
19153H70748k515R3531q1565K61392k94044l4408p8652J67728J25607q7419O098
$$ 870748 868233 961764 880199 1141591 847547 813139 734487 902215 1027822 940403 946501
19142I46501L44927j86060L5268K6939k64084k420O5477k4604J8702j13253K95845
$$ 946501 1291428 1105368 1140636 1167575 903491 901071 966548 941944 960646 847393 1143238
19131A143238j89834J62762J20907k32383R11J40571q3418K43768L4543j27306
$$ 1143238 953404 1116166 1237073 1004690 1005601 1146172 1062754 1306522 1341065 1213759
19121A213759k16940M23819J16740j00766K32115J9470K06119J14225L07748Q5896
$$ 1213759 996819 1420638 1537378 1436612 1668727 1688197 1894316 2008541 2316289 2402185
19111B402185M21977N02624j17816J42522J74016J61075j41258j34415p8886m64009
$$ 2402185 2824162 3326786 3208970 3351492 3525508 3686583 3545325 3410910 3332024 2868015
19101B868015n44077q4070m14876K1199j12926j56582l29889J75185n9911M5206
$$ 2868015 2323938 2239868 1824992 1846191 1733265 1576683 1246794 1421979 1362068 1407274
19091A407274R1362J36765l17678P0348K37832J44327j2540L92992M21549P3809
$$ 1407274 1498636 1635401 1317723 1388071 1625903 1770230 1757690 2150682 2572231 2646040
19081B646040L94062J35580O4912L56290L11263j1002J28730j07910k52725j13421
$$ 2646040 3040102 3175682 3240594 3596884 3908147 3897145 4025875 3917965 3665240 3551819
19071C551819J77409j34035l1807k95305k45768k3303j65749o94080J90342j39154
$$ 3551819 3729228 3595193 3563386 3268081 3022313 2999010 2833261 2139181 2329523 2190369
19061B190369Q7405n37567l5933L88400l19610O9584p4886n0346L5753L3732L07535
$$ 2190369 2277774 1740207 1704274 2092674 1773064 1842648 1767762 1717416 1753169 1786901 2094436
19050B094436J05744M93005J46522M17320P3282K06573J44108j984j5640K0867
$$ 2094436 2200180 2693185 2839707 3257027 3330309 3536882 3680990 3679006 3663366 3684233
19040C684233l36m17813n67337l26635j32202k08038n5004l5787m4387j04626
$$ 3684233 3683897 3266084 2698747 2372112 2239910 2031872 1976868 1941081 1896694 1792068
19030A792068J5647q1450K19755k8747K48524k19615J84923J46643L89297K1864
$$ 1792068 1807715 1726265 1946020 1917273 2165797 1946182 2131105 2277748 2667045 2688909
19020B688909L16882O31605L390K79519K38324M79599K92912L95321M73042J08159
$$ 2688909 3005791 3637396 3640786 3920305 4158629 4638228 4931140 5326461 5799503 5907662
19010E907662q2804M26164K11838O41473L48088Q56460P82429J132184J124475
$$ 5907662 5824858 6251022 6462860 7104333 7452421 8308881 9091310 10223494 11347969
19001A1347969J295670J241304J426450Q10690J031857K98712J91431j48460m97736
$$ 11347969 12643639 13884943 15311393 16122083 17153940 17452652 17644083 17495623 16997887
18992A6997887j358391j200420k027383j645126j595591j318028j023723j052836
$$ 16997887 15639496 14439076 12411693 10766567 9170976 7852948 6829225 5776389
18984E776389o82992l64156o96414n00709j13472n28366n0982j35884j88590j49374
$$ 5776389 5093397 4729241 4032827 3532118 3418646 2890280 2839298 2703414 2514824 2365450
18974B365450j18294k41709J96824l28315O9937o6652j67213J28396j22542j36316
$$ 2365450 2247156 2005447 2202271 1873956 1943893 1877241 1710028 1838424 1715882 1579566
18964A579566M87740k00311k21818J47880n2115J10420K27569K1017l4845L16608
$$ 1579566 2067306 1866995 1645177 1793057 1740942 1851362 2078931 2099948 2065103 2381711
18954B381711k93655L23496l9847J75469j33668K40026J84250K63020L03040M83300
$$ 2381711 2088056 2411552 2371705 2547174 2413506 2653532 2837782 3100802 3403842 3887142
18944C887142L38527L27233J018250R27077Q28624J295344J187739J484302J465229
$$ 3887142 4225669 4552902 5571152 6498229 7326853 8622197 9809936 11294238 12759467
18935A2759467J191452J049922Q78874M52979k35289n04856q61220j028330j382042
$$ 12759467 13950919 15000841 15879715 16332694 16097405 15592549 14731329 13702999 12320957
18926A2320957j918476j454830j457488j073911r75753o89090m66381q13041m15966
$$ 12320957 10402481 8947651 7490163 6416252 5440499 4751409 4285028 3471987 3056021
18917C056021r6369k63665m37960k17129j0947k59551N0870k76910k64207L12385
$$ 3056021 2959652 2695987 2258027 2040898 2029951 1770400 1821270 1544360 1280153 1592538
18907A592538k81058l05146J41936j05121Q9554j32755M6830J88784m79785Q0364
$$ 1592538 1311480 1006334 1148270 1043149 1132703 999948 1046778 1235562 755777 836141
18897H36141J14064k82902J61662o6876J90110k18163J89062j96805j64649Q5710
$$ 836141 950205 667303 828965 762089 952199 734036 923098 726293 561644 647354
18887F47354J49625j08188N234J6544j14133K85551J4946j76015j23324m1693
$$ 647354 796979 688791 694025 710569 596436 881987 896933 720918 597594 555901
18877E55901n2676J65939J59036j89366K03695k83169J17296J78458k39242O9902
$$ 555901 503225 669164 828200 638834 842529 559360 676656 855114 615872 685774
18867F85774J20844j70417m859n3288O8633J37397k24056J06538j46001J27214
$$ 685774 806618 636201 631342 578054 646687 784084 560028 666566 520565 647779
18857F47779n2112J63116k39916Q9830j29023M39006m51725K43272j99391M7391
$$ 647779 595667 758783 518867 608697 479674 918680 466955 710227 510836 558227
18847E58227L4550O0964J12652K1767j36569k9770j28498K07501J55474j53491
$$ 558227 592777 653741 766393 788160 651591 621821 493323 700824 856298 702807
18837G02807k44873J73066N7280j19496J9128L10547k77765J5006j45634K61787
$$ 702807 457934 631000 688280 568784 587912 898459 620694 635700 490066 751853
18827G51853r1638j97240m9315J21590K88093k52738K2975r4723J69330k0383
$$ 751853 660215 462975 413660 535250 823343 570605 593580 498857 668187 647804
18817F47804J7194j55976J10281K9791R26O6485P3914j74820J61784J48963k31685
$$ 647804 664998 509022 619303 649094 650020 716505 790419 615599 777383 926346 694661
18806F94661j21839j76588J27355m3957J63920J24844o9422j31052J30266p8602
$$ 694661 572822 396234 523589 479632 643552 768396 698974 567922 698188 619586
18796F19586K93383j06447j24136m505K85404k20808j15433K29051l33493M04860
$$ 619586 912969 806522 682386 677881 963285 742477 627044 856095 522602 927462
18786I27462n3852k32984J47711P5355J5805K13177j89974l4347o7514J74406
$$ 927462 873610 640626 788337 863692 879497 1092674 902700 868353 800839 975245
18776I75245k20194J41935J71509k87670p6517J19181J32337j47940l5062j08514
$$ 975245 755051 896986 1068495 780825 704308 823489 955826 807886 772824 664310
18766F64310L04024m20806r2499M20699j34280l6239L2016j00930j06277K71079
$$ 664310 968334 547528 455029 875728 741448 705209 737225 636295 530018 801097
18756H01097l06038K04582O8880Q6419k93825K06056J48978j77814r2785r695
$$ 801097 495059 699641 768521 854940 561115 767171 916149 738335 645550 635855
18746F35855K26650k28325K0847N1126o9362j60547K11919J00697m3479m6128
$$ 635855 862505 634180 655027 706153 636791 476244 688163 788860 745381 699253
18736F99253n3599O2971j83250j10M0975o2984J0281J30640p6976j66223K40036
$$ 699253 645654 708625 525375 525265 566240 503256 513537 644177 567201 400978 641014
18725F41014j04674K47695k34993R4332l2586n7520L23108k95978J20458Q7741
$$ 641014 536340 784035 549042 643374 610788 553268 876376 580398 700856 788597
18715G88597J64568k07603J22613l44523J88469r3562j68081K42269N0922j81296
$$ 788597 953165 745562 868175 523652 712121 618559 450478 692747 743669 562373
18705E62373M170K71302j79557L4404j4613J45462j82213r2873P0204K85527m39265
$$ 562373 566543 837845 658288 692692 678079 823541 641328 548455 618659 904186 464921
18694D64921J24015J91413Q438k65095R2309J21981k99771J11992J45052q0585
$$ 464921 588936 780349 788787 523692 616001 737982 438211 550203 695255 614670
18684F14670J88726k50377J22326p1180J28055j12922n2807J22197K05314j88041
$$ 614670 803396 553019 675345 604165 732220 619298 566491 688688 894002 705961
18674G05961J99051k63236M2666R7541j3806l65677M32642j94882Q1299J29597
$$ 705961 905012 641776 684442 781983 768177 402500 835142 640260 721559 851156
18664H51156Q1951l97517J19771j11949n836r1613L50548k33354N3796k3493K73525
$$ 851156 933107 535590 655361 543412 537576 445963 796511 563157 616953 593460 866985
18653H66985m18353L28011k42521K39640O785j44407j37420q222j0346O83j27996
$$ 866985 448632 776643 534122 773762 780547 636140 498720 490498 480152 480835 352839
18642C52839Q6254k74n730K5527O8026J74209k62121P6885L8761m5283O2935B25662
$$ 352839 439093 438819 433089 458616 526642 700851 438730 515615 554376 509093 572028 225662
18629C42008M34439j33184j09081k0694O0176O3792k09403N0394J55161k79432
$$ 342008 776447 643263 534182 513488 573664 637456 428053 478447 633608 354176
18619C54176L43345j19464K0996M4177C14137L40209n1311J03044m8893j34005
$$ 354176 697521 578057 599053 643230 314137 654346 603035 706079 657186 523181
18609E23181J77124J01927o5821j5074j09754M0877J17505Q781n6009M5485j48007
$$ 523181 700305 802232 736411 721337 611583 652460 769965 778746 722737 768222 620215
18598F20215K0289J54156N6901J02490p2893n3353k1284n985J65662k71598j68911
$$ 620215 640504 794660 851561 954051 881158 827805 806521 800536 966198 694600 525689
18587E25689J61279q1405N30317l70817K3334J69900k15367M227P324K15325k46992
$$ 525689 686968 605563 1135880 765063 788397 958297 742930 747157 754481 969806 722814
18576G22814j01052L35717j54776o2348j91062J45298l43011L70515j28460j61616
$$ 722814 621762 957479 802703 740355 549293 694591 351580 722095 593635 432019
18566D32019L02840K09750k61413k5537K3353j39427l4884O2635P2627k68034
$$ 432019 734859 944609 683196 657659 681012 541585 506701 569336 641963 373929
18556C73929K03753k36119j7894J62802P1210n4976M8329J68509k49184J01883
$$ 373929 577682 341563 323669 486471 557681 502705 551034 719543 470359 572242
18546E72242Q6831j88659N2415O0289j91076A33944M55798J31246q0922q0550
$$ 572242 659073 470414 522829 583118 392042 133944 589742 720988 640066 559516
18536E59516O2290Q2307k15385J25933j70762K05493n5184j3297j33879K0556
$$ 559516 621806 704113 488728 614661 443899 649392 594208 580911 447032 467588
18526D67588j70839K19172J34269k30880J98443o2994k28621K44283L6301o6084
$$ 467588 296749 515921 650190 419310 617753 554759 326138 570421 606722 540638
18516E40638j32650J88884j71393M9081j50444K83211A94441M04907k54012K39149
$$ 540638 407988 596872 425479 474560 324116 607327 194441 599348 345336 584485
18506E84485K6311j27291J46864o6004q2250R5721L8824j57196o7711K01524J08177
$$ 584485 610796 483505 630369 564365 482115 577836 616660 459464 391753 593277 701454
18495G01454j54162J32079L9947q3150j14707J75638j88758L47902k34507j70117
$$ 701454 547292 679371 719318 636168 521461 697099 508341 856243 621736 451619
18485D51619Q71P3316N5596p7141j52578O0779J56146J81931k05098L60515m01471
$$ 451619 452490 525806 581402 504261 351683 412462 568608 750539 545441 905956 504485
18474E04485O0647k64073L35070p9529j09118K25625j72914J24968J3682J63678
$$ 504485 565132 301059 636129 556600 447482 673107 500193 625161 638843 802521
18464H02521j66253M8809J35005k70515L6844K14514K1016l5910M0543R5651m6706
$$ 802521 636268 685077 820082 549567 586411 800925 821941 786031 826574 922225 875519
18453H75519L3650k7118J90571l90179j55254K23769B51740L87597j34665J64741
$$ 875519 909169 882051 1072622 682443 527189 750958 251740 639337 504672 669413
18443F69413k03719J7003J08097k57795K77762M4645o1195K19855k58488O5975
$$ 669413 465694 482697 590794 332999 610761 655406 594211 814066 555578 621553
18433F21553J70124j01286J39145j0596j4702J12834k27481J02463l59676J44363
$$ 621553 791677 690391 829536 818940 804238 917072 689591 792054 432378 576741
18423E76741J13035q305k60979O8399O8331j44115P8540l2849N8043k28561J82827
$$ 576741 689776 681471 420492 488891 557222 413107 491647 458798 516841 288280 471107
18412D71107O5751n2401O6841j20484J054l1230J03732J46359J45877l14989J60645
$$ 471107 536858 484457 551298 430814 431868 400638 504370 650729 796606 481617 642262
18401F42262k34408M6583J2938K73593j40522J5662j05171N9255p1598J05422
$$ 642262 407854 454437 467375 740968 600446 616108 510937 570192 498594 604016
18391F04016j11473M2790j76067J81161m3423O003J8872k5038K9306j20367n9064
$$ 604016 492543 535333 359266 540427 497004 503007 521879 496841 526147 405780 346716
18380C46716K586O2348J5277p4488O0940R4451j9433N8666m4499L7613P3253N8677
$$ 346716 349302 411650 426927 352439 413379 507830 488397 547063 502564 540177 613430 672107
18368F72107P0550j96721j01783M4454j07380K82163j73329M8172L7513o4902
$$ 672107 742657 545936 444153 488607 381227 663390 490061 538233 575746 510844
18358E10844K3502j33245J57878K09560j71860J15383k1125m8673n9685M350K2494
$$ 510844 534346 401101 558979 768539 596679 712062 690937 642264 582579 586929 609423
18347F09423j62562L25951k2498R2732k70600j33903k2510L18500j41092o657
$$ 609423 446861 772812 750314 843046 572446 438543 416033 734533 593441 586784
18337E86784j8264j34547O9413B41518L15394J09667j79355L78647j30576j8266
$$ 586784 568520 433973 503386 241518 556912 666579 487224 865871 735295 717029
18327G17029r7548R0790k53715K71552j61545N8687J5544J09447n8756n553O6398
$$ 717029 619481 710271 456556 728108 566563 625250 640794 750241 691485 685932 752330
18316G52330J20862j50765q6122M3877k08093N1079J89149p6011j00777J33952
$$ 752330 873192 722427 636305 680182 472089 523168 712317 636306 535529 669481
18306F69481O7205l59303J03550M6095m389J57432j87849J65463k49064M6368
$$ 669481 736686 377383 480933 527028 522639 680071 492222 657685 408621 454989
18296D54989K829j91542K37305p349o4970P4561J50989C01519m9516J84425j25033
$$ 454989 457818 266276 503581 496232 431262 505823 656812 301519 252003 436428 311395
18285C11395L66118j9596k27146M752k1830J82184q7062J23624k47688O314N6655
$$ 311395 677513 657917 430771 435523 413693 595877 508815 632439 384751 391065 447720
18274D47720l7201J20336m2319j16603L20m5983M33272q2616j60627J7247l7064
$$ 447720 410519 530855 488536 371933 372253 326270 759542 676926 516299 533546 496482
18263D96482K51333B32710J52104K34833q1682J20234k92117M23987r2758j96885
$$ 496482 747815 232710 384814 619647 537965 658199 366082 790069 697311 500426
18253E00426K85144j09853j56702K26005k41532K3685l2423J75410M6699j28564
$$ 500426 785570 675717 519015 745020 503488 527173 494750 670160 716859 588295
18243E88295o0517J0482k5537r7784J35440O4971q4254N1063J34458j13424P778
$$ 588295 527778 538260 512723 414939 550379 615350 531096 582159 716617 603193 610971
18232F10971r6458o9745M6460j45178J05646J4777J63724k07201M01282k77957
$$ 610971 514513 444768 491228 346050 451696 466473 630197 422996 824278 546321
18222E46321M4671m5791J93559M9018j43492n6967J09897j57762K2163K2459j67178
$$ 546321 590992 545201 738760 787778 644286 587319 697216 539454 561617 584076 416898
18211D16898O4830J2525j27507K05700B71313L52052K26918l78046K67976C61499
$$ 416898 481728 494253 366746 572446 271313 623365 850283 472237 740213 361499
18200D26322m717K65690m5734J30280l7175j07266p7211K28255k03318L4456J367
$$ 426322 421605 687295 641561 771841 734666 627400 550189 778444 575126 609582 610949
18189F10949J47072K2073k04091P0499j43756M3534m8643j19490K76161J112j75600
$$ 610949 758021 780094 576003 646502 502746 546280 497637 378147 654308 655420 479820
18178D79820J68251M0818k29638J5371K76346j56349N8306R8408o8647L0840o7362
$$ 479820 648071 688889 459251 474622 750968 594619 652925 751333 682686 713526 646164
18167F46164Q1802k1838Q0405J8703l73782M10241k09113K51744k75616j2250
$$ 646164 727966 706128 786533 805236 431454 841695 632582 884326 608710 596460
18157E96460K24037j63642j3098j16070m0961J7327K77116j59853n3174l7807
$$ 596460 820497 656855 643757 527687 486726 504053 781169 621316 568142 530335
18147E30335L34879o3019j58362j5628j75786O2381j75030J61285K54568r8282
$$ 530335 865214 802195 643833 628205 452419 514800 339770 501055 755623 657341
18137F57341k58413m2928K93043J13139j22444J25971j80194J20287J0137o7105
$$ 657341 398928 356000 649043 762182 639738 765709 585515 705802 715939 648834
18127F48834j26302m0942J19944m4310n4300J72938k37341J63832j14687J24555
$$ 648834 522532 481590 601534 557224 502924 675862 438521 602353 487666 612221
18117F12221O7225r7647L3484L3189N804j79690R3490j34901K8028K57934j54476
$$ 612221 679446 581799 615283 648472 654276 474586 568076 433175 461203 719137 564661
18106E64661Q4476o8532O0582l03104M11783j08505l7021k9749J65694j51984
$$ 564661 649137 580605 641187 338083 749866 641361 604340 574591 740285 588301
18096E88301j54483J05647k9134n3808J20574o5573Q3951j06632J57472j2695
$$ 588301 433818 539465 510331 456523 577097 511524 595475 488843 646315 633620
18086F33620j49176k2275o7665J53637j9721q3384J807J16416q6405K2637J73865
$$ 633620 484444 462169 394504 548141 528420 445036 446843 563259 476854 499491 673356
18075F73356k01595J7167M8639j2702L27729k36312p8704Q6060j28724K0178K74008
$$ 673356 471761 488928 537567 524865 852594 616282 537578 623638 494914 515092 789100
18064G89100l51647P2560j41713l9368K65753k68444J53630l876k9639j25755
$$ 789100 437453 510013 368300 328932 594685 326241 479871 475995 446356 320601
18054C20601J61379m7035J24661j13897j80055O8879J17248o1821J9162R8364
$$ 320601 481980 434945 559606 445709 265654 334533 451781 389960 409122 507486
18044E07486K22140j52669o9106m3464p989j8697J12796J2087K8670k49640L24357
$$ 507486 729626 576957 507851 464387 456398 437701 550497 562584 591254 341614 665971
18033F65971k40322R0791j75319R4504N3676l7195M7648j86862J8264J80553j07449
$$ 665971 425649 516440 341121 435625 489301 452106 499754 312892 331156 511709 404260
18022D04260J55011l5638J8268o2093J44204j49218J90459k07777J39947p433
$$ 404260 559271 523633 541901 479808 624012 474794 665253 457476 597423 589990
18012E89990B09078K64955k00390K86753B47140J81626j07144K61560J00157H8638
$$ 589990 209078 474033 273643 560396 247140 428766 321622 583182 683339 88638
18001D51317M7032j40122O5519N8074A98901K84868o0430L01217l28924N8581
$$ 451317 498349 358227 423746 481820 198901 483769 423339 724556 395632 454213
17991D54213k3868m1464r451N5368j46690L15586j17609J19305o4118j71532J17728
$$ 454213 430345 388881 379430 434798 288108 603694 486085 605390 541272 369740 487468
17980D87468N4052l6725r8765L41421k16687N5577B69229K86482l9989J18948
$$ 487468 541520 504795 406030 747451 530764 586341 269229 555711 515722 634670
17970F34670k08466K26024N2881k22265j8441p6634M2429K72746k16734P6400
$$ 634670 426204 652228 705109 482844 464403 387769 430198 702944 486210 562610
17960E62610j7201o9341j10333L94778k70518N1348J55947j54041j74308K48558
$$ 562610 545409 476068 365735 760513 489995 541343 697290 543249 368941 617499
17950F17499k91336K22516o0204K4676R7164J60390q7035l4745j68575j7270J18011
$$ 617499 326163 548679 488475 513151 610315 770705 683670 648925 480350 463080 581091
17939E81091j61783A82973M54256P9204k09827j01017R0254K10279k93959J07850
$$ 581091 419308 182973 637229 716433 506606 405589 495843 706122 412163 520013
17929E20013j15763J57685K10524k21993j37881K74709q6539j00374J8765j90618
$$ 520013 404250 561935 772459 550466 412585 687294 600755 500381 519146 328528
17919C28528L48425j59191K15388n1016A96445K76929M2310J2882J7966L6815
$$ 328528 676953 517762 733150 682134 196445 473374 515684 528566 546532 583347
17909E83347J94554C35466K61468P9227j15790L3436r7757M104J27601B72640
$$ 583347 777901 335466 596934 676161 560371 593807 496050 500154 627755 272640
17898F35130j55082J58840j17884J072P7660J18346k60925K87041n3449o0631
$$ 635130 480048 638888 521004 522076 599736 718082 457157 744198 690749 630118
17888F30118Q1050l49147K55754K41674k96914j419P0533r6703n2109J18516p366
$$ 630118 711168 362021 617775 859449 562535 561116 631649 534946 482837 601353 593987
17877E93987p5305J19169j90543K38164j68121P8864J48126j73261j67233P8525
$$ 593987 518682 637851 447308 685472 517351 596215 744341 571080 403847 482372
17867D82372J31367q5447J38397j02071J79664n4797q6256M088j34454m4434O3563
$$ 482372 613739 528292 666689 564618 744282 689485 603229 607317 472863 428429 491992
17856D91992O1475j56070K22634J367M2576A04833M33970M7784J84770l26822
$$ 491992 553467 397397 620031 621398 663974 104833 538803 586587 771357 444535
17846D44535K49440r7047K9031O3009m0688L7535N204k10128J04942J44572j0773
$$ 444535 693975 596928 625959 688968 648280 685815 691019 480891 585833 730405 719632
17835G19632L4143j61811Q268K37857k59635p4231L04883j3673Q693k13264J13027
$$ 719632 753775 591964 600232 838089 578454 504223 809106 795433 804126 590862 703889
17824G03889r6371q9468J22202J25712j08182K70531m5226O3174k31482K75065
$$ 703889 607518 518050 640252 765964 657782 928313 883087 946261 714779 989844
17814I89844m1301m2816J95079j59039J08057P4945K0806j35335L0726l78096
$$ 989844 948543 905727 1100806 941767 1049824 1124769 1145575 1010240 1040966 662870
17804F62870P8618R0230J99960j43461R0207M1801j08290L8420P6486J04175J9778
$$ 662870 741488 831718 1031678 888217 978424 1020225 911935 950355 1026841 1131016 1150794
17793A150794k47800k06136J18134o8231J30633j91651n9980J04882j35288l5141
$$ 1150794 902994 696858 814992 746761 877394 685743 625763 730645 595357 560216
17783E60216l1966P9347j7441K08877C69840L24712N5667C67817M69295n9397
$$ 560216 528250 607597 590156 799033 369840 694552 750219 367817 837112 777715
17773G77715q0939J73772D18353L36571N8118l53590K14617o4413J80584n4613
$$ 777715 696776 870548 418353 754924 813042 459452 674069 609656 790240 735627
17763G35627B22197K94457r2657J39323K1437o5273Q6499J66238J11215k59819
$$ 735627 222197 516654 423997 563320 584757 519484 605983 772221 883436 623617
17753F23617m1916M6758J40227k93596J71985r7867Q066K81695j57652L83L5002
$$ 623617 581701 628459 768686 475090 647075 549208 557274 838969 681317 681700 716702
17742G16702k39282J37875J97399j05672j4960j13520j82431K60196j10761L7966
$$ 716702 477420 615295 812694 707022 692062 578542 396111 656307 545546 583512
17732E83512J65729k84502J01507J05007Q274L8953N7887j71626K8927K32815
$$ 583512 749241 464739 566246 671253 679527 718480 776367 604741 633668 866483
17722H66483p2089q2481n2328J5996j16003J14318J90537k55534Q4443O5434j68264
$$ 866483 794394 711913 659585 675581 559578 673896 864433 608899 693342 758776 590512
17711E90512R8025J01534k26724J38072n8331j27691J06265o7667P3871L7203
$$ 590512 688537 790071 563347 701419 643088 515397 621662 553995 627866 665069
17701F65069N4650j78151j28519J09875J4696K24974n3461L08213m42841K31825
$$ 665069 719719 541568 413049 522924 537620 762594 709133 1017346 574505 806330
17691H06330j34550j03865J09611N9473M880N6550K2191k5217j26315J9236J68776
$$ 806330 671780 567915 677526 736999 741879 798429 820620 795403 669088 688324 857100
17680H57100j81178M7519l601j30781L87192j19665k94344j12862K74050n1690
$$ 857100 675922 723441 719840 589059 976251 856586 562242 449380 723430 671740
17670F71740M9291M783j863j01990J64334q6763o6193J77724m2504j77732l2771
$$ 671740 721031 725814 723951 621961 786295 699532 633339 811063 768559 590827 558056
17659E58056L6434K93368k13685J92174L8697j37557J50516K7829J27021l19899
$$ 558056 594490 887858 674173 866347 905044 767487 918003 945832 1072853 752954
17649G52954Q9379J35087k07462K53181m1678p768k93355K92454k71763K10548
$$ 752954 842333 977420 769958 1023139 981461 973693 680338 972792 701029 911577
17639I11577j39508J00825k55254K48470J87212j74096J0868j05076J6455J16011
$$ 911577 772069 872894 617640 866110 1053322 879226 890094 785018 801473 917484
17629I17484L8947p4760N1218j02758K76053j54752J40818j5707J79046k33041
$$ 917484 956431 881671 932889 830131 1106184 951432 1092250 1076543 1255589 1022548
17619A022548J03405k1161o1173J78229l81263K06502P6236K15912k99828L01663
$$ 1022548 1125953 1104792 1043619 1221848 840585 1047087 1123323 1339235 1039407 1341070
17609A341070q06l29238K74674j04063M8863L081j34742K69845J22769r2139j19877
$$ 1341070 1340264 1011026 1285700 1181637 1230500 1233581 1098839 1368684 1491453 1399314 1279437
17598A279437q4094l324J06451j0698J0060k32886K61990P816j41304j0672Q9359
$$ 1279437 1195343 1192019 1298470 1287772 1297832 1064946 1326936 1334752 1193448 1182776 1272135
17587A272135P6653p086j59299K14387L3778j88692R6354K9379j8592K34311o9080
$$ 1272135 1348788 1341702 1182403 1396790 1430568 1241876 1338230 1367609 1349017 1583328 1514248
17576A514248j4838n6620o3882J31510q0001k70901K69530j61896M88154k86309
$$ 1514248 1499410 1442790 1378908 1510418 1430417 1159516 1429046 1267150 1755304 1468995
17566A468995j00008L1809j90003J29252N2437k9186P1795l45419J92063N6943
$$ 1468995 1368987 1400796 1210793 1340045 1392482 1363296 1435091 1089672 1281735 1338678
17556A338678J22934k44942J05367L4642q3527q7j68035J44085K09155p6154o4904
$$ 1338678 1461612 1216670 1322037 1356679 1273152 1273065 1105030 1249115 1458270 1382116 1317212
17545A317212J15294M1830n5035J7880K62528j73774J08065k11222J53512J53982
$$ 1317212 1432506 1474336 1419301 1437181 1699709 1525935 1634000 1422778 1576290 1730272
17535A730272k36299j20899J51335n28122L00741k6465K44886J07205j51049k3758
$$ 1730272 1493973 1373074 1524409 996287 1297028 1270563 1515449 1622654 1471605 1447847
17525A447847o1198J95233L4188j275K27812k92642n5185j43465L52967l9185
$$ 1447847 1386649 1581882 1616070 1614795 1842607 1549965 1494780 1351315 1704282 1665097
17515A665097j00321j55119M43853J43210J40190J90533L1611K21445j58511n3121
$$ 1665097 1564776 1409657 1853510 1996720 2136910 2327443 2359054 2580499 2421988 2368867
17505B368867L8860M1511J95769n4454J58357j92616J66214N2852K09898K32862
$$ 2368867 2407727 2449238 2645007 2590553 2748910 2556294 2722508 2775360 2985258 3218120
17495C218120L16250K04836K94556M54771N87571M07697R28025Q29033J997005
$$ 3218120 3534370 3739206 4033762 4488533 5076104 5483801 6411826 7240859 9237864
17486I237864L386435N456680Q541421J1068462J2862197J0851436P885364N986972
$$ 9237864 12624299 18080979 26622400 37690862 50553059 61404495 69289859 75276831
17478G5276831L746945K445646k53803l571802p755966j1876027j2839568r801216
$$ 75276831 79023776 81469422 81215619 77643817 69887851 58011824 45172256 35371040
17470C5371040l920474J971855P791099J0682898J0350070Q207177N702501L660283
$$ 35371040 31450566 33422421 41213520 51896418 62246488 70453665 76156166 79816449
17462G9816449J956719k02914l603806p407647j1769280j4671400j4062036j0844502
$$ 79816449 81773168 81570254 77966448 70558801 58789521 44118121 30056085 19211583
17454A9211583o222391m009114j993122j320644p19567p35119k57686n37887r508
$$ 19211583 12989192 8980078 6986956 5666312 4946745 4211626 3953940 3416053 3406545
17445C406545j29831j58969J23797l11311m0309P6251P8556j57780k83712O6061
$$ 3406545 3276714 3117745 3241542 2930231 2889922 2966173 3044729 2886949 2603237 2669298
17435B669298l05885K06005M6888j6947j33442J23991K14308j82760n1638l5349
$$ 2669298 2363413 2569418 2616306 2599359 2465917 2589908 2804216 2621456 2569818 2534469
17425B534469J37622j70233j7123r4017K11533m12041k05442J12987l9214J09244
$$ 2534469 2672091 2501858 2484735 2390718 2602251 2190210 1984768 2097755 2058541 2167785
17415B167785r9744J37241J4337j18071J75383M6629M9151P2947l3086o6869k2698
$$ 2167785 2068041 2205282 2219619 2101548 2276931 2323560 2372711 2445658 2412572 2345703 2323005
17404B323005L22626K52056j72511K07049K3100K20845J93368j58042M87334J20436
$$ 2323005 2645631 2897687 2725176 2932225 2955325 3176170 3369538 3211496 3698830 3819266
17394C819266M47129n2661M02100L04939M52226L24221L95056J88454M03901K89878
$$ 3819266 4266395 4213734 4615834 4920773 5372999 5697220 6092276 6280730 6684631 6974509
17384F974509N3975K73428l73257o4448j8622q8722k16542o9469J34775l44461
$$ 6974509 7028484 7301912 6928655 6864207 6845585 6756863 6540321 6470852 6605627 6261166
17374F261166K03309Q8199L64478L6605L15780J88529L67675L21808J25032n4072
$$ 6261166 6464475 6552674 6917152 6953757 7269537 7458066 7825741 8147549 8272581 8218509
17364H218509Q2357L76005P9839m1184k53464J64120P9989j39013M7460L30045
$$ 8218509 8300866 8676871 8756710 8715526 8462062 8626182 8706171 8567158 8614618 8944663
17354H944663J60186K30497J49563K38779J151537J13057N06821L81387O41842
$$ 8944663 9104849 9335346 9484909 9723688 10875225 10988282 11495103 11876490 12518332
17345A2518332L52767M76602L93735K23818J36899Q1975l22531O2569j93649r6218
$$ 12518332 12871099 13347701 13741436 13965254 14102153 14184128 13861597 13924166 13730517 13634299
17335A3634299k89916j70529j40257M1105j46032K63520J18224n167R25211n6996
$$ 13634299 13344383 13173854 13033597 13074702 12928670 13192190 13310414 13305247 14230458 14173462
17325A4173462L75497L26052K40154L90113K15591M1797N2508L84936j08108K8183
$$ 14173462 14548959 14875011 15115165 15505278 15720869 15762666 15815174 16200110 16092002 16120185
17315A6120185k1580Q4830o4769j31078J20826K71288k18785L03129q367K62164
$$ 16120185 16098605 16183435 16118666 15987588 16108414 16379702 16160917 16464046 16455679 16717843
17305A6717843q4625J03135L7540M56513o0767p447p0816j53497j38581j26398
$$ 16717843 16633218 16736353 16773893 17230406 17169639 17162192 17091376 16937879 16799298 16672900
17295A6672900j57874l92535j51036J71J74915p2308Q4105M06159J13497q0415
$$ 16672900 16515026 16122491 15971455 15971626 16146541 16074233 16158338 16564497 16677994 16597579
17285A6597579k8257r8144m02317l70588k36137q16590n15640p51681j025955
$$ 16597579 16569322 16471178 16068861 15698273 15462136 14645546 14129906 13378225 12352270
17276A2352270n08650j024917o27842n12664q28260m37039n80227j37186j83130
$$ 12352270 11843620 10818703 10190861 9678197 8849937 8412898 7832671 7695485 7512355
17267G512355n17771j1543l73953k6907j5087q6835n2501J6239k66867l7812N0942
$$ 7512355 6994584 6983041 6609088 6582181 6567094 6480259 6427758 6443997 6177130 6139318 6190260
17256F190260j23945n2567m67947o3816j42914j49521L47064m55270l3635O1209
$$ 6190260 6066315 6013748 5545801 5481985 5339071 5189550 5536614 5081344 5047709 5108918
17246E108918j11013l28642L59169l72944N855J51319l28119l8402L11213m69544
$$ 5108918 4997905 4669263 5028432 4655488 4661343 4812662 4484543 4446141 4757354 4287810
17236D287810k16613J58442j21915r1519m46176J51193k36155J31290j84973p6016
$$ 4287810 4071197 4229639 4107724 4016205 3570029 3721222 3485067 3616357 3431384 3355368
17226C355368J14996j53228l7046k6472K17005m1577M2451l01739J46483J27277
$$ 3355368 3470364 3317136 3280090 3253618 3470623 3429046 3471497 3169758 3316241 3443518
17216C443518P220k8290m1616M4709k73084K13902j40250R1344l4297q0015O5980
$$ 3443518 3450738 3422448 3380832 3425541 3152457 3366359 3226109 3317453 3283156 3203141 3269121
17205C269121l72060L38876m33687J56385j3473k12002o6970m5260P2818j03419
$$ 3269121 2897061 3235937 2802250 2958635 2945162 2733160 2666190 2620930 2693748 2590329
17195B590329k9246j15247l3939j57824M5577o5200K1634M8396K1096o0787q4034
$$ 2590329 2561083 2445836 2411897 2254073 2299650 2234450 2256084 2304480 2325576 2264789 2180755
17184B180755L6116M716L16542m83995K47072R1623j08868J51967J270J08404
$$ 2180755 2216871 2221587 2538129 2054134 2301206 2392829 2283961 2435928 2437198 2545602
17174B545602o9881j344K52021k60029J99932k05939J56529j05841J43674k26314
$$ 2545602 2475721 2474377 2726398 2466369 2666301 2460362 2616891 2511050 2654724 2428410
17164B428410K53557K04566k71864K30025P2383j46498J55352n8566L85108k12819
$$ 2428410 2681967 2886533 2614669 2844694 2917077 2770579 2925931 2867365 3252473 3039654
17154C039654k37374K19250L15409l39702q0022J49182j09111J4954J11329k17636
$$ 3039654 2802280 3021530 3336939 2997237 2917215 3066397 2957286 2972240 3083569 2865933
17144B865933J24172r5027j56062K06896J8608q5551p5028K20317n4352j62245
$$ 2865933 2990105 2895078 2739016 2945912 2964520 2878969 2803941 3024258 2969906 2807661
17134B807661J83397L974j49818j78412P0317K0911j51704k65519K61396J8827
$$ 2807661 2991058 2995032 2845214 2666802 2737119 2758030 2606326 2340807 2602203 2621030
17124B621030K4048r3302o5585J14255j46220N1526L29862k29287J79985l5050
$$ 2621030 2645078 2551776 2486191 2600446 2454226 2505752 2835614 2606327 2786312 2751262
17114B751262j31979R6181j8226L23391k7761P3379K5337r5694l3710R8418o2881
$$ 2751262 2619283 2715464 2697238 3020629 2992868 3066247 3091584 2995890 2962180 3060598 2997717
17103B997717K958p0772k93939N5718r5842l13084M9492j42498j74440k52984
$$ 2997717 3000675 2929903 2635964 2691682 2595840 2282756 2332248 2189750 2015310 1762326
17093A762326j36092m4242K84220k69306j02131j31214O4088k95444J99648j13226
$$ 1762326 1626234 1581992 1866212 1596906 1494775 1363561 1427649 1132205 1331853 1218627
17083A218627L3162L5755r1888R9481j1333J04191l92101L22733O9520m12930
$$ 1218627 1251789 1287544 1195656 1295137 1283804 1387995 995894 1318627 1388147 975217
17073I75217K37128k2944K38355J12728l08076m1063N0870j88975J68876j2012
$$ 975217 1212345 1189401 1427756 1540484 1232408 1191345 1242215 1053240 1222116 1210104
17063A210104m3830K8999J14047N4754O5043l2135J45643M01964M1290M25779
$$ 1210104 1166274 1195273 1309320 1364074 1429117 1396982 1542625 1944589 1985879 2411658
17053B411658k05461O77338o3940J15701J25381Q5403J07723j02687N2628j56163
$$ 2411658 2206197 2883535 2819595 2935296 3060677 3146080 3253803 3151116 3203744 3047581
17043C047581K3287J95991M0114j86172L80244K1607p3172j76711J63832k09248
$$ 3047581 3070868 3266859 3306973 3120801 3501045 3522652 3449480 3272769 3436601 3227353
17033C227353l26234j0031l87828J2183m43296L4632l64069q511J32091k99082
$$ 3227353 2901119 2891088 2503260 2515443 2072147 2106779 1742710 1734199 1866290 1567208
17023A567208J29488j23428p0112N5939k22999K852o5278q5192K89724n34788
$$ 1567208 1696696 1573268 1503156 1559095 1336096 1338948 1273670 1188478 1478202 943414
17013I43414L42886j52330K23339k22678j18753M1736M4759j3114k01414J95931
$$ 943414 1286300 1133970 1357309 1134631 1015878 1057614 1102373 1089259 887845 1083776
17003A083776k44790J72267m8827J53950M7599O4954j19006k21344M39576q274
$$ 1083776 838986 1011253 962426 1116376 1163975 1228929 1109923 888579 1328155 1319881
16993A319881J83k44190L2493L5862k9408O2334m1675q9253K31112j18179R6888
$$ 1319881 1320064 1075874 1108367 1144229 1114821 1177155 1135480 1046227 1277339 1159160 1256048
16982A256048j31392J80079M9016j99789P5149K23020k63867K4953M9934R3651
$$ 1256048 1124656 1304735 1353751 1153962 1229111 1452131 1188264 1213217 1263151 1356802
16972A356802N4942k2198j23946K11341J07402j42600J68359N5535K41369l8063
$$ 1356802 1411744 1389546 1265600 1476941 1584343 1441743 1610102 1665637 1907006 1868943
16962A868943L0434R3643J45683O0211J97073j24038L1197J78645j62853O9760
$$ 1868943 1899377 1993020 2138703 2198914 2395987 2271949 2303146 2481791 2318938 2388698
16952B388698j41597l5520p8726k20731k1908J3568k75583K42782k46361n2530
$$ 2388698 2247101 2211581 2132855 1912124 1890216 1903784 1628201 1870983 1624622 1572092
16942A572092K21365j77557K4388j51324o4100j82398M0116j9823N0755j12187
$$ 1572092 1793457 1615900 1640288 1488964 1424864 1242466 1282582 1262759 1313514 1201327
16932A201327p5595J64648j13838o2776J12709l6446R4939m15255J00139j11112
$$ 1201327 1125732 1290380 1176542 1113766 1226475 1190029 1284968 869713 969852 858740
16922H58740L3493j3959J87780j13647p1608L2675k43019k8577M9885J70676P339
$$ 858740 892233 878274 1066054 952407 880799 913474 670455 641878 691763 862439 869778
16911H69778Q0540q0816K09066k28390J11609m2116j27496J28948R4290j61431
$$ 869778 950318 869502 1078568 850178 961787 919671 792175 921123 1015413 853982
16901H53982j08033K36169l92734J65846j34202L51655k23735L2628o6869o6150
$$ 853982 745949 982118 589384 755230 621028 972683 748948 781576 714707 648557
16891F48557M5490R1545n8939J94823j66573M7390K32410E04730K82308o3317
$$ 648557 694047 785592 726653 921476 754903 802293 1034703 504730 787038 723721
16881G23721j0078O9438m7394K4529j13142q9278J75020j58327L35949j33437
$$ 723721 713643 783081 735687 760216 647074 557796 732816 574489 910438 777001
16871G77001O3630M6506k23897j9037L1071p0551J93123J21795j47045r6749o8086
$$ 777001 840631 887137 663240 644203 675274 604723 797846 919641 772596 675847 607761
16860F07761K95714j59057J58099q2775L09623k01397j92216J86455k04928N3657
$$ 607761 903475 744418 902517 819742 1129365 927968 735752 922207 717279 770936
16850G70936J03423J56568q2868l61123R3612P5265k58036K64258j74146p0996
$$ 770936 874359 1030927 948059 586936 680548 755813 497777 762035 587889 516893
16840E16893J42309N1008O1779J1260J31145k5106r8896p5686J98948m6794L8621
$$ 516893 659202 710210 771989 783249 914394 889288 790392 714706 913654 866860 905481
16829I05481P9281j65298J05549J83238J21325l05547J65328l8199O8532J52393
$$ 905481 984762 819464 925013 1108251 1229576 924029 1089357 1051158 1119690 1272083
16819A272083J71542m5165k2155R6349J71320r6079Q1136l9409q4106J88541l6493
$$ 1272083 1443625 1398460 1376305 1472654 1643974 1547895 1629031 1589622 1505516 1694057 1657564
16808A657564m6837p151K48743k05197q1961O8715K40565m65080L92980j73535
$$ 1657564 1610727 1603576 1852319 1647122 1565161 1633876 1874441 1409361 1802341 1628806
16798A628806j98013K22057K0998n25298J00828Q3960l1570k79045K34795k84380
$$ 1628806 1430793 1652850 1673848 1148550 1249378 1333338 1301768 1022723 1257518 973138
16788I73138R843O1545j24645q2117M8726l0325k08726J69204j1210k45852J2796
$$ 973138 982981 1044526 919881 837764 886490 856165 647439 816643 805433 559581 572377
16777E72377o865J13733L85032k34974k30088P6603J23496k25296J27043k17005
$$ 572377 565512 679245 1064277 829303 599215 675818 799314 574018 701061 484056
16767D84056j6705K31622K66463M684k61827m8404J92103p4848J4071k2634p4299
$$ 484056 467351 698973 965436 970120 708293 659889 851992 777144 791215 768581 694282
16756F94282j28278M1088K3516K06805j29513J4151P1321j50559l4105P3658k64396
$$ 694282 566004 607092 630608 837413 707900 722051 793372 642813 608708 682366 417970
16745D17970J13396J57693o0858l1511O2014q9727J23425k84545K45393l8767
$$ 417970 531366 689059 628201 596690 658704 568977 692402 407857 653250 614483
16735F14483J36556O0043j83801j37887J95309J59300k68634k7817K6265j16902
$$ 614483 751039 811082 627281 489394 684703 844003 575369 547552 573817 456915
16725D56915L06651O4640l45045M34550o2556j72859J33848K40356k99709M4856
$$ 456915 763566 828206 483161 917711 855155 682296 816144 1056500 756791 801647
16715H01647m0901k8781R0551J89929O9185l35057L4112O5727j22772L73103J08107
$$ 801647 760746 731965 822516 1012445 1081630 746573 780685 846412 723640 1096743 1204850
16704A204850j07967J53464K8394P0928n8755r2356P9208K28004k25889K42850
$$ 1204850 1096883 1250347 1278741 1349669 1290914 1198558 1277766 1505770 1279881 1522731
16694A522731j86396j38383K7626M5896K67135k27354k5719L2618K6786o5105
$$ 1522731 1336335 1197952 1225578 1271474 1538609 1311255 1285536 1318154 1344940 1279835
16684A279835o0524p6399K72014l08533K87752l89027M0481p1595J82185j47091
$$ 1279835 1219311 1142912 1414926 1106393 1394145 1005118 1045599 974004 1156189 1009098
16674A009098p1132J9180r5110K11293N6569k0037K45939K5043K818P845K9180
$$ 1009098 937966 957146 862036 1073329 1129898 1109861 1355800 1380843 1383661 1391506 1420686
16663A420686p318J97011o8380l34321K47861j71144J14875j01377M34587l64624
$$ 1420686 1413368 1610379 1541999 1207678 1455539 1284395 1399270 1297893 1732480 1367856
16653A367856J43718j26829J46859L5823j86059k82162P7278o3346n090j96781
$$ 1367856 1511574 1384745 1531604 1567427 1381368 1099206 1176484 1113138 1108048 911267
16643I11267m1497o8486m4902R8342K9790k6930r3509j36400K72660j15835k01056
$$ 911267 869770 801284 756382 854724 884514 857584 764075 627675 900335 784500 583444
16632E83444N8877K55745k35553q0149N1011P2675L1253j17101J43595j6842l2435
$$ 583444 642321 898066 662513 582364 633375 706050 737303 620202 763797 746955 714520
16621G14520n1655j13767J79067k13280J06416j1464L8540j68047L67958p4892
$$ 714520 662865 549098 728165 514885 621301 609837 648377 480330 848288 773396
16611G73396l3525J91664k17844o3620j6492J68587k59745Q9274O2802L0909J58724
$$ 773396 739871 931535 713691 650071 633579 802166 542421 631695 694497 725406 884130
16600H84130j12062n9929K6443O9126J73441j82701J26754j56531O5345R1050
$$ 884130 772068 712139 738582 807708 981149 798448 925202 768671 834016 925066
16590I25066m0937j3170J77390k59503J22507r6507j59622L24577k04471r7455
$$ 925066 884129 870959 1048349 788846 911353 814846 655224 979801 775330 677875
16580F77875m2932j1010R3579l2912P576j50772J40750O6671o6324k49524J46740
$$ 677875 634943 623933 717512 684600 692176 541404 682154 748825 682501 432977 579717
16569E79717k29218K60728q1729p7817K24540l2563j9216K33115l26652k5606
$$ 579717 350499 611227 529498 451681 676221 643658 624442 857557 530905 505299
16559E05299j67911K83153Q2454J6580j12948j70083K86536n5063R1322M2787
$$ 505299 337388 620541 702995 719575 606627 436544 723080 668017 759339 802126
16549H02126J14759J7519j48024P5610k19913K47545j86068K5463j09777K6855
$$ 802126 916885 934404 786380 861990 642077 889622 703554 729017 619240 646095
16539F46095J2842j05187J15308j6447l7441J21601m2315m5630J7017k6722R1129
$$ 646095 658937 553750 669058 652611 615170 736771 694456 648826 665843 639121 730250
16528G30250K2042K2112L1264L0608m4646J26771o8456J50513m01o8683O4405
$$ 730250 752292 774404 805668 836276 791630 918401 849945 1000458 1000057 931374 995779
16517I95779n221j7705k32155j78245J81613j2833j18900K49127m8313l3307M676
$$ 995779 990558 972853 740698 562453 744066 731233 612333 861460 813147 779840 784516
16506G84516n4645J522K2356M5894Q3751M881n0765P5251o9642J16019N9298j18690
$$ 784516 729871 731393 753749 799643 883394 888275 837510 912761 843119 959138 1018436 899746
16494H99746P8222m5503J7548K2337Q5213j56412K5884J2308k95241M28814j61790
$$ 899746 977968 932465 950013 972350 1057563 901151 927035 939343 644102 1072916 911126
16483I11126j10525k80194L95009l50626o79Q5127j36548j56482J93449k62255
$$ 911126 800601 520407 915416 564790 564111 649238 512690 356208 549657 287402
16473B87402L21817j6440j82378A03139M04719j39650K7211M38855k40987K05628
$$ 287402 609219 592779 410401 103139 507858 368208 395419 834274 593287 798915
16463G98915K15808J52058R1501M2055J71137q6990K43324j25369j2021k4802
$$ 798915 1014723 1166781 1258282 1300337 1471474 1384484 1627808 1502439 1490418 1465616
16453A465616J47694j90515n339Q3341J700R4458Q3756J94851l83400L99241L37908
$$ 1465616 1613310 1422795 1417456 1500797 1502497 1596955 1680711 1875562 1492162 1891403 2229311
16442B229311k44731r4217O2657K3629K85438l00644J76961M10924J79690L21741
$$ 2229311 1984580 1890363 1953020 1976649 2262087 1961443 2138404 2549328 2729018 3050759
16432C050759K40807J04014K10849M7148N0431K17113J36664L87889L63371N72596
$$ 3050759 3291566 3395580 3606429 3653577 3704008 3921121 4057785 4445674 4809045 5381641
16422E381641Q07063Q96442Q63295J160058J382389J373927J440717J419604J670668
$$ 5381641 6188704 7085146 7948441 9108499 10490888 11864815 13305532 14725136 16395804
16413A6395804J763699J812165J917876J881539J990066K115388K426281K453883
$$ 16395804 18159503 19971668 21889544 23771083 25761149 27876537 30302818 32756701
16405C2756701K216438K352452K338026K508220K522486K495431K357447J995628
$$ 32756701 34973139 37325591 39663617 42171837 44694323 47189754 49547201 51542829
16397E1542829K317184L029544L966691M787848O454825Q858737J1787583J2217230
$$ 51542829 53860013 56889557 60856248 65644096 72098921 80957658 92745241 104962471
16389A04962471Q623100O79538p730511j2232879j3979272j3740800j2624576
$$ 104962471 113585571 114265109 106534598 94301719 80322447 66581647 53957071
16382E3957071j1315137r585791q676938p046799n179204l024342n74165O64924
$$ 53957071 42641934 33056143 24379205 17332406 12153202 9128860 8554695 9219619
16374I219619J115314K72482l28241p41641r40488r38682j018768n30574l34392
$$ 9219619 10334933 10607415 10279174 9537533 8597045 7658363 6639595 6109021 5774629
16365E774629n35306j01569l69199l4790l75569j1557J24436q6395m47526j15430
$$ 5774629 5239323 5137754 4768555 4733765 4358196 4346639 4471075 4384680 3937154 3821724
16355C821724q3061n45735l65852j87309l89156l41883m40679j29547k69580p1167
$$ 3821724 3738663 3192928 2827076 2639767 2250611 1908728 1468049 1338502 1068922 997755
16345I97755k09504j94589k94261j46615g1551m71066J33575j20057l33564J66117
$$ 997755 788251 593662 299401 152786 -71551 -542617 -409042 -529099 -862663 -696546
16335f96546J74181j1010a57683D24684N1599J40756J30187M08130n1714l09524
$$ -696546 -522365 -533375 -157683 424684 476283 617039 747226 1155356 1103642 794118
16325G94118J66260j55962m9730B85224J14137J17478k51431G9345L14812K2230
$$ 794118 960378 804416 754686 285224 399361 516839 265408 79345 394157 416387
16315D16387o661K2179P2743k22630j8757J85525o2368J46713k54093L18720K8360
$$ 416387 409726 431905 504648 282018 263261 448786 386418 533131 279038 597758 626118
16304F26118L76236Q7936m659n3251N6947J53400j71327k2758j13788Q2198J2747
$$ 626118 1002354 1090290 1085631 1032380 1089327 1242727 1071400 1048642 934854 1017052 1029799
16293A029799r7682N1158O3513l37454L8635r0724j0420L21367j10451R5139o276
$$ 1029799 932117 983275 1046788 709334 747969 657245 646825 968192 857741 952880 946604
16282I46604p8967K04058J37290m0408L2617J92231J1447j5435j7582j026P6125
$$ 946604 867637 1071695 1208985 1168577 1201194 1393425 1404872 1389437 1371855 1370829 1446954
16271A446954j01233k23180O178K23097m14034j81858J23209n5407j99106M6017
$$ 1446954 1345721 1122541 1128719 1351816 937782 755924 879133 823726 624620 670637
16261F70637q4771Q4829P0786n2288J14027J49266L2071k50235N1063n2939R6477
$$ 670637 585866 670695 741481 689193 803220 952486 984557 734322 785385 732446 828923
16250H28923q3J30888q8441J00590J07041J77541j12729q668J44230r1974J60532
$$ 828923 828840 959728 871287 971877 1078918 1256459 1143730 1135062 1279292 1187318 1347850
16239A347850j14933K33529N728j36560j78504n271K54481l15824k4423K658R0193
$$ 1347850 1232917 1466446 1472174 1335614 1157110 1151839 1406320 1090496 1066073 1068731 1158924
16228A158924p3026r9926N2306n332j03027l0555K46363K0232j30310j06903m4485
$$ 1158924 1085898 985972 1038278 1032946 929919 899364 1145727 1165959 1035649 928746 884261
16217H84261K27474l56880J68738M0766J9704o9160M364K42512k46099j9200L34661
$$ 884261 1111735 754855 923593 964359 984063 914903 919267 1161779 915680 896480 1231141
16206A231141k49089j59376L94024j72293J58431l68514o7603J69848J91949j44988
$$ 1231141 982052 822676 1216700 1044407 1202838 834324 766721 936569 1128518 983530
16196I83530k36207Q0308K08115J1602k69954J71332M344K05708j03050L5090
$$ 983530 747323 827631 1035746 1047348 777394 948726 953070 1158778 1055728 1090818
16186A090818j66454J68985j38098l3773k06746L61787o3941j43579J67944p5785
$$ 1090818 924364 1093349 955251 921478 714732 1076519 1012578 868999 1036943 961158
16176I61158l24143Q6467k4558Q380j69813L29445J90267j62313m932k05162L11728
$$ 961158 637015 723482 698924 707304 537491 866936 1057203 894890 889958 684796 996524
16165I96524O772m9563k7087K425R8771p1651J07935j56223R3971j6185P7234
$$ 996524 1003296 953733 926646 929071 1027842 956191 1064126 907903 1001874 985689 1062923
16154A062923K4367j46273j24699J60420p355J30340o5287j58004K54229k12450
$$ 1062923 1087290 941017 816318 976738 969383 1099723 1034436 876432 1130661 918211
16144I18211Q460J39479K2807j35153L238L7694j01704L09796k52018M2653J26014
$$ 918211 926671 1066150 1088957 953804 957042 994736 893032 1202828 950810 993463 1119477
16133A119477q6710k8465M8206J23096o0610J55022k93467O6959k0762K18275
$$ 1119477 1032767 1004302 1052508 1175604 1114994 1270016 976549 1043508 1022746 1241021
16123A241021k25301m4444p5101K34221j34645L3015k15681K07218j7466J18763
$$ 1241021 1015720 971276 896175 1130396 995751 1028766 813085 1020303 1002837 1121600
16113A121600k04663P4181K55659j37132l0101m57974L56564J2521k34594M08091
$$ 1121600 916937 991118 1246777 1109645 1079544 621570 978134 990655 756061 1164152
16103A164152j74950J41657k83713L83660o6686j3901j97826R4069J40240j44582
$$ 1164152 989202 1130859 847146 1230806 1164120 1150219 952393 1046462 1186702 1042120
16093A042120J33481j3980j32275j10707J38372J23793j35810K44372q3879m4073
$$ 1042120 1175601 1161621 1029346 918639 1057011 1180804 1044994 1289366 1205487 1161414
16083A161414j55033J50325k8267J80439j67393J97600j39280J21287l45724K62702
$$ 1161414 1006381 1156706 1128439 1308878 1141485 1339085 1199805 1321092 975368 1238070
16073A238070q4312N5502O7673l8412J2544j29336J49343k40991J48436K85586
$$ 1238070 1153758 1209260 1276933 1238521 1251065 1121729 1271072 1030081 1178517 1464103
16063A464103k16665J62007n8968R9889m50287L99989K23017l21452M00166j36239
$$ 1464103 1247438 1409445 1350477 1450366 1000079 1400068 1623085 1301633 1701799 1565560
16053A565560J7277K25775l22499L03068p3198j03956R6293J78222q1980J16920
$$ 1565560 1582837 1808612 1486113 1789181 1715983 1612027 1708320 1886542 1804562 1921482
16043A921482j3001j30092m7950N012J20892p879k85682O2782J56159j04972l4186
$$ 1921482 1908481 1778389 1730439 1735451 1856343 1848464 1562782 1625564 1781723 1676751 1642565
16032A642565K02568k00302j48662J70544N0298l3659O5550M1620N987q9915J70360
$$ 1642565 1845133 1644831 1496169 1666713 1717011 1683352 1748902 1790522 1796509 1706594 1876954
16021A876954J58421k0976j39372Q0382j71333O7802L69480j87583J2338Q731
$$ 1876954 2035375 2014399 1875027 1955409 1784076 1851878 2221358 2033775 2046113 2054844
16011B054844L5240P964p2051r8880L83850k96785M5983M5397k97844n4687L94248
$$ 2054844 2090084 2098048 2025997 1927117 2310967 2014182 2060165 2105562 1807718 1753031 2147279
16000B147279k05178L00174p1954j56466J35399p308j89438J6584J01502l3763
$$ 2147279 1942101 2242275 2170321 2013855 2149254 2141946 1952508 1969092 2070594 2036831
15990B036831j41693J65193J16853J10131k00880K04590L4494j32961J39099j58187
$$ 2036831 1895138 2060331 2177184 2287315 2086435 2291025 2325519 2192558 2331657 2173470
15980B173470L83615j27982J52638k82061m9920M6736J00608J11849l47454p7092
$$ 2173470 2557085 2429103 2581741 2299680 2249760 2296496 2397104 2508953 2161499 2084407
15970B084407J59280K09823k19334J55170k71872K98995j49519j83250L36929
$$ 2084407 2243687 2453510 2234176 2389346 2117474 2416469 2266950 2083700 2420629
15961B420629o3702j51531K8189p6122K21937j43171k02278J78487J63503j25063
$$ 2420629 2356927 2205396 2233585 2157463 2379400 2236229 2033951 2212438 2375941 2250878
15951B250878O9493M5684J20294j49585J45382k93571J86237j21453J77450p7088
$$ 2250878 2320371 2366055 2486349 2336764 2482146 2188575 2374812 2253359 2430809 2353721
15941B353721K51324J17626l36076L58063o5802m7603J8751J23072R0041l00188
$$ 2353721 2605045 2722671 2386595 2744658 2678856 2631253 2650004 2773076 2863117 2562929
15931B562929L50645L7580K90015k06944P7868K0865M8758L82551k3098J26695
$$ 2562929 2913574 2951154 3241169 3034225 3112093 3132958 3181716 3564267 3541169 3667864
15921C667864L21221L75751N2463M84170L34689M96323O74907J100179J194487
$$ 3667864 3989085 4364836 4417299 4901469 5236158 5732481 6407388 7507567 8702054
15912H702054K036981K631930L839144N041947O345405P084098O862434O138435
$$ 8702054 10739035 13370965 17210109 22252056 28597461 35681559 42543993 48682428
15904D8682428N631678L791199K357199K18643j728817m301747o035307p606524
$$ 48682428 54314106 58105305 60462504 60681147 58952330 54650583 48615276 41008752
15896D1008752p926335p508301n711012m871049l336847k345979j377083j297296
$$ 41008752 33082417 25574116 19863104 14992055 11655208 9309229 7932146 6634850
15888F634850j000376m76699n81735n61821k14789j73957m37381m0675j5613l26698
$$ 6634850 5634474 5157775 4576040 4014219 3799430 3625473 3188092 3147417 3131804 2805106
15878B805106J68048k19817k67929R7988Q1909j00613J51808j61739j13649J32110
$$ 2805106 2973154 2753337 2485408 2583396 2665305 2564692 2716500 2554761 2441112 2573222
15868B573222l7094q5083J9959j3905n6106P0584J703n0120k73995J77320K020
$$ 2573222 2536128 2451045 2471004 2457099 2400993 2471577 2473280 2423160 2149165 2326485 2328505
15857B328505K2347N0427r1029J9680q0163J57437K7906o0188j1948k13502l1973
$$ 2328505 2350852 2401279 2310250 2329930 2249767 2407204 2435110 2374922 2362974 2149472 2117499
15846B117499K98873j04659l50103J91862J2038Q953M4023J5516Q3612J394K92003
$$ 2117499 2416372 2311713 1961610 2153472 2165510 2174463 2218486 2234002 2317614 2319008 2611011
15835B611011l0140m0729j07444J73089L36193k53872k12437j4659L9092k5299
$$ 2611011 2580871 2540142 2432698 2605787 2941980 2688108 2475671 2461012 2500104 2474805
15825B474805k51928J29056q5959J1431j33798K40233l66334L44090Q609j46228
$$ 2474805 2222877 2351933 2265974 2277405 2143607 2383840 2017506 2361596 2370205 2223977
15815B223977k7948J02540r9820K10621j11489J7784j83195P7308K70054j76268
$$ 2223977 2196029 2298569 2198749 2409370 2297881 2315665 2132470 2209778 2479832 2303564
15805B303564J73196K902j02412o6488L01025J06639r8015q2471K72106n9561
$$ 2303564 2476760 2479662 2377250 2310762 2611787 2718426 2620411 2537940 2810046 2750485
15795B750485K34073j72992K79011Q0380K02318k04683M612J74851M2643J25259
$$ 2750485 2984558 2811566 3090577 3170957 3373275 3168592 3173204 3348055 3390698 3515957
15785C515957j24154j6511J56698J59663J224J70854J06425p1227K11367n2106
$$ 3515957 3391803 3375292 3531990 3691653 3692877 3863731 3970156 3898929 4110296 4058190
15775D058190K35860M32749m76365p5383J49084j08565J19876o2472L1305L7361
$$ 4058190 4294050 4726799 4250434 4175051 4324135 4215570 4335446 4272974 4304279 4341640
15765D341640J47118r4362K48435n6957j26027K13540j63597M35232j92285q2975
$$ 4341640 4488758 4394396 4642831 4585874 4459847 4673387 4509790 4945022 4752737 4669762
15755D669762J30363r8675J25949k63127L98664J02206K31814k37411K80386L6843
$$ 4669762 4800125 4701450 4827399 4564272 4962936 5065142 5296956 5059545 5339931 5376774
15745E376774M80073j9582j02735L43661K6336K94759Q7030j9988L48548n5952
$$ 5376774 5856847 5837265 5734530 6078191 6104527 6399286 6486316 6466328 6814876 6758924
15735F758924M0039N2418J61249L63499n65758J45320L95591O5234k18547j05895
$$ 6758924 6798963 6851381 7012630 7376129 6810371 6955691 7351282 7416516 7197969 7092074
15725G092074J34249q287r4208l45314K49147l87480m01770J17580J75744n7926
$$ 7092074 7226323 7218036 7123828 6778514 7027661 6640181 6238411 6355991 6531735 6473809
15715F473809R2848J2661K57054l2230J2398k20788k49406J25934K24398p3090
$$ 6473809 6566657 6579318 6836372 6804142 6816540 6595752 6346346 6472280 6696678 6623588
15705F623588K08472K23389k0212J82245J69761K87935L03912k6673K06285J00747
$$ 6623588 6832060 7055449 7035237 7217482 7387243 7675178 7979090 7952417 8158702 8259449
15695H259449J81594K12015M0132o1573m597L63583m22309k4363n5254p5359R6066
$$ 8259449 8441043 8653058 8693190 8631617 8627020 8990603 8568294 8543931 8488677 8413318 8509384
15684H509384O2185k64543l6907L46998l52200L19879l94795j10938J68096k63978
$$ 8509384 8571569 8307026 8270119 8617117 8264917 8584796 8190001 8079063 8247159 7983181
15674G983181j31470j06296j68176l09973k7866K09170j32628j05579n08K00557
$$ 7983181 7851711 7745415 7577239 7267266 7239400 7448570 7315942 7210363 7209855 7410412
15664G410412L2479K84488m1181L47225o9376L70272J04950L64374N05843L54420
$$ 7410412 7442891 7727379 7686198 8033423 7964047 8334319 8439269 8803643 9309486 9663906
15654I663906N58873O60332L42385P47030K04268R56674M83535N49669N57083
$$ 9663906 10222779 10883111 11225496 11972526 12176794 13133468 13617003 14166672 14723755
15645A4723755K46597P18536M54366O79897O21181N42317Q09311Q36315O21625
$$ 14723755 14970352 15688888 16143254 16823151 17444332 17986649 18795960 19632275 20253900
15636B0253900L69094O93858M51043J29845K34109N574l999k39246j76064j55739
$$ 20253900 20622994 21316852 21767895 21897740 22131849 22137423 22133424 21894178 21718114 21562375
15626B1562375j902j61885o1186k77295k93452J33498n02862o68234k73395p99944
$$ 21562375 21560473 21398588 21337402 21060107 20766655 20900153 20397291 19729057 19455662 18655718
15616A8655718r53015p09250r68788q29160m27729m90140p57852l31863j36635
$$ 18655718 17702703 16993453 16024665 15195505 14767776 14277636 13519784 13187921 13051286
15607A3051286n66776q5843n89866j58756l74521j83006k89404l98599O4471k24580
$$ 13051286 12484510 12398667 11808801 11650045 11275524 11092518 10803114 10404515 10468986 10244406
15597A0244406j9637J05689K46002M2715Q00468Q84369K299188M437093R605553
$$ 10244406 10224769 10330458 10576460 10619175 11419643 12304012 14603200 19040293 28645846
15588B8645846J4882145J3528805R111726O050911M215111K859424J625395K57650
$$ 28645846 43527991 57056796 66168522 72219433 76434544 79293968 80919363 81177013
15580H1177013l334931j0647155j8255969j7712775j1119962n437696k827744
$$ 81177013 77842082 67194927 48938958 31226183 20106221 14668525 11840781
15573A1840781j654111p06074o34343j99068k44456K10031K39892J30035M7732
$$ 11840781 10186670 9480596 8846253 8647185 8402729 8612760 8852652 8982687 9030419
15564I030419L25046l7125M35553O65687Q0803K80126R84572J751877L426825
$$ 9030419 9355465 9318340 9753893 10419580 10500383 10780509 11765081 13516958 16943783
15555A6943783P242266J4771855K0054277J6246257J0402452P114657N024670
$$ 16943783 24186049 38957904 59012181 75258438 85660890 92775547 97800217
15548I7800217L509441J479146r32340o249844j7645998k4505097k1475792j2119086
$$ 97800217 101309658 102788804 101856464 95606620 77960622 53455525 31979733 19860647
15540A9860647o055034l050268j974371j110717n04578l96462l97113J1835m09601
$$ 19860647 13805613 10755345 8780974 7670257 7165679 6769217 6372104 6383939 5974338
15531E974338n0487N637l40208k37367k48051j95127K20006l25976l38867j84254
$$ 5974338 5923851 5929488 5589280 5351913 5103862 4908735 5128741 4802765 4463898 4279644
15521D279644J335k27979J76907k53304k82357N84931n8026j02177j18265L04843
$$ 4279644 4280979 4053000 4229907 3976603 3694246 4279177 4221151 4118974 4000709 4305552
15511D305552j74985M28620J49042p7739l06794M26937n6115j84712n8670R3221
$$ 4305552 4130567 4559187 4708229 4630490 4323696 4750633 4694518 4509806 4451136 4544357
15501D544357k79581j40155J79452O982j04960K34706n63062M23866r8815r3478
$$ 4544357 4264776 4124621 4304073 4311055 4206095 4440801 3877739 4301605 4202790 4109312
15491D109312L27022j78181J91149K4005J59472l4320L02036K46733O1612M06147
$$ 4109312 4436334 4258153 4449302 4473307 4632779 4598459 4900495 5147228 5208840 5614987
15481E614987P5370N90838p7902L4944O7397L0824L39231j22164k15391L78307
$$ 5614987 5690357 6281195 6203293 6238237 6305634 6336458 6675689 6553525 6338134 6716441
15471F716441N64466N29432P56996M98801O67843O83075K59294L12771J98526
$$ 6716441 7280907 7810339 8567335 9066136 9733979 10417054 10676348 10989119 11187645
15462A1187645j02382m01424k70136n34352m14443j13928L8067L28384Q15057
$$ 11187645 11085263 10683839 10413703 9879351 9464908 9350980 9389047 9717431 10532488
15453A0532488O27714K57998L6248N62759P931j66183l24342o23829n00981n31795
$$ 10532488 11160202 11418200 11454448 12017207 12025138 11858955 11534613 10910784 10409803 9878008
15443I878008q59143j48151k57307J62971K47885R5810O6632j27198q5014J48175
$$ 9878008 9018865 8870714 8613407 8776378 9024263 9120073 9186705 9059507 8974493 9122668
15433I122668k27990l94175m93483m86232j2486l43416j67785k02810l88063K753
$$ 9122668 8894678 8500503 8007020 7520788 7508302 7164886 6997101 6794291 6406228 6408981
15423F408981p690m31092L941j30842l9206j40798r646l98030l5539O8556m80046
$$ 6408981 6401291 5970199 5974140 5843298 5804092 5663294 5653648 5255618 5220079 5288635 4808589
15412D808589L1241p5772J33517j05339J83628J43852j37211K88471j64157R1059
$$ 4808589 4839830 4764058 4897575 4792236 4975864 5119716 4982505 5270976 5106819 5197878
15402E197878l0516L33370k23740L26429P900K24788j72931O3300P2443k4868
$$ 5197878 5167362 5500732 5276992 5603421 5611321 5836109 5663178 5726478 5798921 5774053
15392E774053K44214j29405Q9971r6487J321L42080m83193M92137j26224L50572
$$ 5774053 6018267 5888862 5978833 5882346 5883667 6225747 5742554 6234691 6108467 6459039
15382F459039k1418J59013R114J87774j17798k81817M8723J90608k5178o5211
$$ 6459039 6437621 6596634 6605748 6793522 6675724 6393907 6442630 6633238 6608060 6542849
15372F542849j41959K04415N7503L1312l05640L21817K79903k1891J2004J58229
$$ 6542849 6400890 6605305 6662808 6694120 6388480 6710297 6990200 6968309 6980313 7138542
15362G138542M69491Q6692j43253L96126P5743J60053J81080O9417L03830J89784
$$ 7138542 7608033 7694725 7551472 7947598 8023341 8183394 8364474 8433891 8737721 8927505
15352H927505L55729J55900O83159P29137J872245L016658O164903Q008442P213270
$$ 8927505 9283234 9439134 10122293 10851430 12723675 15740333 21905236 29913678 37126948
15343C7126948N457623L578848K630621J892708J175272l0728k244664o357788
$$ 37126948 42584571 46163419 48794040 50686748 51862020 51831292 49586628 43228840
15335D3228840q863477q603442n625384k726739j421387p52606o04027m25603
$$ 43228840 34365363 25761921 20136537 17409798 15988411 15235805 14631778 14206175
15327A4206175J6667m73802m32363k08572k33016J20761n9104K60366K20204O59100
$$ 14206175 14222842 13749040 13316677 13108105 12875089 12995850 12936746 13197112 13417316 14076416
15317A4076416R25262J378497K304017M829704Q579465J2322870J3655423J2245969
$$ 14076416 15001678 16380175 18684192 23513896 32093361 44416231 58071654 70317623
15309G0317623R387031O304835L965101K596458O04319l053214q786093j4316639
$$ 70317623 79704654 86009489 89974590 92571048 93175367 90122153 81336060 67019421
15301F7019421j7000057j5097188r872838n936889k896996j704222j149478l02147
$$ 67019421 50019364 34922176 25049338 19112449 16215453 14511231 13361753 13059606
15293A3059606k31592p8905M2959q0437j79572L4355j55913J13840m1046j7264
$$ 13059606 12828014 12749109 12792068 12711631 12532059 12566414 12410501 12524341 12483295 12466031
15283A2466031P5781K8904Q85193J922554L720183O618102P438952O570534M230231
$$ 12466031 12541812 12570716 13455909 15378463 19098646 25716748 33155700 39726234 43956465
15274D3956465L061485K225927J137775Q82629j063207l064603o935869r289827
$$ 43956465 47017950 49243877 50381652 51264281 50201074 47136471 40200602 30910775
15266C0910775q149822n181464k741356j633479j015429r61262p39149p19649
$$ 30910775 22760953 17579489 14838133 13204654 12189225 11227963 10488814 9769165
15258I769165k72413n43883J80689n6587n6412J49461J99483N10966K49196M09742
$$ 9769165 9496752 8952869 9133558 9076971 9020559 9170020 9369503 9880469 10129665 10539407
15248A0539407N3671k71397j65398j98657l45232k0803l38660l6746m17848n26352
$$ 10539407 10593078 10321681 10156283 9957626 9612394 9591591 9252931 9216185 8798337 8271985
15238H271985l53559M14736J70304K03335L77413P03195N66512M40064m7881K35677
$$ 8271985 7918426 8333162 8503466 8706801 9084214 9787409 10353921 10793985 10746104 10981781
15228A0981781K02793j81599j83180k00708m29685k21281m71668m59366j5108
$$ 10981781 11184574 11002975 10819795 10619087 10189402 9968121 9496453 9037087 9021979
15219I021979j81760K28304K88619m7613L04976N59173N56952l6709N07975P968
$$ 9021979 8840219 9068523 9357142 9309529 9614505 10173678 10730630 10693921 11201896 11209864
15209A1209864j65821l27692n43139j28450o89726o69541n42835j16268o45661
$$ 11209864 11044043 10716351 10173212 10044762 9355036 8685495 8142660 8026392 7380731
15200G380731k34692K1177l48870j68833j28404m1720R1613j47011O394K80383
$$ 7380731 7146039 7167216 6818346 6649513 6521109 6479389 6571002 6423991 6430385 6710768
15190F710768j8447p612J81545J12217P4976P6188j05608L36260P2053k67967
$$ 6710768 6692321 6684709 6866254 6978471 7053447 7129635 7024027 7360287 7432340 7164373
15180G164373N0666J23890K49057Q766O3586l1719M71720j44178J07497P6057
$$ 7164373 7215039 7338929 7587986 7596752 7660338 7628619 8100339 7956161 8063658 8139715
15170H139715L4333l05194L43717j40539k21537K68829o9627j68721j08144M20948
$$ 8139715 8174048 7868854 8212571 8072032 7850495 8119324 8049697 7880976 7772832 8193780
15160H193780K5302j70439M09646J10455J75185K91293M0344j98613K08279p9213
$$ 8193780 8219082 8048643 8458289 8568744 8743929 9035222 9075566 8876953 9085232 9006019
15150I006019m4224J49203n23069j05795J48346j39723l0353M9020j06459L27269
$$ 9006019 8961795 9110998 8587929 8482134 8630480 8490757 8460404 8509424 8402965 8730234
15140H730234k45310p5809P443k77576J2353K4587j14929j83832K72688L30010
$$ 8730234 8484924 8409115 8416558 8138982 8151335 8175922 8060993 7877161 8149849 8479859
15130H479859n79031K42084j16123K59743k92928L6240R7020j74968J70406j78983
$$ 8479859 7900828 8142912 8026789 8286532 7993604 8029844 8126864 7951896 8122302 7943319
15120G943319O5559j49164K21574k56279Q0625l21735p6649M129J24021J90377
$$ 7943319 8008878 7859714 8081288 7825009 7905634 7583899 7507250 7511379 7635400 7825777
15110G825777O3697M0688J64817K35213R159J64930L01694J1441K93733L21393
$$ 7825777 7889474 7930162 8094979 8330192 8339351 8504281 8805975 8817416 9111149 9432542
15100I432542J88509L58113K1711K62753J29946M00447K53808M20156Q44973J116215
$$ 9432542 9621051 9979164 10000875 10263628 10393574 10794021 11047829 11467985 12312958 13429173
15090A3429173J644252K389433L545028K501322K056691J668420J171725Q91140
$$ 13429173 15073425 17462858 21007886 23509208 25565899 27234319 28406044 29297184
15082B9297184J29229j49928o62358j980088k706004j928010k18102J320005K637478
$$ 29297184 29426413 29276485 28614127 26634039 23928035 22000025 21781923 23101928 25739406
15073B5739406K708711K030411J528442J228667R83526N70724L64733k00224j029803
$$ 25739406 28448117 30478528 32006970 33235637 34219163 34789887 35154620 34954396 33924593
15064C3924593n98598J878535L114741K832038K525133K486844K208821K608068
$$ 33924593 33325995 35204530 38319271 41151309 43676442 46163286 48372107 50980175
15056E0980175K487988K553862P39494k743085l898859j953021R52264L314072
$$ 50980175 53468163 56022025 56761519 54018434 50119575 48166554 49118818 52432890
15048E2432890M289803L336170K172934O37391Q27120J466244K671688J996866
$$ 52432890 56722693 60058863 62231797 62869188 63696308 65162552 67834240 69831106
15040F9831106M98749j312902l134190k711052r01992Q4351J224450J259143J213744
$$ 69831106 70329855 69016953 65882763 63171711 62269719 62354070 63578520 64837663 66051407
15031F6051407K082753M234179O270072O424622N335402L760835K569977R65354
$$ 66051407 68134160 72368339 78638411 85063033 90398435 94159270 96729247 97694601
15023I7694601m63610j714020l468490n809742p613213p871575m520372k030657
$$ 97694601 97230991 95516971 92048481 86238739 78625526 70753951 66233579 64202922
15015F4202922K48350K56181K0618R4144L94232K07081K5365m22874k237679l582053
$$ 64202922 64451272 64707453 64728071 64822215 65216447 65423528 65448893 65026019 62788340 59206287
15005E9206287m691312m417977k616944j894834q67321l82195K5852J007292K171217
$$ 59206287 54514975 50096998 47480054 45585220 44717899 44335704 44361556 45368848 47540065
14996D7540065J702831J305069J557732J023320R37915o68771j070011j708835
$$ 47540065 49242896 50547965 52105697 53129017 54066932 53398161 52328150 50619315
14988E0619315j603742j139286K65954K16865J9724m21827R39579K82559P83744
$$ 50619315 49015573 47876287 48142241 48359106 48378830 47957003 48896582 49179141 49962885
14979D9962885N4821j262322l201532m131588l735848l126009k357709k641520
$$ 49962885 50017706 48755384 45553852 41422264 37686416 34560407 32202698 29561178
14971B9561178j982542j589518n66665j77141O0102R85896Q27422M52408Q52088
$$ 29561178 27578636 25989118 25422453 25245312 25305414 26291310 27118732 27571140 28423228
14962B8423228M49245Q15198J587858J856266L138178M226553O304463R038785
$$ 28423228 28872473 29687671 31275529 33131795 36269973 40496526 46800989 55839774
14954E5839774J2828610J7940465K2959752K6221678K9770905L3918203L6597723
$$ 55839774 68668384 86608849 109568601 135790279 165561184 199479387 236077110
14947B36077110L5671633L5729642L5231869K8188512J4754160J397668o996593
$$ 236077110 271748743 307478385 342710254 370898766 385652926 387050594 380054001
14940C80054001j3343719j8438556k2032064k4624131k9049876l4049547l2277777
$$ 380054001 366710282 348271726 326239662 301615531 272565655 238516108 206238331
14933B06238331k3775720j3812486q237675p809345j0022119j2611900j3788422
$$ 206238331 182462611 168650125 160412450 152603105 142580986 129969086 116180664
14926A16180664j1366900q987641o098142l390540k026248k989106l627486l241955
$$ 116180664 104813764 95826123 89727981 86337441 84311193 81322087 77694601 74452646
14918G4452646l261149l108848l209280m271463o556386r477754j0033959q585396
$$ 74452646 71191497 68082649 64873369 60601906 54045520 44567766 34533807 25948411
14910B5948411n487155k979525k146268j043345q73092r3964N16600J76265O21015
$$ 25948411 20461256 17481731 15335463 14292118 13419026 13325062 13841662 14017927 14638942
14901A4638942J040514J256238J307594J317857J919918L021468M613886N365303
$$ 14638942 15679456 16935694 18243288 19561145 21481063 24502531 29116417 34481720
14893C4481720N201603L577875K186550Q98143O98247L16463m31647k583482n172357
$$ 34481720 39683323 43261198 45447748 46345891 47044138 47360601 46928954 44345472 39173115
14884C9173115p057948o852605m954590k744572j445585p70094o13453k50891
$$ 39173115 32115167 25262562 20307972 17563400 16117815 15347721 14734268 14483377
14876A4483377M35112R49248J249150P04961P70365K91437O95826J89349J20479
$$ 14483377 14918489 15867737 17116887 17821848 18592213 18883650 19579476 19768825 19889304
14867A9889304M19219M56729p03426k35441k18708Q28463J504669L310205N745981
$$ 19889304 20308523 20765252 20061826 19826385 19607677 20436140 21940809 25251014 30996995
14858C0996995P904669R107494R964627J0248625J0127252Q397714O190966L283236
$$ 30996995 38901664 48009158 57973785 68222410 78349662 86747376 92938342 96221578
14850I6221578L67151l475718p184300r973430j0986624j1716542j1586519r761659
$$ 96221578 96588729 93113011 85928711 75955281 64968657 53252115 41665596 31903937
14842C1903937o745806m126514k153261j457293j130855r59009m14186n17708
$$ 31903937 25158131 21031617 18878356 17421063 16290208 15331199 14917013 14399305
14834A4399305k59810L84083k3084K23874n7083K54147J20028P50157O77572O89503
$$ 14399305 14139495 14523578 14500494 14724368 14667285 14921432 15041460 15791617 16469189 17158692
14824A7158692P62198R67466J575563K306426M580375O954474Q180597Q483501
$$ 17158692 17920890 18888356 20463919 22770345 27350720 34305194 42485791 50969292
14816E0969292N646100M075105K775832J321655L51712j263626m250010q187755
$$ 50969292 56615392 60690497 63466329 64787984 65139696 63876070 59626060 51438305
14808E1438305j0469431j0861903p882676n107899k286263j538251j043500o18005
$$ 51438305 40968874 30106971 22224295 17116396 14830133 13291882 12248382 11630377
14800A1630377p43730k91012j66581l55781k60161k44316m66424j32121o53233
$$ 11630377 10886647 10595635 10429054 10073273 9813112 9568796 9102372 8970251 8317018
14791H317018l79690P347k56244j97813k45079j01952K1961L54325K00575J98093
$$ 8317018 7937328 7944675 7688431 7490618 7245539 7143587 7165548 7519873 7720448 7918541
14781G918541K06343O17273O46989J077402M77662N30131N10083N06892r3949
$$ 7918541 8124884 8742157 9389146 10466548 10944210 11474341 11984424 12491316 12397367
14772A2397367J05051n73425j92599p37349j095672q76077m39727k64545j04297
$$ 12397367 12502418 11928993 11736394 10999045 9903373 9027296 8587569 8323024 8218727
14763H218727Q2108J00824j05083P0463M06158L41053K45260L77349K22308J01346
$$ 8218727 8300835 8401659 8296576 8367039 8773197 9114250 9359510 9736859 9959167 10060513
14753A0060513L9759j47788O04921k81182J63419L91326j28156l01453O41141
$$ 10060513 10100272 9952484 10557405 10276223 10439642 10830968 10702812 10401359 11042500
14744A1042500j26352M82551M46679L22238O72348Q80412P78837J581388J777133
$$ 11042500 10916148 11398699 11845378 12167616 12839964 13720376 14499213 16080601 17857734
14735A7857734K600953L656758M948603P111779J1373719J7797145K6760710L3913176
$$ 17857734 20458687 24115445 29064048 36175827 47549546 65346691 92107401 126020577
14727A26020577L5969749L6411559L1335717K3751550J6117903Q552508L66163
$$ 126020577 161990326 198401885 229737602 253489152 269607055 278159563 278525726
14720B78525726j0310364k4460576l5151970m0910332m1640652l5841570k6528282
$$ 278525726 268215362 243754786 208602816 167692484 126051832 90210262 63681980
14713F3681980j7348507j0572452o694505m526739l515023k413054j919264j183295
$$ 63681980 46333473 35761021 29066516 24539777 21024754 18611700 16692436 15509141
14705A5509141j025594j127958q10396j136584j070179p29680p44473n00216k46460
$$ 15509141 14483547 13355589 12545193 11408609 10338430 9608750 8864277 8364061 8117601
14696H117601k87950j35797J21402q7181m7974p1845K07476M0981M57814N4668
$$ 8117601 7829651 7693854 7815256 7728075 7680101 7608256 7815732 7856713 8314527 8369195
14686H369195l902l34043J79214o14132L86885P1435K08740K35435J12768M02742
$$ 8369195 8365293 8031250 8210464 7596332 7983217 8054652 8263392 8498827 8611595 9014337
14676I014337R07582O73643O31169K48451M9310k95632o4037L7742l13658q23001
$$ 9014337 9921919 10595562 11226731 11475182 11524492 11228860 11164823 11202565 10888907 10065906
14666A0065906n23410n85306l18586O913j76262o1932J08390K44404L25845l48039
$$ 10065906 9542496 8957190 8638604 8645517 8469255 8407323 8515713 8760117 9085962 8737923
14656H737923r6090r99645q40727p55187j80533N3952l4841J25738K43783O02342
$$ 8737923 8641833 7642188 6801461 6046274 5865741 5919693 5884852 6010590 6254373 6856715
14646F856715K19270L32103K36388l6640K25200L07500J53338k64173J91075k06291
$$ 6856715 7075985 7408088 7644476 7607836 7833036 8140536 8293874 8029701 8220776 8014485
14636H014485J77940L53385L33747N19209k71313K64555l62155K2168n78320o33397
$$ 8014485 8192425 8545810 8879557 9398766 9127453 9392008 9029853 9052021 8473701 7840304
14626G840304m70742r67799l73660r25318k10627m8741N2359k08267o6604J21079
$$ 7840304 7369562 6401763 6028103 5102785 4892158 4843417 4895776 4687509 4620905 4741984
14616D741984l1503j42670p6043l53456j16854P1525p3269j46726N4639j17149
$$ 4741984 4710481 4567811 4491768 4138312 4021458 4092983 4019714 3872988 3927627 3810478
14606C810478r5993k60736n4107j36786O7430M61482K05957J83764P61352O94155
$$ 3810478 3714485 3453749 3399642 3262856 3330286 3791768 3997725 4181489 4942841 5636996
14596E636996O01809M73328O0671J43149m7370j08924l39701l57282o64962m02716
$$ 5636996 6238805 6712133 6772804 6915953 6868583 6759659 6419958 6062676 5397714 4994998
14586D994998q50436k1474j64116m21379K43569p4696J21680J55438O7595N6258
$$ 4994998 4144562 4123088 3958972 3537593 3781162 3706466 3828146 3983584 4051179 4107437
14576D107437j98449K95586j68198M86735O6839K93765j04958O7765M29904O95891
$$ 4107437 3908988 4204574 4036376 4523111 4589950 4883715 4778757 4846522 5276426 5972317
14566E972317M70792J252530O82769O95916J173951J411536L506098O294322Q506765
$$ 5972317 6443109 7695639 8378408 9074324 10248275 11659811 15165909 21460231 29966996
14557B9966996Q177740N049322L885840K474896K001668J431732J11768j703486
$$ 29966996 38144736 43194058 47079898 49554794 51556462 52988194 53099962 51396476
14549E1396476o163070r279188r299495n708911o18092K657900P087724Q810378
$$ 51396476 45233406 35954218 26654723 20945812 20327720 22985620 30073344 38883722
14541C8883722P773734N083296M160025K192328J364480J17155j474684m855937
$$ 38883722 46657456 51740752 55900777 58093105 59457585 59574740 58100056 53244119
14533E3244119r474469j1195988r086686n330492k631813j748623m78219O2681
$$ 53244119 43769650 32573662 23486976 18156484 15524671 13776048 13297829 13360510
14525A3360510P4750K4931M26680M64947N46910K254434M514279O265762M987713
$$ 13360510 13435260 13460191 13886871 14351818 14898728 17153162 21667441 27933203 32920916
14516C2920916L833647K464508J889112J461748J257404n1582j687771n077738
$$ 32920916 36754563 39219071 41108183 42569931 43827335 43775753 42087982 37010244
14508C7010244p182270n344414k751369N92190L381802N768309N686668M279222
$$ 37010244 29827974 24483560 21732191 22324381 25706183 31474492 37161160 41440382
14500D1440382K367926J650753R44260L68156j036163j869870m380519o919442
$$ 41440382 43808308 45459061 46403321 46771477 45735314 43865444 39484925 32565483
14492C2565483p396837n346933l436861k049006j456726j228894q75848r43616
$$ 32565483 25168646 19821713 16384852 14335846 12879120 11650226 10774378 9830762
14484I830762j173968j149903j378650r96737n22529q5362n05067L56239j14144
$$ 9830762 8656794 7506891 6128241 5131504 4608975 4523613 4018546 4374785 4260641
14475D260641K2499k38385K07432k403L80106M56896L35030M37460J51420L26
$$ 4260641 4283140 4044755 4252187 4249784 4629890 5086786 5421816 5859276 6010696 6011022
14465F011022M00677j8348J49024J97715j71069l26680N9149K41347L99754L19498
$$ 6011022 6411699 6393351 6542375 6740090 6569021 6242341 6301490 6542837 6942591 7262089
14455G262089K04310J57966K31282l32744N6306k29389m45806m08226l57751p850
$$ 7262089 7466399 7624365 7855647 7522903 7579209 7349820 6904014 6495788 6138037 6130187
14445F130187J75184K09775M26227K73889J84380O65447K79933m0507K46969K6211
$$ 6130187 6305371 6515146 6941373 7215262 7399642 8065089 8345022 8304515 8551484 8577695
14435H577695L61014j68650N34311N11031O94614J452290K827301L904226O025106
$$ 8577695 8938709 8770059 9304370 9815401 10510015 11962305 14789606 18693832 24718938
14426B4718938O070998O024220M384146L799164K501176J770064N32642j247877
$$ 24718938 30789936 36814156 41198302 44997466 47498642 49268706 49801348 48553471
14418D8553471l597992o243064p205909o945227m956793l701322k315426j754441
$$ 48553471 44955479 38712415 31506506 24561279 19604486 15903164 13587738 11833297
14410A1833297j058231j001035o60212n20451M3408j55057J58175j2654j51964
$$ 11833297 10775066 9774031 9113819 8593368 8636776 8481719 8639894 8627240 8475276
14401H475276J00620l0292L87259M16736L93179R87056J570036J868000L692399
$$ 8475276 8575896 8545604 8932863 9349599 9742778 10729834 12299870 14167870 17860269
14392A7860269N603040Q166426J0479159J0296649R498534P497668N747358L842949
$$ 17860269 23463309 31629735 42108894 52405543 61904077 69401745 75149103 78992052
14384G8992052J441297o25653m190758p866434j1121992j2033098j0779036q515603
$$ 78992052 80433349 79807696 75616938 67750504 56628512 44595414 33816378 25300775
14376B5300775n506782m044807k631226j346047j000224o27349m31966l53702
$$ 25300775 19793993 15749186 13117960 11771913 10771689 10144340 9712374 9358672
14368I358672m05319J01675r4998J52441J70561R8088M2873O36209L25570Q08541
$$ 9358672 8953353 9055028 8960030 9112471 9283032 9381120 9423993 10060202 10385772 11194313
14358A1194313J210304J792399K416405L826621M132853N806792O152044N771345
$$ 11194313 12404617 14197016 16613421 20440042 24572895 30379687 36531731 42303076
14350D2303076N667800N790210N848450N763551O385024O143195M549233K646135
$$ 42303076 47970876 53761086 59609536 65373087 71758111 77901306 82450539 85096674
14342H5096674N05886m76808j332571j675533k560701m329814n077810o600711
$$ 85096674 85602560 85125752 83793181 82117648 79556947 75227133 70149323 63548612
14334F3548612p809514p891319o787669n261216m270117k924660l060000k542531
$$ 63548612 55739098 47847779 41060110 35798894 31528777 28604117 25544117 23001586
14326B3001586m162220m242362l518393j738297j585627n59816o83538o93531
$$ 23001586 18839366 14597004 11078611 9340314 7754687 7194871 6511333 5817802
14318E817802k62573n15389j94143l55676k53765j84403j52193j40550k9921j12364
$$ 5817802 5555229 5039840 4845697 4490021 4236256 4051853 3899660 3759110 3729189 3616825
14308C616825k82966k61234J72223j42932j07967P6821p0488l52239l9666p3627
$$ 3616825 3333859 3072625 3244848 3101916 2993949 3070770 3000282 2648043 2608377 2534750
14298B534750Q5589R4979o7855p8707K08516j15177j9487j26566m3844k15936
$$ 2534750 2620339 2715318 2647463 2568756 2777272 2662095 2642608 2516042 2472198 2256262
14288B256262M9548R9788O9656j66697K09804k38769K34242j31494J22784O7839
$$ 2256262 2305810 2405598 2475254 2308557 2518361 2279592 2513834 2382340 2505124 2572963
14278B572963L5824J01541k2721J97024j7876O5688k47248J32983n7930L3147
$$ 2572963 2608787 2710328 2687607 2884631 2866755 2932443 2685195 2818178 2760248 2793395
14268B793395j5702K66593k19035J7501m39590j1675J5329K2855K48J78332n41857
$$ 2793395 2777693 3044286 2825251 2842752 2403162 2391487 2406816 2429671 2429919 2608251 2066394
14257B066394K07949m4299K5773l32531J71572J07503l37173K12831p5993p4395
$$ 2066394 2274343 2230044 2255817 1923286 2094858 2202361 1865188 2078019 2002026 1927631
14247A927631o7958N6867j56034J11525J50792j56031J7328n8046O0198J48119
$$ 1927631 1859673 1916540 1760506 1872031 2022823 1866792 1884120 1826074 1886272 2034391
14237B034391J73097L4226k05010K11816J07086J45010j29069l4040j25926k17671
$$ 2034391 2207488 2241714 2036704 2248520 2355606 2500616 2371547 2337507 2211581 1993910
14227A993910P4454j32919k04019J46897l6438R7362n459J24761J23269j82040
$$ 1993910 2068364 1935445 1731426 1878323 1841885 1939247 1933788 2058549 2181818 1999778
14217A999778q9691N08545M3131Q4821J23361L6833n1396l0960J45323J92207
$$ 1999778 1910087 2418632 2461763 2546584 2669945 2706778 2655382 2624422 2769745 2961952
14207B961952Q89608J1133J21329K19277p4885R3262L0909o0937O5944n60826
$$ 2961952 3851560 3862693 3984022 4203299 4128414 4221676 4252585 4191648 4257592 3696766
14197C696766o89237q01372k48542q64l4553K1063j41576L51316p496j9777o1513
$$ 3696766 3007529 2206157 1957615 1956751 1922198 1943261 1801685 2153001 2145505 2125728 2064215
14186B064215J8197j05349k8030k16509P8717M61479q2690k3362K65766J31774
$$ 2064215 2082412 1977063 1949033 1732524 1811241 2272720 2190030 2166668 2432434 2564208
14176B564208Q1089O13314k04925O5665O1546r7225m9506n06540N2693k01909
$$ 2564208 2645297 3258611 3053686 3119351 3180897 3083672 3034166 2527626 2580319 2378410
14166B378410m21009p164j5205r8354J8699L09420j1709j8422l81034K16544K25702
$$ 2378410 1957401 1950237 1935032 1836678 1855377 2164797 2153088 2134666 1753632 1970176 2195878
14155B195878N3601N3737J33109K8238L6170M5321Q6317k84986J04470J07189
$$ 2195878 2249479 2303216 2436325 2464563 2500733 2546054 2632371 2347385 2451855 2559044
14145B559044R4566l7939K81128N03053M39257P95387J249271R30241P04064P03097
$$ 2559044 2653610 2615671 2896799 3399852 3839109 4634496 5883767 6814008 7518072 8221169
14135H221169P83424J95685L70732r5008k64323o53880j069054j510057r34236
$$ 8221169 9004593 9200278 9571010 9476002 9211679 8557799 7488745 5978688 5044452
14126E044452m81777q16764r9174m45881K9615R642L307J68036K02631O2177r2050
$$ 5044452 4562675 3745911 3646737 3200856 3230471 3240113 3243420 3411456 3614087 3676264 3584214
14115C584214K12444J95855j17266J36569j84885l99147j86854M5864n34081m2385
$$ 3584214 3796658 3992513 3875247 4011816 3826931 3427784 3240930 3286794 2752713 2710328
14105B710328R7107N799j73417M53236p445K63975J38996M37865L25482O31059
$$ 2710328 2807435 2813234 2639817 3093053 3085608 3349583 3488579 3926444 4251926 4882985
14095D882985M36131K90317Q2974L05660L85412r0989k16573L3339n12602K24676
$$ 4882985 5319116 5609433 5692407 5998067 6383479 6292490 6075917 6109256 5596654 5821330
14085E821330Q7955M79638L77369Q64753N84048Q35777O10104Q50483J025685
$$ 5821330 5909285 6388923 6766292 7631045 8215093 9050870 9660974 10511457 11537142
14076A1537142R64134J772608J717418J981119K845088M113618N575707P213939
$$ 11537142 12501276 14273884 15991302 17972421 20817509 24931127 30506834 37720773
14068C7720773Q554221Q530879P968444O450428M341323K870143J253164q21919
$$ 37720773 46274994 54805873 62774317 69224745 73566068 76436211 77689375 76867456
14060G6867456l429827o169005q363079r582248r113111q022947n772396m918323
$$ 76867456 73437629 67268624 58905545 49323297 40210186 32187239 26414843 21496520
14052B1496520l780957k553852k216351j988351j264434j023886q15047j81882
$$ 21496520 17715563 15161711 12945360 10957009 9692575 8668689 7853642 7671760
14044G671760o33888j15323l22929k48830l07866J1218l96441l38143m94054k26111
$$ 7671760 7037872 6922549 6599620 6350790 6042924 6054142 5657701 5319558 4825504 4599393
14034D599393l90427j29906n82754r7794k27452R9058k18984j32111k29668O0761
$$ 4599393 4208966 4079060 3496306 3398512 3171060 3270118 3051134 2919023 2689355 2750116
14024B750116k12575m3J13319J09262l21275n5334j96606Q3078J27036L5452j47994
$$ 2750116 2537541 2537498 2650817 2760079 2438804 2383470 2186864 2269942 2396978 2432430 2284436
14013B284436K31024j39126R0731j38846j4860P7095k43545P8865J35343j52128
$$ 2284436 2515460 2376334 2467065 2328219 2313359 2390454 2146909 2225774 2361117 2208989
14003B208989k2729Q4566k58460j8285K10141O4995k16785L44095K0758r533p4872
$$ 2208989 2186260 2270826 2012366 1994081 2204222 2269217 2052432 2396527 2417285 2407752 2332880
13992B332880M32001R3125J70171K68467M40893N57341P12340J418989J456224
$$ 2332880 2764881 2858006 3028177 3296644 3737537 4294878 5007218 6426207 7882431
13983G882431J224894R14312O25163N36413M0911r106j61967j015101j146313
$$ 7882431 9107325 10021637 10646800 11183213 11224124 11215018 11053051 10037950 8891637
13974H891637j545789j372794j072046o13502n02102k68866l73229J25647j85391
$$ 8891637 7345848 5973054 4901008 4287506 3785404 3516538 3143309 3268956 3083565
13965C083565j30484j75639N3645J0971j03329O7915k47351m8503j25846R001
$$ 3083565 2953081 2777442 2831087 2842058 2738729 2806644 2559293 2510790 2384944 2393945
13955B393945j38227K0090j4668P0019p7914J16596J44090J28598J2114L45943
$$ 2393945 2255718 2275808 2261140 2331159 2253245 2369841 2513931 2642529 2654643 3000586
13945C000586K41610L4039J74500N92934P27943J704215J483326K151645J705226
$$ 3000586 3242196 3276235 3450735 4043669 4771612 6475827 7959153 10110798 11816024
13936A1816024J893443J957943J089848O39108N14380r60214j251695k078813
$$ 11816024 13709467 15667410 16757258 17396366 17910746 16950532 15698837 13620024
13928A3620024k285254k144829k455887j667797j251609o84083m65605l15412
$$ 13620024 11334770 9189941 6734054 5066257 3814648 3130565 2664960 2349548
13920B349548K3840l12446j69197j68404M0657j45986J41621j28499J2502o2828
$$ 2349548 2373388 2060942 1891745 1723341 1763998 1618012 1759633 1631134 1643636 1580808
13910A580808J390k4614P8454j18446R240K40634k98505n6399L25113l96497n0162
$$ 1580808 1582198 1557584 1636038 1517592 1526832 1767466 1468961 1412562 1737675 1341178 1291016
13899A291016m6906K60196k16925k9503K57974m3352L2719R4903k98095K35102
$$ 1291016 1244110 1504306 1287381 1257878 1515852 1472500 1505219 1600122 1302027 1537129
13889A537129k59609L56962J48543l67333L9348l15444L88476m1462j35791n9277
$$ 1537129 1277520 1634482 1783025 1415692 1455040 1139596 1528072 1486610 1350819 1291542
13879A291542K38229k01905O9355K9381J83267l43136L23722j22813j55068J59165
$$ 1291542 1529771 1327866 1397221 1426602 1609869 1266733 1590455 1467642 1312574 1471739
13869A471739o5113q0506J49936P9834J8107j6432K43207k16903P8105J69677
$$ 1471739 1406626 1326120 1476056 1555890 1573997 1557565 1800772 1583869 1661974 1831651
13859A831651k4787j8811m17953J72786o0040O1833J68590k10175O746K46507
$$ 1831651 1806864 1788053 1370100 1542886 1482846 1544679 1713269 1503094 1509840 1756347
13849A756347j54444j25649L496J24741j28788P6927m3585J38612M3570k29138
$$ 1756347 1601903 1476254 1479750 1604491 1475703 1552630 1509045 1647657 1691227 1462089
13839A462089j05637J88945q3135j86192J98646p8194p5832J35980k60077K57481
$$ 1462089 1356452 1545397 1462262 1276070 1474716 1396522 1320690 1456670 1196593 1454074
13829A454074j75479J22268L0171k5848j27689K24635q0413J42902M98k54774
$$ 1454074 1278595 1400863 1431034 1405186 1277497 1502132 1421719 1564621 1565119 1310345
13819A310345J9818q7540j4764m3163n425J17411n5369J31802j25528k8542j45678
$$ 1310345 1330163 1242623 1227859 1184696 1179271 1296682 1241313 1373115 1247587 1219045 1073367
13808A073367R0182Q7353o9478J78720p0144R2986K062j527M3067P2462j71233
$$ 1073367 1163549 1250902 1181424 1360144 1290000 1382986 1385048 1383521 1426588 1499050 1327817
13797A327817J05774n542r9228K106J48394l20763M08687j93797j84284J64502
$$ 1327817 1433591 1428049 1328821 1330927 1479321 1158558 1567245 1373448 1189164 1353666
13787A353666Q5287k85049Q1622J27293N1164r3654J76721J44011j59448P4459
$$ 1353666 1438953 1153904 1235526 1362819 1413983 1320329 1497050 1641061 1481613 1556072
13777A556072M4299J50529j07926J09159O6837l49320M1693k38898K52954k9252
$$ 1556072 1600371 1750900 1642974 1752133 1818970 1469650 1511343 1272445 1525399 1496147
13767A496147m2422k8262O7412P5094O3380l28776K09958k70261J73217p5544
$$ 1496147 1453725 1425463 1492875 1567969 1631349 1302573 1512531 1242270 1415487 1339943
13757A339943k2754P2763r2682Q4426j72022J17024K25376P6912k68649K23010
$$ 1339943 1317189 1389952 1297270 1381696 1209674 1326698 1552074 1628986 1360337 1583347
13747A583347j57159k1855l3773J44106L3016P6454K4566k11705L08541K936L9186
$$ 1583347 1426188 1404333 1370560 1514666 1547682 1624136 1648702 1436997 1745538 1748474 1787660
13736A787660j77013K79048k17173p6050K15993j75659J60149m0628L2392J22378
$$ 1787660 1610647 1889695 1672522 1596472 1812465 1636806 1796955 1756327 1788719 1911097
13726A911097j61763N22j28751M10743m31887M45427k14782p9761L18033r0496
$$ 1911097 1749334 1749856 1621105 2031848 1599961 2045388 1830606 1750845 2068878 1978382
13716A978382j12631j473K46929M395J13535k78186M9286j52086K36480l1154
$$ 1978382 1865751 1864278 2111207 2115602 2229137 1950951 2000237 1848151 2084631 2053477
13706B053477p5258K66340J57790m69516K52430k38340r1389J57482J25221l8198
$$ 2053477 1978219 2244559 2402349 1932833 2185263 1946923 1855534 2013016 2138237 2100039
13696B100039m5636K9894L2991L38069o4091J05293J11687p6962J71646r5292
$$ 2100039 2054403 2084297 2117288 2455357 2391266 2496559 2608246 2531284 2702930 2607638
13686B607638M7434m00988l44618M1373k1418N1772j15617j79956O9079Q2909
$$ 2607638 2655072 2254084 1909466 1950839 1929421 1981193 1865576 1685620 1754699 1837608
13676A837608n3171K15181J22443j32347K0243k77550Q82M00823j35210j17983
$$ 1837608 1784437 1999618 2122061 1989714 2009957 1732407 1733289 2134112 1998902 1880919
13666A880919J20557L45482K01102J64340m2396r9645L2269L8246o8065J53204
$$ 1880919 2001476 2346958 2548060 2712400 2670004 2570359 2602628 2640874 2572809 2726013
13656B726013j00051j72220j00386k10179K25293o3449k52770K53797k70048o7840
$$ 2726013 2625962 2453742 2353356 2143177 2368470 2305021 2052251 2306048 2036000 1968160
13646A968160o0501L44719k10037o2481R3239k26665J55050j77661O181J42311
$$ 1968160 1907659 2252378 2042341 1979860 2073099 1846434 2001484 1823823 1830004 1972315
13636A972315L20663j38208K54302j54185J96649J39241J07856O2207k12147r5961
$$ 1972315 2292978 2154770 2409072 2254887 2451536 2590777 2698633 2760840 2548693 2452732
13626B452732j64204J70825m05361o5746l55409K32095j84328M71320j21944j84149
$$ 2452732 2288528 2459353 2053992 1988246 1632837 1864932 1680604 2151924 2029980 1845831
13616A845831l7825K55573k02014m7958J14107M3039J19290l1411K33851j97814
$$ 1845831 1808006 2063579 1861565 1813607 1927714 1970753 2090043 2058632 2292483 2094669
13606B094669J54481n9609J16521l01846K87292k23127j11905J05656k64598K51193
$$ 2094669 2249150 2189541 2306062 2004216 2291508 2068381 1956476 2062132 1797534 2048727
13596B048727j78105L08629j18321n2544J004K38413j1142j92394o7850m4351
$$ 2048727 1870622 2179251 2060930 2008386 2009390 2247803 2236661 2044267 1976417 1932066
13586A932066p0567K11805j82651n3284j49715J25836r7286J45936q9223J27646
$$ 1932066 1861499 2073304 1890653 1837369 1687654 1813490 1716204 1862140 1772917 1900563
13576A900563L0773j42447j31996P698p4702O1643M9417M810k6957j56138M5215
$$ 1900563 1931336 1788889 1656893 1664591 1589889 1651532 1700949 1705759 1678802 1522664 1567879
13565A567879J47797J87505k42974O5412j82119K42762q9062J42292k63798p4514
$$ 1567879 1715676 1903181 1660207 1725619 1543500 1786262 1697200 1839492 1575694 1501180
13555A501180R4892Q6807k66302j70270L05542J77568k64217L51585l5507M9508
$$ 1501180 1596072 1682879 1416577 1246307 1551849 1729417 1465200 1816785 1781278 1830786
13545A830786N8047Q9629P1972O9526O6466K31167q4361j9845P7606j56438l9083
$$ 1830786 1888833 1978462 2050434 2119960 2186426 2417593 2333232 2313387 2390993 2234555 2195472
13534B195472p9642k6089m8787k76085L3730o5659J14217j43252Q4252K81256
$$ 2195472 2115830 2089741 2040954 1764869 1798599 1732940 1847157 1703905 1788157 2069413
13524B069413K17394r2391p1223J89365K34300k05206j63509p2005k67792J47006
$$ 2069413 2286807 2194416 2123193 2312558 2546858 2341652 2178143 2106138 1838346 1985352
13514A985352l16986K1425j9909k98938M8632K8351J19591k34386j19873k9887
$$ 1985352 1668366 1689791 1669882 1370944 1419576 1447927 1567518 1333132 1213259 1183372
13504A183372K55313J72768l00753J37539N7421q6424k23504K92993j73962J54201
$$ 1183372 1438685 1611453 1310700 1448239 1505660 1419236 1195732 1488725 1314763 1468964
13494A468964l679L8065l07150K14824j93129l8638L99333j37925Q867K2440m3337
$$ 1468964 1465285 1503350 1196200 1411024 1217895 1179257 1578590 1440665 1449532 1471972 1428635
13483A428635M8086P3457N4955J07183k09450k56721N3507K93721k48876K12819
$$ 1428635 1476721 1550178 1605133 1712316 1502866 1246145 1299652 1593373 1344497 1557316
13473A557316k88685K39988n7307j56528L44801j52255m7918J62211k12821n0244
$$ 1557316 1268631 1508619 1451312 1294784 1639585 1487330 1439412 1601623 1388802 1338558
13463A338558K10237M3047k25397O9926q2099K13808M7534p3422K09094P6L23928
$$ 1338558 1548795 1591842 1366445 1436371 1354272 1568080 1615614 1542192 1751286 1751362 2075290
13452B075290j81223J89480K51804p3030K10505J93047m71328M4508K86146l97570
$$ 2075290 1894067 2083547 2335351 2262321 2472826 2665873 2194545 2239053 2525199 2127629
13442B127629l11973m0327J99485j3913l66453n8488P051j26326P0677O2048J67552
$$ 2127629 1815656 1775329 1974814 1960901 1594448 1535960 1543011 1416685 1487362 1549410 1716962
13431A716962k43182J97546r2943m7766M7077R7868q3091J80393K81755J34041
$$ 1716962 1473780 1671326 1578383 1530617 1577694 1675562 1592471 1772864 2054619 2188660
13421B188660j83098L60515K9326J41079L2072k46646K88902q8304k46034j00200
$$ 2188660 2005562 2366077 2395403 2536482 2568554 2321908 2610810 2522506 2276472 2176272
13411B176272k37359O5133P941k24592j654j83535K65343j13523R2892n5880M8388
$$ 2176272 1938913 2004046 2011987 1787395 1785741 1602206 1867549 1754026 1846918 1791038 1839426
13400A839426K9434k1521J6367j98041O6320L7943J12589J20539J64906o1386
$$ 1839426 1868860 1847339 1863706 1665665 1731985 1769928 1882517 2003056 2167962 2106576
13390B106576K2490M6857K11594q8498M2779n45K84675j70458N6623r800M2466
$$ 2106576 2129066 2175923 2387517 2299019 2341798 2341253 2625928 2455470 2512093 2502293 2544759
13379B544759K73239k27285j4105j11404K53641m22053o709K637P9698j40504
$$ 2544759 2817998 2590713 2576608 2465204 2718845 2296792 2290083 2292720 2372418 2231914
13369B231914J08837k1621k29246M36908j65999n0907J06817r2619o9240L2652
$$ 2231914 2340751 2319130 2089884 2526792 2360793 2309886 2416703 2324084 2254844 2287496
13359B287496J68417k4927j24511j5217J66580J2100J06865L162O6558n7573J3055
$$ 2287496 2455913 2430986 2306475 2291258 2457838 2469938 2576803 2579965 2646523 2588950 2602005
13348B602005K77675k68037J21068j71285j18099N8602J28745m4794k57689P2554
$$ 2602005 2879680 2611643 2732711 2561426 2443327 2501929 2630674 2585880 2328191 2400745
13338B400745k5595J34801j30921P5491P4478l30415K48610j32825K4991L21984
$$ 2400745 2375150 2509951 2379030 2454521 2528999 2198584 2447194 2314369 2339360 2661344
13328B661344k39275O5199J25890J09562j61917K10389j59065P5973l8890M17973
$$ 2661344 2422069 2487268 2613158 2722720 2560803 2771192 2612127 2688100 2649210 3067183
13318C067183k72255n7834J26670R3788J0594L22575J43044r5464M2027K3952
$$ 3067183 2794928 2737094 2863764 2957552 2968146 3290721 3433765 3338301 3380328 3404280
13308C404280J17061k25768J62898R0914l00347K85105k96017k4098K31941K31769
$$ 3404280 3521341 3295573 3458471 3549385 3249038 3534143 3238126 3214028 3445969 3677738
13298C677738m4009K4678P6730n3106K78084K4636L3274j16765l2592O0188m3673
$$ 3677738 3633729 3658407 3735137 3682031 3960115 3984751 4018025 3901260 3868668 3928856 3885183
13287C885183L1899m5254K39739q8985j3065j64246J29894L8068n9444K75569
$$ 3885183 3917082 3871828 4111567 4022582 4009517 3845271 3975165 4013233 3953789 4229358
13277D229358j72131J78024j81489J63316K84162j46199J66874K7742J55879k06866
$$ 4229358 4057227 4235251 4053762 4217078 4501240 4355041 4521915 4549657 4705536 4498670
13267D498670K99242j84371K2109N8733K00058l3179M41848k8958j38316L81260
$$ 4498670 4797912 4613541 4635650 4694383 4894441 4861262 5303110 5274152 5135836 5517096
13257E517096J53779K97029k30780M69661j98653K62037K35750l4813N38556q3776
$$ 5517096 5670875 5967904 5737124 6206785 6008132 6270169 6505919 6471106 7009662 6925886
13247F925886L38082L6532K67730J85601L64007J7991J49328K62613p3940K62735
$$ 6925886 7263968 7300500 7568230 7753831 8117838 8135829 8285157 8547770 8473830 8736565
13237H736565J28211J25891J41669k82956J23033M43182l06596K75151N40191
$$ 8736565 8864776 8990667 9132336 8849380 8972413 9415595 9108999 9384150 9924341
13228I924341j71848J78105L87704L08522K54761L30917J79357N06831J6334L68993
$$ 9924341 9752493 9930598 10318302 10626824 10881585 11212502 11391859 11898690 11915024 12284017
13218A2284017Q3556J29821J55786j3155j21413K20113m84543j1603m24599j4990
$$ 12284017 12367573 12497394 12653180 12640025 12518612 12738725 12254182 12242579 11817980 11802990
13208A1802990l35564l71305j42928j30858k42642l7530m33038J22807j02550
$$ 11802990 11467426 11096121 10953193 10822335 10579693 10542163 10109125 10231932 10129382
13199A0129382M6265k30229k94566K14784k40492J72929j81810k70003n5828j31000
$$ 10129382 10175647 9945418 9650852 9865636 9625144 9798073 9616263 9346260 9290432 9159432
13189I159432k55374k63335k51859j68698j58182k96685k32448j20000l99861
$$ 9159432 8904058 8640723 8388864 8220166 8061984 7765299 7532851 7412851 7012990
13180G012990l16072j53473k75980k49235L2624j25719j19556l00981L5839k21424
$$ 7012990 6696918 6543445 6267465 6018230 6050854 5925135 5805579 5504598 5540437 5319013
13170E319013J68491k27799o8187Q692N0172K17216l7401R1900J6079K96318j37573
$$ 5319013 5487504 5259705 5191518 5200210 5250382 5467598 5430197 5522097 5538176 5834494 5696921
13159E696921M72376Q100J98522Q8224J98412J08484J4685n3374k3126j95363
$$ 5696921 6169297 6177397 6375919 6464143 6662555 6771039 6785724 6732350 6709224 6513861
13149F513861j3910J08803j38380J45957j80054j52264p0198j11408o5393j15578
$$ 6513861 6499951 6608754 6470374 6616331 6436277 6284013 6213815 6102407 6037014 5921436
13139E921436k78067k89198M2146l14652l64008j83758j20511k16823j81779n7215
$$ 5921436 5643369 5354171 5396317 5081665 4717657 4533899 4413388 4196565 4014786 3957571
13129C957571J77853j42011j11948l2107K6035K54237k48975M8727Q337R8096
$$ 3957571 4135424 3993413 3881465 3849358 3875393 4129630 3880655 3929382 3937719 4035815
13119D035815l10065O8653j85121J46519k31409j10758K19811l75694J08479P758
$$ 4035815 3725750 3794403 3609282 3755801 3524392 3413634 3633445 3257751 3366230 3373988
13109C373988L28571k10139P1173M5759J61694j00850J14526m024K28844K57545
$$ 3373988 3702559 3492420 3563593 3609352 3771046 3670196 3784722 3780698 4009542 4267087
13099D267087M56372j97448L09156N60588Q7491N10862k3195J33561L48517L5052
$$ 4267087 4723459 4526011 4835167 5395755 5483246 5994108 5970913 6104474 6452991 6488043
13089F488043K35879j57593J15385P1553p0676q7223K2947j70620k43504o9077
$$ 6488043 6723922 6566329 6681714 6753267 6682591 6595368 6618315 6447695 6204191 6135114
13079F135114O8255l74285j87424j05213m01296j97702m91060j46593j62286k19398
$$ 6135114 6203369 5829084 5641660 5536447 5135151 4937449 4446389 4299796 4137510 3918112
13069C918112K01114j05930n87836L14601j58621k5569j18077j7699J95844j10708
$$ 3918112 4119226 4013296 3425460 3740061 3581440 3555871 3437794 3420095 3615939 3505231
13059C505231J4070J61440j5516J42373n0833j5519O3367M8557L9193J83117l52410
$$ 3505231 3519301 3680741 3665225 3807598 3756765 3741246 3804613 3853170 3892363 4075480 3723070
13048C723070M7865J88328l28658N39644n02143K34855M9363j183L53512l86868
$$ 3723070 3770935 3959263 3630605 4170249 3668106 3902961 3952324 3951141 4304653 3917785
13038C917785J2601K31175j53266j983J93712J25597j84647J78407J01340P5766
$$ 3917785 3930386 4161561 4008295 4006312 4200024 4325621 4140974 4319381 4420721 4496487
13028D496487J63086K7995j74292R7596j88828K03281k95J65707J51881o2890
$$ 4496487 4659573 4687568 4513276 4610872 4422044 4625325 4625030 4790737 4942618 4879728
13018D879728q4470N9133J84365N3870J60507j82415j2655P1324J30578j53990
$$ 4879728 4795258 4854391 5038756 5092626 5253133 5070718 5058063 5129387 5259965 5105975
13008E105975J58243O831K50059l48341Q7458J52869J21946j37605p0795M8787
$$ 5105975 5264218 5271049 5521108 5172767 5260225 5413094 5535040 5397435 5326640 5375427
12998E375427K62552m8800O2378N2248P670J37624K16275j82302m298J92870q9221
$$ 5375427 5637979 5589179 5651557 5703805 5711475 5849099 6065374 5883072 5878774 6071644 5982423
12987E982423j23310J49661j6067p8073k03917O0275K31623l06066N65316l22965
$$ 5982423 5859113 6008774 5992707 5914634 5710717 5770992 6002615 5696549 6261865 5938900
12977E938900j12275Q1709j13811j06259l8635J63991j24750k27617j00514M9629
$$ 5938900 5826625 5908334 5794523 5688264 5649629 5813620 5688870 5461253 5360739 5410368
12967E410368J41899k24143Q865L8824j25444j12308P5529L3736q1566K4175P3694
$$ 5410368 5552267 5328124 5336989 5375813 5250369 5138061 5213590 5247326 5165760 5189935 5263629
12956E263629q178l5088J2463J6915J58813k13915K00865j09117N6143j38901
$$ 5263629 5255451 5220363 5232826 5249741 5408554 5194639 5395504 5286387 5342530 5203629
12946E203629K18768j66340R2874r1537j81115j46269K91280j23851j35352L08262
$$ 5203629 5422397 5256057 5348931 5257394 5076279 4930010 5221290 5097439 4962087 5270349
12936E270349L3353k58970K64969K590l5428n7723L9130P913K7069K032L0841
$$ 5270349 5303702 5044732 5309701 5312291 5276863 5219140 5258270 5266183 5293252 5295284 5326125
12925E326125J03990k62336q5499l35438K29885q0965O6420L7779j20916j02524
$$ 5326125 5430115 5167779 5082280 4746842 4976727 4895762 4962182 4999961 4879045 4776521
12915D776521J82340q4559l52920N6386l89340P0782j74646j74550M8410J0837
$$ 4776521 4958861 4874302 4521382 4577768 4188428 4259210 4084564 3910014 3958424 3969261
12905C969261o8729J34917j16916p7893p1028q5863n5757q6070p9119K79262m00981
$$ 3969261 3900532 4035449 3918533 3840640 3769612 3683749 3627992 3541922 3462803 3742065 3341084
12894C341084P1108n9873R2346k39996M28428k61569k78338L48762k02196J12264
$$ 3341084 3412192 3352319 3444665 3204669 3633097 3371528 3093190 3441952 3239756 3352020
12884C352020K76828N2892k44743j16440Q6914O8308j24764O555l0788r9470O6836
$$ 3352020 3628848 3681740 3436997 3320557 3407471 3475779 3351015 3357570 3326782 3227312 3294148
12873C294148j04342N1697k68018K80609k03758l5137P5716k0145j19050O3367
$$ 3294148 3189806 3241503 2973485 3254094 3050336 3015199 3090915 3070770 2951720 3015087
12863C015087o7300J93630N8454j99126l08069M91686l83666M27252j73067j52504
$$ 3015087 2947787 3141417 3199871 3000745 2692676 3184362 2800696 3227948 3054881 2902377
12853B902377N9030q4031J20008m5532J47298k05961K65938k35740j38690j11038
$$ 2902377 2961407 2877376 2997384 2951852 3099150 2893189 3159127 2923387 2784697 2673659
12843B673659J78727o7025O37j22535N1143N9502M06912k71603j00120J35288
$$ 2673659 2852386 2785361 2785998 2663463 2714606 2774108 3181020 2909417 2809297 2944585
12833B944585k2316l64772K23360L8206J45930k03349K53038M6266p6378j52135
$$ 2944585 2922269 2557497 2780857 2819063 2964993 2761644 3014682 3060948 2984570 2832435
12823B832435j661Q3799K1404P750j3139j54231q3161M8630L08962l51893M6079
$$ 2832435 2830774 2914573 2935977 2943727 2930588 2776357 2693196 2741826 3050788 2698895 2744974
12812B744974K02276J4907k5321o7375J20158j25088Q9761J81084k91526q1201
$$ 2744974 2947250 2962157 2936836 2869461 2989619 2864531 2954292 3135376 2843850 2762649
12802B762649o8825J61593K41593j29760M1805r3013k0295q2188J32171k393n6234
$$ 2762649 2693824 2855417 3097010 2967250 3009055 2916042 2895747 2813559 2945730 2943337 2887103
12791B887103O8693J26387M4023o9995p4980Q7644K67561l33794N9304r7463K3865
$$ 2887103 2955796 3082183 3126206 3056211 2981231 3068875 3336436 3002642 3061946 2964483 2988348
12780B988348N1682J01863j38851m1036n583j53530Q2054K95420j64454J13089
$$ 2988348 3040030 3141893 3003042 2962006 2956423 2802893 2884947 3180367 3015913 3129002
12770C129002J98583k68500J39379o6275l5736j16522Q9862K5480k43044K60812
$$ 3129002 3327585 3059085 3198464 3132189 3096453 2979931 3069793 3095273 2852229 3113041
12760C113041K2607L4908o0750p6957J81364k88017M96320j27039j133k57250
$$ 3113041 3135648 3170556 3109806 3032849 3214213 2926196 3422516 3295477 3294344 3037094
12750C037094L88937o9045j74004N3227m03699L09679J29479p7584j08879L13765
$$ 3037094 3426031 3356986 3182982 3236209 2832510 3142189 3271668 3194084 3085205 3398970
12740C398970j56141J12228k01013k277L10394p5925r2710j09520J42700j20572
$$ 3398970 3242829 3355057 3154044 3151767 3462161 3386236 3293526 3184006 3326706 3206134
12730C206134Q9955j87094Q9179N4059Q1200m1578Q9672J52105k8383l16717J57618
$$ 3206134 3296089 3108995 3198174 3252233 3333433 3291855 3381527 3533632 3505249 3188532 3346150
12719C346150k6748K27628m84078K18031J78128J05117m286j68268K35956l56854
$$ 3346150 3319402 3547030 3062952 3280983 3459111 3564228 3559942 3391674 3627630 3270776
12709C270776L07038k52509L97816j69505L26784l06215L22725j61865K36642
$$ 3270776 3577814 3325305 3723121 3553616 3880400 3574185 3896910 3735045 3971687
12700C971687R0992L11900j68607K07559j30809L52900J26374J00527K37681M45218
$$ 3971687 4062679 4374579 4205972 4413531 4282722 4635622 4761996 4862523 5100204 5545422
12690E545422l9037O66199K58394K51205L09825J31063k83526j4810J934k52055
$$ 5545422 5506385 6172584 6430978 6682183 6992008 7123071 6839545 6824735 6826669 6574614
12680F574614m5243p18493j73586o54092o4149j136l71342Q6475l22629K76953
$$ 6574614 6529371 5810878 5637292 4983200 4919051 4917915 4546573 4633048 4310419 4587372
12670D587372p9631o5544L70751p0869K05697J53392j06607m8589K78415J15716
$$ 4587372 4507741 4442197 4812948 4742079 4947776 5101168 4994561 4945972 5224387 5340103
12660E340103M4114k11458R1289j85841K77015j05865R0365J65679j02455K92943
$$ 5340103 5384217 5172759 5264048 5078207 5355222 5249357 5339722 5505401 5402946 5695889
12650E695889L63867J39704J07066R4936j89576N8940N5311j54737L01740m9589
$$ 5695889 6059756 6199460 6306526 6401462 6211886 6270826 6326137 6171400 6473140 6423551
12640F423551L8480j9132J79284K27174j8897J94027Q6188N4554o5622q8864L10810
$$ 6423551 6462031 6442899 6622183 6849357 6830460 7024487 7110675 7165229 7099607 7010743 7321553
12629G321553k33202Q3915M3894o0340k61991M5918l24831o067l69857q4570k94015
$$ 7321553 7088351 7172266 7216160 7155820 6893829 6939747 6614916 6608849 6238992 6154422 5860407
12618E860407j64705l0692j96282k66530K4722J25388L29366K27400M83349M24963
$$ 5860407 5695702 5665010 5468728 5202198 5226920 5352308 5681674 5909074 6392423 6817386
12608F817386P06385L91007M43718L82037N54689M4882k67818k53937k30200m21839
$$ 6817386 7523771 7914778 8358496 8740533 9295222 9340104 9072286 8818349 8588149 8166310
12598H166310m14273m15881n71503n13652l27462k08557n3602L693M702L06525
$$ 8166310 7752037 7336156 6764653 6251001 5923539 5714982 5661380 5665073 5669775 5976300
12588E976300L6452p2090M6176P4414k47934K19390q4839j7208L45677J33289
$$ 5976300 6012752 5940662 5986838 6061252 5813318 6032708 5947869 5930661 6276338 6409627
12578F409627L41613K1278N60984L3223K37158J67706j05758j11101l68689k59595
$$ 6409627 6751240 6772518 7333502 7366725 7603883 7771589 7665831 7554730 7186041 6926446
12568F926446o37634k97031m75950k93290r8173J43095J7946o6944j27487K25769
$$ 6926446 6288812 5991781 5515831 5222541 5124368 5267463 5285409 5218465 5090978 5316747
12558E316747q8022P9399R5529k90591L68202j98455Q3649j37774j5948p9426
$$ 5316747 5228725 5308124 5403653 5113062 5481264 5282809 5366458 5228684 5212736 5133310
12548E133310K20180q3822l7835R3012J8075p426J09061K14942J13806q892M31140
$$ 5133310 5353490 5269668 5231833 5324845 5342920 5335494 5444555 5659497 5773303 5764411 6195551
12537F195551k15036J38928J57310l28511j1927j21145k00058J7042k94753N7134
$$ 6195551 5980515 6119443 6276753 5948242 5936315 5815170 5615112 5632154 5337401 5394535
12527E394535J4685j02768J39675j37813L25670K00246j74370o3578J89291Q6086
$$ 5394535 5409220 5306452 5446127 5308314 5633984 5834230 5659860 5596282 5785573 5871659
12517E871659m32727K39756O8752J81045J2265M16412L93656L95254Q1901K8631
$$ 5871659 5438932 5678688 5747440 5928485 5940750 6357162 6750818 7146072 7227973 7256604
12507G256604p3635J16257O3684J44583k28454l07193l69308r8245k18735K2480
$$ 7256604 7182969 7299226 7362910 7507493 7279039 6971846 6602538 6504293 6285558 6308038
12497F308038o5547k26022J56888J9441K76297k90592n0012K20004k08733L65242
$$ 6308038 6242491 6016469 6173357 6192798 6469095 6178503 6128491 6348495 6139762 6505004
12487F505004k33484O3231j04649L43467J61620l6981J92156L65838q2084j38573
$$ 6505004 6271520 6334751 6230102 6573569 6735189 6698208 6890364 7256202 7174118 7035545
12477G035545j1165j1089L27127j19399j3503k58320q6311l54778K16342m6782
$$ 7035545 7024380 7013291 7340418 7221019 7207516 6949196 6862885 6508107 6724449 6677667
12467F677667J40502J09079j52611L21920j91828J48697J04095K0613L6809K48262
$$ 6677667 6818169 6927248 6774637 7096557 6904729 7053426 7157521 7178134 7214943 7463205
12457G463205L50601m09426J40799N04001q2481K15269L20057Q7644K02665J05869
$$ 7463205 7813806 7404380 7545179 8049180 7966699 8181968 8502025 8589669 8792334 8898203
12447H898203M25548J01059K77128L06648M55933K60810M75477L26883N98297
$$ 8898203 9323751 9424810 9701938 10008586 10464519 10725329 11200806 11527689 12125986
12438A2125986j5199J37329j74472P52186K5775q5571j36226m5805J06545L9796
$$ 12125986 12110787 12248116 12073644 12825830 12851605 12766034 12629808 12584003 12690548 12730344
12428A2730344N9589O7950L1799J42904r3285L80837k4678K19197K45651M77436
$$ 12730344 12789933 12857883 12889682 13032586 12939301 13320138 13295460 13514657 13760308 14237744
12418A4237744K05970L10725N11993N02136P13220M01078N47743R13823M16341
$$ 14237744 14443714 14754439 15266432 15768568 16481788 16882866 17430609 18344432 18760773
12409A8760773L76895O5219K25857M4682K5212l66072l21057r2928m63219j92077
$$ 18760773 19137668 19202887 19428744 19473426 19498638 19132566 18811509 18718581 18255362 18063285
12399A8063285m39488m66665j12310l59417j99073r3415l25888r2332K64461j80337
$$ 18063285 17623797 17157132 17044822 16685405 16486332 16392917 16067029 15974697 16239158 16058821
12389A6058821K62748J55724J31718N28293K9343N57651L75042L67673J37839
$$ 16058821 16321569 16477293 16609011 17137304 17166647 17724298 18099340 18467013 18604852
12380A8604852J56534L09940J91292J12933j56308M5997J29668l81967k01340
$$ 18604852 18761386 19071326 19262618 19375551 19219243 19265240 19394908 19012941 18811601
12371A8811601k39822l0568l79937j86409j77822k78333J57052o13917j12558
$$ 18811601 18571779 18541211 18161274 17974865 17797043 17518710 17675762 17061845 16949287
12362A6949287m8669l84358j36192l23514m24745J98816m94843M5502n9699L4473
$$ 16949287 16900618 16516260 16380068 16056554 15631809 15830625 15335782 15381284 15321585 15356058
12352A5356058l13012j36164k34674l75820k45963K54553m16479m00640J70000
$$ 15356058 15043046 14906882 14672208 14296388 14050425 14304978 13888499 13487859 13657859
12343A3657859k95723J99376o3223J25968L48681k8341L02023K47058k2837M58327
$$ 13657859 13362136 13561512 13498289 13624257 13972938 13944597 14246620 14493678 14470841 14929168
12333A4929168J27078L88406L35477J02337L7309O43734K51034L98776J35969
$$ 14929168 15056246 15444652 15780129 15882466 15919775 16563509 16814543 17213319 17349288
12324A7349288O9034K09974L4142L78928p0318o3789N56397j43291j04765J79522
$$ 17349288 17418322 17628296 17662438 18041366 17971048 17907259 18463656 18320365 18215600 18395122
12314A8395122k80662K6787K77966p0722M12227j50977L54842q0941M60370J01992
$$ 18395122 18114460 18141247 18419213 18348491 18760718 18609741 18964583 18883642 19344012 19446004
12304A9446004P17672N2067J74053m3914K76252l40345J71044m8830m74355l98883
$$ 19446004 20163676 20215743 20389796 20345882 20622134 20281789 20452833 20404003 19929648 19530765
12294A9530765m12267k39172m98292k65364j80636r6225m61456j59126l12818
$$ 19530765 19118498 18879326 18381034 18115670 17935034 17838809 17377353 17218227 16905409
12285A6905409l72654k78478m16284m88248l70091l91228q84383O095o02972j99500
$$ 16905409 16532755 16254277 15837993 15349745 14979654 14588426 13704043 13710138 13107166 12907666
12275A2907666l38290l18200j39750K14l22871k11261J25178J06685k18768k24959
$$ 12907666 12569376 12251176 12111426 12111640 11788769 11577508 11702686 11809371 11590603 11365644
12265A1365644K73357J39338k33494n9840O5905N6925K3289j72292K59314J07540
$$ 11365644 11639001 11778339 11544845 11485005 11550910 11607835 11631124 11458832 11718146 11825686
12255A1825686n3721L99332j0120L45611P48634J78644N63356R57430M85128R61458
$$ 11825686 11771965 12171297 12161177 12506788 13255422 13434066 13997422 14954852 15439980 16401438
12245A6401438P69560R98482Q04329Q75844N52790N40910M52452O87689j01428
$$ 16401438 17170998 18169480 18973809 19849653 20402443 20943353 21395805 22083494 21982066
12236B1982066J05202p1392P4803k05192m02859j70959p8069j01812l44909j91671
$$ 21982066 22087268 22015876 22090679 21885487 21482628 21311669 21233600 21131788 20786879 20595208
12226B0595208p06305l60807j048440m34748j101453r13020p69687q15316m24252
$$ 20595208 19888903 19528096 18479656 18044908 16943455 16030435 15260748 14445432 14021180
12217A4021180o96072m09587n06749M2436n24927j61218m01712o5977l06754j54633
$$ 14021180 13325108 12915521 12408772 12451208 11926281 11765063 11363351 11297374 10990620 10835987
12207A0835987j76104j23549k08933j00657j27410j89923j78803K48210j74362
$$ 10835987 10659883 10536334 10327401 10226744 10099334 9909411 9730608 9978818 9804456
12198I804456k53805M17335j06323O0241j2274j57460M2195K32759j63095L42590
$$ 9804456 9550651 9967986 9861663 9921904 9909630 9752170 9794365 10027124 9864029 10206619
12188A0206619k418K22773L93439n9442j45154L80202O06522K23594j36561K13070
$$ 10206619 10204201 10426974 10820413 10760971 10615817 10996019 11602541 11826135 11689574 11902644
12178A1902644K7333j80689K30312l04164K15526j53712L06383j74727K9364K59185
$$ 11902644 11929977 11749288 11979600 11675436 11890962 11737250 12043633 11868906 11898270 12157455
12168A2157455M7630K58869k03014M85554J67702K77262Q56104K89655N14462
$$ 12157455 12205085 12463954 12260940 12746494 12914196 13191458 14047562 14337217 14851679
12159A4851679M33062M47990L55955L70525K41676j03224r9741j91026k18058
$$ 14851679 15284741 15732731 16088686 16459211 16700887 16597663 16497922 16306896 16088838
12150A6088838m43339J30312R8207K50390N39150J38585P53915J40031M71700
$$ 16088838 15645499 15775811 15874018 16124408 16663558 16802143 17556058 17696089 18167789
12141A8167789L81244L5047L54880J32155O85196K85996R05154P55880R01949
$$ 18167789 18549033 18584080 18938960 19071115 19756311 20042307 20947461 21703341 22605290
12132B2605290J452449J287290J298930J799412J650823J786202J738783J311527
$$ 22605290 24057739 25345029 26643959 28443371 30094194 31880396 33619179 34930706
12124C4930706J489231J311446J097398M76350M66613N32912j25041l1926k07153
$$ 34930706 36419937 37731383 38828781 39305131 39771744 40304656 40179615 40147689 39940536
12115C9940536j33913l42023l11894l82219P179k26908l94184l02401l24544k16614
$$ 39940536 39806623 39464600 39152706 38770487 38777666 38550758 38156574 37854173 37529629 37313015
12105C7313015J24206K43185K09603Q58245J78143R52243J19478K17722J46712
$$ 37313015 37437221 37680406 37890009 38748254 38926397 39878640 39998118 40215840 40362552
12096D0362552r4197m11147k76615p66811r41626j004051o36966k35030m49859
$$ 40362552 40268355 39857208 39580593 38813782 37872156 36868105 36231139 35996109 35546250
12087C5546250L72946L06439J71738N62920P24322L99613N66051P4302J76936
$$ 35546250 35919196 36225635 36397373 36960293 37684615 38084228 38650279 38724581 38901517
12078C8901517R3427l65538m21312k936K21249j7382q5831K0439m80228n86164
$$ 38901517 38994944 38629406 38208094 38205158 38426407 38409025 38323194 38343633 37863405 37277241
12068C7277241m46678n12323p94933r66715j299990q13944r86721p55646r14774
$$ 37277241 36830563 36318240 35523307 34556592 33256602 32442658 31455937 30700291 29785517
12059B9785517j005459o50318k33408r01952m33332l38937m73829m24921k42055
$$ 29785517 28780058 28129740 27896332 26994380 26561048 26222111 25748282 25323361 25081306
12050B5081306m98521k36118o77922j84915m64895l56245l05089m89492q1086
$$ 25081306 24582785 24346667 23668745 23483830 23018935 22662690 22357601 21868109 21787023
12041B1787023k96210n71581l81920n37483n68092q5284p67080o9509n64729j9922
$$ 21787023 21490813 20919232 20537312 19999829 19431737 19346453 18579373 18509864 17945135 17925213
12031A7925213n3992K53359j60661J87207J32506J73624K01148k7099k07884j17014
$$ 17925213 17871221 18124580 17963919 18151126 18283632 18457256 18658404 18631305 18423421 18306407
12021A8306407o17774m24102n76912j23465m37985l39007k75521k89622k17359
$$ 18306407 17688633 17264531 16687619 16564154 16126169 15787162 15511641 15222019 15004660
12012A5004660k07470k98511n46278p5200j20179n13677j56996l73330L950N8798
$$ 15004660 14797190 14498679 13952401 13877201 13757022 13243345 13086349 12713019 12716969 12775767
12002A2775767P1071J56403M55867J51649J1985j82763l36552m88492j60214l59005
$$ 12775767 12846838 13003241 13459108 13610757 13622742 13439979 13103427 12614935 12454721 12095716
11992A2095716l93435l11648Q3067n66826j29458j31414m2890j5887k69828j96208
$$ 12095716 11702281 11390633 11473700 10906874 10777416 10646002 10603112 10587225 10317397 10121189
11982A0121189r2261m10743m17619l51521m09079k29370j60122j45523k2717r2528
$$ 10121189 10028928 9618185 9200566 8849045 8439966 8210596 8050474 7904951 7882234 7789706
11972G789706k82709j73638Q6444j63078l91942l1734o2897l37506K841j07284
$$ 7789706 7506997 7333359 7419803 7256725 6864783 6833049 6770152 6432646 6435487 6328203
11962F328203o5369j46596R2638J69406M5067K38492J6208K8170J86426J37811
$$ 6328203 6262834 6116238 6208876 6378282 6423349 6661841 6678049 6706219 6892645 7030456
11952G030456j04047M11677j83523l2889j46933J00737q3673j12640N57431p980
$$ 7030456 6926409 7338086 7154563 7121674 6974741 7075478 6991805 6879165 7436596 7428616
11942G428616J63640J32836K68922J26354J17071J59772j08722j88610J94437
$$ 7428616 7592256 7725092 7994014 8120368 8237439 8397211 8288489 8099879 8294316
11933H294316k7089r3618k50158L18579j20776K05734m12025o8915j13738J28562
$$ 8294316 8267227 8173609 7923451 8242030 8121254 8326988 7914963 7846048 7732310 7860872
11923G860872k61069j29114m30296n8909l89063k08290K79025j38878j56339L2083
$$ 7860872 7599803 7470689 7040393 6981484 6592421 6384131 6663156 6524278 6367939 6400022
11913F400022p6442j58064P3701L29274J047115J253265J690232N38081P12008
$$ 6400022 6323580 6165516 6239217 6568491 7615606 8868871 10559103 11097184 11809192
11904A1809192J28242O9880L45381k02557j39333q68723j996799j873643j383552
$$ 11809192 11937434 12007314 12352695 12150138 12010805 11142082 9145283 7271640 5888088
11895E888088j84195P4683n6173k11654K02648J60175l3225L44385P73908R6961
$$ 5888088 5703893 5778576 5722403 5510749 5713397 5873572 5840347 6184732 6958640 7055601
11885G055601Q60941R02701M05178M76385L83526M00851k17678J50327n4744o84051
$$ 7055601 7916542 8819243 9224421 9700806 10084332 10485183 10267505 10417832 10363088 9679037
11875I679037q02287o63365n16409l73738n61676j66189m23183j84675n86281
$$ 9679037 8876750 8213385 7696976 7323238 6761562 6595373 6172190 5987515 5401234
11866E401234K6809l57621J12343J48260l91304R8813k708k22112O8437n3922
$$ 5401234 5428043 5070422 5182765 5331025 4939721 5038534 5035826 4813714 4882151 4828229
11856D828229J58642k75675J71056l2443n644P0987N9136M27383M8655R1864J29870
$$ 4828229 4986871 4711196 4882252 4849809 4844165 4915152 4974288 5401671 5450326 5542190 5672060
11845E672060M92345M78650M82888N57214O09522J72346N12347J57936K7492J44297
$$ 5672060 6164405 6643055 7125943 7683157 8292679 8465025 8977372 9135308 9162800 9307097
11835I307097j27234j27760k70498j42783k78748l07338k7513J1139l19916K99331
$$ 9307097 9179863 9052103 8781605 8638822 8360074 8052736 8025223 8036362 7716446 8015777
11825H015777j57196n39361o7094p57931l93136p19441k86808j58611k99743j59641
$$ 8015777 7858581 7319220 7252126 6494195 6101059 5381618 5094810 4936199 4636456 4476815
11815D476815j39520O0789k19065K81197j91048p5605J36223n1906k20286N5512
$$ 4476815 4337295 4398084 4179019 4460216 4269168 4193563 4329786 4277880 4057594 4113106
11805D113106l28471J08307J40003J54374r4290N736K70354l27486K17072L5959
$$ 4113106 3784635 3892942 4032945 4187319 4093029 4098765 4369119 4041633 4258705 4294664
11795D294664P2717o5039L9032J92058K45001L08775L85953M86787K27963M07055
$$ 4294664 4367381 4302342 4341374 4533432 4778433 5087208 5473161 5959948 6187911 6594966
11785F594966J41718R8879j0517J35042l52850k25457m71456n75861m83347m53198
$$ 6594966 6736684 6835563 6825046 6960088 6607238 6381781 5910325 5334464 4851117 4397919
11775D397919j41894j17412m44474K36981j66653k6050k4575r7431M4226l24381
$$ 4397919 4256025 4138613 3694139 3931120 3764467 3738417 3713842 3616411 3660637 3336256
11765C336256R1300j6144l8306j03087r7883K32852J58632j70928M1858m33k34383
$$ 3336256 3427556 3411412 3373106 3270019 3172136 3404988 3563620 3392692 3434550 3434117 3199734
11754C199734K40307k42852J51761k6023j42242K64715k11652J10350P9897j94719
$$ 3199734 3440041 3197189 3348950 3322927 3180685 3445400 3233748 3344098 3423995 3229276
11744C229276p4433J12548M0596j32124P6830K80r8805O7732r0977p1413o1518
$$ 3229276 3154843 3267391 3307987 3175863 3252693 3252973 3154168 3221900 3130923 3059510 2997992
11733B997992K09416k46676n0804K15236o7216Q2894l15422K48413k10269Q4295
$$ 2997992 3207408 2960732 2909928 3125164 3057948 3140842 2825420 3073833 2863564 2947859
11723B947859n2619K77790j14519K1157j61391L4026O4095K6082R0597L111K7951
$$ 2947859 2895240 3173030 3058511 3079668 2918277 2952303 3016398 3042480 3133077 3136188 3164139
11712C164139l24998J05122N675K75258n2455l1647p1937j02084J25930J12626
$$ 3164139 2839141 2944263 2949938 3225196 3172741 3141094 3069157 2967073 3093003 3205629
11702C205629k42544L0334M3586R1120M9979j532p8680K03550m2255L8875K821
$$ 3205629 2963085 2993419 3037005 3128125 3178104 3176572 3097892 3301442 3259187 3298062 3300883
11691C300883L1946j3890j21158L03778p8933j58304K83220n3942J17799J65248
$$ 3300883 3332829 3318939 3197781 3501559 3422626 3264322 3547542 3493600 3611399 3776647
11681C776647j8510k2790J38644J7333J72094l45580Q1031K54375k08330j9350
$$ 3776647 3758137 3735347 3873991 3891324 4063418 3717838 3798869 4053244 3844914 3825564
11671C825564J58290j39617J51079j94605M52353l59189R9773n1292n6344r193
$$ 3825564 3983854 3844237 3995316 3800711 4253064 3893875 3993648 3942356 3886012 3876819
11661C876819K44972j70020L3086k30473K93218m03423J52745J8602k03289K35039
$$ 3876819 4121791 3951771 3984857 3754384 4047602 3644179 3796924 3815526 3612237 3847276
11651C847276r6061K00715p3038O0853k64473J66840j50528K29601k45210Q3600
$$ 3847276 3751215 3951930 3878892 3939745 3675272 3842112 3691584 3921185 3675975 3759575
11641C759575o5990R7753j11062j28885J27218j6588J29846k25028r2119J22368
$$ 3759575 3693585 3791338 3680276 3551391 3678609 3662021 3791867 3566839 3474720 3597088
11631C597088J2856K61029o861k78929J1804J1084R961K2625k7292J50673L0285
$$ 3597088 3609944 3870973 3864112 3585183 3596987 3608071 3618032 3640657 3613365 3764038 3794323
11620C794323j71250j25795J77801J76971j19280J20424l52898M3785J73708j36914
$$ 3794323 3623073 3497278 3675079 3852050 3732770 3853194 3500296 3544081 3717789 3580875
11610C580875Q8097k12328J84552K8133J87500k02595J05866J11844k30494L90106
$$ 3580875 3668972 3456644 3641196 3669329 3856829 3654234 3760100 3871944 3641450 4031556
11600D031556q6042j5247k08540K60408r3290j05370L42629j95799M2730j37697
$$ 4031556 3945514 3930267 3721727 3982135 3888845 3783475 4126104 3930305 3973035 3835338
11590C835338M639J01176Q3824j14912p9155j7899J92132j15402j66914R1806
$$ 3835338 3839977 3941153 4024977 3910065 3830910 3813011 4005143 3889741 3722827 3814633
11580C814633K68024J06255n4699j83710N2096M01230L1953j17386k55007K12069
$$ 3814633 4082657 4188912 4134213 3950503 4002599 4403829 4435782 4318396 4063389 4275458
11570D275458J56956m68453K13698p1735J77816j12720P4319k2056J17165M9157
$$ 4275458 4432414 3963961 4177659 4105924 4283740 4171020 4245339 4223283 4340448 4389605
11560D389605J6259j84551K50630m9416P0524j6828P7605J09370l2051m5502p5632
$$ 4389605 4405864 4221313 4471943 4422527 4493051 4476223 4553828 4663198 4631147 4585645 4510013
11549D510013J2028l0999P3478l19966O788M946k167p6016p5967l9109K9039k5606
$$ 4510013 4522041 4491042 4564520 4244554 4251342 4256288 4254121 4178105 4102138 4063029 4092068 4066462
11537D066462j09268K30344K17096l25833R36J91376n0121j18344K64831j98019
$$ 4066462 3957194 4187538 4404634 4078801 4079737 4271113 4220992 4102648 4367479 4169460
11527D169460J27307l7513p8801L3763L3500l0608r8419n7049J04334j3512P9971
$$ 4169460 4296767 4259254 4180453 4214216 4247716 4217108 4118689 4061640 4165974 4152462 4232433
11516D232433K87826j84273m3299J62619R3430n6895j76601L46052l2443J7588
$$ 4232433 4520259 4335986 4292687 4455306 4548736 4491841 4315240 4661292 4628849 4646437
11506D646437o8362J51507n0221Q091O8850j16321J24790k52480J29007m0096
$$ 4646437 4578075 4729582 4679361 4687452 4756302 4639981 4764771 4512291 4641298 4601202
11496D601202K04506L998l72419O10397n01022J72888j24273K14072r7123J69762
$$ 4601202 4805708 4809706 4437287 5047684 4546662 4719550 4595277 4809349 4712226 4881988
11486D881988r331j32218M88L69252m03809J48592L6037J17754N5775n7806L3755
$$ 4881988 4872657 4740439 4740927 5110179 4706370 4854962 4890999 5008753 5064528 5006722 5040477
11475E040477P4120J05411k8285p6208J22658k08697L5326L1164J9698m19804
$$ 5040477 5114597 5220008 5191723 5115515 5238173 5029476 5064802 5095966 5115664 4695860
11465D695860P1734L39145n1381n2763j15141M5754R6997j2225n3529k04661M04963
$$ 4695860 4767594 5106739 5055358 5002595 4887454 4933208 5030205 5017980 4964451 4759790 5164753
11454E164753k37286J48185J62317k07820l84448O07036O3283l6811k98264L76234
$$ 5164753 4927467 5075652 5237969 5030149 4645701 5252737 5316020 5279209 4980945 5357179
11444E357179J3432j69400M12685q6552K53412p6597J79009k79940J3035N04533
$$ 5357179 5370611 5201211 5613896 5527344 5780756 5704159 5883168 5603228 5616263 6120796
11434F120796r1488J69021j89962M55699k83696K36563R5615k35685J72775l578
$$ 6120796 6029308 6198329 6008367 6464066 6180370 6416933 6512548 6276863 6449638 6446060
11424F446060J21585J585j8011m693n1101j52287L74669j61541J55562J48217
$$ 6446060 6567645 6569230 6551219 6546526 6495425 6343138 6717807 6556266 6711828 6860045
11414F860045j36714K58404O0977o7977K99337q3779L1396L39937J80471j9823
$$ 6860045 6723331 6981735 7042712 6974735 7274072 7190293 7221689 7561626 7742097 7722274
11404G722274p9631J77882J89646p5839L12033L54376n5389J85678J73162N3764
$$ 7722274 7642643 7820525 8010171 7934332 8246365 8600741 8545352 8731030 8904192 8957956
11394H957956L08742P6063P1870R1595J11087M02722J6795K78565j30931M11643
$$ 8957956 9266698 9342761 9414631 9506226 9617313 10020035 10036830 10315395 10184464 10596107
11384A0596107J63810Q8581J99488J49173L927J43341N8872J89503j76978K54270
$$ 10596107 10759917 10848498 11047986 11197159 11201086 11344427 11403299 11592802 11415824 11670094
11374A1670094J72399L4572J55388j79499J43845M51320M4205J22504r6927K17404
$$ 11670094 11842493 11877065 12032453 11852954 11996799 12448119 12492324 12614828 12517901 12735305
11364A2735305o1198Q5305J35383k10009K50927L77443l75210p8043J40587K7024
$$ 12735305 12674107 12759412 12894795 12684786 12935713 13313156 12937946 12859903 13000490 13027514
11354A3027514J14948k5041O6859N0325j30248J99539P209l9231l9045k0459k168
$$ 13027514 13142462 13117421 13184280 13234605 13104357 13303896 13311105 13271874 13232829 13212370 13210202
11343A3210202O1274M766k69081J54005k22262Q5502n3057j00280p0552k37769
$$ 13210202 13271476 13276242 13007161 13161166 12938904 13024406 12971349 12871069 12800517 12562748
11333A2562748P8693j71598L1226n81982K8169J44203m64348j01494j84231M9400
$$ 12562748 12641441 12469843 12501069 11919087 11947256 12091459 11627111 11525617 11341386 11390786
11323A1390786j44378k84961N7379m4747l54101k04946l83863k096j81892j0031
$$ 11390786 11246408 10961447 11018826 10974079 10619978 10415032 10031169 10029073 9847181 9837150
11313I837150k66271J73975m32092o6336n16992j9525j88787n2663r8900k44887
$$ 9837150 9570879 9744854 9312762 9246426 8729434 8709909 8521122 8468459 8369559 8124672
11303H124672j78818k38418k65176J15849k25808k04671j32484l9622k67537K5091
$$ 8124672 7945854 7707436 7442260 7558109 7332301 7127630 6995146 6955524 6687987 6713078
11293F713078j52033k62855J83686m00123J00586k40111k17130K11151j92517
$$ 6713078 6561045 6298190 6481876 6081753 6182339 5942228 5725098 5936249 5743732
11284E743732q0184j39243J93580m34128k9557j92250j41634J81718k21057J19328
$$ 5743732 5663548 5524305 5717885 5283757 5254200 5061950 4920316 5102034 4880977 5000305
11274E000305j86082r991j36160o5896q5515l0540Q606k17691K40488j91582J2120
$$ 5000305 4814223 4804232 4668072 4602176 4516661 4486121 4494727 4277036 4517524 4325942 4338062
11263D338062j37886R0062j04619m6745K1943m7911J24596j89709J88738k23181
$$ 4338062 4200176 4290238 4185619 4138874 4160817 4112906 4237502 4047793 4236531 4013350
11253D013350K3930j49917K0202J27744j4916j65658L9699j4248J73054j83558
$$ 4013350 4037280 3887363 3907565 4035309 4020393 3854735 3894434 3880186 4053240 3869682
11243C869682k4936P5857N4386j75478l8344p9403J94674M8122j25791j43994
$$ 3869682 3844746 3920603 3974989 3799511 3761167 3681764 3876438 3924560 3798769 3654775
11233C654775n5429L33292L5400j25787K3147R6520K9329J08075n5819M76663
$$ 3654775 3599346 3932638 3968038 3842251 3865398 3961918 3991247 4099322 4043503 4520166
11223D520166Q99836O89626O98092k13035L70755O41046j05166J4100l70231P1071
$$ 4520166 5420002 6109628 6807720 6594685 6965440 7606486 7501320 7515420 7145189 7216260
11213G216260r20411r67624o26773l59561k93926o6985j5127j56289l190O0070
$$ 7216260 6295849 5328225 4701452 4341891 4047965 3980980 3965853 3809564 3806374 3866444
11203C866444o8369J72764l8613L4509L7292L4496J63785K03333O04792M76733
$$ 3866444 3798075 3970839 3932226 3966735 4004027 4038523 4202308 4405641 5010433 5487166
11193E487166P04901N64233K65397K35390L41500O7472p8576K882l89397p54647
$$ 5487166 6192067 6756300 7021697 7257087 7598587 7666059 7587483 7590365 7200968 6446321
11183F446321p37870q94726k41117k88241r5868K81570m14563K04413o8594J48454
$$ 6446321 5708451 4813725 4572608 4284367 4188499 4470069 4055506 4259919 4191325 4339779
11173D339779j03720j36122K4167R2482P8201M1370j38920K1345J46186J3396
$$ 4339779 4236059 4099937 4124104 4216586 4294787 4336157 4197237 4218582 4364768 4378164
11163D378164j01934J8264j8821Q7062Q6507n8847j07569N5981q36J41554r5956
$$ 4378164 4276230 4294494 4275673 4362735 4449242 4390395 4282826 4338807 4337971 4479525 4383569
11152D383569K02185M618r6124j1155Q7926r6655O8765K65672l04191L5816O3144
$$ 4383569 4585754 4590372 4494248 4483093 4571019 4474364 4543129 4808801 4504610 4540426 4603570
11141D603570J20488J3601m7148P8751Q7876J11718l26009M68052j79409N1425
$$ 4603570 4724058 4737659 4690511 4769262 4857138 4968856 4642847 5110899 4931490 4982915
11131D982915l0485L4240K79908Q3861j50014l9243k62425L82119J8024J842j47273
$$ 4982915 4952430 4986670 5266578 5350439 5200425 5161182 4898757 5280876 5298900 5300742 5153469
11120E153469K87207p6297n8329J28126N8901q1071K07650j88237j31380J97223
$$ 5153469 5440676 5364379 5306050 5434176 5493077 5412006 5619656 5431419 5300039 5497262
11110E497262K7601O8786j02635n7902Q7774K123l8381p0678l1958p3440R7684
$$ 5497262 5524863 5593649 5491014 5433112 5520886 5523009 5484628 5413950 5381992 5308552 5406236
11099E406236Q9575k22112K26665R306k47182N4648j56615K23681k82194K68414
$$ 5406236 5495811 5273699 5500364 5509670 5262488 5317136 5160521 5384202 5102008 5370422
11089E370422j29807J72811k43896K16903j87998j40536J60865j023p625J66663
$$ 5370422 5240615 5413426 5169530 5386433 5198435 5057899 5218764 5217741 5210116 5376779
11079E376779L0173j09430Q7378n7924P8190N2102N1142j55633J74705K00381
$$ 5376779 5406952 5297522 5384900 5326976 5405166 5457268 5508410 5352777 5527482 5727863
11069E727863l6364J63183N951K8928J5862J95641r1086M5844K17688K07376k1327
$$ 5727863 5691499 5854682 5860633 5889561 5905423 6101064 6009978 6055822 6273510 6480886 6459559
11058F459559l41250M11798K36605j48569Q5235P1414j38800L62019J04180j53754
$$ 6459559 6118309 6530107 6766712 6618143 6703378 6774792 6635992 6998011 7102191 6948437
11048F948437J02293K91723M0653R388k22470J74362K17403L04305j09842j22576
$$ 6948437 7050730 7342453 7383106 7392494 7170024 7344386 7561789 7866094 7756252 7633676
11038G633676K51748K69074K1708M5740q374N25725R3718J05943J32767L71808
$$ 7633676 7885424 8154498 8176206 8221946 8213572 8739297 8833015 8938958 9071725 9443533
11028I443533R8457M92684J20351R0984M74315J64645L81883M2429K61494L72233
$$ 9443533 9541990 10034674 10155025 10246009 10720324 10884969 11266852 11309281 11570775 11943008
11018A1943008L52781J43792l9459N88780K32111l65347O01490j95113p5195N11119
$$ 11943008 12295789 12439581 12400122 12988902 13221013 12855666 13457156 13262043 13186848 13697967
11008A3697967k2547K36810K26269J6857M09567M0198L94232K03674M39607K65053
$$ 13697967 13675420 13912230 14138499 14155356 14564923 14605121 14999353 15203027 15642634 15907687
10998A5907687L41589M44701K18178N20473K74801M36930K38205L96693J30852
$$ 15907687 16249276 16693977 16912155 17432628 17707429 18144359 18382564 18779257 18910109
10989A8910109J62590L33935J82812K83555o5552L59729M66410K85502J28858
$$ 18910109 19072699 19406634 19589446 19873001 19807449 20167178 20633588 20919090 21047948
10980B1047948M15284M51747J41085L36784N39797m2607O23344L17655j53838
$$ 21047948 21463232 21914979 22056064 22392848 22932645 22890038 23513382 23831037 23677199
10971B3677199N80349J52368M78822K01803N26114N31774J38874M98998P07153
$$ 23677199 24257548 24409916 24888738 25090541 25616655 26148429 26287303 26786301 27493454
10962B7493454M10594J79439P32541K30424K57326N76453N28623N02246Q48686
$$ 27493454 27904048 28083487 28816028 29046452 29303778 29880231 30408854 30911100 31759786
10953C1759786M01473O18387O00683M60746P53214P63879O26062N61184P02449
$$ 31759786 32161259 32779646 33380329 33841075 34594289 35358168 35984230 36545414 37247863
10944C7247863O64684M35516M02882R57956O46170P04763Q01585R31397M59331
$$ 37247863 37912547 38348063 38750945 39708901 40355071 41059834 41861419 42792816 43252147
10935D3252147P57045J036313P43626P64150N71729J258669P13163J038886R07269
$$ 43252147 44009192 45045505 45789131 46553281 47125010 48383679 49096842 50135728 51042997
10926E1042997J069512R82430J426836R38995J119667R13452J134172Q31910R64787
$$ 51042997 52112509 53094939 54521775 55460770 56580437 57493889 58628061 59459971 60424758
10917F0424758Q33033N49851N63225M18426J77149M00333K67977K21443M64164
$$ 60424758 61257791 61807642 62370867 62789293 62966442 63366775 63634752 63856195 64320359
10908F4320359j15439K00478R1937j55841K93478o1542j06305L19516p1598K12621
$$ 64320359 64204920 64405398 64497335 64341494 64634972 64573430 64467125 64786641 64715043 64927664
10898F4927664M59576j35967M77258L14671J82989N37241M22837N44899P16301
$$ 64927664 65387240 65251273 65728531 66043202 66226191 66763432 67186269 67731168 68447469
10889F8447469Q37316P09681J000615J141580J408624J307688J660054J870321
$$ 68447469 69284785 69994466 70995081 72136661 73545285 74852973 76513027 78383348
10881G8383348K108766K354117K750170K989043L092756M199832M143651M554485
$$ 78383348 80492114 82846231 85596401 88585444 91678200 95878032 100021683 104576168
10873A04576168M466062N085745M601344M925266M578142M132941L480603L006222
$$ 104576168 109042230 114127975 118729319 123654585 128232727 132365668 135846271 138852493
10865A38852493J805161J019555k06942q26948j985119k684391l581683m102264
$$ 138852493 140657654 141677209 141470267 140643319 138658200 135973809 132392126 128289862
10857A28289862m556771n466189n200640n230138n635042n391179n130158n136984
$$ 128289862 123733091 118266902 113066262 107836124 102201082 96809903 91679745 86542761
10849H6542761n091270m444348m527089m202804m214510l677134l613587l203292
$$ 86542761 81451491 77007143 72480054 68277250 64062740 60385606 56772019 53568727
10841E3568727l345839k962760k524554k333111k531217k216944j811113k120809
$$ 53568727 50222888 47260128 44735574 42402463 39871246 37654302 35843189 33722380
10833C3722380j448904j729047j375680j441357j084998j411765p64048j322379
$$ 33722380 32273476 30544429 29168749 27727392 26642394 25230629 24466581 23144202
10825B3144202q44144r64351q55494p36697o94361p32554n89678n49483m34611
$$ 23144202 22300058 21335707 20480213 19743516 19049155 18316601 17726923 17177440 16742829
10816A6742829m28777m15807l19837k21400l61864o37913J6755m92165l98784
$$ 16742829 16314052 15898245 15578408 15357008 14995144 14357231 14373986 13881821 13483037
10807A3483037l86684o29650j81838l82316m28189k67085n12966j37599n63957
$$ 13483037 13096353 12466703 12284865 11902549 11474360 11207275 10694309 10556710 9992753
10798I992753k7536l86483m20797N4366k34370k67687k96720j65639P5356k98635
$$ 9992753 9965217 9578734 9157937 9212303 8977933 8710246 8413526 8247887 8323243 8024608
10788H024608k13797J84835k45326j00422l24680j35814k68931j100j62608q962
$$ 8024608 7810811 7995646 7750320 7649898 7325218 7189404 6920473 6919373 6756765 6747803
10778F747803j68439O1511k86846Q5205m06251n4532j18787k20118K71159L8937
$$ 6747803 6579364 6640875 6354029 6439234 6032983 5978451 5859664 5639546 5910705 5949642
10768E949642m20509j64527K559K1144k63906m7778N9176J46721j03945k01633
$$ 5949642 5529133 5364606 5367165 5388309 5124403 5076625 5135801 5282522 5178577 4976944
10758D976944J75760k73300J50201j72739O783K05377r8218j8549q5718P6056
$$ 4976944 5152704 4879404 5029605 4856866 4863649 5069026 4970808 4952259 4866541 4942597
10748D942597j03302j36558R6771M0249k44702m7728j65630l49277P1672O2579
$$ 4942597 4839295 4702737 4799508 4839757 4595055 4547327 4381697 4032420 4104092 4166671
10738D166671r6616j70538J26833K3889K31142j24114K47838p0750O6210p4857
$$ 4166671 4070055 3899517 4026350 4050239 4281381 4157267 4405105 4334355 4400565 4325708
10728D325708J69957j19200O7157j2321J6847k37252J24722j64250k02734J66589
$$ 4325708 4495665 4376465 4443622 4431301 4448148 4210896 4335618 4171368 3968634 4135223
10718D135223p5927L61722m27968q9266N8283K19134k82910K71950j63702J30089
$$ 4135223 4059296 4421018 3993050 3903784 3962067 4181201 3898291 4170241 4006539 4136628
10708D136628k20002J8821K13139R5897j7786P0034j91438k3895R4034j59131
$$ 4136628 3916626 3935447 4148586 4244483 4226697 4296731 4105293 4081398 4175432 4016301
10698D016301l16223L24093j34504L5901p9044l5907k70104Q5802m4840L3494
$$ 4016301 3700078 4024171 3889667 3925568 3846524 3810617 3540513 3626315 3581475 3614969
10688C614969O7391J32372r8800Q5462j66938L278k67116K45664j97138J49171
$$ 3614969 3682360 3814732 3715932 3801394 3634456 3637734 3370618 3616282 3419144 3568315
10678C568315j56907o7285O7242k26657K30797J73867j26538J17064l46722M6612
$$ 3568315 3411408 3344123 3411365 3184708 3415505 3589372 3462834 3579898 3233176 3279788
10668C279788k56342m7471K28036m9207r935P3282m15635J12920n6339q7280n8415
$$ 3279788 3023446 2975975 3204011 3154804 3144869 3218151 2802516 2915436 2859097 2771817 2713402
10657B713402Q1268n247l32649L21900J75889j13501o496k74244K59350k60163
$$ 2713402 2794670 2789423 2456774 2778674 2954563 2841062 2834566 2560322 2819672 2559509
10647B559509K06295j53551j1629J583K72580j36309l82441P2228j24206K98357
$$ 2559509 2765804 2612253 2600624 2602207 2874787 2738478 2356037 2428265 2304059 2602416
10637B602416k55957P606J29715j57112J0873K84778j06493k20691M26192k32148
$$ 2602416 2346459 2354065 2483780 2326668 2337541 2622319 2515826 2295135 2721327 2489179
10627B489179j43363J04633j90875L10272l97883J59698j1153J05028j39519L43309
$$ 2489179 2345816 2450449 2259574 2569846 2171963 2331661 2320508 2425536 2286017 2629326
10617B629326l26027J12559j7984J37059j7029m5820k46802J35305J01088k11884
$$ 2629326 2303299 2415858 2397874 2534933 2517904 2472084 2225282 2360587 2461675 2249791
10607B249791J60579k20823J02998k33837O6905L12438l30050J24724j13982J14283
$$ 2249791 2410370 2189547 2292545 2058708 2125613 2438051 2108001 2232725 2118743 2233026
10597B233026P0839r5493N6425o355q3370J8492L4459o4579J62280k27302L03236
$$ 2233026 2303865 2208372 2264797 2258442 2175072 2193564 2228023 2163444 2325724 2098422 2401658
10586B401658k13279k7648q6267o9307M24777k39394L46338k62084r1747J05156
$$ 2401658 2188379 2160731 2074464 2005157 2429934 2190540 2536878 2274794 2183047 2288203
10576B288203j34113J01128l6814j09495m2152R1973j88086K30393K6040k74637
$$ 2288203 2154090 2255218 2218404 2108909 2066757 2158730 1970644 2201037 2227077 1952440
10566A952440n6639P5726j1527P071k70641P6824P2337n1224J19777j71314K02387
$$ 1952440 1895801 1971527 1960000 1967071 1696430 1773254 1845591 1794367 1914144 1742830 1945217
10555A945217j07148j23893K06880j21326p4743p426L7281P8259r7296J77985
$$ 1945217 1838069 1714176 1921056 1799730 1724987 1717561 1754842 1833101 1735805 1913790
10545A913790j50330j8551m7073J3543n090q1579K15183l5187J46906k16847j37071
$$ 1913790 1763460 1744909 1697836 1711379 1706289 1624710 1839893 1804706 1951612 1734765 1597694
10534A597694L44979j4679j01228j9956R4295J20854N4528k481l9285R8648l42202
$$ 1597694 1942673 1927994 1826766 1806810 1901105 2021959 2076487 2074006 2034721 2133369 1791167
10523A791167K20632J38644k062J1445L9923R9336K95272j6920J4202J00506J68824
$$ 1791167 2011799 2150443 2148381 2159826 2199749 2299085 2594357 2577437 2591639 2692145 2860969
10512B860969j76199n0303j62833N2855k46303J932r8243k10154K6142k0156J47880
$$ 2860969 2684770 2634467 2471634 2524489 2278186 2280118 2181875 1971721 1997863 1977707 2125587
10501B125587J1335K31062r2680J00301q175j24669q0855k7364O8705K80110J58114
$$ 2125587 2136922 2367984 2275304 2375605 2367430 2242761 2161906 2134542 2203247 2483357 2641471
10490B641471j17656J62711r2089N96824m18333J21393j34537J05681k16331j88774
$$ 2641471 2523815 2686526 2594437 3191261 2772928 2894321 2759784 2865465 2649134 2460360
10480B460360J5772J01141j33945l0765J09538k03049K40256j24094m6627J28877
$$ 2460360 2476132 2577273 2443328 2412563 2522101 2319052 2559308 2435214 2388587 2517464
10470B517464j14682K6576l0329N5349L27423K09927j36159j24663K92926l1281
$$ 2517464 2402782 2429358 2399029 2454378 2781801 2991728 2855569 2730906 3023832 2992551
10460B992551J70506j29646K00738k47852L28774j57685K34462K3925p6922J26826
$$ 2992551 3163057 3033411 3234149 2986297 3315071 3157386 3391848 3415773 3338851 3465677
10450C465677j88335Q2981P4716j39844n9212k88977R429O1532r7593k67145K15174
$$ 3465677 3277342 3360323 3435039 3295195 3235983 2947006 2956435 3017967 2920374 2653229 2868403
10439B868403K39050L00065O9228P5800q1945K98051l15030K11917J3943r2982
$$ 2868403 3107453 3407518 3476746 3552546 3470601 3768652 3453622 3665539 3679482 3586500
10429C586500l32812j99008j41144j28951l1096k41198J63638j68229K55818j88598
$$ 3586500 3253688 3054680 2913536 2784585 2753489 2512291 2675929 2507700 2763518 2574920
10419B574920l3698q1553K98196n0048o4348j29816K90499L02397R3374p6724
$$ 2574920 2541222 2459669 2757865 2707817 2643469 2513653 2804152 3106549 3199923 3123199
10409C123199K46984M28848K4832M96783N4023J97596K6505J25291o1743J88812
$$ 3123199 3370183 3799031 3823863 4320646 4374669 4572265 4598770 4724061 4662318 4851130
10399D851130k0932K71887K42341L08815K63610K50055M21236M41601O49544K06088
$$ 4851130 4830198 5102085 5344426 5653241 5916851 6166906 6588142 7029743 7679287 7885375
10389G885375J80073r327L88933j07914m2897j37864o7400k44255l99424k18070
$$ 7885375 8065448 8056121 8445054 8337140 8294243 8156379 8088979 7844724 7445300 7227230
10379G227230M2765l40342k92422M5451l78101L90298j54782K78071k58008K89644
$$ 7227230 7269995 6929653 6637231 6682682 6304581 6694879 6540097 6818168 6560160 6849804
10369F849804K0138L14974o2431N2835R2309K45303j47572k01151k5790j55581
$$ 6849804 6869942 7184916 7122485 7175320 7267629 7512932 7365360 7164209 7138419 6982838
10359F982838j05062l71571J0425q5877k98894K63722l56728k4853m2149j88742
$$ 6982838 6877776 6506205 6516630 6430753 6131859 6395581 6038853 6014000 5971851 5783109
10349E783109k68774N3710k87447Q5176m0315l40807J15767J6391k94359M57498
$$ 5783109 5514335 5568045 5280598 5365774 5325459 4984652 5100419 5116810 4822451 5279949
10339E279949l2029J76599j72585J60615j59661J04937j34119p6884K99451l6223
$$ 5279949 5247920 5424519 5251934 5412549 5252888 5357825 5223706 5146822 5446273 5410050
10329E410050L612j18838P9262k74756K27624l14613L83762j35385j27240J66255
$$ 5410050 5413662 5294824 5374086 5099330 5326954 5012341 5396103 5260718 5133478 5299733
10319E299733P1308Q1847k09286L495J76153L0212p1058R6450J96292k8607K06365
$$ 5299733 5371041 5452888 5243602 5247097 5423250 5453462 5382404 5478854 5675146 5646539 5852904
10308E852904J97571j28537K56300L0020J92812P7513n2422l3995K32703j65884
$$ 5852904 6050475 5921938 6178238 6208258 6401070 6478583 6426161 6392166 6624869 6458985
$$ [...]
##END NTUPLES=NMR SPECTRUM
##END=
