##TITLE=coffee_type TORI02-ROVE100C_50-50%
COFFEE_meoh_noesyp64 COFFEE_meoh {C:\Bruker\TOPSPIN} Administrator 6
##JCAMPDX= 6.0         $$ Bruker NMR JCAMP-DX V2.0
##DATA TYPE= NMR SPECTRUM
##DATA CLASS= NTUPLES
##ORIGIN= Bruker BioSpin GmbH
##OWNER= Administrator
$$ 1.72 TOPSPIN		Version 2.1
$$ 2012-05-18 15:47:06.979 -0700  Administrator@X
$$ Compression mode = diff/dup
##.OBSERVE FREQUENCY= 400.13188235
##.OBSERVE NUCLEUS= ^1H
##.ACQUISITION MODE= SIMULTANEOUS (DQD)
##.ACQUISITION SCHEME= undefined
##.AVERAGES= 64
##.DIGITISER RES= 22
##SPECTROMETER/DATA SYSTEM= spect
##.PULSE SEQUENCE= noesygpps1d.comp
##.SOLVENT NAME= COFFEE_meoh
##.SHIFT REFERENCE= INTERNAL, COFFEE_meoh, 1, 14.98061
##AUDIT TRAIL= $$ (NUMBER, WHEN, WHO, WHERE, PROCESS, VERSION, WHAT)
$$ ##TITLE= Audit trail, TOPSPIN		Version 2.1
$$ ##JCAMPDX= 5.01
$$ ##ORIGIN= Bruker BioSpin GmbH
$$ ##OWNER= Administrator
$$ $$ C:\Bruker\TOPSPIN/data/Administrator/nmr/12-COFFEE-2402/82/pdata/1/auditp.txt
$$ ##AUDIT TRAIL=  $$ (NUMBER, WHEN, WHO, WHERE, PROCESS, VERSION, WHAT)
(   1,<2012-02-24 21:03:23.656 -0500>,<Administrator>,<TOPSPIN>,<go>,<TOPSPIN 2.1>,
      <created by zg
	started at 2012-02-24 20:51:53.453 -0500,
	POWCHK enabled, PULCHK disabled,
       configuration hash MD5:
       B0 76 FB 9C 50 81 44 7D 18 B3 26 32 4E 60 AD 96
       data hash MD5: 64K
       6A 85 85 13 42 59 98 A7 12 F6 B7 18 87 57 0F 40>)
(   2,<2012-02-24 21:03:27.031 -0500>,<Administrator>,<TOPSPIN>,<proc1d>,<TOPSPIN 2.1>,
      <Start of raw data processing
       efp LB = 0.3 FT_mod = 6 PKNL = 1 PHC0 = 0 PHC1 = 0 SI = 128K 
       data hash MD5: 128K
       F6 46 9E A8 70 A4 1C 0E FF 0C FE 56 5F 35 E0 BA>)
(   3,<2012-02-24 21:03:28.328 -0500>,<Administrator>,<TOPSPIN>,<proc1d>,<TOPSPIN 2.1>,
      <pk PHC0 = 25.61462 PHC1 = 0 
       data hash MD5: 128K
       96 38 90 B0 89 E9 BF F6 FD 80 62 9E C1 44 AC BA>)
(   4,<2012-02-24 21:03:28.594 -0500>,<Administrator>,<TOPSPIN>,<proc1d>,<TOPSPIN 2.1>,
      <abs ABSG = 1 
       data hash MD5: 128K
       35 50 98 34 51 2B 09 09 B8 8A B5 2A D1 E5 74 BF>)
(   5,<2012-02-24 21:03:28.672 -0500>,<Administrator>,<TOPSPIN>,<proc1d>,<TOPSPIN 2.1>,
      <abs ABSG = 2 
       data hash MD5: 128K
       10 78 FD 92 87 BF E5 41 AA B1 E0 ED 32 A6 2C D9>)
(   6,<2012-02-24 21:03:28.719 -0500>,<Administrator>,<TOPSPIN>,<proc1d>,<TOPSPIN 2.1>,
      <abs ABSG = 3 
       data hash MD5: 128K
       FD AB 98 49 9A 2E E0 EF CB A0 71 BB 3D F6 23 EC>)
(   7,<2012-02-24 21:03:28.797 -0500>,<Administrator>,<TOPSPIN>,<proc1d>,<TOPSPIN 2.1>,
      <abs ABSG = 4 
       data hash MD5: 128K
       04 45 25 67 FE 2B A1 0A 58 FA A3 08 53 55 FB ED>)
(   8,<2012-02-24 21:03:28.844 -0500>,<Administrator>,<TOPSPIN>,<proc1d>,<TOPSPIN 2.1>,
      <abs ABSG = 5 
       data hash MD5: 128K
       31 2E 9D 11 01 E4 90 6D 95 20 2D CD 49 71 76 23>)
(   9,<2012-02-24 21:03:28.969 -0500>,<Administrator>,<TOPSPIN>,<audit>,<TOPSPIN 2.1>,
      <user comment:
       ICON-NMR User ID: Administrator
$$ [...]
150 150 150 150 150 150 150 150
##$TP07= 0
##$TPNAME0= <>
##$TPNAME1= <>
##$TPNAME2= <>
##$TPNAME3= <>
##$TPNAME4= <>
##$TPNAME5= <>
##$TPNAME6= <>
##$TPNAME7= <>
##$TPOAL= (0..7)
0.5 0.5 0.5 0.5 0.5 0.5 0.5 0.5
##$TPOFFS= (0..7)
0 0 0 0 0 0 0 0
##$TUNHIN= 0
##$TUNHOUT= 0
##$TUNXOUT= 0
##$USERA1= <user>
##$USERA2= <user>
##$USERA3= <user>
##$USERA4= <user>
##$USERA5= <user>
##$V9= 5
##$VALIST= <valist>
##$VCLIST= <CCCCCCCCCCCCCCC>
##$VD= 0
##$VDLIST= <DDDDDDDDDDDDDDD>
##$VPLIST= <PPPPPPPPPPPPPPP>
##$VTLIST= <TTTTTTTTTTTTTTT>
##$WBST= 1024
##$WBSW= 4
##$XGAIN= (0..3)
0 0 0 0
##$XL= 0
##$YL= 0
##$YMAX_a= 14209025
##$YMIN_a= -6351233
##$ZGOPTNS= <>
##$ZL1= 120
##$ZL2= 120
##$ZL3= 120
##$ZL4= 120
##$ABSF1= 14.98061
##$ABSF2= -5.57192
##$ABSG= 5
##$ABSL= 3
##$ALPHA= 0
##$AQORDER= 0
##$ASSFAC= 0
##$ASSFACI= 0
##$ASSFACX= 0
##$ASSWID= 0
##$AUNMP= <proc_prof1d_extract>
##$AXLEFT= 0
##$AXNAME= <>
##$AXNUC= <1H>
##$AXRIGHT= 0
##$AXTYPE= 0
##$AXUNIT= <>
##$AZFE= 0.1
##$AZFW= 0.1
##$BCFW= 0
##$BC_mod= 0
##$BYTORDP= 0
##$COROFFS= 0
##$CY= 15
##$DATMOD= 1
##$DC= 0
##$DFILT= <>
##$DTYPP= 0
##$F1P= 0
##$F2P= 0
##$FCOR= 0.5
##$FTSIZE= 131072
##$FT_mod= 6
##$GAMMA= 0
##$GB= 0
##$INTBC= 1
##$INTSCL= 1
##$ISEN= 128
##$LB= 0.3
##$LEV0= 0
##$LPBIN= 0
##$MAXI= 10000
##$MC2= 0
##$MEAN= 0
##$ME_mod= 0
##$MI= 0
##$NCOEF= 0
##$NC_proc= -3
##$NLEV= 6
##$NOISF1= 0
##$NOISF2= 0
##$NSP= 0
##$NTH_PI= 0
##$NZP= 0
##$OFFSET= 14.98061
##$PC= 1
##$PHC0= 25.61462
##$PHC1= 0
##$PH_mod= 1
##$PKNL= yes
##$PPARMOD= 0
##$PPDIAG= 0
##$PPIPTYP= 0
##$PPMPNUM= 2147483647
##$PPRESOL= 1
##$PSCAL= 4
##$PSIGN= 0
##$PYNMP= <proc.py>
##$REVERSE= no
##$SF= 400.13
##$SI= 131072
##$SIGF1= 0
##$SIGF2= 0
##$SINO= 400
##$SIOLD= 131072
##$SPECTYP= <>
##$SREGLST= <1H.CDCl3>
##$SSB= 0
##$STSI= 131072
##$STSR= 0
##$SW_p= 8223.68421052632
##$SYMM= 0
##$S_DEV= 0
##$TDeff= 65536
##$TDoff= 0
##$TI= <>
##$TILT= no
##$TM1= 0
##$TM2= 0
##$TOPLEV= 0
##$USERP1= <user>
##$USERP2= <user>
##$USERP3= <user>
##$USERP4= <user>
##$USERP5= <user>
##$WDW= 1
##$XDIM= 131072
##$YMAX_p= 500881767
##$YMIN_p= -249345514
##$CURPLOT= <Network HP LaserJet P1505>
##$CURPRIN= <$Network HP LaserJet P1505>
##$DFORMAT= <normdp>
##$LAYOUT= <+/1D_H.xwp>
##$LFORMAT= <normlp>
##$PFORMAT= <normpl>
##$SURQMSG= 1
$$ End of Bruker specific parameters
$$ ---------------------------------
##NTUPLES= NMR SPECTRUM
##VAR_NAME=  FREQUENCY,     SPECTRUM/REAL,   SPECTRUM/IMAG
##SYMBOL=    X,             R,               I
##VAR_TYPE=  INDEPENDENT,   DEPENDENT,       DEPENDENT
##VAR_FORM=  AFFN,          ASDF,            ASDF
##VAR_DIM=   131072,        131072,          131072
##UNITS=     HZ,            ARBITRARY UNITS, ARBITRARY UNITS
##FACTOR=    0.0627417313425165, 1,          1
##FIRST=     8223.62146879498, -617,         -89362
##LAST=      0,             1759,            -88827
##MIN=       0,             -249345514,      0
##MAX=       8223.62146879498, 500881767,    0
$$ Real data points
##PAGE= N=1
##DATA TABLE= (X++(R..R)), XYDATA
$$ [...]
60676A481302r636q852q865r337q935p367o020o004o643o825o778p221p679p023
$$ 1481302 1471666 1462814 1453949 1444612 1435677 1428310 1422290 1416286 1409643 1402818 1396040 1388819 1381140 1374117
60662A374117n398m179m084m677n617p075q593q884p352m957l045k032j778k337
$$ 1374117 1368719 1364540 1360456 1355779 1350162 1343087 1334494 1325610 1318258 1313301 1310256 1308224 1306446 1304109
60648A304109l638m892n285n017m970n456o065o786q356j0975j3355j4031j3305
$$ 1304109 1300471 1295579 1290294 1285277 1280307 1274851 1268786 1262000 1253644 1242669 1229314 1215283 1201978
60635A201978j2892j3569j4349j4358j4263j4850j5285j4315j2432j1179j0665
$$ 1201978 1189086 1175517 1161168 1146810 1132547 1117697 1102412 1088097 1075665 1064486 1053821
60624A053821r748q646r061j1126j2365j0972q226o209m764k584k9J381J672K362
$$ 1053821 1044073 1035427 1026366 1015240 1002875 991903 983677 977468 972704 970120 970091 971472 973144 975506
60610I75506L883N000N083N213O474Q437J0007J0781J0927J0418R105P325O017
$$ 975506 979389 984389 989472 994685 1001159 1009596 1019603 1030384 1041311 1051729 1060834 1068159 1074176
60597A074176O069P428Q974R705J0040J1156J2900J3614J2668J1943J3452J6440
$$ 1074176 1080245 1087673 1096647 1106352 1116392 1127548 1140448 1154062 1166730 1178673 1192125 1208565
60585A208565J8346J8074J6811J5966J5791J5937J6050J5857J5630J6264J7860
$$ 1208565 1226911 1244985 1261796 1277762 1293553 1309490 1325540 1341397 1357027 1373291 1391151
60574A391151J8850J7989J6507J6391J7046J5957J2766J0014R195Q538O034K492
$$ 1391151 1410001 1427990 1444497 1460888 1477934 1493891 1506657 1516671 1525866 1534404 1540438 1542930
60562A542930k07k210m996q666j1989j4568j7057j9418k0595k0126j8648j6692
$$ 1542930 1542723 1540513 1535517 1526851 1514862 1500294 1483237 1463819 1443224 1423098 1404450 1387758
60550A387758j4143j1155q460o398m569k857j826j463m14K549O761J0394J2779
$$ 1387758 1373615 1362460 1354000 1347602 1343033 1340176 1338350 1336887 1336473 1339022 1345783 1356177 1368956
60537A368956J4972J7726K0045K0465J9078J7267J5701J3770J1048Q113N550L229
$$ 1368956 1383928 1401654 1421699 1442164 1461242 1478509 1494210 1507980 1519028 1527141 1532691 1535920
60525A535920J307R06K652N143O190N436M461M280M028K648P57m5P17J746J384
$$ 1535920 1537227 1538133 1540785 1545928 1552118 1557554 1562015 1566295 1570323 1572971 1573728 1573683 1574400 1576146 1577530
60510A577530q55m043o779q310q963r589j0592j1598j2065j2038j2092j2544j2983
$$ 1577530 1576675 1572632 1565853 1557543 1548580 1538991 1528399 1516801 1504736 1492698 1480606 1468062 1455079
60497A455079j2747j1766j0421q613n722j875J480L174M014N731Q603J1448J3906
$$ 1455079 1442332 1430566 1420145 1411532 1405810 1403935 1405415 1408589 1412603 1418334 1426937 1438385 1452291
60484A452291J6964K0767K3712K4824K5591K8099L2374L6988M1433M6301N1694
$$ 1452291 1469255 1490022 1513734 1538558 1564149 1592248 1624622 1661610 1703043 1749344 1801038
60473A801038N7150O2961P0178P9094Q8792R8113J06224J12252J15339J15034
$$ 1801038 1858188 1921149 1991327 2070421 2159213 2257326 2363550 2475802 2591141 2706175
60463B706175J10986J02484Q9071P1285N0222K7174M611j3476k4075k7838k7871
$$ 2706175 2817161 2919645 3008716 3080001 3130223 3157397 3162008 3148532 3124457 3096619 3068748
60452C068748k5912k1126j2605j593R214J7495K2303K4252K4828K4868K3863K1575
$$ 3068748 3042836 3021710 3009105 3007512 3016726 3034221 3056524 3080776 3105604 3130472 3154335 3175910
60440C175910J9673K0376K3886K8746L4345M1439N0417O0970P3400Q8247J04420
$$ 3175910 3195583 3215959 3239845 3268591 3302936 3344375 3394792 3455762 3529162 3617409 3721829
60429C721829J20024J35547J54004J76759K01394K24939K47299K69725K91655
$$ 3721829 3841853 3977400 4131404 4308163 4509557 4734496 4981795 5251520 5543175
60420E543175L11378L29077L47157L67803L91849M20066M54102M95510N44261
$$ 5543175 5854553 6183630 6530787 6898590 7290439 7710505 8164607 8660117 9204378
60411I204378N98017O52158P00102P33589P42618P16175O45323N27395L67495
$$ 9204378 9802395 10454553 11154655 11888244 12630862 13347037 13992360 14519755 14887250
60402A4887250J76278l2823k44224m40623o05853p28921q06262q41326q42325
$$ 14887250 15063528 15030705 14786481 14345858 13740005 13011084 12204822 11363496 10521171
60393A0521171q18797p78430p26523o67824o07544n49618m95095m43455l95011
$$ 10521171 9702374 8923944 8197421 7529597 6922053 6372435 5877340 5433885 5038874
60384E038874l51109l12488k78615k48608k22072j98966j79109j61883j46350
$$ 5038874 4687765 4375277 4096662 3848054 3625982 3427016 3247907 3086024 2939674
60375B939674j31994j19355j09238j01209r3779q6276p9515p4068o9199o4307
$$ 2939674 2807680 2688325 2579087 2477878 2384099 2297823 2218308 2144240 2075041 2010734
60365B010734o0261n7949n6275n3164m8196m2999l9032l6121l3338l0372k7724
$$ 2010734 1950473 1892524 1836249 1783085 1734889 1691890 1652858 1616737 1583399 1553027 1525303
60354A525303k5977k5068k4192k2590k0571j9274j9019j8617j6793j3862j1253
$$ 1525303 1499326 1474258 1450066 1427476 1406905 1387631 1368612 1349995 1333202 1319340 1308087
60343A308087r823r286q926q224p011n685m993n110n233m577l357k239j332m61
$$ 1308087 1298264 1288978 1280052 1271828 1264817 1259132 1254139 1249029 1243796 1239219 1235862 1233623 1232291 1231830
60329A231830J8l79j247j646j453j577k716m506o088p029p530q041q802r617j0056
$$ 1231830 1231848 1231469 1230222 1228576 1227123 1225546 1222830 1218324 1212236 1205207 1197677 1189636 1180834 1171217 1161161
60314A161161r933r398q593p515o441n917o063o187n452l643j205J069K321K204
$$ 1161161 1151228 1141830 1133237 1125722 1119281 1113364 1107301 1101114 1095662 1092019 1090814 1091883 1094204 1096408
60300A096408J405R88J019N57o85j632j306p6J202K448L853M860M708L695K973
$$ 1096408 1097813 1098801 1099820 1100377 1099692 1098060 1096754 1096678 1097880 1100328 1104181 1109041 1113749 1117444 1120417
60285A120417L252M327N557O207N790M757M420N412O771P273P098P241P845Q283
$$ 1120417 1123669 1127996 1133553 1139760 1145550 1150307 1154727 1160139 1166910 1174183 1181281 1188522 1196367 1204650
60271A204650Q493Q914R335R136Q645Q925R955J0288R042P230O452O980P808P939
$$ 1204650 1213143 1222057 1231392 1240528 1249173 1258098 1268053 1278341 1287383 1294613 1301065 1308045 1315853 1323792
60257A323792P009N099K710P87O1J62k55k194n114p312p656o796o288o575o461
$$ 1323792 1330801 1335900 1338610 1339397 1339458 1339620 1339365 1337171 1332057 1324745 1317089 1310293 1304005 1297430 1290969
60242A290969m828k205m7J090J909L089M510N826P122Q513R517R277P536N210
$$ 1290969 1286141 1283936 1283889 1284979 1286888 1289977 1294487 1300313 1307435 1315948 1325465 1334742 1342278 1347488
60228A347488L842M319O171Q140R225R006P379M737K352J675K876M676N928O765
$$ 1347488 1351330 1355649 1361820 1369960 1379185 1388191 1395570 1400307 1402659 1404334 1407210 1411886 1417814 1424579
60214A424579P866R240J0376J1071J1565J2137J3046J4417J5870J6820J7519J9167
$$ 1424579 1432445 1441685 1452061 1463132 1474697 1486834 1499880 1514297 1530167 1546987 1564506 1583673
60202A583673K2334K5996K8923L1493L5100M0152M5636N0633N5267O0034O4946
$$ 1583673 1606007 1632003 1660926 1692419 1727519 1767671 1813307 1863940 1919207 1979241 2044187
60191B044187O9756P4600Q0089Q6793R4550J02302J09073J15193J21998J29944
$$ 2044187 2113943 2188543 2268632 2355425 2449975 2552277 2661350 2776543 2898541 3028485
60181C028485J37710J43643J47514J50132J51787J51931J49947J45305J37385
$$ 3028485 3166195 3309838 3457352 3607484 3759271 3911202 4061149 4206454 4343839
60172D343839J26317J13800J01799R0261P7212O1586M4900K9479J5817K722j0313
$$ 4343839 4470156 4583956 4685755 4776016 4853228 4914814 4959714 4989193 5005010 5007732 4997419
60161D997419k1907l0173l4635l6271l6117l4305l0445k4278j5746n017P164J9605
$$ 4997419 4975512 4945339 4910704 4874433 4838316 4804011 4773566 4749288 4733542 4728525 4735689 4755294
60149D755294L1703M4108N7651P1883Q5355R7207J07817J17948J27800J36668
$$ 4755294 4786997 4831105 4888756 4960639 5045994 5143201 5251018 5368966 5496766 5633434
60139E633434J42871J44402J40714J33535J24826J14158R9600Q0960O0545M0499
$$ 5633434 5776305 5920707 6061421 6194956 6319782 6433940 6533540 6614500 6675045 6715544
60129F715544K1158K330j5714l3108n0322o6227p8045q4457q7121q7915q6349
$$ 6715544 6736702 6739032 6723318 6690210 6639888 6573661 6495616 6411159 6324038 6236123 6149774
60118F149774q1037p2060o0143m5137k7206q255R851K7321M4923O1713P6548R0428
$$ 6149774 6068737 5996677 5936534 5891397 5864191 5855936 5865787 5893108 5938031 5999744 6076292 6166720
60106F166720J04699J17764J26366J29579J28723J23775J13049R6758P7854N8560
$$ 6166720 6271419 6389183 6515549 6645128 6773851 6897626 7010675 7107433 7185287 7243847
60096G243847L8725J8412m12j6046k8730l8739m4701m5296m1168l3831k3848j1148
$$ 7243847 7282572 7300984 7300572 7284526 7255796 7217057 7172356 7127060 7085892 7052061 7028213 7017065
60084G017065M154K2226M3614O7705R2340J16000J39413J64086J90411K18222
$$ 7017065 7021219 7043445 7087059 7154764 7247104 7363104 7502517 7666603 7857014 8075236
60074H075236K47714K78464L08555L36327L62208L87344M11056M31138M46290
$$ 8075236 8322950 8601414 8909969 9246296 9608504 9995848 10406904 10838042 11284332
60065A1284332M56667M62193M61707M54003M38515M14828L82519L41950K94511
$$ 11284332 11740999 12203192 12664899 13118902 13557417 13972245 14354764 14696714 14991225
60056A4991225K41725J84524J23560N9709n943p2126j37031j98243k53404l00867
$$ 14991225 15232950 15417474 15541034 15600743 15594800 15522674 15385643 15187400 14933996 14633129
60046A4633129l39563l68473l86743l94451l92661l82311l63468l36514l03644
$$ 14633129 14293566 13925093 13538350 13143899 12751238 12368927 12005459 11668945 11365301
60037A1365301k67903k30584j91031j49550j08769p0789l4392K713L9530P1912
$$ 11365301 11097398 10866814 10675783 10526233 10417464 10346675 10312283 10314996 10354526 10426438
60027A0426438R7061J15807J29948J39307J42394J38520J28094J11889R0967O6724
$$ 10426438 10523499 10639306 10769254 10908561 11050955 11189475 11317569 11429458 11520425 11587149
60017A1587149M0123J1443j8784m9304p9169j08499j37507j65373j90584k11933
$$ 11587149 11627272 11638715 11619931 11570627 11491458 11382959 11245452 11080079 10889495 10677562
60007A0677562k28651k40137k46114k46733k42171k32567k18601k01657j83106
$$ 10677562 10448911 10208774 9962660 9715927 9473756 9241189 9022588 8820931 8637825
59998H637825j63767j44122j24553j05259q6382o8196n0546l2385j2774P662K7281
$$ 8637825 8474058 8329936 8205383 8100124 8013742 7945546 7895000 7862615 7849841 7857503 7884784
59987G884784M5393O2562P8841R2954J03618J10460J13161J10915J03438R1538
$$ 7884784 7930177 7992739 8071580 8164534 8268152 8378612 8491773 8602688 8706126 8797664
59977H797664P6047N7058L4770J0177j5621m1883o7483r0897j11602j30389j47382
$$ 8797664 8873711 8930769 8965539 8975716 8960095 8918212 8850729 8759832 8648230 8517841 8370459
59966H370459j60830j68901j71771j70728j65976j56712j42998j26341j08398
$$ 8370459 8209629 8040728 7868957 7698229 7532253 7375541 7232543 7106202 6997804
59957F997804q9972p1252n2311l3262j4307M442K3287M2722O2737Q2802J02581
$$ 6997804 6907832 6836580 6784269 6751007 6736700 6741142 6764429 6807151 6869888 6952690 7055271
59946G055271J22048J40730J57666J72337J84669J93881J98338J97017J90083
$$ 7055271 7177319 7318049 7475715 7648052 7832721 8026602 8224940 8421957 8612040
59937H612040J77664J59317J35471J08144P9317M9535J8882j1838m1844p0999
$$ 8612040 8789704 8949021 9084492 9192636 9271953 9321488 9340370 9328532 9286688 9215689
59927I215689r8555j22470j41268j55432j65453j69733j66389j56323j42491j26561
$$ 9215689 9117134 8994664 8853396 8697964 8532511 8362778 8196389 8040066 7897575 7771014
59917G771014j08344q8105o7203m6269k4885l534J6153L3822N1244O9594Q7289
$$ 7771014 7662670 7574565 7507362 7461093 7436208 7432674 7448827 7482649 7533893 7603487 7690776
59906G690776J01793J12514J20613J26764J30482J31483J30334J27507J22559
$$ 7690776 7792569 7905083 8025696 8152460 8282942 8414425 8544759 8672266 8794825
59897H794825J14767J04339R2688Q1504P1594O2744N4692M8039M3982M3324M6097
$$ 8794825 8909592 9013931 9106619 9188123 9259717 9322461 9377153 9425192 9469174 9512498 9558595
59886I558595N2239O2235P6996R7080J22127J51024J82709K16652K52363K88701
$$ 9558595 9610834 9673069 9750065 9847145 9969272 10120296 10303005 10519657 10772020 11060721
59876A1060721L24286L58600L91839M23417M51242M72745M85899M88727M78730
$$ 11060721 11385007 11743607 12135446 12558863 13010105 13482850 13968749 14457476 14936206
59867A4936206M53698M12633L55360K82140J94790R7784k911j02046j95527k79478
$$ 14936206 15389904 15802537 16157897 16440037 16634827 16732611 16729700 16627654 16432127 16152649
59857A6152649l50337m06025m46005m70280m79338m74992m59961m36331m05390
$$ 16152649 15802312 15396287 14950282 14480002 14000664 13525672 13065711 12629380 12223990
59848A2223990l69121l30365k90846k50220k08056j65818j25738q8223n1720j5124
$$ 12223990 11854869 11524504 11233658 10983438 10775382 10609564 10483826 10395603 10343883 10328759
59838A0328759K0719N4121Q4245J11150J34602J53504J66348J71885J69197J57464
$$ 10328759 10349478 10403599 10487844 10598994 10733596 10887100 11053448 11225333 11394530 11551994
59828A1551994J35953J04437O3704J5605l7462r3176j49376k03569k52724k93934
$$ 11551994 11687947 11792384 11856088 11871693 11834231 11741055 11591679 11388110 11135386 10841452
59818A0841452l25465l47222l60342l66576l67548l63857l54862l39998l20592
$$ 10841452 10515987 10168765 9808423 9441847 9074299 8710442 8355580 8015582 7694990
59809G694990k99500k78575k57305k34698k11574j89922j70607j53035j36711
$$ 7694990 7395490 7116915 6859610 6624912 6413338 6223416 6052809 5899774 5763063
59800E763063j21685j07633r4119q2053p3411o8867o6787o5079o3004o0702n8166
$$ 5763063 5641378 5533745 5439626 5357573 5284162 5215295 5148508 5083429 5020425 4959723 4901557
59789D901557n5433n2769m9839m5513l9258l1971k4926j8778j4243j2553j4351
$$ 4901557 4846124 4793355 4743516 4698003 4658745 4626774 4601848 4583070 4568827 4556274 4541923
59778D541923j9005k5785l4618m4628n3221n8194o0068o0887o1262o0036n6413
$$ 4541923 4522918 4497133 4462515 4417887 4364666 4306472 4246404 4185517 4124255 4064219 4007806
59767D007806n0942m4589l8177l2421k7181k0863j2077j819P521J5329K3337L2759
$$ 4007806 3956864 3912275 3874098 3841677 3814496 3793633 3781556 3779737 3787258 3802587 3825924 3858683
59755C858683M2489N1030N8743O6936P5546Q2980Q8069R1205R3476R5278R6033
$$ 3858683 3901172 3952202 4010945 4077881 4153427 4236407 4324476 4415681 4509157 4604435 4700468
59744D700468R5009R2090Q7539Q1165P2219O0596M7853L6640K9128K6091K7108
$$ 4700468 4795477 4887567 4975106 5056271 5128490 5189086 5236939 5273579 5302707 5328798 5355906
59733E355906L1140L7144M4683N3903O4732P6400Q8183J00390J14154J30538J50093
$$ 5355906 5387046 5424190 5468873 5522776 5587508 5663908 5752091 5852481 5966635 6097173 6247266
59722F247266J72821J97988K24371K51312K79178L08262L37535L65048L88842
$$ 6247266 6420087 6618075 6842446 7093758 7372936 7681198 8018733 8383781 8772623
59713H772623M06328M12905M02298L68883L09995K27227J27033J9964q2197j70024
$$ 8772623 9178951 9591856 9994154 10363037 10673032 10900259 11027292 11047256 10965059 10795035
59703A0795035k38155k84776l10714l18813l12799k95881k70595k39823k06926
$$ 10795035 10556880 10272104 9961390 9642577 9329778 9033897 8763302 8523479 8316553
59694H316553j74328j42377j10239p7859m6700j8347P280L1841N6607Q1258J05197
$$ 8316553 8142225 7999848 7889609 7811750 7765050 7746703 7753983 7785824 7842431 7923689 8028886
59683H028886J29107J53936J78903K02411K25131K50067K78794L09591L40437
$$ 8028886 8157993 8311929 8490832 8693243 8918374 9168441 9447235 9756826 10097263
59674A0097263L71897M05223M39475M73103N07284N44853N86179O28584O70006
$$ 10097263 10469160 10874383 11313858 11786961 12294245 12839098 13425277 14053861 14723867
59665A4723867P10744P51137P89673Q24285Q53587Q75744Q87749Q87336Q74937
$$ 14723867 15434611 16185748 16975421 17799706 18653293 19529037 20416786 21304122 22179059
59656B2179059Q52883Q23555P89203P52981P19102O91864O74515O68384O72621
$$ 22179059 23031942 23855497 24644700 25397681 26116783 26808647 27483162 28151546 28824167
59647B8824167O85050P03358P25119P46779P63507P70359P63429P40164O99308
$$ 28824167 29509217 30212575 30937694 31684473 32447980 33218339 33981768 34721932 35421240
59638C5421240O40567N64047M70680L64046K51150J40157L7343n2913j26273j78542
$$ 35421240 36061807 36625854 37096534 37460580 37711730 37851887 37889230 37836317 37710044 37531502
59628C7531502k07843k15038k01777j69509j20501n7899J5911R9788J92114K89933
$$ 37531502 37323659 37108621 36906844 36737335 36616834 36558935 36574846 36674634 36866748 37156681
59618C7156681L90489M92290N93989O93318P87640Q74311R49640J008414J044864
$$ 37156681 37547170 38039460 38633449 39326767 40114407 40988718 41938358 42946772 43991636
59609D3991636J052910J025165R53788Q33946O65954M53819K03876p3331l61388
$$ 43991636 45044546 46069711 47023499 47857445 48523399 48977218 49181094 49107763 48746375
59600D8746375o40880q94659j110245j279237j397354j465704j490180j478565
$$ 48746375 48105495 47210836 46100591 44821354 43424000 41958296 40468116 38989551
59592C8989551j438315j376690j301697j222140j147064j085142j043824j028002
$$ 38989551 37551236 36174546 34872849 33650709 32503645 31418503 30374679 29346677
59584B9346677j038221j068925j108528j143237j163068j164993j150446j121073
$$ 29346677 28308456 27239531 26131003 24987766 23824698 22659705 21509259 20388186
59576B0388186j077857j023323r62155q98783q35332p72511p11625o54668o02656
$$ 20388186 19310329 18287006 17324851 16426068 15590736 14818225 14106600 13451932 12849276
59567A2849276n54663n09051m65353m24570l87611l54045l22824k93668k66945
$$ 12849276 12294613 11785562 11320209 10895639 10508028 10153983 9831159 9537491 9270546
59558I270546k42486k19614j98549j80548j66135j54097j43044j33269j26267
$$ 9270546 9028060 8808446 8609897 8429349 8263214 8109117 7966073 7832804 7706537
59549G706537j22983j23233j26320j31286j36797j41642j45387j48150j49837
$$ 7706537 7583554 7460321 7334001 7202715 7065918 6924276 6778889 6630739 6480902
59540F480902j50070j48550j45002j39222j31679j23610j15765j07395r7423q6327
$$ 6480902 6330832 6182282 6037280 5898058 5766379 5642769 5527004 5419609 5322186 5235859
59530E235859p5879o7020n8972n0575m1568l2148k2312j2349l334L807R523J5126
$$ 5235859 5159980 5092960 5033988 4983413 4941845 4909697 4887385 4875036 4871702 4875509 4885032 4900158
59518D900158K1132K6672L0666L3028L4604L6363L8863M2045M5276M8122N1230
$$ 4900158 4921290 4947962 4978628 5011656 5046260 5082623 5121486 5163531 5208807 5256929 5308159
59507E308159N5947O2586O9942P7231Q5725R7034J10245J22608J33390J45139
$$ 5308159 5364106 5426692 5496634 5573865 5659590 5756624 5866869 5989477 6122867 6268006
59497F268006J60232J77765J95303K12433K30795K51162K72402K93173L13059
$$ 6268006 6428238 6606003 6801306 7013739 7244534 7495696 7768098 8061271 8374330
59488H374330L31725L48371L62509L74397L84290L91679L95397L94086L86910
$$ 8374330 8706055 9054426 9416935 9791332 10175622 10567301 10962698 11356784 11743694
59479A1743694L74442L58474L40256L19577K96465K72828K50670K29229K05872
$$ 11743694 12118136 12476610 12816866 13136443 13432908 13705736 13956406 14185635 14391507
59470A4391507J79987J54086J30851J10997R4744Q3432P8378P9294Q4971R4423
$$ 14391507 14571494 14725580 14856431 14967428 15062172 15145604 15223982 15303276 15388247 15482670
59460A5482670J06316J18062J26534J29182J23843J08341Q1316M3095m847o0934
$$ 15482670 15588986 15707048 15833582 15962764 16086607 16194948 16276264 16319359 16314512 16253578
59450A6253578j23546j90645k59691l27540l90385m44624m88091n19796n38828
$$ 16253578 16130032 15939387 15679696 15352156 14961771 14517147 14029056 13509260 12970432
59441A2970432n44885n39985n27707n09928m85811m54926m19822l84073l49081
$$ 12970432 12425547 11885562 11357855 10847927 10362116 9907190 9487368 9103295 8754214
59432H754214l14362k80126k47811k18271j90769j63912j36891j10124q5079o2940
$$ 8754214 8439852 8159726 7911915 7693644 7502875 7338963 7202072 7091948 7006869 6943929
59422F943929m2895k2598q57K1081M1690O1460Q1901J03223J24389J44801J64641
$$ 6943929 6901034 6878436 6877579 6898660 6940350 7001810 7083711 7186934 7311323 7456124 7620765
59411G620765J83979K02746K21025K38372K53378K65005K73536K78929K78993
$$ 7620765 7804744 8007490 8228515 8466887 8720265 8985270 9258806 9537735 9816728
59402I816728K70893K53844K28642J95104J52227J01017M4952j3012p2066j31322
$$ 9816728 10087621 10341465 10570107 10765211 10917438 11018455 11063407 11050395 10978329 10847007
59392A0847007j87626k36956k77082l07921l30206l44931l53383l56420l53777
$$ 10847007 10659381 10422425 10145343 9837422 9507216 9162285 8808902 8452482 8098705
59383H098705l45021l31085l14127k95975k77355k58607k40211k22345k04701
$$ 8098705 7753684 7422599 7108472 6812497 6535142 6276535 6036324 5813979 5609278
59374E609278j87225j70518j54943j39805j24407j09613r7160q7155p7449o6180
$$ 5609278 5422053 5251535 5096592 4956787 4832380 4722767 4625607 4538452 4461003 4394823
59364D394823n4004m2851l3517k5579j8895j3395p945j173O530J3543J9552K5729
$$ 4394823 4340819 4297968 4264451 4238872 4219977 4206582 4198637 4197464 4203994 4217537 4237089 4262818
59352D262818L2306L8158M3434N0136N8734O6212O9261O8066O5460O3875O4876
$$ 4262818 4295124 4333282 4376716 4426852 4485586 4551798 4621059 4689125 4754585 4818460 4883336
59341D883336P0032P9789R2216J05253J19630J37324J57430J75985J90247K01238
$$ 4883336 4953368 5033157 5125373 5230626 5350256 5487580 5645010 5820995 6011242 6212480
59331F212480K11846K24296K40116K60581K86126L16149L49893L86585M24704
$$ 6212480 6424326 6648622 6888738 7149319 7435445 7751594 8101487 8488072 8912776
59322H912776M62682N00760N40683N82747O24418O62577O95790P23250P42700
$$ 8912776 9375458 9876218 10416901 10999648 11624066 12286643 12982433 13705683 14448383
59313A4448383P51002P46287P28342O97466O54517O02198N44831M86100M27639
$$ 14448383 15199385 15945672 16674014 17371480 18025997 18628195 19173026 19659126 20086765
59304B0086765L70139L14866K63250K15411J70007J25476Q0607L3956j6153p0264
$$ 20086765 20456904 20771770 21035020 21250431 21420438 21545914 21626521 21660477 21644324 21574060
59294B1574060j26983j84061k39646k91808l37616l74132m00241m16772m25284
$$ 21574060 21447077 21263016 21023370 20731562 20393946 20019814 19619573 19202801 18777517
59285A8777517m28019m28563m30467m34599m39200m42991m46678m50809m53936
$$ 18777517 18349498 17920935 17490468 17055869 16616669 16173678 15727000 15276191 14822255
59276A4822255m54079m50636m43623m32376m16540l97332l76240l53142l27127
$$ 14822255 14368176 13917540 13473917 13041541 12625001 12227669 11851429 11498287 11171160
59267A1171160k98566k69074k40003k12157j86247j62136j38318j13770q9931
$$ 11171160 10872594 10603520 10363517 10151360 9965113 9802977 9664659 9550889 9460958
59258I460958o9226n2066l7011k3627j3386p490n445o197r424j5221k3431l3531
$$ 9460958 9391732 9339666 9302655 9279028 9265642 9258152 9252707 9246510 9237086 9221865 9198434 9164903
59246I164903m4597n5504o5884p6361q6873r5494j00335j02057j02679j02324
$$ 9164903 9120306 9064802 8998918 8922557 8835684 8740190 8639855 8537798 8435119 8332795
59236H332795r9160r2609q4313p5473o5237n2658l8284k2727n395J3787L2759
$$ 8332795 8233635 8141026 8056713 7981240 7916003 7863345 7825061 7802334 7796939 7810726 7843485
59225G843485M9322O4128P9919R7948J16513J33303J48058J62349J77387J92709
$$ 7843485 7892807 7956935 8036854 8134802 8251315 8384618 8532676 8695025 8872412 9065121
59215I065121K06874K18838K28239K34561K36642K33397K24590K10454J90919
$$ 9065121 9271995 9490833 9719072 9953633 10190275 10423672 10648262 10858716 11049635
59206A1049635J65722J35126J00252O2910K5321j0710m4826p7778j09491j38219
$$ 11049635 11215357 11350483 11450735 11513645 11538966 11528256 11483430 11405652 11296161 11157942
59196A1157942j62229j81383j96118k05961k10513k11012k08965k03856j94365
$$ 11157942 10995713 10814330 10618212 10412251 10201738 9990726 9781761 9577905 9383540
59187I383540j82001j71351j65833j64516j63541j59336j49981j35099j15736
$$ 9383540 9201539 9030188 8864355 8699839 8536298 8376962 8226981 8091882 7976146
59178G976146r3644o9903m4520j7395J1179M1136P2607J05089J37664J70478K04726
$$ 7976146 7882502 7812599 7768079 7750684 7761863 7802999 7875606 7980695 8118359 8288837 8493563
59167H493563K40626K76532L10713L42970L73558M01274M23457M37487M41674
$$ 8493563 8734189 9010721 9321434 9664404 10037962 10439236 10862693 11300180 11741854
59158A1741854M34973M16239L83614L34958K69748J90679J02537R482q5677j79695
$$ 11741854 12176827 12593066 12976680 13311638 13581386 13772065 13874602 13884084 13798407 13618712
59148A3618712k68001l46248m11732m62838m98369n18246n23812n16764m98738
$$ 13618712 13350711 13004463 12592731 12129893 11631524 11113278 10589466 10072702 9573964
59139I573964m72566m42544m12042l81514l49895l17353k85482k55521k27647
$$ 9573964 9101398 8658854 8246812 7865298 7515403 7198050 6912568 6657047 6429400
59130F429400k01829j78066j55896j34784j15166r8154q3847p0820n7706m4777
$$ 6429400 6227571 6049505 5893609 5758825 5643659 5545505 5461658 5390838 5333132 5288355
59120E288355l3383k4049j5777p266J544R609J6253K2051K8085L4820M2045M9406
$$ 5288355 5254972 5230923 5215146 5207880 5209424 5219033 5235286 5257337 5285422 5320242 5362287 5411693
59108E411693N6536O3039O8969P4978Q1347Q7235R1612R4644R7241R9451J00332
$$ 5411693 5468229 5531268 5600237 5675215 5756562 5843797 5935409 6030053 6127294 6226745 6327077
59097F327077R9265R6264R0934Q2437P0826N7408M3397K9055J4477J01j4027k8355
$$ 6327077 6426342 6522606 6613540 6695977 6766803 6824211 6867608 6896663 6911140 6911241 6897214 6868859
59085F868859m2356n3934o1277o4834o6515o7235o6168o2344n6155m9008m1831
$$ 6868859 6826503 6772569 6711292 6646458 6579943 6512708 6446540 6384196 6328041 6279033 6237202
59074F237202l4171k4814j3190J5J3772K7811M2350N7005P0813Q3500R6032J09519
$$ 6237202 6203031 6178217 6165027 6165042 6178814 6206625 6248975 6305980 6376793 6460293 6556325 6665844
59062F665844J24033J38901J53853J69338J85594K01760K16501K29725K43160
$$ 6665844 6789877 6928778 7082631 7251969 7437563 7639323 7855824 8085549 8328709
59053H328709K58391K74425K88147K97478L03013L06207L07122L04700K97949
$$ 8328709 8587100 8861525 9149672 9447150 9750163 10056370 10363492 10668192 10966141
59044A0966141K85695K66060K37557K00164J54394J00290L8697k7414r4435j60179
$$ 10966141 11251836 11517896 11755453 11955617 12110011 12210301 12248998 12221584 12127149 11966970
59034A1966970k22976k79796l27468l65375l94866m16355m29086m33399m30882
$$ 11966970 11743994 11464198 11136730 10771355 10376489 9960134 9531048 9097649 8666767
59025H666767m22264m07712l89399l71045l53994l36030l15211k92787k71184
$$ 8666767 8244503 7836791 7447392 7076347 6722353 6386323 6071112 5778325 5507141
59016E507141k51126k32205k14608j98610j83586j69032j55729j44677j35546
$$ 5507141 5256015 5023810 4809202 4610592 4427006 4257974 4102245 3957568 3822022
59007C822022j27215j19115j11171j03205r5132q7216p9689p2813o7372o4031
$$ 3822022 3694807 3575692 3464521 3361316 3266184 3178968 3099279 3026466 2959094 2895063
58997B895063o1965n9362n5608n1725m8406m5195m1980l9541l7917l5948l3288
$$ 2895063 2833098 2773736 2718128 2666403 2617997 2572802 2530822 2491281 2453364 2417416 2384128
58986B384128l1157l0111k8711k5654k1756j8443j5573j2169q203m345q12K249
$$ 2384128 2352971 2322860 2294149 2268495 2246739 2228296 2212723 2200554 2192351 2188006 2187194 2189443
58974B189443M144M529M300M597N620P100R031J1200J2949J4117J5248J6269J6112
$$ 2189443 2193587 2198116 2202416 2207013 2212633 2219733 2228764 2239964 2252913 2267030 2282278 2298547 2314659
58961B314659J4219J1265P862M009K59k221l510n011o849p151m997k004L85L030
$$ 2314659 2328878 2340143 2348005 2352014 2352273 2350052 2346542 2341531 2334682 2327531 2322534 2320530 2320915 2323945
58947B323945O782J0094J1107J0436R679Q596O068K621l95l120o381r493j1133
$$ 2323945 2330727 2340821 2351928 2362364 2372043 2380639 2386707 2389328 2388933 2385813 2379432 2369939 2358806
58934B358806j1707j2565j3470j3024j1236r438p933n771k735K52K716N059P617
$$ 2358806 2347099 2334534 2321064 2308040 2296804 2287366 2279433 2273662 2270927 2271179 2273895 2278954 2286571
58921B286571J0514J4034J7756K0157K0662K1131K3511K6956K9410L1129L4071
$$ 2286571 2297085 2311119 2328875 2349032 2369694 2390825 2414336 2441292 2470702 2501831 2535902
58910B535902L8177M1142M1941M2099M3004M4405M6036M8578N1985N4743N5732
$$ 2535902 2574079 2615221 2657162 2699261 2742265 2786670 2832706 2881284 2933269 2988012 3043744
58899C043744N5575N5463N5818N6762N8698O1779O5558O9483P3240P6635Q0009
$$ 3043744 3099319 3154782 3210600 3267362 3326060 3387839 3453397 3522880 3596120 3672755 3752764
58888C752764Q4428R0522R7544J04621J12246J21205J30694J39414J48035J58427
$$ 3752764 3837192 3927714 4025258 4129879 4242125 4363330 4494024 4633438 4781473 4939900
58878D939900J70669J83030J95071K08465K24175K40994K57736K75048K93980
$$ 4939900 5110569 5293599 5488670 5697135 5921310 6162304 6420040 6695088 6989068
58869F989068L14326L35530L58096L82998M10621M41024M74301N09998N46957
$$ 6989068 7303394 7638924 7997020 8380018 8790639 9231663 9705964 10215962 10762919
58860A0762919N84428O22708O62067P01835P40850P78187Q13049Q44459Q71130
$$ 10762919 11347347 11970055 12632122 13333957 14074807 14852994 15666043 16510502 17381632
58851A7381632Q90944R00561Q96412Q75959Q37160P77267O93728N86604M58814
$$ 17381632 18272576 19173137 20069549 20945508 21782668 22559935 23253663 23840267 24299081
58842B4299081L14127J56687p303j69599l22954m62940n86211o88727p67488q22946
$$ 24299081 24613208 24769895 24762592 24592993 24270039 23807099 23220888 22532161 21764673 20941727
58832B0941727q58058q75389q76490q63620q40258q09469p72829p31532o87670
$$ 20941727 20083669 19208280 18331790 17468170 16627912 15818443 15045614 14314082 13626412
58823A3626412o43749o01369n61051n23132m88023m55483m24521l94782l67443
$$ 13626412 12982663 12381294 11820243 11297111 10809088 10353605 9929084 9534302 9166859
58814I166859l43773l23057l03064k82733k63174k45674k29867k14583j99444
$$ 9166859 8823086 8500029 8196965 7914232 7651058 7405384 7175517 6960934 6761490
58805F761490j84783j70763j57512j45438j34626j24516j14791j05749r7222q8113
$$ 6761490 6576707 6405944 6248432 6102994 5968368 5843852 5729061 5623312 5526090 5437977
58795E437977p7799o6940n6176m5288l4569k5367j7785r384J807J4270K5122L4261
$$ 5437977 5360178 5293238 5237062 5191774 5157205 5131838 5114053 5104669 5106476 5120746 5145868 5180129
58783E180129M4032N5517O7728Q0020R2708J05264J16599J27493J40329J55750
$$ 5180129 5224161 5279678 5347406 5427426 5520134 5625398 5741997 5869490 6009819 6165569
58773F165569J71766J86831K01735K17548K33834K50224K68069K88875L12169
$$ 6165569 6337335 6524166 6725901 6943449 7177283 7427507 7695576 7984451 8296620
58764H296620L36401L61256L87900M17257M48934M81771N15064N49325N85834
$$ 8296620 8633021 8994277 9382177 9799434 10248368 10730139 11245203 11794528 12380362
58755A2380362O25016O65478P05150P42961P78441Q09993Q34715Q49966Q53838
$$ 12380362 13005378 13670856 14376006 15118967 15897408 16707401 17542116 18392082 19245920
58746A9245920Q44026Q17447P71469P04695O16374N06191L75310K27350O8191
$$ 19245920 20089946 20907393 21678862 22383557 22999931 23506122 23881432 24108782 24176973
58737B4176973r4944k54620m04376n39095o54322p46324q13768q58718q84807
$$ 24176973 24082029 23827409 23423033 22883938 22229616 21483292 20669524 19810806 18925999
58728A8925999q94727q90235q73637q47768q14857p76690p35472o93238o50761
$$ 18925999 18031272 17141037 16267400 15419632 14604775 13828085 13092613 12399375 11748614
58719A1748614o08331n67158n28708m93052m59290m27250l97627l70878l47256
$$ 11748614 11140283 10573125 10044417 9551365 9092075 8664825 8267198 7896320 7549064
58710G549064l27163l10012k93559k76184k59088k44357k31563k18469k04500
$$ 7549064 7221901 6911889 6618330 6342146 6083058 5838701 5607138 5388669 5184169
58701E184169j91024j78453j65549j51836j38421j26146j14878j04823r6386q8576
$$ 5184169 4993145 4814692 4649143 4497307 4358886 4232740 4117862 4013039 3916653 3828077
58691C828077p9706p0045o1757n5788n0793m5551m0387l5754l1254k6749k2810
$$ 3828077 3748371 3678326 3616569 3560781 3509988 3464437 3424050 3388296 3357042 3330293 3307483
58680C307483j9732j7617j7432k0144k4825k9514l3952l9157m4492m7729m8524
$$ 3307483 3287751 3270134 3252702 3232558 3207733 3178219 3144267 3105110 3060618 3012889 2964365
58669B964365m9152n0995n2793n3287n3204n3539n3952n3998n4130n4438n4173
$$ 2964365 2915213 2864218 2811425 2758138 2704934 2651395 2597443 2543445 2489315 2434877 2380704
58658B380704n3391n3330n4318n5075n4731n3751n2341m9902m6677m3861m1463
$$ 2380704 2327313 2273983 2219665 2164590 2109859 2056108 2003767 1953865 1907188 1863327 1821864
58647A821864l8226l4305l1593l0663k9746k7756k5936k5355k5165k4492k3706
$$ 1821864 1783638 1749333 1717740 1687077 1657331 1629575 1603639 1578284 1553119 1528627 1504921
58636A504921k2692k0370j7172j5426j5723j5540j3180j0471r519r328q004o112
$$ 1504921 1482229 1461859 1444687 1429261 1413538 1397998 1384818 1374347 1364828 1355500 1347496 1341384
58624A341384n120m356k382p2M10j141l005m140m589m059k167K94K031K929L743
$$ 1341384 1336264 1331908 1329526 1329454 1329864 1328723 1325718 1321578 1316989 1312930 1310763 1311057 1313088 1316017 1319760
58609A319760M626N171N385N532N564N451N433N370M780L913L546L305J824p47
$$ 1319760 1324386 1329557 1334942 1340474 1346038 1351489 1356922 1362292 1367072 1370985 1374531 1377836 1379660 1378913
58595A378913k300j743n69l64n04L42K190M512P440J0868J3876J6228J9020K2702
$$ 1378913 1376613 1374870 1374301 1373937 1373433 1373775 1375965 1380477 1387917 1398785 1412661 1428889 1447909 1470611
58581A470611K6092K8471L0852L4096L7588M0912M4915M9688N3766N6779O0808
$$ 1470611 1496703 1525174 1556026 1590122 1627710 1668622 1713537 1763225 1816991 1873770 1934578
58570A934578O7327P4805Q1312Q7520R5105J03864J12680J21945J32903J45652
$$ 1934578 2001905 2076710 2158022 2245542 2340647 2444511 2557191 2679136 2812039 2957691
58560B957691J59464J73996J88759K02745K15822K28962K41993K52867K60345
$$ 2957691 3117155 3291151 3479910 3682655 3898477 4127439 4369432 4622299 4882644
58551D882644K65032K66521K62009K49387K29104K01148J63349J15286O1217O229
$$ 4882644 5147676 5414197 5676206 5925593 6154697 6355845 6519194 6634480 6695697 6701926
58541F701926m8060j00975j48588j85929k11941k28906k38400k41025k38733k33820
$$ 6701926 6653866 6552891 6404303 6218374 6006433 5777527 5539127 5298102 5059369 4825549
58531D825549k26320k15335k02036j88592j75136j60698j46006j32476j19455
$$ 4825549 4599229 4383894 4181858 3993266 3818130 3657432 3511426 3378950 3259495
58522C259495j05564r1804q0236p0475o0667n1121m3744l8414l3275k8276k5184
$$ 3259495 3153931 3062127 2981891 2911416 2850749 2799628 2755884 2717470 2684195 2655919 2630735
58511B630735k4012k2497j9427j5958j3361j1652j0615j0275j0423j1210j3693
$$ 2630735 2606723 2584226 2564799 2548841 2535480 2523828 2513213 2502938 2492515 2481305 2467612
58500B467612j8307k3808k9333l5963m4118n1267n4927n6255n7614n8212n5776
$$ 2467612 2449305 2425497 2396164 2360201 2316083 2264816 2209889 2153634 2096020 2037808 1982032
58489A982032n1334m8239m7020m5167m1993l9747l9405l8862l6275l2484k9330
$$ 1982032 1930698 1882459 1835439 1790272 1748279 1708532 1669127 1630265 1593990 1561506 1532176
58478A532176k7791k8079k9422k9691k7367k3887k1900k1559k0807j8786j6582
$$ 1532176 1504385 1476306 1446884 1417193 1389826 1365939 1344039 1322480 1301673 1282887 1266305
58467A266305j4984j3951j3809j4616j4927j3672j2362j2776j3549j2236r648
$$ 1266305 1251321 1237370 1223561 1208945 1194018 1180346 1167984 1155208 1141659 1129423 1119775
58456A119775q560q791p481m104j302n36o35r40k183l632k921L86M159P242J0529
$$ 1119775 1111215 1102424 1094943 1090839 1089537 1089001 1088366 1087426 1085243 1081611 1078690 1079076 1083235 1090477 1101006
58441A101006J3995J5973J6206J6465J7276J7103J5764J5552J7793K1002K3560
$$ 1101006 1115001 1130974 1147180 1163645 1180921 1198024 1213788 1229340 1247133 1268135 1291695
58430A291695K5576K7028K6750K4534K1871J9455J6013J0663M409j534p088j2313
$$ 1291695 1317271 1344299 1371049 1395583 1417454 1436909 1452922 1463585 1467994 1466460 1459372 1447059
58418A447059j6967k1428k6109k9793l0600k8844k6875k6001k5630k5191k4516
$$ 1447059 1430092 1408664 1382555 1352762 1322162 1293318 1266443 1240442 1214812 1189621 1165105
58407A165105k2656j9013j5488j4555j5323j4614j1837r493q709p795n845m191
$$ 1165105 1142449 1123436 1107948 1093393 1078070 1063456 1051619 1042126 1033417 1025622 1019777 1015586
58395A015586l414k110K21K047K696L618N742Q024R509J0428J0685R835Q945R799
$$ 1015586 1012172 1010062 1010283 1012330 1015026 1018644 1024386 1032410 1041919 1052347 1063032 1072867 1081812 1091611
58381A091611J1877J2908J2728J3525J5912J8119J9554K1609K4021K3939K0014
$$ 1091611 1103488 1116396 1129124 1142649 1158561 1176680 1196234 1217843 1241864 1265803 1285817
58370A285817J4360R253M698L04l349o311r400j1934j2202j0874j0715j2150j2459
$$ 1285817 1300177 1309430 1314128 1314432 1311083 1304772 1295372 1283438 1271236 1260362 1249647 1237497 1225038
58357A225038j0404q134p175o000l227rK503N135Q363J0715J1189J0892J0872
$$ 1225038 1214634 1206500 1199325 1193325 1190098 1190089 1192592 1197727 1206090 1216805 1227994 1238886 1249758
58344A249758J0603R795R216Q780P144M019N84k850o930j0841j2900j3704j5279
$$ 1249758 1260361 1270156 1279372 1288152 1295296 1299315 1299899 1297049 1290119 1279278 1266378 1252674 1237395
58331A237395j6955j6061j3215j2523j5414j8463j8937j8352j8830j9650j9298
$$ 1237395 1220440 1204379 1191164 1178641 1163227 1144764 1125827 1107475 1088645 1068995 1049697
58320A049697j7543j3895p380P10P182J1165J4529J7442J7843J6402J7112K1075
$$ 1049697 1032154 1018259 1010879 1011589 1018771 1029936 1044465 1061907 1079750 1096152 1113264 1134339
58308A134339K4333K3947K1923K0831K0011J8646J8376J9967K1200K0701K0264
$$ 1134339 1158672 1182619 1204542 1225373 1245384 1264030 1282406 1302373 1323573 1344274 1364538
58297A364538K1000K1126J9890J9649K1440K2509K0985J9109J9000J9096J7534
$$ 1364538 1385538 1406664 1426554 1446203 1467643 1490152 1511137 1530246 1549246 1568342 1585876
58286A585876J5157J2504P803J056l953m923m536n624o651n282k645o11J635M919
$$ 1585876 1601033 1613537 1621340 1622396 1618443 1613520 1608984 1603360 1596709 1591427 1588782 1588171 1589806 1594725
58272A594725P370P685P994J0374J3564J5878J8051K0688K2427K3206K5512K9810
$$ 1594725 1602095 1609780 1617774 1628148 1641712 1657590 1675641 1696329 1718756 1741962 1767474 1797284
58260A797284L2708L2404L1657L2696L3598L2784L2391L3781L4311L2084K9500
$$ 1797284 1829992 1862396 1894053 1926749 1960347 1993131 2025522 2059303 2093614 2125698 2155198
58249B155198K8492K6843K2891J9300J8257J7494J4971J3005J3729J5035J5055
$$ 2155198 2183690 2210533 2233424 2252724 2270981 2288475 2303446 2316451 2330180 2345215 2360270
58238B360270J5956J9241K2158K3049K5193L0730L5744L6440L5537L7449M1546
$$ 2360270 2376226 2395467 2417625 2440674 2465867 2496597 2532341 2568781 2604318 2641767 2683313
58227B683313M5080M8320N1860N3317N1723N0999N4257N9018O2397O6190P2248
$$ 2683313 2728393 2776713 2828573 2881890 2933613 2984612 3038869 3097887 3160284 3226474 3298722
58216C298722P7986Q1348Q5046R1046R6183R7956R8995J00985J00361R5235R0079
$$ 3298722 3376708 3458056 3543102 3634148 3730331 3828287 3927282 4028267 4128628 4223863 4313942
58205D313942Q8158Q6110Q1614P9094Q1633Q4835Q5491Q8525R7803J07978J13727
$$ 4313942 4402100 4488210 4569824 4648918 4730551 4815386 4900877 4989402 5087205 5195183 5308910
58194E308910J19445J30981J45037J55765J64957J76635J88564J98177K09706
$$ 5308910 5428355 5559336 5704373 5860138 6025095 6201730 6390294 6588471 6798177
58185F798177K26111K41403K50682K60148K77206K98482L18092L39450L67651
$$ 6798177 7024288 7265691 7516373 7776521 8053727 8352209 8670301 9009751 9377402
58176I377402L98242M25337M53054M87099N23175N55746N89814O31387O75098
$$ 9377402 9775644 10200981 10654035 11141134 11664309 12220055 12809869 13441256 14116354
58167A4116354P14304P54541Q03747Q58754R15156R80069J060483J149953J242072
$$ 14116354 14830658 15585199 16388946 17247700 18162856 19142925 20203408 21353361 22595433
58158B2595433J344927J465594J593309J716505J843930J990041K153231K328127
$$ 22595433 23940360 25405954 26999263 28715768 30559698 32549739 34702970 37031097
58150C7031097K523645K746645K984442L228371L498495L820688M199487M641409
$$ 37031097 39554742 42301387 45285829 48514200 52012695 55833383 60032870 64674279
58142F4674279N181260N851217O646870P559925Q617262R843128J1205788J2643054
$$ 64674279 69855539 75706756 82353626 89913551 98530813 108373941 119579729 132222783
58134A32222783J4112467J5587995J7085381J8774188K0986923K3973685K7651729
$$ 132222783 146335250 161923245 179008626 197782814 218769737 242743422 270395151
58127B70395151L1645725L5373998L7770181L7015592L1209536J9935643N212744
$$ 270395151 302040876 337414874 375185055 412200647 443410183 463345826 468558570
58120D68558570r429706k1026944k8483697l2260294l3337606l2604964l0787695
$$ 468558570 459128864 438101920 409618223 377357929 344020323 311415359 280627664
58113B80627664k8444811k5904926k3314400k0772592j8372241j6155812j4127722
$$ 280627664 252182853 226277927 202963527 182190935 163818694 147662882 133535160
58106A33535160j2307999j0720505r347340q148857p113829o244848n513293m874369
$$ 133535160 121227161 110506656 101159316 93010459 85896630 79651782 74138489 69264120
58098F9264120m311406l824874l394818k995101k630535k320961k060213j824851
$$ 69264120 64952714 61127840 57733022 54737921 52107386 49786425 47726212 45901361
58090D5901361j609192j416662j229595j022441p94099n55798k99776j2178K95009
$$ 45901361 44292169 42875507 41645912 40623471 39829372 39273574 38973798 38961620 39256629
58081C9256629N95788Q82911J165292J456322J795923K252788K855302L538745
$$ 39256629 39852417 40735328 41900620 43356942 45152865 47405653 50260955 53799700
58073E3799700M201811M771147N125248M984421M025944K204167q8440k249428
$$ 53799700 58001511 62772658 67897906 72882327 76908271 79112438 79023998 76774570
58065G6774570l854126m819400n274510n374542n233424m939000m560648m143916
$$ 76774570 72920444 68101044 62826534 57451992 52218568 47279568 42718920 38575004
58057C8575004l717833l305184k920953k570133k253886j973694j728523j514481
$$ 38575004 34857171 31551987 28631034 26060901 23807015 21833321 20104798 18590317
58049A8590317j329360j173395j045280r40953q55658p84474p22740o68644o23086
$$ 18590317 17260957 16087562 15042282 14101329 13245671 12461197 11738457 11069813 10446727
58040A0446727n84732n48298n10007m71242m34463l99424l65847l35692l09934
$$ 10446727 9861995 9313697 8803690 8332448 7897985 7498561 7132714 6797022 6487088
58031F487088k86842k66123k50778k42274k37432k32664k27624k22469k15461
$$ 6487088 6200246 5934123 5683345 5441071 5203639 4970975 4743351 4520882 4305421
58022D305421k05789j95286j84980j73377j60111j47792j38077j29342j19999
$$ 4305421 4099632 3904346 3719366 3545989 3385878 3238086 3100009 2970667 2850668
58013B850668j10904j02821r4950q7546q2427p9517p6273p1810o7975o5313o1954
$$ 2850668 2739764 2636943 2541993 2454447 2372020 2292503 2216230 2144420 2076445 2011132 1949178
58002A949178n7515n3928n1351m7723m3682m2927m5778m7412m5017m1962m1872
$$ 1949178 1891663 1837735 1786384 1738661 1694979 1652052 1606274 1558862 1513845 1471883 1430011
57991A430011m2979m1878l9020l6766l4924l1969k8439k5883k4140k2125j9837
$$ 1430011 1387032 1345154 1306134 1269368 1234444 1202475 1174036 1148153 1124013 1101888 1082051
57980A082051j7686j5609j4193j4513j5602j4629j0935p198n254l717j377J52
$$ 1082051 1064365 1048756 1034563 1020050 1004448 989819 978884 971686 966432 962715 961338 961490
57968I61490o86k653m025n251p148q682q652p617o343m310j353J214K689M026
$$ 961490 960804 958151 954126 948875 941727 933045 924393 916776 910433 906123 904770 905984 908673 912699
57954I12699N468N446L514J917K393L570L445K419J971K218K662L679N408O748
$$ 912699 918167 923613 927127 929044 931437 935007 938452 940871 942842 945060 947722 951401 956809 963557
57940I63557O988O988P388P322O166M815L980K916J187q5nO60P71j55l002q771
$$ 963557 970545 977533 984921 992243 998409 1003224 1007204 1010120 1011307 1011222 1011217 1011877 1012648 1012493 1009491 1000720
57924A000720j6114k1554k3545k4178k5406k6053k4298k0859j7586j4723j1659
$$ 1000720 984606 963052 939507 915329 889923 863870 839572 818713 801127 786404 774745
57913G74745q857p110o072n068m163l381k370j782k919n019n287l000r78j351
$$ 774745 765888 758778 752706 747638 743475 740094 737724 735942 733023 728004 722717 719717 718739 717388
57899G17388k472k258j815l022m855n332n320o955r544j0455r383q528q821q972
$$ 717388 714916 712658 710843 707821 702966 697634 692314 685359 675815 665360 655977 647449 638628 629656
57885F29656q228p361o536m751j894O36J994K948M274N699O876Q035R020Q794
$$ 629656 621428 614067 607531 602780 600886 601522 603516 606464 610738 616437 623313 631348 640368 649162
57871F49162O738L780J459J42j298l980p411r859j0518j0658j1888j3763j4505
$$ 649162 655900 659680 661139 661281 659983 656003 648592 638733 628215 617557 605669 591906 577401
57858E77401j3812j3280j3732j3882j2476j0149q158o548m681k566n96J117K340
$$ 577401 563589 550309 536577 522695 510219 500070 491912 485364 480683 478117 477521 478638 480978
57845D80978K501J710J091J327J792J693J111L88l76p34l6J307K136K540L814
$$ 480978 483479 485189 486280 487607 489399 491092 492203 492591 492215 491481 491445 492752 494888 497428 501242
57830E01242N886O801N809M817N256N555L697O55r73o24Om33j992m378o983q434
$$ 501242 507128 513929 519738 524555 529811 535366 539063 539718 538745 538121 538127 537694 535702 531324 524341 515907
57814E15907p863o305n453n501n452m957m494m172l584k544j019R75K728L107
$$ 515907 508044 501739 496286 490785 485333 480376 475882 471710 468126 465582 464563 465538 468266 471373
57800D71373K451K894N510Q429R285Q323P380P000O573O348O973P629O760M516
$$ 471373 473824 476718 482228 490657 499942 508265 515645 522645 529218 535566 542539 550168 556928 561444
57786E61444K506J364L36q74j806k677m271o216p091o521n709n633o066o574p202
$$ 561444 563950 565314 565650 564776 562970 560293 556022 549806 542715 536194 530485 524852 518786 512212 505010
57771E05010p807p862p228o355n660n426o006p246q071p621o485n745n321m469
$$ 505010 497203 489341 482113 475758 470098 464672 458666 451420 443349 435728 429243 423498 418177 413708
57757D13708l471l384m400n816p357r056j0140r641q157p481q330r672j0347j0015
$$ 413708 410237 406853 402453 396637 389280 380224 370084 360443 352286 344805 336475 326803 316456 306441
57743C06441q554o073l649k641k903k951k091j131p71o56l29J12P44K026L814
$$ 306441 297887 291814 288165 285524 282621 279670 277579 276448 275677 275021 274692 274804 275548 277574 281388
57728B81388N172N623N711O103O979Q426J0411J2295J3498J4676J6905J9504K0178
$$ 281388 286560 292183 297894 303997 310976 319402 329813 342108 355606 370282 387187 406691 426869
57715D26869J7829J3882J0222P142M122J279j005k949m725n712n493n046n807
$$ 426869 444698 458580 468802 475944 480066 481345 480340 477391 472666 466954 461461 456415 450608
57702D50608p684r096q995q073p699q124q207o833m359k305j575j346k46J753
$$ 450608 442924 433828 424833 416760 409061 400937 392730 385897 381538 379233 377658 376312 376066 377819
57688C77819L205L004J732J023J871L702M988M818L947L931N231O718P326P283
$$ 377819 381024 384028 385760 386783 388654 392356 397344 402162 406109 410040 415271 421989 429315 436598
57674D36598P166O714N628M743N153O537P642Q112Q639R539J0446J1292J2312
$$ 436598 443764 450478 456106 460849 466002 472539 480181 488293 496932 506471 516917 528209 540521
57661E40521J3112J3073J2784J3757J6416J9484K1605K2570K2904K3333K4729
$$ 540521 553633 566706 579490 593247 609663 629147 650752 673322 696226 719559 744288
57650G44288K7372L0086L1294L1118L1293L2898L5544L8884M3250M8242N2442
$$ 744288 771660 801746 833040 864158 895451 928349 963893 1002777 1046027 1094269 1146711
57639A146711N5355N8363O2712O7865P2814P7847Q3773R0407R7031J03775J11267
$$ 1146711 1202066 1260429 1323141 1391006 1463820 1541667 1625440 1715847 1812878 1916653 2027920
57628B027920J19537J28380J38318J50002J62854J75386J86912J98112K09811
$$ 2027920 2147457 2275837 2414155 2564157 2727011 2902397 3089309 3287421 3497232
57619C497232K21698K32215K39198K40602K34998K21581J99840J69919J33560
$$ 3497232 3718930 3951145 4190343 4430945 4665943 4887524 5087364 5257283 5390843
57610E390843R4256N5820K0861r126l2577m7727n4633n7710o5551q6276j21278
$$ 5390843 5485099 5540919 5561780 5552654 5520077 5472350 5417717 5360007 5294456 5208180 5086902
57599E086902j63325k01525k28311k41854k43660k36090k22044k04630j85820
$$ 5086902 4923577 4722052 4493741 4251887 4008227 3772137 3550093 3345463 3159643
57590C159643j66194j46368j27540j10381r4616q0152o7445n6299m5672l5316
$$ 3159643 2993449 2847081 2719541 2609160 2514544 2434392 2366947 2310648 2264976 2229660
57580B229660k6248j8768j1381k786O314J4573K2193L0355L9182M7753N5806O4178
$$ 2229660 2203412 2184644 2173263 2170477 2176791 2191364 2213557 2243912 2283094 2330847 2386653 2450831
57568B450831P3683Q4290R5423J06382J16794J26849J36844J46334J54528J61551
$$ 2450831 2524514 2608804 2704227 2810609 2927403 3054252 3191096 3337430 3491958 3653509
57558C653509J68030J72985J73552J67558J55048J36449J10820P7514L8436l034
$$ 3653509 3821539 3994524 4168076 4335634 4490682 4627131 4737951 4815465 4853901 4850867
57548D850867m4365q3695j18517j46671j68209j84391j95231j99813j98791j94557
$$ 4850867 4806502 4722807 4604290 4457619 4289410 4105019 3909788 3709975 3511184 3316627
57538C316627j88737j81225j71839j61222j49846j37688j25451j14687j06096
$$ 3316627 3127890 2946665 2774826 2613604 2463758 2326070 2200619 2085932 1979836
57529A979836r8861r2097q5868q0317p4921o9211o3362n7605n1939m6795m2933
$$ 1979836 1880975 1788878 1703010 1622693 1547772 1478561 1415199 1357594 1305655 1258860 1215927
57518A215927m0230l7548l4432l1951l1018l0701k9148k5716k1444j7750j5446
$$ 1215927 1175697 1138149 1103717 1071766 1040748 1010047 980899 955183 933739 915989 900543
57507I00543j4696j4990j5028j3414r955o152l939l689l686j887J848N779Q444
$$ 900543 885847 870857 855829 842415 832460 826308 822369 818680 814994 813107 814955 820734 829178
57494H29178J0048J1457J2827J4103J5988J9170K2905K5601K6785K7482K8657
$$ 829178 839226 850683 863510 877613 893601 912771 935676 961277 988062 1015544 1044201
57483A044201L0355L2521L5560L9688M4532M9670N4963O0158O4951O9586P4647
$$ 1044201 1074556 1107077 1142637 1182325 1226857 1276527 1331490 1391648 1456599 1526185 1600832
57472A600832Q0024Q5010Q9750R5572J03279J11828J19408J25344J30089J33694
$$ 1600832 1680856 1765866 1855616 1951188 2054467 2166295 2285703 2411047 2541136 2674830
57462B674830J35008J32443J25014J12534R5258P3556M7842J8728j2670m4341
$$ 2674830 2809838 2942281 3067295 3179829 3275087 3348643 3396485 3415213 3402543 3358202
57452C358202p3405r7053j14105j25587j33275j37767j38613j36103j31680j26190
$$ 3358202 3284797 3187744 3073639 2948052 2814777 2677010 2538397 2402294 2270614 2144424
57442B144424j19042j09953j00342r1762q3726p4632o4349n4552m6653m0631l5749
$$ 2144424 2025382 1915429 1815087 1723325 1639599 1564967 1500618 1446066 1399413 1358782 1323033
57431A323033l1261k6433k1081j6034j2061q456l918J351N738Q494J0697J3690
$$ 1323033 1291772 1265339 1244258 1228224 1216163 1207707 1203789 1205140 1210878 1219372 1230069 1243759
57419A243759J7742K2450K7460L2522L7764M3919N1355N9040O5640P1540P8378
$$ 1243759 1261501 1283951 1311411 1343933 1381697 1425616 1476971 1536011 1601651 1673191 1751569
57408A751569Q6605R5018J02771J10139J16963J22106J25057J26291J25141J19008
$$ 1751569 1838174 1933192 2035963 2146102 2263065 2385171 2510228 2636519 2761660 2880668
57398B880668J05961Q6882O3797L7322P349k4535n5069q1789j04384j23398j38420
$$ 2880668 2986629 3073511 3137308 3174630 3181979 3157444 3102375 3020586 2916202 2792804 2654384
57387B654384j47987j51244j49364j44863j39248j32107j23110j13810j06104
$$ 2654384 2506397 2355153 2205789 2060926 1921678 1789571 1666461 1552651 1446547
57378A446547r9655r2729q5257p8886p3965o8834o2587n6439n1545m7475m3677
$$ 1446547 1346892 1254163 1168906 1090020 1016055 947221 884634 828195 776650 729175 685498
57367F85498m0528l7882l4660l0983k8827k9108k9955k9228k7068k4534k1643
$$ 685498 644970 607088 572428 541445 512618 483510 453555 424327 397259 372725 351082
57356C51082j8481j6372j5974j5784j4504j3268j3378j3528j1844r340q480r167
$$ 351082 332601 316229 300255 284471 269967 256699 243321 229793 217949 208609 200129 190962
57344A90962r044p267n304m222l685l516l849l786k274l07Q1j015j602j230j539
$$ 190962 181918 174651 169347 165125 161440 157924 154075 150289 148015 147708 147789 146774 145172 143942 142403
57329A42403k871l141j127J389K134J171j53j515l355n386o816p487p778p788
$$ 142403 139532 136391 135264 136653 138787 139958 139805 138290 134935 129549 122733 115246 107468 99680
57315I9680p281o116m511l238l453n527q089r266q865q206p843o877m858k960
$$ 99680 92399 86283 81772 78534 75081 69554 61465 52199 43334 35128 27285 20408 15550 12590
57301A2590k586l719A014e182n814l888j063J322K307J893O62o39j280j093p59
$$ 12590 10004 6285 1014 -5182 -10996 -14884 -15947 -14625 -12318 -10425 -9763 -10402 -11682 -12775 -13534
57286a3534q52q34J01J538K278K125K062K795f0F244Q547R740Q828O806N977P017
$$ -13534 -14386 -15220 -15119 -13581 -11303 -9178 -7116 -4321 -60 6244 14791 24531 33359 40165 46142 53159
57270E3159Q268Q429Q422R738J2065J3701J3629J2356J1013J0268J0092J0295
$$ 53159 61427 69856 78278 88016 100081 113782 127411 139767 150780 161048 171140 181435
57258A81435J0984J2091J2640J1539R483Q736J0120J1607J1273J0194J0598J2348
$$ 181435 192419 204510 217150 228689 238172 246908 257028 268635 279908 290102 300700 313048
57246C13048J3654J4335J5647J7342J7756J6948J6993J8664K0467K1506K2857
$$ 313048 326702 341037 356684 374026 391782 408730 425723 444387 464854 486360 509217
57235E09217K5168K7321K8507K9520L0878L1724L1757L2311L4270L6599L8242
$$ 509217 534385 561706 590213 619733 650611 682335 714092 746403 780673 817272 855514
57224H55514L9823M2145M4465M5649M5821M5733M5591M5309M4671M2481L7283
$$ 855514 895337 937482 981947 1027596 1073417 1119150 1164741 1210050 1254721 1297202 1334485
57213A334485K9867K3412J9840J7469J3605Q019K448k060n696q677j0971j2729
$$ 1334485 1364352 1387764 1407604 1425073 1438678 1446697 1449145 1447085 1441389 1432712 1421741 1409012
57201A409012j3916j4043j2943j1085q503m498Q85O038R212J0165J0018J0225
$$ 1409012 1395096 1381053 1368110 1357025 1348522 1344024 1344909 1350947 1360159 1370324 1380342 1390567
57189A390567J1735J4064J5170J3574J0574Q932R552J1304J3822J7997K3448K8311
$$ 1390567 1402302 1416366 1431536 1445110 1455684 1464616 1474168 1485472 1499294 1517291 1540739 1569050
57177A569050L2320L7520M4926N2747N8918O3072O5091O4235O0887N6660N1663
$$ 1569050 1601370 1638890 1683816 1736563 1795481 1858553 1923644 1987879 2048766 2105426 2157089
57166B157089M4134L3981K3824J5328P687J246q90K770R427J6453K5331L8061
$$ 2157089 2201223 2235204 2259028 2274356 2282043 2283289 2282399 2285169 2294596 2311049 2336380 2374441
57154B374441N2553O5410P6975Q9623J02767J13439J20876J26864J32179J35826
$$ 2374441 2426994 2492404 2569379 2659002 2761769 2875208 2996084 3122948 3255127 3390953
57144C390953J37226J36293J32160J24643J16204J09568J03891R5995Q5042P3314
$$ 3390953 3528179 3664472 3796632 3921275 4037479 4147047 4250938 4346933 4431975 4505289
57134D505289O2854N3776M5735L8755L2787K8098K5672K5461K5170K2546J8152
$$ 4505289 4568143 4621919 4667654 4706409 4739196 4767294 4792966 4818427 4843597 4866143 4884295
57123D884295J4152J1449R662Q650Q122O874M339J738R4j495m004o590q256r483
$$ 4884295 4898447 4909896 4919558 4928208 4936330 4943204 4947543 4949281 4949375 4947880 4943876 4937286 4929030 4919547
57109D919547j0558j0599j0097j1794j6792k2511k6867l1429l7579m2933m5127
$$ 4919547 4908989 4898390 4888293 4876499 4859707 4837196 4810329 4778900 4741321 4698388 4653261
57098D653261m6200m9250n3596n7256o1504o8617p7419q5310r2233r8431j01248
$$ 4653261 4607061 4557811 4504215 4446959 4385455 4316838 4239419 4154109 4061876 3963445 3862197
57087C862197r9090r5931r6613j00094j02535j04548j09515j17112j24568j32514
$$ 3862197 3763107 3667176 3570563 3470469 3367934 3263386 3153871 3036759 2912191 2779677
57077B779677j43309j55384j65499j74983j87346k01385k13382k24611k39658
$$ 2779677 2636368 2480984 2315485 2140502 1953156 1751771 1538389 1313778 1074120
57068A074120k58511k77403B41877g6650l43612l68486l94215m24370m57739m90380
$$ 1074120 815609 538206 241877 -76650 -420262 -788748 -1182963 -1607333 -2065072 -2555452
57058b555452n23885n63745o10701o61926p19186p86947q64084r47131j040329
$$ -2555452 -3079337 -3643082 -4253783 -4915709 -5634895 -6421842 -7285926 -8233057 -9273386
57049i273386j152300j284326j432730j601222j799045k028429k286511k578053
$$ -9273386 -10425686 -11710012 -13142742 -14743964 -16543009 -18571438 -20857949 -23436002
57041b3436002k912481l290314l707880m173711m703490n302243n973464o744237
$$ -23436002 -26348483 -29638797 -33346677 -37520388 -42223878 -47526121 -53499585 -60243822
57033f0243822p652376q698556r831616j0990357j2146050j3302483j4458923
$$ -60243822 -67896198 -76594754 -86426370 -97416727 -109562777 -122865260 -137324183
57026a37324183j5532200j6259380j6224057j5135020j3168563j0940158q991847
$$ -137324183 -152856383 -169115763 -185339820 -200474840 -213643403 -224583561 -233575408
57019b33575408p302580n396901k939872j30753K504073M594852O150650P413110
$$ -233575408 -240877988 -246274889 -249214761 -249345514 -246841441 -242246589 -236095939 -228682829
57011b28682829Q622121R902028J1245985J2537838J3615485J4354406J4704873
$$ -228682829 -220060708 -210158680 -198912695 -186374857 -172759372 -158404966 -143700093
57004a43700093J4671200J4289186J3625853J2769332J1799533J0773212R733811
$$ -143700093 -129028893 -114739707 -101113854 -88344522 -76544989 -65771777 -56037966
56997e6037966Q717497P746144O829846N981188N216285M540935L948233L431522
$$ -56037966 -47320469 -39574325 -32744479 -26763291 -21547006 -17006071 -13057838 -9626316
56989i626316K987864K607523a757903B14899J706251J473081J267828J087194
$$ -9626316 -6638452 -4030929 -1757903 214899 1921150 3394231 4662059 5749253
56981E749253R32836Q03084O90069N88283M98696M22165L56212L00324K56832
$$ 5749253 6682089 7485173 8175242 8763525 9262221 9684386 10040598 10340922 10597754
56972A0597754K23946J95101J67823J46460J33525J24944J16569J08915J02528
$$ 10597754 10821700 11016801 11184624 11331084 11464609 11589553 11706122 11815037 11917565
56963A1917565R4599Q3505P1410N9408M4994K7018Q318r329k8253n0014p1775
$$ 11917565 12012164 12095669 12167079 12226487 12271481 12298499 12306817 12297488 12269235 12219221 12147446
56952A2147446r0487j07176j24630j44109j66149j91009k16480k38671k56840
$$ 12147446 12056959 11949783 11825153 11681044 11514895 11323886 11107406 10868735 10611895
56943A0611895k74411k94279l16607l41700l70139l98353m18667m26227m22432
$$ 10611895 10337484 10043205 9726598 9384898 9014759 8616406 8197739 7771512 7349080
56934G349080m10319l91023l66660l41758l18602k94585k66619k34854k00129
$$ 7349080 6938761 6547738 6181078 5839320 5520718 5226133 4959514 4724660 4524531
56925D524531j61877j20968q0487m0839K046N0779J02650J53901K01772K36667
$$ 4524531 4362654 4241686 4161199 4120360 4122406 4173185 4275835 4429736 4631508 4868175
56915D868175K37522J84377P7915n6744j85578k83288l39941l58647l50222l26821
$$ 4868175 5105697 5290074 5367989 5311245 5125667 4842379 4502438 4143791 3793569 3466748
56905C466748k96764k63811k29871j96928j66926j41099j19244r9322p9110n9208
$$ 3466748 3169984 2906173 2676302 2479374 2312448 2171349 2052105 1952783 1873673 1814465
56895A814465m3084l3312k9416l0137l5225m3372n0880n4840n6107n6891n7115
$$ 1814465 1771381 1738069 1708653 1678516 1643291 1599919 1549039 1494199 1438092 1381201 1324086
56884A324086n5443n2302m9052m5269l9544l2354k5753k0655j6415j2565q938
$$ 1324086 1268643 1216341 1167289 1122020 1082476 1050122 1024369 1003714 987299 974734 965796
56873I65796m740N73N934R982J3009J5572J5938J1467K456p588j5672k1485k5776
$$ 965796 961056 961629 967563 977545 990554 1006126 1022064 1033531 1035987 1028399 1012727 991242 965466
56860I65466k8549k9540k8965k7097k4065k0400j7016j4387j2320j0544q967p504
$$ 965466 936917 907377 878412 851315 827250 806850 789834 775447 763127 752583 743616 736112
56848G36112o237n421m964m376l698l689m432m795m188l834m964o708p238o482
$$ 736112 729875 724454 719490 715114 711416 707727 703295 698500 694312 690478 685514 678806 671568 665086
56834F65086o003o443o635n469l374j498j74J384M066P544J0046J0077Q347P090
$$ 665086 659083 652640 646005 640536 637162 635664 635490 636874 640940 648484 658530 668607 676954 684044
56820F84044P180P246O195N066N277O423P286P928R166J0817J2190J3633J5844
$$ 684044 691224 698470 704665 709731 715008 721431 728717 736645 745811 756628 768818 782451 798295
56807G98295J8201J9551K0368K2316K5687K8985L1316L3628L7115M1235M3662
$$ 798295 816496 836047 856415 878731 904418 933403 964719 998347 1035462 1076697 1120359
56796A120359M1487L2844J8602K625j0668j9351k4193k6375k6163k3660j9551
$$ 1120359 1161846 1194690 1213292 1215917 1205249 1185898 1161705 1135330 1109167 1085507 1065956
56785A065956j4610r226l507K630R460J6944K4427L1394L8180M5277N2487N9573
$$ 1065956 1051346 1042120 1038613 1041243 1050703 1067647 1092074 1123468 1161648 1206925 1259412 1318985
56773A318985O7012P4640P9622P7184O3993M0602J1204j8116m1579n6116o2547
$$ 1318985 1385997 1460637 1540259 1617443 1681436 1722038 1733242 1715126 1673547 1617431 1554884
56762A554884o3888o2450n8966n3835m7755m0947l3031k4200j5713q615k390M559
$$ 1554884 1490996 1428546 1369580 1315745 1267990 1227043 1194012 1169812 1154099 1145484 1143094 1147653
56750A147653J3264K3155L2753M1220M8796N4950N6498M9117L1708Q373j4664
$$ 1147653 1160917 1184072 1216825 1258045 1306841 1361791 1418289 1467406 1499114 1507487 1492823
56739A492823l3307m6372n3912n6730n6637n5189n2132m6470l8885l1583k5717
$$ 1492823 1459516 1413144 1359232 1302502 1245865 1190676 1138544 1092074 1053189 1021606 995889
56728I95889k0363j4300p625j247M310R173J3763J8248K2065K4180K3959K1131
$$ 995889 975526 961226 953601 952354 956664 965837 979600 997848 1019913 1044093 1068052 1089183
56716A089183J4743L683j0718k3995l2216l5577l6934l7842l7820l6534l4342
$$ 1089183 1103926 1107609 1096891 1072896 1040680 1005103 968169 930327 892507 855973 821631
56705H21631l0979k6130k1223j8472j7992j7851j7073j6425j5982j4310j0834
$$ 821631 790652 764522 743299 724827 706835 688984 671911 655486 639504 625194 614360
56694F14360p100m786m076m513n705o648o214m978m739n617n664m227l328m334
$$ 614360 607260 602474 598398 593885 588180 581532 575318 570340 565601 559984 554320 550093 546765 542431
56680E42431n505m728k877k175k638k598j964k396m289n751n239l667l108m329
$$ 542431 536926 532198 529321 527146 524508 521910 519946 517550 513261 507510 502271 498604 495496 491167
56666D91167o342p856q439q225p241n545l889l308l658l501k131p25l47K2J729
$$ 491167 484825 476969 468530 460305 453064 447519 443630 440322 436664 433163 431032 430307 429960 429982 431711
56651D31711L577L099L94j734j638m89L13Q84J280P00o57j132k93J27q01j551
$$ 431711 435288 438387 438781 437047 435409 434920 435233 436117 437397 438097 437440 436308 436015 436142 435341 433790
56635D33790j148j421m058p295q084o285m407m104n052o437p460o998m642j669
$$ 433790 432642 431221 427163 419868 411784 405499 401092 396988 391936 385499 378039 371041 366399 364730
56621C64730M69J803K733K615J211K05J079K535K367J029Q07K127L308L652M188
$$ 364730 365199 367002 369735 372350 373561 373766 374845 377380 379747 380776 381583 383710 387018 390670 394858
56606C94858N305O090O291O712P267O742M915L097K210J966K205L222M533N091
$$ 394858 400163 406253 412544 419256 426523 433265 438180 441277 443487 445453 447658 450880 455413 460504
56592D60504N067N653O761O801N176L181J814M93j350l064m113n106o578p960
$$ 460504 465571 471224 477985 484786 489962 493143 494957 495450 494100 491036 486923 481817 475239 467279
56578D67279q585q557q005o649m829l731l907m526m745m696m561l921k797k226
$$ 467279 458694 450137 442132 435483 430654 426923 423016 418490 413745 409049 404488 400567 397770 395544
56564C95544k857l838l862k624o18J580L281L748L103K432K371K268J298k54j406
$$ 395544 392687 388849 384987 382363 381745 383325 386606 390354 393457 395889 398260 400528 401826 401572 400166
56549D00166j653j234o54k95p4N55J760K712K504J454N25k56j396k318j836l36
$$ 400166 398513 397279 396625 396330 396256 396811 398571 401283 403787 405241 405766 405510 404114 401796 399960 399624
56533C99624M10K8J86J692K900K225O05l0N36J136J232J010L97n13o50R40L525
$$ 399624 400034 400062 400248 401940 404840 407065 407670 407640 408176 409312 410544 411554 411951 411438 410788 411728 415253
56516D15253N472O217O265N690M138K227J538K744M737N971O085N831N955O513
$$ 415253 420725 426942 433207 438897 443035 445262 446800 449544 454281 460252 466337 472168 478123 484636
56502D84636P067P241P085O941P021P383Q148R385J0701J1384J1117J0249R369
$$ 484636 491703 498944 506029 512970 519991 527374 535522 544907 555608 566992 578109 588358 597727
56489E97727Q795Q423P780O497N157N075O506P672O761M486L123L207K996J455
$$ 597727 606522 614945 622725 629222 634379 639454 645960 653632 660393 664879 668002 671209 674205 675660
56475F75660j69n89n72j466l026m056m396m811n465n806n775n972o708p658q466
$$ 675660 675491 674902 674330 672864 669838 665782 661386 656575 651110 645304 639529 633557 626849 619191 610725
56460F10725r136r769j0325j0578j0249r427q801r028r759r954r146p863o767
$$ 610725 601589 591820 581495 570917 560668 551241 542440 533412 523653 513699 504553 496690 489923
56447D89923o190o375p139p312n776l272j832k103k586k120j512j844k536k440
$$ 489923 483733 477358 470219 462907 457131 453859 452027 449924 447338 445218 443706 441862 439326 436886
56433D36886j811j755k265k175q29J152K715L296L049K648K682L050L211L006
$$ 436886 435075 433320 431055 428880 428051 429203 431918 435214 438263 440911 443593 446643 449854 452860
56419D52860K665K132J240M78N68J192J402J308K023L669M978N350N713O622P056
$$ 452860 455525 457657 458897 459375 459943 461135 462537 463845 465868 469537 474515 479865 485578 492200 499256
56404D99256O027M119K449J384J076J990L913N625O471P027P477O878N163M194
$$ 499256 505283 509402 511851 513235 514311 516301 520214 525839 532310 539337 546814 553692 558855 563049
56390E63049N269O846O454M017J784J518K934M436M532L153K099L131N279N646
$$ 563049 568318 575164 581618 585635 587419 588937 591871 596307 600839 603992 606091 609222 614501 620147
56376F20147L469J366J400K149J470N5p6Q91J048j59j605k575l120k955j988j418
$$ 620147 623616 624982 626382 628531 630001 630056 629980 630871 631919 631760 630155 627580 624460 621505 619517 618099
56360F18099k499m612o056o212n610m699m044m700o743q368q139p022o468n947
$$ 618099 615600 610988 604932 598720 593110 588411 584367 579667 572924 564556 556417 549395 542927 536980
56346E36980m503l417m433o290o003l275r26q15j918k587k391j495j59P45M47
$$ 536980 532477 529060 524627 518337 512334 509059 508133 507318 505400 502813 500422 498927 498768 499513 499960
56331D99960l99o10k96k93m17k05o18k572m427l630o23J690K380L407N694P264
$$ 499960 499561 498951 498655 498362 497945 497740 497122 494550 490123 486493 485870 487560 489940 493347 499041 506305
56315E06305O417M282K921K835L468M436N194M906L659K548K001J268P5o75m81
$$ 506305 512722 517004 519925 522760 526228 530664 535858 540764 544423 546971 548972 550240 550315 549640 549159
56300E49159j18k25k68L82J281J481O55o09j138k4K164L523L048J972J887K463
$$ 549159 549041 548816 548548 548930 550211 551692 552347 551738 550600 550576 552740 556263 559311 561283 563170 565633
56284E65633K620K786L994N572N961N284M929N078M960N047O368Q005Q004O714
$$ 565633 568253 571039 575033 580605 586566 591850 596779 601857 606817 611864 618232 626237 634241 640955
56270F40955O512Q050R590J0285J1193J2573J3013J2143J1560J2060J2348J1562
$$ 640955 647467 655517 665107 675392 686585 699158 712171 724314 735874 747934 760282 771844
56258G71844J0801J1102J1942J2704J3564J4154J3410J1669J0808J1337J1439
$$ 771844 782645 793747 805689 818393 831957 846111 859521 871190 881998 893335 904774
56247I04774R915Q009P224P209O942O282N318L839K324J856K318K332J548J127
$$ 904774 914689 922698 929922 937131 944073 950355 955673 959512 961836 963692 966010 968342 969890 971017
56233I71017J372J035j41l97J334L644M824N166N941P484R357J1187J2505J3019
$$ 971017 972389 973424 973283 972886 974220 977864 982688 987854 993795 1001279 1010636 1021823 1034328 1047347
56219A047347J3458J4961J7391J9687K1845K4738K8038L0419L1911L3911L6776
$$ 1047347 1060805 1075766 1093157 1112844 1134689 1159427 1187465 1217884 1249795 1283706 1320482
56208A320482L9729M3082M8004N3882N8754O2536O7021P2492P7536Q2526Q9668
$$ 1320482 1360211 1403293 1451297 1505179 1563933 1626469 1693490 1765982 1843518 1926044 2015712
56197B015712R8851J07116J13512J20767J30485J40175J47048J51619J55496J58535
$$ 2015712 2114563 2221679 2335191 2455958 2586443 2726618 2873666 3025285 3180781 3339316
56187C339316J60193J60928J60180J55567J46023J33287J18643J01089Q0531N9627
$$ 3339316 3499509 3660437 3820617 3976184 4122207 4255494 4374137 4475226 4555757 4615384
56177D615384M0240K0969O73j8363l3409m4854n4282o1414o5641o8350p0952p2609
$$ 4615384 4655624 4676593 4677266 4658903 4625494 4580640 4526358 4464944 4399303 4330953 4260001 4187392
56165D187392p2373p1678p2307p3816p5142p6778p9316q1949q4450q8229r3386
$$ 4187392 4115019 4043341 3971034 3897218 3822076 3745298 3665982 3584033 3499583 3411354 3317968
56154C317968r7313r8534r9227j01316j02934j01722r8869r6544r3750q8397q1564
$$ 3317968 3220655 3122121 3022894 2921578 2818644 2716922 2618053 2521509 2427759 2339362 2257798
56143B257798p6132p2573o9267o5635o1962n7583n2110m7139m4049m1527l7830
$$ 2257798 2181666 2109093 2039826 1974191 1912229 1854646 1802536 1755397 1711348 1669821 1631991
56132A631991l3824l1232k9619k7701k5730k4033k1241j6825j3244j2591j3167
$$ 1631991 1598167 1566935 1537316 1509615 1483885 1459852 1438611 1421786 1408542 1395951 1382784
56121A382784j2401j0936j0455r754o807k817k93J212L526N602N158L464M071
$$ 1382784 1370383 1359447 1348992 1339238 1332431 1329614 1329321 1330533 1334059 1339661 1344819 1348283 1352354
56108A352354P353J0208J0970J0882J0902J0454R474Q655P659N669L490K698L101
$$ 1352354 1359707 1369915 1380885 1391767 1402669 1413123 1422597 1431252 1438911 1444580 1448070 1450768 1453869
56095A453869L327L213L436L653L328L379M643N976O141O161P357Q652Q547Q300
$$ 1453869 1457196 1460409 1463845 1467498 1470826 1474205 1478848 1484824 1490965 1497126 1504483 1513135 1521682 1529982
56081A529982J0198J4146J8936K5533L5857M9173O2623P4664Q5655R6082J06408
$$ 1529982 1540180 1554326 1573262 1598795 1634652 1683825 1746448 1821112 1906767 2002849 2109257
56070B109257J17488J29166J39988J50070J62198J78057J95633K12196K26871
$$ 2109257 2226745 2355911 2495899 2645969 2808167 2986224 3181857 3394053 3620924
56061C620924K37928K41221K34522K20493K02351J80217J55022J31738J13979
$$ 3620924 3858852 4100073 4334595 4555088 4757439 4937656 5092678 5224416 5338395
56052E338395R8758Q1307O1849M2684K2318j505k5461m3562n4814o2828p0037
$$ 5338395 5437153 5518460 5580309 5622993 5645311 5643806 5618345 5574783 5519969 5457141 5387104
56041E387104p7853r0139j10089j34489j56663j73997j87574j96297j97457j92005
$$ 5387104 5309251 5219112 5109023 4974534 4817871 4643874 4456300 4260003 4062546 3870541
56031C870541j83568j73017j59291j44233j31049j19030j05324r0906p9283p0448
$$ 3870541 3686973 3513956 3354665 3210432 3079383 2960353 2855029 2764123 2684840 2614392
56021B614392o1571n2754m6415m2014l6820l0979k6533k2744j7661j2896j1224
$$ 2614392 2552821 2500067 2453652 2411638 2374818 2343839 2317306 2294562 2276901 2264005 2252781
56010B252781j1093r052n806m071k532J687O637Q409Q476J1186J5697J7720J7664
$$ 2252781 2241688 2232636 2226830 2222759 2220227 2221914 2228551 2236960 2245436 2256622 2272319 2290039 2307703
55997B307703J9540K3055K4423K4022K5696K9348L1565L2579L5214L8230L8326
$$ 2307703 2327243 2350298 2374721 2398743 2424439 2453787 2485352 2517931 2553145 2591375 2629701
55986B629701L7288L9287M2700M2909M1499M3816M8883N1088N0635N2686N7130
$$ 2629701 2666989 2706276 2748976 2791885 2833384 2877200 2926083 2977171 3027806 3080492 3137622
55975C137622N9168N9405O3264P0579P5753P8099Q1973Q7126Q9362R0429R6265
$$ 3137622 3196790 3256195 3319459 3390038 3465791 3543890 3625863 3712989 3802351 3892780 3989045
55964C989045J05443J10595J11480J15119J22534J27297J28087J30707J36422
$$ 3989045 4094488 4205083 4316563 4431682 4554216 4681513 4809600 4940307 5076729
55955E076729J40329J42679J49703J61579J71496J78166J87275J99383K08931
$$ 5076729 5217058 5359737 5509440 5671019 5842515 6020681 6207956 6407339 6616270
55946F616270K16246K27499K41802K52115K59982K74801K97264L18587L37696
$$ 6616270 6832516 7060015 7301817 7553932 7813914 8088715 8385979 8704566 9042262
55937I042262L63162L95950M26921M54160M85903N23140N56869N86192O21231
$$ 9042262 9405424 9801374 10228295 10682455 11168358 11691498 12248367 12834559 13455790
55928A3455790O64066P05043P42373P86602Q41148Q97877R56658J029120J117680
$$ 13455790 14119856 14824899 15567272 16353874 17195022 18092899 19049557 20078677 21196357
55919B1196357J211581J308739J419667J544638J670329J795314J935113K096350
$$ 21196357 22407938 23716677 25136344 26680982 28351311 30146625 32081738 34178088
55911C4178088K271207K462424K685192K938285L204427L487415L817629M214896
$$ 34178088 36449295 38911719 41596911 44535196 47739623 51227038 55044667 59259563
55903E9259563M682232N242390N936907O775920P731922Q795062R987408J1311998
$$ 59259563 63941795 69184185 75121092 81897012 89628934 98423996 108411404 119723402
55895A19723402J2744329J4288254J5978490J7820265J9811728K2040592K4646259
$$ 119723402 132467731 146755985 162734475 180554740 200366468 222407060 247053319
55888B47053319K7650745L0941875L4387536L7599416L9303696L7270302K9593635
$$ 247053319 274704064 305645939 340033475 377632891 416936587 454206889 483800524
55881D83800524J6471128O10115j4334779k5798946l3061270l6618135l7333652
$$ 483800524 500271652 500881767 486546988 460748042 427686772 391068637 353734985
55874C53734985l6084759l3678969l0730276k7591916k4459433k1484247j8765982
$$ 353734985 317650226 283971257 253240981 225649065 201189632 179705385 160939403
55867A60939403j6327317j4164254j2287351j0690467r329990q166643p190622
$$ 160939403 144612086 130447832 118160481 107470014 98140024 89973381 82782759
55860H2782759o384652n702094n104143m584856m140652l748530l393330l085232
$$ 82782759 76398107 70696013 65591870 61007014 56866362 53117832 49724502 46639270
55852D6639270k830395k610832k410178k233751k086493j954868j827053j709556
$$ 46639270 43808875 41198043 38787865 36554114 34467621 32512753 30685700 28976144
55844B8976144j608419j513612j416176j322540j238690j157714j075320j000775
$$ 28976144 27367725 25854113 24437937 23115397 21876707 20718993 19643673 18642898
55836A8642898r40210q84755q26400p70630p22908o77629o30896n89861n58884
$$ 18642898 17702688 16817933 15991533 15220903 14497995 13820366 13189470 12599609 12040725
55827A2040725n30044m97232m66577m43324m21354l95349l70955l53143l36296
$$ 12040725 11510681 11013449 10546872 10103548 9682194 9286845 8915890 8562747 8226451
55818H226451l15263k95126k80763k67538k51246k36737k27848k18962k05413
$$ 8226451 7911188 7616062 7335299 7067761 6816515 6579778 6351930 6132968 5927555
55809E927555j92361j84618j77277j65446j54113j49217j47273j42945j39095
$$ 5927555 5735194 5550576 5373299 5207853 5053740 4904523 4757250 4614305 4475210
55800D475210j40446j44236j45596j45688j46724j45350j38736j31145j27093
$$ 4475210 4334764 4190528 4044932 3899244 3752520 3607170 3468434 3337289 3210196
55791C210196j23629j16304j07134r9948r3368q4899p6662p0840o4635n5694m7282
$$ 3210196 3086567 2970263 2863129 2763181 2669813 2584914 2508252 2437412 2372777 2317083 2269801
55780B269801m2310l7556k9570k1189j6273j2958q015l483l458q231j6278k7623
$$ 2269801 2227491 2189935 2160365 2139176 2122903 2109945 2101930 2098447 2094989 2086758 2070480 2042857
55768B042857m0708n0580n4794n6717n9133n9596n6249n2602n1777n1215m8017
$$ 2042857 2002149 1951569 1896775 1840058 1780925 1721329 1665080 1612478 1560701 1509486 1461469
55757A461469m4404m2918m1175l6577l1683k9746k9084k6758k3672k1489j8517
$$ 1461469 1417065 1374147 1332972 1296395 1264712 1234966 1205882 1179124 1155452 1133963 1115446
55746A115446j3284q170n298k887L69J854P8j501j65J157q31m263o372q675j2983
$$ 1115446 1102162 1093992 1088694 1085807 1086176 1088030 1088108 1086607 1086442 1087599 1086768 1082505 1076133 1067458 1054475
55731A054475j6697j7156j6629j7930j9077j7354j4894j5022j6477j6246j4800
$$ 1054475 1037778 1020622 1003993 986063 966986 949632 934738 919716 903239 886993 872193
55720H72193j3972j2816j0179p997p674o708l362r20k663o246p904q542j0687
$$ 872193 858221 845405 835226 827229 819555 812847 809485 808565 805902 799656 791752 783210 772523
55707G72523j3001j3014j2063j2316j2011q862n185m313m774l328j041q92j817
$$ 772523 759522 746508 734445 722129 710118 701256 696071 691758 686984 683656 682615 681723 679906
55694F79906o84J809K645K133L014N294O658O512N323J615n982j5131k2169k6385
$$ 679906 679222 681031 683676 685809 688823 694117 700775 707287 712610 714225 708243 693112 670943 644558
55680F44558k8659k8381k5670k3754k4633k5048k1360j5755j2539j1052p846l714
$$ 644558 615899 587518 561848 538094 513461 488413 467053 451298 438759 427707 419861 416147
55668D16147k488m139m996m196m511o973r420j0365j0158q711n928l635l493l852
$$ 416147 413659 409520 404524 400328 395817 388844 379424 369059 358901 350190 344262 340627 337134 333282
55654C33282k401m96q63k437j954N01J982J819J966K983L796M649O231O830M539
$$ 333282 330881 330385 329522 327085 325131 325632 327614 329433 331399 334382 338178 342827 349058 355888 360427
55639C60427J304M80J312M73j851k264p9J979K859M126N598M891K076L32R02J323
$$ 360427 361731 362211 363523 363996 362145 359881 359802 361781 364640 368766 374364 379255 381331 381663 382565 383888
55623C83888p4j527j102L77R76j6k094l986m025k061n99j873m500n478m609m034
$$ 383888 383814 382287 381185 381562 382538 382522 380428 376442 372417 370356 369757 367884 363384 357906 353297 349263
55607C49263m345m405m259m915n591m557k352j108j031n30N64J065J131J751K207
$$ 349263 344918 340513 336254 331339 325748 321191 318839 317731 316700 316170 316734 317799 318930 320681 322888
55592C22888J295L47J399L039J994j442l628l312l024m330n547n171m226m159
$$ 322888 324183 324530 325929 328968 330962 329520 325892 322580 319556 315226 309679 304508 300282 296123
55578B96123n212p388j0399j2370j1441q812p320p143o029l782k814l809m511
$$ 296123 290911 283523 273124 260754 249313 240501 233181 226038 220009 216227 213413 209604 205093
55565B05093l726l161m021m901m347k990j895j028l65n04j380k133k562l002k814
$$ 205093 201367 198206 194185 189284 184937 181947 180052 179024 178659 178155 176775 174642 172080 169078 166264
55550A66264j288L51K85q15q49q4p85l005m158l199k103k311k772k371j593r06
$$ 166264 164976 165327 165612 164797 163948 163864 163079 160074 155916 152717 150614 148303 145531 143160 141567 140661
55534A40661OO94J56r44p44O50J198N28N09J671K158J216O60J690K965L216L237
$$ 140661 140667 141361 141517 140573 139829 140479 141677 142205 142714 144385 146543 147759 148419 150109 153074 156290 159527
55517A59527L946M804N425O558Q226R063Q638Q404R278J0381J1089J2172J3784
$$ 159527 163473 168277 173702 180260 188486 197549 206187 214591 223869 234250 245339 257511 271295
55504B71295J4569J3891J3048J3055J3097J2173J0384P751L689j261n142p089
$$ 271295 285864 299755 312803 325858 338955 351128 361512 369263 372952 371691 366549 359460
55492C59460q343r911j1079j1218j1212j1927j2890j3349j3229j2323j0228p628
$$ 359460 351117 341206 330127 318909 307697 295770 282880 269531 256302 243979 233751 226123
55480B26123n915n080l945k714k970m618n407m418l444l659l566j860J0J50q65
$$ 226123 220208 215128 211183 208469 205499 200881 195474 191056 187612 183953 180387 178527 178537 178687 177822
55465A77822j373j440k242l711m631m463l626k634j944k042k810l450l583l607
$$ 177822 176449 175009 172767 169056 164425 159962 156336 153702 151758 149716 146906 143456 139873 136266
55451A36266l627l111k046j278j274j560j660j524r51J26Q11J75j103j648j759
$$ 136266 132639 129528 127482 126204 124930 123370 121710 120186 119235 119361 120172 120347 119244 117596 115837
55436A15837k778m192l867j554L66L77k76k07m0o80j484j601j411j464j426j127
$$ 115837 113059 108867 105000 103446 103812 104189 103913 103706 103666 102986 101502 99901 98490 97026 95600 94473
55420I4473j141j459j266p83j442l234m028k747j181j056j358l68J262J612M82
$$ 94473 93332 91873 90607 89824 88382 85148 81120 78373 77192 76136 74778 74410 75672 77284 77766
55405G7766p28j337j719j844j253k84M8n63j321j308l70P88J048j24j888k692
$$ 77766 77038 75701 73982 72138 70885 70601 70649 70086 68765 67457 67087 67875 68923 68799 66911 64219
55389F4219j901k68J099J605J199M59M03J257J817J106J52N26J635J337p97k752
$$ 64219 62318 62050 63149 64754 65953 66412 66815 68072 69889 70995 71147 71673 73308 74645 73848 71096
55373G1096k825j334N76K106K560J645K92k04K2j2p2R77K900M135L977L016J607
$$ 71096 68271 66937 67513 69619 72179 73824 74116 73912 73934 73922 73850 74827 77727 81862 85839 88855 90462
55356I0462m1q30o9N76q89l257l553j639j37J58J036K802L339K163J590K532K833
$$ 90462 90421 89591 89522 90098 89209 85952 82399 80760 80623 80781 81817 84619 87958 90121 91711 94243 97076
55339I7076J300j23NK29n86j021k18K7j342k240j062K54m67j899j768o81m50o35
$$ 97076 98376 98253 98258 98487 97901 96880 96662 96689 95347 93107 92045 92299 91832 89933 88165 87484 87034 86399
55321H6399J07J035O83m02r27j326k337k742j292N98Q81J62J68L25j101l424m182
$$ 86399 86506 87541 88224 87822 86895 85569 83232 80490 79198 79796 80677 80839 81007 81332 80231 76807 72625
55304G2625k765q64K44N10j00j334j762l62J610K240J663J207R24J33m96O9R61
$$ 72625 69860 68996 69240 69750 69650 68316 66554 66192 67802 70042 71705 72912 73836 73969 73473 73542 74503
55287G4503M83j068k012k203k911m087l979j755J307L373L576K226O68L10Q56
$$ 74503 74986 73918 71906 69703 66792 62705 58726 56971 58278 61651 65227 67453 68121 68431 69287
55272F9287L96j658l180k229J15J625K054K422K645K098J304P84m16k749m143
$$ 69287 69683 68025 64845 62616 62731 64356 66410 68832 71477 73575 74879 75663 75247 72498 68355
55257F8355k807o39o88k297k217K2J562R99O2k2l57j535j987o99Q60J074N67O93
$$ 68355 65548 64909 64221 61924 59707 59729 61291 62290 62352 62330 61973 60438 58451 57752 58612 59686 60253 60946
55239F0946J208R43j87j098r46J66J449J957J333K41l79l77j70J62Q23J507J526
$$ 60946 62154 63097 62910 61812 60866 61032 62481 64438 65771 66012 65633 65256 65086 65248 66071 67578 69104
55222F9104O54o38j586j454j37J321J671J200J259J801J168r20k321j680m55q5
$$ 69104 69758 69120 67534 66080 65943 67264 68935 70135 71394 73195 74363 73443 71122 69442 68987 68902
55206F8902N10K330L529K153p8p9J701K189P41l51j36k36j399k074j301l52m69
$$ 68902 69412 71742 75271 77424 77346 77267 78968 81157 81898 81547 81411 81175 79776 77702 76401 76049 75580
55189G5580j182j704k122k399j975j020n01n37j48J007K049K273J792P81n32j195
$$ 75580 74398 72694 70572 68173 66198 65178 64677 64140 63992 64999 67048 69321 71113 71894 71362 70167
55173G0167l44J300K120J689P58k63j260j378J6J673J731M04m80k42L18Q84J674
$$ 70167 69823 71123 73243 74932 75690 75427 74167 72789 72805 74478 76209 76613 76133 75891 76209 77093 78767
55156G8767J918O59j001r27P50J739J034q7o10q19o39N41J975J951N72k52L9n6
$$ 78767 80685 81344 80343 79416 80166 81905 82939 82852 82242 81423 80784 81325 83300 85251 85823 85571 85610 85554
55138H5554j168k019j887j581j245J87K487L686L051K091J610M80j510k380j195
$$ 85554 84386 82367 80480 78899 77654 77841 80328 84014 87065 89156 90766 91246 89736 87356 86161
55123H6161J08q4m91L86J314M72j400k416k645l216l461j717J491L404K344m86
$$ 86161 86269 86185 85694 86080 87394 87866 86466 84050 81405 78189 74728 73011 74502 77906 80250 79764
55107G9764k715l089k034q59n08p39p15l19j38l03m52q46k001l018k150L96K218
$$ 79764 77049 73960 71926 71067 70559 69820 69105 68786 68648 68345 67893 67047 65046 62028 59878 60274 62492
55090F2492K110J721K557L277J813j261l394l281j703Q0J314J557Q79N7l38n70
$$ 62492 64602 66323 68880 72157 73970 72709 69315 66034 64331 64411 65725 67282 68161 68218 67880 67310
55074F7310q76p39R3P45L49n71q18r1R54J736K131K293K539L015L281K918K471
$$ 67310 66434 65695 65788 66533 66882 66311 65493 65402 66356 68092 70223 72516 75055 78070 81351 84269 86740
55057H6740K831L595L526K671K315K615K181O98k48J14J76j293k864k695j449
$$ 86740 89571 93166 96692 99363 101678 104293 106474 107172 106924 107038 107214 105921 103057 100362 98913
55042I8913r61j191p35M82J157Q47L68J80n2l62k98K33R83J993L155L553K280
$$ 98913 97952 96761 96026 96508 97665 98512 98880 99060 99008 98646 98348 98581 99564 101557 104712 108265 110545
55025A10545k00k287k636q44K334M801M271Q48k315k287K79K198J609n28k217
$$ 110545 110345 108058 105422 104578 106912 111713 115984 116832 114517 112230 112509 114707 116316 115788 113571
55010A13571k328r11J112K503K735K356J913J199K42M7J164K366K165R89M18P31
$$ 113571 111243 110332 111444 113947 116682 119038 120951 122150 122392 122439 123603 125969 128134 129123 129541 130272
54994A30272P77K9q18j284j633j922j797j540j946k885l123k076p25j31J19J223
$$ 130272 131049 131078 130260 128976 127343 125421 123624 122084 120138 117253 114130 112054 111329 111198 111317 112540
54978A12540L298M963M767K779O09k06L01Q44O16O0j90k93n42n81r1K91j32p13
$$ 112540 115838 120801 125568 128347 128956 128750 129051 129895 130511 130571 130381 130088 129546 128965 128874 129165 129033 128320
54960A28320l0K039L844L852K292O24n6J74M71J04r31j843j709k89J673K920K632
$$ 128320 128290 130329 134173 138025 140317 140941 140885 141059 141530 141634 140703 138860 137151 136862 138535 141455 144087
54943A44087J131l33q27o44p16j276j631j226m22J7k51q66j062l04J068J985J838
$$ 144087 145218 144885 144058 143414 142698 141422 139791 138565 138143 138160 137909 137043 135981 135677 136745 138730 140568
54926A40568J086L36n71j679k046j001L64N49L7M35J507J391K2k59J601L348K658
$$ 140568 141654 141990 141419 139740 137694 136693 137057 137606 137643 138078 139585 140976 140998 140739 142340 145688 148346
54909A48346M67o61K7J448K879M217M825M012K412J429J596K510L884N495O666
$$ 148346 148813 148152 148179 149627 152506 156723 161548 165560 167972 169401 170997 173507 177391 182886 189552
54894A89552O953P061P968R616J1368J3140J4902J5711J4604J2212J0370J0205
$$ 189552 196505 203566 211534 221150 232518 245658 260560 276271 290875 303087 313457 323662
54882C23662J1422J2977J3520J1814P917L673Q21j053l737p834j2146j5323j6911
$$ 323662 335084 348061 361581 373395 381312 384985 385806 384753 381016 373182 361036 345713 328802
54869C28802j6882j5438j3529j2404j2220j1794j0112p628n662m804m285l026
$$ 328802 311920 296482 282953 270549 258329 246535 236423 228795 223133 218329 214044 211018
54857B11018j151k9m36j256r28K79Q45O77J477L976O609P861Q197Q671R153R396
$$ 211018 209867 209838 209402 208146 207218 207497 208342 209019 210496 214472 221081 228942 237139 245810 254963 264359
54841B64359J0354J2669J4914J5130J3410J1296R381P124M358J272k614p695j2796
$$ 264359 274713 287382 302296 317426 330836 342132 351513 358637 362995 364267 361653 353958 341162
54828C41162j6086j7320j7714j7858j7136j5221j2712j0396q811q291q331p525
$$ 341162 325076 307756 290042 272184 255048 239827 227115 216719 207908 199617 191286 183761
54816A83761n262k857j705j082M45K261K340L22k100l701m553m500l036j058m82
$$ 183761 178499 175642 173937 172855 173300 175561 177901 178223 176123 172422 167869 163369 160333 159275 158793
54801A58793j594k547k198j571j669j722p52N05N87p22k343l204k916j881j203
$$ 158793 157199 154652 152454 150883 149214 147492 146740 147245 147832 147110 144767 141563 138647 136766 135563
54786A35563j696k678k709j750j363k314l296k924j717j004q53l35P17J471J413
$$ 135563 133867 131189 128480 126730 125367 123053 119757 116833 115116 114112 113259 112924 113641 115112 116525
54771A16525Q53J72o46j556k073j733p38N6Ln05l70Q33K112K121P14q99j413m10
$$ 116525 117378 117550 116904 115348 113275 111542 110804 110860 110863 110358 109988 110821 112933 115054 115768 114869 113456 113046
54753A13046J573L474M433M560M721N285N637N258M571M125L777L544M178N854
$$ 113046 114619 118093 122526 127086 131807 137092 142729 147987 152558 156683 160460 164004 168182 174036
54739A74036P226P186O767P599R334J0349J0564J1385J3149J4799J6105J7974
$$ 174036 181262 188448 195215 202814 212148 222497 233061 244446 257595 272394 288499 306473
54727C06473K0097K0512J8282J4752J1271P539L141j012m116o847r878j2220j2539
$$ 306473 326570 347082 365364 380116 391387 398926 402067 401055 396939 390092 380214 367994 355455
54714C55455j1390j0658j1193j2028j1734r862p290n539n274n227l414K28L481
$$ 355455 344065 333407 322214 310186 298452 288590 281300 275761 270487 265260 261846 262074 265555
54701B65555M510L913L509M156N489O908Q001Q720R765J1930J4569J5839J5205
$$ 265555 270065 273978 277487 281643 287132 294040 302041 310761 320526 332456 347025 362864 378069
54688C78069J4552J5732J8017J9213J8416J6373J3745J0442O471K235k030o391
$$ 378069 392621 408353 426370 445583 463999 480372 494117 504559 511030 513265 511235 504844
54676E04844j0855j5354j9625k2720k3398k1787j9814j8982j8528j7020j4932
$$ 504844 493989 478635 459010 436290 412892 391105 371291 352309 333781 316761 301829
54665C01829j3976j4225j3816j1702r126p703p311o755n597m461l922l892l990
$$ 301829 287853 273628 259812 248110 238984 231281 223970 217215 211618 207157 203235 199343 195353
54652A95353m025m022m002l823l249k287j330p13k72L38J034J365J181Q08N49
$$ 195353 191328 187306 183304 179481 176232 173945 172615 171902 171630 171968 173002 174367 175548 176356 176905
54637A76905L66K74O40J786L275L982L110J182k75k64N85Q29M6o86k40J207K593
$$ 176905 177271 177545 178185 179971 183246 187228 190338 191520 191245 190981 191566 192395 192441 191755 191515 192722 195315
54620A95315L272L353L074K488J843J687K286L218L757L652L437L898N253O812
$$ 195315 198587 201940 205014 207502 209345 211032 213318 216536 220293 223945 227382 231280 236533 243345
54606B43345P518O876N496M599M981O242P068O484M930L894M344N682O485O102
$$ 243345 250863 257739 263235 267834 272815 279057 286125 292609 297539 301433 305777 311459 317944 324046
54592C24046N221M943N596O532O830O196N227M940N988Q303J1246J3905J5508
$$ 324046 329267 334210 339806 346338 353168 359364 364591 369531 375519 383822 395068 408973 424481
54579D24481J5993J6135J6610J7044J6482J4567J1516P155J263n010r643j2218
$$ 424481 440474 456609 473219 490263 506745 521312 532828 539983 541246 536236 526593 514375
54567E14375j4468j7472j9797j9713j7869j6084j4633j2752j0992j0711j1471
$$ 514375 499907 482435 462638 442925 425056 408972 394339 381587 370595 359884 348413
54556C48413j1229r323p257o157n376m171k928j957o75J106K393K459J898J476
$$ 348413 337184 327861 320604 314447 309071 304900 301972 300015 299340 300446 302839 305298 307196 308672
54542C08672R69n1j309k503l873n453o594o968p058p137o752n903n517n993o342
$$ 308672 309641 309590 308281 305778 301905 296452 289858 282890 275832 268695 261943 256040 250523 244530 238188
54527B38188n765n022n158n760n566m231k567j539j675k739l445k427k01R77m
$$ 238188 232423 227401 222243 216483 210917 206686 204119 202580 200905 198166 194721 192294 192093 193070 193066
54512A93066j647k194k003k102j890l80J221O83j758l351k518n77P19J404K252
$$ 193066 191419 189225 187222 185120 183230 182850 184071 184754 182996 179645 177127 176550 177269 178673 180925
54497A80925L018K936K030R47J02k64J86J326K203J970R89M03Q01J732K490K862
$$ 180925 183943 186879 188909 189856 189958 189694 189880 191206 193409 195379 196368 196771 197572 199304 201794 204656
54481B04656L045L145L101K999L279M245N497O189O055N735N844O162O216O250
$$ 204656 207701 210846 213947 216946 220225 224470 229967 236156 242211 247946 253790 259952 266168 272418
54467B72418O893P944Q278P136N074L342K520J897J40l376p646j0587j0845r082
$$ 272418 279311 287255 295533 302669 307743 311085 313605 315502 315642 312266 304620 294033 283188 274106
54453B74106p285o821p432q034p963p319o482n634m672l392j805m24O1l67p10
$$ 274106 266821 260000 252568 244534 236571 229252 222770 217136 212464 209072 207267 206843 206904 206537 205827
54438B05827L9J501K204J537P69J295K495K510J012l23m37l94j187j693l79J859
$$ 205827 205866 207367 209571 211108 211877 213172 215667 218177 219189 218866 218429 218035 216848 215155 214776 216635
54422B16635K691J895J753L585N715N795L865K007J731K652L341K835J435L13
$$ 216635 219326 221221 222974 226559 232274 238069 241934 243941 245672 248324 251665 254500 255935 256248
54408B56248P1j04j233k649k413J56L380N014M375K369L39p28o11o7j65j110k251
$$ 256248 256319 256215 254982 252333 249920 250076 253456 258470 262845 265214 265553 264825 264214 264147 263982 262872 260621
54391B60621l156l869m175l720k992k930l338k984j651o82r58j761k298k833l413
$$ 260621 257465 253596 249421 245701 242709 239779 236441 233457 231806 231124 230166 228405 226107 223274 219861
54376B19861k970j062Q05R48k88j364j698j690j385n83K85O50P14Q51P62K54J46
$$ 219861 216891 215829 216634 217582 217294 215930 214232 212542 211157 210574 210859 211509 212223 213074 213836 214090 214236
54359B14236J140K431K785K374K173K106J347N5p11n78P9J332L378N156N077L397
$$ 214236 215376 217807 220592 222966 225139 227245 228592 228647 227936 227358 227437 228769 232147 237303 242380 245777
54343B45777K325L321N570P486Q550R141R611J0160J0807J0947R673O944L949
$$ 245777 248102 251423 256993 264479 273029 282170 291781 301941 312748 323695 333368 340312 344261
54330C44261J938J203J250J261L04j993m575n534m165j948j054k226m452o388
$$ 344261 346199 347402 348652 349913 350217 348224 343649 338115 333950 332002 330948 328722 324270 317882
54316C17882p458p734p339o392n411n169n711n888m641k582j420j662j967j299
$$ 317882 310424 302690 295351 288959 283548 278379 272668 266780 262139 259557 258137 256475 254508 253209
54302B53209n35r37j963j896k97J381J626L68j316k271k021r16L45J563K993M390
$$ 253209 252674 251737 249774 247878 247581 248962 250588 250956 249640 247369 245348 244432 244777 246340 249333 253723
54286B53723M968M744M900O022O925O393N142M762N310N467M723L843L391L114
$$ 253723 258691 263435 268335 274357 281282 287675 292817 297579 302889 308356 313079 316922 320313 323427
54272C23427K795K339J190j108l669n026n167n515o717p803p866p333p016p019
$$ 323427 326222 328561 329751 328643 324974 319948 314781 309266 302549 294746 286880 279547 272531 265512
54258B65512p009o823o308n452m891n423o725p386o638n221m328m415n222o094
$$ 265512 258503 251680 245372 239920 235029 229606 222881 215495 208857 203636 199308 194893 189671 183577
54244A83577o056m564k493j466j861k482k549k759l750m601m063k519j528j694
$$ 183577 177521 172957 170464 168998 167137 164655 162106 159347 155597 150996 146933 144414 142886 141192
54230A41192k187k273k275k579k645j808o20m82j627k413j356P56J839J332P16
$$ 141192 139005 136732 134457 131878 129233 127425 126805 126323 124696 122283 120927 121683 123522 124854 125570
54215A25570R65J100N5j378j762j101l77J81Q35J055K17p28k01J454K148J018
$$ 125570 126535 127635 127690 126312 124550 123449 123072 123253 124088 125143 125360 124632 124431 125885 128033 129051
54199A29051m01m91N11J529K206K636K646K180J609R70k93k111l131k179R8J770
$$ 129051 128650 128159 128670 130199 132405 135041 137687 139867 141476 142446 142153 140042 136911 134732 134830 136600
54183A36600J663L00q90r24J57J625K812L422L286K359J219Q68J385J444pk154
$$ 136600 138263 138563 137673 136749 136906 138531 141343 144765 148051 150410 151629 152497 153882 155326 155319 153165
54167A53165l367l322k928k592j983j284j216j651j564o29K73L48l51j489k565
$$ 153165 149798 146476 143548 140956 138973 137689 136473 134822 133258 132629 132902 133250 132899 131410 128845
54152A28845k537o76J931L150K292O51o53j798k829k884j619j26M98L54j14r71
$$ 128845 126308 125632 127563 130713 133005 133656 133003 131205 128376 125492 123873 123747 124245 124599 124485 123514
54136A23514j950k053r08L70P00M55M47M13l84j746k704k747k082j201o45p17
$$ 123514 121564 119511 118603 118973 119673 120128 120575 120988 120604 118858 116154 113407 111325 110124 109479 108762
54120A08762r24m27N93R13Q7p32n19J49K48n7K7M38M94M8n26j071j494j393p06
$$ 108762 107838 107411 108004 108917 109004 108272 107753 107902 108150 108093 108120 108558 109052 109100 108574 107503 106009 104616 103910
54101A03910k13m73p96k17Q80J162K28r04j177o11M1J90j93o88p80l18L97R54
$$ 103910 103697 103224 102428 102211 103091 104253 104481 103577 102400 101789 101830 102020 101827 101139 100359 100041 100438 101392
54083A01392J001L16p62j088K81K610L853K923R00l53j63P33J282R51M0n05k7
$$ 101392 102393 102709 101947 100859 101140 103750 107603 110526 111426 111073 110910 111643 112925 113876 113916 113411 113384
54066A13384R17J158M75k37l62k00n5J93L67l3q04j061o48k95r1P29J969K080
$$ 113384 114301 115459 115934 115697 115335 115135 115080 115273 115640 115607 114803 113742 113094 112799 112708 113437 115406 117486
54048A17486M75j240j474p21k79j79K29P22P21N08N73N76J82J19J030K126K355
$$ 117486 117961 116721 115247 114526 114247 114068 114297 115019 115740 116248 116821 117397 117579 117698 118728 120854 123209
54031A23209K056K049J847N54j116j570p41n9k07n80r53j898l222l522j952N87
$$ 123209 125265 127314 129161 129715 128599 127029 126288 126229 126022 125442 124489 122591 119369 115847 113895 114482
54015A14482K518L079K501J440O25M57O81O82P6j070k167k168m74J815K613J435
$$ 114482 117000 120079 122580 124020 124645 125102 125783 126465 126541 125471 123304 121136 120662 122477 125090 126525
53999A26525J87M41J247R83P2KN49K33q15p09J302L705M865M674L815K886K636
$$ 126525 126712 127153 128400 129383 129455 129457 130006 130239 129424 128715 130017 133722 138587 143261 147076 149962 152598
53982A52598L479M420L867K025R89J877L337L710L339L625M799N828O049N914
$$ 152598 156077 160497 164364 166389 167378 169255 172592 176302 179641 183266 188065 193893 199942 205856
53968B05856O183O972P612P363O487O326P660R240R021O820M605L867L860L071
$$ 205856 212039 219011 226623 233986 240473 246799 254459 263699 272720 279540 284145 288012 291872 294943
53954B94943J361j23n12N8R17J423J428J467K076K750K184o8k774m334m377l639
$$ 294943 296304 296181 295669 295727 296644 298067 299495 300962 303038 305788 307972 307904 305130 300796 296419 292780
53938B92780k765j931j339j417k273l350l859l635l369l768m537m718m098l558
$$ 292780 290015 288084 286745 285328 283055 279705 275846 272211 268842 265074 260537 255819 251721 248163
53924B48163l569l255j849k66P4n58p34l95r62k560l110j210J504K327Q39j144
$$ 248163 244594 241339 239490 239224 239298 238740 238006 237611 236649 234089 230979 229769 231273 233600 234439 233295
53908B33295k228k514k303j393q3M66l24j346j035N90J859J426k47j510j334k46
$$ 233295 231067 228553 226250 224857 224774 225240 224916 223570 222535 223125 224984 226410 226163 224653 223319 223073
53892B23073M08k5p87o30N85J496R64k07j73J302K373J882J284K356M185M395
$$ 223073 223481 223456 222669 222039 222624 224120 225084 224877 224704 226006 228379 230261 231545 233901 238086 242481
53876B42481L010K650M560O726O948N741M859M532L971L379L526M059L954L145
$$ 242481 245491 248141 252701 259427 266375 272116 276975 281507 285478 288857 292383 296442 300396 303541
53862C03541K293J399J47q57o48N58J695K346K761K928L019M082O610Q964R080
$$ 303541 305834 307233 307380 306523 305875 306433 308128 310474 313235 316163 319182 323264 329874 338838 347918
53847C47918P378N996N461M538L347L987P192J0700J2113J1573J0345Q604O151
$$ 347918 355296 361292 366753 371291 374638 378625 385817 396517 408630 420203 430548 439152 445303
53834D45303L969L273L723L926L182J643n65l132m960m981l561k273k335l785
$$ 445303 449272 452545 456268 460194 463376 465019 464454 461322 456362 451381 447820 445547 443212 439427
53820D39427n882p709q617q594q207p918p655p247o843o738p109q014r076r194
$$ 439427 433545 425836 417219 408625 400418 392500 384845 377598 370755 364017 356908 348894 339818 330624
53806C30624p398m450k728l852o788q847q386o080l791k681k529k633k953l872
$$ 330624 323226 318776 316048 312196 305408 296561 288175 282095 278304 275623 273094 270461 267508 263636
53792B63636n006n185m094l110l504m637n013m545m315m457l983k760k003k411
$$ 263636 258630 253445 249351 246241 242737 238100 233087 228542 224227 219770 215787 213027 211024 208613
53778B08613l079k824j477L89J945K149N52j688k791k591k373k447j601M66K072
$$ 208613 205534 202710 201233 201622 203567 205716 206268 204580 201789 199198 196825 194378 192777 193243 195315
53763A95315J874P07Oj72m66p96q86j014j124l65J269K089R11q82j168o5O30L43
$$ 195315 197189 197896 197902 197730 197264 196468 195582 194568 193444 193079 194348 196437 197348 196466 195298 195233 195863 196206
53745A96206K62J115K122K319J729J052J086K474N093P727R012Q696P480O031
$$ 196206 196468 197583 199705 202024 203753 204805 205891 208365 213458 221185 230197 238893 246373 252404
53731B52404M827M466N180O210O527N993N239M741M659N095N726N668M577L427
$$ 252404 257231 261697 266877 273087 279614 285607 290846 295587 300246 305341 311067 316735 321312 324739
53717C24739L280L776L778L128K616K623K897L394M085M080K325n89k557k374
$$ 324739 328019 331795 335573 338701 341317 343940 346837 350231 354316 358396 360721 360132 357575 355201
53703C55201j082m90j077j879j909j248r22j864l845n468n566m364k973k087j702
$$ 355201 354119 353629 352552 350673 348764 347516 346594 344730 340885 335417 329851 325487 322514 320427 318725
53688C18725j755k233k778l021l241l928m761m862m259m140n156o196n600l361
$$ 318725 316970 314737 311959 308938 305697 301769 297008 292146 287887 283747 278591 272395 266795 263434
53674B63434j419j529l224m276l222r23O76Q58M75J92m50j816k998k740j018J065
$$ 263434 262015 260486 257262 252986 249764 248841 249517 250375 250850 251042 250592 248776 245778 243038 242020 243085
53658B43085K564L181K923K060J256J097J478J958K428K946L248L058K775L091
$$ 243085 245649 248830 251753 253813 255069 256166 257644 259602 262030 264976 268224 271282 274057 277148
53644B77148L990M715M778M549M612M925M902M217L392L263L807L942L026J978
$$ 277148 281138 285853 290631 295180 299792 304717 309619 313836 317228 320491 324298 328240 331266 333244
53630C33244K044K836K902K136J948K730K916J564K18P80K707L944L728K871J903
$$ 333244 335288 338124 341026 343162 345110 347840 350756 352320 352538 353318 356025 359969 363697 366568 368471
53615C68471O77n65j284j650k090j992k89K658N051N640M687L024J227k22j109
$$ 368471 369148 368583 367299 365649 363559 361567 361278 363936 368987 374627 379314 382338 383565 383343 382234
53600C82234j859k823l282k210P8K104K981K975K411J233k14j129j229r55o35
$$ 382234 380375 377552 374270 372060 372138 374242 377223 380198 382609 383842 383628 382499 381270 380315 379680
53585C79680k97j52l25l10K41N15m32j917k407j834j506j666j142M12J735K172
$$ 379680 379383 379231 378906 378596 378837 379352 378920 377003 374596 372762 371256 369590 368448 368860 370595 372767
53569C72767K662L671L937K515N48l70l64l80k69O61J937K379J885J471J772K662
$$ 372767 375429 379100 383037 385552 386100 385730 385366 384986 384717 385378 387315 389694 391579 393050 394822 397484
53553C97484M000N583O550O045M518L436L687M889O174O857O533N399M480M810
$$ 397484 401484 407067 413617 419662 424180 427616 431303 436192 442366 449223 455756 461155 465635 470445
53539D70445O262P747Q578Q969R210R090Q422P595P254P613Q299Q749Q730Q495
$$ 470445 476707 484454 493032 502001 511211 520301 528723 536318 543572 551185 559484 568233 576963 585458
53525E85458Q377Q220P551O434N761O255P518Q546Q912Q927Q723P944O493N028
$$ 585458 593835 602055 609606 616040 621801 628056 635574 644120 653032 661959 670682 678626 685119 690147
53511F90147M318M312M227L522K411J381N63n2j42O39J745J915P16o14n92O95
$$ 690147 694465 698777 703004 706526 708937 710318 710881 710829 710687 711326 713071 714986 715702 715088 714496 715191
53495G15191J914K415K711L175L308K646J505M48k87m39L51J702K379J684M91
$$ 715191 717105 719520 722231 725406 728714 731360 732865 733313 733026 732587 732938 734640 737019 738703 739194
53480G39194J87R83J909K174J925J843K383L321L890L667L403M294O143P202O482
$$ 739194 739381 740364 742273 744447 746372 748215 750598 753919 757809 761476 764879 769173 775316 782518 789000
53465G89000N349N844Q016J0122J1184J2108J4099J6925J9251K0139J9910J9800
$$ 789000 794349 800193 808209 818331 829515 841623 855722 872647 891898 912037 931947 951747
53453I51747K0787K2688K4472K5706K7038K8873L0352L0661L0720L2170L4915
$$ 951747 972534 995222 1019694 1045400 1072438 1101311 1131663 1162324 1193044 1225214 1260129
53442A260129L7152L8072L8997M1228M4246M6822M8741N0202N0673M9838M8980
$$ 1260129 1297281 1335353 1374350 1415578 1459824 1506646 1555387 1605589 1656262 1706100 1755080
53431A755080M9733N1588N2364N1308N0225N0851N2507N3378N3122N2972N3676
$$ 1755080 1804813 1856401 1908765 1960073 2010298 2061149 2113656 2167034 2220156 2273128 2326804
53420B326804N4541N4582N3688N2511N1777N1972N3139N4614N5258N4285N1933
$$ 2326804 2381345 2435927 2489615 2542126 2593903 2645875 2699014 2753628 2808886 2863171 2915104
53409B915104M9205M6947M5120M2935L9869L6455L3782L2065L0148K6818K2252
$$ 2915104 2964309 3011256 3056376 3099311 3139180 3175635 3209417 3241482 3271630 3298448 3320700
53398C320700J7779J4522J2682J1850J1236R802O949L083j061n560j0844j6151
$$ 3320700 3338479 3353001 3365683 3377533 3388769 3398571 3405520 3408603 3407542 3401982 3391138 3374987
53386C374987j9679k0798k1323k3748k8629l4239l8448m0471m1112m1813m3279
$$ 3374987 3355308 3334510 3313187 3289439 3260810 3226571 3188123 3147652 3106540 3064727 3021448
53375C021448m4839m5431m5194m5445m6911m8876n0354n1227n1547n0693m8188
$$ 3021448 2976609 2931178 2885984 2840539 2793628 2744752 2694398 2643171 2591624 2540931 2492743
53364B492743m4781m1711l9324l7230l5291l3481l1228k8034k4522k1739j9505
$$ 2492743 2447962 2406251 2366927 2329697 2294406 2260925 2229697 2201663 2177141 2155402 2135897
53353B135897j6557j2317p507k926J434N709R589J2825J5775J9152K3455K8624
$$ 2135897 2119340 2107023 2099516 2096590 2098024 2103733 2113322 2126147 2141922 2161074 2184529 2213153
53341B213153L3803L7729L9905M1296M3363M6698N1109N6353O1824O6094O8259
$$ 2213153 2246956 2284685 2324590 2365886 2409249 2455947 2507056 2563409 2625233 2691327 2759586
53330B759586O9582P2404P7335Q2786Q7332R0967R3854R5604R6674R8931J03426
$$ 2759586 2829168 2901572 2978907 3061693 3149025 3239992 3333846 3429450 3526124 3625055 3728481
53319C728481J08618J12085J13425J14337J16204J18720J20784J21754J21700
$$ 3728481 3837099 3949184 4062609 4176946 4293150 4411870 4532654 4654408 4776108
53310D776108J20912J19508J17306J14129J10149J05738J01069R6112R0756Q4510
$$ 4776108 4897020 5016528 5133834 5247963 5358112 5463850 5564919 5661031 5751787 5836297
53300E836297P6547O7027N8104N2196M9079M5844M0095L2046K3073J3666L703
$$ 5836297 5912844 5979871 6037975 6090171 6139250 6185094 6225189 6257235 6280308 6293974 6297677
53289F297677o345j5661k3958l1338l7992m4791n3360o4566p7411r0063j01356
$$ 6297677 6291332 6275671 6251713 6220375 6182383 6137592 6084232 6019666 5942255 5852192 5750836
53278E750836j10686j17355j21147j22965j24002j24628j24778j24670j24255
$$ 5750836 5640150 5522795 5401648 5278683 5154681 5030053 4905275 4780605 4656350
53269D656350j22784j19973j17027j15315j14623j13752j12329j10731j08676
$$ 4656350 4533566 4413593 4296566 4181251 4066628 3952876 3840547 3729816 3621140
53260C621140j05406j01119r6813r2604q7552q1402p5384p0759o7307o3643n8641
$$ 3621140 3515734 3414615 3317802 3225198 3137646 3056244 2980860 2910101 2842794 2779151 2720510
53249B720510n2489m6717m2936m1016l8909l4811k9010k2882j7038j1623p644
$$ 2720510 2668021 2621304 2578368 2537352 2498443 2463632 2434622 2411740 2394702 2383079 2375435
53238B375435o017n523l492J043O276R931J1378J1362J1154J2250J5375J9268
$$ 2375435 2369418 2363895 2360403 2361446 2367722 2377653 2389031 2400393 2411547 2423797 2439172 2458440
53226B458440K1838K2967K4661K8066L2017L5340L8679M2772M6521M8457M8943
$$ 2458440 2480278 2503245 2527906 2555972 2587989 2623329 2662008 2704780 2751301 2799758 2848701
53215B848701M9375N0071N0447N0509N0615N0416M9476M8376M7762M6891M4745
$$ 2848701 2898076 2948147 2998594 3049103 3099718 3150134 3199610 3247986 3295748 3342639 3387384
53204C387384M2065M0400L9502L7568L4057L0374K7513K4868K1706J8132J4161
$$ 3387384 3429449 3469849 3509351 3546919 3580976 3611350 3638863 3663731 3685437 3703569 3717730
53193C717730R513M865J520r43m849j1285j8475k4554l0162l6661m3329m8396
$$ 3717730 3727243 3732108 3733628 3732685 3727836 3716551 3698076 3673522 3643360 3606699 3563370 3514974
53181C514974n1839n5061n8424o1104o3028o4919o6644o7438o7740o8756p0084
$$ 3514974 3463135 3408074 3349650 3288546 3225518 3160599 3093955 3026517 2958777 2890021 2819937
53170B819937o9768o7255o4401o2824o1970o0712n9221n8111n7150n6040n5368
$$ 2819937 2750169 2682914 2618513 2555689 2493719 2433007 2373786 2315675 2258525 2202485 2147117
53159B147117n5532n5735n5099n3887n2575n0741m8070m5426m3530m1535l8439
$$ 2147117 2091585 2035850 1980751 1926864 1874289 1823548 1775478 1730052 1686522 1644987 1606548
53148A606548l5156l3484l3612l4238l4635l4764l3868l1168k7860k6254k6551
$$ 1606548 1571392 1537908 1504296 1470058 1435423 1400659 1366791 1335623 1307763 1281509 1254958
53137A254958k6501k4918k3458k3789k4905k4678k2888k1006j9935j9482j9624
$$ 1254958 1228457 1203539 1180081 1156292 1131387 1106709 1083821 1062815 1042880 1023398 1003774
53126A003774k0747k2531k3787k3695k2602k1321k0229j9205j8277j7933j8528
$$ 1003774 983027 960496 936709 913014 890412 869091 848862 829657 811380 793447 774919
53115G74919j9323j8700j6036j3003j2038j3414j4903j4680j3503j3316j4561
$$ 774919 755596 736896 720860 707857 695819 682405 667502 652822 639319 626003 611442
53104F11442j5750j5342j3302j0956r657r511r343q213o852o862q489j0132j0338
$$ 611442 595692 580350 567048 556092 546435 536924 527581 519368 512516 505654 497165 487033 476695
53091D76695r306q046o937n769m426l003j785j474k564m192m736m000l575m282
$$ 476695 467389 459343 452406 446637 442211 439208 437423 435949 433385 429193 424457 420457 416882 412600
53077D12600m715l468j507p07j109j439j651k750m331m435k403p6O29Q5p7P38
$$ 412600 407885 404417 402910 402203 401094 399655 398004 395254 390923 386488 384085 384009 384638 384723 384646 385384
53061C85384J729K186K329K805L824M884N281M916M454M491M773M693M245L930
$$ 385384 387113 389299 391628 394433 398257 403141 408422 413338 417792 422283 427056 431749 435994 439924
53047D39924L891L781L423K909K047L82j921l770m147l362k964m258o829q764
$$ 439924 443815 447596 451019 453928 455975 456357 454436 450666 446519 443157 440193 435935 429106 420342
53033D20342q706p474p022p931q974r172q888q358o750m041k493m230p939r929
$$ 420342 411636 404162 397140 389209 380235 371063 362175 353817 347067 343026 340533 336303 328364 318435
53019C18435q527n710m096m033m221l884l270k822k606k343j698q43n96j317j958
$$ 318435 309908 304198 300102 296069 291848 287964 284694 281872 279266 276923 275225 274382 273786 272469 270511
53004B70511j201N18J331L77j332k697l826m838m837l210j081j90p64j453j176
$$ 270511 269310 269828 271159 271536 270204 267507 263681 258843 254006 250796 249715 249525 248761 247308 246132
52989B46132j72O69P01j80j541k572k694k180j897k316k978l055k394j787j995
$$ 246132 245960 246629 247330 247150 245609 243037 240343 238163 236266 233950 230972 227917 225523 223736 221741
52974B21741k654k635j622o22m70n38J66J203J185q8j307j645j820k667l652l626
$$ 221741 219087 216452 214830 214208 213738 213200 213366 214569 215754 215666 214359 212714 210894 208227 204575 200949
52958B00949k417r89l18o07j231j267l62O98Q04p1q99j027p95n03J30J090J553
$$ 200949 198532 197543 197225 196618 195387 194120 193758 194456 195260 195189 194290 193263 192468 191965 192095 193185 194738
52941A94738J054L71M65J135J475J158M50m74j352j282N21L320N167M879L151
$$ 194738 195792 196163 196628 197763 199238 200396 200846 200372 199020 197738 198259 201579 206746 211625 214776
52926B14776J508O52K26j35j13P70K126K759J948M90o1R36K647L942M524M816
$$ 214776 216284 216936 217162 217027 216914 217684 219810 222569 224517 225007 224946 225882 228529 232471 236995 241811
52910B41811N205N704O086O156O073O296O870P000N945M246L263L497M068L917
$$ 241811 247016 252720 258806 264962 271035 277331 284201 291201 297146 301392 304655 308152 312220 316137
52896C16137K658L27k540m488m040j602O83J414J016j28k768o759r620r187o744
$$ 316137 318795 319122 316582 312094 308054 306452 307135 308549 309565 309437 306669 299910 290290 281103 274359
52881B74359n387n808n888m377k614k062k188j866j317j411k031k398k349k342
$$ 274359 268972 263164 257276 252899 250285 248223 246035 244169 242852 241441 239410 237012 234663 232321
52867B32321k617l080l591l710k796j048Q8n00j977k465j346K37J076J142R38
$$ 232321 229704 226624 223033 219323 216527 215479 215567 215067 213090 210625 209279 209516 210592 211734 212672
52852B12672N06l76j520k291k101q03J006K105J543j88j424j080J74R57Q90O33
$$ 212672 213178 212802 211282 208991 206890 206087 207093 209198 210741 210553 209129 208049 208223 209180 210070 210703
52836B10703N36K16m39p02M4J321K073J919J374J026R20P94M15l68j601k893l343
$$ 210703 211239 211455 211016 210314 210358 211679 213752 215671 217045 218071 218991 219785 220200 219832 218231 215338 211995
52819B11995k129N60L261M274L203J383M38O51J093J115R54R03P41L91K81M84
$$ 211995 209866 210426 213687 217961 221164 222547 222985 223636 224729 225844 226798 227701 228442 228833 229114 229598
52803B29598L16n05r82q3J679K928L372L819M519M733M129L348K848K296J534
$$ 229598 229914 229409 228427 228344 230023 232951 236323 240142 244661 249394 253523 256871 259719 262015 263549
52788B63549J158J598K451L374M768O868Q869R788R686R291Q809P967O780N492
$$ 263549 264707 266305 268756 272130 276898 283766 292635 302423 312109 321400 330209 338176 344956 350448
52774C50448L920J703q06k628l254l128l025l345m079m903n210m459k845j445
$$ 350448 354368 356071 355265 352637 349383 346255 343230 339885 335806 330903 325693 321234 318389 316944
52760C16944j387k849m936o526p182p147o651n632m253l194k882k803k278j735
$$ 316944 315557 312708 307772 301246 294064 286917 280266 274634 270381 267187 264305 261502 259224 257489
52746B57489k281l898n010m341k513j228j397k628l948m385l308j008J103J650
$$ 257489 255208 251310 246300 241959 239446 238218 236821 234193 230245 225860 222552 221544 222647 224297
52732B24297O10q72j904k507l038l509l679l482l164l023l015k638j509p5O32
$$ 224297 224907 224035 222131 219624 216586 213077 209398 205916 202752 199729 196714 194076 192567 192492 193124
52717A93124J82p41j275j374j472j684j900k323l065l442k524n14J179J562J101
$$ 193124 193306 192565 191290 189916 188444 186760 184860 182537 179472 176030 173506 172992 174171 175733 176834
52702A76834Q40J003R98N21m7l03m05p07j239j818k416l035l293k734j645j008
$$ 176834 177674 178677 179675 180196 180149 179846 179441 178734 177495 175677 173261 170226 166933 164199 162554 161546
52686A61546j255j644j363p88r13j805k507k449k093j922j621p21N33J456J665
$$ 161546 160291 158647 157284 156496 155583 153778 151271 148822 146729 144807 143186 142465 142998 144454 146119
52671A46119J189J65j134k177k448j839o76M68J026Q16K58r9k63o31j179j254
$$ 146119 147308 147473 146339 144162 141714 139875 139199 139667 140693 141509 141767 141668 141405 140774 139595 138341
52655A38341l75J213K762L568L308K321J526J560K111K427K255J746R33J49L87
$$ 138341 137966 139179 141941 145509 148817 151138 152664 154224 156335 158762 161017 162763 163696 163845 164232
52640A64232K152M203M884M491M775O070O706N691M128L263K840K302J993K056
$$ 164232 166384 170587 175471 179962 184737 190807 197513 203204 207332 210595 213435 215737 217730 219786
52626B19786J677O34P8M12P5j998m158m385l466l598m814n258m409l528l180k764
$$ 219786 221463 222097 222175 222587 222662 220664 216506 212121 208655 205057 200243 194985 190576 187048 183868 181104
52610A81104k532l528n185n327l292j052m12j070k176l763n453n644l657j350
$$ 181104 178572 175044 169859 164532 161240 160188 159776 158706 156530 152767 147314 141670 138013 136663
52596A36663r69k269l220k752j408P6J260J434O8k013l025k066J18K229L516L805
$$ 136663 135694 133425 130205 127453 126045 126121 127381 128815 128883 126870 123845 121779 121897 124126 127642 131447
52580A31447L182K085J111M12m26j501j977r59R59J756J58k621m067l235j508
$$ 131447 134629 136714 137825 138237 137811 136310 134333 133374 134333 136089 136247 133626 129559 126324 124816
52565A24816l52M56J659K687K297N43j184j919j743r24L70J430J390M51l36o85
$$ 124816 124464 124920 126579 129266 131563 132106 130922 129003 127260 126336 126706 128136 129526 129977 129641 128956
52549A28956j346k455k892j825K8J362J762J676J616J817K245K521K336K000J851
$$ 128956 127610 125155 122263 120438 120466 121828 123590 125266 126882 128699 130944 133465 135801 137801 139652
52534A39652J287n25k777l335j501P55J182j29j396j448m25J045K273K710K541
$$ 139652 140939 140414 137637 134302 132801 133556 134738 134609 133213 131765 131340 132385 134658 137368 139909
52519A39909K565K903K645J547R05J567K192J216l23P2K587M672M665L837L979
$$ 139909 142474 145377 148022 149569 150474 152041 154233 155449 155126 155198 157785 162457 167122 170959 174938
52504A74938M647M121K030l56j871k310j885q81J19M97K70N1K88Q70J433J681
$$ 174938 179585 183706 185736 185380 183509 181199 179314 178433 178552 179049 179319 179370 179658 180528 181961 183642
52488A83642J534J281J420J990K101P77j615l244k454N70L896N466M624K450P89
$$ 183642 185176 186457 187877 189867 191968 192745 191130 187886 185432 186002 189898 195364 199988 202438 203227
52473B03227O32J295J368M57m39l99K46N99L83k53j375k741l097j369J450K993
$$ 203227 203859 205154 206522 206979 206540 206141 206387 206986 207369 207116 205741 203000 199903 198534 199984 202977
52457B02977K365J003L51J25l42n95j38J44p23j862j600m8J046R12N14N44K54
$$ 202977 205342 206345 206696 206821 206479 205884 205746 205890 205167 203305 201705 201657 202703 203615 204129 204673 204927
52440B04927r86k270k186o18J215K133K022J760K275L450M088L382J996J057M99
$$ 204927 203941 201671 199485 198867 200082 202215 204237 205997 208272 211722 215810 219192 221188 222245 222744
52425B22744m18j325r59P07J944J490R9o88m19K64P00O03J0o66r13o79j02J159
$$ 222744 222326 221001 220042 220749 222693 224183 224282 223594 223175 223439 224139 224742 224752 224086 223173 222494 222392 223551
52407B23551L247M807L780L12k493j758J936N427O357M814K356N10N2P98J887
$$ 223551 226798 231605 235385 235697 233204 231446 233382 238809 245166 249980 252336 252846 252898 253696 255583
52392B55583K585K688K217J215J18l23J29R05J335J167L50r85k216k819l222m091
$$ 255583 258168 260856 263073 264288 264406 264083 264212 265117 266452 267619 267969 266984 264768 261949 258727 254636
52376B54636m719l586q63J174R17p00j872j968j213J47J188M67j794l107j884
$$ 254636 249917 246331 245468 246642 247559 246859 244987 243019 241806 241953 243141 243608 241814 238707 236823
52361B36823J45M74n36p37J43M19m60j162q05P2J014K093K596J364j094k596k102
$$ 236823 236968 237442 236906 236169 236312 236731 236271 235109 234304 234376 235390 237483 240079 241443 240349 237753 235651
52344B35651r08m25k58O32K130L216L220K199Q22K45J146K710L457L210L078L341
$$ 235651 234743 234318 234060 234692 236822 240038 243258 245457 246279 246524 247670 250380 253837 257047 260125 263466
52328B63466K871J104p94j543j251n61N16K047L423M094M228M026L293K317J942
$$ 263466 266337 267441 266647 265104 263853 263292 263808 265855 269278 273372 277600 281626 284919 287236 289178
52313B89178K001J110r50k016l81K412L473K522J798K357K794K012J158J781L477
$$ 289178 291179 292289 291339 289323 288942 291354 294827 297349 299147 301504 304298 306310 307468 309249 312726
52298C12726M593M359L223J777M59m5Q02K492L730L858L517L647M205M281L375
$$ 312726 317319 321678 324901 326678 327137 327092 327894 330386 334116 337974 341491 345138 349343 353624 356999
52283C56999K089J380J390J444J123P42O26M25k28q03l60J041K217K396K123K140
$$ 356999 359088 360468 361858 363302 364425 365167 365793 366218 365990 365187 364827 365868 368085 370481 372604 374744
52267C74744K103J270J39K07J809L265K944J487R54K067L391L488K825K869L952
$$ 374744 376847 378117 378256 378463 380272 383537 386481 387968 388922 390989 394380 397868 400693 403562 407514
52252D07514M871M494L087K041K574M750P454R311R760R221Q331P408O766O944
$$ 407514 412385 416879 419966 422007 424581 429331 436785 446096 455856 465077 473408 480816 487582 494526
52238D94526Q099R543J0450J0771J0922J0861J0176R067Q428Q728R338R280Q392
$$ 494526 502625 512168 522618 533389 544311 555172 565348 574415 582843 591571 600909 610189 618581
52225F18581P500P508Q360Q863P859N655L942L967N229O446P234Q062Q966R378
$$ 618581 626081 633589 641949 650812 658671 664326 668268 672235 677464 683910 691144 699206 708172 717550
52211G17550R205Q988Q860Q254P044O154O513P951R555J0580J0745J0173R512
$$ 717550 726755 735743 744603 752857 759901 766055 772568 780519 790074 800654 811399 821572 831084
52198H31084R469R869R676Q443P204P161Q011Q303P329N857M922M652M638M875
$$ 831084 840553 850422 860098 868541 875745 882906 890917 899220 906549 912406 917328 921980 926618 931493
52184I31493N670O757P093N972M060K769K617K733K294J685J648J930J740J318
$$ 931493 937163 943920 951013 956985 961045 963814 966431 969164 971458 973143 974791 976721 978461 979779
52170I79779J795L344M635M565L647L082L256L941N231P269R339J0239R701Q764
$$ 979779 981574 984918 989553 994118 997765 1000847 1004103 1008044 1013275 1020544 1029883 1040122 1049823 1058587
52156A058587Q577R307J0337J1088J1435J1532J1539J1485J1316J0952J0269R176
$$ 1058587 1067164 1076471 1086808 1097896 1109331 1120863 1132402 1143887 1155203 1166155 1176424 1185600
52144A185600Q004P591Q546J0368J1722J1724J0608Q993P135N091L125J518K92
$$ 1185600 1193604 1201195 1209741 1220109 1231831 1243555 1254163 1263156 1270291 1275382 1278507 1280025 1280317
52131A280317n11o29p0O17R10Q21L65q76l039n204o070n430m231l313k663k013
$$ 1280317 1279806 1279177 1279107 1279724 1280634 1281455 1281820 1280944 1277905 1272701 1266631 1261201 1256970 1253657 1250994 1248981
52115A248981j407j040j036j666l280n609p534p986p054n921n676o250o586n889
$$ 1248981 1247574 1246534 1245498 1243832 1240552 1234943 1227409 1219423 1212369 1206448 1200772 1194522 1187936 1182047
52101A182047m699m466n835p607p962o598n163n279o678p661p106n552m376m387
$$ 1182047 1177348 1172882 1167047 1159440 1151478 1144880 1139717 1134438 1127760 1120099 1112993 1107441 1103065 1098678
52087A098678n251n940n523l875j852o70q69j902k918l714m620n626o179o055
$$ 1098678 1093427 1087487 1081964 1078089 1076237 1075567 1074698 1072796 1069878 1066164 1061544 1055918 1049739 1043684
52073A043684n902o464p484p884o982n148l291k091j792k341l492m987o619q077
$$ 1043684 1037782 1031318 1023834 1015950 1008968 1003820 1000529 998438 996646 994305 990813 985826 979207 971130
52059I71130q823q493p373o208n463n087m901m726m198l087j857j311j496j663
$$ 971130 962307 953814 946441 940233 934770 929683 924782 920056 915858 912771 910914 909603 908107 906444
52045I06444j549j878k985l786l000r31R09J732K016K350K837L678N189O798P162
$$ 906444 904895 903017 900032 896246 893246 892315 893224 894956 896972 899322 902159 905837 911026 917824 924986
52030I24986N963M700M833N917O620O970Q174J0331J1928J2067J1890J2807J4277
$$ 924986 930949 935649 940482 946399 953019 959989 968163 978494 990422 1002489 1014379 1027186 1041463
52017A041463J4637J3702J3202J4448J6634J7874J7268J5493J3810J2939J2673
$$ 1041463 1056100 1069802 1083004 1097452 1114086 1131960 1149228 1164721 1178531 1191470 1204143
52006A204143J2478J2479J3528J5787J7607J6926J3950J1220J0541J1048J1061
$$ 1204143 1216621 1229100 1242628 1258415 1276022 1292948 1306898 1318118 1328659 1339707 1350768
51995A350768J0540J0311R953Q351N949M501M438M266L062J836J587J469J00k343
$$ 1350768 1361308 1371619 1381572 1389923 1395872 1400373 1404811 1409077 1412139 1413975 1415562 1417031 1417131 1414788
51981A414788m508n626n816n290m375l831m187n027n795o628p540p528n919m052
$$ 1414788 1410280 1404654 1398838 1393548 1389173 1385342 1381155 1376128 1370333 1363705 1356165 1348637 1342718 1338666
51967A338666l917n328o011m764k842j765j419j081q89j123j205p24n15j355k362
$$ 1338666 1334749 1329421 1323410 1318646 1315804 1314039 1312620 1311539 1310650 1309527 1308322 1307598 1307083 1305728 1303366
51952A303366k147j079p20j232j043N65K206K367J370M12k46j196k641m316o186
$$ 1303366 1301219 1300140 1299420 1298188 1297145 1297710 1299916 1302283 1303653 1304065 1303819 1302623 1299982 1295666 1289480
51937A289480q297j0231j1472j2113j2469j2439j1952j1717j2499j3887j4895
$$ 1289480 1281183 1270952 1259480 1247367 1234898 1222459 1210507 1198790 1186291 1172404 1157509
51926A157509j5614j7117j9504k1432k2092k2399k3374k4401k4272k3250k2791
$$ 1157509 1141895 1124778 1105274 1083842 1061750 1039351 1015977 991576 967304 944054 921263
51915I21263k3386k3967k3590k2790k2758k3706k4571k4149k2316k0188j9049
$$ 921263 897877 873910 850320 827530 804772 781066 756495 732346 710030 689842 670793
51904F70793j9099j9443j9285j8652j7778j6419j4408j2432j1393j1187j0860
$$ 670793 651694 632251 612966 594314 576536 560117 545709 533277 521884 510697 499837
51893D99837r889q628p490o531n901n885o196n951m833l714l561m148m417l967
$$ 499837 489948 481320 473830 467299 461398 455513 449317 443366 438533 434819 431258 427110 422693 418726
51879D18726l483l681m290m426l730k738k106j914k105l045m886o492o124l679
$$ 418726 415243 411562 407272 402846 399116 396378 394272 392358 390253 387208 382322 375830 369706 366027
51865C66027j222n82j292j812j940k491l301l299k618k683l861m674m194l659
$$ 366027 364805 364223 362931 361119 359179 356688 353387 350088 347470 344787 340926 336252 332058 328399
51851C28399m410n541n085k816l60J038J375P41j080l527n063m645k740n06J178
$$ 328399 323989 318448 313363 310547 310187 311225 312600 313341 312261 308734 303671 299026 296286 295780 296958
51836B96958J734Q59p74j692j298q47j743l359l724k349r60j061k001k371k154
$$ 296958 298692 299551 298777 297085 295787 294940 293197 289838 286114 283765 282805 281744 279743 277372 275218
51821B75218k183k231j310K42O69p29k430k680j450J34J197J122m10k312k322
$$ 275218 273035 270804 269494 269736 270405 269676 267246 264566 263116 263250 264447 265569 265159 262847 260525
51806B60525J84K709K802J628K222M819O571N946M641M408M538L871L103L296
$$ 260525 260709 263418 266220 267848 270070 274889 281460 287406 292047 296455 300993 304864 307967 311263
51792C11263L687K883J182j23r06j825k442j654J48J123M35p85j253r35k91P08
$$ 311263 314950 317833 319015 318892 317986 316161 313719 312065 312213 313336 313771 312986 311733 310798 310507 311215
51776C11215J933K410J259q64k018q54J985M381M713L287J763J303J584J661J214
$$ 311215 313148 315558 316817 315953 313935 313081 315066 319447 324160 327447 329210 330513 332097 333758 334972
51761C34972N57j32r75j894k378j939o21R24J960K235K031J618J045O75J253K629
$$ 334972 335529 335397 334422 332528 330150 328211 327590 328514 330474 332709 334740 336358 337403 338078 339331 341960
51745C41960L144J485j064j885n14Q33P38O06K074M110M430K801J093N88R27J476
$$ 341960 345104 346589 345525 343640 343126 343959 344697 345303 347377 351487 355917 358718 359811 360399 361326 362802
51729C62802K158K825L052K737K111J256M73Q03K912N599O660N507L938L943N488
$$ 362802 364960 367785 370837 373574 375685 376941 377414 378217 381129 386728 393388 398895 402833 406776 412264
51714D12264O833O463M471K362J631K339L348L977M807O317P618P533O288N076
$$ 412264 419097 425560 430031 432393 434024 436363 439711 443688 448495 454812 462430 469963 476251 481327
51700D81327M454M288M803O134P121O140L410R71J3n18k094m487o197o226m790
$$ 481327 485781 490069 494872 501006 508127 514267 517677 518648 518661 518143 516049 511562 505365 499139 494349
51685D94349k831j344p33n10R4J106J758J407R7j531k438j728J84J438P73p24
$$ 494349 491518 490174 489441 488931 489025 490131 491889 493296 493393 491862 489424 487696 487880 489318 490091 489367
51669D89367j077k96j44j254k323k488k570l238l669l144k450k463k519j761j048
$$ 489367 488290 487994 487850 486596 484273 481785 479215 475977 472308 469164 466714 464251 461732 459971 458923
51654D58923j899m091n810n946m939l462j656J61J234J211M80n81k016l521m105
$$ 458923 457024 452933 447123 441177 436238 432776 431120 431281 432515 433726 434206 433625 431609 428088 423983
51639D23983l045r41P71J243P59J8p12j497k148k187j400j06J181K067K271J896
$$ 423983 420938 419997 420768 422011 422770 422788 422076 420579 418431 416244 414844 414738 415919 417986 420257 422153
51623D22153J806L008N180O551N909M225L395L977N116O139O831O416L961J21
$$ 422153 423959 426967 432147 438698 444607 448832 452227 456204 461320 467459 474290 480706 484667 484788
51609D84788k998m341n066o522q300r130q747p868o976o271o226p086q019p761
$$ 484788 481790 477449 472383 465861 457561 448431 439684 431816 424840 418569 412343 405257 397238 389477
51595C89477o237m773m547n306n866n532m712m188l929l106j426L1jj242k141
$$ 389477 383240 378467 373920 368614 362748 357216 352504 348316 344387 341281 339855 339886 339885 338643 336502
51580C36502j896j269j167j318r06J36J010R49j23j547k461k609k579k759k565
$$ 336502 334606 333337 332170 330852 329946 330082 331092 332041 331918 330371 327910 325301 322722 319963 317398
51565C17398j409p5J82l40k45L70k80k547l957k308J229L726M126L501K558R60
$$ 317398 315989 315914 316096 315756 315511 315881 315601 313054 309097 306789 308018 311744 315870 319371 321929 322889
51549C22889j026k156j875r85j55J062L150N482O894P088O907P352Q521R443Q999
$$ 322889 321863 319707 317832 316847 316692 317754 320904 326386 333280 340368 347275 354627 363148 372591 381590
51534C81590P184N247M441M912O007P131P795P472O146M821M589N271N567M533
$$ 381590 388774 394021 398462 403374 409381 416512 424307 431779 437925 442746 447335 452606 458173 462706
51520D62706K421J81j287j470n86L19J29j242k707l043j823L64K352L173K919
$$ 462706 465127 465308 464021 462551 461965 462284 462413 461171 458464 455421 453598 453962 456314 459487 462406
51505D62406K760L647N159O037N793N238N330O105O925P292P034O039M397K832
$$ 462406 465166 468813 473972 480009 485802 491040 496370 502475 509400 516692 523726 529765 534162 536994
51491E36994K292K775K953J653m42j468q60p6l46r46p01j95p78k075k357j310
$$ 536994 539286 542061 545014 546667 546225 544757 543897 543821 543475 542529 541828 541633 540855 538780 536423 535113
51475E35113m51o05r02q74j520l260m641m480l724l759m099l513k382k131k896
$$ 535113 534662 534057 533155 532281 530761 527501 522860 518380 514656 510897 506798 503285 500903 498772 495876
51460D95876l498l359k940k471j739r55o35p02p87j106j896k459j971r04k65J34
$$ 495876 492378 489019 486079 483608 481869 480914 480279 479577 478790 477684 475788 473329 471358 470454 470189 470323
51444D70323J171K423K467J152n2k85k69o25p44nJ085J713J789J617J342J141
$$ 470323 471494 473917 476384 477536 477484 477199 476930 476305 475561 475556 476641 478354 480143 481760 483102 484243
51428D84243J183J035J30r51p53R46K507K638K203K766M213N122N080N303O740
$$ 484243 485426 486461 486591 485640 484887 485833 488340 490978 493181 495947 500160 505282 510362 515665 522405
51413E22405Q568R174Q146O661O004O248O687P095P836Q796R055Q002O110M332
$$ 522405 530973 540147 548293 554954 560958 567206 573893 580988 588824 597620 606675 614677 620787 625119
51399F25119L246L150L974M626L477M62k350l363l647n081p246q120p292o373
$$ 625119 628365 631515 635489 640115 643592 644054 641704 638341 634694 629613 622367 614247 606955 600582
51385F00582o342o591o791p525q531q413p018o287p461q984q545o157l746k545
$$ 600582 594240 587649 580858 573333 564802 556389 549371 543084 535623 526639 518094 511937 508191 505646
51371E05646k255k357k919m102n512o191n151k409N14J939K000K330L610M720
$$ 505646 503391 501034 498115 494013 488501 482310 477159 474750 475264 477203 479203 481533 485143 489863
51357D89863M687M069L617K888J401J7k43P1l90j734k870l371m020n516p557r292
$$ 489863 494550 498619 502236 505124 506525 506542 506299 506370 505980 504246 501376 498005 493985 488469 480912 471620
51341D71620j0056r732q820q073p642o997o018n453n793o350o233n652n396n523
$$ 471620 461564 451832 443012 434939 427297 420300 414282 408829 403036 396686 390453 384801 379405 373882
51327C73882n514n355n515o057o551o758o685o157n041l852l422l989m963n464
$$ 373882 368368 363013 357498 351441 344890 338132 331447 325290 320249 316397 312975 308986 304023 298559
51313B98559m797k841n45M46p14l089m943n335m429k783j084j10j28o03r55j293
$$ 298559 293762 290921 290376 290822 290108 287019 282076 276741 272312 269529 268445 268335 268207 267604 266649 265356
51297B65356j758j807r87J4J44m62o26K16J370J884J520P43K82O63J711K675L165
$$ 265356 263598 261791 260804 260818 260962 260500 259874 260090 261460 263344 264864 265607 265889 266552 268263 270938 274103
51280B74103L563M087M192L577L126L795N105N814N748N789O213O171N046L300
$$ 274103 277666 281753 285945 289522 292648 296443 301548 307362 313110 318899 325112 331283 336329 339629
51266C39629J816J018P28L84n44j913l035l798m924o468p117o117m925n340o766
$$ 339629 341445 342463 343191 343575 343031 341118 338083 334285 329361 322893 315776 309659 304734 299394 292628
51251B92628p189o356n791n893n382l958l115l530l842l080k285k479k828k356
$$ 292628 285439 279083 273292 267399 262017 258059 254944 251414 247572 244492 242207 239728 236900 234544
51237B34544j813k069k022j83K567L802K695O01j092j958j686k04J293J037j034
$$ 234544 232731 230662 228640 228457 231024 234826 237521 238122 237030 235072 233386 233182 234475 235512 234478
51222B34478l012l414k696j983j438o41K72P01M14j84m81j31O75J200Q64r1q19
$$ 234478 231466 228052 225356 223373 221935 221294 221566 222267 222681 222497 222016 221885 222560 223760 224624 224533 223714
51205B23714p38N6J025J367K54k249m572m874l142j345j185k308l211l209k831
$$ 223714 222976 223032 224057 225424 225678 223429 218857 213983 210841 209496 208311 206003 202792 199583 196752
51190A96752k684k690k472j903j061K8J308K406K721J931L84j150k079k192j468
$$ 196752 194068 191378 188906 187003 185942 185970 187278 189684 192405 194336 194720 193570 191491 189299 187831
51175A87831j54R69J031J50m45J39J333J904J518P93K16j30r2L05L17p30k030
$$ 187831 187677 188646 189677 189827 189382 189521 190854 192758 194276 195069 195285 195155 195063 195368 195685 194955 192925
51158A92925j913q5J850K652K884L406L652K739J399J186K080K397J245k59o05
$$ 192925 191012 190927 192777 195429 198313 201719 205371 208110 209509 210695 212775 215172 216417 216158 215553
51143B15553K91J460K162K173J510N80K18P74J410R46p00k399l038k368p00J525
$$ 215553 215844 217304 219466 221639 223149 223729 223947 224721 226131 227077 226377 223978 220940 218572 217872 219397
51127B19397L623M731M512L598K890K545K032J146L71R9j24j092k821m316m534
$$ 219397 223020 227751 232263 235861 238751 241296 243328 244474 244845 244944 244820 243728 240907 236591 232057
51112B32057l394j875j129j468k064j869q95l06r51k201k661j800k49J235K249
$$ 232057 228663 226788 225659 224191 222127 220258 219363 219057 218106 215905 213244 211444 211195 212430 214679
51097B14679K376J381Lm22L42J016N75m28r24p60j91J105L145M544L867J788L21
$$ 214679 217055 218436 218439 218017 218359 219375 219950 219522 218598 217838 217647 218752 221897 226441 230308 232096 232417
51080B32417n6p60k445l730l386k288j930k126j540Q6J492J567M53r51j935k364
$$ 232417 232361 231601 229156 225426 222040 219752 217822 215696 214156 214242 215734 217301 217754 216803 214868 212504
51064B12504k590k902k938k029l82P07M05m94o52K2N71N71N50Q59J059O63j22
$$ 212504 209914 207012 204074 202045 201663 202370 202775 202281 201629 201651 202222 202793 203343 204202 205261 205924 205802
51047B05802n96k72P39J795K226J985J593J275O47l87j038o21L28P02K72l13o60
$$ 205802 205206 204934 205673 207468 209694 211679 213272 214547 215194 214807 213769 213148 213476 214178 214450 214137 213477
51030B13477q69p72M2J365K425K963L422L872L593K110K8j531j854q83R04K594
$$ 213477 212608 211836 211878 213243 215668 218631 222053 225925 229518 231628 231656 230125 228271 227388 228292 230886
51014B30886L337L059K416J953J717J644J781K027K179K253K315K043J152J77
$$ 230886 234223 237282 239698 241651 243368 245012 246793 248820 250999 253252 255567 257610 258762 258939
51000B58939Q7R35J767J980J944J999J788J061K95j13n33j311j887j558p98q28
$$ 258939 259026 259961 261728 263708 265652 267651 269439 270500 270795 270682 270149 268838 266951 265393 264595 263767
50984B63767j928k839k196j45J707J942P68l72o16n57j106k078k644k624k397
$$ 263767 261839 259000 256804 256659 258366 260308 261076 260704 260088 259531 258425 256347 253703 251079 248682
50969B48682j785l63J243J738J155J016K020K888K370J169P55J327J992K213J997
$$ 248682 246897 246534 247777 249515 250670 251686 253706 256594 258964 260133 260888 262215 264207 266420 268417
50954B68417J359P28J060K382K963J408r79j604k4J739K371K801M046N259N154
$$ 268417 269776 270504 271564 273946 276909 278317 277338 275734 275710 277449 279820 282621 286667 291926 297080
50939B97080M129L605L882L971L349K719K803L323L624L740M187N085O047O961
$$ 297080 301209 304814 308696 312667 316016 318735 321538 324861 328485 332225 336412 341497 347544 354505
50925C54505Q078R150R194P788O216O389Q746J2009J4844J6839J7877J7887J7677
$$ 354505 362583 371733 380927 388715 394931 401320 410066 422075 436919 453758 471635 489522 507199
50912E07199J8704K1236K3684K4668K4812K5555K6997K8301K9553L1749L5096
$$ 507199 525903 547139 570823 595491 620303 645858 672855 701156 730709 762458 797554
50901G97554L8678M1727M4148M5723M6073M5597M5300M5396M4980M3502M1605
$$ 797554 836232 877959 922107 967830 1013903 1059500 1104800 1150196 1195176 1238678 1280283
50890A280283M0021L8460L6205L3252L0187K7334K4490K1418J8170J4969J1948
$$ 1280283 1320304 1358764 1394969 1428221 1458408 1485742 1510232 1531650 1549820 1564789 1576737
50879A576737R118O652N184N338O741P884P494N754L693J767l18k861o011j0154
$$ 1576737 1585855 1592507 1597691 1603029 1609770 1617654 1625148 1630902 1634595 1636362 1636044 1633183 1627172 1617018
50865A617018j5351k0519k4191k6295k8350l1656l5971m0098m3009m4292m4339
$$ 1617018 1601667 1581148 1556957 1530662 1502312 1470656 1434685 1394587 1351578 1307286 1262947
50854A262947m4248m4673m4678m2739l9161l6289l5591l5588l3742k9727k5552
$$ 1262947 1218699 1174026 1129348 1086609 1047448 1011159 975568 939980 906238 876511 850959
50843H50959k2791k0914j8630j5768j3166j1244r512p496n508m130l338k641j877
$$ 850959 828168 807254 788624 772856 759690 748446 738934 731438 725930 721800 718462 715821 713944
50830G13944j220l87J178L023L554J997k59j142k22J399K917M302N270N277M663
$$ 713944 712724 712337 713515 716538 720092 722089 721830 720688 720466 721865 724782 729084 734354 739631 744294
50815G44294M548N300O164O597O942P520Q125Q734R669J0798J1591J2319J3976
$$ 744294 748842 754142 760306 766903 773845 781365 789490 798224 807893 818691 830282 842601 856577
50802H56577J6482J8346J8901J9726K2680K7413L1871L4788L6631L8584M1418
$$ 856577 873059 891405 910306 930032 952712 980125 1011996 1046784 1083415 1121999 1163417
50791A163417M5194M9373N3485N7914O3496P0031P6114Q0988Q5443R0150R4333
$$ 1163417 1208611 1257984 1311469 1369383 1432879 1502910 1579024 1660012 1745455 1835605 1929938
50780A929938R7102R9114J01379J03213J02994J00478R6707R1915Q5240P6669
$$ 1929938 2027040 2126154 2227533 2330746 2433740 2534218 2630925 2722840 2808080 2884749
50770B884749O7681N9496N1928M4292L6335K8015J9668J2868R808J0790J3322
$$ 2884749 2952430 3011926 3063854 3108146 3144481 3172496 3192164 3205032 3214840 3225630 3238952
50759C238952J4570J4100J3580J4400J6422J8401J8663J5780R505J042q203j7982
$$ 3238952 3253522 3267622 3281202 3295602 3312024 3330425 3349088 3364868 3374373 3375415 3367212 3349230
50747C349230k8683l9882n0353n9464o7607p5012q0974q4784q6688q7274q6298
$$ 3349230 3320547 3280665 3230312 3170848 3103241 3028229 2947255 2862471 2775783 2688509 2602211
50736B602211q2916p6961o9400o1399n3472m5630l7859l0078k1997j3490n000
$$ 2602211 2519295 2442334 2372934 2311535 2258063 2212433 2174574 2144496 2122499 2109009 2104009
50725B104009K877J0153J7502K5389L3310M0062M4701M7291M8659M9379M9030
$$ 2104009 2106886 2117039 2134541 2159930 2193240 2233302 2278003 2325294 2373953 2423332 2472362
50714B472362M6576M1523L4529K6860J9529J2875O597M4p044j3950j9611k4078
$$ 2472362 2518938 2560461 2594990 2621850 2641379 2654254 2660851 2660895 2653851 2639901 2620290 2596212
50702B596212k8643l4172m0035m5322n0270n5461o0262o3331o4372o4050o2451
$$ 2596212 2567569 2533397 2493362 2448040 2397770 2342309 2282047 2218716 2154344 2090294 2027843
50691B027843n9078n4486n0276m6979m3347l8324l2493k6805k1113j4928q587
$$ 2027843 1968765 1914279 1864003 1817024 1773677 1735353 1702860 1676055 1654942 1640014 1631427
50680A631427k674K901Q333J3188J7297K1569K6883L2749L8146M3068M8090N2927
$$ 1631427 1628753 1631654 1639987 1653175 1670472 1692041 1718924 1751673 1789819 1832887 1880977 1933904
50668A933904N6814N9971O3376O7057O9870P0981P0570O8906O5923O1841N7230
$$ 1933904 1990718 2050689 2114065 2181122 2250992 2321973 2392543 2461449 2527372 2589213 2646443
50657B646443N2120M5953L8580L0604K2436J3889N028l328j0335j5705j9194k0364
$$ 2646443 2698563 2744516 2783096 2813700 2836136 2850025 2855053 2851725 2841390 2825685 2806491 2786127
50645B786127j9423j7628j6007j4080j0617n596o23K743M486N520O037N167K314
$$ 2786127 2766704 2749076 2733069 2718989 2708372 2702776 2702153 2704896 2709382 2714902 2720939 2726106 2728420
50632B728420j933o682j1832j7450k2498k5531k6838k8363l0788l1872k8951k2353
$$ 2728420 2726487 2719805 2707973 2690523 2668025 2642494 2615656 2587293 2556505 2524633 2495682 2473329
50620B473329j4958q823l574K027Q394J5316K2647L0164L7425M4278N1323N9619
$$ 2473329 2458371 2449548 2445974 2448001 2456395 2471711 2494358 2524522 2561947 2606225 2657548 2717167
50608B717167O9982Q2209R4727J05609J14588J23374J33007J41473J45323J43369
$$ 2717167 2787149 2869358 2964085 3069694 3184282 3307656 3440663 3582136 3727459 3870828
50598C870828J37320J28919J18254J05231R1030P7046O3574N0441L7984K6589
$$ 3870828 4008148 4137067 4255321 4360552 4451582 4528628 4592202 4642643 4680627 4707216
50588D707216J5949N595m502j4324k3983l2875l9703m4003m6749m8615m8729m6242
$$ 4707216 4723165 4728760 4724258 4709934 4685951 4653076 4613373 4569370 4522621 4474006 4425277 4379035
50576D379035m2202l8316l4582k9588k2907j5679r003l167J513M511O016O762
$$ 4379035 4336833 4298517 4263935 4234347 4211440 4195761 4186758 4183591 4185104 4189615 4195631 4202393
50564D202393O659M695O56m266q976j3416j7478k0192k1005k0943k1248k1400
$$ 4202393 4209052 4213747 4214403 4210137 4201161 4187745 4170267 4150075 4129070 4108127 4086879 4065479
50552D065479j9632j5190r165l216J594M904O996Q725J0607J1716J0381O211N12
$$ 4065479 4045847 4030657 4021492 4018276 4019870 4024774 4031770 4040495 4051102 4062818 4073199 4079410 4079922
50539D079922n712j3267k3399l5454m7128n7027o6068p5960q6756r6513j03216
$$ 4079922 4074210 4060943 4037544 4002090 3954962 3897935 3831867 3755907 3669151 3572638 3469422
50528C469422j06618j08014j08369j07219j03779r8664r3633q9518q5333p9964
$$ 3469422 3362804 3254790 3146421 3039202 2935423 2836759 2743126 2653608 2568275 2488311
50518B488311p3851o8026o2240n5311m7196l9336l2781k7224k2229j8116j4833
$$ 2488311 2414460 2346434 2284194 2228883 2181687 2142351 2109570 2082346 2060117 2042001 2027168
50507B027168j1078n691P62O753J1627J5772J9474K2845K6587L1558L7385M2619
$$ 2027168 2016090 2010399 2011161 2017914 2029541 2045313 2064787 2087632 2114219 2145777 2183162 2225781
50495B225781M6596N0356N5377O2091O9881P7806Q4943R0819R6059J02110J09620
$$ 2225781 2272377 2322733 2378110 2440201 2510082 2587888 2672831 2763650 2859709 2961819 3071439
50484C071439J17185J22314J23598J21735J18534J15251J11798J07297J01282
$$ 3071439 3188624 3310938 3434536 3556271 3674805 3790056 3901854 4009151 4110433
50475D110433R4439Q8148Q3443Q0440P8692P7816P7701P8310P9474Q0817Q1915
$$ 4110433 4204872 4293020 4376463 4456903 4535595 4613411 4691112 4769422 4848896 4929713 5011628
50464E011628Q2617Q3182Q4115Q5872Q8685R2455R6594J00214J02580J03418J02657
$$ 5011628 5094245 5177427 5261542 5347414 5436099 5528554 5625148 5725362 5827942 5931360 6034017
50453F034017J00206R5963Q9673Q0616O8022N2107L4235J5587l853k4475m5682
$$ 6034017 6134223 6230186 6319859 6400475 6468497 6520604 6554839 6570426 6566573 6542098 6496416
50442F496416o6091q4757j01365j15306j25465j31083j32313j29764j23923j15085
$$ 6496416 6430325 6345568 6244203 6128897 6003432 5872349 5740036 5610272 5486349 5371264
50432E371264j03535q9758p4685n9451m4650l0213j6477m856L163P153P138K580
$$ 5371264 5267729 5177971 5103286 5043835 4999185 4968972 4952495 4947639 4950802 4957955 4965093 4967673
50420D967673o997k0774l7312n6090p7021r8506j17613j32489j43417j51228j56111
$$ 4967673 4960676 4939902 4902590 4846500 4769479 4670973 4553360 4420871 4277454 4126226 3970115
50409C970115j58353j58766j57517j53698j46955j38644j30580j23365j16561
$$ 3970115 3811762 3652996 3495479 3341781 3194826 3056182 2925602 2802237 2685676
50400B685676j09679j02266r3890q4858p6210o8439o0925n3306m6382m0828l5933
$$ 2685676 2575997 2473731 2379841 2294983 2218773 2150334 2089409 2036103 1989721 1948893 1912960
50389A912960l0703k5436k1041j7425j3773j0011o773m063j060K751P040J1237
$$ 1912960 1882257 1856821 1835780 1818355 1804582 1794571 1787798 1783735 1782675 1785426 1792466 1803703
50377A803703J4991J8240K1391K5115K9406L3203L5588L6957L8473M0761M3895
$$ 1803703 1818694 1836934 1858325 1883440 1912846 1946049 1981637 2018594 2057067 2097828 2141723
50366B141723M7982N2728N7009N9786O1349O2785O4589O6615O8794P0822P1671
$$ 2141723 2189705 2242433 2299442 2359228 2420577 2483362 2547951 2614566 2683360 2754182 2825853
50355B825853P0675O8867O7943O8077O8027O7303O6839O7419O8787P0468P2276
$$ 2825853 2896528 2965395 3033338 3101415 3169442 3236745 3303584 3371003 3439790 3510258 3582534
50344C582534P3638P3575P1792O8903O5421O1492N7639N4325N0527M4198L4786
$$ 3582534 3656172 3729747 3801539 3870442 3935863 3997355 4054994 4109319 4159846 4204044 4238830
50333D238830K3994J3360K322j0346k4385l8471n1851o4349p5498q4993r3499
$$ 4238830 4262824 4276184 4278506 4268160 4243775 4205304 4153453 4089104 4013606 3928613 3835114
50322C835114j01682j08468j11582j09996j05006r8539r1220q2415p1797o0262
$$ 3835114 3733432 3624964 3513382 3403386 3298380 3199841 3108621 3026206 2954409 2894147
50312B894147m9291l9606l0782k2236j4249p594k490J155K488j45p150j6543k5615
$$ 2894147 2844856 2805250 2774468 2752232 2737983 2730389 2727899 2729054 2731542 2731397 2724247 2707704 2682089
50299B682089l3285m0215m7156n3973o0041o4741o7658o8801o8721o8019o6861
$$ 2682089 2648804 2608589 2561433 2507460 2447419 2382678 2315020 2246219 2177498 2109479 2042618
50288B042618o5199o3200o0959n8163n4474n0090m5539m1136l7054l3591l0889
$$ 2042618 1977419 1914219 1853260 1795097 1740623 1690533 1644994 1603858 1566804 1533213 1502324
50277A502324k8585k6186k3599k0848j7680j4065j0719q395o775m849k298K92
$$ 1502324 1473739 1447553 1423954 1403106 1385426 1371361 1360642 1352247 1345472 1340623 1338325 1338617
50265A338617K640N243Q327J1066J2467J2632J2664J3443J4972J6845J8971K1612
$$ 1338617 1341257 1346500 1354827 1365893 1378360 1390992 1403656 1417099 1432071 1448916 1467887 1489499
50253A489499K4781K7789K9566K9582K8338K7009K6652K7637K9408L0687L0481
$$ 1489499 1514280 1542069 1571635 1601217 1629555 1656564 1683216 1710853 1740261 1770948 1801429
50242A801429K9181K8204K8130K7683K5141K0352J4734R671N728L060J442k36
$$ 1801429 1830610 1858814 1886944 1914627 1939768 1960120 1974854 1984525 1990253 1993313 1994755 1994519
50230A994519l321p841j2368j5837j8670k1626k4354k5980k6688k7737k9930l2672
$$ 1994519 1991198 1983357 1970989 1955152 1936482 1914856 1890502 1864522 1837834 1810097 1780167 1747495
50218A747495l4623l4940l3904l2623l1992l1758l0752k8323k5320k3234k2605
$$ 1747495 1712872 1677932 1644028 1611405 1579413 1547655 1516903 1488580 1463260 1440026 1417421
50207A417421k2727k2774k2603k2383k2011k1270k0212j9132j8224j7499j6839
$$ 1417421 1394694 1371920 1349317 1326934 1304923 1283653 1263441 1244309 1226085 1208586 1191747
50196A191747j6018j4680j2551r719o739m499l790m709o362p443p297o361n376
$$ 1191747 1175729 1161049 1148498 1138779 1132040 1127541 1123751 1119042 1112680 1105237 1097940 1091579 1086203
50183A086203m412l017j229Q4J84n08p92o1J116J854J978J891J821J605J272J284
$$ 1086203 1081791 1078774 1077545 1077629 1077813 1077305 1076513 1076452 1077568 1079422 1081400 1083291 1085112 1086717 1087989 1089273
50167A089273J974K959L411K852J488k11k018l864n403o058n659m773m165m057
$$ 1089273 1091247 1094206 1097617 1100469 1101957 1101746 1099728 1095864 1090461 1084403 1078744 1073971 1069806 1065749
50153A065749m161m250m234l870l057k430k806l860m220l383k555k714k854j594
$$ 1065749 1061588 1057338 1053104 1049234 1046177 1043747 1040941 1037081 1032861 1029478 1026923 1024209 1021355 1019761
50139A019761J86J70j896l428k317N46K911L919M033L470K342J681K752N326P709
$$ 1019761 1019947 1020117 1018221 1014793 1012476 1013022 1015933 1019852 1023885 1027355 1029697 1031378 1034130 1039456 1047165
50124A047165Q496P486N200K555Q01N65Q70J94j472k722l001l517n363p742q914
$$ 1047165 1055661 1063147 1068347 1070902 1071703 1072268 1073138 1073332 1071860 1069138 1066137 1062620 1057257 1049515 1040601
50109A040601q255o695n514n222n405n302m694m215m414m677l771j581O36J949
$$ 1040601 1032346 1025651 1020137 1014915 1009510 1004208 999514 995299 990885 986208 982437 980856 981492 983441
50095I83441K873M237N804O623O250M962L201J450L27L21J529L668N854O543M824
$$ 983441 986314 990551 996355 1002978 1009228 1014190 1017391 1018841 1019168 1019489 1021018 1024686 1030540 1037083 1041907
50080A041907K124J377L703O918Q310P818P177P016O600N878N783O399O559N727
$$ 1041907 1044031 1045408 1049111 1056029 1064339 1072157 1079334 1086350 1092950 1098828 1104611 1111010 1117569 1123296
50066A123296M808M613M847N231O205P737Q513P470N268L286J790L14q03n75R03
$$ 1123296 1128104 1132717 1137564 1142795 1149000 1156737 1165250 1172720 1177988 1181274 1183064 1183378 1182575 1182000 1182903
50051A182903K186K158J093k16j424k292k223j011M84J253J468K071L262M318
$$ 1182903 1185089 1187247 1188340 1188124 1186700 1184408 1182185 1181174 1181658 1182911 1184379 1186450 1189712 1194030
50037A194030N024O051P588Q792R398J0654J3492J6639J8158J8293J8961K0694
$$ 1194030 1199054 1205105 1212693 1221485 1230883 1241537 1255029 1271668 1289826 1308119 1327080 1347774
50025A347774K2126K2689K3614K5599K7588K8983L1030L4580L8211M0410M2101
$$ 1347774 1369900 1392589 1416203 1441802 1469390 1498373 1529403 1563983 1602194 1642604 1684705
50014A684705M4965M8635N1765N4783N9039O4068O8333P2294P7968Q5456R2703
$$ 1684705 1729670 1778305 1830070 1884853 1943892 2007960 2076293 2148587 2226555 2312011 2404714
50003B404714R8979J05791J13714J21046J26607J31352J35901J38586J37461J32361
$$ 2404714 2503693 2609484 2723198 2844244 2970851 3102203 3238104 3376690 3514151 3646512
49993C646512J23779J11667R6875Q1771O7837N4370M1134L0377K4034K0551J6695
$$ 3646512 3770291 3881958 3978833 4060604 4128441 4182811 4223945 4254322 4278356 4298907 4315602
49982D315602J1238M606l778j5133k9138m4654o2022q2034j02845j20432j32454
$$ 4315602 4326840 4331446 4327668 4312535 4283397 4238743 4176721 4094687 3991842 3871410 3738956
49971C738956j39518j42736j42194j38149j31639j23368j13661j03780r5362q8187
$$ 3738956 3599438 3456702 3314508 3176359 3044720 2921352 2807691 2703911 2608549 2520362
49961B520362q0454p1835o4315n9247n5489n1360m6887m2942l9729l7145l5320
$$ 2520362 2439908 2368073 2303758 2244511 2189022 2137662 2090775 2047833 2008104 1970959 1935639
49950A935639l3656l0759k6547k3277k2897k4320k4830k3493k1563k0015j8441
$$ 1935639 1901983 1871224 1844677 1821400 1798503 1774183 1749353 1725860 1704297 1684282 1665841
49939A665841j6428j4508j3173j1983j0257q055n926m081k358q25Q7K82L80J078
$$ 1665841 1649413 1634905 1621732 1609749 1599492 1591437 1585511 1581430 1579072 1578247 1578334 1578616 1578996 1580074
49925A580074K207L000L216L340L526L356L037L757N832P632P724P282Q559J1464
$$ 1580074 1582281 1585281 1588497 1591837 1595363 1598719 1601756 1605513 1611345 1618977 1626701 1633983 1642542 1654006
49911A654006J3792J4687J5675J7788J9974K1376K3045K5989K9206L1392L3310
$$ 1654006 1667798 1682485 1698160 1715948 1735922 1757298 1780343 1806332 1835538 1866930 1900240
49900A900240L6560M0838M4405M6861M9763N4512O0994O8371P6093Q3998R2372
$$ 1900240 1936800 1977638 2022043 2068904 2118667 2173179 2234173 2302544 2378637 2462635 2555007
49889B555007J01902J12895J24640J36350J48357J61547J75757J89738K02375
$$ 2555007 2656909 2769804 2894444 3030794 3179151 3340698 3516455 3706193 3908568
49880C908568K12848K19677K21024K16293K06497J92855J76170J57983J41074
$$ 3908568 4121416 4341093 4562117 4778410 4984907 5177762 5353932 5511915 5652989
49871E652989J27587J17106J07544R7701Q8032P8768O8257N3796L3924R278j8638
$$ 5652989 5780576 5897682 6005226 6102927 6190959 6269727 6337984 6391780 6425704 6434982 6416344
49860F416344m8794q0305j11410j39731j63576j82490j96645k06404k12510k15825
$$ 6416344 6367550 6287245 6175835 6036104 5872528 5690038 5493393 5286989 5074479 4858654
49850D858654k16458k13918k08458k01537j94328j86555j77449j67272j56891
$$ 4858654 4642196 4428278 4219820 4018283 3823955 3637400 3459951 3292679 3135788
$$ [...]
##END NTUPLES=NMR SPECTRUM
##END=
