##TITLE=coffee_type TORI02-ROVE100C_60-40%
more volumen (450uL)
COFFEE_meoh_noesyp64 COFFEE_meoh {C:\Bruker\TOPSPIN} Administrator 8
##JCAMPDX= 6.0         $$ Bruker NMR JCAMP-DX V2.0
##DATA TYPE= NMR SPECTRUM
##DATA CLASS= NTUPLES
##ORIGIN= Bruker BioSpin GmbH
##OWNER= Administrator
$$ 1.72 TOPSPIN		Version 2.1
$$ 2012-05-18 15:47:36.979 -0700  Administrator@X
$$ Compression mode = diff/dup
##.OBSERVE FREQUENCY= 400.13188235
##.OBSERVE NUCLEUS= ^1H
##.ACQUISITION MODE= SIMULTANEOUS (DQD)
##.ACQUISITION SCHEME= undefined
##.AVERAGES= 64
##.DIGITISER RES= 22
##SPECTROMETER/DATA SYSTEM= spect
##.PULSE SEQUENCE= noesygpps1d.comp
##.SOLVENT NAME= COFFEE_meoh
##.SHIFT REFERENCE= INTERNAL, COFFEE_meoh, 1, 14.98061
##AUDIT TRAIL= $$ (NUMBER, WHEN, WHO, WHERE, PROCESS, VERSION, WHAT)
$$ ##TITLE= Audit trail, TOPSPIN		Version 2.1
$$ ##JCAMPDX= 5.01
$$ ##ORIGIN= Bruker BioSpin GmbH
$$ ##OWNER= Administrator
$$ $$ C:\Bruker\TOPSPIN/data/Administrator/nmr/12-COFFEE-2402/102/pdata/1/auditp.txt
$$ ##AUDIT TRAIL=  $$ (NUMBER, WHEN, WHO, WHERE, PROCESS, VERSION, WHAT)
(   1,<2012-02-24 21:49:50.797 -0500>,<Administrator>,<TOPSPIN>,<go>,<TOPSPIN 2.1>,
      <created by zg
	started at 2012-02-24 21:38:20.547 -0500,
	POWCHK enabled, PULCHK disabled,
       configuration hash MD5:
       B0 76 FB 9C 50 81 44 7D 18 B3 26 32 4E 60 AD 96
       data hash MD5: 64K
       0E 67 DA 93 64 63 7C D7 FA EB 54 AD BC 9F F6 10>)
(   2,<2012-02-24 21:49:53.422 -0500>,<Administrator>,<TOPSPIN>,<proc1d>,<TOPSPIN 2.1>,
      <Start of raw data processing
       efp LB = 0.3 FT_mod = 6 PKNL = 1 PHC0 = 0 PHC1 = 0 SI = 128K 
       data hash MD5: 128K
       03 9A 5B E8 6E 0D 12 69 61 6C A1 7A 0A A6 40 D3>)
(   3,<2012-02-24 21:49:54.687 -0500>,<Administrator>,<TOPSPIN>,<proc1d>,<TOPSPIN 2.1>,
      <pk PHC0 = 24.84558 PHC1 = 0 
       data hash MD5: 128K
       91 E7 6E DE 54 A4 F0 EF 29 E4 29 B3 E6 36 7F 8E>)
(   4,<2012-02-24 21:49:54.969 -0500>,<Administrator>,<TOPSPIN>,<proc1d>,<TOPSPIN 2.1>,
      <abs ABSG = 1 
       data hash MD5: 128K
       C1 FC C6 DA CC 7D 43 88 03 63 61 6B 27 2B 4F 4F>)
(   5,<2012-02-24 21:49:55.312 -0500>,<Administrator>,<TOPSPIN>,<proc1d>,<TOPSPIN 2.1>,
      <abs ABSG = 2 
       data hash MD5: 128K
       F8 20 34 B8 CA F1 8D 20 F0 94 0B 4B 33 84 AF F9>)
(   6,<2012-02-24 21:49:55.391 -0500>,<Administrator>,<TOPSPIN>,<proc1d>,<TOPSPIN 2.1>,
      <abs ABSG = 3 
       data hash MD5: 128K
       DC AF E5 B0 9A BA EB 5C 38 98 DE 7B 02 2B 86 76>)
(   7,<2012-02-24 21:49:55.469 -0500>,<Administrator>,<TOPSPIN>,<proc1d>,<TOPSPIN 2.1>,
      <abs ABSG = 4 
       data hash MD5: 128K
       76 2C 0D 92 35 72 20 FC FC 3C AF B7 1A 4E 6D A1>)
(   8,<2012-02-24 21:49:55.516 -0500>,<Administrator>,<TOPSPIN>,<proc1d>,<TOPSPIN 2.1>,
      <abs ABSG = 5 
       data hash MD5: 128K
       68 C0 B4 AC 95 A6 16 99 7B 66 0B FC 68 DD 6A D3>)
(   9,<2012-02-24 21:49:55.641 -0500>,<Administrator>,<TOPSPIN>,<audit>,<TOPSPIN 2.1>,
      <user comment:
$$ [...]
150 150 150 150 150 150 150 150
##$TP07= 0
##$TPNAME0= <>
##$TPNAME1= <>
##$TPNAME2= <>
##$TPNAME3= <>
##$TPNAME4= <>
##$TPNAME5= <>
##$TPNAME6= <>
##$TPNAME7= <>
##$TPOAL= (0..7)
0.5 0.5 0.5 0.5 0.5 0.5 0.5 0.5
##$TPOFFS= (0..7)
0 0 0 0 0 0 0 0
##$TUNHIN= 0
##$TUNHOUT= 0
##$TUNXOUT= 0
##$USERA1= <user>
##$USERA2= <user>
##$USERA3= <user>
##$USERA4= <user>
##$USERA5= <user>
##$V9= 5
##$VALIST= <valist>
##$VCLIST= <CCCCCCCCCCCCCCC>
##$VD= 0
##$VDLIST= <DDDDDDDDDDDDDDD>
##$VPLIST= <PPPPPPPPPPPPPPP>
##$VTLIST= <TTTTTTTTTTTTTTT>
##$WBST= 1024
##$WBSW= 4
##$XGAIN= (0..3)
0 0 0 0
##$XL= 0
##$YL= 0
##$YMAX_a= 12965393
##$YMIN_a= -6039690
##$ZGOPTNS= <>
##$ZL1= 120
##$ZL2= 120
##$ZL3= 120
##$ZL4= 120
##$ABSF1= 14.98061
##$ABSF2= -5.57192
##$ABSG= 5
##$ABSL= 3
##$ALPHA= 0
##$AQORDER= 0
##$ASSFAC= 0
##$ASSFACI= 0
##$ASSFACX= 0
##$ASSWID= 0
##$AUNMP= <proc_prof1d_extract>
##$AXLEFT= 0
##$AXNAME= <>
##$AXNUC= <1H>
##$AXRIGHT= 0
##$AXTYPE= 0
##$AXUNIT= <>
##$AZFE= 0.1
##$AZFW= 0.1
##$BCFW= 0
##$BC_mod= 0
##$BYTORDP= 0
##$COROFFS= 0
##$CY= 15
##$DATMOD= 1
##$DC= 0
##$DFILT= <>
##$DTYPP= 0
##$F1P= 0
##$F2P= 0
##$FCOR= 0.5
##$FTSIZE= 131072
##$FT_mod= 6
##$GAMMA= 0
##$GB= 0
##$INTBC= 1
##$INTSCL= 1
##$ISEN= 128
##$LB= 0.3
##$LEV0= 0
##$LPBIN= 0
##$MAXI= 10000
##$MC2= 0
##$MEAN= 0
##$ME_mod= 0
##$MI= 0
##$NCOEF= 0
##$NC_proc= -3
##$NLEV= 6
##$NOISF1= 0
##$NOISF2= 0
##$NSP= 0
##$NTH_PI= 0
##$NZP= 0
##$OFFSET= 14.98061
##$PC= 1
##$PHC0= 24.84558
##$PHC1= 0
##$PH_mod= 1
##$PKNL= yes
##$PPARMOD= 0
##$PPDIAG= 0
##$PPIPTYP= 0
##$PPMPNUM= 2147483647
##$PPRESOL= 1
##$PSCAL= 4
##$PSIGN= 0
##$PYNMP= <proc.py>
##$REVERSE= no
##$SF= 400.13
##$SI= 131072
##$SIGF1= 0
##$SIGF2= 0
##$SINO= 400
##$SIOLD= 131072
##$SPECTYP= <>
##$SREGLST= <1H.CDCl3>
##$SSB= 0
##$STSI= 131072
##$STSR= 0
##$SW_p= 8223.68421052632
##$SYMM= 0
##$S_DEV= 0
##$TDeff= 65536
##$TDoff= 0
##$TI= <>
##$TILT= no
##$TM1= 0
##$TM2= 0
##$TOPLEV= 0
##$USERP1= <user>
##$USERP2= <user>
##$USERP3= <user>
##$USERP4= <user>
##$USERP5= <user>
##$WDW= 1
##$XDIM= 131072
##$YMAX_p= 485083653
##$YMIN_p= -379462605
##$CURPLOT= <Network HP LaserJet P1505>
##$CURPRIN= <$Network HP LaserJet P1505>
##$DFORMAT= <normdp>
##$LAYOUT= <+/1D_H.xwp>
##$LFORMAT= <normlp>
##$PFORMAT= <normpl>
##$SURQMSG= 1
$$ End of Bruker specific parameters
$$ ---------------------------------
##NTUPLES= NMR SPECTRUM
##VAR_NAME=  FREQUENCY,     SPECTRUM/REAL,   SPECTRUM/IMAG
##SYMBOL=    X,             R,               I
##VAR_TYPE=  INDEPENDENT,   DEPENDENT,       DEPENDENT
##VAR_FORM=  AFFN,          ASDF,            ASDF
##VAR_DIM=   131072,        131072,          131072
##UNITS=     HZ,            ARBITRARY UNITS, ARBITRARY UNITS
##FACTOR=    0.0627417313425165, 1,          1
##FIRST=     8223.62146879498, 2329,         -78038
##LAST=      0,             4230,            -77673
##MIN=       0,             -379462605,      0
##MAX=       8223.62146879498, 485083653,    0
$$ Real data points
##PAGE= N=1
##DATA TABLE= (X++(R..R)), XYDATA
$$ [...]
62971B294887K8577K8540L0418L1730L0000K5685K0883J6224J0880M919n36n448
62959B516759j1048j7563k3544k8056l1768l5150l7226l7239l6145l5164l3913
62948B189943l1326k7615k3837k0085j5538j0158m982p12K993O604J0031J3052
62936B088370J5829J8775K2127K5529K7778K7585K5233K3003K2926K4346K4703
62925B346204K2708J9598J7169J5661J4019J1277P039J392m979j0976j6119k1137
62913B401856k7142l4396m2143m9257n4743n8123n9855o1038o2173o2454o0872
62902A829660n7737n4454n1815m9253m5993m2337l9228l6801l4088l0404k6607
62891A360943k4295k3758k3353k1435j8398j6025j4978j4076j2251j0320r913
$$ plain form
62971 2294887 2323464 2352004 2382422 2414152 2444152 2469837 2490720 2506944 2517824 2522743 2522207 2516759
62959 2516759 2505711 2488148 2464604 2436548 2404780 2369630 2332404 2295165 2259020 2223856 2189943
62948 2189943 2158617 2131002 2107165 2087080 2071542 2061384 2056402 2055690 2058683 2065287 2075318 2088370
62936 2088370 2104199 2122974 2145101 2170630 2198408 2225993 2251226 2274229 2297155 2321501 2346204
62925 2346204 2368912 2388510 2405679 2421340 2435359 2446636 2453675 2455067 2450088 2439112 2422993 2401856
62913 2401856 2374714 2340318 2298175 2248918 2194175 2136052 2076197 2015159 1952986 1890532 1829660
62902 1829660 1771923 1717469 1665654 1616401 1570408 1528071 1488843 1452042 1417954 1387550 1360943
62891 1360943 1336648 1312890 1289537 1268102 1249704 1233679 1218701 1204625 1192374 1182054 1172141
62880A172141j1289j3137j4285j4630j4392j3434j1869j0688j0941j2336j3274
62869A031866j2595j0901r727r560r427q583p769q005q790q694p645p211q237
62856I14722r509r460q181o810n874n258n049n222n028l910k655k458l188l753
62842H38367l787l687l378k479j466j150j152n73m7j106l320m237k870j174j111
62827H06830k115k716k787k721k015l74J115J613K091L525M731M023K071J065
62813H14336J680K855M003N242N913N030L071J424K25j237k309j507O94J955J332
62798H42707K08l43q49j535j491o65l66p58q6K301M339M188K838K032J518L82
62782H54420n36J27J763K777L116L653L876K564L19q90o06k81p64j409j843k614
$$ plain form
62880 1172141 1160852 1147715 1133430 1118800 1104408 1090974 1079105 1068417 1057476 1045140 1031866
62869 1031866 1019271 1008370 998643 989083 979656 971073 963304 955299 946509 937815 930170 922959 914722
62856 914722 905213 895753 887572 880762 874888 869630 864581 859359 854331 850421 847766 845308 842120 838367
62842 838367 834580 830893 827515 825036 823570 822420 821268 820695 820648 819542 816222 811985 809115 807941 806830
62827 806830 804715 801999 799212 796491 794476 794102 795217 796830 798921 802446 807177 811200 813271 814336
62813 814336 816016 818871 822874 828116 834029 839059 842130 843554 843779 842542 840233 838726 839420 841375 842707
62798 842707 842915 842572 841723 840188 838697 838032 837666 836908 836822 839123 843462 847650 850488 852520 854038 854420
62782 854420 853884 854011 855774 858551 861667 865320 869196 871760 872079 871189 870583 870302 869538 868129 866286 863672
62766H63672l681m027l394k873l148l563l580l834m894o069o382n853n016l875
62752H03483k308r76r47k429m471n892o181n513m186k244J49K131K599J644R74
62737G75833K145M719O905P790Q112Q966J0575J2415J3774J4239J4201J4719J6250
62724I10643J7871J8689J9456K1523K4493K6652K7855L0091L4444L9283M2523
62713A213523M4409M6671M9925N3420N6662N9787O2494O3919O3626O1785N8473
62702A834694N3616M7586M0861L3169K3800J2972J968q283j7976k7423l6105m3202
62690A915677m8657n3138n7144o0524o2654o2975o1603n9531n7829n6395n4040
62679A281187n0202m6122m3550m2567m1396l8489l4142k9868k6844k5236k4430
$$ plain form
62766 863672 859991 855964 852570 849697 846549 842986 839406 835572 830678 824609 818227 812374 807358 803483
62752 803483 801175 800199 799252 796823 792352 786460 780279 774766 770580 768336 768485 770616 773215 774859 775833
62737 775833 777978 782697 789602 797392 805504 814470 825045 837460 851234 865473 879674 894393 910643
62724 910643 928514 947203 966659 988182 1012675 1039327 1067182 1097273 1131717 1171000 1213523
62713 1213523 1257932 1304603 1354528 1407948 1464610 1524397 1586891 1650810 1714436 1776221 1834694
62702 1834694 1888310 1935896 1976757 2009926 2033726 2046698 2048666 2040383 2022407 1994984 1958879 1915677
62690 1915677 1867020 1813882 1756738 1696214 1633560 1570585 1508982 1449451 1391622 1335227 1281187
62679 1281187 1230985 1184863 1141313 1098746 1057350 1018861 984719 954851 928007 902771 878341
62668H78341k3331k0906j7149j3414j1200j0632j0528r889q754p630o733n947
62656G32228m992l465j249R30J981J975K533N016Q650J1231J1743J1563J2837
62643G90981J6068J9711K2109K3342K4901K7637L0717L2914L4406L6454L9547
62632A098787M2935M6062M9290N2674N5200N6159N6386N6982N7426N6281N3345
62621A681527M9678M5437L9321L0626K0591J0774J124r282k0197l0220l8689m6334
62609A734356n3633n9496o2446o2664o1944o1619o1340o0084n7649n4511n0905
62598A088065m6858m2880l9630l6947l4027l0741k7895k6022k4760k3726k3001
62587G31578k2309k0702j7880j5041j3528j3106j2546j1409j0352r901r805r516
$$ plain form
62668 878341 855010 834104 816955 803541 792341 781709 771181 761292 752538 744908 738175 732228
62656 732228 727236 723771 722522 723452 725433 727408 729941 734957 743607 754838 766581 778144 790981
62643 790981 807049 826760 848869 872211 897112 924749 955466 988380 1022786 1059240 1098787
62632 1098787 1141722 1187784 1237074 1289748 1344948 1401107 1457493 1514475 1571901 1628182 1681527
62621 1681527 1731205 1776642 1815963 1846589 1867180 1877954 1879078 1869796 1849599 1819379 1780690 1734356
62609 1734356 1680723 1621227 1558781 1496117 1434173 1372554 1311214 1251130 1193481 1138970 1088065
62598 1088065 1041207 998327 958697 921750 887723 856982 829087 803065 778305 754579 731578
62587 731578 709269 688567 670687 655646 642118 629012 616466 605057 594705 584804 574999 565483
62575E65483q720p521o563o613p537q038p052m992l051j823j225j124j235r36
62561D99053j62J74m63j108o35N38J468K587M735O822O707M602L409M942P690
62546E40359R285R557R878J0695J1275J1273J1250J1690J2435J3080J3642J4707
62534F79126J6915J9901K2131K2465K1654K1438K2509K4426K7164L0932L4437
62523I43098L5340L3221L0354K8590K7044K3998J9517J4717R745M232j178n504
62511A163174r072j2938j6997k0231k2517k4725k7064k8673k9000k8427k7413
62500I16117k6033k4408k2784k1197j9757j9082j9469j9940j9249j7729j6839
62489F89630j6801j6116j3840j1125r720r969j0988j2069j2891j2910j1504q749
$$ plain form
62575 565483 556763 549242 542679 536066 528529 520491 513439 508447 505396 503573 502348 501224 499989 499053
62561 499053 498891 499065 498602 497494 496859 497397 498865 501452 506187 513009 519716 524318 527727 532669 540359
62546 540359 549644 559201 569079 579774 591049 602322 613572 625262 637697 650777 664419 679126
62534 679126 696041 715942 738073 760538 782192 803630 826139 850565 877729 908661 943098
62523 943098 978438 1011659 1042013 1070603 1097647 1121645 1141162 1155879 1165624 1169856 1168678 1163174
62511 1163174 1154102 1141164 1124167 1103936 1081419 1056694 1029630 1000957 971957 943530 916117
62500 916117 890084 865676 842892 821695 801938 782856 763387 743447 724198 706469 689630
62489 689630 672829 656713 642873 631748 622028 612059 601071 589002 576111 563201 551697 542948
62477E42948n447k447k78P95R14P23Q42J214J353J217J403K268L357M010M303
62462E57175M896O084P442Q557R566J0824J2349J3890J5274J6455J7594J9333
62450F99439K2297K5874K8170K8103K6985K7032K8643L0495L1961L3708L5539
62439A018246L5530L2420K7628K3601K0812J7597J2470N636j523p595j2012j5439
62427A157371j9057k3029k6129k7358k7261k6946k6620k5892k4917k4087k3018
62416H83057k0983j8182j5546j3444j1546r814q666q174p940p730p429o576m822
62403G42205k773j365n63L79J466J945J857K312L909N879P330Q308R095R377Q918
62388G98279Q366Q484R015Q881P443N077K681Q51o20k505n162p845r611j0721
$$ plain form
62477 542948 537501 535054 534776 535571 536485 537208 538050 539264 540617 541834 543237 545505 548862 552872 557175
62462 557175 562071 568155 575597 584154 593720 604544 616893 630783 646057 662512 680106 699439
62450 699439 721736 747610 775780 803883 830868 857900 886543 917038 948999 982707 1018246
62439 1018246 1053776 1086196 1113824 1137425 1158237 1175834 1188304 1193940 1192417 1184822 1172810 1157371
62427 1157371 1138314 1115285 1089156 1061798 1034537 1007591 980971 955079 930162 906075 883057
62416 883057 862074 843892 828346 814902 803356 793542 784876 776702 768762 761032 753603 747027 742205
62403 742205 739432 738067 737504 737883 739349 741294 743151 745463 749372 755251 762581 770889 779984 789361 798279
62388 798279 806645 815129 824144 833025 840468 845545 848226 849077 848457 845952 840790 832945 823334 812613
62374H12613j2303j4447j5800j5503j4516j4108j3994j3090j1482j0229r496q305
62362F59340o254m127k404m24K186M424N285N514O676Q789J0225J0096R520R963
62348G18809J1272J2058J1598J0622J0393J1409J2939J3630J2865J1599J1332
62337H48526J2019J1853R550O043L154J375M5j031j569j999l069m288m323l239
62323H73047k732l517l875j670L056Q241J1795J3032J3131J4546J8841K4603K8737
62310I97235L0359L1849L5283L9714M3425M7005N2050N7931O2471O5257O7943
62299A530522P1253P3859P4563P3628P1383O7226O0638N1999M1750L0002J7533
62288B164356O018l465j1448j9147k7221l5620m3651n0030n3934n6282n8832o1530
$$ plain form
62374 812613 800310 785863 770063 754560 740044 725936 711942 698852 687370 677141 667645 659340
62362 659340 653086 648959 646555 646131 648317 652741 658026 663540 670216 679005 689230 699326 708846 718809
62348 718809 730081 742139 753737 764359 774752 786161 799100 812730 825595 837194 848526
62337 848526 860545 872398 881948 887991 891145 892520 892565 891534 889965 887966 884897 880609 876286 873047
62323 873047 870315 866798 862923 861253 864309 872550 884345 897377 910508 925054 943895 968498 997235
62310 997235 1027594 1059443 1094726 1134440 1177865 1224870 1276920 1334851 1397322 1462579 1530522
62299 1530522 1601775 1675634 1750197 1823825 1895208 1962434 2023072 2075071 2116821 2146823 2164356
62288 2164356 2170374 2166909 2155461 2136314 2109093 2073473 2029822 1979792 1925858 1869576 1810744 1749214
62276A749214o2201n9540n5133n1460m8924m6179m2619l9052l6086l3253l0083
62265A244684k7006k4642k2700k0342j7499j5203j4232j3781j2197q977n331k473
62253A060301l67J287J860Q27p49j318j156j918l861n185m690l489l341m436n766
62238A027999o634o949o743o261n879n366l939j657J47O66R06K214M261N660O067
62223A004492O441P435Q710R797J0628J1168J1492J2309J4523J7842K0613K1569
62211A157019K1416K2125K4815K8685L2095L4271L5761L7605M0624M5382N1844
62200A531642N8531O3075O4736O5696O8434P2084P3151O9960O4395N8469N1258
62189B241431M0892K8108J5650M791n476j5928k5809l4470m2426m9853n5316n7313
$$ plain form
62276 1749214 1687013 1627473 1572340 1520880 1471956 1425777 1383158 1344106 1308020 1274767 1244684
62265 1244684 1217678 1193036 1170336 1149994 1132495 1117292 1103060 1089279 1077082 1068105 1062774 1060301
62253 1060301 1059934 1061221 1063081 1063908 1063159 1061841 1060685 1058767 1054906 1049721 1045031 1041542 1038201 1033765 1027999
62238 1027999 1021365 1014416 1007673 1001412 995533 990167 986228 984571 984718 985384 986290 988504 992765 998425 1004492
62223 1004492 1010933 1018368 1027078 1036875 1047503 1058671 1070163 1082472 1096995 1114837 1135450 1157019
62211 1157019 1178435 1200560 1225375 1254060 1286155 1320426 1356187 1393792 1434416 1479798 1531642
62200 1531642 1590173 1653248 1717984 1783680 1852114 1924198 1997349 2067309 2131704 2190173 2241431
62189 2241431 2282323 2310431 2326081 2330872 2325396 2309468 2283659 2249189 2206763 2156910 2101594 2044281
62177B044281n6577n5547n5561n5420n3111m8360m2816l7911l3380k8327k3005
62166A554266j8528j5141j2058r274q130r170j0548r823o792l392j174j24K69
62153A450381J94L7M57J472K337K791L695N777Q377J0126J0539J0465J1106J3027
62139A530781J5862J8701K0874K2537K4391K6693K8955L0807L2720L5383L8547
62128A826251M1120M2409M2755M2724M2096M0204L7136L3960L1417K8818K4889
62117B233779J9799J5690J4677J6627J9421K1320K2596K4625K7975L1837L5183
62106B483529L7826M0084M1762M2007M0222L6799L2669K8338K3601J8194J2510
62095B837541P527L916J247j770n958j0649j4295j6045j6216j5235j3091j0267
$$ plain form
62177 2044281 1987704 1932157 1876596 1821176 1768065 1719705 1676889 1638978 1605598 1577271 1554266
62166 1554266 1535738 1520597 1508539 1499265 1491135 1481965 1471417 1461594 1454802 1451410 1450236 1450112 1450381
62153 1450381 1450575 1450612 1451069 1452541 1454878 1457669 1461364 1467141 1475518 1485644 1496183 1506648 1517754 1530781
62139 1530781 1546643 1565344 1586218 1608755 1633146 1659839 1688794 1719601 1752321 1787704 1826251
62128 1826251 1867371 1909780 1952535 1995259 2037355 2077559 2114695 2148655 2180072 2208890 2233779
62117 2233779 2253578 2269268 2283945 2300572 2319993 2341313 2363909 2388534 2416509 2448346 2483529
62106 2483529 2521355 2561439 2603201 2645208 2685430 2722229 2754898 2783236 2806837 2825031 2837541
62095 2837541 2845068 2848984 2850231 2848461 2842503 2831854 2817559 2801514 2785298 2770063 2756972 2746705
62083B746705q180p577p085m731o92K868M723N842P405R180J0703J2567J5190
62070B786918J7491J8428J9158K1761K5978K9111K9678K9488L1129L4628L7969
62059C081737M0115M1981M4442M6854M8216M8886N0158N2477N4891N6347N6809
62048C622913N6865N6786N6524N6218N6163N6354N6430N6216N6060N6580N8194
62037D245303O0697O3199O4830O5698O6801O8679P0704P2263P3984P6874Q0637
62026E009669Q3987Q6560Q9337R3014R7109J01117J05441J10579J16015J20509
62016F013337J22810J21852J17180J09953J02848R8200R6424R6503R7303R7916
62006G074326R7354R4650Q9116Q0468O9300N7503M7112L8335K9816K1281J4427
$$ plain form
62083 2746705 2738525 2730948 2723863 2719132 2718440 2721308 2726031 2731873 2739278 2748458 2759161 2771728 2786918
62070 2786918 2804409 2822837 2841995 2863756 2889734 2918845 2948523 2978011 3009140 3043768 3081737
62059 3081737 3121852 3163833 3208275 3255129 3303345 3352231 3402389 3454866 3509757 3566104 3622913
62048 3622913 3679778 3736564 3793088 3849306 3905469 3961823 4018253 4074469 4130529 4187109 4245303
62037 4245303 4306000 4369199 4434029 4499727 4566528 4635207 4705911 4778174 4852158 4929032 5009669
62026 5009669 5093656 5180216 5269553 5362567 5459676 5560793 5666234 5776813 5892828 6013337
62016 6013337 6136147 6257999 6375179 6485132 6587980 6686180 6782604 6879107 6976410 7074326
62006 7074326 7171680 7266330 7355446 7435914 7505214 7562717 7609829 7648164 7677980 7699261 7713688
61995G713688J0264P000K123m404j0714j5996k1092k6464l1418l5511l9177m2584
61983G505715m5110m6278m6317m5624m4515m3473m2639m1237l8631l5799l4334
61972G041758l4013l2895l0093k6905k4705k3315k2085k1016j9868j7656j4327
61961F774880j1712j1323j2156j2114j0733q906o643l198P77L292L732L783M885
61948F714564O243O436N785N776O755P604P456O511M927K031k889r583j7116k4720
61934F719780l2180l9806m8290n8039o8223p6928q2856q6545q9333r1378r1529
61923E954673q9184q5441q2144q0255p9358p8296p6102p2763o9277o6631o4631
61912E110591o2285n9207n5868n2469m8679m4829m2127m0881l9669l7363l4929
$$ plain form
61995 7713688 7723952 7730952 7733075 7728671 7717957 7701961 7680869 7654405 7622987 7587476 7548299 7505715
61983 7505715 7460605 7414327 7368010 7322386 7277871 7234398 7191759 7150522 7111891 7076092 7041758
61972 7041758 7007745 6974850 6944757 6917852 6893147 6869832 6847747 6826731 6806863 6789207 6774880
61961 6774880 6763168 6751845 6739689 6727575 6716842 6707936 6701293 6698095 6698872 6702164 6705896 6709679 6714564
61948 6714564 6720807 6727243 6733028 6738804 6745559 6753163 6760619 6767130 6772057 6774088 6771199 6761616 6744500 6719780
61934 6719780 6687600 6647794 6599504 6541465 6473242 6396314 6313458 6226913 6137580 6046202 5954673
61923 5954673 5865489 5780048 5697904 5617649 5538291 5459995 5383893 5311130 5241853 5175222 5110591
61912 5110591 5048306 4989099 4933231 4880762 4832083 4787254 4745127 4704246 4664577 4627214 4592285
61901D592285l3749l3018l0716k6824k3468k1552j9347j5410j1128q881q637q063
61889D351492n511j364L552R233J5651K1644K5782K7965K9591L2107L5729L9515
61877D585386M2194M3030M2444M1995M3259M6269M9391N1229N2154N3211N4077
61866E104639N3642N2712N4308O0183O8373P5902Q3039R3027J07818J26013J45372
61855F025028J65548J87508K11647K37716K65681K95435L26134L56964L88408
61846H460069M21875M58006M96061N34984N74391O14165O53187O88460P15044
61837A3616242P26517P15456O73942N94910M75045L17779J33852o1463k52266
61828A6940014m24719n68455o77795p52399p96041q13909q10424p89041p53480
$$ plain form
61901 4592285 4558536 4525518 4494802 4467978 4444510 4422958 4403611 4388201 4377073 4368192 4359555 4351492
61889 4351492 4345981 4344617 4348169 4357402 4373053 4394697 4420479 4448444 4478035 4510142 4545871 4585386
61877 4585386 4627580 4670610 4713054 4755049 4798308 4844577 4893968 4945197 4997351 5050562 5104639
61866 5104639 5158281 5210993 5265301 5325484 5393857 5469759 5552798 5645825 5753643 5879656 6025028
61855 6025028 6190576 6378084 6589731 6827447 7093128 7388563 7714697 8071661 8460069
61846 8460069 8881944 9339950 9836011 10370995 10945386 11559551 12212738 12901198 13616242
61837 13616242 14342759 15058215 15732157 16327067 16802112 17119891 17253743 17192280 16940014
61828 16940014 16515295 15946840 15269045 14516646 13720605 12906696 12096272 11307231 10553751
61819A0553751p08525o59220o09004n58882n08841m60012m14753l74495l38361
61810E921658l04539k72484k43073k17012j94013j73367j54381j36166j18044
61801D108579j00460q4618p0666n7074m2663k8547j6931q185m13P817J5629K1359
61789C743827K4874K7248K8578K7580K3469J7249J0628M351j859q085j3538j7044
61777C867278j8054j7126j5365j3129r553l836L139R298J3475J6058J7299J6232
61765C865716J2212O484R00m428j0775j8240k5006k9533l2260l4446l6078l5801
61753C658745l2580k6708j9278j1220k897N665J4438K3391L2632M2369N2576O3042
61741C800175P3828Q5308R7347J08995J19580J29850J41169J53811J66965J80456
$$ plain form
61819 10553751 9845226 9186006 8577002 8018120 7509279 7049267 6634514 6260019 5921658
61810 5921658 5617119 5344635 5101562 4884550 4690537 4517170 4362789 4226623 4108579
61801 4108579 4008119 3923501 3852835 3795761 3753098 3724551 3707620 3699435 3699022 3706839 3722468 3743827
61789 3743827 3768701 3795949 3824527 3852107 3875576 3892825 3903453 3907804 3905945 3897860 3884322 3867278
61777 3867278 3849224 3832098 3816733 3803604 3794051 3790215 3793354 3802652 3816127 3832185 3849484 3865716
61765 3865716 3877928 3884412 3885312 3880884 3870109 3851869 3826863 3797330 3765070 3730624 3694546 3658745
61753 3658745 3626165 3599457 3580179 3568959 3566062 3571727 3586165 3609556 3642188 3684557 3737133 3800175
61741 3800175 3874003 3959311 4056658 4165653 4285233 4415083 4556252 4710063 4877028 5057484
61731E057484J95353K12391K30846K49850K70190K93708L21093L51361L83795
61722G566071M19499M60268N06296N55970O08149O63921P25419P93174Q65511
61713A3164278R40615J018244J098614J179935J257502J324632J373144J392568
61705B2749532J369709J290440J143427R24277O38707L03594n4961m06718p24086
61696B7233921r87887j189473j328670j410135j441164j431162j390520j328377
61688A6726533j251517j165440j075360r85305q97292q12690p33863o63095o00284
61679H541687n43341m90981m43743m02054l64799l30607k99292k71188k45969
61670E149713k23126k02851j85345j69783j55105j41591j30555j22361j15829
$$ plain form
61731 5057484 5252837 5465228 5696074 5945924 6216114 6509822 6830915 7182276 7566071
61722 7566071 7985570 8445838 8952134 9508104 10116253 10780174 11505593 12298767 13164278
61713 13164278 14104893 15123137 16221751 17401686 18659188 19983820 21356964 22749532
61705 22749532 24119241 25409681 26553108 27477385 28116092 28419686 28364725 27958007 27233921
61696 27233921 26246034 25056561 23727891 22317756 20876592 19445430 18054910 16726533
61688 16726533 15475016 14309576 13234216 12248911 11351619 10538929 9805066 9141971 8541687
61679 8541687 7998346 7507365 7063622 6661568 6296769 5966162 5666870 5395682 5149713
61670 5149713 4926587 4723736 4538391 4368608 4213503 4071912 3941357 3818996 3703167
61661C703167j09989j05390j02851j01532r9348r5383r0821q7024q3530p8967
61651B748332p3399o8447o4983o1965n8170n3983n0569m8094m5756m3197m0823
61640B138946l8984l7738l7180l7093l6430l4096l0344k6761k4794k4654k5391
61629A785481k5539k4136k1828k0303j9977j9052j6169j2983j2225j3600j3945
61618A585724j1661q824q026r008r650q935p627o713o354n913m537k252o20j298
61604A494306l706n528n972o834r380j1893j1922r611p080n375l952k573j699
61591A408781r96P38L726O579Q008Q171P993P903P716P253O697O533P112Q038
61577A494252Q299P472O508O684Q043R511J0404J1013J1742J2434J2699J2355
$$ plain form
61661 3703167 3593178 3487788 3384937 3283405 3184057 3088674 2997853 2910829 2827299 2748332
61651 2748332 2674933 2606486 2541503 2479538 2421368 2367385 2316816 2268722 2222966 2179769 2138946
61640 2138946 2099962 2062224 2025044 1987951 1951521 1917425 1887081 1860320 1835526 1810872 1785481
61629 1785481 1759942 1735806 1713978 1693675 1673698 1654646 1638477 1625494 1613269 1599669 1585724
61618 1585724 1574063 1565239 1557213 1548205 1538555 1529620 1521993 1515280 1508926 1503013 1498476 1496224 1495604 1494306
61604 1494306 1490600 1485072 1479100 1472266 1462886 1450993 1439071 1429460 1422380 1417005 1413053 1410480 1408781
61591 1408781 1407785 1408523 1412249 1418828 1426836 1435007 1443000 1450903 1458619 1465872 1472569 1479102 1486214 1494252
61577 1494252 1502551 1510023 1516531 1523215 1531258 1540769 1551173 1562186 1573928 1586362 1599061 1611416
61565A611416J1235Q995N443R37l671p588j0730j3743j7046j9988k1457k1347
61553A522456k0679k0076j9080j7357j5644j4704j4150j3285j2453j2465j3102
61542A349461j3337j2862j2237j1614j0358q261o240n328n450n459m226j710R30
61529A253309K459L041M143O652R663J1816J3156J4672J6430J7540J8016J9315
61517A390212K2474K6635L0054L1985L2996L3873L4951L6286L7906L9683M1259
61506A758314M2259M2564M2368M1877M1017L9501L7303L4773L2174K9308K5921
61495B167379K2364J9620J8537J9060K0134K0506J9774J8583J7521J6068J3183
61484B372729Q819M195M91k151m268o471r313j2879j6114j7404j6297j4048j2018
$$ plain form
61565 1611416 1622651 1631646 1637089 1638026 1634355 1626767 1616037 1602294 1585248 1565260 1543803 1522456
61553 1522456 1501777 1481701 1462621 1445264 1429620 1414916 1400766 1387481 1375028 1362563 1349461
61542 1349461 1336124 1323262 1311025 1299411 1289053 1280792 1274552 1269224 1263774 1258315 1254089 1252379 1253309
61529 1253309 1255768 1258809 1262952 1269604 1279267 1291083 1304239 1318911 1335341 1352881 1370897 1390212
61517 1390212 1412686 1439321 1469375 1501360 1534356 1568229 1603180 1639466 1677372 1717055 1758314
61506 1758314 1800573 1843137 1885505 1927382 1968399 2007900 2045203 2079976 2112150 2141458 2167379
61495 2167379 2189743 2209363 2227900 2246960 2267094 2287600 2307374 2325957 2343478 2359546 2372729
61484 2372729 2381548 2385743 2386234 2384083 2379815 2373344 2364031 2351152 2335038 2317634 2301337 2287289 2275271
61471B275271j0257q049n109j606K267O127R569J3062J7910K4572L1745L7874
61459B393376M2898M7865N3669O0924P0053Q0476R0587R9815J09794J22113J35905
61448C307475J49209J62074J76251J92182K08389K23896K39256K54675K68878
61439E182285K80549K89238K93933K91996K80569K58449K25978J84107J34567
61430G421671Q0519K6167k4516o8994j06761j38710j65187j84623j95086j97174
61420F447306j94095j88515j80424j68817j54289j38891j23955j09176r3823p8056
61410E017265o2816m8789l5783k3197j0990J04R529J7669K5320L2828M0090M6903
61398E008133N2669N6459N8252N9471O1187O2397O1605N9661N9163O1009O3483
$$ plain form
61471 2275271 2265014 2256965 2251856 2250250 2252517 2258644 2268213 2281275 2299185 2323757 2355502 2393376
61459 2393376 2436274 2484139 2537808 2598732 2668785 2749261 2839848 2939663 3049457 3171570 3307475
61448 3307475 3456684 3618758 3795009 3987191 4195580 4419476 4658732 4913407 5182285
61439 5182285 5462834 5752072 6046005 6338001 6618570 6877019 7102997 7287104 7421671
61430 7421671 7502190 7528357 7503841 7434847 7328086 7189376 7024189 6839566 6644480 6447306
61420 6447306 6253211 6064696 5884272 5715455 5561166 5422275 5298320 5189144 5095321 5017265
61410 5017265 4954449 4905660 4869877 4846680 4835690 4835794 4845323 4862992 4888312 4921140 4961230 5008133
61398 5008133 5060802 5117261 5175513 5234984 5296171 5358568 5420173 5479834 5538997 5600006 5663489
61387E663489O5121O6502O8355O9726O9348O7464O4866O1289N6248N0728M6403
61376F349539M3471M0530L6322L0559K3269J4584N311l263j0454j6562k2280k8106
61364F462920l4227m0272m5275m8464n0166n1417n2592n2795n0825m6570m1349
61353E948968l6771l3111k8973k3009j5820r579n680l639k437k040k845m506o105
61340E774453p201p913q306q278p622n631j070O661J6732K8036M0768N5823P2978
61327E949430R0879J08964J28195J49401J71898J94299K15965K36853K56487K74085
61317G776456K89403L02402L11623L13633L04852K84046K52704K13057J66327
61308A0214503J13338N6387m30n3249j00402j42164j79052k11022k37964k59938
$$ plain form
61387 5663489 5728610 5795112 5863467 5933193 6002541 6070005 6134871 6196160 6252408 6303136 6349539
61376 6349539 6393010 6433540 6469862 6500421 6523690 6538274 6543585 6540322 6529868 6513306 6491026 6462920
61364 6462920 6428693 6388421 6343146 6294682 6244516 6193099 6140507 6087712 6036887 5990317 5948968
61353 5948968 5912197 5879086 5850113 5827104 5811284 5801705 5796025 5792386 5789949 5787909 5785064 5780558 5774453
61340 5774453 5767252 5759339 5751033 5742755 5735133 5729502 5728432 5735093 5751825 5779861 5820629 5876452 5949430
61327 5949430 6040309 6149273 6277468 6426869 6598767 6793066 7009031 7245884 7502371 7776456
61317 7776456 8065859 8368261 8679884 8993517 9298369 9582415 9835119 10048176 10214503
61308 10214503 10327841 10384228 10383798 10330549 10230147 10087983 9908931 9697909 9459945 9200007
61298I200007k76708k87817k93588k95333k93867k88409k77991k63766k48629
61289F673899k34301k19892k04055j87426j71856j58022j45219j33131j22137
61280E097860j11717j00197q6837p3010o0358m8686l6641k3833j1258n7R328J7060
61268D571654K3810L0412L6906M2146M5017M5791M5680M5480M5155M4313M2319
61257E018683L8542L3342K8344K4825K2324J9815J7582J6570J6287J4990J1951
61246E263255Q236M988K252l91l327p255j2928k0195k8252l6878m6119n4786o0929
61233E007671o4244o6482o8767p0073o9234o6901o4176o0558n4878m7533m0299
61222D334526l4166k8638k3031j7370j2022p307l604j248j89l7k43p3J133L265
$$ plain form
61298 9200007 8923299 8635482 8341894 8046561 7752694 7464285 7186294 6922528 6673899
61289 6673899 6439598 6219706 6015651 5828225 5656369 5498347 5353128 5219997 5097860
61280 5097860 4986143 4885946 4799109 4726099 4665741 4617055 4580414 4556581 4545323 4545266 4554594 4571654
61268 4571654 4595464 4625876 4662782 4704928 4749945 4795736 4841416 4886896 4932051 4976364 5018683
61257 5018683 5057225 5090567 5118911 5143736 5166060 5185875 5203457 5220027 5236314 5251304 5263255
61246 5263255 5271491 5276479 5278731 5278340 5275013 5267758 5254830 5234635 5206383 5169505 5123386 5068600 5007671
61233 5007671 4943427 4876945 4808178 4738105 4668871 4601970 4537794 4477236 4422358 4374825 4334526
61222 4334526 4300360 4271722 4248691 4231321 4219299 4211992 4208388 4207140 4206951 4206914 4206671 4206598 4207731 4210996
61208D210996N366O702P443P980Q235Q329R314J2270J6941K2105K7232L2957L9752
61195D415622M6859N3099N8437O4317P2131Q1577R0880R8686J05184J10884J14874
61184E312550J15236J10845J01668Q7336O6738L9521P140k8054o3845r7964j27947
61173E523224j52026j69642j80711j85175j83726j78016j69485j58796j47008
61164C998639j36102j27329j19845j12210j04573r8085r2669q6806p9512p1300
61154B970208o3057n5085m7403m0144l3288k6764k1058j7059j4798j2876r707
61143B628969n127l65L555O902J0513J4293J7088J8212J8498J9339K1065K2864
61131B775806K3832K3276K0357J4698P468O89m858j0041j5522k0729k5050k8799
$$ plain form
61208 4210996 4216362 4223064 4230507 4238487 4246722 4255051 4264365 4276635 4293576 4315681 4342913 4375870 4415622
61195 4415622 4462481 4515580 4574017 4638334 4710465 4792042 4882922 4981608 5086792 5197676 5312550
61184 5312550 5427786 5538631 5640299 5727635 5794373 5833894 5841034 5812980 5749135 5651171 5523224
61173 5523224 5371198 5201556 5020845 4835670 4651944 4473928 4304443 4145647 3998639
61164 3998639 3862537 3735208 3615363 3503153 3398580 3300495 3207826 3121020 3041508 2970208
61154 2970208 2907151 2852066 2804663 2764519 2731231 2704467 2683409 2666350 2651552 2638676 2628969
61143 2628969 2623842 2623477 2627032 2633934 2644447 2658740 2675828 2694040 2712538 2731877 2752942 2775806
61131 2775806 2799638 2822914 2843271 2857969 2865437 2866126 2861268 2851227 2835705 2814976 2789926 2761127
61119B761127l2345l5448l8241m1624m5685m8867n0004n0248n1531n3769n5145
61108B258220n4748n3342n1617m9246m6079m3090m1517m1611m2583m3238m2601
61097A748548m0441l7415l4402l1648k8880k6020k3268k0566j7529j4040j0578
61086A463761p899o559o590p471q629j0082j2179j4585j6071j5773j4206j2526
61074A331191j1062r136o154k458Q61K786L258L338M236O162Q405J0453J2334
61061A354214J3829J4236J3420J2341J2137J3000J4158J4494J3196J0580Q290
61050A493895P795Q548Q736P976P830R195J0697J0558Q799O548M316K110K51j263
61036A585991l481p309j1975j5648j7219j6937j5925j5673j7154j9621k1074k0707
$$ plain form
61119 2761127 2728782 2693334 2655093 2613469 2567784 2518917 2468913 2418665 2367134 2313365 2258220
61108 2258220 2203472 2150130 2098513 2049267 2003188 1960098 1918581 1876970 1834387 1791149 1748548
61097 1748548 1708107 1670692 1636290 1604642 1575762 1549742 1526474 1505908 1488379 1474339 1463761
61086 1463761 1455862 1449303 1442713 1435242 1426613 1416531 1404352 1389767 1373696 1357923 1343717 1331191
61074 1331191 1320129 1310993 1304839 1302381 1303242 1306028 1309286 1312624 1316860 1323022 1331427 1341880 1354214
61061 1354214 1368043 1382279 1395699 1408040 1420177 1433177 1447335 1461829 1475025 1485605 1493895
61050 1493895 1501690 1510238 1518974 1526950 1534780 1543975 1554672 1565230 1574029 1580577 1584893 1587003 1587254 1585991
61036 1585991 1582510 1575201 1563226 1547578 1530359 1513422 1497497 1481824 1464670 1445049 1423975 1403268
61024A403268j9942k0315k1440k2064k1939k1343j9903j7313j4458j2378j0791
61013A201382q894o835n114l348j137O89J150Q95J322K453L178L156L103L579
60999A195579M635O074P038O336M389L666N508P871Q147P005O869P688P251N402
60985A283458M796O975J0385J2877J4066J4466J4411J4598J5938J8176K0095K1519
60973A451760K3440K5859K7392K7568K7750K8922L0235L0554L0108K9768K9825
60962A763181L0229L0942L1606L1721L1465L1365L1213L0570L0279L1931L5578
60951B110080L9441M2254M4539M7258N0618N4593N9371O4927P1107P8111Q5969
60940B748268R3913J01632J10492J21724J34019J45032J54946J66136J79580J94115
$$ plain form
61024 1403268 1383326 1363011 1341571 1319507 1297568 1276225 1256322 1239009 1224551 1212173 1201382
61013 1201382 1192488 1185653 1180539 1177191 1176054 1176743 1177893 1178788 1180110 1182563 1185741 1188897 1192000 1195579
60999 1195579 1200214 1206288 1213326 1219662 1224051 1227717 1233225 1241096 1249243 1256248 1263117 1270805 1278056 1283458
60985 1283458 1288254 1295229 1305614 1318491 1332557 1347023 1361434 1376032 1391970 1410146 1430241 1451760
60973 1451760 1475200 1501059 1528451 1556019 1583769 1612691 1642926 1673480 1703588 1733356 1763181
60962 1763181 1793410 1824352 1855958 1887679 1919144 1950509 1981722 2012292 2042571 2074502 2110080
60951 2110080 2149521 2191775 2236314 2283572 2334190 2388783 2448154 2513081 2584188 2662299 2748268
60940 2748268 2842181 2943813 3054305 3176029 3310048 3455080 3610026 3776162 3955742 4149857
60930D149857K09344K26367K45016K62853K77899K90374L01416L12301L25337
60921F600764L42990L65524L91571M21219M55974M95762N39288N87749O44810
60912A0845651P12284P89339Q76407R75952J089052J216174J362206J535085J738371
60903B1140521J972187K243164K564086K940135L367224L846453M369214M848884
60895D7291868N074444M794968L914856K621074J295366K81863k72568l93666
60887F4608205j77463K32018N93102N93537J7678j083421k401289l564124m339755
60878E4478488m693445m712937m514087m195571l829135l456965l095432k748874
60870B3232042k421360k117413j839291j588817j369303j182797j027646r00445
$$ plain form
60930 4149857 4359201 4585568 4830584 5093437 5371336 5661710 5963126 6275427 6600764
60921 6600764 6943754 7309278 7700849 8122068 8578042 9073804 9613092 10200841 10845651
60912 10845651 11557935 12347274 13223681 14199633 15288685 16504859 17867065 19402150 21140521
60903 21140521 23112708 25355872 27919958 30860093 34227317 38073770 42442984 47291868
60895 47291868 52366312 57161280 61076136 63697210 64992576 65274439 65001871 64608205
60887 64608205 64430742 64662760 65255862 65849399 65867077 64783656 62382367 58818243 54478488
60878 54478488 49785043 45072106 40558019 36362448 32533313 29076348 25980916 23232042
60870 23232042 20810682 18693269 16853978 15265161 13895858 12713061 11685415 10784970
60862A0784970p97909p15356o46237n85470n31565m84215m41834m02757l66725
60853E812902l33638l02689k74021k49445k30066k14696k01683j90465j80326
60844C635873j69710j58321j48023j39945j32255j22589j11443j01313r3453q7098
60834B371723q1047p4545o7298n9982n4159n0496m7660m3990l9588l5888l3806
60823A783264l3336l4145l5571l6633l7026l7459l8235l8430l7310l5739l4864
60812A384516l4306l2843l0355k7738k5364k2903k0431j8490j7145j5945j4741
60801A124255j3602j2183j0084p704n712l864j277J990M721O199P183Q792J1022
60788A109736J2934J3972J4552J5440J6955J8814K0425K1228K0946J9821J8531
$$ plain form
60862 10784970 9987061 9271705 8625468 8039998 7508433 7024218 6582384 6179627 5812902
60853 5812902 5479264 5176575 4902554 4653109 4423043 4208347 4006664 3816199 3635873
60844 3635873 3466163 3307842 3159819 3019874 2887619 2765030 2653587 2552274 2458821 2371723
60834 2371723 2290676 2216131 2148833 2088851 2034692 1984196 1936536 1892546 1852958 1817070 1783264
60823 1783264 1749928 1715783 1680212 1643579 1606553 1569094 1530859 1492429 1455119 1419380 1384516
60812 1384516 1350210 1317367 1287012 1259274 1233910 1211007 1190576 1172086 1154941 1138996 1124255
60801 1124255 1110653 1098470 1088386 1080682 1074970 1071106 1069829 1071819 1076540 1082739 1089922 1098714 1109736
60788 1109736 1122670 1136642 1151194 1166634 1183589 1202403 1222828 1244056 1265002 1284823 1303354
60777A303354J7510J6306J4119J1109Q586P492P260O829O167N956O095N595L856
60764A420234J208j645l895m578l475j983j922l440n210o717q844j1932j4876
60751A352925j6813j8276j9789k0552j9635j7555j5597j4287j3350j2447j1117
60740A173507q766n595k796r94P73L489O339P688P409P109Q254J0972J4332J6928
60726A238649J7630J6671J5647J5560J5433J3845J1291R584R262R107Q237P297
60714A388213P123P458P502P008O367O206P041Q757J0292J0562R789R212R371
60701A494901R485Q747P506O664O520O441N412K821p34l480m030k980k225k586
60687A532462l104k818k161k012k424l114m326o229q027q801q850r184r941j0316
$$ plain form
60777 1303354 1320864 1337170 1351289 1362398 1370984 1378476 1385736 1392565 1398732 1404688 1410783 1416378 1420234
60764 1420234 1421442 1419797 1415902 1411324 1407849 1405866 1403944 1400504 1395294 1388577 1379733 1367801 1352925
60751 1352925 1336112 1317836 1298047 1277495 1257860 1240305 1224708 1210421 1197071 1184624 1173507
60740 1173507 1164741 1159146 1156350 1155356 1156129 1159618 1165957 1173645 1181054 1188163 1196417 1207389 1221721 1238649
60726 1238649 1256279 1272950 1288597 1304157 1319590 1333435 1344726 1354310 1363572 1372679 1380916 1388213
60714 1388213 1395336 1402794 1410296 1417304 1423671 1429877 1436918 1445675 1455967 1466529 1476318 1485530 1494901
60701 1494901 1504386 1513133 1520639 1527303 1533823 1540264 1545676 1548497 1547763 1544283 1540253 1537273 1535048 1532462
60687 1532462 1529358 1526540 1524379 1522367 1519943 1516829 1512503 1506274 1498247 1489446 1480596 1471412 1461471 1451155
60673A451155j0057r867j0129j0225r583q657q266q481q783q998r424j0207j1004
60660A327474j1384j1183j0434r239p804o485n622n326n491n961o651p333p440
60647A227121o357m140j752k73N0j99m18m07k11o4m97j978m287o684q795j0768
60631A180341j2565j3771j4425j5126j5867j5603j3807j1727j1079j1936j2904
60620A031531j3031j2405j1171r382p792p347p552o667m104j333K99J379L116
60607I55541N211O400O386O001N841N931O543Q110J0210J1597J1516J0410R254
60594A058951Q745R131J0224J1389J1897J1449J0252Q870Q157Q804J0425J1660
60582A179954J1829J1916J3126J4970J5929J5677J5467J6343J8126K0218K2107
$$ plain form
60673 1451155 1441098 1431231 1421102 1410877 1401294 1392637 1384371 1375890 1367107 1358109 1348685 1338478 1327474
60660 1327474 1316090 1304907 1294473 1285234 1277430 1270945 1265323 1259997 1254506 1248545 1241894 1234561 1227121
60647 1227121 1220764 1216624 1214872 1214599 1214649 1214450 1214032 1213625 1213414 1213350 1212853 1210875 1206588 1199904 1191109 1180341
60631 1180341 1167776 1154005 1139580 1124454 1108587 1092984 1079177 1067450 1056371 1044435 1031531
60620 1031531 1018500 1006095 994924 985542 977750 970403 962851 956184 952080 950747 951046 952425 955541
60607 955541 960752 967152 973538 979539 985380 991311 997854 1005964 1016174 1027771 1039287 1049697 1058951
60594 1058951 1067696 1076827 1087051 1098440 1110337 1121786 1132038 1140908 1149065 1157869 1168294 1179954
60582 1179954 1191783 1203699 1216825 1231795 1247724 1263401 1278868 1295211 1313337 1333555 1355662
60571A355662K2879K1529J8482J5687J4471J4048J2923J0953R082P549N529K426
60559A511220j350n071q444j1368j3444j4214j3868j3350j3472j4064j4235j3550
60547A374790j2460j1313r521o404k549N59K249L312M796O863Q995J0602J1140
60534A381059J0336Q658P103O198N708N427N492N647N092L761K890L491M810N240
60520A460912M426L518L564M514N667O211N456L384J040n15j583l166m944n336
60506A483148m059l175m479o883p965p476p554r414j1498j1641r803p736o602
60493A384863n870m228r34L507P578J0027J1335J3345J7013K1150K4080K5894
60481A507760K7999L1063L4584L8341M2873M8500N4895O1897O9619P7637Q5099
$$ plain form
60571 1355662 1378541 1400070 1418552 1434239 1448710 1462758 1475681 1486634 1495716 1503265 1508794 1511220
60559 1511220 1509870 1504799 1496355 1484987 1471543 1457329 1443461 1430111 1416639 1402575 1388340 1374790
60547 1374790 1362330 1351017 1341496 1335092 1332543 1333102 1335351 1338663 1343459 1350322 1359317 1369919 1381059
60534 1381059 1391395 1400053 1407156 1413354 1419062 1424489 1429981 1435628 1440720 1444481 1447371 1450862 1455672 1460912
60520 1460912 1465338 1468856 1472420 1476934 1482601 1488812 1494268 1497652 1498692 1498177 1496594 1493428 1488484 1483148
60506 1483148 1479089 1475914 1471435 1464552 1456587 1449111 1441557 1432143 1420645 1409004 1399201 1391465 1384863
60493 1384863 1378993 1374765 1373831 1377338 1384916 1394943 1406278 1419623 1436636 1457786 1481866 1507760
60481 1507760 1535759 1566822 1601406 1639747 1682620 1731120 1786015 1847912 1917531 1995168 2080267
60470B080267R1910R8540J04193J06349J02871R3785Q0352O3422M3552K2039R41
60459B888221j7481l0920l7479l6927l1039k2129j1635n07J0035J8951K6000L1232
60447B786322L4522L6143L6951L7300L6706L5253L4253L4666L6118L8679M4231
60436C191144N4272O7447Q1115R4754J09973J27737J47706J69854J94472K20413
60426D458887K45463K68858K91642L14356L36357L58044L81836M09992M42998
60417G508433M80806N23879N71479O19359O59489O80959O71236O19434N21181
60408A2856255L80752K08313J6115j81985l69626n30034o51019p28557p66165
60399A0234049p71464p52675p16936o70445o18734n65820n13332m61621m11819
$$ plain form
60470 2080267 2172177 2270717 2374910 2481259 2584130 2677915 2758267 2821689 2865241 2887280 2888221
60459 2888221 2870740 2839820 2802341 2765414 2734375 2712246 2700611 2700104 2710139 2729090 2755090 2786322
60447 2786322 2820844 2856987 2893938 2931238 2967944 3003197 3037450 3072116 3108234 3146913 3191144
60436 3191144 3245416 3312863 3393978 3488732 3598705 3726442 3874148 4044002 4238474 4458887
60426 4458887 4704350 4973208 5264850 5579206 5915563 6273607 6655443 7065435 7508433
60417 7508433 7989239 8513118 9084597 9703956 10363445 11044404 11715640 12335074 12856255
60408 12856255 13237007 13445320 13461435 13279450 12909824 12379790 11728771 11000214 10234049
60399 10234049 9462585 8709910 7992974 7322529 6703795 6137975 5624643 5163022 4751203
60390D751203l65914l24912k88180k55023k25722k00429j78145j57687j39124
60381B616067j23599j11941j03570r6407q8113p8277o9184o3287o0065n6751n2009
60370A712864m7196m3754m1284l8929l6759l4767l2108k8576k5454k3609k2009
60359A338419j9445j6543j4655j3793j3095j2461j2215j1944j1091j0032r217
60348A193928p926n362k430q92j159k214l233l927l730k212j64J192J906L058
60334A166835M984O977Q433R113Q526O606M720M439N206M817K440l96k122k957
60320A227621l820m862n893p173q690r462q538o408m632m182m631m843m201l178
60306A147108k696k880k724j422L53J162O42j98m59k12K66J165K446L225K629
$$ plain form
60390 4751203 4385289 4060377 3772197 3517174 3291452 3091023 2912878 2755191 2616067
60381 2616067 2492468 2380527 2276957 2180550 2092437 2014160 1944976 1881689 1821624 1764873 1712864
60370 1712864 1665668 1621914 1580630 1541701 1504942 1470175 1438067 1409491 1384037 1360428 1338419
60359 1338419 1318974 1302431 1287776 1273983 1260888 1248427 1236212 1224268 1213177 1203145 1193928
60348 1193928 1186002 1180640 1178210 1177318 1176159 1173945 1170712 1166785 1163055 1160843 1160679 1161871 1163777 1166835
60334 1166835 1171819 1178796 1187229 1196342 1204868 1211474 1216194 1220633 1225839 1230656 1233096 1232700 1230578 1227621
60320 1227621 1223801 1218939 1213046 1205873 1197183 1187721 1179183 1172775 1168143 1163961 1159330 1154487 1150286 1147108
60306 1147108 1144412 1141532 1138808 1137386 1137739 1138901 1139543 1139345 1138886 1138674 1138940 1140105 1142551 1145776 1148405
60291A148405J022k18j62P90J616K062K977N063P472Q326O932M858M322N782P735
60276A206982Q553P952O782O116O460P323P542O424M588L358L560N153P598R990
60262A298381J1223J0833R568Q397P212N347L143J854J715J220j051m614p724
60249A345504r379r875r606q276n679k847j549k395l933m109k431p5J961L792
60235A291103N543O521O341N986O555P498P369O122N280N655O293O309O583Q453
60221A381611J1313J2799J1590R133P980Q908J0447J1051J0928J1249J2313J3453
60209A512775J4482J6091J8475K0608K1620K2291K4313K8192L2606L5900L7770
60198A785123L9359M1940M5702M9890N4018N8584O4197P0445P6294Q1610Q7384
$$ plain form
60291 1148405 1149427 1149209 1149047 1149837 1151453 1153515 1156492 1161555 1169027 1177353 1184285 1189143 1193465 1199247 1206982
60276 1206982 1215535 1223487 1230269 1236385 1242845 1250168 1257710 1264134 1268722 1272080 1275640 1280793 1288391 1298381
60262 1298381 1309604 1320437 1330005 1338402 1345614 1350961 1354104 1355958 1357673 1358893 1357842 1353228 1345504
60249 1345504 1336125 1326250 1316644 1308368 1302689 1299842 1298293 1295898 1291965 1287856 1285425 1285350 1287311 1291103
60235 1291103 1296646 1303167 1309508 1315494 1322049 1329547 1336916 1343038 1348318 1353973 1360266 1366575 1373158 1381611
60221 1381611 1392924 1405723 1417313 1426446 1434426 1443334 1453781 1464832 1475760 1487009 1499322 1512775
60209 1512775 1527257 1543348 1561823 1582431 1604051 1626342 1650655 1678847 1711453 1747353 1785123
60198 1785123 1824482 1866422 1912124 1962014 2016032 2074616 2138813 2209258 2285552 2367162 2454546
60187B454546R4396J02337J10423J18151J25223J31572J37738J44378J50942J55608
60177C725314J57013J55352J51568J46305J40015J32957J24424J12939R8124Q1572
60167E025583O5151M9199L3224J7491K996r513j9649k7085l1828l4298l4536l2101
60155E004634k7242k1089j4077n335N578J7655L0103M3584N8552P3723Q7769J01129
60143E354984J14452J26545J35858J42762J48050J50264J47177J39313J29186
60134F588591J17400J02383Q3931O4013M3578K1601j630k3134m0766n5826p0297
60123F829844q3183r1679r4838r4192r1273q6029p7519o5329n0382l4648j9421
60112F041351l723J4419L4841N4676P1603Q6238J00209J13056J22314J25946J23477
$$ plain form
60187 2454546 2548942 2651279 2761702 2879853 3005076 3136648 3274386 3418764 3569706 3725314
60177 3725314 3882327 4037679 4189247 4335552 4475567 4608524 4732948 4845887 4944011 5025583
60167 5025583 5090734 5139933 5173157 5190648 5193644 5184131 5164482 5137397 5105569 5071271 5036735 5004634
60155 5004634 4977392 4956303 4942226 4936891 4942469 4960124 4990227 5033811 5092363 5166086 5253855 5354984
60143 5354984 5469436 5595981 5731839 5874601 6022651 6172915 6320092 6459405 6588591
60134 6588591 6705991 6808374 6892305 6956318 6999896 7021497 7019867 6996733 6955967 6900141 6829844
60123 6829844 6746661 6654982 6560144 6465952 6374679 6288650 6211131 6145802 6095420 6060772 6041351
60112 6041351 6037628 6052047 6086888 6141564 6213167 6299405 6399614 6512670 6634984 6760930 6884407
60101F884407J15431J02930Q7583P0626N2285L2721J3325l907j8123k9870l9500
60090G267908m6037m7968m4739l7153k6426j3163K575K0521M0110O1281Q4593
60079G261502J09966J36015J61595J87526K15589K45967K76826L06525L35046
60070I236557L63011L90251M15795M38355M56474M68782M74377M72636M62853
60061A3179091M44735M18827L85501L43997K93830K36892J76471J14204M9704
60052A5643252j6595q2245j45122k04898k61048l10925l51336l81016m00286m09256
60042A3080525m07716l96176l75830l47960l14348k77457k39163j99648j58493
60033A0363734j16294p4299l3065P241M5422P9275J07110J28493J43565J52204
$$ plain form
60101 6884407 6999838 7102768 7190351 7260977 7313262 7345983 7359308 7355401 7337278 7307408 7267908
60090 7267908 7221871 7173903 7129164 7092011 7065585 7052422 7054997 7075518 7115628 7176909 7261502
60079 7261502 7371468 7507483 7669078 7856604 8072193 8318160 8594986 8901511 9236557
60070 9236557 9599568 9989819 10405614 10843969 11300443 11769225 12243602 12716238 13179091
60061 13179091 13623826 14042653 14428154 14772151 15065981 15302873 15479344 15593548 15643252
60052 15643252 15626657 15544412 15399290 15194392 14933344 14622419 14271083 13890067 13489781 13080525
60042 13080525 12672809 12276633 11900803 11552843 11238495 10961038 10721875 10522227 10363734
60033 10363734 10247440 10173141 10140076 10147317 10192739 10272014 10379124 10507617 10651182 10803386
60023A0803386J53956J48224J34589J13344Q5729N3460J8317j7808n2959q5798
60013A1354440j16048j43944j69384j91784k10445k24919k35145k41264k43070
60004I578437k40079k32551k22014k09920j96187j80148j62410j44379j26263
59995G864486j07246q7645o8749n0139k9478o067J7411L8308N7352P6631R5524
59984G800388J10966J21169J26964J29422J28009J21467J09347R2311P1640M8534
59974H860217K3263m723l5206o6080r4554j19091j39419j55251j66161j72432
59964G930563j74784j73282j67473j57556j44490j28892j10834r0851p0233n0020
59954F662148l0349j0956Q258K7352M6528O5938Q5678J05932J26769J47592J67142
$$ plain form
60023 10803386 10957342 11105566 11240155 11353499 11439228 11492688 11511005 11493197 11440238 11354440
60013 11354440 11238392 11094448 10925064 10733280 10522835 10297916 10062771 9821507 9578437
60004 9578437 9338358 9105807 8883793 8673873 8477686 8297538 8135128 7990749 7864486
59995 7864486 7757240 7669595 7600846 7550707 7521229 7515162 7532573 7570881 7628233 7704864 7800388
59984 7800388 7911354 8032523 8159487 8288909 8416918 8538385 8647732 8740043 8811683 8860217
59974 8860217 8883480 8878757 8843551 8777471 8682917 8563826 8424407 8269156 8102995 7930563
59964 7930563 7755779 7582497 7415024 7257468 7112978 6984086 6873252 6782401 6712168 6662148
59954 6662148 6631799 6620843 6629101 6656453 6702981 6768919 6854597 6960529 7087298 7234890 7402032
59943G402032J84073J97426K06600K11115K10249K02990J88736J68224J43296
59934I114741J15337Q4658N1822J8809j2220m1045o9158r7263j23800j46153j62499
59923H733229j72127j74677j70104j59454j44935j28703j11526r2975p2790n1618
59913G454320l0326r140J2133L3473N4634P5213R4227J10090J21936J30593J37378
59902H184531J42201J43868J41995J37375J30525J21228J09781R7394Q4931P2388
59892I366217O0032M9014M0382L4580L2430L5344M3680N5994P0881Q8852J11489
59881I988895J39237J70876K04735K39895K76428L14852L54881L94569M31133
59872A2515501M62588M87694N04534N10308N02761M80516M41913L85210L10720
$$ plain form
59943 7402032 7586105 7783531 7990131 8201246 8411495 8614485 8803221 8971445 9114741
59934 9114741 9230078 9314736 9366558 9385367 9373147 9332102 9262944 9165681 9041881 8895728 8733229
59923 8733229 8561102 8386425 8216321 8056867 7911932 7783229 7671703 7578728 7505938 7454320
59913 7454320 7423994 7414854 7426987 7460460 7515094 7590307 7684534 7794624 7916560 8047153 8184531
59902 8184531 8326732 8470600 8612595 8749970 8880495 9001723 9111504 9208898 9293829 9366217
59892 9366217 9426249 9475263 9515645 9550225 9582655 9617999 9661679 9717673 9788554 9877406 9988895
59881 9988895 10128132 10299008 10503743 10743638 11020066 11334918 11689799 12084368 12515501
59872 12515501 12978089 13465783 13970317 14480625 14983386 15463902 15905815 16291025 16601745
59863A6601745K21471J21374J4411r3747j95554k84846l59345m18846m62376m88789
59853A4655498m99025m95965m82397m60263m31097l95944l55572l11896k68264
59844A0955075k26906j86856j45764j03069o0144j8201K2125N9668R2979J21616
59834A0510523J45914J65686J80150J88626J90073J82494J64180J35213R6617
59825A1959476M8891o943o7332j27246j83383k34852k80700l18520l46168l63777
59815A0079446l73344l76817l74807l66857l52957l34817l14907k94042k71122
59806G019776k45954k20810j97896j76627j55234j34102j15451j00257q7608p6817
59796E509020o8167o1539n6127n1683m8450m5734m2049l6835l0624k3466j4759
$$ plain form
59863 16601745 16823216 16944590 16959001 16865254 16669700 16384854 16025509 15606663 15144287 14655498
59853 14655498 14156473 13660508 13178111 12717848 12286751 11890807 11535235 11223339 10955075
59844 10955075 10728169 10541313 10395549 10292480 10232336 10214135 10236260 10295928 10388907 10510523
59834 10510523 10656437 10822123 11002273 11190899 11380972 11563466 11727646 11862859 11959476
59825 11959476 12008367 12001424 11934092 11806846 11623463 11388611 11107911 10789391 10443223 10079446
59815 10079446 9706102 9329285 8954478 8587621 8234664 7899847 7584940 7290898 7019776
59806 7019776 6773822 6553012 6355116 6178489 6023255 5889153 5773702 5673445 5585837 5509020
59796 5509020 5440853 5379314 5323187 5271504 5223054 5177320 5135271 5098436 5067812 5044346 5029587
59785E029587m791M826J2403J6713J6603J1674L307o573j7724l0958m5428n8470
59773D931169o8436p5774q0900q3027q1930p9018p5477p0643o3384n4071m4163
59762D154346l4633k5532j6413o581M390J5907K6841L6892M6686N6493O6002P5492
59750D399890Q5667R5817J03634J07574J08075J05585R9023Q7632P3335N9504
59740E325736M7835L7904K9559K4188K3054K5336K8612L1098L3020L6000M1577
59729E683919N0559O3414Q0383J00857J23242J46127J69456J94195K21205K50785
59719G084142K82853L16765L51144L84279M14235M37937M50396M45411M17129
59710A0584291L61548K78519J73809N8590n4395j54433k33604k87017l14845l22888
$$ plain form
59785 5029587 5024796 5029622 5042025 5058738 5075341 5087015 5090322 5083749 5066025 5035067 4989639 4931169
59773 4931169 4862733 4786959 4706059 4623032 4541102 4462084 4386607 4315964 4252580 4198509 4154346
59762 4154346 4119713 4094181 4077768 4071187 4075577 4091484 4118325 4155217 4201903 4258396 4324398 4399890
59750 4399890 4485557 4581374 4685008 4792582 4900657 5006242 5105265 5192897 5266232 5325736
59740 5325736 5373571 5411475 5441034 5465222 5488276 5513612 5542224 5573322 5606342 5642342 5683919
59729 5683919 5734478 5797892 5878275 5979132 6102374 6248501 6417957 6612152 6833357 7084142
59719 7084142 7366995 7683760 8034904 8419183 8833418 9271355 9721751 10167162 10584291
59710 10584291 10945839 11224358 11398167 11456757 11402362 11247929 11014325 10727308 10412463 10089575
59700A0089575l18461l05374k84090k55684k23294j89868j56654j24009r1868
59691H140273n9491k6744M412L1745N6053Q0387J05762J30180J52499J74650J98713
59680H988439K24059K49137K74371L01447L30865L61866L94003M27397M61987
59671A2013571M97698N35027N74485O15739O57888P00247P42345P83412Q22000
59662A7942412Q55659Q81104Q95490Q97767Q88344Q67873Q37405P99632P58792
59653B5624478P19355O85613O61866O51150O53478O66491O87645P14357P42601
59644C1807034P67450P85102P92488P85047P57273P06164O32477N38760M28790
59635C8000585L09219J88749P4273l0080j19646j88214k32209k53183k54013k34880
$$ plain form
59700 10089575 9771114 9465740 9181650 8925966 8702672 8512804 8356150 8232141 8140273
59691 8140273 8080782 8054038 8058450 8090195 8146248 8226635 8332397 8462577 8615076 8789726 8988439
59680 8988439 9212498 9461635 9736006 10037453 10368318 10730184 11124187 11551584 12013571
59671 12013571 12511269 13046296 13620781 14236520 14894408 15594655 16337000 17120412 17942412
59662 17942412 18798071 19679175 20574665 21472432 22360776 23228649 24066054 24865686 25624478
59653 25624478 26343833 27029446 27691312 28342462 28995940 29662431 30350076 31064433 31807034
59644 31807034 32574484 33359586 34152074 34937121 35694394 36400558 37033035 37571795 38000585
59635 38000585 38309804 38498553 38572826 38542746 38423100 38234886 38002677 37749494 37495481 37260601
59625C7260601j95229j37604o6623J4556J04392K00809L01534M05871N13726O23216
59615C9025249P30925Q33796R28623J010013J070710J103700J102357J059028
59607D6864401R65750Q17355O13977L61942P4081k31435n34929q19054j069437
59598D7042651j273867j423899j517711j559930j558271j521096j457420j377014
59590C5353443j289602j204573j131514j079602j055246j059625j087444j127499
59582B6318338j165876j191163j198158j187114j160261j119670j067611j007276
59574A7221209r42456q76479q11247p47120o84270o24290n69526n20482m75128
59565A0970211m31573l90310l52869l19366k88687k60257k34280k10729j89345
$$ plain form
59625 37260601 37065372 36927768 36861145 36875701 36980093 37180902 37482436 37888307 38402033 39025249
59615 39025249 39756174 40589970 41518593 42528606 43599316 44703016 45805373 46864401
59607 46864401 47830151 48647506 49261483 49623425 49697506 49466071 48931142 48112088 47042651
59598 47042651 45768784 44344885 42827174 41267244 39708973 38187877 36730457 35353443
59590 35353443 34063841 32859268 31727754 30648152 29592906 28533281 27445837 26318338
59582 26318338 25152462 23961299 22763141 21576027 20415766 19296096 18228485 17221209
59574 17221209 16278753 15402274 14591027 13843907 13159637 12535347 11965821 11445339 10970211
59565 10970211 10538638 10148328 9795459 9476093 9187406 8927149 8692869 8482140 8292795
59556H292795j70239j53463j38494j25173j14652j08359j06369j07618j11156
59547G157272j16269j21996j27487j32472j36651j39301j40157j39739j38085
59538E965115j34238j27998j20829j13743j05601r5289q4331p5110o7193n7860
59528D982923m6108l3906k3255j4014n217L239J1030J8335K5422L1973L7387M1408
59516E029217M4300M6658M8884N0642N1349N1525N2769N5843N9847O4148O9878
59505E625060P8223Q8385R8857J09682J21678J34405J46936J60016J75149J91928
59495F930319K08669K25544K44540K65972K87475L07195L25721L43861L60589
59486I499885L74647L86451L96727M04237M06519M02317L92158L77062L57932
$$ plain form
59556 8292795 8122556 7969093 7830599 7705426 7590774 7482415 7376046 7268428 7157272
59547 7157272 7041003 6919007 6791520 6659048 6522397 6383096 6242939 6103200 5965115
59538 5965115 5830877 5702879 5582050 5468307 5362706 5267417 5183086 5107976 5040783 4982923
59528 4982923 4936815 4902909 4879654 4865640 4860423 4863662 4874692 4893027 4918449 4950422 4987809 5029217
59516 5029217 5073517 5120175 5169059 5219701 5271050 5322575 5375344 5431187 5491034 5555182 5625060
59505 5625060 5703283 5791668 5890525 6000207 6121885 6256290 6403226 6563242 6738391 6930319
59495 6930319 7138988 7364532 7609072 7875044 8162519 8469714 8795435 9139296 9499885
59486 9499885 9874532 10260983 10657710 11061947 11468466 11870783 12262941 12640003 12997935
59477A2997935L36011L12816K89283K65199K39511K11252J80594J49354J20300
59468A5102255R5852P7462O5836O1064O2564O9406Q0665R5081J10540J24328J33666
59457A6078719J35462J26238J03421O6934J8837l8474j03125j73149k45875l17963
59447A5651025l85596m45074m93942n31384n56950n69717n69630n58849n40217
59438A0999666n14887m83070m46826m10004l74804l40107l04070k67235k32076
59429G626587k00379j72064j46086j21545r7915p4821n1931k9110o585J5291L6488
59418F777930N7169P7084R5972J14720J35076J57303J79204J98645K16203K33928
59408H243234K52118K68837K82136K90947K93944K89435K76653K55677K25818
$$ plain form
59477 12997935 13333946 13646762 13936045 14201244 14440755 14652007 14832601 14981955 15102255
59468 15102255 15198107 15275569 15341405 15402469 15465033 15534439 15615104 15710185 15820725 15945053 16078719
59457 16078719 16214181 16340419 16443840 16510774 16529611 16491137 16388012 16214863 15968988 15651025
59447 15651025 15265429 14820355 14326413 13795029 13238079 12668362 12098732 11539883 10999666
59438 10999666 10484779 10001709 9554883 9144879 8770075 8429968 8125898 7858663 7626587
59429 7626587 7426208 7254144 7108058 6986513 6888598 6813777 6761846 6732736 6726151 6741442 6777930
59418 6777930 6835099 6912183 7008155 7122875 7257951 7415254 7594458 7793103 8009306 8243234
59408 8243234 8495352 8764189 9046325 9337272 9631216 9920651 10197304 10452981 10678799
59399A0678799J85729J35615P8087J6322m7300j10292j69419k22046k67344l05290
59389I972861l35225l56110l67695l70824l67054l58211l45774l30320l12032
59380F829616k91863k71399k51440k31609k11792j92898j75602j59204j42645
59371D901164j26141j10951r7745q5914p4362o2458n0332l8775k8888k1188j4860
59360D189550q299p89O714J3066J8893K5959L4421M2173M7994N3910O2338P1584
59348D557514P6795P5750P1394O8065O7604P0192P6309Q5768R6881J08911J23739
59337E478922J42522J62105J77609J87947J96314K05912K17971K33509K53851
59328G256662K78871L07079L37993L72379M09892M48739M88120N28742N70370
$$ plain form
59399 10678799 10864528 11000143 11078230 11094552 11047252 10936960 10767541 10545495 10278151 9972861
59389 9972861 9637636 9281526 8913831 8543007 8175953 7817742 7471968 7141648 6829616
59380 6829616 6537753 6266354 6014914 5783305 5571513 5378615 5203013 5043809 4901164
59371 4901164 4775023 4664072 4566327 4480413 4406051 4343593 4293261 4254486 4225598 4204410 4189550
59360 4189550 4181251 4180462 4187176 4200242 4219135 4245094 4279515 4321688 4369682 4423592 4485930 4557514
59348 4557514 4634309 4710059 4781453 4849518 4917122 4987314 5063623 5149391 5246272 5355183 5478922
59337 5478922 5621444 5783549 5961158 6149105 6345419 6551331 6769302 7002811 7256662
59328 7256662 7535533 7842612 8180605 8552984 8962876 9411615 9899735 10428477 10998847
59319A0998847O11137O49979O87343P22020P49130P63001P61073P44137P14036
59310A7400703O72515O21516N63529N01778M40066L81258L25722K72220K20521
59301B1399828J71720J25705P9988L1795j9880p4850j32887j93316k54221l12770
59291B0821112l65649m09218m40743m60232m70310m74111m74158m72951m72717
59282A6781023m74124m76694m80710m86697m92702m94449m89648m80254m69034
59273A2436711m55606m37714m15112l89991l64049l37108l08632k79249k50330
59264I198920k22836j96775j71545j46745j22720r9987p8363n7291l6860j7702
59254H048096J9J6488L1249M3488N3297O1288O7036O9427O8605O5689O0256N0227
$$ plain form
59319 10998847 11609984 12259963 12947306 13669326 14418456 15181457 15942530 16686667 17400703
59310 17400703 18073218 18694734 19258263 19760041 20200107 20581365 20907087 21179307 21399828
59301 21399828 21571548 21697253 21777241 21809036 21789156 21714306 21581419 21388103 21133882 20821112
59291 20821112 20455463 20046245 19605502 19145270 18674960 18200849 17726691 17253740 16781023
59282 16781023 16306899 15830205 15349495 14862798 14370096 13875647 13385999 12905745 12436711
59273 12436711 11981105 11543391 11128279 10738288 10374239 10037131 9728499 9449250 9198920
59264 9198920 8976084 8779309 8607764 8461019 8338299 8238312 8159949 8102658 8065798 8048096
59254 8048096 8048115 8064603 8095852 8139340 8192637 8253925 8320961 8390388 8458993 8524682 8584938 8635165
59242H635165L5156J7708O75j5735l2219m7591n9591o7584p2783p6105p7118p4917
59230H165061o9021n9527m6971l1973j4907L739K2850M1367N9452P7971R6866
59219H244907J15381J33673J52471J70829J86191J97150K04443K08570K08431
59210I822046K03218J93617J79919J60913J36258J08344Q0188N2818K6171J125
59200A0964617k1008l9792n5007o5810p2194p6042p9233q1992q4712q9902j00037
59189A0198888j14444j30372j46108j60676j71413j74913j70746j61879j50875
59180H817462j37483j20484j00092p7611n3900k8939k151K7184N9239R3105J27570
59169H603900J62404J98264K35374K73049L10375L46627L80836M11323M35537
$$ plain form
59242 8635165 8670321 8688029 8688704 8672969 8640750 8593159 8533568 8465984 8393201 8317096 8239978 8165061
59230 8165061 8096040 8036513 7989542 7957569 7942662 7946401 7969251 8010618 8070070 8148041 8244907
59219 8244907 8360288 8493961 8646432 8817261 9003452 9200602 9405045 9613615 9822046
59210 9822046 10025264 10218881 10398800 10559713 10695971 10804315 10884503 10937321 10963492 10964617
59200 10964617 10943609 10903817 10848810 10783000 10710806 10634764 10555531 10473539 10388827 10298925 10198888
59189 10198888 10084444 9954072 9807964 9647288 9475875 9300962 9130216 8968337 8817462
59180 8817462 8679979 8559495 8459403 8381792 8327892 8298953 8296802 8323986 8383225 8476330 8603900
59169 8603900 8766304 8964568 9199942 9472991 9783366 10129993 10510829 10922152 11357689
59160A1357689M50080M51501M37779M08780L64811L05476K30757J42791M5672
59151A4195336n6155j58470k56585l45248m19845m77718n18607n43808n54588
59142A0864312n51449n35534n10428m81156m51011m20390l89044l57948l28250
59133F839102k99864k72261k45635k20363j96343j73915j54227j37605j22562
59124E016327j07631r3175q0134o8073n5944m3970l3187k3621j4379n163L474
59113D494524J1215J8286K5005L1695L8520M4904N0026N4479O0040O6897P2798
59102D968389P6439Q0087Q6745R5875J04288J10518J15831J21056J25016J26556
59092F010800J26183J24760J21923J16541J07977R6378Q2336O6627N0063L3484
$$ plain form
59160 11357689 11807769 12259270 12697049 13105829 13470640 13776116 14006873 14149664 14195336
59151 14195336 14139181 13980711 13724126 13378878 12959033 12481315 11962708 11418900 10864312
59142 10864312 10312863 9777329 9266901 8785745 8334734 7914344 7525300 7167352 6839102
59133 6839102 6539238 6266977 6021342 5800979 5604636 5430721 5276494 5138889 5016327
59124 5016327 4908696 4815521 4735387 4667314 4611370 4567400 4534213 4510592 4496213 4491050 4494524
59113 4494524 4505739 4524025 4549030 4580725 4619245 4664149 4714175 4768654 4828694 4895591 4968389
59102 4968389 5044828 5124915 5211660 5307535 5411823 5522341 5638172 5759228 5884244 6010800
59092 6010800 6136983 6261743 6383666 6500207 6608184 6704562 6786898 6853525 6903588 6937072
59082F937072J7830L544j0125k4102l7413m7444n3023n5672n6746n5094m9418
59071F569409m1288l3378k5507j4907l67J6220L2517M8082O3639P9693R6375J13666
59059F904154J31272J48894J66418J83466J99373K14400K29913K46363K62131
59050H686384K75771K88147L00565L11824L19234L21752L19558L11071K93140
59041A1427446K64518K26695J80921J26738O4390l207p1951j38572k00572k55707
59031A1620699l02817l42151l74001l97743m12889m20402m22162m19421m12214
59022H116899m00104l83341l63494l42783l22695l03408k84600k66152k47984
59013E202338k30156k13379j98360j84344j70000j56082j45114j37313j29295
$$ plain form
59082 6937072 6954902 6958446 6948321 6924219 6886806 6839362 6786339 6730667 6673921 6618827 6569409
59071 6569409 6528121 6494743 6469236 6454329 6453962 6470182 6502699 6550781 6614420 6694113 6790488 6904154
59059 6904154 7035426 7184320 7350738 7534204 7733577 7947977 8177890 8424253 8686384
59050 8686384 8962155 9250302 9550867 9862691 10181925 10503677 10823235 11134306 11427446
59041 11427446 11691964 11918659 12099580 12226318 12290708 12287501 12215550 12076978 11876406 11620699
59031 11620699 11317882 10975731 10601730 10203987 9791098 9370696 8948534 8529113 8116899
59022 8116899 7716795 7333454 6969960 6627177 6304482 6001074 5716474 5450322 5202338
59013 5202338 4972182 4758803 4560443 4376099 4206099 4050017 3904903 3767590 3638295
59004C638295j18630j07413r8786r2064q4486p6202o9840o5846o2004n7428n3546
58993B752050n0791m7683m3875m1068l9919l8706l6079l2770k9663k6487k3307
58982B341702k0997j9203j6040j0928n758k146N60L456O235Q338J0239J2383J4451
58969B322292J6626J9983K4641K9001L1708L2693L1622K7487K0884J4509R820
58958B581266N098j582r155j5018j8029j8263j5508j0368n582l727l936l069J43
58945B482270L852N791N527L943K041M56r32k988o171r457j1335j1625j1428j1419
58931B438525j1178j0115q104n093j038L523P444J0064J1893J3829J5936J7483
58919B483169J8305J9575K2612K6957L0513L1994L2560L4267L7348M0102M1264
$$ plain form
59004 3638295 3519665 3412252 3313466 3221402 3136916 3060714 2990874 2925028 2863024 2805596 2752050
58993 2752050 2701259 2653576 2609701 2568633 2528714 2490008 2453929 2421159 2391496 2365009 2341702
58982 2341702 2320705 2301502 2285462 2274534 2268776 2266630 2267190 2270646 2276881 2285219 2295458 2307841 2322292
58969 2322292 2338918 2358901 2383542 2412543 2444251 2476944 2508566 2536053 2556937 2571446 2581266
58958 2581266 2586364 2584782 2575627 2560609 2542580 2524317 2508809 2498441 2492859 2489132 2485196 2482127 2482270
58945 2482270 2486122 2491913 2497440 2501383 2503424 2503880 2502948 2499960 2493789 2484332 2472997 2461372 2449944 2438525
58931 2438525 2427347 2417232 2409128 2404035 2402997 2406520 2413964 2424028 2435921 2449750 2465686 2483169
58919 2483169 2501474 2521049 2543661 2570618 2601131 2633125 2665685 2699952 2737300 2777402 2818666
58908B818666M1638M3150M6821N1723N5597N6789N5964N5497N6802N9001O0768
58897C402416O2452O5177O8798P2218P5191P8358Q1954Q6039R1430R8743J06750
58886D289526J13537J19190J25714J34273J44207J54730J65847J77432J89051
58877E613507K00940K13714K27100K40515K54672K70788K88342L05691L22981
58868G938250L42214L64240L88092M13873M43596M78074N15151N52482N90263
58859A2026235O29814O71044P12701P53889P94054Q32403Q68053Q99557R23522
58850A9111272R34961R29670R05164Q59027P88293O91628N70723M28784K69304
58841B5488826R7355p9436k52501m14229n58127o79270p75928q49455r01467r32228
$$ plain form
58908 2818666 2860304 2903454 2950275 3001998 3057595 3114384 3170348 3225845 3282647 3341648 3402416
58897 3402416 3464868 3530045 3598843 3671061 3746252 3824610 3906564 3992603 4084033 4182776 4289526
58886 4289526 4403063 4522253 4647967 4782240 4926447 5081177 5247024 5424456 5613507
58877 5613507 5814447 6028161 6255261 6495776 6750448 7021236 7309578 7615269 7938250
58868 7938250 8280464 8644704 9032796 9446669 9890265 10368339 10883490 11435972 12026235
58859 12026235 12656049 13327093 14039794 14793683 15587737 16420140 17288193 18187750 19111272
58850 19111272 20046233 20975903 21881067 22740094 23528387 24220015 24790738 25219522 25488826
58841 25488826 25586181 25506745 25254244 24840015 24281888 23602618 22826690 21977235 21075768 20143540
58831B0143540r42417r34926r13813q82644q44426q01551p55042p05441o55224
58822A2708056o08354n66403n27133m88278m50825m17063l87269l60304l35850
58813H566577l14088k94152k74839k55977k37700k19433k01099j84164j69747
58804F415378j56736j43494j30541j19638j10872j02450r3095q3088p3120o3428
58794E338916n3971m4380l3949k2382j0478N61J0155J8586K6868L6463M7951N9901
58782E374241P0357P9695R0309J03193J16823J30035J43667J58178J72082J84494
58772F623074J97309K12758K30269K47786K64864K82620L01756L22541L45593
58763I028570L70890L97003M23035M50449M81304N15645N52246N90731O31169
$$ plain form
58831 20143540 19201123 18266197 17352384 16469740 15625314 14823763 14068721 13363280 12708056
58822 12708056 12099702 11533299 11006166 10517888 10067063 9650000 9262731 8902427 8566577
58813 8566577 8252489 7958337 7683498 7427521 7189821 6970388 6769289 6585125 6415378
58804 6415378 6258642 6115148 5984607 5864969 5754097 5651647 5558552 5475464 5402344 5338916
58794 5338916 5284945 5240565 5206616 5184234 5173756 5174317 5184472 5203058 5229926 5266389 5314340 5374241
58782 5374241 5444598 5524293 5614602 5717795 5834618 5964653 6108320 6266498 6438580 6623074
58772 6623074 6820383 7033141 7263410 7511196 7776060 8058680 8360436 8682977 9028570
58763 9028570 9399460 9796463 10219498 10669947 11151251 11666896 12219142 12809873 13441042
58754A3441042O72620P13911P54734P94086Q28631Q54641Q70572Q75576Q66319
58745B0672132Q37738P86600P12243O14337M92488L48552J87677J6835j56429
58736B4512173l24175m78900o14967p28776q18172q82748r24158r44883r47094
58727A7848300r33498r08146q74915q35897p92515p47077p01662o56487o11465
58718A0786638n68492n29987m95553m62343m28836l96449l67336l42272l20852
58709F874518l02158k84809k67627k50706k35026k20888k07428j93547j78826
58700D733503j63849j50104j38876j29626j20296j09873r9589r0767q2831p4598
58690C573094o6270n8674n1595m4423l7635l2086k7554k3304j9365j6110j3441
$$ plain form
58754 13441042 14113662 14827573 15582307 16376393 17205024 18059665 18930237 19805813 20672132
58745 20672132 21509870 22296470 23008713 23623050 24115538 24464090 24651767 24668602 24512173
58736 24512173 24187998 23709098 23094131 22365355 21547183 20664435 19740277 18795394 17848300
58727 17848300 16914802 16006656 15131741 14295844 13503329 12756252 12054590 11398103 10786638
58718 10786638 10218146 9688159 9192606 8730263 8301427 7904978 7537642 7195370 6874518
58709 6874518 6572360 6287551 6019924 5769218 5534192 5313304 5105876 4912329 4733503
58700 4733503 4569654 4419550 4280674 4151048 4030752 3920879 3821290 3730523 3647692 3573094
58690 3573094 3506824 3448150 3396555 3352132 3314497 3282411 3254857 3231553 3212188 3196078 3182637
58679C182637j1541j1429j3568j7010k0986k5971l2026l7676m1956m5820m9770
58668B874884n2071n1495m9998n0166n1454n1773n1353n1931n3142n3000n1446
58657B307055n0448n0662n0720m9728m7974m5389m1747l8135l5951l4666l2855
58646A828780l0805k9607k8406k5667k2677k2416k4784k6330k5229k3431k2907
58635A546521k2847k1811k0227j9187j8669j8128j7338j5747j2585q381n026l603
58623A362972l371l174k635j848j191j444k739l688l028j628j034o94J124M104
58609A341726O128O617O901P313O698N304N233P176R097R141P704N795L508J146
58595A429487j68n6N56J177K397M270N961P551J0305J4343J7925J9936K1414K3883
$$ plain form
58679 3182637 3171096 3159667 3146099 3129089 3108103 3082132 3050106 3012430 2970474 2924654 2874884
58668 2874884 2822813 2771318 2721320 2671154 2619700 2567927 2516574 2464643 2411501 2358501 2307055
58657 2307055 2256607 2205945 2155225 2105497 2057523 2012134 1970387 1932252 1896301 1861635 1828780
58646 1828780 1797975 1768368 1739962 1714295 1691618 1669202 1644418 1618088 1592859 1569428 1546521
58635 1546521 1523674 1501863 1481636 1462449 1443780 1425652 1408314 1392567 1379982 1371601 1366575 1362972
58623 1362972 1359601 1356427 1353792 1351944 1350753 1349309 1346570 1342882 1339854 1338226 1337192 1336498 1337622 1341726
58609 1341726 1347854 1354471 1361372 1368685 1375383 1380687 1385920 1393096 1402193 1411334 1419038 1424833 1428341 1429487
58595 1429487 1429319 1429263 1429819 1430996 1433393 1437663 1443624 1451175 1461480 1475823 1493748 1513684 1535098 1558981
58581A558981K7688L2432L7414M1209M2697M3112M5198M9788N5048N9576O4128
58570B057271O9513P5049Q0233Q6125R3814J02863J12304J21966J32064J42802
58560C074004J54921J69204J85026K00744K15843K31059K46179K59563K70072
58551E006615K77382K79942K74849K60495K37273K04946J61887J08317M8380j2503
58541F847583p0849j24659j71561k09075k35879k51930k58343k57613k52717k45222
58531D769735k35314k23582k11144j97888j82723j66101j50201j36015j22391
58522C144376j08583r5660q4369p3887o3837n5350m8891m2986l6600l0835k6735
58511B476643k3188j8829j4469j1804j0800j0100r186q655q978j0224j2575j6142
$$ plain form
58581 1558981 1586669 1619101 1656515 1697724 1740421 1783533 1828731 1878519 1933567 1993143 2057271
58570 2057271 2126784 2201833 2282066 2368191 2462005 2564868 2677172 2799138 2931202 3074004
58560 3074004 3228925 3398129 3583155 3783899 3999742 4230801 4476980 4736543 5006615
58551 5006615 5283997 5563939 5838788 6099283 6336556 6541502 6703389 6811706 6860086 6847583
58541 6847583 6776734 6652075 6480514 6271439 6035560 5783630 5525287 5267674 5014957 4769735
58531 4769735 4534421 4310839 4099695 3901807 3719084 3552983 3402782 3266767 3144376
58522 3144376 3035793 2940133 2855764 2781877 2718040 2662690 2613799 2570813 2534213 2503378 2476643
58511 2476643 2453455 2434626 2420157 2408353 2397553 2387453 2378267 2369612 2360634 2350410 2337835 2321693
58499B321693k0765k6441l3275m0559m6767n0896n2973n3144n1301m7886m3962
58488A853724m0297l7257l5321l4480l3641l2095l0992l1491l2206l0977k8523
58477A486444k7458k7835k7057k4531k2819k3212k3553k1916j9392j7517j5815
58466A235339j3754j2518j2660j2310r964p183o317p155p858p730p205o259m768
58453A119658l418k872k788k759l064l548l083j113J399L424M979O231O980P612
58439A127638R025J0985J2234J2700J3779J6005J8413K0625K3357K6222K7405
58428A318388K6291K4273K2281J9712J6359J2875Q877L150l684r506j4095j9029
58416A405892k3795k5720k4700k3985k4913k4977k2942k1616k2930k4220k2509
$$ plain form
58499 2321693 2300928 2274487 2241212 2200653 2153886 2102990 2050017 1996873 1945572 1897686 1853724
58488 1853724 1813427 1776170 1740849 1706369 1672728 1640633 1609641 1578150 1545944 1514967 1486444
58477 1486444 1458986 1431151 1404094 1379563 1356744 1333532 1309979 1288063 1268671 1251154 1235339
58466 1235339 1221585 1209067 1196407 1184097 1174133 1166950 1160633 1153478 1145620 1137890 1130685 1124426 1119658
58453 1119658 1116240 1113368 1110580 1107821 1104757 1101209 1098126 1097013 1098412 1101836 1106815 1113046 1120026 1127638
58439 1127638 1136663 1147648 1159882 1172582 1186361 1202366 1220779 1241404 1264761 1290983 1318388
58428 1318388 1344679 1368952 1391233 1410945 1427304 1440179 1449056 1452206 1448522 1439016 1424921 1405892
58416 1405892 1382097 1356377 1331677 1307692 1282779 1257802 1234860 1213244 1190314 1166094 1143585
58405A143585j9123j6877j5689j4181j2829j2276j0959p524l503p53J360L640
58393A034871M560L141J772K863M992N575N164N741O892P148P281Q849J1046J2314
58379A122209J3376J5518J7692J8528J9398K1864K3746K1659J6239J1136P686
58368A309051M267K94k682l827m129m755o382r366j2528j3117j0218o711n396
58355A234501n021l021k66N43j53P15L941P233R166J0732J2781J4517J4745J2829
58341A313242Q652L263j142l490n090p251r204j0038j0828j2660j4380j4622j4261
58328A222191j4512j4386j2651j0582j0161j1049j1691j1750j1104q393l183K221
58316A104950N628P813J0198J2002J2222J2131J3069J4006J3936J4140J5395J5793
$$ plain form
58405 1143585 1124462 1107585 1091896 1077715 1064886 1052610 1041651 1034127 1030624 1029871 1031231 1034871
58393 1034871 1039431 1042572 1044344 1047207 1052199 1057774 1062938 1068679 1075571 1082719 1090000 1098849 1109895 1122209
58379 1122209 1135585 1151103 1168795 1187323 1206721 1228585 1252331 1273990 1290229 1301365 1309051
58368 1309051 1313318 1313612 1310930 1307103 1302974 1298219 1291837 1282471 1269943 1256826 1246608 1239897 1234501
58355 1234501 1229480 1226459 1226193 1226736 1226583 1227298 1231239 1238472 1247638 1258370 1271151 1285668 1300413 1313242
58341 1313242 1321894 1325157 1324015 1320525 1315435 1308184 1298980 1288942 1278114 1265454 1251074 1236452 1222191
58328 1222191 1207679 1193293 1180642 1170060 1159899 1148850 1137159 1125409 1114305 1105912 1102729 1104950
58316 1104950 1110578 1118391 1128589 1140591 1152813 1164944 1178013 1192019 1205955 1220095 1235490 1251283
58304A251283J4366J3744J5831J8047J7678J6716J8067K0084J9571J7582J7332
58293A440301J8685J9555K0444K2611K3881K1454J6985J3870J1412O913J598j017
58281A616692j202k025l632l781k691k064o47L646Q606J0314R828J1480J5411
58268A659935J7616J6952J6355J7260J8273J9233K1471K4093K4873K4540K5633
58257A886234K7805K8961K9842L2444L5076L4358L1140K9012K8086K5746K2393
58246B211097K0688K0194J8606J7119J8526K1338K2084K2144K5438L0560L2469
58235B460263L1310L2127L5989L8860L9490M1156M4894M7893M9339N1451N4299
58224B927071N5806N7029O1119O7190P1500P4296P8926Q4988Q9252R2488R7991
$$ plain form
58304 1251283 1265649 1279393 1295224 1313271 1330949 1347665 1365732 1385816 1405387 1422969 1440301
58293 1440301 1458986 1478541 1498985 1521596 1545477 1566931 1583916 1597786 1609198 1616111 1617709 1616692
58281 1616692 1615490 1613465 1609833 1606052 1603361 1601297 1600650 1604296 1612902 1623216 1633044 1644524 1659935
58268 1659935 1677551 1694503 1710858 1728118 1746391 1765624 1787095 1811188 1836061 1860601 1886234
58257 1886234 1914039 1943000 1972842 2005286 2040362 2074720 2105860 2134872 2162958 2188704 2211097
58246 2211097 2231785 2251979 2270585 2287704 2306230 2327568 2349652 2371796 2397234 2427794 2460263
58235 2460263 2491573 2523700 2559689 2598549 2638039 2679195 2724089 2771982 2821321 2872772 2927071
58224 2927071 2982877 3039906 3101025 3168215 3239715 3314011 3392937 3477925 3567177 3659665 3757656
58213C757656J04297J07167J07823J10951J15363J15369J11063J08200J08115
58204D746004J07009J05276J07950J15212J21895J27217J35768J48117J59726
58195E874174J69923J82513J96975K08489K17311K28430K41832K53005K63038
58186G835690K77413K94951L09334L21548L38785L60807L80272L97221M19826
58177A0935847M49600M79484N08433N44116N88958O37190O87428P44110Q04636
58168A6379802Q59832R09243R61404J017606J070994J122774J182456J250859
58160B4754970J320376J392980J478766J575887J672434J769319J879515K004048
58152C7848295K133037K271585K437996K634544K848927L087462L376282L727428
$$ plain form
58213 3757656 3861953 3969120 4076943 4187894 4303257 4418626 4529689 4637889 4746004
58204 4746004 4853013 4958289 5066239 5181451 5303346 5430563 5566331 5714448 5874174
58195 5874174 6044097 6226610 6423585 6632074 6849385 7077815 7319647 7572652 7835690
58186 7835690 8113103 8408054 8717388 9038936 9377721 9738528 10118800 10516021 10935847
58177 10935847 11385447 11864931 12373364 12917480 13506438 14143628 14831056 15575166 16379802
58168 16379802 17239634 18148877 19110281 20127887 21198881 22321655 23504111 24754970
58160 24754970 26075346 27468326 28947092 30522979 32195413 33964732 35844247 37848295
58152 37848295 39981332 42252917 44690913 47325457 50174384 53261846 56638128 60365556
58144F0365556M137870M624221N218366N922655O711267P582162Q561971R654757
58136A12778825J0840407J2131093J3569515J5173757J6977141J9144639K1944707
58129B22560084K5552517K9934521L4825176L9447829M2048150M0109877L1811774
58122D66289928J7736251J057474j4213612k5377807l1857996l4537353l4719686
58115C44377199l3517450l1656874k9475978k7067209k4484408k1833022j9219591
58108A57122667j6717134j4401262j2352981j0602257r115969p854575o799358
58101G9279131n921030n171608m521579l968383l500968l090913k721994k392745
58093D7989911k087403j779732j467531j168641q82204n88220k83130K1486L32686
$$ plain form
58144 60365556 64503426 69127647 74346013 80268668 86979935 94562097 103124068 112778825
58136 112778825 123619232 135750325 149319840 164493597 181470738 200615377 222560084
58129 222560084 248112601 278047122 312872298 352320127 394368277 434478154 466289928
58122 466289928 484026179 485083653 470870041 445492234 413634238 379096885 344377199
58115 344377199 310859749 279202875 249726897 222659688 198175280 176342258 157122667
58108 157122667 140405533 126004271 113651290 103049033 93933064 86078489 79279131
58101 79279131 73358101 68186493 63664914 59696531 56195563 53104650 50382656 47989911
58093 47989911 45902508 44122776 42655245 41486604 40604400 40016180 39733050 39754536 40087222
58084D0087222O69037J023136J375137J744813K191861K772696L533511M492889
58076E7890302N503268O109154N700477L974455J269335j611847l919752n324730
58068F9590662n900019n903807n602806n191067m764404m342135l920878l507458
58060C0458088l111403k735154k383518k067668j792702j553271j345277j170382
58052A4298713j026678r06433q05368p24174o59976o06013n59958n23067m91478
58043G995568m57919m21530l86897l54182l19562k84537k55115k31972k10419
58034E073435j90241j76840j72009j71290j70983j70849j69798j65574j58978
58025C526873j52641j46156j37761j29362j24098j20493j14931j08043j02630
$$ plain form
58084 40087222 40756259 41779395 43154532 44899345 47091206 49863902 53397413 57890302
58076 57890302 63393570 69502724 75203201 79177656 80446991 78835144 74915392 69590662
58068 69590662 63690643 57786836 52184030 46992963 42228559 37886424 33965546 30458088
58060 30458088 27346685 24611531 22228013 20160345 18367643 16814372 15469095 14298713
58052 14298713 13272035 12365602 11560234 10836060 10176084 9570071 9010113 8487046 7995568
58043 7995568 7537649 7116119 6729222 6375040 6055478 5770941 5515826 5283854 5073435
58034 5073435 4883194 4706354 4534345 4363055 4192072 4021223 3851425 3685851 3526873
58025 3526873 3374232 3228076 3090315 2960953 2836855 2716362 2601431 2493388 2390758
58016B390758r7509q9944q2107p8145p6501p2236o5648o1430o0081n7355n1897
58005A597905m6645m2714l8186l3232l0398k9598k8180k5921k4853k4526k2742
57994A250910k0421k0302k1376k0244j7436j6687j8079j7921j5486j4040j4561
57983A054357j4273j2283j1227j1993j1877r455o962o242o233n609m494k811k89
57970I50609J567R52p94p93N17J67j888k545r67L28L67J201L541N245N374N785
57954I68666P274P923O779N665N896O271N781N325N439N156M370M649O482Q323
57940A053999R273J0285J1605J1696R713O824M098J226j898m604p075j0462j4740
57927A079940j8555k1428k3905k5411k4644k2449k1488k2341k2549k0297j6534
$$ plain form
58016 2390758 2293249 2203305 2121198 2043053 1966552 1894316 1828668 1767238 1707157 1649802 1597905
58005 1597905 1551260 1508546 1470360 1437128 1406730 1377132 1348952 1323031 1298178 1273652 1250910
57994 1250910 1230489 1210187 1188811 1168567 1151131 1134444 1116365 1098444 1082958 1068918 1054357
57983 1054357 1040084 1027801 1016574 1004581 992704 983249 976287 970045 963812 958203 953709 950898 950609
57970 950609 952176 953128 952334 951541 952058 952225 950337 947792 946825 947153 947520 948721 952262 957507 962881 968666
57954 968666 975940 983863 990642 996307 1002203 1008474 1014255 1019580 1025019 1030175 1034545 1039194 1045676 1053999
57940 1053999 1063272 1073557 1085162 1096858 1106571 1113395 1117493 1118719 1116821 1112217 1105142 1094680 1079940
57927 1079940 1061385 1039957 1016052 990641 965997 943548 922060 899719 877170 856873 840339
57916H40339j2714q957n465l263k314j014J309L298L868L849M377N262N835O102
57902H40512O352O825P943R678J0790J0095Q222O566M975K311j254m563p500j0391
57888H90561j2125j1499r949r934j0906r914o221k189N49K628M412N164N278O226
57874H42081P533O837L676J93k650o365j1563j6423j9695k2198k4176k4342k2774
57861G10134k1680k1803k1198j9105j7724j8178j7996j5089j1343r513q933p134
57849E20438l777k48K987O022P915P811O494M900K614k84j659l8K633L476K746
57834E62030K755L805M015K810J889K438L449L364J983L82k73J75M68r35l861
57819E84494o323p015o858p331q406r068q827p731n923m138l523l980l771j796
$$ plain form
57916 840339 827625 818668 813203 809940 807626 806612 807921 811219 815087 818936 823313 828575 834410 840512
57902 840512 846864 853689 861632 871310 882100 892195 900417 906983 911958 914269 913015 908452 900952 890561
57888 890561 878436 866937 856988 847054 836148 826234 820013 817824 818373 821001 825413 830577 835855 842081
57874 842081 849614 856451 860127 860320 857670 851305 839742 823319 803624 781426 757250 732908 710134
57861 710134 688454 666651 645453 626348 608624 590446 572450 557361 546018 536505 527572 520438
57849 520438 516661 516413 519400 525422 533337 541148 547642 552542 555156 554872 553213 553175 555808 559284 562030
57834 562030 564785 568590 572605 575415 577304 579742 583191 586555 588538 588920 588647 588822 589290 588355 584494
57819 584494 578171 571156 564298 556967 548561 539493 530666 522935 517012 512874 509351 505371 501600 499804
57805D99804Q75K699L564M005L927L540M078O066P994Q322P725P712Q015P226
57791E75552N341L819L404L399K974J952N00j030k257l402n226p691r538r964
57777E57833r752r829r737q721p378o954p536p973p200m996k221p52j982m759
57763D68043o216n379m328m757n435m690l560m098n884o683n876m985n116n899
57749C95137o793p612p843p023n782n112m798l811k018k25J186K344K917K422
57735C52989J443J339K692M833O670P353O741O074P336J0916J4606J6151J6082
57722D55225J6795J9421K2801K5006K4640K1309J6100J1134P462L988m19m786
57710F18676p439q693j0340j2956j5303j6129j5241j3216j1222j0521j0891j0441
$$ plain form
57805 499804 500679 503378 506942 510947 514874 518414 522492 528558 536552 544874 552599 560311 568326 575552
57791 575552 580893 584712 588116 591515 594489 596441 596941 595911 593654 590252 585026 577335 567797 557833
57777 557833 548081 538252 528515 519794 512416 505462 497926 489953 482753 477757 475536 474784 472802 468043
57763 468043 461827 456448 452120 447363 441928 437238 433678 429580 423696 417013 411137 406152 401036 395137
57749 395137 388344 380732 372889 365866 360084 354972 350174 346363 344345 344120 345306 347650 350567 352989
57735 352989 354432 355771 358463 363296 369966 377319 384060 390134 397470 408386 422992 439143 455225
57722 455225 472020 491441 514242 539248 563888 585197 601297 612431 619893 623881 623462 618676
57710 618676 611237 602544 592204 579248 563945 547816 532575 519359 508137 497616 486725 476284
57698D76284q256o162o080o784n503k003J379L315M529N277M495K078j41n97L48
57683D62179J503K245K372K002K006L238N027N691M833L889M126N397P082Q907
57669E20497J0442J1021J0701J0378J0712J1724J3361J5555J7645J8843J9332
57658F70211K0024K1361K3228K5604K8211L0022L0427L0423L1233L2303L2445
57647I75492L2485L4565L8810M2896M5475M7901N1718N6357O0465O4229O9071
57636A519464P5783Q3690R1207R6877J00591J04132J09790J18272J28567J39749
57626B568122J51999J65853J81240J97348K12862K26572K38415K49180K58157
57617D449748K61873K56535K41141K16807J84118J43547R8265N3851J4564j8333
$$ plain form
57698 476284 468028 461866 455786 449002 443499 441496 442875 446190 450719 455996 460491 462569 462428 461831 462179
57683 462179 463682 465927 468299 470301 472307 475545 480572 486263 491096 494985 499111 504508 511590 520497
57669 520497 530939 541960 552661 563039 573751 585475 598836 614391 632036 650879 670211
57658 670211 690235 711596 734824 760428 788639 818661 849088 879511 910744 943047 975492
57647 975492 1007977 1042542 1081352 1124248 1169723 1217624 1269342 1325699 1386164 1450393 1519464
57636 1519464 1595247 1678937 1770144 1867021 1967612 2071744 2181534 2299806 2428373 2568122
57626 2568122 2720121 2885974 3067214 3264562 3477424 3703996 3942411 4191591 4449748
57617 4449748 4711621 4968156 5209297 5426104 5610222 5753769 5852034 5905885 5920449 5902116
57607E902116m4193o1302o9293p2393p8986r7344j30431j73239k15050k45670
57597D714215k60519k60540k49278k31334k11609j92910j74462j54672j34707
57588B844184j17195j02394q8478p5079o3435n3103m1867k9482j8410r955k507
57577B242279N454J3357K0626K8263L7031M6283N5736O6191P7590Q8583R8968
57566B780361J10225J22644J34493J45158J56313J68467J79085J85905J89586
57557D172237J90937J87816J77025J57405J29084R1883M7014j245m8104r1523
57547E012529j31068j65012j90960k08369k18463k22283k20495k14284k04941
57538C236654j93341j80803j69116j58610j47807j36178j25350j16117j06564
$$ plain form
57607 5902116 5857923 5796621 5727328 5654935 5575949 5478605 5348174 5174935 4959885 4714215
57597 4714215 4453696 4193156 3943878 3712544 3500935 3308025 3133563 2978891 2844184
57588 2844184 2726989 2624595 2536117 2461038 2397603 2344500 2302633 2273151 2254741 2244786 2242279
57577 2242279 2247733 2261090 2281716 2309979 2347010 2393293 2449029 2515220 2592810 2681393 2780361
57566 2780361 2890586 3013230 3147723 3292881 3449194 3617661 3796746 3982651 4172237
57557 4172237 4363174 4550990 4728015 4885420 5014504 5106387 5153401 5152156 5104052 5012529
57547 5012529 4881461 4716449 4525489 4317120 4098657 3876374 3655879 3441595 3236654
57538 3236654 3043313 2862510 2693394 2534784 2386977 2250799 2125449 2009332 1902768
57529A902768r5323q4701p7817p4080p0169o4528n8296n2663m7795m3842m0828
57518A192726l7856l4293l1175k9614k8587k6237k2627j9310j6895j4927j3387
57507I17818j2286j0535p291l812j929j257j3J978L407M211N883Q949J2202J4641
57493I31966J6513J8352K0343K2623K4921K6309K6581K7303L0027L4003L7368
57482A216309L9870M2701M6211M9849N3909N9282O5581P1484P6935Q3203R0751
57471A896085R8770J06788J15038J23122J30057J35744J40934J45451J47829J46723
57461C186541J41271J30191J12088Q7084N7008K3799j1171m6158p8638j06212
57451C495803j27407j41836j50280j54232j54607j51266j44391j35420j25816
$$ plain form
57529 1902768 1807445 1722744 1644927 1570847 1500678 1436150 1377854 1325191 1277396 1233554 1192726
57518 1192726 1154870 1120577 1089402 1059788 1031201 1004964 982337 963027 946132 931205 917818
57507 917818 905532 894997 887706 883894 881965 880708 880695 882673 886080 890291 896174 905123 917325 931966
57493 931966 948479 966831 987174 1009797 1034718 1061027 1087608 1114911 1144938 1178941 1216309
57482 1216309 1256179 1298880 1345091 1394940 1448849 1508131 1573712 1645196 1722131 1805334 1896085
57471 1896085 1994855 2101643 2216681 2339803 2469860 2605604 2746538 2891989 3039818 3186541
57461 3186541 3327812 3458003 3570091 3657175 3714183 3737982 3726811 3680653 3602015 3495803
57451 3495803 3368396 3226560 3076280 2922048 2767441 2616175 2471784 2336364 2210548
57442B210548j15791j05285r5158q6149p7573o8478n9237n0756m2982l5737k9962
57431A443440k6491k4225k1126j6409j0570m202J776N856P725R440J3179J8617
57419A397010K4034K8879L3600L8239M2991M8908N6063O2497O7217P2678Q1605
57408A953721R2754J02709J10723J18553J26322J32007J34593J34312J29789J18152
57398C153635R8432P2222M1026N810l0803o4964r4783j20552j41647j56118j63763
57387B598495j66737j66422j62260j54453j45228j36339j27395j17724j07981
57378A313956r9068r0983q3378p6048o8708o1525n5674n1819m8670m4816m1171
57367E92096l9384l8676l6892l3980l1487k9248k5869k2209k0815k1575k1427
$$ plain form
57442 2210548 2094757 1989472 1894314 1808165 1730592 1662114 1602877 1552121 1509139 1473402 1443440
57431 1443440 1416949 1392724 1371598 1355189 1344619 1340417 1342193 1348049 1355774 1365214 1378393 1397010
57419 1397010 1421044 1449923 1483523 1521762 1564753 1613661 1669724 1732221 1799438 1872116 1953721
57408 1953721 2046475 2149184 2259907 2378460 2504782 2636789 2771382 2905694 3035483 3153635
57398 3153635 3252067 3324289 3365315 3371125 3340322 3275358 3180575 3060023 2918376 2762258 2598495
57387 2598495 2431758 2265336 2103076 1948623 1803395 1667056 1539661 1421937 1313956
57378 1313956 1214888 1123905 1040527 964479 895771 834246 778572 726753 678083 633267 592096
57367 592096 552712 514036 477144 443164 411677 382429 356560 334351 313536 291961 270534
57356B70534j9019j6380j5219j4654j3593j2453j1521j0228q959r012j0080j0234
57344A19182r063q189q125p429n590l891k780j319M1n74k792l552j656L06J4j441
57328F3142k062j933k084k678l692n333o776o670n566n366n871m877k357j165
57314F712k522Dd412m410n186n508m765m592n730o239m922l575l745m225m023
57299f1332m725p387r738r256o849n003m220l495k431r42J212K996K421j40j544
57284a10433m09P40k28j705j570p99j088j560q94l31j521l197l056j368r3K23
57268a27289K90J71k66k21Q53K184L152M187N156N002M131M542O342P071O040
57253g8655N949Q273J0449J0146Q965R125R683f898A958J0137J1252J0283Q675
$$ plain form
57356 270534 251515 235135 219916 205262 191669 179216 167695 157467 148508 139496 129416 119182
57344 119182 110119 101930 93805 86376 80786 76895 74115 72796 72837 72263 69471 65919 64263 64569 64583 63142
57328 63142 61080 59147 57063 54385 50693 45360 38584 31914 26348 20982 15111 10234 7877 6712
57314 6712 4190 4 -4412 -8822 -14008 -19516 -24281 -28873 -34603 -40842 -45764 -49339 -53084 -57309 -61332
57299 -61332 -66057 -73444 -83182 -92438 -99287 -104290 -108510 -112005 -114436 -115378 -114166 -111170 -108749 -108889 -110433
57284 -110433 -110842 -110102 -110330 -112035 -113605 -114404 -115492 -117052 -117946 -118277 -119798 -122995 -126051 -127419 -127512 -127289
57268 -127289 -126999 -126828 -127094 -127315 -126462 -124278 -121126 -116939 -111783 -106781 -102650 -98108 -91766 -84695 -78655
57253 -78655 -72706 -64433 -53984 -43838 -34873 -25748 -16065 -6898 1958 12095 23347 33630 42305
57240D2305Q468Q516P125O022P825J1430J3780J4615J5888J7865J9318K0414K2244
57227B15815K4532K6615K9395L3674L7994M0627M2095M3350M3421M1437L8758
57216F17713L6459L3020K7356K1595J7597J3216N579m158j2943k0515k8127l4666
57204F72126l8181l9675m1386m2611m1039l7060l3039k9353k4592j8921j3976
57193C12293j0201o995m553l244k427j976l091n617o988o037m964n074l907K08
57179B47427M341N326M650N155O151O065O569R461J2401J2540J1505J2113J3122
57166C56826J2265J1490J3752J7300J8732J9385K2867K8478L2761L5672L9536
57155F09064M3709M5904M7088M9636N2517N3685N4932N8745O2754O3536O3526
$$ plain form
57240 42305 50773 59289 66414 72436 80261 91691 105471 120086 135974 153839 173157 193571 215815
57227 215815 240347 266962 296357 330031 368025 408652 450747 494097 537518 578955 617713
57216 617713 654172 687192 714548 736143 753740 766956 772535 768377 755434 734919 706792 672126
57204 672126 633945 594270 552884 510273 469234 432174 399135 369782 345190 326269 312293
57193 312293 302092 295097 290544 287300 284873 282897 279806 274189 267201 261164 256200 251126 247219 247427
57179 247427 251768 257094 261744 266899 273050 279115 285684 295145 307546 320086 331591 343704 356826
57166 356826 369091 380581 394333 411633 430365 449750 472617 501095 533856 569528 609064
57155 609064 652773 698677 745765 795401 847918 901603 956535 1015280 1078034 1141570 1205096
57144A205096O7473P4040P7911P8619Q0179Q3157Q4300Q3457Q3996Q6561Q8537
57133B093326Q9237Q9730Q8665Q4321P9590P8604P9773P8618P5810P5472P7075
57122B990221P6545P4176P3770P4872P3509P0030O8423O8529O6616O3123O1851
57111C761665O2043N9205N3716N0513N0419M9765M8485N0441N5594N9715O1899
57100D363460O4678O7226O6489O4340O5300O7807O6502O2105N9898N9343N4996
57089E062144M6985M0455L5119K5789J3018K404o599k0239l8734n6024p1402r0101
57077D942815j12215j32446j50937j72552j95538k13114k26207k41875k59815
57068C238116k74003k86958l07437l34477l59587l84872m22033C96028a31185
$$ plain form
57144 1205096 1272569 1346609 1424520 1503139 1583318 1666475 1750775 1834232 1918228 2004789 2093326
57133 2093326 2182563 2272293 2360958 2445279 2524869 2603473 2683246 2761864 2837674 2913146 2990221
57122 2990221 3066766 3140942 3214712 3289584 3363093 3433123 3501546 3570075 3636691 3699814 3761665
57111 3761665 3823708 3882913 3936629 3987142 4037561 4087326 4135811 4186252 4241846 4301561 4363460
57100 4363460 4428138 4495364 4561853 4626193 4691493 4759300 4825802 4887907 4947805 5007148 5062144
57089 5062144 5109129 5149584 5184703 5210492 5223510 5225914 5219315 5199076 5160342 5104318 5032916 4942815
57077 4942815 4830600 4698154 4547217 4374665 4179127 3966013 3739806 3497931 3238116
57068 3238116 2964113 2677155 2369718 2035241 1675654 1290782 868749 396028 -131185
57058g14759o49640p24888p99787q75617r64884j069566j179541j295018j428219
57049i701919j579928j738076j903248k090450k301393k521961k752159l010258
57041b7599392l302380l620312l977637m415596m964993n635484o446625p427151
57033f7389570q573958r852311j1235902j2691340j4132047j5476546j6749318
57026a56100992j7974093j8904064j9049648j8199016j6870143j6031251j6291237
57019b79420444j7417985j8579798j8865479j7587412j4416520r534499l640468
57012c79462605K383062P905462J2681525J6676596J9899824K2380279K4152632
57005b73383225K5197324K5450923K4911529K3699347K2003966K0014052J7901610
$$ plain form
57058 -714759 -1364399 -2089287 -2889074 -3764691 -4729575 -5799141 -6978682 -8273700 -9701919
57049 -9701919 -11281847 -13019923 -14923171 -17013621 -19315014 -21836975 -24589134 -27599392
57041 -27599392 -30901772 -34522084 -38499721 -42915317 -47880310 -53515794 -59962419 -67389570
57033 -67389570 -75963528 -85815839 -97051741 -109743081 -123875128 -139351674 -156100992
57026 -156100992 -174075085 -192979149 -212028797 -230227813 -247097956 -263129207 -279420444
57019 -279420444 -296838429 -315418227 -334283706 -351871118 -366287638 -375822137 -379462605
57012 -379462605 -377079543 -369174081 -356492556 -339815960 -319916136 -297535857 -273383225
57005 -273383225 -248185901 -222734978 -197823449 -174124102 -152120136 -132106084 -114204474
56998a14204474J5813605J3840387J2013738J0350964Q878848P609404O524868
56991c9172660N601699M826432M179039L627085L149603K746377K413568K130387
56983a0498470J879519J661082J476225J314825J169293J043844R40081a65329
56974E96355O85386O22600N66223N11516M63784M25463L88510L47470L08206K75933
56964E191446K46043K14134J84182J59191J33964J04340P4233M6827J7576j8015
56954F353921n8428j02731j53136k05117k44802k63077k64436k56923k42561k23135
56944D339575k05220j92060j78652j61685j46493j37650j30770j20588j09501
56935B956956j00989r1829p8295o3391n0645l6969j8945k2J6254L4573O1778R7213
$$ plain form
56998 -114204474 -98390869 -84550482 -72536744 -62185780 -53306932 -45697528 -39172660
56991 -39172660 -33570961 -28744529 -24565490 -20938405 -17788802 -15042425 -12628857 -10498470
56983 -10498470 -8618951 -6957869 -5481644 -4166819 -2997526 -1953682 -1013601 -165329
56974 596355 1281741 1904341 2470564 2982080 3445864 3871327 4259837 4607307 4915513 5191446
56964 5191446 5437489 5651623 5835805 5994996 6128960 6233300 6307533 6354360 6371936 6353921
56954 6353921 6295493 6192762 6039626 5834509 5589707 5326630 5062194 4805271 4562710 4339575
56944 4339575 4134355 3942295 3763643 3601958 3455465 3317815 3187045 3066457 2956956
56935 2956956 2855967 2764138 2685843 2622452 2571807 2534838 2515893 2515871 2532125 2566698 2628476 2725689
56923B725689J36122J76381K12311K26045J96655J19791J3325r5573j84725k42580
56913C283441k68795k71497k60409k41393k17967j94297j73124j53454j33747
56904A368758j15051r8298q1771o4665m9749l8926k9543j9064j0131o773q569
56893H46218j2688j8701k6797l3977l6864l6434l5576l3917k9490k3766k0289
56882E37719j9278j7718j4268j0489p683n547l431n61M042R745J3913J5513J7079
56869E19036K0551K3279K1198J4183N129m443j4441k3271k8517k9999k9400k7513
56857D45792k4414k1332j9745j9215j8425j7567j7590j8065j7875j7134j6460
56846B37970j5443j3699j2282j2165j2558j2462j2478j3204j3460j2123j0201
$$ plain form
56923 2725689 2861811 3038192 3250503 3476548 3673203 3792994 3806319 3710746 3526021 3283441
56913 3283441 3014646 2743149 2482740 2241347 2023380 1829083 1655959 1502505 1368758
56904 1368758 1253707 1155409 1073638 1008973 959224 920298 890755 871691 861560 854787 846218
56893 846218 833530 814829 788032 754055 717191 680757 645181 611264 581774 558008 537719
56882 537719 518441 500723 486455 475966 468283 462736 459305 458744 462786 472531 486444 501957 519036
56869 519036 539587 562866 584064 598247 603376 598933 584492 561221 532704 502705 473305 445792
56857 445792 421378 400046 380301 361086 342661 325094 307504 289439 271564 254430 237970
56846 237970 222527 208828 196546 184381 171823 159361 146883 133679 120219 108096 97895
56835I7895q976p707n384k997j564M40M968J0918J5603J8700K2054K6281L0165
56822B00396L2876L4340L3841L0635K5763K1372J8366J6225J4649J3833J3633
56811D55929J3815J4572J5718J6265J6007J6392J8478K1208K3121K4545K6731
56800F62781L0074L4392L9345M2910M1250L2239J8172L388r468j9438k5556k7571
56788H22518k7052k5572k2756j7921j2206p096k188L393Q881J3491J8727K6511
56776G78730L6133M5654N5237O6022P6228Q0961P6040O0315L5376N553k2386m2585
56764A251278n3750n8310n8567n5463n0094m3754l6660k8612k0661j4153q551
56753H22703k235M903J1683J8049K5170L3329M1531M8684N3048N1139L9901K0513
$$ plain form
56835 97895 88919 81212 75828 72831 71267 71707 76675 87593 103196 121896 143950 170231 200396
56822 200396 233272 267612 301453 332088 357851 379223 397589 413814 428463 442296 455929
56811 455929 469744 484316 500034 516299 532306 548698 567176 588384 611505 636050 662781
56800 662781 692855 727247 766592 809502 850752 882991 901163 904551 895083 875645 850089 822518
56788 822518 795466 769894 747138 729217 717011 709915 707727 711120 720001 733492 752219 778730
56776 778730 814863 860517 915754 981776 1058004 1138965 1215005 1275320 1310696 1316249 1293863 1251278
56764 1251278 1197528 1139218 1080651 1025188 975094 931340 894680 866068 845407 831254 822703
56753 822703 820468 825371 837054 855103 880273 913602 955133 1003817 1056865 1108004 1147905 1168418
56741A168418j750k1637l6610m6164n0863n2259n1818m9480m4603l8148l2364
56730G42722k8296k4997k1137j6050r627k604L365P392J0709J4934J9560K2540
56718G18511K2547J9054J1334l27j3107k3573l0816l5715l8002l6625l2611k8821
56706E31849k6690k5369k3991k2544k0633j7735j4731j2916j1656r386o706n790
56694C33702o708p142o050m739l961k921j848k406m439n288l738j949j883k444
56680B78186j962j175j551k598k970k748k778l019l219l864m912n059l821k785
56666B35725l010k875p18J911K201L73p45r8L04j226l695n116m929l923k965k550
56650B08664k742l010k695j907j430j635k071k246k209k112j745r10PJ73r25k909
$$ plain form
56741 1168418 1166668 1145031 1108421 1062257 1011394 959135 907317 857837 813234 775086 742722
56730 742722 714426 689429 668292 652242 642615 640011 643376 650768 661477 676411 695971 718511
56718 718511 741058 760112 771446 771119 758012 734439 703623 667908 629906 593281 560670 531849
56706 531849 505159 479790 455799 433255 412622 394887 380156 367240 355584 346198 339492 333702
56694 333702 326994 319852 313802 309063 305102 302181 300333 297927 293488 288200 284462 282513 280630 278186
56680 278186 276224 275049 273498 270900 267930 265182 262404 259385 256166 252302 247390 242331 238510 235725
56666 235725 232715 229840 229122 231033 233234 233607 232862 232764 233068 231842 228147 223031 218102 214179 211214 208664
56650 208664 205922 202912 200217 198310 196880 195245 193174 190928 188719 186607 184862 183952 183959 184132 183207 180298
56634A80298m758n727n882n645m967l532j652k73J87M68J584L741O338Q648J0138
56619A78966J0516J0009R435R557J0202J0251Q699N879L370K417K675K967L063
56606B68006L608M348L913K095Q20J506K628J639j395l869l968k301m66L71l04
56591B76631j960k897k056n68n3J6J105K422J795l49r32J144L303L420K695K801
56575B86517K919J720R2n86r63k181l362l181k645l681n760o565n452l899k760
56560B50213j507o8P73J038J641K517K464J184r1l60J08Q01J606K205K110J582
56544B66216J371J375P80l02p49k18L28K00j95n39j272k354k553r51J644L614
56528B66395M293M188L925L710L466L080K593K373K708L175K970K113J712K613
$$ plain form
56634 180298 175540 169813 163931 158286 153319 149787 148135 147862 148049 148517 150101 153842 160180 168828 178966
56619 178966 189482 199491 208926 218483 228685 238936 247635 253514 256884 259301 261976 264943 268006
56606 268006 271614 275962 279875 281970 282790 284296 286924 288563 287168 283299 279331 277030 276564 276935 276631
56591 276631 274671 271774 269718 269150 269097 269113 270218 272640 274435 274086 273154 274298 277601 281021 283716 286517
56575 286517 289436 291156 291248 290662 289699 287518 284156 280975 278330 274649 268889 262324 256872 252973 250213
56560 250213 248706 248638 249411 250449 252090 254607 257071 258255 258164 257804 257912 258713 260319 262524 264634 266216
56544 266216 267587 268962 269742 269440 268691 268473 268801 269001 268806 268267 266995 264641 262088 261137 262781 266395
56528 266395 270688 274876 278801 282511 285977 289057 291650 294023 296731 299906 302876 304989 306701 309314
56514C09314M201N046M482L217K459K804L937N160N886N760M760L615L641N428
56500C69710P767Q805Q249P432P127O622N379M268M244N044O084P366Q494Q267
56486D64858O556N167N166M891K773O31J344M147N378L701J345p2j683m259o049
56471D93894n426l554k562k843l697n085o982q231p729o106m961n169o657q883
56457D16009j0693j0792r253p548o415n175l716l279m131m401k900j298j553k776
56443C42079k926k228k304k883k200l35O69K56K86J841L290K647K92j784k336
56428C34364j558k07J050J736J668R29j44r48r85o52j025k264k998k112l33J015
56412C27536J986L325M541M438L342K951L811M591M217L363L260M193N546O379
$$ plain form
56514 309314 313515 318561 323043 326260 328719 331523 335460 340620 346506 352266 357026 360641 364282 369710
56500 369710 377477 386282 394531 401963 409090 415712 421091 425359 429603 434647 440731 448097 456591 464858
56486 464858 471414 476581 481747 486638 489411 490042 491386 495533 500911 504612 505957 505885 504202 499943 493894
56471 493894 488468 484914 482352 479509 475812 470727 463745 455514 447785 441679 436718 431549 424892 416009
56457 416009 405316 394524 385271 377723 371308 366133 362417 359138 355007 350606 347706 346408 344855 342079
56443 342079 339153 336925 334621 331738 329538 329203 329872 330128 330414 332255 335545 338192 338484 336700 334364
56428 334364 332806 332599 333649 335385 337053 337982 337838 336890 335905 335253 334228 331964 328966 326854 326521 327536
56412 327536 329522 332847 337388 341826 345168 348119 351930 356521 360738 364101 367361 371554 377100 383479
56398C83479N728L373P09q2J711M508O112N704M167L052L197L986L977K695J154
56383D33470K48m11j113p19J703M751O131N732N336N506M962L119J102j97j141
56368D68479j911j845r68n07j120k095k951m203n827o521n577m144l571l626l365
56353D20248k710k231k192k655l701m919n527n422n278n197m471l051j915j414
56339C69565p05N09J054K8j723k802k750j625N59K947L767K392L89n19n40p68
56323C69778j173r58o8R17J837K804L486L513L053K363J353K23l01O6O68R83J229
56306C89773J536J554J326J307J156J11j043k38K615M628L570P85r94j145p93
56291D04148m85r2J34N1K95R17P18o83j509k99J748K854L494N019O904P829Q305
$$ plain form
56398 383479 389207 392580 393289 393207 394918 399426 405538 411242 415409 418461 421658 425644 429621 432316 433470
56383 433470 433718 433307 432194 431475 433178 437929 444060 449792 455128 460634 465596 468715 469817 469620 468479
56368 468479 466568 464723 463755 463248 462128 460033 457082 452879 447052 440531 434954 430810 427239 423613 420248
56353 420248 417538 415307 413115 410460 406759 401840 396313 390891 385613 380416 375945 372894 370979 369565
56339 369565 368860 369369 370423 370451 368728 365926 363176 361551 362110 365057 368824 371216 371605 371086 370546 369778
56323 369778 368605 367647 367579 368496 370333 373137 376623 380136 383189 385552 386905 387128 386827 386893 387561 388544 389773
56306 389773 391309 392863 394189 395496 396652 396763 395720 395482 398097 402725 406295 407080 406086 404941 404148
56291 404148 403663 403571 403705 403756 404051 404968 405686 405003 403494 403195 404943 407797 411291 416310 423214 431043 439348
56274D39348R398R966Q176N189M165N746P567Q333R311J1243J2756J2875J2613
56261E56686J2904J3150J2956J3323J4819J6167J6015J4777J3633J2861J2254
56250G09545J1938J1701J0609Q499O900P106Q055P510N095K778K156K418J679
56237G95989k86j616p10J780L898M782N234O081P214Q410R796J0994J1034R971
56223H72571R427J0540J2361J3483J4225J5805J8132K0063K1524K3837K7836L2736
56211A092540L7057M0004M2047M4488M8135N2146N5049N7208O0976O7683P5842
56200A673175Q3450R0637R8594J07072J14746J21255J27401J33847J40899J48720
56190B839796J56516J62398J65321J66141J65419J61558J52834J39953J24648
$$ plain form
56274 439348 448746 458712 466888 472077 476242 481988 489555 497888 507199 518442 531198 544073 556686
56261 556686 569590 582740 595696 609019 623838 640005 656020 670797 684430 697291 709545
56250 709545 721483 733184 743793 752292 759192 766298 774353 781863 786958 789736 791892 794310 795989
56237 795989 795703 794087 793377 795157 799055 803837 809071 815152 822366 830776 840572 851566 862600 872571
56223 872571 881998 892538 904899 918382 932607 948412 966544 986607 1008131 1031968 1059804 1092540
56211 1092540 1129597 1169601 1211648 1256136 1304271 1356417 1411466 1468674 1529650 1597333 1673175
56200 1673175 1756625 1847262 1945856 2052928 2167674 2288929 2416330 2550177 2691076 2839796
56190 2839796 2996312 3158710 3324031 3490172 3655591 3817149 3969983 4109936 4234584
56181D234584J06909Q5966O2980M0370J8973j815k1539l8588n2297o3059p0690
56170D301794p4827p6698p8412q0491q1953q2449q2593q2586q2489q3407q6373
56159C409516r0345r3420r5521r7869j00351j01787j02397j03427j04391j03280
56149B416728r9675r5355r1492q7448q2767p8201p4215p0115o5153n9295n2983
56138A560029m7322m3810m2360m0383l5943l0773k7901k7046k5300k1846j8852
56127A198493j7646j6998j5713j4268j3136j1742r860q158o808n183l184j376
56115A074421J49J558K357K348K898N379Q972J1873J3799J5236J5422J3605J1311
56102A179328J0519J0624R927R005R379R913Q258N174L672M383N382O183P955
$$ plain form
56181 4234584 4341493 4427459 4490439 4530809 4549782 4547967 4526428 4487840 4435543 4372484 4301794
56170 4301794 4226967 4150269 4071857 3991366 3909413 3826964 3744371 3661785 3579296 3495889 3409516
56159 3409516 3319171 3225751 3130230 3032361 2932010 2830223 2727826 2624399 2520008 2416728
56149 2416728 2317053 2221698 2130206 2042758 1959991 1881790 1807575 1737460 1672307 1613012 1560029
56138 1560029 1512707 1468897 1426537 1386154 1350211 1319438 1291537 1264491 1239191 1217345 1198493
56127 1198493 1180847 1163849 1148136 1133868 1120732 1108990 1099130 1090972 1084164 1078981 1075797 1074421
56115 1074421 1074570 1076128 1078485 1080833 1083731 1089110 1098082 1109955 1123754 1138990 1154412 1168017 1179328
56102 1179328 1189847 1200471 1210398 1219403 1228782 1238695 1246953 1252127 1255799 1260182 1265564 1271747 1279702
56089A279702J0149J0861J0518J1318J3126J3905J4107J6385K0909K5341K9666
56078A455987L6383M5392N3429N9532O6524P5975Q6101R5904J06990J19896J32854
56067B334967J45623J60268J76497J90192J98115K00302J96784J86446J70828
56058C960022J54684J40651J27070J12517R8161Q3846O6268M3543J8028p106l0354
56047D767330m9531o1719o8044p4456q5276r9421j14682j31226j48352j62087
56037C772536j69213j70609j68245j62265j53137j43111j33262j22268j09938
56028B440488r8502q8752p8751o7917n8534n1578m5223l8865l4266l1225k6973
56017A819902k1392j7702j6167j2739o082l26J799K816M847N975N435O444J0280
$$ plain form
56089 1279702 1289851 1300712 1311230 1322548 1335674 1349579 1363686 1380071 1400980 1426321 1455987
56078 1455987 1492370 1537762 1591191 1650723 1717247 1793222 1879323 1975227 2082217 2202113 2334967
56067 2334967 2480590 2640858 2817355 3007547 3205662 3405964 3602748 3789194 3960022
56058 3960022 4114706 4255357 4382427 4494944 4593105 4676951 4743219 4786762 4804790 4797684 4767330
56047 4767330 4717799 4656080 4588036 4513580 4428304 4328883 4214201 4082975 3934623 3772536
56037 3772536 3603323 3432714 3264469 3102204 2949067 2805956 2672694 2550426 2440488
56028 2440488 2341986 2253234 2174483 2106566 2048032 1996454 1951231 1912366 1878100 1846875 1819902
56017 1819902 1798510 1780808 1764641 1751902 1745820 1745494 1747293 1750109 1754956 1760931 1766366 1772810 1783090
56004A783090J3229J3272J4116J8484K2954K3965K3725K5532K8129K9262L0209
55993B025967L2273L3288L1936L1195L3363L6129L7322L8843M2041M4250M4006
55982B430613M4635M8545N2924N5111N7050O0536O3498O4998O8135P3950P8407
55971C098402P9582Q1605Q7191R2882R6179J00395J07551J13707J16688J21145
55961D095327J30188J39338J44755J50097J58964J67974J73855J80055J89664
55952E530217J99176K05752K13099K23716K33402K40039K49122K63648K77897
55943G636068K88527L01850L21920L41903L56445L72118L95762M22994M48745
55934A0886332M78587N18354N62725O05549O51086P03391P55449Q00917Q45760
$$ plain form
56004 1783090 1796319 1809591 1823707 1842191 1865145 1889110 1912835 1938367 1966496 1995758 2025967
55993 2025967 2058240 2091528 2123464 2154659 2188022 2224151 2261473 2300316 2342357 2386607 2430613
55982 2430613 2475248 2523793 2576717 2631828 2688878 2749414 2812912 2877910 2946045 3019995 3098402
55971 3098402 3177984 3259589 3346780 3439662 3535841 3636236 3743787 3857494 3974182 4095327
55961 4095327 4225515 4364853 4509608 4659705 4818669 4986643 5160498 5340553 5530217
55952 5530217 5729393 5935145 6148244 6371960 6605362 6845401 7094523 7358171 7636068
55943 7636068 7924595 8226445 8548365 8890268 9246713 9618831 10014593 10437587 10886332
55934 10886332 11364919 11883273 12445998 13051547 13702633 14406024 15161473 15962390 16808150
55925A6808150Q96052R46123R91540J040976J101544J165799J227818J297630
55917B5475632J383670J475994J564381J657695J766960J885807K007861K146694
55909C9364694K316960K513408K731418K989487L307494L683882M120465M644839
55901F5672647N276602N996288O782265P652330Q633913R727620J0944864J2344768
55893A33031297J3983564J5872376J8045255K0610146K3649165K7128663L0969298
55886B83289764L4978933L8342354L9190651L5241411K5471344J1313019l953521
55879D63873955j7103059k6431279l1838596l4083154l4127822l2835513l0822816
55872B56631716k8422669k5800015k3092002k0423822j7867209j5467914j3294773
$$ plain form
55925 16808150 17704202 18650325 19641865 20682841 21784385 22950184 24178002 25475632
55917 25475632 26859302 28335296 29899677 31557372 33324332 35210139 37218000 39364694
55909 39364694 41681654 44195062 46926480 49915967 53223461 56907343 61027808 65672647
55901 65672647 70949249 76945537 83727802 91380132 100014045 109741665 120686529 133031297
55893 133031297 147014861 162887237 180932492 201542638 225191803 252320466 283289764
55886 283289764 318268697 356611051 395801702 431043113 456514457 467827476 463873955
55879 463873955 446770896 420339617 388501021 354417867 320290045 287454532 256631716
55872 256631716 228209047 202409032 179317030 158893208 141025999 125558085 112263312
55865A12263312j1410736r817950q476565p358208o443309n689605n047549m496400
55857E3522990m033202l639721l290525k980426k714549k481846k264586k063459
55849C0054676j888401j734253j588482j453596j339466j241709j148566j061255
55841A8598948r87629r23283q58198p95265p43718p00571o56217o12382n77340
55832A1744345n48828n18368m87617m64320m46257m24725m00502l81688l68632
55823G703408l54555l38580l25616l15759l05230k94875k86983k76969k58888
55814D945953k35868k15112j96339j75091j53215j35694j20938j04438q8413p7979
55804C442866p1505o4645o0027o2800p0045p4552p5954p8431q0862p9224p5812
$$ plain form
55865 112263312 100852576 91034626 82558061 75199853 68756544 63066939 58019390 53522990
55857 53522990 49489788 45850067 42559542 39579116 36864567 34382721 32118135 30054676
55849 30054676 28166275 26432022 24843540 23389944 22050478 20808769 19660203 18598948
55841 18598948 17611319 16688036 15829838 15034573 14290855 13590284 12934067 12321685 11744345
55832 11744345 11195517 10677149 10189532 9725212 9278955 8854230 8453728 8072040 7703408
55823 7703408 7348853 7010273 6684657 6368898 6063668 5768793 5481810 5204841 4945953
55814 4945953 4710085 4494973 4298634 4123543 3970328 3834634 3713696 3609258 3520845 3442866
55804 3442866 3371361 3306716 3246689 3183889 3113844 3039292 2963338 2884907 2804045 2724821 2649009
55793B649009p5995p8074p5863o9200o2953n7866n1266m4537m0968l8229l1669
55782B022389k2950j7081j3260p281q02O45k947p334j2788k2782l5351m4500m9268
55769A786690n3179n5787n3343m7206m3180m2389m0472l5940l2069l0316k8859
55758A323950k7693k8663l0334k9088k5281k2600k1865k0949j9863j9977j9419
55747A058218j5325r590o464n677l943j714j837l008j520J490J476j649l952n048
55733A001457q062j2464j4201j3237j3816j6696j7912j6111j4550j4677j3862
55722H45869j0976q558p952p272n396l450j531J425M016L129j263o266j0766j5428
55708G75581j8644j7761j4408j3136j4509j4554j1464p763n344l378j771j914
$$ plain form
55793 2649009 2573014 2494940 2419077 2349877 2286924 2229058 2177792 2133255 2092287 2054058 2022389
55782 2022389 1999439 1982358 1969098 1961817 1961015 1961660 1958713 1951379 1938591 1915809 1880458 1835958 1786690
55769 1786690 1733511 1677724 1624381 1577175 1533995 1491606 1451134 1415194 1383125 1352809 1323950
55758 1323950 1296257 1267594 1237260 1208172 1182891 1160291 1138426 1117477 1097614 1077637 1058218
55747 1058218 1042893 1033303 1026839 1021162 1017219 1015505 1013668 1010660 1009140 1010630 1012106 1010457 1006505 1001457
55733 1001457 993395 980931 966730 953493 939677 922981 905069 888958 874408 859731 845869
55722 845869 834893 826335 818383 811111 805715 802265 800734 802159 806175 809304 808041 801775 791009 775581
55708 775581 756937 739176 724768 711632 697123 682569 671105 663342 657998 654620 652849 650935
55696F50935l238l384k338k282l344l715l729n286p592q349q805j2344j8113k1561
55682E46855k1498k1217k2033k1436j8617j6321j5745j4593j1733r159p840n996
55670C60667l004q11j98M02J181J57k831n148n456n132m908l917k675k997m294
55655C21036l857j495J72M03J069K223J465j346l139k421r12M11K679N606O922
55640C28816O358O105O434N186K425J020J531J263l98n46J809L619L082K357K841
55625C71902K363l12k420j611J75J41j120j620j417j609k097k399k679k594j351
55610C53352K91O06OM68J514O00j811j853J643M948N246M511N245O191N087K581
55594C88625O74k18m58R0P33j44k293l296k361j594k319l373m238o151q517q309
$$ plain form
55696 650935 647697 644313 641975 639693 636349 632634 628905 623619 616027 607678 598873 586529 568416 546855
55682 546855 525357 504140 482107 460671 442054 425733 409988 395395 383662 374503 366663 360667
55670 360667 357663 356852 356654 357056 358237 358394 355563 350415 344959 339827 334919 331002 328327 325330 321036
55655 321036 317179 315684 315856 316259 317328 319551 321016 319670 316531 314110 313198 313609 316288 321894 328816
55640 328816 335174 341279 347713 352899 355324 356344 357875 359138 358740 358194 360003 363622 366704 369061 371902
55625 371902 374265 373953 371533 369922 370097 370238 369118 367498 366081 364472 362375 359976 357297 354703 353352
55610 353352 353643 354249 354255 354723 356237 356837 355026 353173 354816 359764 365010 369521 374766 380957 386044 388625
55594 388625 389299 389081 388623 388713 389446 389302 387009 383713 381352 379758 377439 374066 369828 363677 355160 346851
55578C46851n207l454n839r389j0039q279o976o550n782n123n804p178p822p700
55564B51709p120n402k840j914l998o685o845m725k738j839j439j439j958k193
55550B00574j577j018j365j791j361q21j337k560l407l633l463k797j776r71l90
55535A72307L31N80n01j855j519n1j74k342l767k769q86M56K041M010M487L059
55519A73407K504M529O821O909O189P065Q568Q104N886M468M959O370P839R284
55505B62902J0576J1794J3495J5309J5535J3428J0539Q580P314N759L756J174
55493C80161k645p322j1039j2923j4065j5171j5356j4384j3734j3905j3118j0373
55481B36126p520o566o967p289p361p060n392k708j465k720l996k787k8K005L058
$$ plain form
55578 346851 341644 338190 332351 322962 312923 304644 297668 291118 285336 280213 274409 267231 259409 251709
55564 251709 244589 239187 236347 234433 230435 223750 216905 212180 209442 207603 206164 204725 202767 200574
55550 200574 198997 197979 196614 194823 193462 192641 191304 188744 185337 181704 178241 175444 173668 172697 172307
55535 172307 172638 173218 172717 170862 169343 169292 169118 166776 163009 160240 159354 159810 161851 165861 170348 173407
55519 173407 175911 180440 187261 194170 200359 207424 215992 224096 229982 234450 239409 245779 253618 262902
55505 262902 273478 285272 298767 314076 329611 343039 353578 362158 369472 375231 378987 380161
55493 380161 377516 370194 359155 346232 332167 316996 301640 287256 273522 259617 246499 236126
55481 236126 228606 222040 215073 207784 200423 193363 187971 185263 183798 181078 177082 174295 174267 176272 179330
55466A79330L770L442J511m36o89m5k22j146j895k636l399k691K08L022L103J142
55450A82369r2L29R35M08j381m127p147r206r605q728o936m303k103k406n034
55435A22973p052o570m963m010l315k287k051l222m065l176j978k281l279l201
55421G1523k193j379p52n3K2o36p08J36J53j172j395J034L629L346R68p96j358
55404G0369j644j430l42L04m46j039n1Q88k51k166k319r75m7L73J175J510K31
55387F4140j306j187k65m03q66J32J648J451J11K8J179J467O40L38O96K96q07
55370F7292j173q98j390k490k628j582n11L19J312J752Q57k19L2P96N89L05J548
55353F3911L129K657P39OP09Q98L04M21J145J062P59K068M145M078J591o16j357
$$ plain form
55466 179330 183100 186542 188053 187617 186928 186883 186661 185515 183620 180984 177585 174894 175102 178124 181227 182369
55450 182369 182277 182606 183541 183949 182568 178441 171294 162088 152483 143755 136819 132516 130413 128007 122973
55435 122973 115921 109351 104388 100378 97063 94776 92725 89503 85438 82262 80284 78003 74724 71523
55421 71523 69330 67951 67199 67146 67168 66532 65824 65960 66113 64941 63546 64580 68209 71555 72523 71727 70369
55404 70369 68725 67295 66953 67257 66811 65772 65721 66609 66358 64192 61873 60898 60851 61224 62399 63909 64140
55387 64140 62834 61647 61382 60979 60113 60245 61893 63344 63455 63483 64662 66129 66769 67107 67803 68099 67292
55370 67292 66119 65221 63831 61341 58713 57131 56620 56939 58251 60003 60860 60641 60673 61469 62058 62363 63911
55353 63911 67040 69697 70436 70442 71151 72049 72353 72774 73919 74981 75740 77808 81953 86031 87622 87006 85649
55336H5649k130l430l687k591j949k256j718K21J451M96j245j739o33J261K811
55321G0511K610L81j691j342L33M75j025j727j019o94j101n56R06J035n15j221
55305F5360o2P48k16j273r66m96j014j530j284j470k470k214M55L181L287J566
55289F1602M51J56p90k396l129k468j529j268j437j262l25J052J946J734P98k19
55273E2916j422k809l067j065J763K606J037n06k44R86J766K002K052J786J366
55258E9167J340J382M70j185j948j050L90J075Q82L09p2M42J792K447J198p19
55242F5920j171l77k18q03m93P36R77j26o52K04P97M3r14j038r23r58m55L70k9
55223F0890j813k954k190n57Q40K138K924J922l11j142J46Q62q35k900k731j114
$$ plain form
55336 85649 83519 80089 76402 73811 71862 69606 67888 68109 69560 70056 68811 67072 66439 67700 70511
55321 70511 73121 73502 71811 70469 70802 71277 70252 68525 67506 66812 65711 65155 66061 67096 66581 65360
55305 65360 65298 66046 65830 64557 63591 63095 62081 60551 59267 57797 55327 53113 53568 56749 60036 61602
55289 61602 62053 62209 61419 59023 55894 53426 51897 50629 49192 47930 47605 48657 50603 52337 53135 52916
55273 52916 51494 48685 45618 44553 46316 48922 49959 49453 49209 50195 51961 53963 56015 57801 59167
55258 59167 60507 61889 62359 61174 59226 58176 58566 59641 60523 60832 60760 61202 62994 65441 66639 65920
55242 65920 64749 64372 64154 63351 62858 63594 64571 64445 63793 63997 64794 64837 63923 62885 61962 61004 60549 60919 60890
55223 60890 59077 56123 53933 53376 54216 56354 59278 61200 60889 59747 59893 60755 59920 57020 54289 53175
55207E3175l78o36l97N12J030Q72M97n2o46m35Q38J941J895J485J717J980J172
55190F4570m45j749k220j837o69N14M67p34j488j087p80j382j689n93Q52J254
55174E2984J224K039L069K485P4k286k773j325N41J115K08m31P61K754L135J607
55158F5181L82P30J408J244J016J550K011J479N15j77j024k275k918k200q24L11
55142F6409J122J275K8j918k428r41N30N72L91J245K092J522J29q58j482j909
55126F5779j301L28J031k46j571q62Q79J334M00m36p72j114j155m68Q1m05j127
55109F0375j029p08j068j427r70p42j864l039k241O6J743K132K077J703N56o11
55093E4953m91O71J602J965K047J358l42j525o58J176J636N16n53r82j421j568
$$ plain form
55207 53175 52797 52161 51764 52276 53306 54178 54675 54623 53977 53542 54380 56321 58216 59701 61418 63398 64570
55190 64570 64125 62376 60156 58319 57650 58164 58631 57897 56409 55322 54542 53160 51471 50878 51730 52984
55174 52984 54208 56247 59316 61801 61875 59589 56816 55491 56032 57147 57355 56924 57685 60439 63574 65181
55158 65181 65563 66293 67701 68945 69961 71511 73522 75001 75516 75339 74315 72040 69122 66922 66098 66409
55142 66409 67531 68806 68834 66916 64488 63547 64077 64649 65040 66285 68377 69899 70028 69170 67688 65779
55126 65779 64478 64806 65837 65591 64020 63158 64037 65371 65771 65335 64563 63449 62294 61826 61907 61502 60375
55109 60375 59346 58638 57570 56143 55173 54431 52567 49528 47287 47353 49096 51228 53305 55008 55564 54953
55093 54953 54462 55133 56735 58700 60747 62105 61763 60238 59580 60756 62392 62908 62355 61373 59952 58384
55077E8384m68J156J385O3r55o35K45J003J884K675K549J578P96N05J78OQ39K376
55059G3564L254L099K876K918K306P00p58r40k2J163K059K320J706L22j435k969
55043I0163l353j850O44J841Q33n20l38N15K74n03N8J703K369J587Q53P09J11
55026I5096r63j055m9J44j241k209r66J428K796K723K164J526P40M07J245K705
55010A04491L377K688J338J72n92j043j098o82j18K4m17r15r20n96l93j19O13
54993A05810J113J75j781k604j268O28J211P43L38k52j648k744j835O47K513K699
54977A03745J968J085J47l61K17J265J403O57N28J599K621K450J531Q90P43O94
54961A21182M87J67j3K85J007J591J738J784J808J270L40L41J590K081J24k711
$$ plain form
55077 58384 57916 59072 60457 60520 59565 58930 59175 60178 62062 64737 67286 68864 69660 70165 70343 70349 71188 73564
55059 73564 76818 79917 82793 85711 88017 88717 87959 87019 86997 88160 90219 92539 94245 94567 93132 90163
55043 90163 86810 84960 85604 87445 88278 87758 87420 87935 88209 87706 87764 89467 91836 93423 94276 94985 95096
55026 95096 94133 93078 93029 93173 91932 89723 88757 90185 92981 95704 97868 99394 100134 100541 101786 104491
55010 104491 107868 110556 111894 112066 111474 110431 109333 108651 108533 108557 108140 107225 106305 105709 105316 105197 105810
54993 105810 106923 107098 105317 102713 101445 102073 103284 104027 104365 104113 102465 99721 97886 98533 101046 103745
54977 103745 105713 106798 106945 106584 106801 108066 109469 110126 110654 112253 114874 117324 118855 119745 120488 121182
54961 121182 121669 121836 121823 122108 123115 124706 126444 128228 130036 131306 131646 131987 133577 135658 135782 133071
54945A33071l499k052p66q23j121r54j123j832j861p10M04N01R2k82r81j891j872
54928A14301n69O03M19m75p96m26J0L51O86P09K46j90k2O92J563K272K254R70
54910A22598j042k130j163J292L719N041N076M328L618L409L338K926K648L461
54896A57119N389P405Q694R168Q926Q285Q288R907J2606J4771J5677J5891J5709
54883B97835J4625J2670J0809R396P393L884n96m888q523j1496j3454j3883j2924
54870B90848j1604j1252j2438j4151j4454j2656j0276q959q207o554m365l481
54858A72451m152m458l265j706r08nK162M846O383O553O493O809P094P206P829
54843B13332R499J1751J3586J4590J5151J5370J4144J0169M174r84l361m330o612
$$ plain form
54945 133071 129572 127520 126754 125931 124810 123856 122733 120901 119040 118330 118734 119235 119327 119045 118064 116173 114301
54928 114301 113732 114335 114754 114279 113483 113057 113067 113418 114104 114813 115059 114869 114847 115539 117102 119374 121628 122598
54910 122598 121556 119426 118263 119555 123274 128315 133391 137719 141337 144746 148084 151010 153658 157119
54896 157119 162508 169913 178607 187775 196701 204986 213274 223181 235787 250558 266235 282126 297835
54883 297835 312460 325130 335939 345335 352728 356612 356016 351128 342605 331109 317655 303772 290848
54870 290848 279244 267992 255554 241403 226949 214293 204017 195058 186851 180297 175932 172451
54858 172451 168299 163841 160576 158870 157962 157957 160119 164965 171348 177901 184394 191203 198297 205503 213332
54843 213332 222831 234582 248168 262758 277909 293279 307423 317592 321766 320782 317421 313091 306479
54830C06479j0543j3751j4461j3416j2301j1784j1589j1409j1014j0195r007p574
54818A69435n659l216j132m38q51j161j052j334k379l524m178m317l817k509j078
54803A32790o02j064j414j278j292j641j712j472j716k506k767j996j052q10j125
54788A10343j595k062j976p05J048J628Q08J95N52M11j507l979m859l880k393
54773I2029j111L02J848K728K454J578J087J315J545P14j116k387j766QJ089J036
54757A01353J006J533J786J376J172J621J804J163Q37K161M702O790P260O016
54743A40580L835K344L123N893Q407Q937Q060P299P087P136P869J0122J3701J7234
54729B51627J9432J9949J9256J7944J5928J2316O738O79l633n806p559j0093j2546
$$ plain form
54830 306479 295936 282185 267724 254308 242007 230223 218634 207225 196211 186016 177009 169435
54818 169435 163776 160560 159428 158990 158139 156978 155926 154592 152213 148689 144511 140194 136377 133868 132790
54803 132790 132188 131124 129710 128432 127140 125499 123787 122315 120599 118093 115326 113330 112278 111468 110343
54788 110343 108748 106686 104710 104005 105053 106681 107489 107684 108236 108647 107140 103161 98302 94422 92029
54773 92029 90918 91220 93068 95796 98250 99828 100915 102230 103775 104489 103373 100986 99220 99228 100317 101353
54757 101353 102359 103892 105678 107054 108226 109847 111651 112814 113651 115812 120514 127304 134564 140580
54743 140580 144415 146759 149882 155775 164182 173119 181179 188478 195565 202701 210570 220692 234393 251627
54729 251627 271059 291008 310264 328208 344136 356452 363190 363869 360236 354430 346871 336778 324232
54716C24232j3706j3793j3583j2873j1002q179n375l377k559k910l640l527k294
54703B27414r22j09O76K009L403M162M474M973N926P529J0079J3164J5568J6716
54689C15062J7422J8509J9573J9810J9122J7637J5108J1634P951M153q42p410
54677D57729j3763j7759j9428k0398k1383k1639k0744j9472j8568j7665j5907
54666B51003j3228j0657r273r022q792p819o573n845n521n072m635m464l898k309
54652A53895o36l13j038j395j449k347l412k426N89K599J804Q5j97N57Q99R75
54636A48190J358J183k57j574j168K15R42J198K094L143L017J983J397J397J165
54621A64283Q07R94J348J083P37J331K444L003L270M071M779M336L661M622O889
$$ plain form
54716 324232 310526 296733 283150 270277 259275 251096 245721 242344 239785 236875 233235 229708 227414
54703 227414 226492 226383 227059 229068 232471 236633 241107 246080 252006 259535 269614 282778 298346 315062
54689 315062 332484 350993 370566 390376 409498 427135 442243 453877 461828 465981 465139 457729
54677 457729 443966 426207 406779 386381 364998 343359 322615 303143 284575 266910 251003
54666 251003 237775 227118 217845 208823 200031 192212 185639 179794 174273 169201 164566 160102 156204 153895
54652 153895 153259 152946 151908 150513 149064 146717 143305 140879 141468 144067 145871 145956 145759 146316 147215 148190
54636 148190 149548 150731 150474 148900 147732 147947 148889 150087 152181 155324 158341 160324 161721 163118 164283
54621 164283 165090 166084 167432 168515 169252 170583 173027 176030 179300 183371 188150 192486 196147 200769 207658
54606B07658Q233P827O995O656O490O669P912R302Q520N143J763P40J625K627
54592B88160L083L366L764M524N924P474P972P152O326O697P937R106J0161J1755
54578C83401J4012J6152J7009J5792J2667Q726M857Q55l799q555j2205j4520j6346
54565D18046j8070j9058j8897j7994j6679j4697j2102r806q640q334p863o466
54553B59440m203j844k41M83R58J552J817J456J081J242J307N08n86q74o92j481
54537B59923l501n294n644m936m303m348m868n135m488l278k862l847m898m502
54523A98019l209k715l225l537l383l626m154l737k324j384j438j386r25j395
54509A61581l127m117k991j360j374k458k570j537q40q59n58L18Q97J078J792
$$ plain form
54606 207658 215891 223718 230713 237369 243859 250528 258440 267742 276262 281405 283168 283908 285533 288160
54592 288160 291243 294609 298373 302897 308821 316295 324267 331419 337745 344442 352379 361485 371646 383401
54578 383401 397413 413565 430574 446366 459033 467759 472616 473471 469672 461117 448912 434392 418046
54565 418046 399976 380918 362021 344027 327348 312651 300549 290743 282103 273769 265906 259440
54553 259440 255237 253393 253152 253635 254593 256145 257962 259418 260499 261741 263048 263556 262970 262096 261404 259923
54537 259923 256422 251128 245484 240548 236245 231897 227029 221894 217406 214128 211266 207419 202521 198019
54523 198019 194810 192095 188870 185333 181950 178324 174170 170433 168109 166725 165287 163901 162976 161581
54509 161581 158454 154337 151346 149986 148612 146154 143584 142047 141207 140348 139790 140108 141005 142083 143875
54494A43875L027L427K405J111N88M28R1J96J294K444K489K021K503L842M408
54479A74149L531K385K043K157K285L080N027P077P893P747P779Q013P593O643
54465B47402O205O316N778L994J646p57l425o024p475p641p693q070p721o248
54451B16287n182n697o614o184m724l772l635l482l145l039k839j976j102j383
54437A63513k480k786j637MJ075J412J340J305J818K786L170K311J169J120K019
54422A76139K688K828L019L162K542J374P56J028J461J641J953K622L431M283
54408B08927N050M955L339Q67j099k039k116j113Q64K248J454o33j622j005o17
54393B17460j557k784l246l319l380k801j455n58q87j357o08R98K046J937J087
$$ plain form
54494 143875 146902 150329 152734 153845 154433 154861 154952 155148 156442 158886 161375 163396 165899 169741 174149
54479 174149 177680 180065 182108 184265 186550 189630 194657 201734 209627 217374 225153 233166 240759 247402
54465 247402 253607 259923 265701 269695 271341 270584 267159 261135 253660 246019 238326 230256 222535 216287
54451 216287 211105 205408 198794 192610 187886 184114 180479 176997 173852 170813 167974 165998 164896 163513
54437 163513 161033 158247 156610 156614 157689 159101 160441 161746 163564 166350 169520 171831 173000 174120 176139
54422 176139 178827 181655 184674 187836 190378 191752 192508 193536 194997 196638 198591 201213 204644 208927
54408 208927 213977 218932 222271 223138 222039 220000 217884 216771 217635 219883 221337 220704 219082 218077 217460
54393 217460 215903 213119 209873 206554 203174 200373 198918 198360 197473 196116 195508 196506 198552 200489 201576
54378B01576j26j676l378m685m944l880k122r39p69m52J040K614K252M4j729j701
54362A81125r56r15j296j070j70P03J148J191J025J031J457J810J400N87N34J617
54346A89221L051M267N494O733P320O902N960N082M566M799O090Q001R742J0993
54332B78221J1390R806N782J295q38l16P20R74R76O73j290m955p978q480p205
54317B78775n820m814m198m546n884p011p051o527n866m462k251o52o30j199j173
54302B16691j069j850k985l174k128m51J305K513K449J416P70J015J105M53J02
54287B16162R49K326L498M814O209O441N399N097O470P164M962J711R80K882M187
54272B79251L000N03j731l448m496m318l285k671k938l513m375o122q313r476
$$ plain form
54378 201576 201450 199774 196396 191711 186767 182887 180765 179826 179057 178605 179645 182259 184511 184555 182826 181125
54362 181125 180169 179254 177958 176888 176718 177421 178569 179760 180785 181816 183273 185083 186483 187070 187604 189221
54346 189221 192272 196539 202033 208766 216086 222988 228948 234030 238596 243395 249485 257486 267228 278221
54332 278221 289611 299417 305199 306494 305656 305340 306060 307034 308010 308683 307393 302438 294460 285980 278775
54317 278775 272955 268141 263943 259397 253513 246502 239451 232924 227058 222596 220345 219693 219063 217864 216691
54302 216691 215622 213772 210787 207613 205485 205034 206339 208852 211301 212717 213487 214502 215607 216060 216162
54287 216162 217111 219437 222935 227749 233958 240399 245798 250895 257365 264529 269491 271202 272182 275064 279251
54272 279251 282251 282754 281023 277575 273079 268761 265476 262805 259867 256354 251979 245857 237544 228068
54258B28068r207q724q812q686p488n703m375l746l409l191l379m256n585o389
54244A45118n622l379j164m70j376k839l798l622k300p63k37p14r84o88r57k235
54228A13970l054k274r91o15m84O21J860J603M09J79P84J89k040l781l340j407
54212A01629L62J011K81j292k030o29J782K803K132J791K729L460K811J821J774
54197A20435K140J825R77K13o52j670j763j71J940K824K492K296K547K098L11
54182A35842j731k481j688m84Nk37l83k2K01n49j991k882k420j054J72N52L5q68
54164A20017j433j343j009q71o53J18J051J186K79r45j815k172j831n65J010J478
54148A12502J48j936l049k518j070K06Q22R47R09Q41Q11R91J252Q61p01k499k791
$$ plain form
54258 228068 218861 210137 201325 192639 185151 179448 175073 171327 167918 164727 161348 157092 151507 145118
54244 145118 139496 136117 134953 134483 133107 130268 126470 122848 120548 119785 119548 118834 117850 117162 116205 113970
54228 113970 110916 108642 107651 107036 106552 107173 109033 110636 111045 111224 112008 112197 110157 106376 103036 101629
54212 101629 101991 103002 103283 101991 99961 99332 101114 103917 106049 107840 110569 114029 116840 118661 120435
54197 120435 122575 124400 125377 125590 124938 123268 121505 121334 123274 126098 128590 130886 133433 135531 135842
54182 135842 134111 131630 129942 129458 129463 129226 128843 128821 129022 128473 126482 123600 121180 120126 120298 120850 120885 120017
54164 120017 118584 117241 116232 115361 114708 114826 115877 117063 117342 116397 114582 112410 110579 110014 111024 112502
54148 112502 112650 110714 107665 105147 104077 104283 105105 106052 106961 107802 108613 109604 110856 111717 111016 108517 105726
54131A05726j372j60o28j829k058j477j354j575r96k0n57k832m302k846L25K285
54115H6330J969Q40M63P03N78%j6J137K528K634J327J67L88J420J958J647R11
54098A04984j14j335k035j609o17k4J80L96J60j101k452k329q08N66J106J413
54082I6381J660J344Q69J281K107J572l32j234J62J988K040Q76L65O07K84q73
54066A09097j860k152k078j651n36R25J730J300j21j781k506j122K055M669M512
54051A10481K063k56j188j819l394n248n599l770r09J336K293K360J999J239K49
54036I9837k12L80J355J603J132R39J228J002j94j275j177m23j86n61q25q47j091
54019A00685j488j438q86n32p62j087q55PJ117K101K762K919K304Q18r48j725
$$ plain form
54131 105726 104354 104194 103566 101737 99679 98202 96848 95273 94277 94257 93700 90868 86566 83720 84045 86330
54115 86330 88299 89139 89602 90305 90883 90883 90867 92004 94532 97166 98493 98660 99048 100468 102426 104073 104984
54098 104984 104870 103535 101500 99891 99274 99250 99430 99826 99986 98885 96433 94104 93296 93862 94968 96381
54082 96381 98041 99385 100254 101535 103642 105214 104882 103648 103810 105798 107838 108714 109079 109686 109970 109097
54066 109097 107237 105085 103007 101356 100820 101745 103475 104775 104654 102873 100367 99245 101300 105969 110481
54051 110481 112544 112288 111100 109281 105887 100639 95040 91270 90361 91697 93990 96350 98349 99588 99837
54036 99837 99625 100005 101360 102963 104095 105034 106262 107264 107070 105795 104618 104195 104009 103448 102623 101776 100685
54019 100685 99197 97759 96873 96341 95579 94492 93637 93644 94761 96862 99624 102543 104847 105665 104717 102992
54003A02992p42J120K113J708J075J184J450R17r7m68J96J367K503L219K971J554
53987A23062j88r67l76R64K340L328L568K999K276K185K817L791M956O033O135
53972A62923M875L650M333O610Q215Q057P448P547P406N964M487N001P050Q109
53958B51675P154N732N240M995L955K699K371K767K769K076J134Mj426k429k187
53943B86529j396j654l127m279m260l940m029l768k651j997l201n299n934m421
53929B36573k334j185j012j317k012k902l304k839k029j679k015k623k822k101
53915B06399o30O10P76J86j09L89J303K156K652K370J237K55O60K158K954K002
53899B25368J50j382k615m097n420n529m161k203p65l70q51j504j495n92O30J573
$$ plain form
54003 102992 102250 103370 105483 107191 108266 109450 110900 111817 111720 111252 111448 112815 115318 118537 121508 123062
53987 123062 122874 121907 121531 122495 124835 128163 131731 134730 137006 139191 142008 145799 150755 156788 162923
53972 162923 167798 171448 175781 182391 190606 198663 206111 213658 221064 227028 231515 236516 243566 251675
53958 251675 258829 264561 269801 274796 278751 281450 283821 286588 289357 291433 292567 292571 291145 288716 286529
53943 286529 285133 283479 280352 276073 271813 267873 263844 260076 257425 255428 252227 246928 240994 236573
53929 236573 234239 233054 232042 230725 228713 225811 222507 219668 217639 215960 213945 211322 208500 206399
53915 206399 205769 206379 207155 207341 207232 207621 208924 211080 213732 216102 217339 217594 218254 220412 223366 225368
53899 225368 225518 224136 221521 217424 212004 206475 202314 200111 199346 198976 198125 196621 195126 194534 195164 196737
53883A96737K321L225M128M520M388M356M901N741O264O362O560P188P650O926
53869B71267M874K567J162P75P68O66L68j90q65j062k22J473L239M330M242K946
53853B96338J487J664M034O778P617O604N759O213P189P808Q262Q715Q458P012
53839C83938N080L707L182L238L608L782L028J226p66j961k033j236k29O6o89
53824D03941j583j684j879l938p502r781r131p275o727p500p973p949q785j0711
53810C11523j1851j0454p091m148l461m605n411m407k606k257l830n414n411m482
53796B36095l947l670k889k080k291l240l695l508l589l979l583k086p19o09j498
53781A94712k633l791m784m951l991k666j830j168J58J838K363Q88j564l262l623
$$ plain form
53883 196737 199058 202283 206411 210931 215319 219675 224576 230317 236581 242943 249503 256691 264341 271267
53869 271267 276141 278708 279870 280645 281413 282079 282447 282257 281392 280330 280108 281581 284820 289150 293392 296338
53853 296338 297825 299489 303523 310301 317918 324522 330281 336494 343683 351491 359753 368468 376926 383938
53839 383938 389018 392725 395907 399145 402753 406535 409563 410789 410023 408062 406029 404793 404564 404630 403941
53824 403941 402358 400674 398795 394857 387355 377574 368443 361168 354441 346941 338968 331019 322234 311523
53810 311523 299672 289218 282127 277979 274518 269913 264502 260095 257489 255232 251402 245988 240577 236095
53796 236095 232148 228478 225589 223509 221218 217978 214283 210775 207186 203207 199624 197538 196819 196210 194712
53781 194712 192079 188288 183504 178553 174562 171896 170066 168898 169056 170894 173257 174145 172581 169319 165696
53766A65696l276k653j401N21K132K458J715Q01J05m04m49J70P78N92J9l4J05
53749A66875n35j344m14K391M643M616L568L550M482N062N138N381N491M697L448
53734B17049K899L118L405L924N237O582O588N668N686O975P604O233M029K791
53720B87788K718K969L284L825M257M120L748L763M048L818K657Q73q64j860j708
53705C23436q20m02j324l126m514m747m032k818j301Q8M20q83k957l946k902j003
53689B89169k82j274k497k410j226m38j022k670m527o049p035p358o934n902m690
53674B34855l728l021k215j262o85p78q63j33R69J232N75K09O58Q76P2q78q90
53657B24993n12r36j863j848n90O28Q81P75J305K505L699M481M898M998M586L564
$$ plain form
53766 165696 162420 159767 158366 158887 161019 163477 165192 165993 166098 165694 165245 165415 166193 166785 166804 166770 166875
53749 166875 166340 164996 164582 166973 171616 176232 179800 183350 187832 192894 198032 203413 208904 213601 217049
53734 217049 219948 223066 226471 230395 235632 242214 248802 254470 260156 267131 274735 280968 284997 287788
53720 287788 290506 293475 296759 300584 304841 308961 312709 316472 320520 324338 326995 327868 327004 325144 323436
53705 323436 322616 322214 320890 317764 313250 308503 304471 301653 300352 300440 300860 299977 297020 293074 290172 289169
53689 289169 288887 287613 285116 282706 281480 281042 280020 277350 272823 266774 259739 252381 245447 239545 234855
53674 234855 231127 228106 225891 224629 223944 223166 222303 222170 223139 224371 224946 225155 225813 226689 226761 225883 224993
53657 224993 224481 223545 221682 219834 219244 219872 220753 221528 222833 225338 229037 233518 238416 243414 248000 251564
53641B51564K448K352L941O354P806P585O682O127N592M381K875J939J489Q54
53627C11989K44N47J785K830K838K091J348J040J151J340J197Q19Q00J200J101
53612C32320J6r78o12O75J469J660K355L597L902K498N50n33p50p94p48n26p07
53595C43394j822l107k929o00K736N048N073L147O81j109k015k534l089l725m122
53580C35027l649j796R33L026L409K571J716J300J032P63M38k86j333j556o4K079
53564C43610K766J499j18n50K31J592L150M401M641L881K950K408K226K648M155
53549C79490O066O605N170L482L550N327P201Q082Q038P542P096P305Q358R530
53535D72842R840R134Q052P211O897P296Q394R691J0376R948Q560O863N582M937
$$ plain form
53641 251564 254012 256364 260305 266659 274465 282050 288732 294859 300451 304832 307707 309646 311135 311989
53627 311989 312233 312780 314565 317395 320233 322324 323672 324712 325863 327203 328400 329219 330019 331219 332320
53612 332320 332336 331358 330746 331421 332890 334550 336905 340502 344404 346902 347452 346919 346169 345375 344627 344101 343394
53595 343394 341572 338465 335536 334936 337672 342720 347793 350940 351621 350512 348497 345963 342874 339149 335027
53580 335027 331378 329582 330515 333541 336950 339521 341237 342537 343569 344332 344770 344484 343151 341595 341531 343610
53564 343610 346376 347875 347757 347207 347438 349030 352180 356581 361222 365103 368053 370461 372687 375335 379490
53549 379490 385556 392161 397331 400813 404363 409690 416891 424973 433011 440553 447649 454954 463312 472842
53535 472842 482682 491816 499868 507079 513976 521272 529666 539357 549733 559681 568241 575104 580686 585623
53521E85623M507L884L461L994N459O881P522P646P800P843P148N542L672K523
53507F63505K526L093L214K768K773L814M843M396K733J509J479J789J710J734
53493G01886K302K651J734l51k474l411k470l0K100K003l6j574j081J47K19m16
53477G01199J27J934K902J748j08l11J726M535O435O956O761O672O974P462Q027
53462G63039Q971J0576J2617J4589J6301J8006J9813K1241K1523K0592J9607K0124
53450I66999K2479K5309K7043K7599K8078K9267L1138L3538L6276L8510L9270
53439A305506L8966L9291M1156M3619M5505M7018M8985N1290N3112N4137N4479
53428A823064N4011N2820N2025N2731N4232N4518N2943N1204N1083N2191N2745
$$ plain form
53521 585623 590130 594014 597475 601469 606928 613809 621331 628977 636777 644620 651768 657310 660982 663505
53507 663505 666031 669124 672338 675106 677879 681693 686536 690932 693665 695174 696653 698442 700152 701886
53493 701886 704188 706839 708573 708222 705748 702337 699867 699837 701937 703940 703904 702330 701249 701396 701615 701199
53477 701199 701326 703260 706162 707910 707802 707491 709217 713752 720187 727143 733904 740576 747550 755012 763039
53462 763039 772010 782586 795203 809792 826093 844099 863912 885153 906676 927268 946875 966999
53450 966999 989478 1014787 1041830 1069429 1097507 1126774 1157912 1191450 1227726 1266236 1305506
53439 1305506 1344472 1383763 1424919 1468538 1514043 1561061 1610046 1661336 1714448 1768585 1823064
53428 1823064 1877075 1929895 1981920 2034651 2088883 2143401 2196344 2247548 2298631 2350822 2403567
53417B403567N1955N0604M9540M8738M8064M7956M8520M8516M6265M1698L6732
53406B922155L3279L1398K9807K7606K4878K1970J9019J6171J3688J1655R990
53395C161616Q675P641O346M046M51m118r065j3601j6902j8874k0696k3784k8181
53382C053554l2505l5593l7575l9291m1321m3646m5578m6063m4704m2756m2262
53371B602260m3921m6297m7425m6730m5141m3884m3305m2591m0605l7279l3939
53360B131143l1700k9989k7478k4141k1176j9026j6836j3969j0666o939k267K974
53348A929930P282J0067J2700J6553K1113K5114K8571L2411L6678M0501M3545
53337B204465M6353M9340N2300N4901N7019N8785O0651O3227O6575P0094P3403
$$ plain form
53417 2403567 2455522 2506126 2555666 2604404 2652468 2700424 2748944 2797460 2843725 2885423 2922155
53406 2922155 2955434 2986832 3016639 3044245 3069123 3091093 3110112 3126283 3139971 3151626 3161616
53395 3161616 3170291 3177932 3184278 3188324 3188775 3184657 3175592 3161991 3145089 3126215 3105519 3081735 3053554
53382 3053554 3021049 2985456 2947881 2908590 2867269 2823623 2778045 2731982 2687278 2644522 2602260
53371 2602260 2558339 2512042 2464617 2417887 2372746 2328862 2285557 2242966 2202361 2165082 2131143
53360 2131143 2099443 2069454 2041976 2017835 1996659 1977633 1960797 1946828 1936162 1929223 1926956 1929930
53348 1929930 1937212 1947279 1959979 1976532 1997645 2022759 2051330 2083741 2120419 2160920 2204465
53337 2204465 2250818 2300158 2352458 2407359 2464378 2523163 2583814 2647041 2713616 2783710 2857113
53326B857113P6845Q0720Q4699Q8420R1839R4545R5784R6053R7473J01335J06063
53315C870889J09105J10186J10914J11644J10933J08320J05574J04133J02922
53306D844620J00070R5675R1257Q7071Q1740P4700O7482O1773N7154N1826M5110
53295E658478L8136L1982K6073J8892R774m77j0374j8749k5477l1663l8885m7860
53283E609850n8143o9172q0715r1742j00118j04759j07389j10491j13968j15582
53273D657771j14668j13313j13358j14022j13580j11880j09961j08229j06290
53264C652470j03923j01188r7928r4089r0227q6942q4085q0967p7079p2272o6763
53253B697007o1241n6445n2337m8215m3710l9018l4195k9216k4756k1629j9319
$$ plain form
53326 2857113 2933958 3014678 3099377 3187797 3279636 3374181 3469965 3566018 3663491 3764826 3870889
53315 3870889 3979994 4090180 4201094 4312738 4423671 4531991 4637565 4741698 4844620
53306 4844620 4944690 5040365 5131622 5218693 5300433 5375133 5442615 5504388 5561542 5613368 5658478
53295 5658478 5696614 5728596 5754669 5773561 5783335 5782858 5772484 5753735 5728258 5696595 5657710 5609850
53283 5609850 5551707 5482535 5401820 5310078 5209960 5105201 4997812 4887321 4773353 4657771
53273 4657771 4543103 4429790 4316432 4202410 4088830 3976950 3866989 3758760 3652470
53264 3652470 3548547 3447359 3349431 3255342 3165115 3078173 2994088 2913121 2836042 2763770 2697007
53253 2697007 2635766 2579321 2526984 2478769 2435059 2396041 2361846 2332630 2307874 2286245 2266926
53242B266926j6330j2262q133m431o71K591L560K192J467L894Q328J1898J3750
53229B272779J4998J6236J7262J8477K0458K2712K4545K6610K9753L3073L5087
53218B531990L6310L8536M1849M4524M5757M6369M6721M6156M4820M4001M3961
53207C010994M3319M1334L9118L7761L6684L4810L2077K8869K5075K0782J6972
53196C367795J4452J2626J0251P048L825J083j920o550j3231k0586k6553l0645
53184C317595l4470l9469m4848m8837n1331n3884n7247o0393o2031o1909o0506
53173B742670n8673n7652n8070n8732n7696n4876n2224n1062n0641m9928m9235
53162B143881m9105m8913m7842m6373m5509m5181m4577m3643m2926m2174m0361
$$ plain form
53242 2266926 2250596 2238334 2230201 2225770 2225099 2227690 2231250 2233442 2234909 2238803 2247131 2259029 2272779
53229 2272779 2287777 2304013 2321275 2339752 2360210 2382922 2407467 2434077 2463830 2496903 2531990
53218 2531990 2568300 2606836 2648685 2693209 2738966 2785335 2832056 2878212 2923032 2967033 3010994
53207 3010994 3054313 3095647 3134765 3172526 3209210 3244020 3276097 3304966 3330041 3350823 3367795
53196 3367795 3382247 3394873 3405124 3412172 3415997 3417080 3415160 3408610 3395379 3374793 3348240 3317595
53184 3317595 3283125 3243656 3198808 3149971 3098640 3044756 2987509 2927116 2865085 2803176 2742670
53173 2742670 2683997 2626345 2568275 2509543 2451847 2396971 2344747 2293685 2243044 2193116 2143881
53162 2143881 2094776 2045863 1998021 1951648 1906139 1860958 1816381 1772738 1729812 1687638 1647277
53151A647277l7467l5015l4138l3805l2057k8798k6218k5888k6592k6161k4802
53140A316336k4752k6640k8262k7840k6549k6248k6332k4938k2336k0724k1040
53129A040675k2143k3072k3914k4345k3594k2398k2792k4988k6518k5557k3403
53118G77951k2232k1932k0883j8773j6838j5772j5032j4174j3582j3711j4379
53107E90643j5034j5252j4921j4207j3302j2114j0608r302q851r047r031q670
53095D50304q708r135q563o195l554k962m610o358o434n311m490m421m434m277
53081C70852m628n697o211m828k286r65j923l519l614k254j139j112j433j112
53067C30131Q8J816L309L574K410J022P90J602K342K525K471K356K354L095M673
$$ plain form
53151 1647277 1609810 1574795 1540657 1506852 1474795 1445997 1419779 1393891 1367299 1341138 1316336
53140 1316336 1291584 1264944 1236682 1208842 1182293 1156045 1129713 1104775 1082439 1061715 1040675
53129 1040675 1018532 995460 971546 947201 923607 901209 878417 853429 826911 801354 777951
53118 777951 755719 733787 712904 694131 677293 661521 646489 632315 618733 605022 590643
53107 590643 575609 560357 545436 531229 517927 505813 495205 485903 477052 468005 458974 450304
53095 450304 441596 432461 423898 417703 414149 411187 406577 400219 393785 388474 383984 379563 375129 370852
53081 370852 366224 360527 354316 349488 347202 346237 344314 340795 337181 334927 333788 332676 331243 330131
53067 330131 330219 332035 335344 338918 341328 342350 343140 344742 347084 349609 352080 354436 356790 359885 364558
53052C64558N724N128M026M300N445N281L582K398K514K198L53j611k343k778
53038C98775m230o170p402p998q537q773q471q239q294p787o602o217p192p687
53024B95176o322m817n391o865o158l051n55p08k438l939m777n033m415l144k297
53009B35266k305k254j371k93j17q51j456j045L41J835K388J533k86k179l349
52994B25857l242j842j56L78m02j008l76N39J69j303k276j976j134o59p81j425
52978B10363k309k789k517k068k033j847o73Q43J091k26j641j979j652j540j666
52963A89357j508q65K6O35K80j221k860l172j865j60N96L2j441l050l807l122
52947A67855j633n99k42M42J961L293L208J905N92m1j67M3P11J597J803P10r60
$$ plain form
53052 364558 370282 375410 379436 383736 389181 394462 398044 400442 402956 405154 405507 403896 401553 398775
53038 398775 394545 388375 380973 372975 364438 355665 347194 338955 330661 322874 316272 310055 302863 295176
53024 295176 288854 284037 278646 271781 265623 262572 262017 261309 258871 254932 250155 245122 240707 237563 235266
53009 235266 232961 230707 229336 229043 228926 228075 226619 225574 225915 227750 230138 231671 231385 229206 225857
52994 225857 222615 220773 220617 220995 220593 219585 219209 219748 219917 218614 216338 214362 213228 212569 211788 210363
52978 210363 208054 205265 202748 200680 198647 196800 196127 196970 198061 197835 196194 194215 192563 191023 189357
52963 189357 187849 186984 187010 187645 187925 186704 183844 180672 178807 178647 179243 179275 177834 174784 170977 167855
52947 167855 166222 165623 165381 165823 167784 171077 174285 176190 176782 176741 176574 176617 177328 178925 180728 181438 180478
52930A80478j462K18L049M715L878J344r26j616p01R98K389K628J823J081J476
52915A99372K988M641N477N219M453M336N563P300P880P014O327O986P894P480
52901B82930O291O083O828O550M300J449m40j492k437l052k810k180k081k557
52887B97382k963l264m169n923p600p903o482m382l151l409m382m923m714m087
52873B30030l036j373K04K39j625l658l687j547P42J139n18k719l905l738l006
52858B03542k456j946q82O30J547J083k34j101r42l73p4K08J045K074K203J205
52842B05529K76L95P37k62k478l967l398j661m30j1N42J656K624K655J846R40
52826B04993N67Q71J541K043J934J087k72j622k344k182j414l66J024K803M410
$$ plain form
52930 180478 179016 179234 182283 186998 190876 192220 191294 189678 188977 189975 192364 194992 196815 197896 199372
52915 199372 202360 207001 212478 217697 222150 226486 232049 239349 247229 254243 260570 267556 275450 282930
52901 282930 289221 295304 302132 308682 312982 314431 313991 312499 310062 307010 304200 302020 299939 297382
52887 297382 294419 291155 286986 281063 273463 265560 259078 254696 251545 248136 243754 238831 234117 230030
52873 230030 226994 225621 225825 226064 224439 220781 217094 215547 216289 217428 216910 214191 210286 206548 203542
52858 203542 201086 199140 198258 198888 200435 201518 201284 200183 199241 198868 198794 199002 200047 202121 204324 205529
52842 205529 205805 206200 206937 206675 204197 200230 196832 195171 194741 194730 195272 196928 199552 202207 204053 204993
52826 204993 205560 206431 207972 210015 211949 213036 212764 211142 208798 206616 205202 204836 205860 208663 213073
52811B13073N055M537L148J052j367k840k196k2J785K354K467K733K668K124K023
52796B36594K813L494L199K462K011J695J594K595M437M858K583r5%K676N059
52781B75975N836O267P213P800P373O601O003N168L940K706J147j475m287m989
52767C25278k994p51q82l213n720p139p539p222o448n759n603n715n469m574l276
52752B52974k171j896k512l221l272l021l216l509k926j734j368k237l045k871
52738B15975k582l262m457m870l953k071J08J612J415m07k293k800k085j341j332
52723A87657j951k600k497j288J80M40q58k460l194l097k530j406o8K92o77j384
52707A64559l15J574J984M38j260j618j006m48k34l44j038k202k795j957l51M04
$$ plain form
52811 213073 218128 222665 225813 226865 225498 222658 220462 220440 222225 224579 227046 229779 232447 234571 236594
52796 236594 239407 242901 246100 248562 250573 252268 253862 256457 260894 265752 268335 268240 268240 270916 275975
52781 275975 281811 288078 295291 303091 310464 317065 323068 328236 332176 334882 336029 334554 330267 325278
52767 325278 322284 321533 320651 317438 311718 304579 297040 289818 283370 277611 272008 266293 260824 256250 252974
52752 252974 250803 248907 246395 243174 239902 236881 233665 230156 227230 225496 224128 221891 218846 215975
52738 215975 213393 210131 205674 200804 196851 194780 194888 196500 197915 197508 195215 192415 190330 188989 187657
52723 187657 185706 183106 180609 179321 179501 179941 179083 176623 173429 170332 167802 166396 166328 166620 165943 164559
52707 164559 164244 165818 167802 168240 166980 165362 164356 163908 163674 163330 162292 160090 157295 155338 154987 155391
52691A55391l91j844k754k773k094q48M64N89j163l471m211l231k564l266l839
52676A23995k763j077o55j159p77P05J787J871J734J350k72k566l052n99K723
52661A21245M197L448J957Q51L50K75J43m69j028n51O98J292Q82O69J110R81k23
52644A35827r16J54J855K639K935L773M527M207L813M925O786P093N431L626K797
52629A89472K242J542J639L065M574M463K436m08k820m342n284o004o138n143
52615A79294l676l417m903o658p265p031o451m681j360J363J046j483l150k864
52601A28764k333k717l096k688k277k539k768k230j343p04k57N2M9J34R89K099
52585A09135K109J116Q61J962K651J332j193l028l427k631r74N82M01j769l652
$$ plain form
52691 155391 155000 153156 150402 147629 145535 144687 145151 145740 144577 141106 136895 133664 131100 127834 123995
52676 123995 121232 120155 119500 118341 117564 118269 120056 121927 123661 125011 124739 122173 119121 118522 121245
52661 121245 125442 128890 130847 131698 132048 132323 132466 131997 130969 130418 131116 132408 133290 133959 135069 136050 135827
52644 135827 134911 135065 136920 139559 142494 146267 150794 155001 158814 163739 170525 177618 183049 186675 189472
52629 189472 191714 193256 194895 197960 202534 206997 209433 209025 206205 201863 196579 190575 184437 179294
52615 179294 175618 172201 167298 160640 153375 146344 139893 135212 133852 135215 136261 134778 131628 128764
52601 128764 126431 123714 120618 117930 115653 113114 110346 108116 106773 106069 105812 105864 105913 106047 107036 109135
52585 109135 111244 112360 113221 115183 117834 119166 117973 114945 111518 108887 107913 108495 108896 107127 103475
52570A03475k997n25J171J085N42P48J273J172L77m89r67j020p80k81O41J911
52554A05336K769K336R62K04R06J984J850M87p44r77o33m84o23m80M90K017K890
52537A18290K117L57n66J11J244J563J282J127R14K47k09L33J142P97n11r95J96
52520A27439J792K130J130R5J68J274K285K222J533J667K860L259J443j003j193
52505A47101J042K903K630J690K115L480L914K844J219j13q86q41oP35M79m64
52489A67842j015o78K83J549K718K970J928N54J59O67Q57J88o54q98m11O43J777
52472A78479J984P58p30q04K99O77l78j377j016Q4Q53J333J617P86j495l464l198
52455A74408j360j81k62k37N73J185Q99M69O79J172J379J493J790J881J404P61
$$ plain form
52570 103475 100478 99953 101124 102209 102751 103499 104772 105944 106321 105832 104865 103845 103065 102784 103425 105336
52554 105336 108105 110441 111403 111607 112513 114497 116347 116834 116090 115113 114480 113996 113373 112893 113383 115400 118290
52537 118290 120407 120764 120198 120309 121553 123116 124398 125525 126439 126686 126477 126810 127952 128749 128238 127243 127439
52520 127439 129231 131361 132491 132586 132754 134028 136313 138535 140068 141735 144595 147854 149297 148294 147101
52505 147101 148143 151046 153676 155366 157481 160961 164875 167719 168938 168825 167939 167098 167092 167827 168306 167842
52489 167842 166827 166149 166432 167981 170699 173669 175597 176151 176310 176977 177834 178022 177368 176470 176059 176702 178479
52472 178479 180463 181221 180491 179687 179986 180663 180285 178908 177892 177976 178829 180162 181779 182565 181070 177606 174408
52455 174408 173048 172867 172605 172368 172941 174126 175025 175494 176173 177345 178724 180217 182007 183888 185292 186053
52439A86053N65P96R89Q48M20j2m0L96O81K54m89q30j018j809k703k160J7J902
52421A83860J879O19k84n56q24r21rJ837L418L770K995J843J073R78J039L81r03
52404B00195j456l97J328K162J908J428R30q6j265j283M20K734M183M411M090
52389B19302L962M320M838M708L323J012j159k366k517k000j419j426k217l172
52375B25189l521l204k644j893p52L32M64m43j425j745j820k337k994k774j393
52360A99040l6k69k157l707k836J14K527K582J358J102K195L106K887K210J852
52345B09968J541Q40L4m80q33j116q78J42J313J817J726J863K730L930M453L479
52329B30529J220r99j926j652j149p16L01K008L255L082K064J477J636J849J687
$$ plain form
52439 186053 186618 187414 188403 189251 189671 189659 189619 190015 190696 190950 190461 189631 188613 186804 184101 181941 181958 183860
52421 183860 185739 186358 186074 185518 184694 183773 183764 185601 189019 192789 195784 197627 198700 199678 200717 201098 200195
52404 200195 198739 198342 199670 201832 203740 205168 206098 206012 204747 203464 203884 206618 210801 215212 219302
52389 219302 223264 227584 232422 237130 240453 241465 240306 237940 235423 233423 232004 230578 228361 225189
52375 225189 221668 218464 215820 213927 213175 213507 213971 213528 212103 210358 208538 206201 203207 200433 199040
52360 199040 199004 198735 196578 192871 190035 190149 192676 195258 196616 197718 199913 203019 205906 208116 209968
52345 209968 211509 212349 212383 211903 211070 209954 209076 209218 210531 212348 214074 215937 218667 222597 227050 230529
52329 230529 231749 230750 228824 227172 226023 225307 225608 227616 230871 233953 236017 237494 239130 240979 242666
$$ [...]
##END NTUPLES=NMR SPECTRUM
##END=
