##TITLE=coffee_type TORI02-ROVE100C_80-20%
COFFEE_meoh_noesyp64 COFFEE_meoh {C:\Bruker\TOPSPIN} Administrator 5
##JCAMPDX= 6.0         $$ Bruker NMR JCAMP-DX V2.0
##DATA TYPE= NMR SPECTRUM
##DATA CLASS= NTUPLES
##ORIGIN= Bruker BioSpin GmbH
##OWNER= Administrator
$$ 1.72 TOPSPIN		Version 2.1
$$ 2012-05-18 15:43:56.261 -0700  Administrator@X
$$ Compression mode = diff/dup
##.OBSERVE FREQUENCY= 400.13188235
##.OBSERVE NUCLEUS= ^1H
##.ACQUISITION MODE= SIMULTANEOUS (DQD)
##.ACQUISITION SCHEME= undefined
##.AVERAGES= 64
##.DIGITISER RES= 22
##SPECTROMETER/DATA SYSTEM= spect
##.PULSE SEQUENCE= noesygpps1d.comp
##.SOLVENT NAME= COFFEE_meoh
##.SHIFT REFERENCE= INTERNAL, COFFEE_meoh, 1, 14.98061
##AUDIT TRAIL= $$ (NUMBER, WHEN, WHO, WHERE, PROCESS, VERSION, WHAT)
$$ ##TITLE= Audit trail, TOPSPIN		Version 2.1
$$ ##JCAMPDX= 5.01
$$ ##ORIGIN= Bruker BioSpin GmbH
$$ ##OWNER= Administrator
$$ $$ C:\Bruker\TOPSPIN/data/Administrator/nmr/12-COFFEE-2302/62/pdata/1/auditp.txt
$$ ##AUDIT TRAIL=  $$ (NUMBER, WHEN, WHO, WHERE, PROCESS, VERSION, WHAT)
(   1,<2012-02-23 20:49:24.547 -0500>,<Administrator>,<TOPSPIN>,<go>,<TOPSPIN 2.1>,
      <created by zg
	started at 2012-02-23 20:37:54.234 -0500,
	POWCHK enabled, PULCHK disabled,
       configuration hash MD5:
       B0 76 FB 9C 50 81 44 7D 18 B3 26 32 4E 60 AD 96
       data hash MD5: 64K
       2B E3 E0 A2 D2 E5 A5 64 E4 9A 05 35 5E 8E 49 7B>)
(   2,<2012-02-23 20:49:28.000 -0500>,<Administrator>,<TOPSPIN>,<proc1d>,<TOPSPIN 2.1>,
      <Start of raw data processing
       efp LB = 0.3 FT_mod = 6 PKNL = 1 PHC0 = 0 PHC1 = 0 SI = 128K 
       data hash MD5: 128K
       B0 2A 9E 96 4D 31 35 5E FF DC D3 1D B3 EE B4 61>)
(   3,<2012-02-23 20:49:29.312 -0500>,<Administrator>,<TOPSPIN>,<proc1d>,<TOPSPIN 2.1>,
      <pk PHC0 = 24.36768 PHC1 = 0 
       data hash MD5: 128K
       29 56 B5 68 4B 31 F0 06 4F 30 E4 ED 21 C4 80 88>)
(   4,<2012-02-23 20:49:29.562 -0500>,<Administrator>,<TOPSPIN>,<proc1d>,<TOPSPIN 2.1>,
      <abs ABSG = 1 
       data hash MD5: 128K
       6D F1 F2 20 F2 0B FB 14 15 2D 9A FA 25 D3 38 4D>)
(   5,<2012-02-23 20:49:29.641 -0500>,<Administrator>,<TOPSPIN>,<proc1d>,<TOPSPIN 2.1>,
      <abs ABSG = 2 
       data hash MD5: 128K
       41 E6 9D C5 FD CF 00 5A 4E 03 A6 42 51 94 C4 0D>)
(   6,<2012-02-23 20:49:29.750 -0500>,<Administrator>,<TOPSPIN>,<proc1d>,<TOPSPIN 2.1>,
      <abs ABSG = 3 
       data hash MD5: 128K
       9D B5 8D 6B D9 85 B1 96 7E 52 AC A0 FB 30 94 36>)
(   7,<2012-02-23 20:49:29.922 -0500>,<Administrator>,<TOPSPIN>,<proc1d>,<TOPSPIN 2.1>,
      <abs ABSG = 4 
       data hash MD5: 128K
       A6 0D 76 16 B3 13 CF 70 6C EE 1A 36 25 D2 F2 E6>)
(   8,<2012-02-23 20:49:29.984 -0500>,<Administrator>,<TOPSPIN>,<proc1d>,<TOPSPIN 2.1>,
      <abs ABSG = 5 
       data hash MD5: 128K
       98 3A 03 E8 F1 38 0E 2F 7D 33 3F 6D 25 04 63 C2>)
(   9,<2012-02-23 20:49:30.109 -0500>,<Administrator>,<TOPSPIN>,<audit>,<TOPSPIN 2.1>,
      <user comment:
       ICON-NMR User ID: Administrator
$$ [...]
150 150 150 150 150 150 150 150
##$TP07= 0
##$TPNAME0= <>
##$TPNAME1= <>
##$TPNAME2= <>
##$TPNAME3= <>
##$TPNAME4= <>
##$TPNAME5= <>
##$TPNAME6= <>
##$TPNAME7= <>
##$TPOAL= (0..7)
0.5 0.5 0.5 0.5 0.5 0.5 0.5 0.5
##$TPOFFS= (0..7)
0 0 0 0 0 0 0 0
##$TUNHIN= 0
##$TUNHOUT= 0
##$TUNXOUT= 0
##$USERA1= <user>
##$USERA2= <user>
##$USERA3= <user>
##$USERA4= <user>
##$USERA5= <user>
##$V9= 5
##$VALIST= <valist>
##$VCLIST= <CCCCCCCCCCCCCCC>
##$VD= 0
##$VDLIST= <DDDDDDDDDDDDDDD>
##$VPLIST= <PPPPPPPPPPPPPPP>
##$VTLIST= <TTTTTTTTTTTTTTT>
##$WBST= 1024
##$WBSW= 4
##$XGAIN= (0..3)
0 0 0 0
##$XL= 0
##$YL= 0
##$YMAX_a= 14606480
##$YMIN_a= -6671558
##$ZGOPTNS= <>
##$ZL1= 120
##$ZL2= 120
##$ZL3= 120
##$ZL4= 120
##$ABSF1= 14.98061
##$ABSF2= -5.57192
##$ABSG= 5
##$ABSL= 3
##$ALPHA= 0
##$AQORDER= 0
##$ASSFAC= 0
##$ASSFACI= 0
##$ASSFACX= 0
##$ASSWID= 0
##$AUNMP= <proc_prof1d_extract>
##$AXLEFT= 0
##$AXNAME= <>
##$AXNUC= <1H>
##$AXRIGHT= 0
##$AXTYPE= 0
##$AXUNIT= <>
##$AZFE= 0.1
##$AZFW= 0.1
##$BCFW= 0
##$BC_mod= 0
##$BYTORDP= 0
##$COROFFS= 0
##$CY= 15
##$DATMOD= 1
##$DC= 0
##$DFILT= <>
##$DTYPP= 0
##$F1P= 0
##$F2P= 0
##$FCOR= 0.5
##$FTSIZE= 131072
##$FT_mod= 6
##$GAMMA= 0
##$GB= 0
##$INTBC= 1
##$INTSCL= 1
##$ISEN= 128
##$LB= 0.3
##$LEV0= 0
##$LPBIN= 0
##$MAXI= 10000
##$MC2= 0
##$MEAN= 0
##$ME_mod= 0
##$MI= 0
##$NCOEF= 0
##$NC_proc= -3
##$NLEV= 6
##$NOISF1= 0
##$NOISF2= 0
##$NSP= 0
##$NTH_PI= 0
##$NZP= 0
##$OFFSET= 14.98061
##$PC= 1
##$PHC0= 24.36768
##$PHC1= 0
##$PH_mod= 1
##$PKNL= yes
##$PPARMOD= 0
##$PPDIAG= 0
##$PPIPTYP= 0
##$PPMPNUM= 2147483647
##$PPRESOL= 1
##$PSCAL= 4
##$PSIGN= 0
##$PYNMP= <proc.py>
##$REVERSE= no
##$SF= 400.13
##$SI= 131072
##$SIGF1= 0
##$SIGF2= 0
##$SINO= 400
##$SIOLD= 131072
##$SPECTYP= <>
##$SREGLST= <1H.CDCl3>
##$SSB= 0
##$STSI= 131072
##$STSR= 0
##$SW_p= 8223.68421052632
##$SYMM= 0
##$S_DEV= 0
##$TDeff= 65536
##$TDoff= 0
##$TI= <>
##$TILT= no
##$TM1= 0
##$TM2= 0
##$TOPLEV= 0
##$USERP1= <user>
##$USERP2= <user>
##$USERP3= <user>
##$USERP4= <user>
##$USERP5= <user>
##$WDW= 1
##$XDIM= 131072
##$YMAX_p= 527243138
##$YMIN_p= -234413797
##$CURPLOT= <Network HP LaserJet P1505>
##$CURPRIN= <$Network HP LaserJet P1505>
##$DFORMAT= <normdp>
##$LAYOUT= <+/1D_H.xwp>
##$LFORMAT= <normlp>
##$PFORMAT= <normpl>
##$SURQMSG= 1
$$ End of Bruker specific parameters
$$ ---------------------------------
##NTUPLES= NMR SPECTRUM
##VAR_NAME=  FREQUENCY,     SPECTRUM/REAL,   SPECTRUM/IMAG
##SYMBOL=    X,             R,               I
##VAR_TYPE=  INDEPENDENT,   DEPENDENT,       DEPENDENT
##VAR_FORM=  AFFN,          ASDF,            ASDF
##VAR_DIM=   131072,        131072,          131072
##UNITS=     HZ,            ARBITRARY UNITS, ARBITRARY UNITS
##FACTOR=    0.0627417313425165, 1,          1
##FIRST=     8223.62146879498, 952,          -94928
##LAST=      0,             5224,            -94485
##MIN=       0,             -234413797,      0
##MAX=       8223.62146879498, 527243138,    0
$$ Real data points
##PAGE= N=1
##DATA TABLE= (X++(R..R)), XYDATA
$$ [...]
62941B427128j4102o794j117M018R589J5120J9930K4322K8696L2554L5216L6803
$$ 2427128 2413026 2406232 2405115 2409133 2418722 2433842 2453772 2478094 2506790 2539344 2574560 2611363
62929B611363L7662L7671L6781L5528L4211L2140K8532K3773J9211J5954J4056
$$ 2611363 2649025 2686696 2723477 2759005 2793216 2825356 2853888 2877661 2896872 2912826 2926882
62918B926882J2269Q542J699p075j5359k2401k9723l8419m7366n5035o1564o7752
$$ 2926882 2939151 2947693 2949392 2942317 2926958 2904557 2874834 2836415 2789049 2734014 2672450 2604698
62906B604698p3098p6390p7511p7243p5924p3668p1274o9389o7143o3185n7793
$$ 2604698 2531600 2455210 2377699 2300456 2224532 2150864 2079590 2010201 1943058 1879873 1822080
62895A822080n2577m8254m4155l9850l5829l2458k9547k7134k5525k4341k2728
$$ 1822080 1769503 1721249 1677094 1637244 1601415 1568957 1539410 1512276 1486751 1462410 1439682
62884A439682k0728j9343j8919j8625j7831j7029j6878j7196j7389j7131j6302
$$ 1439682 1418954 1399611 1380692 1362067 1344236 1327207 1310329 1293133 1275744 1258613 1242311
62873A242311j4981j3765j3370j3609j3531j2831j2289j2500j2989j2978j2269
$$ 1242311 1227330 1213565 1200195 1186586 1173055 1160224 1147935 1135435 1122446 1109468 1097199
62862A097199j1042r601q647q863r685r508p807o121o006o890p112o427o014o336
$$ 1097199 1086157 1076556 1067909 1059046 1049361 1039853 1032046 1025925 1019919 1013029 1005917 999490 993476 987140
62848I87140o522o079n785o224o583n781m170l130l269l808l821l295k821k684
$$ 987140 980618 974539 968754 962530 955947 950166 945996 942866 939597 935789 931968 928673 925852 923168
62834I23168k612k214j542j283k262m428o386o482m632k645k336l631m932n015
$$ 923168 920556 918342 916800 915517 913255 908827 902441 895959 891327 888682 886346 882715 877783 872768
62820H72768m022k702j387O5J638K852L107K371J362P78L79n15j587j514M2J501
$$ 872768 868746 866044 864657 864722 866360 869212 872319 874690 876052 876830 877209 876694 875107 873593 873635 875136
62804H75136J424O23P90J726J710L45r36j333j620k198k210j398q72r87l79J451
$$ 875136 876560 877183 877973 879699 881409 881754 880818 879485 877865 875667 873457 872059 871187 870200 869821 871272
62788H71272K574J439m92j119j199k728m948n060k787j089j751k981k548j038
$$ 871272 873846 875285 874793 873674 872475 869747 864799 859739 856952 855863 854112 851131 848583 847545
62774H47545m34j127k002k453k791l205l460l411l059k426j833j870k714l881
$$ 847545 847111 845984 843982 841529 838738 835533 832073 828662 825603 823177 821344 819474 816760 812879
62760H12879m831n273m916l763k681k617l079k589j035j32q98k070k111j462j419
$$ 812879 808048 802775 797859 794096 791415 788798 785719 783130 782095 781963 781065 778995 776884 775422 774003
62745G74003j704q45J528M311O627Q481R806J0183R857R803J0567J1934J3867
$$ 774003 772299 771454 772982 777293 783920 792401 802207 812390 822247 832050 842617 854551 868418
62732H68418J6594J9358K0344J8881J6881J6966J9474K2442K4535K6754L0707
$$ 868418 885012 904370 924714 943595 960476 977442 996916 1019358 1043893 1070647 1101354
62721A101354L6040M0651M3277M4890M7278N0964N5097N8887O2355O5834O9456
$$ 1101354 1137394 1178045 1221322 1266212 1313490 1364454 1419551 1478438 1540793 1606627 1676083
62710A676083P3264P7135Q0364Q1955Q1736Q0792Q0215P9655P7483P2283O3810
$$ 1676083 1749347 1826482 1906846 1988801 2070537 2151329 2231544 2311199 2388682 2460965 2524775
62699B524775N2678L9657K5439J0766l558j6883k8991m0077n0350n9622o7491
$$ 2524775 2577453 2617110 2642549 2653315 2649757 2632874 2603883 2563806 2513456 2453834 2386343
62688B386343p3911p9202q3393q5993q6743q6180q4870q2322p7619p1227o5388
$$ 2386343 2312432 2233230 2149837 2063844 1977101 1890921 1806051 1723729 1646110 1574883 1509495
62677A509495o1923o0120n7720n3711m9195m5309m1590l7145l2580k9403k7906
$$ 1509495 1447572 1387452 1329732 1276021 1226826 1181517 1139927 1102782 1070202 1040799 1012893
62666A012893k6898k5510k3904k1964j8851j4685j1302j0040r656p844m372j154
$$ 1012893 985995 960485 936581 914617 895766 881081 869779 859739 850083 842239 837867 836713
62654H36713O00J641K956M305N196O127P842J0066J1973J3533J5536J8338K1289
$$ 836713 837313 838954 841910 846215 851411 857538 865380 875446 887419 900952 916488 934826 956115
62641I56115K3574K5247K7210L0294L4440L8800M2590M5717M8554N1455N4749
$$ 956115 979689 1004936 1032146 1062440 1096880 1135680 1178270 1223987 1272541 1323996 1378745
62630A378745N8825O3662O8307P1490P2753P2695P2082P1173O9736O7127O2276
$$ 1378745 1437570 1501232 1569539 1641029 1713782 1786477 1858559 1929732 1999468 2066595 2128871
62619B128871N4375M3705L1531J9016O718n033j6114k7017l8411m9870n9749o6803
$$ 2128871 2183246 2226951 2258482 2277498 2284216 2279183 2263069 2236052 2197641 2147771 2088022 2021219
62607B021219p1404p4705p7176p8488p8385p6957p4242p0242o5397o0700n7121
$$ 2021219 1949815 1875110 1797934 1719446 1641061 1564104 1489862 1419620 1354223 1293523 1236402
62596A236402n4759n2494m8857m3750l9035l6589l5802l4109l0261k5885k3117
$$ 1236402 1181643 1129149 1080292 1036542 997507 960918 925116 891007 860746 834861 811744
62585H11744k1790k0187j7883j6374j6878j8679j9892j9231j6784j3775j1717
$$ 811744 789954 769767 751884 735510 718632 699953 680061 660830 644046 630271 618554
62574F18554j1297j1806j1932j1039r480p833o431n476m851l882k027K6P50m34
$$ 618554 607257 595451 583519 572480 563000 555167 548736 543260 538409 534527 532500 532526 533276 532842
62560E32842k405l701l853k960q59K179M588M767L292K567L818N539N732M624
$$ 532842 530437 526736 522883 519923 519064 521243 525831 530598 533890 536457 540275 545814 551546 556170
62546E56170M106N073O764Q482J0365J2218J3103J2955J3268J5042J7001J7378
$$ 556170 560276 565349 572113 580595 590960 603178 616281 629236 642504 657546 674547 691925
62534F91925J6802J7712K0996K4944K7870L0118L2693L5334L7201L8595M0612
$$ 691925 708727 726439 747435 772379 800249 830367 863060 898394 935595 974190 1014802
62523A014802M3386M5758M6602M5631M3061L9276L4805K9887K4117J7223J0017
$$ 1014802 1058188 1103946 1150548 1196179 1239240 1278516 1313321 1343208 1367325 1384548 1394565
62512A394565L669j942q081j5137k1848k7035l1112l4993l8347m0072l9967l8805
$$ 1394565 1398234 1396292 1388211 1373074 1351226 1324191 1293079 1258086 1219739 1179667 1139700 1100895
62500A100895l6935l4071l0564k7699k6290k5852k5534k5025k4152k2640k0918
$$ 1100895 1063960 1029889 999325 971626 945336 919484 893950 868925 844773 822133 801215
62489H01215k0224k0950k1764k1359k0242j9424j8180j5043j0651p555o847p058
$$ 801215 780991 760041 738277 716918 696676 677252 659072 644029 633378 625823 618976 611918
62477F11918o841o727p086o447l673l24J182Q85P67J593K419K984M296O492Q120
$$ 611918 605077 598350 591264 584817 581144 580820 582002 582887 583654 585247 587666 590650 594946 601438 609558
62462F09558Q406Q571R968J2073J3389J3497J3333J4010J6046J9238K2611K5024
$$ 609558 617964 626535 636503 648576 661965 675462 688795 702805 718851 738089 760700 785724
62450G85724K6361K7691K9834L2392L4644L6684L8943M1084M2278M2371M1966
$$ 785724 812085 839776 869610 902002 936646 973330 1012273 1053357 1095635 1138006 1179972
62439A179972M1356L9928L6903L2255K6776K1237J5611R280K113m974j0992j6197
$$ 1179972 1221328 1261256 1298159 1330414 1357190 1378427 1394038 1403318 1405431 1400457 1389465 1373268
62427A373268k1698k7717l2919l5771l6071l4826l3244l2127l1661l1160k9523
$$ 1373268 1351570 1323853 1290934 1255163 1219092 1184266 1151022 1118895 1087234 1056074 1026551
62416A026551k6460k3090k0774j9610j8497j6604j4229j2203j0796r415p412n007
$$ 1026551 1000091 977001 956227 936617 918120 901516 887287 875084 864288 854873 847461 842454
62404H42454l164k362j919r80J40M84J99O72K578M793N926O166O669P651Q202
$$ 842454 839290 836928 835009 834029 834169 834653 834852 835524 838102 842895 848821 854987 861656 869307 877509
62389H77509P870P411P643Q349Q728Q474P784O535M147M53l695p197r902j2544
$$ 877509 885379 892790 900433 908782 917510 925984 933768 940303 944450 944903 941208 934011 924109 911565
62375I11565j5358j7398j7708j6766j6099j6549j7459j7601j6316j3705j0323
$$ 911565 896207 878809 861101 844335 828236 811687 794228 776627 760311 746606 736283
62364G36283p103n203n253o576p391o194l101L09K777M588O559Q268Q521P627
$$ 736283 729180 723977 718724 712148 704757 698563 695462 695771 698548 703136 709695 717963 726484 734111
62350G34111P682R792J2421J3564J3436J3411J3430J2407J0734J0075J0581J0411
$$ 734111 741793 751585 764006 777570 791006 804417 817847 830254 840988 851063 861644 872055
62338H72055Q493O016M344L155J514m72k128l305m158m551m434m122l668k698
$$ 872055 880548 886564 890908 894063 895577 895105 892977 889672 885514 880963 876529 872407 868739 866041
62324H66041j272nJ003K358M153N753P229R681J3413J7162J9953K2471K5653K9220
$$ 866041 864769 864764 865767 868125 872278 878031 885260 894941 908354 925516 945469 967940 993593 1022813
62310A022813L2643L6368M0835M5327M9106N2658N6609O0419O3575O6935P1187
$$ 1022813 1055456 1091824 1132659 1177986 1227092 1279750 1336359 1396778 1460353 1527288 1598475
62299A598475P4882P5898P4288P1825O9045O4693N7966M9398L9395K7783J5235
$$ 1598475 1673357 1749255 1823543 1895368 1964413 2029106 2087072 2136470 2175865 2203648 2218883
62288B218883L514o406j5158k3359l0342l5311l8817m2233m6278n0565n4157n6169
$$ 2218883 2222397 2215991 2200833 2177474 2147132 2111821 2073004 2030771 1984493 1933928 1879771 1823602
62276A823602n6261n4859n2693n0090m7122m4211m1890l9960l7623l4572l1295
$$ 1823602 1767341 1712482 1659789 1609699 1562577 1518366 1476476 1436516 1398893 1364321 1333026
62265A333026k8201k5260k2638k0894k0046j9108j7090j4158j1339r313p928o762
$$ 1333026 1304825 1279565 1256927 1236033 1215987 1196879 1179789 1165631 1154292 1144979 1137051 1130289
62253A130289n779n238n204n367n523n934o899q085q727q575q151p962p939p846
$$ 1130289 1124510 1119272 1114068 1108701 1103178 1097244 1090345 1082260 1073533 1064958 1056807 1048845 1040906 1033060
62239A033060p674p344o527n155l736k882k752k989k762j061K164N216O121N159
$$ 1033060 1025386 1018042 1011515 1006360 1002624 999742 996990 994001 991239 990178 992342 997558 1003679 1008838
62225A008838M729O298Q772J0438J1161J1681J2122J2458J3326J5057J6807J7920
$$ 1008838 1013567 1019865 1028637 1039075 1050236 1061917 1074039 1086497 1099823 1114880 1131687 1149607
62213A149607J9208K1419K3444K3818K3291K4050K6766L0220L3649L7582M2195
$$ 1149607 1168815 1190234 1213678 1237496 1260787 1284837 1311603 1341823 1375472 1413054 1455249
62202A455249M6538M9868N2549N5352N8832O3258O8050P1402P1730O9500O6336
$$ 1455249 1501787 1551655 1604204 1659556 1718388 1781646 1849696 1921098 1992828 2062328 2128664
62191B128664O2425N6222M6819L5291K3357J1892R85r512j9733k9309l7344m3658
$$ 2128664 2191089 2247311 2294130 2329421 2352778 2364670 2365655 2356143 2336410 2307101 2269757 2226099
62179B226099m9482n5495n9862o0195n7202n4256n3115n2222m9688m5732m1295
$$ 2226099 2176617 2121122 2061260 2001065 1943863 1889607 1836492 1784270 1734582 1688850 1647555
62168A647555l6321l0705k5342k0924j7052j3678j1919j2060j2087r959o385l702
$$ 1647555 1611234 1580529 1555187 1534263 1517211 1503533 1491614 1479554 1467467 1457508 1451123 1447421
62156A447421k724k472k389k872l591l143j019J360K355K134K271L774O217Q609
$$ 1447421 1444697 1442225 1439836 1436964 1433373 1430230 1429211 1430571 1432926 1435060 1437331 1441105 1447322 1455931
62142A455931J0478J2009J3612J5705J8552K1859K4629K6113K6868K8228L0556
$$ 1455931 1466409 1478418 1492030 1507735 1526287 1548146 1572775 1598888 1625756 1653984 1684540
62131A684540L2943L4854L6927L9532M1773M2872M3375M3614M2293L8472L3992
$$ 1684540 1717483 1752337 1789264 1828796 1870569 1913441 1956816 2000430 2042723 2081195 2115187
62120B115187L1623L1141K9644K5794K1431J8568J7221J6929J8226K1220K4499
$$ 2115187 2146810 2177951 2207595 2233389 2254820 2273388 2290609 2307538 2325764 2346984 2371483
62109B371483K6865K8947L1935L5797L9632M2594M3688M1975L8069L4092L0983
$$ 2371483 2398348 2427295 2459230 2495027 2534659 2577253 2620941 2662916 2700985 2735077 2766060
62098B766060K7204K1316J4557R348O225L866J238j848n635j0059j3838j5524
$$ 2766060 2793264 2814580 2829137 2838485 2844710 2848576 2849814 2847966 2842331 2832272 2818434 2802910
62086B802910j5423j5182j5485j5365j3809j0982p624m215r26K090M608O294P107
$$ 2802910 2787487 2772305 2756820 2741455 2727646 2716664 2709040 2704825 2703899 2705989 2710597 2716891 2723998
62073B723998P937J0165J3829J6927J7569J6626J7109K0798K6304L0719L2647
$$ 2723998 2731935 2742100 2755929 2772856 2790425 2807051 2824160 2844958 2871262 2901981 2934628
62062B934628L3286L4714L7514M0328M1872M2812M4859M8268N1358N2692N2741
$$ 2934628 2967914 3002628 3040142 3080470 3122342 3165154 3210013 3258281 3309639 3362331 3415072
62051C415072N2841N3571N4755N6182N7502N8153N8106N8263N9411O1246O2878
$$ 3415072 3467913 3521484 3576239 3632421 3689923 3748076 3806182 3864445 3923856 3985102 4047980
62040D047980O3809O4123O4373O5428O7611O9768P0414P0015P0698P3136P5563
$$ 4047980 4111789 4175912 4240285 4305713 4373324 4443092 4513506 4583521 4654219 4727355 4802918
62029D802918P6872P8706Q2866Q8246R2524R5688R9479J04074J07923J10715J13779
$$ 4802918 4879790 4958496 5041362 5129608 5222132 5317820 5417299 5521373 5629296 5740011 5853790
62018E853790J17120J18402J16036J11493J07386J04569J02427J00942J00956
$$ 5853790 5970910 6089312 6205348 6316841 6424227 6528796 6631223 6732165 6833121
62009F833121J02508J04079J03638J00035R3535Q5425P7194O9741O3109N6880
$$ 6833121 6935629 7039708 7143346 7243381 7336916 7422341 7499535 7569276 7632385 7689265
61999G689265N0803M5047L9832L4725K8652K1093J3135O522J626k863p985j3364
$$ 7689265 7740068 7785115 7824947 7859672 7888324 7909417 7922552 7929074 7930700 7927837 7919852 7906488
61987G906488j8463k3722k9429l4457l7597l9461m1631m4139m5402m4702m3231
$$ 7906488 7888025 7864303 7834874 7800417 7762820 7723359 7681728 7637589 7592187 7547485 7504254
61976G504254m2158m0927l8359l4652l1345k9496k8669k7765k6354k4816k3400
$$ 7504254 7462096 7421169 7382810 7348158 7316813 7287317 7258648 7230883 7204529 7179713 7156313
61965G156313k1663j9238j6736j5205j4666j3955j2242r974p995o421m910l378
$$ 7156313 7134650 7115412 7098676 7083471 7068805 7054850 7042608 7032634 7024639 7018218 7013308 7009930
61953G009930j802J95K845N653P860R296J0304J1079J1518J1518J1160J0664J0182
$$ 7009930 7008128 7008323 7011168 7016821 7024681 7033977 7044281 7055360 7066878 7078396 7089556 7100220 7110402
61940G110402R249O706J836m504j0909j7492k5801l6392m7881n8719o8514p7027
$$ 7110402 7119651 7126357 7128193 7123689 7112780 7095288 7069487 7033095 6985214 6926495 6857981 6780954
61928F780954q3424q7470r0156r2110r2675r1538q9855q8586q7064q4663q2415
$$ 6780954 6697530 6610060 6519904 6427794 6335119 6243581 6153726 6065140 5978076 5893413 5810998
61917E810998q1288q0082p6998p2408o8158o4939o2195n9817n7784n4903n0204
$$ 5810998 5729710 5649628 5572630 5500222 5432064 5367125 5304930 5245113 5187329 5132426 5082222
61906E082222m5198m2345m1388l9714l6419l3511l2466l1968l0056k6623k2720
$$ 5082222 5037024 4994679 4953291 4913577 4877158 4843647 4811181 4779213 4749157 4722534 4699814
61895D699814j8987j5879j4089j3476j2450r557n073m26L488O869J0408J4639
$$ 4699814 4680827 4664948 4650859 4637383 4624933 4615376 4610303 4609877 4613365 4620234 4630642 4645281
61883D645281J9447K4068K7819L0687L2878L4446L6034L9099M4139M9355N2686
$$ 4645281 4664728 4688796 4716615 4747302 4780180 4814626 4850660 4889759 4933898 4983253 5035939
61872E035939N4694N7536O1469O4559O6029O7594P0820P5302Q0416Q7039R6157
$$ 5035939 5090633 5148169 5209638 5274197 5340226 5407820 5478640 5553942 5634358 5721397 5817554
61861E817554J07235J19418J33356J50442J71039J94519K20521K48991K79364
$$ 5817554 5924789 6044207 6177563 6328005 6499044 6693563 6914084 7163075 7442439
61852G442439L10718L42763L76208M12089M50743M91195N31790N72041O13574
$$ 7442439 7753157 8095920 8472128 8884217 9334960 9826155 10357945 10929986 11543560
61843A1543560O58256P05512P52174P94366Q27895Q46721Q42729Q07544P33884
$$ 11543560 12201816 12907328 13659502 14453868 15281763 16128484 16971213 17778757 18512641
61834A8512641O16238M53515K52919L0109j95718m06967n89532p33731q36202
$$ 18512641 19128879 19582394 19835313 19865422 19669704 19262737 18673205 17939474 17103272
61825A7103272r00014r31272r35747r18786q86027q42166p89953p31902o71954
$$ 17103272 16203258 15271986 14336239 13417453 12531426 11689260 10899307 10167405 9495451
61816I495451o13923n59231n07760m60079m17001l77696l40425l05141k73502
$$ 9495451 8881528 8322297 7814537 7354458 6937457 6559761 6219336 5914195 5640693
61807E640693k46118k21494j98127j76219j56494j38565j21327j04359q8113p3082
$$ 5640693 5394575 5173081 4974954 4798735 4642241 4503676 4382349 4277990 4189877 4116795
61797D116795n9335m6757l5263k4796j5350p034k3N649J0199J3908J6660J7865
$$ 4116795 4057460 4010703 3975440 3950644 3935294 3928260 3928237 3933886 3944085 3957993 3974653 3992518
61785C992518J7069J4539J0947O663J758l373p969j1480j3726j4527j3678j1343
$$ 3992518 4009587 4024126 4035073 4041736 4043494 4040121 4032152 4020672 4006946 3992419 3978741 3967398
61773C967398q042m175nM066P680J0801J3290J4438J3606J0947O826J022o451
$$ 3967398 3959356 3955181 3955176 3959242 3966922 3977723 3991013 4005451 4019057 4030004 4036830 4037852 4031401
61760D031401j4206k0394k4525k7127k7998k6454k3107j9512j5764j0329k598
$$ 4031401 4017195 3996801 3972276 3945149 3917151 3890697 3867590 3848078 3832314 3821985 3819387
61749C819387O159J4952K4364L4996M6401N8382P1550Q5602R8863J10680J22566
$$ 3819387 3825546 3840498 3864862 3899858 3946259 4004641 4076191 4161793 4260656 4371336 4493902
61738D493902J35713J49215J62215J76026J92174K09851K27530K45978K67467
$$ 4493902 4629615 4778830 4941045 5117071 5309245 5519096 5746626 5992604 6260071
61729F260071K92663L20465L50351L82960M18670M57473N00047N47340N99123
$$ 6260071 6552734 6873199 7223550 7606510 8025180 8482653 8982700 9530040 10129163
61720A0129163O54483P13370P76324Q43042R12902R86498J065006J148115J234087
$$ 10129163 10783646 11497016 12273340 13116382 14029284 15015782 16080788 17228903 18462990
61711A8462990J321298J407473J486876J549622J583755J576500J513745J381379
$$ 18462990 19784288 21191761 22678637 24228259 25812014 27388514 28902259 30283638
61703C0283638J169945Q79624N22674J23176k86238o71528j005547j272361j466314
$$ 30283638 31453583 32333207 32855881 32979057 32692819 32021291 31015744 29743383 28277069
61694B8277069j589457j649730j658532j627381j566155j483676j388216j286491
$$ 28277069 26687612 25037882 23379350 21751969 20185814 18702138 17313922 16027431
61686A6027431j183216j082016r85759q95597q11113p32454o61363n99219n44901
$$ 16027431 14844215 13762199 12776440 11880843 11069730 10337276 9675913 9076694 8531793
61677H531793m95734m50062m07994l70062l36161l05773k78446k53788k31328
$$ 8531793 8036059 7585997 7178003 6807941 6471780 6166007 5887561 5633773 5402445
61668E402445k10621j91511j74309j59472j46946j36125j26803j19736j15499
$$ 5402445 5191824 5000313 4826004 4666532 4519586 4383461 4256658 4136922 4021423
61659D021423j13124j10703j07335j03597j00110r6665r2843q8530q3519p7679
$$ 4021423 3908299 3797596 3690261 3586664 3486554 3389889 3297046 3208516 3124997 3047318
61649C047318p1884o7687o5375o3263n9814n5746n2976n1874n0714m7967m4237
$$ 3047318 2975434 2907747 2842372 2779109 2719295 2663549 2610573 2558699 2507985 2460018 2415781
61638B415781m1438m0438m0143l8983l6857l5101l4516l4205l2804l0222k7363
$$ 2415781 2374343 2333905 2293762 2254779 2217922 2182821 2148305 2114100 2081296 2051074 2023711
61627B023711k4584k1653j8955j7480j7304j7257j6523j5549j4816j3855j2296
$$ 2023711 1999127 1977474 1958519 1941039 1923735 1906478 1889955 1874406 1859590 1845735 1833439
61616A833439j0930j0510j0276r001p089o184o590o609n013k972k501l715m869
$$ 1833439 1822509 1811999 1801723 1792722 1785633 1779449 1772859 1766250 1761237 1758265 1755764 1752049 1747180
61603A747180m898m774n928q272j0421j1359j1098j0021q429o881o118o256o492
$$ 1747180 1742282 1737508 1731580 1723308 1712887 1701528 1690430 1680409 1671980 1665099 1658981 1652725 1646233
61590A646233n901m141j303K224N417O922O451N300M829M871M488L829M044N482
$$ 1646233 1640332 1636191 1634888 1637112 1642529 1649451 1655902 1661202 1666031 1670902 1675390 1679219 1683263 1688745
61576A688745P056P706P593P586Q291R861J2004J3894J4694J4538J4284J4009
$$ 1688745 1695801 1703507 1711100 1718686 1726977 1736838 1748842 1762736 1777430 1791968 1806252 1820261
61564A820261J2588R319N117J167k900q266j4530j9384k1157k0737k0312k0831
$$ 1820261 1832849 1842168 1847285 1848452 1845552 1837286 1822756 1803372 1782215 1761478 1741166 1720335
61552A720335k1520k1619k1476k1662k1826k1055j9179j7067j5664j5073j4663
$$ 1720335 1698815 1677196 1655720 1634058 1612232 1591177 1571998 1554931 1539267 1524194 1509531
61541A509531j3756j2258j0871j0543j1336j1943j0946q535o328n279m503k644
$$ 1509531 1495775 1483517 1472646 1462103 1450767 1438824 1427878 1419343 1413015 1407736 1403233 1400589
61529A400589K75L068N075O765Q713J0632J1799J2156J2624J4226J6813J8977
$$ 1400589 1400864 1403932 1409007 1415772 1424485 1435117 1446916 1459072 1471696 1485922 1502735 1521712
61517A521712J9609J9388K0223K3135K7336L1452L4945L7939M0431M2231M3328
$$ 1521712 1541321 1560709 1580932 1604067 1631403 1662855 1697800 1735739 1776170 1818401 1861729
61506A861729M3873M4249M5263M7595N0641N2723N2883N1611M9317M5342L9529
$$ 1861729 1905602 1949851 1995114 2042709 2093350 2146073 2198956 2250567 2299884 2345226 2384755
61495B384755L3625K9626K7449K5719K4250K3924K4396K3887K1626J8768J6344
$$ 2384755 2418380 2448006 2475455 2501174 2525424 2549348 2573744 2597631 2619257 2638025 2654369
61484B654369J3719R807M677p73n737r581j1934j3411j5278j7618j8859j7906
$$ 2654369 2668088 2677895 2682572 2681799 2676062 2666481 2654547 2641136 2625858 2608240 2589381 2571475
61472B571475j5854j4422j3458j1327p403k730J744O262J1075J5469J8968K2843
$$ 2571475 2555621 2541199 2527741 2516414 2509011 2506281 2508025 2514287 2525362 2540831 2559799 2582642
61460B582642K9102L7954M7264N5062O1874O9792P9652R0334J00859J11934J24625
$$ 2582642 2611744 2649698 2696962 2752024 2813898 2883690 2963342 3053676 3154535 3266469 3391094
61449C391094J38421J51835J64625J78262J94044K11606K29588K47072K64014
$$ 3391094 3529515 3681350 3845975 4024237 4218281 4429887 4659475 4906547 5170561
61440E170561K80632K96639L10860L21442L26650L25291L16088K97053K66341
$$ 5170561 5451193 5747832 6058692 6380134 6706784 7032075 7348163 7645216 7911557
61431G911557K23852J71620J12734N0665j0469o6321j13895j52486j82724k05107
$$ 7911557 8135409 8307029 8419763 8470428 8459959 8393638 8279743 8127257 7944533 7739426
61421G739426k19941k28030k30452k27571k19112k05592j89184j72406j55946
$$ 7739426 7519485 7291455 7061003 6833432 6614320 6408728 6219544 6047138 5891192
61412E891192j38544j19247r9209q0553o3905m8117l2304j6927k642J0741K3399
$$ 5891192 5752648 5633401 5534192 5453639 5389734 5341617 5309313 5292386 5289744 5300485 5323884
61401E323884L4660M4011N2178O0082O7308P2740P6211P8375P9342P8695P6735
$$ 5323884 5358544 5402555 5454733 5514815 5582123 5654863 5731074 5809449 5888791 5967486 6044221
61390F044221P4477P2463P0621O9233O8910O9554P0498P1614P3082P4104P3401
$$ 6044221 6118698 6191161 6261782 6331015 6399925 6469479 6539977 6611591 6684673 6758777 6832178
61379F832178P1274O9504O8507O6152O0598N3053M6271M0985L5247K7133J6815
$$ 6832178 6903452 6972956 7041463 7107615 7168213 7221266 7267537 7308522 7343769 7370902 7387717
61368G387717N793m918j5344k5749l5789m4647n1839n7481o1569o3430o2513n9408
$$ 7387717 7393510 7388592 7373248 7347499 7311710 7267063 7215224 7157743 7096174 7032744 6970231 6910823
61356F910823n5277n0438m4580l8336l3323k9970k6439k0605j2554m402J926N905
$$ 6910823 6855546 6805108 6760528 6722192 6688869 6658899 6632460 6611855 6599301 6594899 6596825 6602730
61344F602730P898Q350P536N545K474j026l623m201k885p59J588N067J1540K2113
$$ 6602730 6610628 6618978 6626514 6632059 6634533 6633507 6629884 6625683 6622798 6622039 6623627 6628694 6640234 6662347
61330F662347L5935N0881O5752Q1575J00207J21848J44634J66803J88466K10807
$$ 6662347 6698282 6749163 6814915 6896490 6996697 7118545 7263179 7429982 7618448 7829255
61320G829255K34249K58034K81211L03146L22881L38597L48198L50383L44675
$$ 7829255 8063504 8321538 8602749 8905895 9228776 9567373 9915571 10265954 10610629
61311A0610629L30155L04815K67013K17716J60472R8998L5794k6572q4463j35037
$$ 10610629 10940784 11245599 11512612 11730328 11890800 11989798 12025592 11999020 11914557 11779520
61301A1779520j78422k16608k50531k79646l03672l22829l36304l42557l41680
$$ 11779520 11601098 11384490 11133959 10854313 10550641 10227812 9891508 9548951 9207271
61292I207271l35923l27195l15671l01534k86477k72181k58451k44055k28574
$$ 9207271 8871348 8544153 8228482 7926948 7640471 7368290 7109839 6865784 6637210
61283F637210k12347j95399j77704j59876j42577j25572j08318r0974p3992n7194
$$ 6637210 6424863 6229464 6051760 5891884 5749307 5623735 5515417 5424443 5350451 5293257
61273E293257m0426k4621j1075K64J0736K1136L0859L8915M4970M9212N1897N3466
$$ 5293257 5252831 5228210 5217135 5217399 5228135 5249271 5280130 5319045 5364015 5413227 5465124 5518590
61261E518590N4496N5161N4940N3259N0281M6772M3274L9675L5743L1797K8487
$$ 5518590 5573086 5628247 5683187 5736446 5786727 5833499 5876773 5916448 5952191 5983988 6012475
61250F012475K5987K3842K1638J9255J6313J2179O963J645l520r918j8844k9409
$$ 6012475 6038462 6062304 6083942 6103197 6119510 6131689 6138652 6140297 6136777 6126859 6108015 6078606
61238F078606l9373m7538n4106n9316o3280o6874p0965p4713p6349p5744p4431
$$ 6078606 6039233 5991695 5937589 5878273 5814993 5748119 5677154 5602441 5526092 5450348 5375917
61227E375917p2923p0155o5968o1841n8119n2788m4537l5211k7384k1119j5061
$$ 5375917 5302994 5232839 5166871 5105030 5046911 4994123 4949586 4914375 4886991 4865872 4850811
61216D850811r437n732m082l134k301k289l318m434m850m808m944n483o096n950
$$ 4850811 4841374 4835642 4831560 4828426 4826125 4823836 4820518 4816084 4811234 4806426 4801482 4795999 4789903 4783953
61202D783953m192j047K052M107N829Q571J2719J8048K4869L3622M3942N5161
$$ 4783953 4779761 4778714 4780766 4784873 4790702 4799273 4811992 4830040 4854909 4888531 4932473 4987634
61190D987634O7261Q0279R3316J05367J16489J26933J35531J40282J40067J34490
$$ 4987634 5054895 5135174 5228490 5333857 5450346 5577279 5712810 5853092 5993159 6127649
61180F127649J22522J02847P5444M1541K400m0372q3557j23074j56214j81963
$$ 6127649 6250171 6353018 6428462 6470003 6472403 6432031 6348474 6225400 6069186 5887223
61170E887223j99572k08633k10653k08521k03791j96057j85456j73949j63128
$$ 5887223 5687651 5479018 5268365 5059844 4856053 4659996 4474540 4300591 4137463
61161D137463j52271j39939j26424j13342j01562r0833q1065p2549o5030n7614
$$ 4137463 3985192 3845253 3718829 3605487 3503925 3413092 3332027 3259478 3194448 3136834
61151C136834m9861m2335l5810l0370k5473k0556j5376j0025m879m21L256O837
$$ 3136834 3086973 3044638 3008828 2978458 2952985 2932429 2917053 2907028 2902149 2901728 2904984 2911821
61139B911821J1258J6464K1042K3642K4485K4708K4421K2509J8495J3380Q082
$$ 2911821 2923079 2939543 2960585 2984227 3008712 3033420 3057841 3080350 3098845 3112225 3120307
61128C120307K263m485j1187j6366j9757k2315k5011k8401l2600l6872m0013m2040
$$ 3120307 3122570 3118085 3106898 3090532 3070775 3048460 3023449 2995048 2962448 2925576 2885563 2843523
61116B843523m4584m8507n2187n3624n3270n2998n2993n1957m9950m8624m8332
$$ 2843523 2798939 2750432 2698245 2644621 2591351 2538353 2485360 2433403 2383453 2334829 2286497
61105B286497m7380m5045m3198m3581m4978m4695m2079l9076l7608l7433l6745
$$ 2286497 2239117 2194072 2150874 2107293 2062315 2017620 1975541 1936465 1898857 1861424 1824679
61094A824679l4171k9998k5623k2029j9179j6923j5818j6417j8250k0359k2421
$$ 1824679 1790508 1760510 1734887 1712858 1693679 1676756 1660938 1644521 1626271 1605912 1583491
61083A583491k4438k5731k5400k3600k1318j8995j6481j3992j1897r664o431k640
$$ 1583491 1559053 1533322 1507922 1484322 1463004 1444009 1427528 1413536 1401639 1391975 1385544 1382904
61071A382904L27K105L614N220O270O675P362Q698R956J0876J2241J4180J5505
$$ 1382904 1383231 1385336 1388950 1394170 1400440 1407115 1414477 1423175 1433131 1444007 1456248 1470428 1485933
61058A485933J5544J5206J5313J5303J4722J4535J5548J6607J6000J3901J1992
$$ 1485933 1501477 1516683 1531996 1547299 1562021 1576556 1592104 1608711 1624711 1638612 1650604
61047A650604J1095J0520R378P362M474J191j434k899m451p864j2976j7436j9237
$$ 1650604 1661699 1672219 1681597 1688959 1693433 1694624 1693190 1690291 1685840 1677976 1665000 1647564 1628327
61034A628327j8727j7764j7594j8073j8600j9079j9777k0603k1062k1035k1060
$$ 1628327 1609600 1591836 1574242 1556169 1537569 1518490 1498713 1478110 1457048 1436013 1414953
61023A414953k1545k1949k1371j9692j7616j5762j4273j3136j2208j1062r539
$$ 1414953 1393408 1371459 1350088 1330396 1312780 1297018 1282745 1269609 1257401 1246339 1236800
61012A236800q178p401o557m811k654j314p94J13J836L440M231M540M614M218
$$ 1236800 1228622 1221221 1214664 1209853 1207199 1205885 1205091 1205204 1207040 1210480 1214711 1219251 1223865 1228083
60998A228083L737M132N223N589M809M291N013O032O230O022O137O193N812N898
$$ 1228083 1231820 1235952 1241175 1246764 1251573 1255864 1260877 1266909 1273139 1279161 1285298 1291491 1297303 1303201
60984A303201P214Q834R546R861J1019J2914J4638J6324J8684K1231K2757K3255
$$ 1303201 1310415 1319249 1328795 1338656 1349675 1362589 1377227 1393551 1412235 1433466 1456223 1479478
60972A479478K3769K4474K4469K3514K2616K2731K3874K5467K6734K6951K6186
$$ 1479478 1503247 1527721 1552190 1575704 1598320 1621051 1644925 1670392 1697126 1724077 1750263
60961A750263K5415K5273K5369K5583K6962K9941L2766L3537L3131L4169L7483
$$ 1750263 1775678 1800951 1826320 1851903 1878865 1908806 1941572 1975109 2008240 2042409 2079892
60950B079892M1607M5489M9644N4465N9363O3974O8625P3479P8783Q5794R5506
$$ 2079892 2121499 2166988 2216632 2271097 2330460 2394434 2463059 2536538 2615321 2701115 2796621
60939B796621J06375J15520J22715J30990J42555J56253J70121J84359K00175
$$ 2796621 2902996 3018516 3141231 3272221 3414776 3571029 3741150 3925509 4125684
60930D125684K17226K33873K49161K63339K77281K92332L09896L30581L54731
$$ 4125684 4342910 4576783 4825944 5089283 5366564 5658896 5968792 6299373 6654104
60921F654104L84114M21395M67168N19154N75139O34922O98589P65631Q37683
$$ 6654104 7038218 7459613 7926781 8445935 9021074 9655996 10354585 11120216 11957899
60912A1957899R19808J016792J130108J260777J412592J589373J791836K021827
$$ 11957899 12877707 13894499 15024607 16285384 17697976 19287349 21079185 23101012
60904B3101012K287590K599742K964239L383561L851932M318825M642036M606936
$$ 23101012 25388602 27988344 30952583 34336144 38188076 42506901 47148937 51755873
60896E1755873M052028L017596J770232O58248p7290l76724l05517J1257L83959
$$ 51755873 55807901 58825497 60595729 61253977 61176687 60799963 60494446 60505703 60889662
60887F0889662N49873K63546n45247j697987k867630l768411m277230m423129
$$ 60889662 61439535 61703081 61157834 59459847 56592217 52823806 48546576 44123447
60879D4123447m307448m037989l699971l346828l001926k671477k358882k068666
$$ 44123447 39815999 35778010 32078039 28731211 25729285 23057808 20698926 18630260
60871A8630260j803459j564167j352976j172320j021433q96719p94530p10899
$$ 18630260 16826801 15262634 13909658 12737338 11715905 10819186 10024656 9313757
60863I313757o40060n76983n20903m73280m32822l95683l60225l27949k99512
$$ 9313757 8673697 8096714 7575811 7102531 6669709 6274026 5913801 5585852 5286340
60854E286340k73309k48776k27863k11891j99515j88985j79969j71929j63079
$$ 5286340 5013031 4764255 4536392 4324501 4124986 3936001 3756032 3584103 3421024
60845C421024j52603j41867j31932j21853j11024j01196r4067q8456q1981p4454
$$ 3421024 3268421 3126554 2994622 2872769 2761745 2660549 2566482 2478026 2396045 2321591
60835B321591o7510o1774n6457n1217m6473m2179l7849l3726l0605k8703k7735
$$ 2321591 2254081 2192307 2135850 2084633 2038160 1995981 1958132 1924406 1893801 1865098 1837363
60824A837363k7671k8321k8740k8177k7212k6847k7077k7522k8586l0560l2214
$$ 1837363 1809692 1781371 1752631 1724454 1697242 1670395 1643318 1615796 1587210 1556650 1524436
60813A524436l1986l0295k9071k9070k9083k7770k5021k1560j8250j5719j3735
$$ 1524436 1492450 1462155 1433084 1404014 1374931 1347161 1322140 1300580 1282330 1266611 1252876
60802A252876j1371q686p302p893q250n837j606J199J680K161M355P401J0262
$$ 1252876 1241505 1232819 1225517 1217624 1209374 1203537 1201931 1203130 1204810 1206971 1211326 1218727 1228989
60789A228989J3429J7001J9448J9820J9417J9759K0440K0429K0065K0178K0459
$$ 1228989 1242418 1259419 1278867 1298687 1318104 1337863 1358303 1378732 1398797 1418975 1439434
60778A439434K0291K0154K0532K0285J7970J4295J1684J1439J2558J3204J2199
$$ 1439434 1459725 1479879 1500411 1520696 1538666 1552961 1564645 1576084 1588642 1601846 1614045
60767A614045R290N136J162j396k472k784k766k537k470l049m348o296r144j2941
$$ 1614045 1623335 1628471 1629633 1628237 1625765 1622981 1620215 1617678 1615208 1612159 1607811 1601515 1592371 1579430
60753A579430j6854j9802k1569k2606k2940k2143k0429j8865j8253j8154j7367
$$ 1579430 1562576 1542774 1521205 1498599 1475659 1453516 1433087 1414222 1395969 1377815 1360448
60742A360448j5173j1980q833o370m353k293k22J550L114M792O362P389Q299J0154
$$ 1360448 1345275 1333295 1324462 1318092 1313739 1311446 1311224 1312774 1315888 1320680 1327042 1334431 1342730 1352884
60728A352884J3059J5773J7257J7751J7795J7273J6116J5033J4584J4207J3073
$$ 1352884 1365943 1381716 1398973 1416724 1434519 1451792 1467908 1482941 1497525 1511732 1524805
60717A524805J1414J0162R630R263Q444O933N009L798M749P969J1401J2566J1003
$$ 1524805 1536219 1546381 1556011 1565274 1573718 1580651 1585660 1589458 1594207 1602176 1613577 1626143 1637146
60704A637146Q450O950P325Q962J0379J0234Q472O295M661L337J857O16K78O17
$$ 1637146 1645596 1652546 1659871 1668833 1679212 1689446 1697918 1704213 1708874 1712211 1714068 1714684 1714962 1715579
60690A715579R63J230J597J605P28n22j110j028j296k430l876n081o225p615r110
$$ 1715579 1716542 1717772 1719369 1720974 1721702 1721180 1720070 1719042 1717746 1715316 1711440 1706359 1700134 1692519 1683409
60675A683409j0431j1489j2153j2079j1054r422q054p866r000j0468j1069j0861
$$ 1683409 1672978 1661489 1649336 1637257 1626203 1616781 1608727 1600861 1591861 1581393 1570324 1559463
60663A559463j0982j1771j2025j0932r758j0281j2067j2864j1712j0172r925j0369
$$ 1559463 1548481 1536710 1524685 1513753 1503995 1493714 1481647 1468783 1457071 1446899 1436974 1426605
60651A426605r556o994m424l727m750n702n382m258l279k453j424p05j129k268
$$ 1426605 1417049 1410055 1405631 1401904 1397154 1391452 1386070 1381812 1378533 1376080 1374656 1373951 1372822 1370554
60637A370554k866k852l459n013o397p307r170j2544j5426j5928j5199j5526j6646
$$ 1370554 1367688 1364836 1361377 1356364 1349967 1342660 1333490 1320946 1305520 1289592 1274393 1258867 1242221
60624A242221j6434j4728j3826j4910j6384j6448j5312j3871j1937r082o096m157
$$ 1242221 1225787 1211059 1197233 1182323 1165939 1149491 1134179 1120308 1108371 1099289 1093193 1089036
60612A089036l142j855L07K657M115M406M321M951O459P877Q349Q283Q550Q950
$$ 1089036 1085894 1084039 1084346 1087003 1091118 1095524 1099845 1104796 1111255 1119132 1127481 1135764 1144314 1153264
60598A153264Q506P222O427O975P998Q096P159O394O843Q330R899J0983J1953
$$ 1153264 1161770 1168992 1175419 1182394 1190392 1198488 1205647 1212041 1218884 1227214 1237113 1248096 1260049
60585A260049J3334J4657J4761J3481J2290J2617J4094J5251J5542J5756J6694
$$ 1260049 1273383 1288040 1302801 1316282 1328572 1341189 1355283 1370534 1386076 1401832 1418526
60574A418526J8290J9852K0504J9618J7624J6072J6079J6980J7266J6455J5042
$$ 1418526 1436816 1456668 1477172 1496790 1514414 1530486 1546565 1563545 1580811 1597266 1612308
60563A612308J3116J0234O540K740r60m834q483j0948j2062j2865j4354j6462
$$ 1612308 1625424 1635658 1642198 1644938 1643978 1639144 1630661 1619713 1607651 1594786 1580432 1563970
60551A563970j8203j8353j6431j3674j2196j2257j1365p660l079r77j257m97L154
$$ 1563970 1545767 1527414 1510983 1497309 1485113 1472856 1461491 1453831 1450752 1449775 1448518 1448021 1451175
60538A451175P772J0747J1538J0675Q540O292N708O619O512M152J724J720L422
$$ 1451175 1458947 1469694 1481232 1491907 1500447 1506739 1512447 1519066 1525578 1529730 1531454 1533174 1536596
60525A536596M407L991L214K522J715J340K064L077K911J564K01q46k131l488
$$ 1536596 1541003 1544994 1548208 1550730 1552445 1553785 1555849 1558926 1561837 1563401 1563602 1562756 1560625 1557137
60511A557137m009l529k795k366k604m202p139r530r500q104q311j0866j3057
$$ 1557137 1553128 1549599 1546804 1544438 1541834 1537632 1530493 1520963 1511463 1503359 1495048 1484182 1471125
60498A471125j2391r721p753p775q881r437q287n260j420J753L973O294R234J1843
$$ 1471125 1458734 1449013 1441260 1433485 1424604 1415167 1406880 1401620 1400200 1401953 1405926 1412220 1421454 1433297
60484A433297J3401J4997J8144K2479K6199K8574L0741L3987L8451M3690M9451
$$ 1433297 1446698 1461695 1479839 1502318 1528517 1557091 1587832 1621819 1660270 1703960 1753411
60473A753411N5357O0815O5906P1598P8157Q3772Q5718Q2763P5602O4952N0413
$$ 1753411 1808768 1869583 1935489 2007087 2085244 2169016 2254734 2337497 2413099 2478051 2528464
60462B528464L1912J1585o739k0012k7538l0485l0455k8494k4751j8701j0052
$$ 2528464 2560376 2571961 2565222 2545210 2517672 2487187 2456732 2428238 2403487 2384786 2374734
60451B374734K92J0474J9025K5656L0657L3941L5309L5326L5307L6146L7630L9220
$$ 2374734 2375026 2385500 2404525 2430181 2460838 2494779 2530088 2565414 2600721 2636867 2674497 2713717
60439B713717M1314M5159N1493N9773O9147P9746R2462J07625J24716J43414J64010
$$ 2713717 2755031 2800190 2851683 2911456 2980603 3060349 3152811 3260436 3385152 3528566 3692576
60428C692576J86390K09399K31890K53776K75407K96562L17100L38177L61531
$$ 3692576 3878966 4088365 4320255 4574031 4849438 5146000 5463100 5801277 6162808
60419F162808L87629M15636M45390M77948N12994N45620N65956N61945N23472
$$ 6162808 6550437 6966073 7411463 7889411 8402405 8948025 9513981 10075926 10599398
60410A0599398M45858L31295J87631K5974j40811k98741m34514n38706o07871
$$ 10599398 11045256 11376551 11564182 11590156 11449345 11150604 10716090 10177384 9569513
60401I569513o43793o51306o36705o06746n67537n23697m78457m34073l91713
$$ 9569513 8925720 8274414 7637709 7030963 6463426 5939729 5461272 5027199 4635486
60392D635486l51489l13301k77720k45755k17831j93405j71740j52745j36796
$$ 4635486 4283997 3970696 3692976 3447221 3229390 3035985 2864245 2711500 2574704
60383B574704j23777j12556j01838r1412q2129p4464o7771o1348n5626n1462m8664
$$ 2574704 2450927 2338371 2236533 2145121 2062992 1988528 1920757 1859409 1803783 1752321 1703657
60372A703657m6040m2811l9168l5598l2487l0236k8835k7388k4967k1943j9490
$$ 1703657 1657617 1614806 1575638 1540040 1507553 1477317 1448482 1421094 1396127 1374184 1354694
60361A354694j7821j6057j3961j2467j2126j2247j1972j1071r296o382l384k372
$$ 1354694 1336873 1320816 1306855 1294388 1282262 1270015 1258043 1246972 1237676 1231294 1227910 1225538
60349A225538l682m908m038k285k060l282l865l250k870l085k247K70K395K288
$$ 1225538 1221856 1216948 1212910 1210625 1208565 1205283 1201418 1198168 1195298 1192213 1189966 1190236 1192631 1194919
60335A194919J300K091M682O459N969M736M748N734N995M949L537K505J551K92
$$ 1194919 1196219 1198310 1202992 1209451 1215420 1220156 1224904 1230638 1236633 1241582 1245119 1247624 1249175 1249467
60321A249467r44j781k501l559m835n933o787p377p141n475k819o62j40r73j908
$$ 1249467 1248523 1246742 1244241 1240682 1235847 1229914 1223127 1215750 1208609 1203134 1200315 1199653 1199513 1198540 1196632
60306A196632j987j333r58j724l308m296l519j158J678M107N774O366N625L968
$$ 1196632 1194645 1193312 1192354 1190630 1187322 1183026 1179507 1178349 1180027 1184134 1189908 1196274 1201899 1205867
60292A205867K515K234L168M514N272N078M615M997O426P903Q569Q833R522J0410
$$ 1205867 1208382 1210616 1213784 1218298 1223570 1228648 1233263 1238260 1244686 1252589 1261158 1269991 1279513 1289923
60278A289923J0489R520Q429Q052Q091P465N430K479K70J55J498K229J516R33
$$ 1289923 1300412 1309932 1318361 1326413 1334504 1341969 1347399 1349878 1350148 1350303 1351801 1354030 1355546 1356479
60264A356479K111M353N827O213O431O499N441L134N04j975m245n377m339k106
$$ 1356479 1358590 1362943 1368770 1374983 1381414 1387913 1393354 1396488 1396992 1395017 1390772 1385395 1381056 1378950
60250A378950j035j850l104l941n071o399o077l258K9J366Q85M29J048K674N029
$$ 1378950 1377915 1376065 1372961 1369020 1363949 1357550 1351473 1348215 1348244 1349610 1350495 1350924 1351972 1354646 1359675
60235A359675P423Q584Q049P066O988P608Q118Q716R954J1177J0987R082O634
$$ 1359675 1367098 1375682 1383731 1390797 1397785 1405393 1413511 1422227 1432181 1443358 1454345 1463427 1470061
60222A470061N040M856N645O446O790P300Q513R284P961N365M709P569J1675J4005
$$ 1470061 1475101 1479957 1485602 1492048 1498838 1506138 1514651 1523935 1531896 1537261 1541970 1549539 1561214 1575219
60208A575219J4595J5720J8549K2326K6021K9222L1855L4279L7173M0525M3563
$$ 1575219 1589814 1605534 1624083 1646409 1672430 1701652 1733507 1767786 1804959 1845484 1889047
60197A889047M6322N0112N5396O0659O4682O8606P4134Q0973Q7756R4383J01585
$$ 1889047 1935369 1985481 2040877 2101536 2166218 2234824 2308958 2389931 2477687 2572070 2673655
60186B673655J09140J16529J24497J33869J43499J51424J57573J63322J68741
$$ 2673655 2782795 2899324 3023821 3157690 3301189 3452613 3610186 3773508 3942249
60177C942249J72422J73812J73638J71986J67848J60731J51001J38695J23724
$$ 3942249 4114671 4288483 4462121 4634107 4801955 4962686 5113687 5252382 5376106
60168E376106J07229R0807P4145N5442L4677J4735j613j4526k5986l6814m5617
$$ 5376106 5483335 5574142 5648287 5703729 5738406 5753141 5751528 5737002 5711016 5674202 5628585
60157E628585n0200m9697m5340l9069l1266k0619o717Q442K2663L6154N0444O5775
$$ 5628585 5578385 5528688 5483348 5444279 5413013 5392394 5385677 5394119 5416782 5452936 5503380 5569155
60145E569155Q1348R7226J13759J29677J42964J53446J62188J68460J69826J65570
$$ 5569155 5650503 5747729 5861488 5991165 6134129 6287575 6449763 6618223 6788049 6953619
60135F953619J57790J48282J36374J20531J00447P6942N1457K6174K944j8557
$$ 6953619 7111409 7259691 7396065 7516596 7617043 7693985 7745442 7771616 7774560 7756003
60125G756003m0015o1356q0138r4521j04814j11391j13250j09908j02968r4244
$$ 7756003 7715988 7654632 7574494 7479973 7375159 7263768 7150518 7040610 6937642 6843398
60115F843398q3636p0120n3752l5403j5669M876K5279M5209O5268Q5223J02907
$$ 6843398 6759762 6689642 6635890 6600487 6584818 6589694 6614973 6660182 6725450 6810673 6913580
60104F913580J16068J24483J29174J30347J27194J19206J06682R0492P2196N3694
$$ 6913580 7029648 7154131 7283305 7413652 7540846 7660052 7766734 7857226 7929422 7983116
60094G983116L5959J8706K001j2560k3113k9127l0822k7935k0210q539N724K2287
$$ 7983116 8019075 8037781 8039782 8027222 8004109 7974982 7944160 7916225 7896015 7887476 7893200 7915487
60082G915487M1870O4854R0839J19113J48670J78159K06913K36027K67459L01817
$$ 7915487 7957357 8022211 8113050 8232163 8380833 8558992 8765905 9001932 9269391 9571208
60072I571208L37588L72618M05810M37198M66823M93897N17030N35075N47383
$$ 9571208 9908796 10281414 10687224 11124422 11591245 12085142 12602172 13137247 13684630
60063A3684630N53120N50729N38560N15856M82671M39264L86480L26499K62015
$$ 13684630 14237750 14788479 15327039 15842895 16325566 16764830 17151310 17477809 17739824
60054A7739824J94309J23032M8144k8792j05480j79957k50247l13872l68496m12601
$$ 17739824 17934133 18057165 18105309 18076517 17971037 17791080 17540833 17226961 16858465 16445864
60044A6445864m45053m64760m71348m65795m49784m24726l91815l52721l09740
$$ 16445864 16000811 15536051 15064703 14598908 14149124 13724398 13332583 12979862 12670122
60035A2670122k65162k20442j75687j30236q4196l9283K358L9770P2863J00851
$$ 12670122 12404960 12184518 12008831 11878595 11794399 11755116 11757474 11797244 11870107 11970958
60025A1970958J22216J36119J42703J41737J32187J13581Q7023N4619J8675j8412
$$ 11970958 12093174 12229293 12371996 12513733 12645920 12759501 12846524 12901143 12919818 12901406
60015A2901406n4566q8748j20749j50231j76699k00126k20432k36581k47508k53914
$$ 12901406 12846840 12758092 12637343 12487112 12310413 12110287 11889855 11653274 11405766 11151852
60005A1151852k57648k59209k57371k51289k41297k27597k10300j91177j73017
$$ 11151852 10894204 10634995 10377624 10126335 9885038 9657441 9447141 9255964 9082947
59996I082947j56090j37468j15148r0815o7020m3688j9550M743K7552M9262P1629
$$ 9082947 8926857 8789389 8674241 8583426 8516406 8472718 8453168 8457911 8485463 8534725 8606354
59985H606354R4372J14704J30364J41301J48121J50536J47804J39378J24869J04370
$$ 8606354 8700726 8815430 8945794 9087095 9235216 9385752 9533556 9672934 9797803 9902173
59975I902173P9173N1261K1913q531l9641p0487j00138j27667j51552j70002j82293
$$ 9902173 9981346 10032607 10054520 10045989 10006348 9935861 9835723 9708056 9556504 9386502 9204209
59964I204209j89350j92691j92934j89229j80066j64964j45529j24410j03163
$$ 9204209 9014859 8822168 8629234 8440005 8259939 8094975 7949446 7825036 7721873
59955G721873q1706n9941l8567j7658M279K8477N3957P8823J02944J27774J53517
$$ 7721873 7640167 7580226 7541659 7524001 7528280 7556757 7610714 7689537 7792481 7920255 8073772
59944H073772J78012J98859K15546K28903K39107K44759K43650K34260K16829
$$ 8073772 8251784 8450643 8666189 8895092 9134199 9378958 9622608 9856868 10073697
59935A0073697J93201J65412J34398J00271O3614K6099j0465m5439p9435j12690
$$ 10073697 10266898 10432310 10566708 10666979 10730593 10756692 10746227 10700788 10621353 10508663
59925A0508663j43361j68072j84620j93598j96654j93879j84395j69118j51040
$$ 10508663 10365302 10197230 10012610 9819012 9622358 9428479 9244084 9074966 8923926
59916H923926j32200j11955q9093o4072l8196j1866J4796M0520O3653Q3964J02472
$$ 8923926 8791726 8679771 8590678 8526606 8488410 8476544 8491340 8531860 8595513 8679477 8781949
59905H781949J19681J35015J47651J57010J62638J64527J63387J59899J53935
$$ 8781949 8901630 9036645 9184296 9341306 9503944 9668471 9831858 9991757 10145692
59896A0145692J45096J33680J20535J06490R2540Q0115P0290O3131N8499N7130
$$ 10145692 10290788 10424468 10545003 10651493 10744033 10824148 10894438 10957569 11016068 11073198
59886A1073198O0275O8575Q1950J00175J22986J49957J80886K15843K54309K94866
$$ 11073198 11133473 11202048 11283998 11384173 11507159 11657116 11838002 12053845 12308154 12603020
59876A2603020L36233L78011M19848M60487M98126N30846N56056N70420N71217
$$ 12603020 12939253 13317264 13737112 14197599 14695725 15226571 15782627 16353047 16924264
59867A6924264N56895N25669M74862M03038L12160K06609R1147k8948j46960k56140
$$ 16924264 17481159 18006828 18481690 18884728 19196888 19403497 19494644 19465696 19318736 19062596
59857A9062596l52058m32362m94954n38129n62246n69463n61795n40950n09852
$$ 19062596 18710538 18278176 17783222 17245093 16682847 16113384 15551589 15010639 14500787
59848A4500787m72293m30504l84567l34829k83538k33332j85124j38311r2353
$$ 14500787 14028494 13597990 13213423 12878594 12595056 12361724 12176600 12038289 11945936
59839A1945936m7383l895L7387P5407J09162J38270J62983J83323J97964K04219
$$ 11945936 11898553 11894658 11932045 12007452 12116614 12254884 12417867 12601190 12799154 13003373
59829A3003373J99655J83710J57008J19354O9868R685n6947j25183j92103k55663
$$ 13003373 13203028 13386738 13543746 13663100 13732968 13742653 13685706 13560523 13368420 13112757
59819A3112757l12735l60080l96504m22312m37376m41583m36600m25051m08175
$$ 13112757 12800022 12439942 12043438 11621126 11183750 10742167 10305567 9880516 9472341
59810I472341l86250l61089l35593l10497k84043k55658k27758k02673j79904
$$ 9472341 9086091 8725002 8389409 8078912 7794869 7539211 7311453 7108780 6928876
59801F928876j58132j38379j23123j13042j06496j01840r8648r6696r5153r3076
$$ 6928876 6770744 6632365 6509242 6396200 6289704 6187864 6089216 5992520 5897367 5804291
59791E804291q9842q4892p7893o9399o0597n2094m3523l4781k7177k2734k2374
$$ 5804291 5714449 5629557 5551664 5482265 5421668 5369574 5326051 5291270 5264093 5241359 5218985
59780E218985k5369l0540l7448m5935n4938o2580o7608p0195p1105p0499o7811
$$ 5218985 5193616 5163076 5125628 5079693 5024755 4962175 4894567 4824372 4753267 4682768 4614957
59769D614957o2487n4654m5311l5978k7616j9803j1360j849Q163J8260K8668L9281
$$ 4614957 4552470 4497816 4452505 4416527 4388911 4369108 4357748 4355899 4364062 4382322 4410990 4450271
59757D450271M9276N8247O6963P6314Q6187R5899J04819J11883J15568J15337
$$ 4450271 4499547 4557794 4624757 4701071 4787258 4883157 4987976 5099859 5215427 5330764
59747E330764J12261J07135R8872Q6222P0716N6262M5797L9318L5140L2074L0160
$$ 5330764 5443025 5550160 5649032 5735254 5805970 5862232 5908029 5947347 5982487 6014561 6044721
59736F044721L0070L2058L5444L9518M5199N4914P0076Q9348J10303J32097J55544
$$ 6044721 6074791 6106849 6142293 6181811 6227010 6281924 6352000 6441348 6551651 6683748 6839292
59725F839292J81255K08890K37901K67921K98694L30484L64104L99498M34649
$$ 6839292 7020547 7229437 7467338 7735259 8033953 8364437 8728541 9128039 9562688
59716I562688M66490M91717N05265M98934M63908L95606K96228J74064M1984q4778
$$ 9562688 10029178 10520895 11026160 11525094 11989002 12384608 12680836 12854900 12896884 12812106
59706A2812106j92968k75547l31761l63701l74153l67108l47834l21053k89526
$$ 12812106 12619138 12343591 12011830 11648129 11273976 10906868 10559034 10237981 9948455
59697I948455k54505k16689j76874j36617r8210o3063l0451J073L1581O0451Q8493
$$ 9948455 9693950 9477261 9300387 9163770 9065560 9002497 8972046 8973119 9004700 9065151 9153644
59686I153644J17396J47169J76056K03297K30300K58710K88950L21065L55331
$$ 9153644 9271040 9418209 9594265 9797562 10027862 10286572 10575522 10896587 11251918
59677A1251918L91347M27964M64824N02822N42612N83889O26639O71693P19318
$$ 11251918 11643265 12071229 12536053 13038875 13581487 14165376 14792015 15463708 16183026
59668A6183026P68241Q16724Q63639R08055R48707R84247J013020J032220J038346
$$ 16183026 16951267 17767991 18631630 19539685 20488392 21472639 22485659 23517879 24556225
59659B4556225J029194J005061R68408R23544Q76461Q33219P97846P72597P59788
$$ 24556225 25585419 26590480 27558888 28482432 29358893 30192112 30989958 31762555 32522343
59650C2522343P61368P76426Q01029Q31157Q63882Q94964R17534R24881R13340
$$ 32522343 33283711 34060137 34861166 35692323 36556205 37451169 38368703 39293584 40206924
59641D0206924Q81288Q26903P48910O48868N31212M01600K66486J33804J2278
$$ 40206924 41088212 41915115 42664025 43312893 43844105 44245705 44512191 44645995 44658273
59632D4658273r0674j70278k24278k52243k54778k32807j87751j22404m0998N2104
$$ 44658273 44567599 44397321 44173043 43920800 43666022 43433215 43245464 43123060 43082062 43134166
59622D3134166J53552K61024L72940M88600O07643P28765Q49049R64412J069923
$$ 43134166 43287718 43548742 43921682 44410282 45017925 45746690 46595739 47560151 48630074
59613D8630074J159671J227155J265647J267210J221751J119173R53824P26855
$$ 48630074 49789745 51016900 52282547 53549757 54771508 55890681 56844505 57571360
59605E7571360M45136J20442k29618n82397r14760j207792j448042j627117j742527
$$ 57571360 58016496 58136938 57907320 57324923 56410163 55202371 53754329 52127212 50384685
59596E0384685j798313j802991j766415j698791j611223j515315j422001j341582
$$ 50384685 48586372 46783381 45016966 43318175 41706952 40191637 38769636 37428054
59588C7428054j284040j257005j261870j291756j333711j373449j399518j405249
$$ 37428054 36144014 34887009 33625139 32333383 30999672 29626223 28226705 26821456
59580B6821456j388820j352398j300628j238411j168959j094009j015995r38931
$$ 26821456 25432636 24080238 22779610 21541199 20372240 19278231 18262236 17323305
59572A7323305q66144p97877p32466o69526o10576n56817n07965m63378m22746
$$ 17323305 16457161 15659284 14926818 14257292 13646716 13089899 12581934 12118556 11695810
59563A1695810l85355l50132l16945k86665k59622k35183k13055j93659j76938
$$ 11695810 11310455 10960323 10643378 10356713 10097091 9861908 9648853 9455194 9278256
59554I278256j62267j49984j41399j36815j35035j35345j38184j43127j48179
$$ 9278256 9115989 8966005 8824606 8687791 8552756 8417411 8279227 8136100 7987921
59545G987921j52318j56948j63216j69163j71386j68689j62612j54987j46523
$$ 7987921 7835603 7678655 7515439 7346276 7174890 7006201 6843589 6688602 6542079
59536F542079j37370j27639j17216j05994r4316q2696p1293n9946m8407l6367
$$ 6542079 6404709 6277070 6159854 6053860 5959544 5876848 5805555 5745609 5697202 5660835
59526E660835k3824j1536m06R632J9136K7722L4399L9407M4219M9203N2930N4545
$$ 5660835 5637011 5625475 5625069 5634701 5653837 5681559 5715958 5755365 5799584 5848787 5901717 5956262
59514E956262N5291N6791N9210O2065O5625P0405P6455Q4048R3963J06180J19431
$$ 5956262 6011553 6068344 6127554 6189619 6255244 6325649 6402104 6486152 6580115 6686295 6805726
59503F805726J32898J47210J62836J79009J95345K13057K33121K54342K74861
$$ 6805726 6938624 7085834 7248670 7427679 7623024 7836081 8069202 8323544 8598405
59494H598405K94708L15506L38188L62064L85500M06616M24140M38367M50399
$$ 8598405 8893113 9208619 9546807 9908871 10294371 10700987 11125127 11563494 12013893
59485A2013893M59855M64596M63303M56667M45259M28335M06211L81804L57735
$$ 12013893 12473748 12938344 13401647 13858314 14303573 14731908 15138119 15519923 15877658
59476A5877658L33461L07284K79701K52310K24842J96085J67247J41728J21787
$$ 15877658 16211119 16518403 16798104 17050414 17275256 17471341 17638588 17780316 17902103
59467A7902103J07607R9523R8632J04729J15342J27219J37289J42240J38721J24490
$$ 17902103 18009710 18109233 18207865 18312594 18427936 18555155 18692444 18834684 18973405 19097895
59457A9097895R8460N9775Q139n5131j27433k06038k87750l68059m42224n07235
$$ 19097895 19196355 19256130 19264269 19209138 19081705 18875667 18587917 18219858 17777634 17270399
59447A7270399n61540o03397o31134o44867o46346o37039o17737n90115n56994
$$ 17270399 16708859 16105462 15474328 14829461 14183115 13546076 12928339 12338224 11781230
59438A1781230n20707m82159m41750m00246l58666l18165k79974k44672k11649
$$ 11781230 11260523 10778364 10336614 9936368 9577702 9259537 8979563 8734891 8523242
59429H523242j80015j49762j21250r4157o7817m2066j6769Q683L4294N8721Q1125
$$ 8523242 8343227 8193465 8072215 7978058 7910241 7868175 7851406 7860089 7894383 7953104 8034229
59418H034229J03017J26504J51233J74902J96597K17717K39591K61759K82754
$$ 8034229 8137246 8263750 8414983 8589885 8786482 9004199 9243790 9505549 9788303
59409I788303L01133L15585L25324L30368L30228L22568L04652K75885K37374
$$ 9788303 10089436 10405021 10730345 11060713 11390941 11713509 12018161 12294046 12531420
59400A2531420J89366J31141O3770q946q2731j54451k21180k79648l27805l65836
$$ 12531420 12720786 12851927 12915697 12906751 12824020 12669569 12448389 12168741 11840936 11475100
59390A1475100l94698m14481m24875m26395m20507m09057l93823l76024l56009
$$ 11475100 11080402 10665921 10241046 9814651 9394144 8985087 8591264 8215240 7859231
59381G859231l33952l10714k87352k64136k41056k18928j98744j80016j61271
$$ 7859231 7525279 7214565 6927213 6663077 6422021 6203093 6004349 5824333 5663062
59372E663062j42379j25033j10465r7871q5582p2797n9761m7133l5666k5770j6995
$$ 5663062 5520683 5395650 5285185 5187314 5101732 5028935 4969174 4922041 4886375 4860605 4843610
59361D843610q544l70O858J3052J9075K5697L2810L9926M6966N4483O3320P3537
$$ 4843610 4835066 4834696 4841554 4854606 4873681 4899378 4932188 4972114 5019080 5073563 5136883 5210420
59349E210420Q3117Q8563Q8013Q3631Q0058Q0791Q6828R7860J13058J30862J49734
$$ 5210420 5293537 5382100 5470113 5553744 5633802 5714593 5801421 5899281 6012339 6143201 6292935
59338F292935J69442J90430K11907K31830K49075K64684K80972L00360L24810
$$ 6292935 6462377 6652807 6864714 7096544 7345619 7610303 7891275 8191635 8516445
59329H516445L54988L89734M27346M67429N10507N56269O03550O51827P01012
$$ 8516445 8871433 9261167 9688513 10155942 10666449 11222718 11826268 12478095 13179107
59320A3179107P49521P93956Q30973Q58170Q73012Q72634Q55470Q22195P74855
$$ 13179107 13928628 14722584 15553557 16411727 17284739 18157373 19012843 19835038 20609893
59311B0609893P16184O49907N80059N09310M38913L70501L06520K48143J93844
$$ 20609893 21326077 21975984 22556043 23065353 23504266 23874767 24181287 24429430 24623274
59302B4623274J40780Q6746L0452k9016r2040j58202k26404k94611l59327m16352
$$ 24623274 24764054 24850800 24881252 24852236 24760196 24601994 24375590 24080979 23721652 23305300
59292B3305300m62642m97116n19875n31760n34980n33015n29178n25616n23817
$$ 23305300 22842658 22345542 21825667 21293907 20758927 20225912 19696734 19171118 18647301
59283A8647301n25138n30194n38129n46815n53779n57057n55664n49265n37473
$$ 18647301 18122163 17591969 17053840 16507025 15953246 15396189 14840525 14291260 13753787
59274A3753787n20016m97783m72595m45294m15067l81620l46910l13433k81813
$$ 13753787 13233771 12735988 12263393 11818099 11403032 11021412 10674502 10361069 10079256
59265A0079256k51488k22571j95216j68215j40500j13434q9287o7875m7183k6924
$$ 10079256 9827768 9605197 9409981 9241766 9101266 8987832 8898545 8830670 8783487 8756563
59255H756563q755P080K2293L7148M9396N7635O3204O7345O8820O5956N9127M9587
$$ 8756563 8747808 8754888 8777181 8814329 8863725 8921360 8984564 9051909 9120729 9186685 9245812 9295399
59243I295399L7471K2639O284r938k5357l9592n1461o0003o5704o9321p0094o6477
$$ 9295399 9332870 9355509 9361793 9351855 9326498 9286906 9235445 9175442 9109738 9040417 8970323 8903846
59231H903846n8219m6728l3614j9606m512J2462L1959N3583P5915R7673J18339
$$ 8903846 8845627 8798899 8765285 8745679 8741167 8753629 8785588 8839171 8915086 9012759 9131098
59220I131098J37775J56004J73416J90212K05511K17942K26977K32499K33074
$$ 9131098 9268873 9424877 9598293 9788505 9994016 10211958 10438935 10671434 10904508
59211A0904508K26384K11942J91915J68689J42882J14352Q3796N2587K2001o565
$$ 10904508 11130892 11342834 11534749 11703438 11846320 11960672 12044468 12097055 12119056 12112491
59201A2112491l1607n2322o8617q0116q6423q8813r0391r3932j00531j10475j23698
$$ 12112491 12080884 12028562 11959945 11879829 11793406 11704593 11614202 11520270 11419739 11309264 11185566
59190A1185566j38573j51739j60381j63939j63117j58482j50667j40558j28194
$$ 11185566 11046993 10895254 10734873 10570934 10407817 10249335 10098668 9958110 9829916
59181I829916j12472r2726o9656m4118j6082J4452M6741Q0321J15659J52922J91214
$$ 9829916 9717444 9624718 9555062 9510944 9494862 9509314 9556055 9636376 9752035 9904957 10096171
59170A0096171K29926K69760L11265L53063L92507M27511M56985M79836M94097
$$ 10096171 10326097 10595857 10907122 11260185 11652692 12080203 12537188 13017024 13511121
59161A3511121M96624M83548M51927M01242L32874K48451J50079M1823p0816j83320
$$ 13511121 14007745 14491293 14943220 15344462 15677336 15925787 16075866 16117689 16046873 15863553
59151A5863553k92368l93492m80659n49387n98815o30057o44211o42913o29099
$$ 15863553 15571185 15177693 14697034 14147647 13548832 12918775 12274564 11631651 11002552
59142A1002552o05617n74189n36731m96443m56397m17931l81260l46535l13489
$$ 11002552 10396935 9822746 9286015 8789572 8333175 7915244 7533984 7187449 6873960
59133F873960k81460k50788k22998j98643j76358j55054j35808j20120j07533
$$ 6873960 6592500 6341712 6118714 5920071 5743713 5588659 5452851 5332731 5225198
59124E225198r6241q5113p3969o2743n1646m1389l2125k2829j2684k460O369J3336
$$ 5225198 5128957 5043844 4969875 4907132 4855486 4814097 4781972 4759143 4746459 4743999 4750368 4763704
59112D763704J9251K5393L2716M0981M8513N3881N8016O3283P0389P7889Q4894
$$ 4763704 4782955 4808348 4841064 4882045 4930558 4984439 5042455 5105738 5176127 5254016 5338910
59101E338910R2122R9678J06251J11547J17285J24278J30517J33694J33907J32290
$$ 5338910 5431032 5530710 5636961 5748508 5865793 5990071 6120588 6254282 6388189 6520479
59091F520479J28728J22627J14363J04249R1438P5553N8063M0591K3148N554j0923
$$ 6520479 6649207 6771834 6886197 6990446 7081884 7157437 7215500 7256091 7279239 7284793 7273870
59080G273870k5020l7042m7379n4790n8025n7734n5078m9876m1845l2206k2044
$$ 7273870 7248850 7211808 7164429 7109639 7051614 6993880 6938802 6888926 6847081 6814875 6792831
59069F792831j0417L842J9830L6155N3441P2925R3750J14042J33690J53647J73414
$$ 6792831 6782414 6786256 6806086 6842241 6895682 6968607 7062357 7176399 7310089 7463736 7637150
59058G637150J91805K09637K29116K50716K72724K93488L12229L28116L40780
$$ 7637150 7828955 8038592 8267708 8518424 8791148 9084636 9396865 9724981 10065761
59049A0065761L51469L61565L69990L73711L70432L59148L38570L06961K63518
$$ 10065761 10417230 10778795 11148785 11522496 11892928 12252076 12590646 12897607 13161125
59040A3161125K08517J42719O8238j0507q8519j62582k30791k91018l41738l83376
$$ 13161125 13369642 13512361 13580599 13570092 13481573 13318991 13088200 12797182 12455444 12072068
59030A2072068m16735m40833m54605m59870m60104m56595m48178m34545m17370
$$ 12072068 11655333 11214500 10759895 10300025 9839921 9383326 8935148 8500603 8083233
59021H083233l98238l77590l55940l34096l12172k90170k69328k50997k34405
$$ 8083233 7684995 7307405 6951465 6617369 6305197 6015027 5745699 5494702 5260297
59012E260297k17718k01171j86937j75685j65373j53864j41037j28117j16517
$$ 5260297 5042579 4841408 4654471 4478786 4313413 4159549 4018512 3890395 3773878
59003C773878j07451j00964r5238q8403q0912p4568o9553o4415n8823n4191n1303
$$ 3773878 3666427 3565463 3470225 3381822 3300910 3226342 3156789 3092374 3033551 2979360 2928057
58992B928057m9300m7351m5651m4324m2842m0935l8841l6589l4034l1326k8351
$$ 2928057 2878757 2831406 2785755 2741431 2698589 2657654 2618813 2582224 2548190 2516864 2488513
58981B488513k4368j9560j5967j4997j5014j3482j0696q850q098o324k637J689
$$ 2488513 2464145 2444585 2428618 2413621 2398607 2385125 2374429 2365579 2357481 2351157 2348520 2350209
58969B350209N770R917J3734J6130J7434J8959K0119J8727J4643J0436P736N612
$$ 2350209 2355979 2365896 2379630 2395760 2413194 2432153 2452272 2470999 2485642 2496078 2503814 2509426
58957B509426L133R06p71k509l609k062J998N540O896Q094J1192J4734J6138J5550
$$ 2509426 2512559 2513465 2512694 2510185 2506576 2504514 2506512 2512052 2518948 2527042 2538234 2552968 2569106 2584656
58943B584656J4973J4900J4094J1697P735K407l407p727r200q710q122p973p493
$$ 2584656 2599629 2614529 2628623 2640320 2648055 2650462 2647055 2639328 2630128 2621418 2613296 2605323 2597830
58930B597830o002l248P91N266Q427R461R852J1787J5607J9690K2462K3716K4379
$$ 2597830 2591828 2588580 2589371 2594637 2603064 2612525 2622377 2634164 2649771 2669461 2691923 2715639 2740018
58917B740018K5663K8149L1213L3720L5423L7106L9310M1784M4397M7514N1109
$$ 2740018 2765681 2793830 2825043 2858763 2894186 2931292 2970602 3012386 3056783 3104297 3155406
58906C155406N4461N7220N9903O2998O6347O9668P2868P5667P7791P9645Q1839
$$ 3155406 3209867 3267087 3326990 3389988 3456335 3526003 3598871 3674538 3752329 3831974 3913813
58895C913813Q4085Q5792Q7617R0944R5735J00637J05486J11879J20568J30170
$$ 3913813 3997898 4083690 4171307 4262251 4357986 4458623 4564109 4675988 4796556 4926726
58885D926726J39371J48800J59506J70986J82299J94002K07495K22998K39467
$$ 4926726 5066097 5214897 5374403 5545389 5727688 5921690 6129185 6352183 6591650
58876F591650K56221K73613K92250L12398L34179L57823L83534M11241M40581
$$ 6591650 6847871 7121484 7413734 7726132 8060311 8418134 8801668 9212909 9653490
58867I653490M71441N04724N41789N82551O24932O67180P09962P54826Q01371
$$ 9653490 10124931 10629655 11171444 11753995 12378927 13046107 13756069 14510895 15312266
58858A5312266Q47661Q92802R36850R78290J013858J041122J058916J064622J053224
$$ 15312266 16159927 17052729 17989579 18967869 19981727 21022849 22081765 23146387 24199611
58849B4199611J020049R62717Q79579P68395O28340M62388K76775P9333j20921
$$ 24199611 25219660 26182377 27061956 27830351 28458691 28921079 29197854 29277187 29156266
58840B9156266l14345m92811o51216p86489q96142r78576j033862j063594j070719
$$ 29156266 28841921 28349110 27697894 26911405 26015263 25036687 24002825 22939231 21868512
58831B1868512j059779j035731j001683r58777r08788q55298q01454p47995o94756
$$ 21868512 20808733 19773002 18771319 17812542 16903754 16048456 15247002 14499007 13804251
58822A3804251o42988n94802n51154n11604m75521m42488m12015l83860l58289
$$ 13804251 13161263 12566461 12015307 11503703 11028182 10585694 10173679 9789819 9431530
58813I431530l35359l14218k93715k73335k53175k33473k14550j96797j80352
$$ 9431530 9096171 8781953 8488238 8214903 7961728 7728255 7513705 7316908 7136556
58804G136556j65128j51172j38502j26613j14903j03486r2851q2722p2197o0970
$$ 7136556 6971428 6820256 6681754 6555141 6440238 6336752 6243901 6161179 6088982 6028012
58794F028012m9531l8132k6497j4610k813Q831K0428L1708M2547N3788O6369P9823
$$ 6028012 5978481 5940349 5913852 5899242 5896429 5905260 5925688 5957396 5999943 6053731 6120100 6199923
58782F199923R2926J05650J19172J33947J49068J63631J77694J92045K07855K26028
$$ 6199923 6292849 6398499 6517671 6651618 6800686 6964317 7142011 7334056 7541911 7767939
58772G767939K45934K65572K84371L04785L29309L57012L85152M13262M43092
$$ 7767939 8013873 8279445 8563816 8868601 9197910 9554922 9940074 10353336 10796428
58763A0796428M75366N09423N45723N85449O27678O69851P11405P54002P98024
$$ 10796428 11271794 11781217 12326940 12912389 13540067 14209918 14921323 15675325 16473349
58754A6473349Q41764Q84244R25415R62903R91744J008238J010871R96563R59672
$$ 16473349 17315113 18199357 19124772 20087675 21079419 22087657 23098528 24095091 25054763
58745B5054763Q96203Q05906O89014N44649L74897J87442q133k04249l93839n68364
$$ 25054763 25950966 26756872 27445886 27990535 28365432 28552874 28544741 28340492 27946653 27378289
58735B7378289p20406q46538r45645j016891j061436j083473j086849j072817
$$ 27378289 26657883 25811345 24865700 23848809 22787373 21703900 20617051 19544234
58727A9544234j043467j004570r61665r15495q64739q11366p59450p10079o61602
$$ 19544234 18500767 17496197 16534532 15619037 14754298 13942932 13183482 12473403 11811801
58718A1811801o14451n71607n33896m98343m62404m27420l96625l71377l50272
$$ 11811801 11197350 10625743 10091847 9593504 9131100 8703680 8307055 7935678 7585406
58709G585406l30783l11100k91071k71810k54219k38222k23497k10016j97228
$$ 7585406 7254623 6943523 6652452 6380642 6126423 5888201 5664704 5454688 5257460
58700E257460j83862j69457j55175j42235j30445j19121j08335r8427q9381q1541
$$ 5257460 5073598 4904141 4748966 4606731 4476286 4357165 4248830 4150403 4061022 3979481
58690C979481p5644p1243o6302n9542n2081m5851m1556l8846l7070l5034l1746
$$ 3979481 3903837 3832594 3766292 3706750 3654669 3608818 3567262 3528416 3491346 3456312 3424566
58679C424566k8327k7488l0078l3999l7461m1120m5640m9497n1134n1344n1536
$$ 3424566 3396239 3368751 3338673 3304674 3267213 3226093 3180453 3130956 3079822 3028478 2976942
58668B976942n1423n0407m9594n0276n1842n3176n4650n6756n8297n8018n6686
$$ 2976942 2925519 2875112 2825518 2775242 2723400 2670224 2615574 2558818 2500521 2442503 2385817
58657B385817n5550n4097n1500m8842m7486m6411m3611l9362l5804l3914l2842
$$ 2385817 2330267 2276170 2224670 2175828 2128342 2081931 2038320 1998958 1963154 1929240 1896398
58646A896398l1645k9981k7689k5226k3737k3385k2649k0508j7910j5893j3929
$$ 1896398 1864753 1834772 1807083 1781857 1758120 1734735 1712086 1691578 1673668 1657775 1643846
58635A643846j1698j0540j1138j1722j0725r386r382r655q384o460o028o837p059
$$ 1643846 1632148 1621608 1610470 1598748 1588023 1578637 1569255 1559600 1551216 1544756 1538728 1531891 1524832
58622A524832o832p916j0308j1936j1393q784m526M27L898M503L860M613O880
$$ 1524832 1518000 1510084 1499776 1487840 1476447 1467663 1463137 1463564 1467462 1471965 1475825 1480438 1487318
58609A487318Q677R047Q483P195N365M465N772Q110R270Q943Q165O887M691K985
$$ 1487318 1495995 1505042 1513525 1520720 1526085 1530550 1536322 1544432 1553702 1562645 1570810 1577697 1582388 1585373
58595A585373L491N162N412M199M045O125R077J1860J5164J9569K4386K8793L2458
$$ 1585373 1588864 1594026 1599438 1603637 1607682 1613807 1622884 1634744 1649908 1669477 1693863 1722656 1755114
58582A755114L4965L6270L7692M0795M5486N0584N5805O1558O7480P2958P8526
$$ 1755114 1790079 1826349 1864041 1904836 1950322 2000906 2056711 2118269 2185749 2258707 2337233
58571B337233Q5034R2064R8951J06578J16291J27737J39537J51419J63827J76396
$$ 2337233 2422267 2514331 2613282 2719860 2836151 2963888 3103425 3254844 3418671 3595067
58561C595067J88742K01851K16743K32640K48422K64643K81865K98069L10189
$$ 3595067 3783809 3985660 4202403 4435043 4683465 4948108 5229973 5528042 5838231
58552E838231L17262L19537L15211L00670K73545K33552J81261J18476M9334k1134
$$ 5838231 6155493 6475030 6790241 7090911 7364456 7598008 7779269 7897745 7947079 7925945
58542G925945q9121j51317k03780k44015k72933k92544l02945l03959k97920k87858
$$ 7925945 7836824 7685507 7481727 7237712 6964779 6672235 6369290 6065331 5767411 5479553
58532E479553k74383k57305k38794k21546k05172j87880j70458j55012j40900
$$ 5479553 5205170 4947865 4709071 4487525 4282353 4094473 3924015 3769003 3628103
58523C628103j25949j10823r8023q7194p5593o3131n2638m5121l8775l3167l0264
$$ 3628103 3502154 3391331 3293308 3206114 3130521 3067390 3014752 2969631 2930856 2897689 2867425
58512B867425l0467l1255l0862l0147k9881k9183k7628k6186k5256k4192k3372
$$ 2867425 2836958 2805703 2774841 2744694 2714813 2685630 2658002 2631816 2606560 2582368 2558996
58501B558996k4340k7317l0789l3878l7005m0239m3082m5700m8146m8868m6457
$$ 2558996 2534656 2507339 2476550 2442672 2405667 2365428 2322346 2276646 2228500 2179632 2133175
58490B133175m2348l9234l7525l5926l4506l4119l3802l2169l0596l1395l3518
$$ 2133175 2090827 2051593 2014068 1978142 1943636 1909517 1875715 1843546 1812950 1781555 1748037
58479A748037l3872l2291l1233l1034k9706k7256k5826k5363k3510k0260j8340
$$ 1748037 1714165 1681874 1650641 1619607 1589901 1562645 1536819 1511456 1487946 1467686 1449346
58468A449346j8338j7715j5556j4126j4541j4861j3906j3192j3691j3994j3115
$$ 1449346 1431008 1413293 1397737 1383611 1369070 1354209 1340303 1327111 1313420 1299426 1286311
58457A286311j2028j1254r896p975o795o204m539j935m96o01k54J238K285K390
$$ 1286311 1274283 1263029 1253133 1245158 1238363 1232159 1227620 1225685 1225189 1224588 1224334 1225572 1227857 1230247
58443A230247L124N021O774Q223J0769J4066J5750J5299J5010J6327J8307K0170
$$ 1230247 1233371 1238392 1245166 1253389 1264158 1278224 1293974 1309273 1324283 1340610 1358917 1379087
58431A379087K2163K3514K2891K1189K0431J9880J6943J1926P674M405n16p231
$$ 1379087 1401250 1424764 1447655 1468844 1489275 1509155 1526098 1538024 1545698 1550103 1549587 1542356
58419A542356j2596j5654j9115k4160k8327k9993l0504l0391k7970k3423k0076
$$ 1542356 1529760 1514106 1494991 1470831 1442504 1412511 1382007 1351616 1323646 1300223 1280147
58408A280147j9665k0063j9289j7945j6406j3564r866p782p879q049p573p817
$$ 1280147 1260482 1240419 1221130 1203185 1186779 1173215 1163349 1155567 1147688 1139639 1132066 1124249
58396A124249q272o447k763p47j137o97J779L525L469M468P723J0177R955R561
$$ 1124249 1115977 1109530 1106767 1106020 1104883 1104186 1105965 1109490 1112959 1117427 1125150 1135327 1145282 1154843
58382A154843J1093J2966J3907J5651J9122K2205K3581K4559K5199K3286J9028
$$ 1154843 1165936 1178902 1192809 1208460 1227582 1249787 1273368 1297927 1323126 1346412 1365440
58371A365440J5741J3959J0302M283L67M63K93l434p912r867j0642j1906j1780
$$ 1365440 1381181 1395140 1405442 1409725 1410092 1410555 1410848 1407414 1399502 1389635 1378993 1367087 1355307
58358A355307r453q339j0167j0914p248k354o34q77M95L425N954Q342J1078J2323
$$ 1355307 1345854 1337515 1327348 1316434 1309186 1306832 1306198 1305321 1305816 1309241 1315195 1323537 1334615 1346938
58344A346938J1236J0216J0318Q561L351j991m951q170j3617j7461j5897j1763
$$ 1346938 1358174 1368390 1378708 1387269 1390620 1388629 1383678 1375508 1361891 1344430 1328533 1316770
58332A316770r984j0158r011o663n250m321k500q60l45J104M730P679P637P110
$$ 1316770 1306786 1296628 1287617 1280954 1275704 1271383 1268883 1268023 1267678 1268782 1273512 1281191 1288828 1295938
58318A295938Q836J0733R929Q034P878Q513Q095Q096J0009J1499J0474R397J0967
$$ 1295938 1304774 1315507 1325436 1333470 1341348 1349861 1357956 1366052 1376061 1387560 1398034 1407431 1418398
58305A418398J3061J2668J1268J1583J2498J1896J1119J2138J3567J3718J4034
$$ 1418398 1431459 1444127 1455395 1466978 1479476 1491372 1502491 1514629 1528196 1541914 1555948
58294A555948J5669J6570J5775J6026J8156J7975J3124P730N487L727l96l671
$$ 1555948 1571617 1588187 1603962 1619988 1638144 1656119 1669243 1676973 1682460 1686187 1685791 1682120
58282A682120k845j218k877n416m856k788k035l26M844R937J0991J0767J3246
$$ 1682120 1679275 1678057 1675180 1669764 1664908 1662120 1660085 1659759 1664603 1674540 1685531 1696298 1709544
58269A709544J5871J4641J2214J3254J6106J6781J6863J9705K2899K2588K1269
$$ 1709544 1725415 1740056 1752270 1765524 1781630 1798411 1815274 1834979 1857878 1880466 1901735
58258A901735K3402K7015K7483K5891K6001K6777K5659K5075K7783K9943K6816
$$ 1901735 1925137 1952152 1979635 2005526 2031527 2058304 2083963 2109038 2136821 2166764 2193580
58247B193580K1255J8468J6974J3105R841J1999J6912J8845J8709K0586K2999
$$ 2193580 2214835 2233303 2250277 2263382 2273223 2285222 2302134 2320979 2339688 2360274 2383273
58236B383273K2684K2574K6682L1555L2297L2240L6877M3053M4562M3659M6286
$$ 2383273 2405957 2428531 2455213 2486768 2519065 2551305 2588182 2631235 2675797 2719456 2765742
58225B765742N0652N1581N1453N5448O0644O1596O1996O8534P7650Q1214Q1090
$$ 2765742 2816394 2867975 2919428 2974876 3035520 3097116 3159112 3227646 3305296 3386510 3467600
58214C467600Q4920R1451R3549R2107R3299R5345R1849Q5255Q3128Q4191Q1884
$$ 3467600 3552520 3643971 3737520 3829627 3922926 4018271 4110120 4195375 4278503 4362694 4444578
58203D444578P8549Q1775Q9921R5807J01369J13630J29444J39938J46909J58859
$$ 4444578 4523127 4604902 4694823 4790630 4891999 5005629 5135073 5275011 5421920 5580779
58193E580779J73870J83148J88729K00441K17769K31929K43541K60400K80196
$$ 5580779 5754649 5937797 6126526 6326967 6544736 6776665 7020206 7280606 7560802
58184G560802K93812L03780L20734L43450L61295L74411L92309M14712M33864
$$ 7560802 7854614 8158394 8479128 8822578 9183873 9558284 9950593 10365305 10799169
58175A0799169M53264M83198N20303N53178N85394O30251O85731P38569P89818
$$ 10799169 11252433 11735631 12255934 12809112 13394506 14024757 14710488 15449057 16238875
58166A6238875Q50756R16905R73899J026660J093558J173600J250140J325405
$$ 16238875 17089631 18006536 18980435 20007095 21100653 22274253 23524393 24849798
58158B4849798J418444J529306J639645J749411J877316K024391K174891K334601
$$ 24849798 26268242 27797548 29437193 31186604 33063920 35088311 37263202 39597803
58150C9597803K528526K759898L014815L309303L683828M146129M667555N239507
$$ 39597803 42126329 44886227 47901042 51210345 54894173 59040302 63707857 68947364
58142F8947364N881253O591372P354144Q198385R178342J0284751J1447902J2639029
$$ 68947364 74828617 81419989 88774133 96972518 106150860 116435611 127883513 140522542
58134A40522542J3894020J5255595J6828431J8907151K1871191K5853568L0609691
$$ 140522542 154416562 169672157 186500588 205407739 227278930 253132498 283742189
58127B83742189L5667563M0224303M2651900M0547334L2108920J7900048J083687
$$ 283742189 319409752 359634055 402285955 442833289 474942209 492842257 493925944
58120D93925944j4357928k5765295l2530878l5410576l5596341l4226116l2157206
$$ 493925944 479568016 453802721 421271843 385861267 350264926 316038810 283881604
58113B83881604k9826381k7327509k4676499k1967344j9314579j6788460j4456935
$$ 283881604 254055223 226727714 202051215 180083871 160769292 143980832 129523897
58106A29523897j2404564j0664014r188987p926144o861694n977383n220916m552116
$$ 129523897 117119333 106455319 97266332 89340188 82478494 76501111 71280195 66728079
58098F6728079l972288l480082l040364k623853k238781j894940j569900j238212
$$ 66728079 62755791 59275709 56235345 53611492 51372711 49477771 47907871 46669659
58090D6669659r03030n70921k24654J47168N17433Q52089J161087J494316J911466
$$ 46669659 45766629 45195708 44971054 45118222 45635655 46487744 47648831 49143147 51054613
58081E1054613K486600L294361M284627N126116N256355M225584K077251o05276
$$ 51054613 53541213 56835574 61120201 66246317 71502672 75728256 77805507 77200231
58073G7200231l054713m757995n620344n821681n603604n169597m671784m198137
$$ 77200231 74145518 69387523 63767179 57945498 52341894 47172297 42500513 38302376
58065C8302376l765896l358485k971793k615857k291653j993893j729583j510492
$$ 38302376 34536480 31177995 28206202 25590345 23298692 21304799 19575216 18064724
58057A8064724j331617j177354j044885r41619q62942p92664p24533o64983o15174
$$ 18064724 16733107 15555753 14510868 13569249 12706307 11913643 11189110 10524127 9908953
58048I908953n67770n21504m82087m47955m10765l70696l36236l08369k79756
$$ 9908953 9341183 8819679 8337592 7889637 7478872 7108176 6771940 6463571 6183815
58039F183815k50053k27062k11782j97100j82636j75940j77012j76012j69144
$$ 6183815 5933762 5706700 5494918 5297818 5115182 4939242 4762230 4586218 4417074
58030D417074j63161j61331j58222j51528j46037j42533j35046j22865j13365
$$ 4417074 4253913 4092582 3934360 3782832 3636795 3494262 3359216 3236351 3122986
58021C122986j09413j05348r8706r4312r3150q8965q0164p3920p3698p3319o8266
$$ 3122986 3013573 2908225 2809519 2715207 2622057 2533092 2452928 2379008 2305310 2231991 2163725
58010B163725o2780o0654n8524n3640m9461m8340m6623m1851l7251l4872l1654
$$ 2163725 2100945 2040291 1981767 1928127 1878666 1830326 1783703 1741852 1704601 1669729 1638075
57999A638075k6296k2609k2280k1625j9019j8231k0832k2674k1412k0313k1202
$$ 1638075 1611779 1589170 1566890 1545265 1526246 1508015 1487183 1464509 1443097 1422784 1401582
57988A401582k0917j8122j6394j7122j6601j3552j2103j3854j4343j1273q798
$$ 1401582 1380665 1362543 1346149 1329027 1312426 1298874 1286771 1272917 1258574 1247301 1238503
57977A238503r604r967p000l831l119k135J071L064J352o75K01J637R39J50J440
$$ 1238503 1228899 1218932 1211932 1208101 1204982 1202847 1203918 1206982 1208334 1207659 1207860 1209497 1210436 1210586 1212026
57962A212026K556J305k02J58P16J69O94L158M160J603j503k328k520l790m215
$$ 1212026 1214582 1215887 1215685 1215843 1216559 1216728 1217422 1220580 1224740 1226343 1224840 1222512 1219992 1216202 1211987
57947A211987k723k272m637o555n137k786k908m691n711n968o098n381m307n224
$$ 1211987 1209264 1206992 1202355 1195800 1190663 1187877 1184969 1180278 1174567 1168599 1162501 1157120 1152813 1147589
57933A147589p955r148q038p814r097p901l111J17j712m798m620k719k428k870
$$ 1147589 1139634 1130486 1122448 1114634 1105537 1097636 1094525 1094642 1092930 1088132 1083512 1080793 1078365 1075495
57919A075495k048j335k009j608J579M344L544J390J268K029J068n83q82j080
$$ 1075495 1073447 1072112 1070103 1068495 1070074 1074418 1077962 1079352 1080620 1082649 1083717 1083134 1082252 1081172
57905A081172k831m259l451k691m743p756q366p059o332o189n604n725p565r117
$$ 1081172 1078341 1074082 1070631 1067940 1063197 1055441 1047075 1040016 1033684 1027495 1021891 1016166 1008601 999484
57891I99484q597p908r227j1020j1149j0859j1782j1945q981m485j145J673N405
$$ 999484 990887 982979 973752 962732 951583 940724 928942 916997 908016 903531 902386 904059 909464
57878I09464Q275Q160O795O738O709M292Q56q14j579m123p976j0739j2479j4617
$$ 909464 917739 925899 932694 939432 946141 950433 951289 950475 948896 944773 936797 926058 913579 898962
57864H98962j6118j5035j2466j1046j0922j0724j0682j1158j0087n866r95J100
$$ 898962 882844 867809 855343 844297 833375 822651 811969 800811 790724 784858 783863 784963
57852G84963J164K114L913M599M619N762P113O478M770M842O806Q336Q695Q735
$$ 784963 786127 788241 792154 796753 801372 807134 814247 820725 825495 830337 837143 845479 854174 862909
57838H62909P947N380K674K397L994M779M136L482L034K019J086J143Q05j646
$$ 862909 870856 876236 878910 881307 885301 890080 894216 897698 900732 902751 903837 904980 905785 904139
57824I04139m847o256o252o865p611o573m667m806p206r160r245q502p818p252
$$ 904139 899292 893036 886784 879919 872308 865735 861068 856262 849056 839896 830651 822149 814331 807079
57810H07079p364q200p676m188J42K147K519M302P376Q562O989N353N547O620
$$ 807079 799715 791515 783839 779651 779793 781940 784459 788761 796137 804699 811688 817041 822588 829208
57796H29208P487Q356Q934Q170O286M627L277J257j025k106k109k537l541l901
$$ 829208 836695 845051 853985 862155 868441 873068 876345 877602 876577 874471 872362 869825 866284 862383
57782H62383l607l990n370o718p502p734o847m763l309m160o004o346n271m883
$$ 862383 858776 854786 849416 842698 835196 827462 820615 815852 812543 808383 802379 796033 790762 785879
57768G85879n790o965q267j0095j1141r728p003n774o460p081p017p654r329j0614
$$ 785879 780089 773124 764857 754762 743621 733893 726890 721116 714656 707575 700558 692904 683575 672961
57754F72961j0778j0342r281p343n903o676q630q944p178n618n406n160l798k109
$$ 672961 662183 651841 642560 635217 629314 622638 614008 605064 597886 592268 586862 581702 577904 575795
57740E75795r03Q8R59J230J111J477K445L394M242N263O258P344R483J2589J4481
$$ 575795 574892 574980 575939 577169 578280 579757 582202 585596 589838 595101 601359 608703 618186 630775 645256
57725F45256J3826J2593J3119J4366J3925J2156J0932R704O674K882J015O48j189
$$ 645256 659082 671675 684794 699160 713085 725241 736173 745877 752551 755433 756448 757096 755907
57712G55907m777p110o974o657p794r018q860p895o917n595l946k874k578k305
$$ 755907 751130 744020 737046 730389 722595 713577 704717 696822 689905 684310 680364 677490 674912 672607
57698F72607j938j892j544J2J997L001L476M602N387L973J285K13J382K827L594
$$ 672607 670669 668777 667233 667245 669242 672243 675719 680321 685708 689681 690966 691179 692561 695388 698982
57683F98982M394N116N029N163O995R133R036P666Q156J0180J0298Q279P965J0755
$$ 698982 703376 708492 713521 718684 725679 734812 743848 751514 759670 769850 780148 788427 796392 807147
57669H07147J3258J3221J3119J5375J8224J9161J9081K0034K1608K2372K2760
$$ 807147 820405 833626 846745 862120 880344 899505 918586 938620 960228 982600 1005360
57658A005360K4075K6312K8780L1207L2983L3259L2910L4221L7574M0829M2878
$$ 1005360 1029435 1055747 1084527 1115734 1148717 1181976 1214886 1249107 1286681 1327510 1370388
57647A370388M5152M8559N1822N4376N7989O3828P0461P6497Q2761R0138R7681
$$ 1370388 1415540 1464099 1515921 1570297 1628286 1692114 1762575 1839072 1921833 2011971 2109652
57636B109652J04655J12198J21266J30972J40680J51617J64787J79255J93954
$$ 2109652 2214307 2326505 2447771 2578743 2719423 2871040 3035827 3215082 3409036
57627C409036K09146K24682K38965K51169K62384K72880K80015K80283K71758
$$ 3409036 3618182 3842864 4081829 4332998 4595382 4868262 5148277 5428560 5700318
57618E700318K53458K24638J86172J40888R1380L9446j1494n6081r0620j14908
$$ 5700318 5953776 6178414 6364586 6505474 6596854 6636300 6624806 6568725 6478105 6363197
57608F363197j29367j32867j25120j09374r1694p9403q0265r9092j32725j70600
$$ 6363197 6233830 6100963 5975843 5866469 5774775 5695372 5615107 5516015 5383290 5212690
57598E212690k02273k22908k31531k28146k15017j97313j79210j60962j41653
$$ 5212690 5010417 4787509 4555978 4327832 4112815 3915502 3736292 3575330 3433677
57589C433677j22342j04414q7403p0953n6557m4929l3829k1054p622M452J5392
$$ 3433677 3311335 3206921 3119518 3048565 2992008 2947079 2913250 2892196 2884574 2889026 2904418
57578B904418K6235L6242M4573N2836O3203P5321Q7493R9571J12348J25445J38112
$$ 2904418 2930653 2966895 3011468 3064304 3127507 3202828 3290321 3389892 3502240 3627685 3765797
57567C765797J50880J64330J77456J89004J99098K07672K12895K12931K07459
$$ 3765797 3916677 4081007 4258463 4447467 4646565 4854237 5067132 5280063 5487522
57558E487522J95660J74644J42263J00033N1588r0n2184j01045j44014j80605
$$ 5487522 5683182 5857826 6000089 6100122 6151710 6151620 6099436 5998391 5854377 5673772
57548E673772k10101k30356k40973k45122k45628k41679k32155k19557k07262
$$ 5673772 5463671 5233315 4992342 4747220 4501592 4259913 4027758 3808201 3600939
57539C600939j95034j80923j65866j52573j41183j29770j18244j08232r9853r1920
$$ 3600939 3405905 3224982 3059116 2906543 2765360 2635590 2517346 2409114 2309261 2217341
57529B217341q4618p8781p3199o6017n8365n3294n1163m9166m5396m0665l6187
$$ 2217341 2132723 2053942 1980743 1914726 1856361 1803067 1751904 1702738 1657342 1616677 1580490
57518A580490l2119k8633k6197k4464k2548k0313j8028j5394j2386j0061q937
$$ 1580490 1548371 1519738 1493541 1469077 1446529 1426216 1408188 1392794 1380408 1370347 1361410
57507A361410p762n638l825l384k789k92L032N351P477J1069J4997J6910J7352
$$ 1361410 1353648 1348010 1344185 1340801 1338012 1337720 1340752 1346103 1353580 1364649 1379646 1396556 1413908
57494A413908J8753K1285K3155K4393K6676K9860L2272L4276L8096M4067N0368
$$ 1413908 1432661 1453946 1477101 1501494 1528170 1558030 1590302 1624578 1662674 1706741 1757109
57483A757109N6351O2778O8912P2988P5953Q1188Q9748R9028J06850J13935J21488
$$ 1757109 1813460 1876238 1945150 2018138 2094091 2175279 2265027 2364055 2470905 2584840 2706328
57472B706328J29267J36961J44858J52209J57323J59969J61284J60626J54962
$$ 2706328 2835595 2972556 3117414 3269623 3426946 3586915 3748199 3908825 4063787
57463D063787J42102J22313R6202O3741K6490j1542m6704p7924j05402j28795
$$ 4063787 4205889 4328202 4424404 4488145 4514635 4503093 4456389 4378465 4273063 4144268
57453D144268j47303j60092j66179j65394j59644j51675j42658j32626j22648
$$ 4144268 3996965 3836873 3670694 3505300 3345656 3193981 3051323 2918697 2796049
57444B796049j14141j06119r5985q3569p1864o3128n6484n0113m3618l7339l1187
$$ 2796049 2681908 2575789 2479804 2396235 2324371 2261243 2204759 2154646 2111028 2073689 2042502
57433B042502k5195j9792j4863r773m509M72N399J0707J5786J9948K4300L0511
$$ 2042502 2017307 1997515 1982652 1972879 1968370 1968842 1974241 1984948 2000734 2020682 2044982 2075493
57421B075493L8120M5177N1304N7711O4502P0543P6041Q2510R0095R7539J04960
$$ 2075493 2113613 2158790 2210094 2267805 2332307 2402850 2478891 2561401 2651496 2749035 2853995
57410B853995J13802J23575J31581J36595J40086J42701J42085J35364J21667
$$ 2853995 2967797 3091372 3222953 3359548 3499634 3642335 3784420 3919784 4041451
57401D041451J01292P4442M1944N672l2470p0477j05167j33326j54296j69483
$$ 4041451 4142743 4217185 4259129 4264801 4232331 4161854 4056687 3923361 3769065 3599582
57391C599582j79229j82605j80367j75304j68897j60345j49682j39096j29935
$$ 3599582 3420353 3237748 3057381 2882077 2713180 2552835 2403153 2264057 2134122
57382B134122j20838j10360r9446q9959q2462p6451p1341o6323o0701n5018n0419
$$ 2134122 2013284 1902924 1803478 1713519 1631057 1554606 1483265 1416942 1356241 1301223 1250804
57371A250804m6859m3449m0438l8699l7375l4582l0509k7318k5665k4099k2130
$$ 1250804 1203945 1160496 1120058 1081359 1043984 1009402 978893 951575 925910 901811 879681
57360H79681k0975k0666j9528j7367j6283j7142j8050j7360j5646j3596j0818
$$ 879681 858706 838040 818512 801145 784862 767720 749670 732310 716664 703068 692250
57349F92250p889o788p869q942q672q301q699q549o972n409n065m938m002l143
$$ 692250 684361 677573 669704 660762 652090 643789 635090 626541 619569 614160 609095 604157 600155 597012
57335E97012l245l421k794k048j899j918j948k541l014j608J281K628Q65k120
$$ 597012 593767 590346 587552 585504 583605 581687 579739 577198 574184 572576 573857 576485 577350 575230
57321E75230m154n154n064k726J294L833L283J952K181K896K317J353J549K045
$$ 575230 571076 565922 560858 558132 559426 563259 566542 568494 570675 573571 575888 577241 578790 580835
57307E80835J242m18j799l237m961n400l607j625j882l774n107n324n134m496
$$ 580835 582077 581659 579860 576623 571662 566262 562655 561030 559148 555374 550267 544943 539809 535313
57293E35313l222k262k244k073q05N57Q33O68J095J756K164K951M253M840M462
$$ 535313 532091 529829 527585 525512 524707 525264 526097 526765 527860 529616 531780 534731 538984 543824 548286
57278E48286M957P239R302R171P766P058P415Q515J0523J2549J2455J0179Q752
$$ 548286 553243 560482 569784 578955 586721 593779 601194 609709 620232 632781 645236 655415 664167
57265F64167R867J1196J0425R061R563J1354J2588J3377J4277J4035J1944J0184
$$ 664167 674034 685230 695655 704716 714279 725633 738221 751598 765875 779910 791854 802038
57253H02038J0719J2191J2750J3441J5544J7273J6865J6501J9024K2908K4795
$$ 802038 812757 824948 837698 851139 866683 883956 900821 917322 936346 959254 984049
57242I84049K5176K7083L0427L2142L1350L0219L0181L0975L2916L6579M0637
$$ 984049 1009225 1036308 1066735 1098877 1130227 1160446 1190627 1221602 1254518 1291097 1331734
57231A331734M3279M5274M8677N3262N7223O0399O3682O6202O6402O5001O3594
$$ 1331734 1375013 1420287 1468964 1522226 1579449 1639848 1703530 1769732 1836134 1901135 1964729
57220A964729O1353N6489M9927M3907L7832K9240J8234P219l227j4453k5954l5256
$$ 1964729 2026082 2082571 2132498 2176405 2214237 2243477 2261711 2268930 2265703 2251250 2225296 2190040
57208B190040m1655m6782n1239n3725n3616n1728m8593m4476m0649l8093l5488
$$ 2190040 2148385 2101603 2050364 1996639 1943023 1891295 1842702 1798226 1757577 1719484 1683996
57197A683996l0978k5028j9149j3148o554j203J074J939M114O828P620P356Q939
$$ 1683996 1653018 1627990 1608841 1595693 1589139 1587936 1589010 1590949 1595063 1601891 1609511 1616867 1625806
57184A625806J1856J2715J1052R920J0462J0395Q628P149P232P531P094P082Q341
$$ 1625806 1637662 1650377 1661429 1671349 1681811 1692206 1700834 1707983 1715215 1722746 1729840 1736922 1745263
57171A745263R990J1410J3084J4908J5916J6081J6261J6389J5860J5401J6288
$$ 1745263 1755253 1766663 1779747 1794655 1810571 1826652 1842913 1859302 1875162 1890563 1906851
57160A906851J8211K0183K2716K6406K9539L0131K9579L1124L5238L9606M2904
$$ 1906851 1925062 1945245 1967961 1994367 2023906 2054037 2083616 2114740 2149978 2189584 2232488
57149B232488M5594M7840M9879N3615O0556O8912P5790Q1237Q6865R1918R4433
$$ 2232488 2278082 2325922 2375801 2429416 2489972 2558884 2634674 2715911 2802776 2894694 2989127
57138B989127R5132R6201R7266R6548R5025R5272R6961R7554R6782R6515R7039
$$ 2989127 3084259 3180460 3277726 3374274 3469299 3564571 3661532 3759086 3855868 3952383 4049422
57127D049422R7283R7775R9466J00768R9903R8813J00407J03344J04072J02653
$$ 4049422 4146705 4244480 4343946 4444714 4544617 4643430 4743837 4847181 4951253 5053906
57117E053906J01819J01719J00536R8936R8763R8790R6988R5406R7221J00447
$$ 5053906 5155725 5257444 5357980 5456916 5555679 5654469 5751457 5846863 5944084 6044531
57107F044531J00528R7798R6325R6602R5867R4385R4795R6104R5097R2874R3145
$$ 6044531 6145059 6242857 6339182 6435784 6531651 6626036 6720831 6816935 6912032 7004906 7098051
57096G098051R4797R3236Q8512Q4998Q3483Q0907P7455P6409P7184P5959P2966
$$ 7098051 7192848 7286084 7374596 7459594 7543077 7623984 7701439 7777848 7855032 7930991 8003957
57085H003957P1650P1041O6691N8714N0988M2892L0196J3425l230k0643m3142
$$ 8003957 8075607 8146648 8213339 8272053 8323041 8365933 8396129 8409554 8406324 8385681 8342539
57074H342539o9000r2229j13381j38361j66782j92414k15349k42586k75772l09593
$$ 8342539 8273539 8181310 8067929 7929568 7762786 7570372 7355023 7112437 6836665 6527072
57064F527072l43213l82022m27188m74934n26855n88885o59190p29523p99321
$$ 6527072 6183859 5801837 5374649 4899715 4372860 3783975 3124785 2395262 1595941
57055A595941G20182b39555j045846j136238j239405j354413j472642j596258
$$ 1595941 720182 -239555 -1285401 -2421639 -3661044 -5015457 -6488099 -8084357
57047h084357j737968j901003k076605k262319k464704k684598k921442l192820
$$ -8084357 -9822325 -11723328 -13799933 -16062252 -18526956 -21211554 -24132996 -27325816
57039b7325816l525781l926612m384116m905761n524030o259265p091762p964927
$$ -27325816 -30851597 -34778209 -39162325 -44068086 -49592116 -55851381 -62943143 -70908070
57031g0908070q804753r573688j0336575j1183582j1952157j2085296j1043878
$$ -70908070 -79712823 -89286511 -99623086 -110806668 -122758825 -134844121 -145887999
57024a45887999r031069p146156o552730p452561q988611j0106471j0325853r701583
$$ -145887999 -154919068 -162065224 -168617954 -176070515 -185059126 -195165597 -205491450 -215193033
57016b15193033q361862o336271l726808p95823K169639M974718P487282R603021
$$ -215193033 -223554895 -229891166 -233617974 -234413797 -232244158 -227269440 -219782158 -210179137
57008b10179137J1289507J2601522J3603793J4300614J4653766J4635836J4253117
$$ -210179137 -198889630 -186288108 -172684315 -158383701 -143729935 -129094099 -114840982
57001a14840982J3551072J2618207J1562364J0465179R368363Q301910P300856
$$ -114840982 -101289910 -88671703 -77109339 -66644160 -57275797 -48973887 -41673031
56994d1673031O388863N569098M841411M211183L674402L212093K808363K460475
$$ -41673031 -35284168 -29715070 -24873659 -20662476 -16988074 -13775981 -10967618 -8507143
56986h507143K165736J913041J693413a229419A15728J201511J069585R54135
$$ -8507143 -6341407 -4428366 -2734953 -1229419 115728 1317239 2386824 3340959
56978C340959Q56770P70102O89118O17198N56050N00048M45438L95769L53589
$$ 3340959 4197729 4967831 5656949 6274147 6830197 7330245 7775683 8171452 8525041
56969H525041L15290K78100K43851K12437J79630J44686J12234Q3901N5679K5934
$$ 8525041 8840331 9118431 9362282 9574719 9754349 9899035 10011269 10095170 10150849 10176783
56959A0176783k044k7839n6061q8229j20382j51312j84827k21500k56723k90267
$$ 10176783 10174739 10146900 10090839 10002610 9882228 9730916 9546089 9324589 9067866 8777599
56949H777599l28910l74804m18426m47611m57682m49563m25296l90056l52445
$$ 8777599 8448689 8073885 7655459 7207848 6750166 6300603 5875307 5485251 5132806
56940E132806l17522k83582k48799k16022j87894j62358j36505j10584q5350n9454
$$ 5132806 4815284 4531702 4282903 4066881 3878987 3716629 3580124 3469540 3384190 3324736
56930C324736l1724k194L0010O5270R9821J29623J57511J87166K07388J92381
$$ 3324736 3293012 3290818 3320828 3386098 3485919 3615542 3773053 3960219 4167607 4359988
56920D359988J25281J7128j01583k02907k72185l06269l11050k98450k78645k54761
$$ 4359988 4485269 4502397 4400814 4197907 3925722 3619453 3308403 3009953 2731308 2476547
56910B476547k27184j99152j74006j50565j26336j02940q3847o8894n5483m3387
$$ 2476547 2249363 2050211 1876205 1725640 1599304 1496364 1412517 1343623 1288140 1244753
56900A244753l4116k6887j9425j2095p817q297j3023k1210l2042m3563n3578o1394
$$ 1244753 1210637 1183750 1164325 1152230 1144413 1136116 1123093 1101883 1069841 1026278 972700 911306
56888I11306o7164p0312p0060o6822o1971n6877n2605m9201m5021l8535l1040
$$ 911306 844142 773830 703770 636948 574977 518100 465495 416294 371273 332738 301698
56877C01698k5223k0826j4655n770K664Q085J2020J6799K1363K2679J9252J1364
$$ 301698 276475 255649 240994 235224 237888 245973 257993 274792 296155 318834 338086 349450
56865C49450j56j3288k4758l2505l7169l9893m0375l8372l5181l2160B6429G30
$$ 349450 349294 336006 311248 278743 241574 201681 161306 122934 87753 55593 26429 730
56852b1358j8629j5165j2383j1481j1926j1641j0126r047r046q726p813q238j0534
$$ -21358 -39987 -55152 -67535 -79016 -90942 -102583 -112709 -121756 -130802 -139528 -147341 -155579 -166113
56839a66113j1982j0358p001m245k155J06J997K934M007O330R236J1975J5456
$$ -166113 -178095 -188453 -195454 -199699 -201854 -201748 -199751 -196817 -192810 -186480 -177244 -165269 -149813
56826a49813K0410K5533K9149L1104a2184A6987K4285J8890J4656J0796O570L681
$$ -149813 -129403 -103870 -74721 -43617 -12184 16987 41272 60162 74818 85614 92184 95865
56814I5865L884N899P129P104O935O837O699P866J1750J7263K1960K5246K8509
$$ 95865 99749 105648 112777 119881 126816 133653 140352 148218 159968 177231 199191 224437 252946
56801B52946L2812L8279M5013N2228N6672N4069M2854K5648P282p958j7942k3056
$$ 252946 285758 324037 369050 421278 477950 532019 574873 600521 607803 599845 581903 558847
56789E58847k5008k4710k1874j6893j1676p565l577J984R143J6631K3793L0975
$$ 558847 533839 509129 487255 470362 458686 451121 447544 449528 458671 475302 499095 530070
56777E30070L8828M8235O0044P3732Q6795R6015R8413R0801P0688L9414L319k9792
$$ 530070 568898 617133 677177 750909 837704 933719 1032132 1122933 1193621 1233035 1236354 1206562
56765A206562n4911p0403p6515p5269p0290o4422n7798m9577m0639l2852k6304
$$ 1206562 1151651 1081248 1004733 929464 859174 794752 736954 687377 646738 613886 587582
56754E87582j9185j0257qJ0491K0567K9873L8488M6915N4822N9677N7559M5856
$$ 587582 568397 558140 558132 568623 589190 619063 657551 704466 759288 818965 876524 922380
56742I22380K5365L02k3653m2204n4334o1291o3949o2082n6282m8989m2584l7311
$$ 922380 947745 948047 924394 882190 827856 766565 702616 640534 584252 535263 492679 455368
56730D55368l1920k5610j8645j1726n519l17M356R216J4221J8822K2981K6608
$$ 455368 423448 397838 379193 367467 361948 361631 365987 375203 389424 408246 431227 457835
56718D57835K7907K4063J4341J158j2357k4486l4153m0061m1794m0457l7312l2966
$$ 457835 485742 509805 524146 525304 512947 488461 454308 414247 372453 331996 294684 261718
56706B61718k8524k5595k4179k2306j9063j6143j5048j4518j2544r361o443m008
$$ 261718 233194 207599 183420 161114 142051 125908 110860 96342 83798 74437 67994 63986
56694F3986j554K27L25m85o25k14o28j895k524j773m51N97J195J114K4j668l070
$$ 63986 62432 62659 62984 62499 61874 61660 61032 59137 56613 54840 54389 54986 56181 57295 57319 55651 52581
56677E2581l910m410m431l783l116l168l472l017k000j612k143k650k541k241
$$ 52581 48671 44261 39830 36047 32931 29763 26291 23274 21274 19662 17519 14869 12328 10087
56663A0087k021j464m50K87K28m5L57J354J960J451J19j065j386q63j2N35J70
$$ 10087 8066 6602 6152 6439 6667 6622 6979 8333 10293 11744 11863 10798 9412 8549 8537 9072 9242
56646I242j346l164A136h46KJ38j487k693k410k057l011m250l740j176J792L584
$$ 9242 7896 4732 1136 -846 -844 -706 -2193 -4886 -7296 -9353 -12364 -16614 -20354 -21530 -19738 -16154
56630a6154L981L696L503a375B034K433J293J308K681L941L669K019R5j305j916
$$ -16154 -12173 -8477 -4974 -1375 2034 4467 5760 7068 9749 13690 17359 19378 19473 18168 16252
56615A6252j749j237q87n10M84J721J964J068N22J293K355K365J760J882K724
$$ 16252 14503 13266 12379 11869 12353 14074 16038 17106 17628 18921 21276 23641 25401 27283 30007
56600C0007K916J730jr78q23k59k61r99j638j544j307j797k533k264j165r03k096
$$ 30007 32923 34653 34652 33674 32851 32592 32331 31332 29694 28150 26843 25046 22513 20249 19084 18181 16085
56583A6085l171k552o13J265K390K573J523m05j814j796j073o79k97R33K594L200
$$ 16085 12914 10362 9749 11014 13404 15977 17500 17095 15281 13485 12412 11733 11436 12369 14963 18163
56567A8163K068J60q54n8J856L037K348Q11L50J108J343K30q84o53L34Q91J149
$$ 18163 20231 20391 19537 19479 21335 24372 26720 27531 27881 28989 30332 30562 29678 29025 29359 30250 31399
56550C1399J856K743K891K078P71n99j545j465n17J94R0m3N91J475J719J450J368
$$ 31399 33255 35998 38889 40967 41738 41139 39594 38129 37612 37806 37896 37853 38444 39919 41638 43088 44456
56533D4456J589J844K134K484K687K906L556M177L521J606L91J350L500M966N469
$$ 44456 46045 47889 50023 52507 55194 58100 61656 65833 69354 70960 71351 72701 76201 81167 86636
56518H6636N903O426O365N505M171K592J231J045K258L526L618L270L960N381
$$ 86636 92539 98965 105330 110835 115006 117598 118829 119874 122132 125658 129276 132546 136506 141887
56504A41887N777M704L833M676O652Q029P932O914N983N659N884O503P508Q744
$$ 141887 147664 152368 156201 160877 167529 175558 183490 190404 196387 202046 207930 214433 221941 230685
56490B30685R685R834R188Q039O590N200M394M028L011Q57j113j300j14O90M89
$$ 230685 240370 250204 259392 267431 274021 279221 283615 287643 290654 291511 290398 289098 288984 289674 290163
56475B90163p5j119l479o506p931o686m213k459k058k834m364n510n165m008l859
$$ 290163 290088 288969 285490 278984 271053 264367 260154 257695 255637 252803 248439 242929 237764 233756 229897
56460B29897m855n157l959k699k537k948l613n322p654q194n904l249k941m160
$$ 229897 225042 219885 215926 213227 210690 207742 204129 198807 191153 182959 177055 173806 170865 166705
56446A66705m109k112j15K00r41k051j587P89L357L707J685k57l40N68J067J365
$$ 166705 162596 160484 160369 160569 159628 157577 155990 156779 160136 163843 165528 165271 164931 165499 166566 167931
56430A67931K031K425J987J549J830K010J275M09M15R24J392K353M020N154M882
$$ 167931 169962 172387 174374 175923 177753 179763 181038 181447 181862 182786 184178 186531 190551 195705 200587
56415B00587M279M463M683L932L010L142L833L868L262K573J612N20O44K587M658
$$ 200587 204866 209329 214012 217944 220954 224096 227929 231797 235059 237632 239244 239764 240408 242995 247653
56400B47653N130M694M791N043M436L634L742L883K492K38o83L41J945K982L303
$$ 247653 252783 257477 262268 267311 271747 275381 279123 283006 285498 285736 285053 285394 287339 290321 293624
56385B93624K862J912J574K633M199M839M378L441K346J569J995L306L567J958
$$ 293624 296486 298398 299972 302605 306804 311643 316021 319462 321808 323377 325372 328678 332245 334203
56371C34203L96O95J834J947J341J239J131q7j628k082k187l599n825o954o790
$$ 334203 334599 335294 337128 339075 340416 341655 342786 342699 341071 338989 336802 333203 327378 320424 313634
56356C13634o684o829o251n157m821n196m787k932o00R81J142k34k203l070k458
$$ 313634 306950 300121 293870 288713 283892 278696 273909 270977 270377 271358 272500 272266 270063 266993 264535
56341B64535j982k623k977j661L22J605K836M574M838J914j906k837q54Q94J151
$$ 264535 262553 259930 256953 255292 255614 257219 260055 264629 269467 271381 269475 266638 265784 266678 267829
56326B67829J475K481K817K207K231L286L562J989l5p97l89J55M01O62J385K570
$$ 267829 269304 271785 274602 276809 279040 282326 285888 287877 287842 287045 286656 286811 287212 287874 289259 291829
56310B91829L348K679J158Q56K468M041L990L470L991M568L694K462K774L838
$$ 291829 295177 297856 299014 299870 302338 306379 310369 313839 317830 322398 326092 328554 331328 335166
56296C35166L449J810R58J111O51n05n54J022K603K955K510J987J633J881L051
$$ 335166 338615 340425 341383 342494 343145 342640 342086 343108 345711 348666 351176 353163 354796 356677 359728
56281C59728M540N570O207O586O301N781O660R099J0644R760Q420Q836R795R184
$$ 359728 364268 369838 376045 382631 388932 394713 401373 410472 421116 430876 439296 448132 457927 467111
56267D67111Q087Q980J1368J2767J2824J3073J3655J3566J3185J3329J2927J0824
$$ 467111 475198 484178 495546 508313 521137 534210 547865 561431 574616 587945 600872 611696
56255F11696Q699Q792R963R600Q115P775Q193P071M534K708J779M92k19J502M186
$$ 611696 620395 629187 639150 648750 656865 664640 672833 679904 684438 687146 688925 689417 689198 690700 694886
56240F94886M473K470J405K276L204L885N936Q714R493Q399Q716J1502J4199J5264
$$ 694886 699359 701829 703234 705510 708714 712599 718535 727249 736742 745141 753857 765359 779558 794822
56226G94822J6078J7356J7841J7560J8565K1310K3901K5815K8720L2815L6029
$$ 794822 810900 828256 846097 863657 882222 903532 927433 953248 981968 1014783 1050812
56215A050812L7805M0007M3318M6361M9135N3505N9271O3713O6280P0014P6859
$$ 1050812 1088617 1128624 1171942 1218303 1267438 1320943 1380214 1443927 1510207 1580221 1657080
56204A657080Q5048R2622J00238J08890J17839J26464J35646J45930J56506J66804
$$ 1657080 1742128 1834750 1934988 2043878 2161717 2288181 2423827 2569757 2726263 2893067
56194B893067J76954J86410J94419K01718K09058K14524K15405K12233K07450
$$ 2893067 3070021 3256431 3450850 3652568 3861626 4076150 4291555 4503788 4711238
56185D711238K00505J88237J69816J47286J21424R1652O0098L0970N186j9827
$$ 4711238 4911743 5099980 5269796 5417082 5538506 5630158 5690256 5721226 5726412 5706585
56175E706585m4375o5188q0693r2935j03037j09405j11875j13253j15144j16253
$$ 5706585 5662210 5597022 5516329 5423394 5320357 5210952 5099077 4985824 4870680 4754427
56165D754427j16289j17399j20405j23500j25981j29327j33385j35668j35752
$$ 4754427 4638138 4520739 4400334 4276834 4150853 4021526 3888141 3752473 3616721
56156C616721j36231j38031j38833j37389j35187j32631j27986j21441j15840
$$ 3616721 3480490 3342459 3203626 3066237 2931050 2798419 2670433 2548992 2433152
56147B433152j11879j06975j00196r3752q8163q0888p1606o4070o0400n8033n4349
$$ 2433152 2321273 2214298 2114102 2020350 1932187 1851299 1779693 1715623 1655223 1597190 1542841
56136A542841m9945m5296l8910l1174k5628k3806k2874k0683j9021j9415j9878
$$ 1542841 1492896 1447600 1408690 1377516 1351888 1328082 1305208 1284525 1265504 1246089 1226211
56125A226211j8409j5958j3593j0433o504l894l093j933J86J116O14J742N547
$$ 1226211 1207802 1191844 1178251 1167818 1161314 1157420 1154327 1152394 1152580 1153696 1154310 1156052 1161599
56112A161599Q813R203Q463Q542Q782Q809R771J0916R493N853L890M726N010L263
$$ 1161599 1170412 1179615 1188078 1196620 1205402 1214211 1223982 1234898 1244391 1250244 1254134 1258860 1263870 1267133
56098A267133K438M036N245M562M666P008Q891Q888R782J3177J6468J8128K0617
$$ 1267133 1269571 1273607 1278852 1283414 1288080 1295088 1303979 1312867 1322649 1335826 1352294 1370422 1391039
56085A391039K5099K8789L0648L4115M0946M7995N3451O0345P0239P9498Q5792
$$ 1391039 1416138 1444927 1475575 1509690 1550636 1598631 1652082 1712427 1782666 1862164 1947956
56074A947956R2549J02691J13767J23678J35402J51284J67939J81618J93202K03072
$$ 1947956 2040505 2143196 2256963 2380641 2516043 2667327 2835266 3016884 3210086 3413158
56064C413158K06443J99329J84573J67235J48714J29941J14882J05271R6253Q2461
$$ 3413158 3619601 3818930 4003503 4170738 4319452 4449393 4564275 4669546 4765799 4848260
56054D848260O4413M4600K2291k662k5571m1814n2358o0275o6492p3117q5412
$$ 4848260 4912673 4957273 4979564 4976902 4951331 4909517 4857159 4796884 4730392 4657275 4571863
56043D571863j05169j26701j44196j58193j70254j76952j74966j67227j58243
$$ 4571863 4466694 4339993 4195797 4037604 3867350 3690398 3515432 3348205 3189962
56034C189962j47748j34233j20288j09097r9679r0299q2229p5847o8154n8480
$$ 3189962 3042214 2907981 2787693 2678596 2578917 2488618 2406389 2330542 2262388 2203908
56024B203908n1159m8006m4132l6156k8236k4659k2748j8904j5264j4206j2492
$$ 2203908 2152749 2104743 2060611 2024455 1996219 1971560 1948812 1929908 1914644 1900438 1887946
56013A887946p274k035j71J470O284J1241J2804J3479J6005J7373J5338J4517
$$ 1887946 1880672 1878637 1878466 1879936 1886220 1897461 1910265 1923744 1939749 1957122 1972460 1986977
56001A986977J8921K4481K5944K5163K5808K6357K5159K5767K9965L2524L0175
$$ 1986977 2005898 2030379 2056323 2081486 2107294 2133651 2158810 2184577 2214542 2247066 2277241
55990B277241K8653L3184L9320M1222M1543M4655M7684M7028M6542N0187N3845
$$ 2277241 2305894 2339078 2378398 2419620 2461163 2505818 2553502 2600530 2647072 2697259 2751104
55979B751104N3413N3466N8642O4193O4771O4800P0057P6680P8906Q0075Q5435
$$ 2751104 2804517 2857983 2916625 2980818 3045589 3110389 3180446 3257126 3336032 3416107 3501542
55968C501542R1545R3460R4900J00711J06940J08987J11451J19160J27014J29862
$$ 3501542 3593087 3686547 3781447 3882158 3989098 4098085 4209536 4328696 4455710 4585572
55958D585572J33491J44261J56938J64619J71176J81826J91623J96103K02671
$$ 4585572 4719063 4863324 5020262 5184881 5356057 5537883 5729506 5925609 6128280
55949F128280K17809K33994K43410K53155K71728K92311L05660L17680L37214
$$ 6128280 6346089 6580083 6823493 7076648 7348376 7640687 7946347 8264027 8601241
55940H601241L58314L72613L87243M11737M39117M59571M80713N13979N53042
$$ 8601241 8959555 9332168 9719411 10131148 10570265 11029836 11510549 12024528 12577570
55931A2577570N87057O22961O72536P29700P83032Q37856R02565R67174J020554
$$ 12577570 13164627 13787588 14460124 15189824 15972856 16810712 17713277 18680451 19701005
55922A9701005J074758J146115J227046J303961J386913J491639J608467J720866
$$ 19701005 20775763 21921878 23148924 24452885 25839798 27331437 28939904 30660770
55914C0660770J838481J978907K134664K293528K472588K694376K950678L232405
$$ 30660770 32499251 34478158 36612822 38906350 41378938 44073314 47023992 50256397
55906E0256397L573164M015732M555426N163993N844235O607617P427608Q279448
$$ 50256397 53829561 57845293 62400719 67564712 73408947 80016564 87444172 95723620
55898I5723620R199566J0238808J1390336J2641260J4056289J5718564J7635737
$$ 95723620 104923186 115161994 126552330 139193590 153249879 168968443 186604180
55891A86604180J9821259K2416386K5583395K9325319L3554643L8133684M2330737
$$ 186604180 206425439 228841825 254425220 283750539 317305182 355438866 397769603
55884C97769603M4118990M0664495L0319621J4370429l399631j8995153l0161210
$$ 397769603 441888593 482553088 512872709 527243138 523843507 504848354 474687144
55877D74687144l6618727l9193573l9040737l7276332l4737564l1857465k8803267
$$ 474687144 438068417 398874844 359834107 322557775 287820211 255962746 227159479
55870B27159479k5707166k2710356j9882869j7243685j4848327j2770268j1015676
$$ 227159479 201452313 178741957 158859088 141615403 126767076 113996808 102981132
55863A02981132r532329q285815p262870o420577n698920n074745m551392m108188
$$ 102981132 93448803 85162988 77900118 71479541 65780621 60705876 56154484 52046296
55855E2046296l709354l349775l044479k783213k538628k309012k111532j942244
$$ 52046296 48336942 44987167 41942688 39159475 36620847 34311835 32200303 30258059
55847C0258059j781695j631853j509844j411479j315823j220256j138370j068689
$$ 30258059 28476364 26844511 25334667 23923188 22607365 21387109 20248739 19180050
55839A9180050r96786r23948q64107q16127p66630p16247o76701o45721o10328
$$ 19180050 18183264 17259316 16395209 15579082 14812452 14096205 13419504 12773783 12163455
55830A2163455n71500n41311n18849m92283m61652m37170m17982l94416l68558
$$ 12163455 11591955 11050644 10531795 10039512 9577860 9140690 8722708 8328292 7959734
55821G959734l51547l42630l30914l15456l04426k97077k85457k71414k63294
$$ 7959734 7608187 7265557 6934643 6619187 6314761 6017684 5732227 5460813 5197519
55812E197519k57912k43930k21237j99812j81623j60688j38798j24028j15295
$$ 5197519 4939607 4695677 4474440 4274628 4093005 3932317 3793519 3669491 3554196
55803C554196j04620r3075q8626r0055q8858q5195q6269r0482q8912q1384p5851
$$ 3554196 3449576 3356501 3267875 3177820 3088962 3003767 2917498 2827016 2738104 2656720 2580869
55792B580869p2840o5600n4841m8494m7056m3329l6429l2270l0539k4928j6026
$$ 2580869 2508029 2442429 2387588 2339094 2292038 2248709 2212280 2180010 2149471 2124543 2108517
55781B108517j0897j0018p791n669j1454k5248l8740m8682n8805o8379p1552o8660
$$ 2108517 2097620 2087602 2079811 2074142 2062688 2037440 1998700 1950018 1891213 1822834 1751282 1682622
55769A682622o6275o5332o0633n2383m6695m4277m0003l3905l1248l1374k8044
$$ 1682622 1616347 1551015 1490382 1437999 1391304 1347027 1307024 1273119 1241871 1210497 1182453
55758A182453k1411j8272j9622j9213j5453j3569j4791j4310j1341j0545j2065
$$ 1182453 1161042 1142770 1123148 1103935 1088482 1074913 1060122 1045812 1034471 1023926 1011861
55747A011861j0587n810l559n032n139k993l782q307j0863r710r873j3237j5373
$$ 1011861 1001274 995464 991905 986873 981734 978741 974959 966652 955789 946079 936206 922969 907596
55734I07596j4720j5527j9035k0712j8893j7709j8831j8671j6218j5441j7369
$$ 907596 892876 877349 858314 837602 818709 801000 782169 763498 747280 731839 714470
55723G14470j7788j5337j4034j5340j5368j2449r964r225p054k896j143l676o920
$$ 714470 696682 681345 667311 651971 636603 624154 614190 604965 597911 595015 593872 590196 583276
55710E83276q533j0476j3380j4625j4085j5182j8279j9387j7147j4617j2860r507
$$ 583276 574743 564267 550887 536262 522177 506995 488716 469329 452182 437565 424705 415198
55698D15198n128l838n856o454m154k942m644o105n847o362p699o087j332J449
$$ 415198 410070 406232 400376 393922 389768 386826 382182 376077 370230 363868 356169 350082 348750 350199
55684C50199l2k127k640m144p218p736m358j876l348n116l541q13r1k81M03N39
$$ 350199 350167 348040 345400 341256 334038 326302 321944 320068 316720 311604 308063 307250 307159 306878 307281 307820
55668C07820j043k255j699j542l580o137p368p824p764n958l036j865k957l640
$$ 307820 306777 304522 302823 301281 297701 291564 284196 276372 268608 262650 259614 257749 254792 251152
55654B51152k987k961l615k323Q50K288R62J22J251J815Q93J370M154N698M012
$$ 251152 248165 245204 241589 239266 240116 242404 243366 243488 244739 246554 247447 248817 252971 258669 262681
55639B62681K038K334L117K341J174R14O37P6P13K145J720m49q10J580L052J269
$$ 262681 264719 267053 270170 272511 273685 274599 275236 275312 276025 278170 279890 279441 278631 280211 283263 284532
55623B84532j515k915l322k865m47K441K220p10j694O69K421J552J261L314M355
$$ 284532 283017 280102 276780 273915 273468 275909 278129 277419 275725 276394 278815 280367 281628 284942 289297
55608B89297K153k47j94J57j210k055o20M89q92k322j352Q7j92m15J281K773J720
$$ 289297 291450 291203 291009 291166 289956 287901 287281 287770 286878 284556 283204 283291 283099 282684 283965 286738 288458
55591B88458l12j310k576n257o948n797m450n741p783p553o366p404j0160j1623
$$ 288458 288146 286836 284260 279003 272055 266258 261808 256067 248284 240731 234365 226961 216801 205178
55577B05178j1039r943r027q152p880q376q339p136o124o121n947m995m593n091
$$ 205178 194139 184196 175169 167017 159137 150761 142422 135286 129162 123041 117094 112099 107506 102415
55563A02415m663k752j542k112k393j004J90m97j762k009j796j637o80O04j40
$$ 102415 97752 95000 93458 91346 88953 87949 88139 87642 85880 83871 82075 80438 79758 80362 80222
55548H0222l023m770l630j822j221n68R98J635M17p17q08j699l770m162j816J32
$$ 80222 77199 72429 68799 66977 65756 65188 66186 67821 68238 67521 66713 65014 61244 57082 55266 55398
55532E5398l86j068K2R47J36m02O70J116l32j067K90P09j566l106j282P13m38
$$ 55398 55012 53944 53966 54913 55049 54647 55317 56433 56101 55034 55324 56033 54467 51361 50079 50792 50354
55515E0354k140q64J345R17n20N55K851K840J232R22J039r74l413k480J004K729
$$ 50354 48214 47350 48695 49612 49092 49647 52498 55338 56570 57492 58531 57557 54144 51664 52668 55397
55499E5397J674M95J23q21k020j716o16j082k686k722p75R23J323J377J592J847
$$ 55397 57071 57566 57689 56868 54848 53132 52516 51434 48748 46026 45251 46174 47497 48874 50466 52313
55483E2313K831M672N370L431P25j82K21K79O17K234L380K142K25K37J182P64
$$ 52313 55144 59816 65186 68617 69342 69160 69381 69660 70277 72511 75891 78033 78258 78495 79677 80441
55467H0441Q2J485L457K533q39l088l303l596m398m042k738k594l677m013l376
$$ 80441 80523 82008 85465 87998 87159 84071 80768 77172 72774 68732 65994 63400 59723 55710 52334
55452E2334l305l672l100k395l675o182o961n670m870n466A482b676k530j374
$$ 52334 49029 45357 42257 39862 36187 30005 23044 17374 12504 7038 1482 -2676 -5206 -6580
55438f580j07P89j20k220l082k119j243j465j569o68M58R71Q93J82j065j735q78
$$ -6580 -6687 -5898 -6018 -8238 -11320 -13439 -14682 -16147 -17716 -18384 -17926 -16955 -16062 -15880 -16945 -18680 -19558
55421a9558M62N76m11j254j915k915l359k132k40M68J31J15M32K32j92l63j159
$$ -19558 -19096 -18520 -18931 -20185 -22100 -25015 -28374 -30506 -30746 -30278 -30147 -30032 -29600 -29368 -29560 -29923 -31082
55404c1082k897l509j479J028J235K30P12J971J293q81j685r39j085k281k177
$$ -31082 -33979 -37488 -38967 -37939 -36704 -36474 -35762 -33791 -32498 -33379 -35064 -36003 -37088 -39369 -41546
55389d1546n31L10l1P00K771L370J349p16o18N14Q30L95jl48n14J1P06M09n53
$$ -41546 -42077 -41767 -41798 -41098 -38327 -34957 -33608 -34324 -34942 -34428 -33598 -33203 -33204 -33552 -34066 -34055 -33349 -32940 -33493
55370c3493o67J78P26R07J781K934K709J307P35J222N70k017m202l690j096J346
$$ -33493 -34160 -33982 -33256 -32349 -30568 -27634 -24925 -23618 -22883 -21661 -21091 -23108 -27310 -31000 -32096 -30750
55354c0750K280J771Q40Q20J952K763K107R90P83Q66K23nJ630L619L435J825J666
$$ -30750 -28470 -26699 -25859 -25039 -23087 -20324 -18217 -17227 -16444 -15578 -15355 -15360 -13730 -10111 -6676 -4851 -3185
55337c185a63B986J197q23A421a865m831m735k917j740k171k437j462n53n45l78
$$ -3185 -163 2986 4183 3360 1421 -1865 -6696 -11431 -14348 -16088 -18259 -20696 -22158 -22711 -23256 -23634
55321b3634L65L32r35j963k042k329l138k883r88P20R25P07J166J568J246J168
$$ -23634 -23269 -22937 -23872 -25835 -27877 -30206 -33344 -36227 -37215 -36495 -35570 -34863 -33697 -32129 -30883 -29715
55305b9715K053K844K478J450N32m70j576j972j452r77j043j015o67o22q65o65
$$ -29715 -27662 -24818 -22340 -20890 -20358 -20828 -22404 -24376 -25828 -26805 -27848 -28863 -29530 -30152 -31017 -31682
55289c1682l74j081k129j348J432L538L123J482O14O14P38J037J583J606P67j27
$$ -31682 -32056 -33137 -35266 -36614 -35182 -31644 -28521 -27039 -26425 -25811 -25073 -24036 -22453 -20847 -20080 -20207
55273b0207m61o20q31p30n53j102j952j612k1R20Q4j430k226k211j597k73J072
$$ -20207 -20668 -21288 -22119 -22849 -23402 -24504 -26456 -28068 -28089 -27169 -27085 -28515 -30741 -32952 -34549 -34822 -33750
55256c3750J165K52J76J445K174J056n06m75J112K695L175K289K39k019l106k675
$$ -33750 -32585 -32333 -32157 -30712 -28538 -27482 -27988 -28463 -27351 -24656 -21481 -19192 -18953 -20972 -24078 -26753
55240b6753j696r59l54J81K99J91N86J534K351K795L074K792J400l59j138q91
$$ -26753 -28449 -29408 -29762 -29581 -29282 -29091 -28505 -26971 -24620 -21825 -18751 -15959 -14559 -14918 -16056 -16947
55224a6947m88K35K037M097M520K999R48r00k748l888l151j362o97j357j501o66
$$ -16947 -17435 -17200 -15163 -11066 -6546 -3547 -2599 -3499 -6247 -10135 -13286 -14648 -15345 -16702 -18203 -18869
55208a8869n01j491j872o40R27J628J836J873J226J37k96j58m87q01M46K591L015
$$ -18869 -19370 -20861 -22733 -23373 -22446 -20818 -18982 -17109 -15883 -15746 -16042 -16200 -16687 -17488 -17042 -14451 -11436
55191a1436J287j17l3n5q01m20J678L092K410J463a362d12j581l599k719n91L
$$ -11436 -10149 -10266 -10299 -10354 -11155 -11575 -9897 -6805 -4395 -2932 -1362 -412 -1993 -5592 -8311 -8902 -8899
55174h899m06K60J466J209p1j79R72J278Pj219r93L39J735b018B26J217M3E82
$$ -8899 -9305 -9045 -7579 -6370 -6441 -6620 -5648 -4370 -4363 -5582 -6575 -6236 -4501 -2018 226 1443 1486 582
55155a092j949j413j021j938k983j597J827L597K054J34N26J476L31j527j047
$$ -1092 -3041 -4454 -5475 -7413 -10396 -11993 -10166 -6569 -4515 -4381 -3855 -2379 -2048 -3575 -4622
55140d622J109J650J04p62K87i18a60m92j247j717k138j777k52J505K432a416
$$ -4622 -3513 -1863 -1759 -2521 -2234 -918 -160 -652 -1899 -3616 -5754 -7531 -7783 -6278 -3846 -1416
55123E54J510J508K054K368J560j3j002p46mQ9o96j620j900j647C04b006k230
$$ 554 2064 3572 5626 7994 9554 9541 8539 7793 7789 7878 7182 5562 3662 2015 304 -2006 -4236
55106d236l91K021a42B37a630j942n6a565A756L402K061m62l060i78m995l963
$$ -4236 -4627 -2606 -142 237 -1630 -3572 -3628 -1565 1756 5158 7219 6757 3697 -978 -5973 -9936
55090i936j686P99J839J025l40r73o83M06K122L262a922n23k521k303j163p18
$$ -9936 -11622 -10823 -8984 -7959 -8299 -9272 -9955 -9549 -7427 -4165 -1922 -2445 -4966 -7269 -8432 -9150
55074i150o57jR70J402J268J012R09J452B98M960N430M563M036M143L227R92k45
$$ -9150 -9807 -9808 -8838 -7436 -6168 -5156 -4247 -2795 298 5258 10688 15251 19287 23430 26657 27649 27404
55057B7404Q01K080J514K67L43R09j75k564l915l429k451k032k000k097k409k732
$$ 27404 28205 30285 31799 32066 32409 33318 33143 30579 26664 23235 20784 18752 16752 14655 12246 9514
55041I514k724k230q99J514L779L799J684L47J553L298L061J743J858L240L446
$$ 9514 6790 4560 3661 5175 8954 12753 14437 14784 16337 19635 22696 24439 26297 29537 32983
55026C2983J777K27M64J961L267L472K483J087N64J163J478L09j591k599k233
$$ 32983 34760 34987 35451 37412 40679 44151 46634 47721 48285 49448 50926 51235 49644 47045 44812
55011D4812r58R20K834L424K051J40m17L15P10r7j349j696m76J489K125L53j851
$$ 44812 43854 44774 47608 51032 53083 53223 52806 53121 53831 53734 52385 50689 50213 51702 53827 54180 52329
54994E2329j400J459L023J322j208j736j037j310k295k310j494j287j773j966
$$ 52329 50929 52388 55411 56733 55525 53789 52752 51442 49147 46837 45343 44056 42283 40317
54980D0317j748j369j24K387M643M924L613J977pk434l579j879J095K200P78j035
$$ 40317 38569 37200 37076 39463 44106 49030 52643 54620 54613 52179 48600 46721 47816 50016 50794 49759
54964D9759j491p54K32O41J26l22J010L741M779K438o86j246J43M62r29k150k333
$$ 49759 48268 47514 47746 48387 48513 48191 49201 52942 57721 60159 59473 58227 58370 58832 57903 55753 53420
54947E3420k226j870o62O68P90P8q2J99j04p17o84m09n84j98J641L001J438j807
$$ 53420 51194 49324 48662 49330 50120 50198 50116 50315 50211 49494 48810 48401 47817 47619 49260 52261 53699 51892
54929E1892l152j739Q9R61J714K626K824K593L122L777K664K34q78P5J073Q49
$$ 51892 48740 47001 47090 48051 49765 52391 55215 57808 60930 64707 67371 67605 66727 66802 67875 68724
54913F8724L71L13J64L56K193M879N671L966K422K989M533N481O026O497O091
$$ 68724 69095 69408 69572 69928 72121 77000 82671 86637 89059 92048 96581 102062 108088 114585 120676
54898A20676M811M463O224Q925J0876J1733J1792J1387J1689J4020J7434J9000
$$ 120676 125487 129950 136174 145099 155975 167708 179500 190887 202576 216596 234030 253030
54886B53030J7486J4814J3029J1788R801O737K679k410p624j1283j3138j4677
$$ 253030 270516 285330 298359 310147 319948 326685 329364 326954 319330 308047 294909 280232
54874B80232j6455j7160j6191j5098j5112j5170j3826j1558r754q605p323n463
$$ 280232 263777 246617 230426 215328 200216 185046 171220 159662 149908 141303 133980 128517
54862A28517l151r24K28j70q47p9J741K658K484L188N317O769O277N711P159R829
$$ 128517 125366 124442 124670 124500 123653 123574 125315 127973 130457 133645 138962 145731 152008 157719 164878 174707
54846A74707J1719J2684J3809J5075J5548J5087J4106J2314R097M696q7m851r400
$$ 174707 186426 199110 212919 227994 243542 258629 272735 285049 294146 298842 298755 293904 284504
54833B84504j3221j5835j7193j7280j6143j4599j3736j3385j2278j0219q597q198
$$ 284504 271283 255448 238255 220975 204832 190233 176497 163112 150834 140615 132018 123820
54821A23820p979o912n584m906m474l462k169j507j611j906j943j571q37k66o35
$$ 123820 115841 108929 103345 98439 93965 90503 88334 86827 85216 83310 81367 79796 78959 78693 78058
54806G8058j947l225l593k967j730n88n70k024l563l260j073J053J472J49k094
$$ 78058 76111 72886 69293 66326 64596 64008 63438 61414 57851 54591 53518 54571 56043 56192 54098
54791E4098m198m849l503j464m16j20P34J784J354m50j516r76j84qM13J363J583
$$ 54098 49900 45051 41548 40084 39668 39548 40282 42066 43420 42970 41454 40478 40294 40286 40699 42062 43645
54774D3645P07K70R59J075o84k850l198j616M55K020K655K156J233J194J976K082
$$ 43645 44352 44622 45581 46656 45972 43122 39924 38308 38763 40783 43438 45594 46827 48021 49997 52079
54758E2079J331J604L656N293M536K675K262L493M717N337O102P217P910P678
$$ 52079 53410 55014 58670 63963 68499 71174 73436 76929 81646 86983 93085 100302 108212 115890
54744A15890O743N628N094N783P381R027J0794J3306J5554J5330J2793J1328J3181
$$ 115890 122633 128261 133355 139138 146519 155546 166340 179646 195200 210530 223323 234651 247832
54731B47832J6267J7163J5502J3231J0988P834L720j03k943n194p229r149j1230
$$ 247832 264099 281262 296764 309995 320983 328817 332537 332434 329491 324297 317068 307919 296689
54718B96689j3338j4417j3776j2246j0953r634p441m795l106l037l922m446l280
$$ 296689 283351 268934 255158 242912 231959 222325 214884 210089 206983 203946 200024 195578 192298
54705A92298O9M116O205N468M041M270N833O778O500O156O824Q465J0393J1905
$$ 192298 192367 196483 202688 208156 212197 216467 222300 229078 235578 241734 248558 257023 267416 279321
54691B79321J2935J4514J7612K1151K2519K0741J7563J4553J0852N267j279p020
$$ 279321 292256 306770 324382 345533 368052 388793 406356 420909 431761 437028 435749 428729
54679D28729j1731j5985j9250k0678k0890k1159k1457k0931j9607j7985j5727
$$ 428729 416998 401013 381763 361085 340195 319036 297579 276648 257041 239056 223329
54668B23329j2454r234p678p837q424q645q566q050o831n339m370m098m177m307
$$ 223329 210875 201641 193963 186126 177702 169057 160491 152441 145610 140271 135901 131803 127626 123319
54654A23319m068k969j384n25p23q66k61K40l1k27M18J073P92J67O6N5l91n12
$$ 123319 119251 116282 114898 114373 113650 112784 112523 112763 112732 112505 112923 113996 114788 114955 115021 115076 114685 114173
54636A14173K57Q64M61K07J306K575K235R62P04J384J301K32l42P5M41K97M29
$$ 114173 114430 115294 115755 115962 117268 119843 122078 123040 123744 125128 126429 126661 126319 126394 126835 127132 127561
54619A27561J261K187K635K529J985J553K171L611L965K161M8K38K748N551P369
$$ 127561 128822 131009 133644 136173 138158 139711 141882 145493 149458 151619 151667 151905 154653 160204 167573
54604A67573Q082P408N558M396N550P897R057Q592P580O060L688K078L188N739
$$ 167573 175655 183063 188621 193017 198567 206464 215521 224113 231693 237753 241441 243519 246707 252446
54590B52446O529N252M694N843O486N593N542Q161J1464J2485J1263R941R496
$$ 252446 258975 264227 268921 274764 281250 286843 292385 300546 312010 324495 335758 345699 355195
54577C55195R388R272R242Q967P826N521J858l194q592j2444j3866j3934j4190
$$ 355195 364583 373855 383097 392064 399890 405411 407269 404075 395483 383039 369173 355239 341049
54564C41049j4955j5519j5185j3776j1908j0855j1213j1737j0720q371o417n396
$$ 341049 326094 310575 295390 281614 269706 258851 247638 235901 225181 216810 210393 204997
54552B04997m160k249p46j62N73K001K841K044N80j61l46p13q12J17J387J581
$$ 204997 200837 198588 197842 197680 198253 200254 203095 205139 205719 205558 205212 204499 203687 203804 205191 206772
54536B06772M97j136l258o086q423q229n426k665k395m192n853o399o610o956
$$ 206772 207269 206133 202875 196789 188366 180137 174711 172046 169651 165459 159606 153207 146597 139641
54522A39641o531m758k890k563l448l678k552j304j071j476j806k101k294j660
$$ 139641 133110 128352 125462 122899 119451 115773 113221 111917 110846 109370 107564 105463 103169 101509
54508A01509k38M33o16j915j353Q19K339J852M4j776k800k600j285K00J012J451
$$ 101509 101271 101704 101088 99173 97820 98639 100978 102830 102874 101098 98298 95698 94413 94613 95625 97076
54492I7076K195K917K840K224J954K039J820J431J639K353K573J886R12M27R35
$$ 97076 99271 102188 105028 107252 109206 111245 113065 114496 116135 118488 121061 122947 123859 124286 125221
54477A25221K731N215O727O330N331N517O435O144M381L038L398M654N411N109
$$ 125221 127952 133167 139894 146224 151555 157072 163507 169651 174032 177070 180468 185122 190533 195642
54463A95642L743J567n22j671k427m123o714q464q083o218m549m279n416o732
$$ 195642 199385 200952 200430 198759 196332 192209 185495 177031 168948 162730 158181 153902 148486 141754
54449A41754o613m867l167k809k901k123j141j324j959j229M95Q85p26k412k579
$$ 141754 135141 130274 127107 124298 121397 119274 118133 116809 114850 113621 114116 115001 114275 111863 109284
54434A09284j557jJ902L179K559Q75O61K407L563K418O22M13J380J677Q74q6n95
$$ 109284 107727 107726 109628 112807 115366 116241 116902 119309 122872 125290 125912 126325 127705 129382 130256 130170 129575
54417A29575m53O82K507L594K948J422N85R38J942L010L561L024J666P06Q85J513
$$ 129575 129122 129804 132311 135905 138853 140275 140860 141798 143740 146750 150311 153335 155001 155707 156592 158105
54401A58105J512N81j001k751l729l000r25Q89J434J152O58j71j272j792j278
$$ 158105 159617 160198 159197 156446 152717 149717 148792 149681 151115 152267 152925 152754 151482 149690 148412
54386A48412n22m60r26j161q79m15l35j004j961k008q45j88j765m479n362l456
$$ 148412 147890 147430 146504 145343 144464 144049 143714 142710 140749 138741 137896 137708 135943 131464 126102 122646
54370A22646q31M58M67K6p18j615k074k058k061j667J36K698L891L211K642L494
$$ 122646 121815 122273 122740 122766 122048 120433 118359 116301 114240 112573 112709 115407 119298 122509 125151 128645
54354A28645M527M321L349K362R08r63j508K54K623L633L788M498N264M774L593
$$ 128645 133172 137493 140842 143204 144112 143149 141641 141895 144518 148151 151939 156437 161701 166475 170068
54339A70068L394M241M733M459M347M823N359N669N965O131N859N388N133M874
$$ 170068 173462 177703 182436 186895 191242 196065 201424 207093 213058 219189 225048 230436 235569 240443
54325B40443M100K682O22k174n050o557o135n057m804n428o194o679o390m777
$$ 240443 244543 247225 247847 245673 240623 234066 227931 222874 218070 212642 206448 199769 193379 188602
54311A88602k738k557m855p081o698m502k952k472j658j97Q30J089J248J284N52
$$ 188602 185864 183307 178452 171371 164673 160171 157219 154747 153089 152892 153722 154811 156059 157343 157895
54296A57895n35p26R8Q07Q44P06O98O29P49J393J898J303K05L57K225M407N706
$$ 157895 157360 156634 156732 157539 158383 159089 159787 160416 161165 162558 164456 165759 165964 166321 168546 172953 178659
54279A78659O356O763O389M800K923K341L439M720M128J279j765k584j382r10
$$ 178659 185015 191778 198167 202967 205890 208231 211670 216390 220518 221797 220032 217448 216066 215156
54265B15156k833n494o239m925l612l525m021m415n127o676q596r786r410p426
$$ 215156 212323 206829 200590 195665 192053 188528 184507 180092 174965 168289 159693 149907 140497 133071
54251A33071m727k622j749j751k231l347m983o237o482o175n872n264m022k696
$$ 133071 128344 125722 123973 122222 119991 116644 111661 105424 98942 92767 86895 81631 77609 74913
54237G4913j777p76O64J641J229l0j052j837k793l364k936k318k521k710j230
$$ 74913 73136 72360 73024 74665 75894 75864 74812 72975 70182 66818 63882 61564 59043 56333 55103
54222E5103J542L338L007J719R64Q81Q62N77mn89n45L49J165Q75j43n95o7P13
$$ 55103 56645 59983 62990 64709 65673 66554 67416 67993 67989 67400 66855 67204 68369 69244 69101 68506 68439 69152
54204F9152J140J109N31l59m88R48L005L862L088J890J172O78Q4k13K45J310K302
$$ 69152 70292 71401 71932 71573 71085 72033 75038 78900 81988 83878 85050 85728 85812 85599 85844 87154 89456
54187H9456K343R72r91j846r70L44P99O68N47j29j670k676j910o15p25j736j728
$$ 89456 91799 92771 91780 89934 88964 89308 90107 90775 91322 91193 89523 86847 84937 84322 83597 81861 80133
54170H0133p83o08j248j156l98o75j779j293J271L071K087m6j001j093j627k028
$$ 80133 79350 78742 77494 76338 75940 75265 73486 72193 73464 76535 78622 78576 77575 76482 74855 72827
54154G2827j029O51J177L65l57k84OL7k1r0l86r87j776k462k266l89K525M313
$$ 72827 71798 72449 73626 73991 73634 73350 73356 73393 73372 73282 72896 71909 70133 67671 65405 65016 67541 71854
54136G1854L530J125q69j557j301n20M27Q10J63q54j203p97l72l00l14j19L54
$$ 71854 75384 76509 75640 74083 72782 72262 72689 73499 73662 72808 71605 70808 70436 70136 69822 69703 70057
54119G0057J077J676J415J38j049q15Q21K494K937J871k43k500l644k663J38K912
$$ 70057 71134 72810 74225 74363 73314 72499 73320 75814 78751 80622 80379 77879 74235 71572 71710 74622
54103G4622L687K086m37k211k907l194l164k116q4J396J011n89j750k019k166
$$ 74622 78309 80395 79958 77747 74840 71646 68482 66366 66282 67678 68689 68100 66350 64331 62165
54088F2165k438k229j461q42n47K9Q47R58J64l03M84J812K542K592K412J890Q44
$$ 62165 59727 57498 56037 55195 54648 54677 55524 56482 56646 56343 56827 58639 61181 63773 66185 68075 68919
54071F8919j37l90j80r1J70J282K946L995L820K871J759O77k32o99q04j062j684
$$ 68919 68782 68392 68212 68121 68291 69573 72519 76514 80334 83205 84964 85641 85409 84710 83906 82844 81160
54054H1160k147j945j524j851k904l222j648P96J767N73p86k52J549K308J224
$$ 81160 79013 77068 75544 73693 70789 67567 65919 66715 68482 69055 68269 68017 69566 71874 73098
54039G3098k77q45p16o16m81k5L82K31k97n95m62k12k56p73j467j623q89M3J17
$$ 73098 72821 71976 71260 70644 70163 70138 70520 70751 70454 69859 69397 69185 68929 68156 66689 65066 64177 64220 64337
54020F4337o74j376j585j896k423k010K34L212M629L372N84j586j909p95N71J563
$$ 64337 63663 62287 60702 58806 56383 54373 54607 57819 62448 65820 66404 64818 62909 62114 62685 64248
54004F4248K372K999K716J158o10j074j70P97J027R47J036J140J291J859K576
$$ 64248 66620 69619 72335 73493 72883 71809 71639 72436 73463 74410 75446 76586 77877 79736 82312
53989H2312K477J483P89R97J094K66m49K56J712K272K002K502M136N264M806L923
$$ 82312 84789 86272 87061 88058 89152 89418 88969 89225 90937 93209 95211 97713 101849 107113 111919 115842
53973A15842M215N354N855N454N380O369P628Q133P987P969Q338Q752R035R334
$$ 115842 120057 125411 131266 136720 142100 148469 156097 164230 172217 180186 188524 197276 206311 215645
53959B15645R625R571Q868P445N454L448K299K421L249L888L972L388J859k27
$$ 215645 225270 234841 243709 251154 256608 260056 262355 264776 268025 271913 275885 279273 281132 280905
53945B80905j265l17R18q0k873m350l324k385l857o282o950o023n636o116n817
$$ 280905 279640 279323 280241 280161 277288 272938 269614 267229 263372 257090 250140 244117 238481 232365 226548
53930B26548m223k713k278k480k841l439m075m364m607n090m856k895k85P71o2
$$ 226548 222325 219612 217334 214854 212013 208574 204499 200135 195528 190438 185582 182687 182402 183173 183111
53915A83111j094j364j513j856j760j270j214j309k49J716K427R66q32r39M33
$$ 183111 182017 180653 179140 177284 175524 174254 173040 171731 171482 173198 175625 176591 175759 174820 175253
53900A75253J862K535K202R24k80r5J060J303K29l76M24J227R03M58P78Q01j83
$$ 175253 177115 179650 181852 182776 182496 182401 183461 184764 184993 184617 185041 186268 187171 187629 188407 189208 189025
53883A89025n46J092L097L145J984K111L737M836M755N003O412P886Q405Q272
$$ 189025 188479 189571 192668 195813 197797 199908 203645 208481 213236 218239 224651 232537 240942 249214
53869B49214P908P066N730M396L104J356o33j727j276J49J602K493K439J458N09
$$ 249214 257122 264188 269918 274314 277418 278774 278141 276414 275138 275287 276889 279382 281821 283279 283788
53854B83788R07K789M823N749N710N767O462P157O809N510M889O390R181J0836
$$ 283788 284695 287484 292307 298056 303766 309533 315995 323152 329961 335471 340360 346750 355931 366767
53840C66767J0361R277R063Q948P432M842K750J590N02p88j703k231k994l772
$$ 366767 377128 386405 395468 404416 411848 416690 419440 421030 421532 420744 419041 416810 413816 410044
53826D10044l465k021j032j773l587m879n126n268o429q643j0731j1266r926p880
$$ 410044 406579 404558 403526 401753 398166 393287 388161 382893 376464 367821 357090 345824 335898 328018
53812C28018o696o950p975q641q130o511m913m764o228p787p924o823n787n479
$$ 328018 321322 314372 306397 297756 289626 283115 278202 273438 267210 259423 251499 244676 238889 233410
53798B33410n462n212m770m377m249m631n552o526o975o890o678o417n674m080
$$ 233410 227948 222736 217966 213589 209340 204709 199157 192631 185656 178766 172088 165671 159997 155917
53784A55917j800L99J517J012n85k020k411j792o08P21J681J780J010k39j741
$$ 155917 154117 154516 156033 157045 156460 154440 152029 150237 149629 150350 152031 153811 154821 154582 152841
53769A52841l206l711k496m45M54m32j715k116j892j547o87P60J637J147K93L62
$$ 152841 149635 145924 143428 142983 143437 143005 141290 139174 137282 135735 135048 135808 137445 138592 138885 139247
53753A39247R67R29K65j60j98k37M9J271L086M541N374N859N859N194M419M125
$$ 139247 140214 141143 141408 141248 141050 140813 140862 142133 145219 149760 155134 160993 166852 172046 176465 180590
53737A80590L991L566L360L937M580M297L529L468M158M754N190N999O747O358
$$ 180590 184581 188147 191507 195444 200024 204321 207850 211318 215476 220230 225420 231419 238166 244524
53723B44524M923L811L893M821N825O104M927K713J446K396L869L163M30j528
$$ 244524 249447 253258 257151 261972 267797 273901 278828 281541 282987 285383 289252 292415 292845 291317
53709B91317j442j120k142l311k716p98K77n60k308l435l390k742k276k115j775
$$ 291317 289875 288755 286613 283302 280586 279788 280065 279505 277197 273762 270372 267630 265354 263239 261464
53694B61464j120q13j299j935j904j457j321j425j351j537k651m083m510l735
$$ 261464 260344 259531 258232 256297 254393 252936 251615 250190 248839 247302 244651 240568 236058 232323
53680B32323k686j772p55m0l98j302j221J01J191R63j11j280k480l610m195m239
$$ 232323 229637 227865 227110 227070 226672 225370 224149 224250 225441 226404 226293 225013 222533 218923 214728 210489
53664B10489m259m122l153j691j128j960k975k893j594N01K892M511M291K717
$$ 210489 206230 202108 198955 197264 196136 194176 191201 188308 186714 187215 190107 194618 198909 201626
53650B01626J529J432J529J342J703K963M055M180L883L585K696J279R09K486
$$ 201626 203155 204587 206116 207458 209161 212124 216179 220359 224242 227827 230523 231802 232711 235197
53636B35197M531N172M723M837N900O883P064O601N827N115N028N567N767M922
$$ 235197 239728 244900 249623 254460 260360 267243 274307 280908 286735 291850 296878 302445 308212 313134
53622C13134L672L067L145L262L197L039K665K185K199K772K897J969J006J325
$$ 313134 316806 319873 323018 326280 329477 332516 335181 337366 339565 342337 345234 347203 348209 349534
53608C49534K567L172K350O13j186k310k183r55K37M77J13j02k40o56r66o21K9
$$ 349534 352101 355273 357623 358236 357050 354740 352557 351602 351839 352316 352429 352327 352087 351431 350465 349844 349873
53591C49873L51N32R33J002J06j037j315j134j791l046l161j583N4K87k45q7Q40
$$ 349873 350224 350756 351689 352691 352797 351760 350445 349311 347520 344474 341313 339730 339784 340071 339826 339739 340579
53574C40579J337O35q27k071k397j737o08L03O70O64O86J103K042L133L685L499
$$ 340579 341916 342551 341724 339653 337256 335519 334911 335214 335884 336548 337234 338337 340379 343512 347197 350696
53558C50696L248L559M050L892L021K097J460J032J103K239M226N966O739O849
$$ 350696 353944 357503 361553 365445 368466 370563 372023 373055 374158 376397 380623 386589 393328 400177
53544D00177O826O761O740P111P827Q257Q294Q820J0277J1348J0354P756O075
$$ 400177 407003 413764 420504 427615 435442 443699 451993 460813 471090 482438 492792 500548 506623
53531E06623O837Q730R434Q640Q128R110J0572J0701R221P592P166P836Q568Q640
$$ 506623 513460 522190 531624 540264 548392 557502 568074 578775 587996 595588 602754 610590 619158 627798
53517F27798Q065P158O205N554N603O465P597Q076P324N530L374J497L70L66J450
$$ 627798 635863 643021 649226 654780 660383 666848 674445 682521 689845 695375 698749 700246 700616 700982 702432
53502G02432K898L851M206M438M484L626J835L77L14R73R00l0n18J78J271J680
$$ 702432 705330 709181 713387 717825 722309 725935 727770 728147 728461 729434 730334 730304 729786 729964 731235 732915
53486G32915J369J029J039J267J452J322N60q88k414k949j815M94K521L109K524
$$ 732915 734284 735313 736352 737619 739071 740393 740953 740065 737651 734702 732887 733381 735902 739011 741535
53471G41535J959K008K302K704L933O308Q734R858R729R482R751J0350J1072J1872
$$ 741535 743494 745502 747804 750508 754441 760749 769483 779341 789070 798552 808303 818653 829725 841597
53457H41597J2631J3539J5194J7377J8556J8002J7733K0395K5474K9685L1253
$$ 841597 854228 867767 882961 900338 918894 936896 954629 975024 1000498 1030183 1061436
53446A061436L1728L2988L4615L5452L5978L7420L9532M0835M0703L9958L9707
$$ 1061436 1093164 1126152 1160767 1196219 1232197 1269617 1309149 1349984 1390687 1430645 1470352
53435A470352M0464M2357M5295M8889N2435N5094N6278N6171N5635N5145N4184
$$ 1470352 1510816 1553173 1598468 1647357 1699792 1754886 1811164 1867335 1922970 1978115 2032299
53424B032299N2459N1090N1350N2664N3375N3304N3715N4782N5180N4648N4739
$$ 2032299 2084758 2135848 2187198 2239862 2293237 2346541 2400256 2455038 2510218 2564866 2619605
53413B619605N6126N7135N6145N3756N1230M8566M5535M3067M1856M0836L8747
$$ 2619605 2675731 2732866 2789011 2842767 2893997 2942563 2988098 3031165 3073021 3113857 3152604
53402C152604L6038L3600L0838K6873K2681J9910J8226J6009J3173J1202J0395
$$ 3152604 3188642 3222242 3253080 3279953 3302634 3322544 3340770 3356779 3369952 3381154 3391549
53391C391549R063N747P92m481q851j1519j2758j4291j7859k3249k8698l3019
$$ 3391549 3400612 3406359 3407151 3402670 3393819 3382300 3369542 3355251 3337392 3314143 3285445 3252426
53379C252426l6173l8184l9029l9574m1099m3572m5657m6606m6993m7533m8296
$$ 3252426 3216253 3178069 3139040 3099466 3058367 3014795 2969138 2922532 2875539 2828006 2779710
53368B779710m9227n0215n0540m9428m7267m5166m3317m1102l8787l7380l6511
$$ 2779710 2730483 2680268 2629728 2580300 2533033 2487867 2444550 2403448 2364661 2327281 2290770
53357B290770l4230k9722k4741k1278j9125j6881j4185j1472q369l957J551O865
$$ 2290770 2256540 2226818 2202077 2180799 2161674 2144793 2130608 2119136 2110767 2106810 2108361 2115226
53345B115226J1373J5659K0016K3620K5848K7644L0622L5146L9963M3791M6554
$$ 2115226 2126599 2142258 2162274 2185894 2211742 2239386 2270008 2305154 2345117 2388908 2435462
53334B435462M9025N1886N5452N9603O3444O5798O6835O8594P2751P8185Q2252
$$ 2435462 2484487 2536373 2591825 2651428 2714872 2780670 2847505 2916099 2988850 3067035 3149287
53323C149287Q4335Q6566R0611R5572R9799J03188J06385J09114J10867J12377
$$ 3149287 3233622 3320188 3410799 3506371 3606170 3709358 3815743 3924857 4035724 4148101
53313D148101J14711J17389J18832J18479J17158J15671J14152J12496J10435
$$ 4148101 4262812 4380201 4499033 4617512 4734670 4850341 4964493 5076989 5187424
53304E187424J07337J02996R8231R3797Q9154Q3357P6548O9441O2005N4019M6306
$$ 5187424 5294761 5397757 5495988 5589785 5678939 5762296 5838844 5908285 5970290 6024309 6070615
53293F070615L9750L3535K6096J7601R595K326n667j4977k4261l2326l9710m7585
$$ 6070615 6110365 6143900 6169996 6187597 6197192 6199518 6193851 6178874 6154613 6122287 6082577 6034992
53281F034992n6487o6666p8273r0332j00731j08046j12624j15563j17558j18993
$$ 6034992 5978505 5911839 5833566 5743234 5642503 5534457 5421833 5306270 5188712 5069719
53271E069719j20038j20253j19151j17432j16430j16079j14859j12136j09090
$$ 5069719 4949681 4829428 4710277 4592845 4476415 4360336 4245477 4133341 4024251
53262D024251j06710j04387j01302r7741r4117r0069q5596q1762p9124p6560p2889
$$ 4024251 3917541 3813154 3711852 3614111 3519994 3429925 3344329 3262567 3183443 3106883 3033994
53251C033994o8482o4025n8916n2557m6312m2231m0136l7683l3313k7750k2633
$$ 3033994 2965512 2901487 2842571 2790014 2743702 2701471 2661335 2623652 2590339 2562589 2539956
53240B539956j9012j7169j6520j5402j2181p109k227J017L120N185P162Q303Q760
$$ 2539956 2520944 2503775 2487255 2471853 2459672 2452563 2450336 2451353 2454473 2459658 2466820 2475123 2483883
53227B483883R690J1769J4454J6985J9515K2625K6103K9107L1493L4129L7458
$$ 2483883 2493573 2505342 2519796 2536781 2556296 2578921 2605024 2634131 2665624 2699753 2737211
53216B737211M0645M2898M4811M7210M9269M9447M8061M7291M8148M9145M8696
$$ 2737211 2777856 2820754 2865565 2912775 2962044 3011491 3059552 3106843 3154991 3204136 3252832
53205C252832M7260M5901M4095M0745L6642L3942L3122L2051K8677K3613J9293
$$ 3252832 3300092 3345993 3390088 3430833 3467475 3501417 3534539 3566590 3595267 3618880 3638173
53194C638173J7140J6164J4234J0177M581j203o343j0868j5157j9678k4953l1092
$$ 3638173 3655313 3671477 3685711 3695888 3700469 3699266 3692923 3682055 3666898 3647220 3622267 3591175
53182C591175l7274m2361m6153m9451n2719n5483n7416n9158o1394o3758o5223
$$ 3591175 3553901 3511540 3465387 3415936 3363217 3307734 3250318 3191160 3129766 3066008 3000785
53171C000785o5424o4937o4527o4379o3906o2145n8859n5251n2963n2166n1568
$$ 3000785 2935361 2870424 2805897 2741518 2677612 2615467 2556608 2501357 2448394 2396228 2344660
53160B344660n0639n0558n2054n3465n2527m9572m7290m7136m7546m6198m2966
$$ 2344660 2294021 2243463 2191409 2137944 2085417 2035845 1988555 1941419 1893873 1847675 1804709
53149A804709l9654l7539l6214l4723l2923l1376l0459l0081l0112l0496l0844
$$ 1804709 1765055 1727516 1691302 1656579 1623656 1592280 1561821 1531740 1501628 1471132 1440288
53138A440288l0459k9184k7795k7145k7198k7464k7946k8761k9231k8338k6214
$$ 1440288 1409829 1380645 1352850 1325705 1298507 1271043 1243097 1214336 1185105 1156767 1130553
53127A130553k4144k2966k2481k2575k3630k5313k6170k5299k3563k2332k1838
$$ 1130553 1106409 1083443 1060962 1038387 1014757 989444 963274 937975 914412 892080 870242
53116H70242k1605k1559k1680k1279j9885j8359j7958j8627j9259j9278j8870
$$ 870242 848637 827078 805398 784119 764234 745875 727917 709290 690031 670753 651883
53105F51883j7991j6482j4967j4354j4351j3726j2294j1322j1535j1856j0909
$$ 651883 633892 617410 602443 588089 573738 560012 547718 536396 524861 513005 502096
53094E02096q956p480p313p934q407q339p972p675p485o989n776m147l143l661
$$ 502096 493140 485660 478347 470413 462006 453667 445695 438020 430535 423546 417770 413623 410480 406819
53080D06819n380o729o156l743j329o52j418j827j076l33p64j592j267J85J298
$$ 406819 401439 394710 388554 384811 383482 382830 381412 379585 378509 378176 377412 375820 374553 374738 376036
53065C76036J431J554K533L868M617M653M425M213M100M211M370L987K781J305
$$ 376036 377467 379021 381554 385422 390039 394692 399117 403330 407430 411641 416011 419998 422779 424084
53051D24084L02k22q79k163m035o078p720q527q507q086p695p535p635p763p394
$$ 424084 424386 424164 423285 421122 417087 411009 403289 394762 386255 378169 370474 362939 355304 347541 340147
53036C40147o287n165n063n853o259n753n456o423p803p921o665n419m786l879
$$ 340147 333860 328695 323632 317779 311520 305767 300311 293888 286085 278164 271499 266080 261294 257415
53022B57415k260j077j331k107j767l89L86k01j030r75o48j460l583n609o163
$$ 257415 255155 254078 252747 250640 248873 248484 248870 248669 247639 246664 246016 244556 240973 235364 229201
53007B29201n125l320j574l41J40k10j125j936j988j297p06j068k252l153k856
$$ 229201 224076 220756 219182 218841 218981 218771 217646 215710 213722 212425 211719 210651 208399 205246 202390
52992B02390j505N9J166J577J271M77k47m41l20m21p48p10j19L08k17j402k080
$$ 202390 200885 200944 202110 203687 204958 205435 205188 204747 204427 204006 203258 202548 202429 202737 202520 201118 199038
52975A99038j567n04j19q26j854k276k105k092k604l227l476l407l218k646j332
$$ 199038 197471 196967 196848 196022 194168 191892 189787 187695 185091 181864 178388 174981 171763 169117 167785
52960A67785L78J498J422N83MK55R49J232P82K02K69R42J441J168J26j410k932
$$ 167785 168163 169661 171083 171666 171670 171925 172874 174106 174888 175090 175359 176301 177742 178910 179036 177626 174694
52943A74694l407j980O84K665K888K199J874K049K370K916L424K719M59j441r49
$$ 174694 171287 169307 169991 172656 175544 177743 179617 181666 184036 186952 190376 193095 193554 192113 191164
52928A91164J110K141J507J006J582J994J353P91J435K576L205L827N245O686
$$ 191164 192274 194415 195922 196928 198510 200504 201857 202648 204083 206659 209864 213691 218936 225622
52914B25622O876O124N848O445P044P005O473N604M428L260K364J365j90j940
$$ 225622 232498 238622 244470 250915 257959 264964 271437 277041 281469 284729 287093 288458 288268 286328
52900B86328l131l610l592k901j476k58l93j564k296j942j405j657k556l486m258
$$ 286328 283197 279587 275995 273094 271618 271360 270967 269403 267107 265165 263760 262103 259547 256061 251803
52885B51803m886n043m406l226k173j656j500j255p55l55m77r37j035n30m8k32
$$ 251803 246917 241874 237468 234242 232069 230413 228913 227658 226903 226548 226071 225134 224099 223569 223521 223289
52869B23289q47j196j013m73K72R49R10j43j381j578o47L02M39P1j27p1j27n74
$$ 223289 222442 221246 220233 219760 220032 220981 221891 221748 220367 218789 218142 218444 218883 218954 218827 218756 218629 218055
52851B18055j459k541l183k699j162L88R60O04J13j17m31j057j392o13J137K719
$$ 218055 216596 214055 210872 208173 207011 207399 208359 208963 209076 208959 208528 207471 206079 205466 206603 209322
52835B09322L356L456L724L929L284J749J66q31j257j155m00P12J492J776J908
$$ 209322 212678 216134 219858 223787 227071 228820 228986 228155 226898 225743 225343 226055 227547 229323 231231
52820B31231J773P76o74r91N11K337K725J963J558J731J307J2o56N64K796L924
$$ 231231 233004 233780 233106 232115 232626 234963 237688 239651 241209 242940 244247 244259 243603 244167 246963 250887
52804B50887K984J133K85J054K264K559K088K069K870L499L255K921L548M927
$$ 250887 253871 255004 255289 256343 258607 261166 263254 265323 268193 271692 274947 277868 281416 286343
52790B86343O046O505O542O191N343M347L678L156K301J248N28J89j58n30n63
$$ 286343 292389 298894 305436 311627 316970 321317 324995 328151 330452 331700 332228 332417 332259 331729 331166
52775C31166j77L59P77P24l12k250l927m211l408k830l251m403n683o475o095
$$ 331166 330989 331348 332125 332849 332537 330287 326360 322149 318741 315911 312660 308257 302574 296099 290004
52760B90004m378k183n75K80N98n5k102m582n784n416m906n303n908n435l655
$$ 290004 285626 283443 282868 283148 283746 283691 281589 277007 271223 265807 260901 255598 249690 244255 240600
52745B40600j489o4P1p28j479j513j058o10k30q8r99l222n263n310l727k616k863
$$ 240600 239111 239047 239118 238390 236911 235398 234340 233730 233500 233412 232413 229191 223928 218618 214891 212275 209412
52728B09412l181k442j361j156j704k001j479k34J271K036R81j629l888m180k920
$$ 209412 206231 203789 202428 201272 199568 197567 196088 195854 197125 199161 200142 198513 194625 190445 187525
52713A87525j733j507j908k359k528k082p94R41K128J964N78j017j755j453q53
$$ 187525 185792 184285 182377 180018 177490 175408 174614 175555 177683 179647 180225 179208 177453 176000 175147
52698A75147p63j362k483l913n108n212m163l165l216l693l451k695k342k086
$$ 175147 174384 173022 170539 166626 161518 156306 152143 148978 145762 142069 138618 135923 133581 131495
52684A31495q68Q18J132j62j045l61K75r43l101l902k954j915j813j884j168P3
$$ 131495 130627 131445 132577 132415 131370 131009 131284 130341 127240 123338 120384 118469 116656 114772 113604 113677
52668A13677R06R23N46N49J314K333K617J764M62l51m81l53k88k25J2N05J182
$$ 113677 114583 115506 116052 116601 117915 120248 122865 124629 125091 124740 124259 123906 123618 123393 123405 123910 125092
52651A25092J876K515L140L466K896J537O76J265K297K101J117J702M681P652
$$ 125092 126968 129483 132623 136089 138985 140522 141198 142463 144760 146861 147978 149680 154361 162013
52637A62013P743M888J386p89j175l56M93J25j498k871k838k281k838m351m996
$$ 162013 169756 174644 176030 175241 174066 173710 174203 174328 172830 169959 167121 164840 162002 157651 152655
52622A52655l948k680l037m780n754m405j618L10L65k05p0l9j763m630n925m494
$$ 152655 148707 146027 142990 138210 132456 128051 126433 126743 127108 126903 126833 126794 125031 120401 114476 109982
52606A09982k410j908k326j677lQ01k2j250j706j579j435j303j113j027r53n31
$$ 109982 107572 105664 103338 101661 101658 102459 102437 101187 99481 97902 96467 95164 94051 93024 92071 91540
52590I1540n8o06k689n155n915l831N3L146L462J468m45n34O57J479J323R29R85
$$ 91540 91482 90876 88187 83032 77117 73286 73339 76485 79947 81415 80970 80436 81093 82572 83895 84824 85809
52573H5809J334J490J314R57N52M2o67j287j084K67J741J851N93m63m07j73p30
$$ 85809 87143 88633 89947 90904 91456 91498 90831 89544 88460 88727 90468 92319 92912 92449 92042 91869 91139
52556I1139j364r39J36O48N70P75J185R33J91J80J173K030K082K030K365K226
$$ 91139 89775 88836 88972 89620 90190 90965 92150 93083 93274 93454 94627 96657 98739 100769 103134 105360
52540A05360R02n60m19J313K606J680q38k475j543R23K268J311k63j63J494K466
$$ 105360 106262 105702 105283 106596 109202 110882 110044 107569 106026 106949 109217 110528 110265 110102 111596 114062
52524A14062J476j63m39Q59K273K774K768L069L543L251J766j28j185r11K51J674
$$ 114062 115538 115375 114936 115795 118068 120842 123610 126679 130222 133473 135239 135111 133926 133015 133266 134940
52508A34940K933L557L208K305J811K035K280K071J898K177K220J182l97j090
$$ 134940 137873 141430 144638 146943 148754 150789 153069 155140 157038 159215 161435 162617 162220 161130
52494A61130l97P65J418J575J813K352K815K716K061J426J244J171P27M22J227
$$ 161130 160733 161498 162916 164491 166304 168656 171471 174187 176248 177674 178918 180089 180816 181238 182465
52479A82465K854L741L130K043J465R45n8q12o80o39j815l391l817l361l476m055
$$ 182465 185319 189060 192190 194233 195698 196643 196585 195773 195093 194454 192639 189248 185431 182070 178594 174539
52463A74539l524j625L0N89J093K279L020K060J5j422j459n58N33J356J804K055
$$ 174539 171015 169390 169420 170009 171102 173381 176401 178461 178476 177054 175595 175037 175570 176926 178730 180785
52447A80785K234K087J465Q40O38M62m9n2J345K985K591K5k111j813k0J181J279
$$ 180785 183019 185106 186571 187411 188049 188511 188462 188410 189755 192740 195331 195356 193245 191432 191412 192593 193872
52430A93872J132J164J071P74O15P49Q32L14j059k583k801j206O27Q93K09P00
$$ 193872 195004 196168 197239 198013 198628 199377 200209 200523 199464 196881 194080 192874 193501 194394 194603 195303
52414A95303K508L329J982K21j50J05m40j127l68J528K661K160R16J11M24K121
$$ 195303 197811 201140 203122 203343 203193 203298 202858 201731 201363 202891 205552 207712 208628 208739 209163 211284
52398B11284M551N961N179L257K205K536L180L345L067K301R82k27n88o00j233
$$ 211284 215835 221796 226975 230232 232437 234973 238153 241498 244565 246866 247848 247621 247033 246433 245200
52383B45200k013j481K71J142k22k599l960m015l908m089l740k444j278j520k659
$$ 245200 243187 241706 241977 243119 242897 240298 236338 232323 228415 224326 220586 218142 216864 215344 212685
52368B12685k687q20J004M04k097l526k371l87L04P6M86J391J364K52n80m17O7
$$ 212685 209998 209178 210182 210586 208489 204963 202592 202205 202509 202585 203071 204462 205826 206078 205498 205081 205148
52351B05148K78M72Q39J017P10j2j059j980j773n8J809K227J528J222J334M91
$$ 205148 205426 205898 206737 207754 208464 208452 207393 205413 203640 203582 205391 207618 209146 210368 211702 212193
52335B12193j306k088p52J368K561K710K317J310L3k10R82J989J455O17J554L948
$$ 212193 210887 208799 208047 209415 211976 214686 217003 218313 218346 218136 219118 221107 222562 223179 224733 228681
52319B28681N509N158M038L389L044K378J418N86K15O38J933L436M187L999L526
$$ 228681 234190 239348 243386 246775 249819 252197 253615 254201 254416 255054 256987 260423 264610 268609 272135
52304B72135L288L310L671M459N097M562K644M30p27l17J236K943L748L419L018
$$ 272135 275423 278733 282404 286863 291960 296522 299166 299596 298869 298552 299788 302731 306479 309898 312916
$$ [...]
##END NTUPLES=NMR SPECTRUM
##END=
